
##TITLE=AC1326_CRIAH12155_6535781_QMejfoLb3n
##JCAMPDX= 6.0         $$ Bruker NMR JCAMP-DX V2.0
##DATA TYPE= NMR SPECTRUM
##DATA CLASS= NTUPLES
##ORIGIN= BRUKER
##OWNER= Administrator
$$ 1.72 TOPSPIN		Version 2.1
$$ 2012-07-17 22:36:50.656 -0500  Administrator@TOPSPIN
$$ Compression mode = diff/dup
##.OBSERVE FREQUENCY= 400.02188249412
##.OBSERVE NUCLEUS= ^1H
##.ACQUISITION MODE= SIMULTANEOUS (DQD)
##.ACQUISITION SCHEME= undefined
##.AVERAGES= 8
##.DIGITISER RES= 22
##SPECTROMETER/DATA SYSTEM= spect
##.PULSE SEQUENCE= zg30
##.SOLVENT NAME= COFFEE_meoh
##.SHIFT REFERENCE= INTERNAL, COFFEE_meoh, 1, 14.98509
##AUDIT TRAIL= $$ (NUMBER, WHEN, WHO, WHERE, PROCESS, VERSION, WHAT)
$$ ##TITLE= Audit trail, TOPSPIN		Version 2.1
$$ ##JCAMPDX= 5.01
$$ ##ORIGIN= Bruker BioSpin GmbH
$$ ##OWNER= Administrator
$$ $$ C:\Bruker\TOPSPIN/data/COFFEE/nmr/AC1326_CRIAH12155_6535781_QMejfoLb3n/10/pdata/1/auditp.txt
$$ ##AUDIT TRAIL=  $$ (NUMBER, WHEN, WHO, WHERE, PROCESS, VERSION, WHAT)
(   1,<2012-07-17 22:36:43.515 -0500>,<Administrator>,<TOPSPIN>,<go>,<TOPSPIN 2.1>,
      <created by zg
	started at 2012-07-17 22:35:36.875 -0500,
	POWCHK enabled, PULCHK disabled,
       configuration hash MD5:
       6B 1B 68 BB D9 2E 58 E2 7F 35 AD 54 07 DF 0E 41
       data hash MD5: 64K
       09 EB A5 9C A7 F2 96 EA CD 68 75 91 E4 4D 81 C7>)
(   2,<2012-07-17 22:36:46.265 -0500>,<Administrator>,<TOPSPIN>,<proc1d>,<TOPSPIN 2.1>,
      <Start of raw data processing
       efp LB = 0 FT_mod = 6 PKNL = 1 PHC0 = 0 PHC1 = 0 SI = 32K 
       data hash MD5: 32K
       48 1E 91 8C CE BE EF A4 54 14 3D AE A3 E5 68 D2>)
(   3,<2012-07-17 22:36:46.656 -0500>,<Administrator>,<TOPSPIN>,<proc1d>,<TOPSPIN 2.1>,
      <pk PHC0 = 178.5938 PHC1 = 0 
       data hash MD5: 32K
       A1 AB 2A 44 B9 C2 EE F4 2F 98 6F 20 87 93 17 EE>)
(   4,<2012-07-17 22:36:46.765 -0500>,<Administrator>,<TOPSPIN>,<proc1d>,<TOPSPIN 2.1>,
      <abs ABSG = 1 
       data hash MD5: 32K
       DC 10 8C BD B4 E1 5A 86 FD D3 36 F2 CA 7B 16 81>)
(   5,<2012-07-17 22:36:46.796 -0500>,<Administrator>,<TOPSPIN>,<proc1d>,<TOPSPIN 2.1>,
      <abs ABSG = 2 
       data hash MD5: 32K
       29 4B 20 57 B0 4F 75 1C 30 B3 B6 2D 7B 43 5D 2B>)
(   6,<2012-07-17 22:36:46.828 -0500>,<Administrator>,<TOPSPIN>,<proc1d>,<TOPSPIN 2.1>,
      <abs ABSG = 3 
       data hash MD5: 32K
       AF 75 F1 4E 6C 7D 8E 4D 76 16 4A FA A6 9A E9 F8>)
(   7,<2012-07-17 22:36:46.859 -0500>,<Administrator>,<TOPSPIN>,<proc1d>,<TOPSPIN 2.1>,
      <abs ABSG = 4 
       data hash MD5: 32K
       FD DA 0A 4A FC 38 68 0F 86 3E 84 0A B9 61 8E 36>)
(   8,<2012-07-17 22:36:46.890 -0500>,<Administrator>,<TOPSPIN>,<proc1d>,<TOPSPIN 2.1>,
      <abs ABSG = 5 
       data hash MD5: 32K
       E3 CA 63 41 4F 83 F6 5A 85 01 08 19 6D 00 8E 91>)
$$ ##END=
$$ 
$$ $$ hash MD5
$$ $$ E0 08 B1 90 8D 43 74 9B 26 68 76 B3 6F CC 9F 38
##$RELAX= 
##$RELAX= 
##$RELAX= 
##$RELAX= 
##$RELAX= 
##$RELAX= 
##$RELAX= 
$$ Bruker specific parameters
$$ --------------------------
$$ [...]
150 150 150 150 150 150 150 150
##$TP07= 0
##$TPNAME0= <>
##$TPNAME1= <>
##$TPNAME2= <>
##$TPNAME3= <>
##$TPNAME4= <>
##$TPNAME5= <>
##$TPNAME6= <>
##$TPNAME7= <>
##$TPOAL= (0..7)
0.5 0.5 0.5 0.5 0.5 0.5 0.5 0.5
##$TPOFFS= (0..7)
0 0 0 0 0 0 0 0
##$TUNHIN= 0
##$TUNHOUT= 0
##$TUNXOUT= 0
##$USERA1= <user>
##$USERA2= <user>
##$USERA3= <user>
##$USERA4= <user>
##$USERA5= <user>
##$V9= 5
##$VALIST= <valist>
##$VCLIST= <CCCCCCCCCCCCCCC>
##$VD= 0
##$VDLIST= <DDDDDDDDDDDDDDD>
##$VPLIST= <PPPPPPPPPPPPPPP>
##$VTLIST= <TTTTTTTTTTTTTTT>
##$WBST= 2048
##$WBSW= 25
##$XGAIN= (0..3)
0 0 0 0
##$XL= 0
##$YL= 0
##$YMAX_a= 506985
##$YMIN_a= -647966
##$ZGOPTNS= <>
##$ZL1= 120
##$ZL2= 120
##$ZL3= 120
##$ZL4= 120
##$ABSF1= 14.98509
##$ABSF2= -5.573092
##$ABSG= 5
##$ABSL= 3
##$ALPHA= 0
##$AQORDER= 0
##$ASSFAC= 0
##$ASSFACI= 0
##$ASSFACX= 0
##$ASSWID= 0
##$AUNMP= <proc_prof1d_extract_pilot.lims>
##$AXLEFT= 0
##$AXNAME= <>
##$AXNUC= <1H>
##$AXRIGHT= 0
##$AXTYPE= 0
##$AXUNIT= <>
##$AZFE= 0.1
##$AZFW= 0.1
##$BCFW= 0
##$BC_mod= 0
##$BYTORDP= 0
##$COROFFS= 0
##$CY= 15
##$DATMOD= 1
##$DC= 0
##$DFILT= <>
##$DTYPP= 0
##$F1P= 0
##$F2P= 0
##$FCOR= 0.5
##$FTSIZE= 32768
##$FT_mod= 6
##$GAMMA= 0
##$GB= 0
##$INTBC= 1
##$INTSCL= 1
##$ISEN= 128
##$LB= 0
##$LEV0= 0
##$LPBIN= 0
##$MAXI= 10000
##$MC2= 0
##$MEAN= 0
##$ME_mod= 0
##$MI= 0
##$NCOEF= 0
##$NC_proc= -8
##$NLEV= 6
##$NOISF1= 0
##$NOISF2= 0
##$NSP= 0
##$NTH_PI= 0
##$NZP= 0
##$OFFSET= 14.98509
##$PC= 1
##$PHC0= 178.5938
##$PHC1= 0
##$PH_mod= 1
##$PKNL= yes
##$PPARMOD= 0
##$PPDIAG= 0
##$PPIPTYP= 0
##$PPMPNUM= 2147483647
##$PPRESOL= 1
##$PSCAL= 4
##$PSIGN= 0
##$PYNMP= <proc.py>
##$REVERSE= no
##$SF= 400.02
##$SI= 32768
##$SIGF1= 0
##$SIGF2= 0
##$SINO= 400
##$SIOLD= 32768
##$SPECTYP= <>
##$SREGLST= <1H.CDCl3>
##$SSB= 0
##$STSI= 32768
##$STSR= 0
##$SW_p= 8223.68421052631
##$SYMM= 0
##$S_DEV= 0
##$TDeff= 65536
##$TDoff= 0
##$TI= <>
##$TILT= no
##$TM1= 0
##$TM2= 0
##$TOPLEV= 0
##$USERP1= <user>
##$USERP2= <user>
##$USERP3= <user>
##$USERP4= <user>
##$USERP5= <user>
##$WDW= 1
##$XDIM= 32768
##$YMAX_p= 474001689
##$YMIN_p= -673213
##$CURPLOT= <Network HP LaserJet P1505>
##$CURPRIN= <$Network HP LaserJet P1505>
##$DFORMAT= <normdp>
##$LAYOUT= <+/1D_H.xwp>
##$LFORMAT= <normlp>
##$PFORMAT= <normpl>
##$SURQMSG= 1
$$ End of Bruker specific parameters
$$ ---------------------------------
##NTUPLES= NMR SPECTRUM
##VAR_NAME=  FREQUENCY,     SPECTRUM/REAL,   SPECTRUM/IMAG
##SYMBOL=    X,             R,               I
##VAR_TYPE=  INDEPENDENT,   DEPENDENT,       DEPENDENT
##VAR_FORM=  AFFN,          ASDF,            ASDF
##VAR_DIM=   32768,         32768,           32768
##UNITS=     HZ,            ARBITRARY UNITS, ARBITRARY UNITS
##FACTOR=    0.250966925370066, 1,           1
##FIRST=     8223.43324360094, 90579,        -29571
##LAST=      0,             -117202,         -111292
##MIN=       0,             -673213,         0
##MAX=       8223.43324360094, 474001689,    0
$$ Real data points
##PAGE= N=1
##DATA TABLE= (X++(R..R)), XYDATA
$$ [...]
19542B19443F606Q1245b95326L7980j15398C36035h6894j14744a7065r1786n2665
$$ 219443 6606 87851 -295326 -257346 -372744 336035 -86894 -201638 -17065 -108851 -161516
19531a61516H1931j1354B158K77429h9324A37912a59938O1807a3058j31959l5195
$$ -161516 81931 70577 2158 279587 -89324 137912 -159938 -98131 -13058 -145017 -180212
19520a80212B3696c0906B17811A05025P4662F9955L2824J6877i9761j31659A65137
$$ -180212 23696 -30906 217811 105025 179687 69955 102779 119656 -99761 -231420 165137
19508b04364A06950J67947A2338b76484e9977j82324A4179h1026k50568J25770
$$ -204364 106950 274897 12338 -276484 -59977 -242301 14179 -81026 -331594 -205824
19498b05824A71481B4636b99689K2568A05638j0850f1835I9310B6105a0538n0497
$$ -205824 171481 24636 -299689 -277121 105638 94788 -61835 99310 26105 -10538 -61035
19487f1035f710B67081a76056C7197a10525A3194b34356A69452e4442n8758j72189
$$ -61035 -6710 267081 -176056 37197 -110525 13194 -234356 169452 -54442 -113200 -285389
19476b85389e7542k41003A13542N7727d85q1644q8406j18075m2565A6594M9359
$$ -285389 -57542 -298545 113542 171269 -485 -82129 -170535 -288610 -331175 16594 65953
19465F5953g5824p8690f0859q5195B89567C5071P4542b3427r5921L3957D0026
$$ 65953 -75824 -154514 -60859 -146054 289567 35071 109613 -23427 -119348 -85391 40026
19453a22328A14554a2790A35758E9772e00857g5139k2122c6768j85424B37328
$$ -122328 114554 -12790 135758 59772 -500857 -75139 -97261 -36768 -222192 237328
19442D268f5162p283j6100B05395I8424b05319C04375a64624L3921r1067i9316
$$ 4268 -65162 -72445 -88545 205395 98424 -205319 304375 -164624 -130703 -221770 -99316
19430H3662a57322E7052g2488F1500b33637A3073b1312A1845a23561c0204l20352
$$ 83662 -157322 57052 -72488 61500 -233637 13073 -21312 11845 -123561 -30204 -350556
19419c50556c873D4544K62576b51238J21553J8462A47980b45224n4417d4754k33125
$$ -350556 -3873 44544 307120 -251238 -129685 -111223 147980 -245224 -299641 -44754 -277879
19408b77879g8914L2025C4710a75893l487M3778B98088b76313J26503M6182A53470
$$ -277879 -78914 -46889 34710 -175893 -179380 -135602 298088 -276313 -149810 -103628 153470
19396b45292J20242j06767f7055c2549A08817a99699i8216I4314r271M067R8012
$$ -245292 -125050 -231817 -67055 -32549 108817 -199699 -98216 94314 85043 89110 187122
19385A87122f0067C5527o464c40754f3824b452j234j36314c7226r6596e3851j31785
$$ 187122 -60067 35527 29063 -340754 -63824 -2452 -3686 -140000 -37226 -133822 -53851 -185636
19373a85636A96395b6202j56934d594G4304L9521E6651b50002l7709A14310J67685
$$ -185636 196395 -26202 -183136 -4594 74304 113825 56651 -250002 -287711 114310 281995
19362B81995H9658A4304J53140Q6312C4527c05810f9912E896J46573D6069c39455
$$ 281995 89658 14304 167444 253756 34527 -305810 -69912 5896 152469 46069 -339455
19350C25356b22851B5732a25805e5331K0426j60503I1303b09492A62483K13336
$$ 325356 -222851 25732 -125805 -55331 -34905 -195408 91303 -209492 162483 375819
19340C75819e2647q4426e8864j97960J4632J07147j02620g6326H9747a74258J7525
$$ 375819 -52647 -137073 -58864 -256824 -242192 -135045 -237665 -76326 89747 -174258 -156733
19329a56733L9498F1033J3065J54154a74256I5980a13702M1039L2751k33107F1383
$$ -156733 -117235 61033 74098 228252 -174256 95980 -113702 -72663 -39912 -273019 61383
19317b44318A1271a31974B53387a79936o6379n3321A28404a34997j66902k7579
$$ -244318 11271 -131974 253387 -179936 -246315 -299636 128404 -134997 -301899 -329478
19307c29478a46024K2045A27611b8405j4838A5554J62987o5330c70823J35643
$$ -329478 -146024 -123979 127611 -28405 -43243 15554 178541 113211 -370823 -235180
19297b35180a5628l39805g8287F895d7656k22642J9594H5686J15843q9391N406
$$ -235180 -15628 -355433 -78287 6895 -47656 -270298 -250704 85686 201529 112138 117544
19286A17544i8051a1903k83548D3280a12178k2419j40783g7380r0302l9114d0035
$$ 117544 -98051 -11903 -295451 43280 -112178 -134597 -275380 -77380 -167682 -206796 -40035
19274d6605a4649A42750a07645A64279b39999H0416b73760c8262l30982J43670
$$ -46605 -14649 142750 -107645 164279 -239999 80416 -273760 -38262 -369244 -225574
19264b25574I3424d78597A04873b22646M4422N1633j66718B3925K23158e2672
$$ -225574 93424 -478597 104873 -222646 -178224 -126591 -293309 23925 247083 -52672
19253B7506a86402A35937e4226l8221n5774j14139c3903B07850b20116e1300r3164
$$ 27506 -186402 135937 -54226 -92447 -148221 -262360 -33903 207850 -220116 -51300 -144464
19242a44464d2570a0206j29660B07072a7046j27400K8909A71819K6974B4727a38578
$$ -144464 -42570 -10206 -139866 207072 -17046 -144446 -115537 171819 198793 24727 -138578
19230b41119g2489Q942l76392A69149b3728l70166B61641o2579L8944f5463m01944
$$ -241119 -72489 -63547 -439939 169149 -23728 -393894 261641 199062 238006 -65463 -467407
19219d67407D5861g3876l14272a18075m5669C33057g3567G6133L3454c23518A77213
$$ -467407 45861 -73876 -388148 -118075 -163744 333057 -73567 76133 109587 -323518 177213
19207c31507J2606B51135j21606d9259r0974M3505B86360C371a71049D6904i2291
$$ -331507 -318901 251135 129529 -49259 -140233 -96728 286360 3371 -171049 46904 -92291
19195D50b66712A35945M108b04517h1774B66705b889C39849j48742D4616a35169
$$ 450 -266712 135945 140053 -204517 -81774 266705 -2889 339849 191107 44616 -135169
19183A71054b36461P0673a4334D7481B0546a68041F4939c78735k8534b9693F9805
$$ 171054 -236461 -165788 -14334 47481 20546 -168041 64939 -378735 -407269 -29693 69805
19171b13493A24985P3426i1098c2651C81836I6493b9704H5373i7404b4429j92026
$$ -213493 124985 198411 -91098 -32651 381836 96493 -29704 85373 -97404 -24429 -216455
19160b16455A90554b72314L9854E3397b45285i3748B9557a8193A56052F2129j4650
$$ -216455 190554 -272314 -232460 53397 -245285 -93748 29557 -18193 156052 62129 47479
19149D7479b52779C2759O348J3809n450b30636j67237D5383L28841a37953j3256
$$ 47479 -252779 32759 39107 52916 47466 -230636 -397873 45383 374224 -137953 -151209
19138a51209f650A46069o6462b28126A68387b92058a29302j21016a17319a6738
$$ -151209 -6650 146069 79607 -228126 168387 -292058 -129302 -250318 -117319 -16738
19127b13272B3224P4359C5279h8168k48514A36608g4441K7677j79508d9213B25964
$$ -213272 23224 97583 35279 -88168 -336682 136608 -74441 -46764 -226272 -49213 225964
19115a69808M0644N5709I9039a89197e0659G1157J95767g3848c1671J0347k81930
$$ -169808 -129164 -73455 99039 -189197 -50659 71157 266924 -73848 -31671 -21324 -303254
19104c03254F346b20537I8847a32783p3789F8550b01891J6526o276A89425b15483
$$ -303254 6346 -220537 98847 -132783 -206572 68550 -201891 -185365 -191641 189425 -215483
19092D9705j8012a87156C4998a11136b4553F6379m764a51603A50766a30618J9374
$$ 49705 31693 -187156 34998 -111136 -24553 66379 61615 -151603 150766 -130618 -111244
19081a11244n5907a7016G35a12259G0635d35037a91269f4244A66653l0119N393
$$ -111244 -167151 -17016 735 -112259 70635 -435037 -191269 -64244 166653 136534 141927
19070A41927i0199A78499a86329B26080a60724j25628A46256h9260B86007a01834
$$ 141927 -90199 178499 -186329 226080 -160724 -286352 146256 -89260 286007 -101834
19059b30397A32673L1742a64807n1499B1329a09888L081j85114G192i8157l5246
$$ -230397 132673 164415 -164807 -216306 21329 -109888 -106807 -291921 7192 -98157 -133403
19048a33403m6215K356c2987l9494A62253E3617J1667d4389A39201a1779j84121
$$ -133403 -179618 -177262 -32987 -72481 162253 53617 65284 -44389 139201 -11779 -195900
19037a95900M3720M3641b3067A39354F5302K6828m3476f4867A9304J43056a55022
$$ -195900 -152180 -108539 -23067 139354 65302 92130 48654 -64867 19304 162360 -155022
19025b08007A37123n3977c2486r4689M332C43704K5871A5210c20343a36501j38512
$$ -208007 137123 83146 -32486 -127175 -122843 343704 369575 15210 -320343 -136501 -275013
19014b75013F98L10733a72447g029k2523q736k40431D5550b39083A14358c20967
$$ -275013 698 311431 -172447 -7029 -29552 -38288 -278719 45550 -239083 114358 -320967
19002a20132e0423I9810b88727C43298f2397A68463c86466R6733E2961K24399
$$ -120132 -50423 99810 -288727 343298 -62397 168463 -386466 -289733 52961 277360
18992B77360A17164f9681j31709B4944J39582A1488h8573j59713M1874h8633A41219
$$ 277360 117164 -69681 -201390 24944 164526 11488 -88573 -248286 -206412 -88633 141219
18980D3285a29789l39543a44230m5299i853k96181e7484j67664B36986D0103D928
$$ 43285 -129789 -469332 -144230 -189529 -9853 -306034 -57484 -225148 236986 40103 4928
18968h6361F3537b71335Q7226j4497m5715M8478a4791j49916K1733A62727h8582
$$ -86361 63537 -271335 -184109 -198606 -244321 -195843 -14791 -164707 -142974 162727 -88582
18956A15931a23528m5222P6041A21647A8696H416d33697f5563o58A02838D1698
$$ 115931 -123528 -168750 -92709 121647 18696 8416 -433697 -65563 -66221 102838 41698
18944i1658C3332J4486P9927a25362j45474d6383r1071D0754b49384a03336G6869
$$ -91658 33332 47818 127745 -125362 -270836 -46383 -137454 40754 -249384 -103336 76869
18932A42522K35250a40820D4354a9194r8642I1138g9018j03480I6757M7097N5940
$$ 142522 377772 -140820 44354 -19194 -117836 91138 -79018 -182498 96757 143854 199794
18921A99794b17601B1131A109c6357a2690j88214h4175F5550h7531l3261o193
$$ 199794 -217601 21131 1109 -36357 -12690 -200904 -84175 65550 -87531 -120792 -126985
18910a26985N368n4176h5800l47467H2559a93695Q082f11q4962A93318p6240M7708
$$ -126985 -121617 -175793 -85800 -433267 82559 -193695 -185613 -611 -85573 193318 117078 164786
18898A64786j6525J6756a85895b2383I8837D8577b9686j654G9429b45217D23480
$$ 164786 148261 165017 -185895 -22383 98837 48577 -29686 -31340 79429 -245217 423480
18886C9391b2127B359Q2417a39633A23193C4571a37792A44136a06538I5816a64951
$$ 39391 -22127 2359 84776 -139633 123193 34571 -137792 144136 -106538 95816 -164951
18874A16297L6264N1205b10683f2295n5897r3084H2932J77995g2492A58047g0303
$$ 116297 152561 203766 -210683 -62295 -118192 -211276 82932 260927 -72492 158047 -70303
18862H8856f4743m9426j33710j13295H4705b617l79684I3110c52162a04756B01056
$$ 88856 -64743 -114169 -247879 -361174 84705 -2617 -382301 93110 -352162 -104756 201056
18850a20016I8720d84F5571N6570K43250g4964j79809R5491j36123I2507c8500
$$ -120016 98720 -484 65571 122141 365391 -74964 -254773 -159282 -295405 92507 -38500
18838A07241b08614C9149b38663i533C3375b52290A25369b62767j3366A87632
$$ 107241 -208614 39149 -238663 -9533 33375 -252290 125369 -262767 -276133 187632
18827B51401d9987B7355g4519j7013J9160k09983a1840r2012A76191a04434b8560
$$ 251401 -49987 27355 -74519 -91532 -72372 -282355 -11840 -103852 176191 -104434 -28560
18815C25511a06769d0055q0613A68709K18872N2480E2390J33070j0406p9273i3464
$$ 325511 -106769 -40055 -120668 168709 387581 440061 52390 185460 175054 95781 -93464
18803e9531E8595a010q4980A91752a15258D1610b3295j75412o4173a2716m5602
$$ -59531 58595 -1010 -85990 191752 -115258 41610 -23295 -198707 -262880 -12716 -58318
18792e8318A08663b38509C0446a30454A8247J38707P8751g3068p4380c25o7957
$$ -58318 108663 -238509 30446 -130454 18247 156954 235705 -73068 -147448 -325 -68282
18781f8282k12658p8160A00967J08527H3066a7942n37000c6407B87199o4495a67002
$$ -68282 -280940 -359100 100967 209494 83066 -17942 -554942 -36407 287199 222704 -167002
18769a15740j2732k51847D4602K84427a79029P153f0605E8206c50341A86694D8413
$$ -115740 -128472 -380319 44602 329029 -179029 -171876 -60605 58206 -350341 186694 48413
18757A68218b0709k5097B5866a74041c445r9188n9592C2432b24216P9499N2215
$$ 168218 -20709 -45806 25866 -174041 -3445 -102633 -162225 32432 -224216 -144717 -92502
18746i2502j98470A92809d35870a39381f9485l5333j14331C26214a53646A42478
$$ -92502 -290972 192809 -435870 -139381 -69485 -104818 -219149 326214 -153646 142478
18735b87299A93922g761q1927A8815d5027j74709l00139i3511j3571B12160b3413
$$ -287299 193922 -7761 -89688 18815 -45027 -219736 -519875 -93511 -107082 212160 -23413
18723F4089b7095j89484J00302j05190A82071J44760G9739b7471D2569f7078m7808
$$ 64089 -27095 -216579 -116277 -221467 182071 326831 79739 -27471 42569 -67078 -114886
18712a14886q5454Q2038l6772A01624a46088E1475c1942j64730d9430j39916j5032
$$ -114886 -200340 -118302 -155074 101624 -146088 51475 -31942 -196672 -49430 -189346 -204378
18701b04378F2294c39886a57229H2025B8507c83269f4554a6991F9565B7231i3944
$$ -204378 62294 -339886 -157229 82025 28507 -383269 -64554 -16991 69565 27231 -93944
18689c30626G2868h2267A24882b96914O4194b5367j27024A30183a83679N8186
$$ -330626 72868 -82267 124882 -296914 -232720 -25367 -152391 130183 -183679 -125493
18679a25493B03541P9440c99087g1042b7159j22642k15015b2476D4625a17901
$$ -125493 203541 282981 -399087 -71042 -27159 -149801 -364816 -22476 44625 -117901
18668g3546C3322h4298A38390k0421b85494I8622m4410g3136C98568c59029B3999
$$ -73546 33322 -84298 138390 117969 -285494 98622 54212 -73136 398568 -359029 23999
18656a63488h822B1114J05189i7979k993E8723C96b11843b8122A39915h8137k3890
$$ -163488 -8822 21114 126303 -97979 -100972 58723 396 -211843 -28122 139915 -88137 -112027
18644a12027D8022a329q1852a0920n5802k69317C40993B9736J37497i8217k3351
$$ -112027 48022 -1329 -83181 -10920 -66722 -336039 340993 29736 167233 -98217 -121568
18633a21568f0285J0613I7937J06223c13331d4709m6169H6032J7270N648H320
$$ -121568 -60285 -49672 97937 204160 -313331 -44709 -90878 86032 103302 108950 8320
18621B0174a63630k24697A59049M5307g2354j12113k17230e9998p0078J7453j66025
$$ 20174 -163630 -388327 159049 204356 -72354 -184467 -401697 -59998 -130076 -112623 -278648
18610b78648J24976f1665d529A16730c56560J34930e6015b5193j93849G1251B9673
$$ -278648 -153672 -61665 -4529 116730 -356560 -221630 -56015 -25193 -219042 71251 29673
18598c9572j06809d6180F8021J33205J14220c3659k12372i3604B01829I5830a87378
$$ -39572 -146381 -46180 68021 201226 315446 -33659 -246031 -93604 201829 95830 -187378
18586b59094d8988D5543c75395J14256O0152j09967Q7762C2959b08429c9536k30054
$$ -259094 -48988 45543 -375395 -261139 -200987 -310954 -223192 32959 -208429 -39536 -269590
18575b69590C2311a74218B21395C818P570J96637f0817j75391a09155A3298b29347
$$ -269590 32311 -174218 221395 3818 11388 208025 -60817 -236208 -109155 13298 -229347
18563h4457p8769A81311i470o8037j9837d3891H2738a03686A44934E6790c50706
$$ -84457 -163226 181311 -9470 -77507 -97344 -43891 82738 -103686 144934 56790 -350706
18551g3176j66096A21061a1452j73492A0026K46166D1049b02468B06069a66753
$$ -73176 -239272 121061 -11452 -184944 10026 256192 41049 -202468 206069 -166753
18540a89804C4857J91917g8701A01507g917A52608b88129l7000c2987j63891d2382
$$ -189804 34857 226774 -78701 101507 -7917 152608 -288129 -325129 -32987 -196878 -42382
18528h848m5963F3031b09300a8727A57288n9303e4935k02830M7210N1605J0376
$$ -8848 -54811 63031 -209300 -18727 157288 97985 -54935 -257765 -210555 -158950 -148574
18517a48574j60928f5483L0237G2311J82578A25148a60887k6407m5452J07107
$$ -148574 -309502 -65483 -35246 72311 254889 125148 -160887 -187294 -232746 -125639
18507a25639e8731A02948m7128b2725k53668A12451J26317p1757a23629k66142
$$ -125639 -58731 102948 55820 -22725 -276393 112451 238768 167011 -123629 -389771
18497c89771e9544G3245D34J02577B4237b0849A31002G558b66562C27798a84676
$$ -389771 -59544 73245 434 103011 24237 -20849 131002 7558 -266562 327798 -184676
18485a19671j02717g2985A95953h4701I8847m9363J01073o57e2972l3559A75813
$$ -119671 -222388 -72985 195953 -84701 98847 49484 150557 149900 -52972 -86531 175813
18473f1717B3620J01868a1043j2462F8195b61660J14869A77145E1372a21746j07512
$$ -61717 23620 125488 -11043 -23505 68195 -261660 -146791 177145 51372 -121746 -229258
18462b29258a824m1650F5580J66917e5894F6113J64092a06869E6928a33819k2929
$$ -229258 -1824 -43474 65580 232497 -55894 66113 230205 -106869 56928 -133819 -156748
18451a56748A12341C0238a34407g788p8978E7070c05979I584a86883f125C9815
$$ -156748 112341 30238 -134407 -7788 -86766 57070 -305979 9584 -186883 -6125 39815
18439a19969r7099Q3048d7157m2095P529C9218b520A15728Q6958f9993b5032I5347
$$ -119969 -217068 -134020 -47157 -89252 -81723 39218 -2520 115728 202686 -69993 -25032 95347
18426F6377e33563f295B20005a64027A8251P4995C6326a73235j32471A86517d9223
$$ 66377 -533563 -6295 220005 -164027 18251 93246 36326 -173235 -305706 186517 -49223
18414A8786M1391B3927e2149B63431n6364r6923b69710a20797N3823C63947a19128
$$ 18786 60177 23927 -52149 263431 207067 110144 -269710 -120797 -66974 363947 -119128
18402e7052j5647E9776c37509C01856A11630N0382b63896A47844F8332R6008N9738
$$ -57052 -72699 59776 -337509 301856 111630 162012 -263896 147844 68332 164340 224078
18391B24078b45990B54838a24417A0440g4277r6235A93918l5696b51358a18365
$$ 224078 -245990 254838 -124417 10440 -74277 -170512 193918 158222 -251358 -118365
18380A655h5117B43839b14698p1638J14584j5761o7799A92157a75565A61205n6917
$$ 1655 -85117 243839 -214698 -286336 -171752 -187513 -255312 192157 -175565 161205 104288
18369A04288a05312D9575G414a10373B7601b0373I5905B4047a93612A462a42735
$$ 104288 -105312 49575 7414 -110373 27601 -20373 95905 24047 -193612 1462 -142735
18357A25609C8443K16133B3856J70289h7965A76550L8541a49333d6582j96856
$$ 125609 38443 254576 23856 194145 -87965 176550 215091 -149333 -46582 -243438
18347b43438B62887a24260b0578k84056A60359a0950B58049c85949A9238O1471
$$ -243438 262887 -124260 -20578 -304634 160359 -10950 258049 -385949 19238 80709
18337H0709K7111N8553a54478G369a34634e3393a2485j26109c6907M27A02888
$$ 80709 107820 166373 -154478 7369 -134634 -53393 -12485 -138594 -36907 -36480 102888
18325C4471C148J43940i2809a8231C527J08803C442J5082i845m2408j75685q8855
$$ 34471 3148 147088 -92809 -18231 3527 112330 3442 18524 -9845 -52253 -227938 -316793
18313c16793n6943C7887N780L51886A05443i7635k72709f2566m0966j02220A97965
$$ -316793 -373736 37887 43667 395553 105443 -97635 -370344 -62566 -103532 -205752 197965
18301a0892G9814l6478N1210J5371B1179b04996N2058M0421A9169a31321j40009
$$ -10892 79814 43336 94546 109917 21179 -204996 -152938 -112517 19169 -131321 -271330
18290b71330a1446n3279B72725a66938F5081J4313J07469h1470A34892o3807M9678
$$ -271330 -11446 -64725 272725 -166938 65081 79394 186863 -81470 134892 71085 120763
18279A20763c8479A2778b08267F2423a41093A02696g8920j9499M4998E1697b51660
$$ 120763 -38479 12778 -208267 62423 -141093 102696 -78920 -98419 -53421 51697 -251660
18267I3318b68464J2643L3930A92175b76437E9144a14277j1464c2802E0861P6631
$$ 93318 -268464 -255821 -221891 192175 -276437 59144 -114277 -125741 -32802 50861 127492
18256A27492g8671D508J55915J34728c40890A62350G8071l3805b52364r5084a55456
$$ 127492 -78671 4508 160423 295151 -340890 162350 78071 44266 -252364 -347448 -155456
18244a16044A24854k9668b49385A56946c71845f1778K4933m09581a75100P674
$$ -116044 124854 95186 -249385 156946 -371845 -61778 -36845 -446426 -175100 -167426
18234a67426d098H0557G789J82896Q6278A06673a2055l43161l5306a36553b5467
$$ -167426 -4098 80557 7789 190685 276963 106673 -12055 -355216 -390522 -136553 -25467
18222a09210k21467g8710k072j61354a05245j48151d1170j69623C10450c11586
$$ -109210 -330677 -78710 -80782 -242136 -105245 -253396 -41170 -210793 310450 -311586
18211g4015A51052D9264a73395E5450i8993C6855J50642b2303k8315k83923J66853
$$ -74015 151052 49264 -173395 55450 -98993 36855 187497 -22303 -50618 -334541 -167688
18200a67688A5602J9701c933j65268p0860G6449R2226J84947a95003R5012j75481
$$ -167688 15602 35303 -3933 -169201 -240061 76449 168675 353622 -195003 -99991 -275472
18189b75472E8884b4333H9302i8511K8976j2416k7359M5552o4867M2769A17884
$$ -275472 58884 -24333 89302 -98511 -69535 -81951 -109310 -63758 -128625 -85856 117884
18177c67981a32658j13130A33718f2388I6818b07261G1183a19292c4567C0973
$$ -367981 -132658 -245788 133718 -62388 96818 -207261 71183 -119292 -34567 30973
18166f2576O267A176a04276j16071a00625l31238J16833J43325A1678a64593K3713
$$ -62576 -56309 1176 -104276 -220347 -100625 -431863 -315030 -171705 11678 -164593 -140880
18155a40880B1941c04616m3557A86713a30030b8001j95474D42838e2159k07286
$$ -140880 21941 -304616 -348173 186713 -130030 -28001 -223475 442838 -52159 -259445
18145b59445a5924j87082D3424a6731H7011K34951H380J10867a78973A14593a44068
$$ -259445 -15924 -203006 43424 -16731 87011 321962 8380 119247 -178973 114593 -144068
18133E3280Q6982a37167O1601j69599J17258F5770K7820a78686I4922f9085A9257
$$ 53280 140262 -137167 -75566 -245165 -127907 65770 93590 -178686 94922 -69085 19257
18121b54435A98766L5429G9434K46289d9420p7537a0062G5760a78290L145o4277
$$ -254435 198766 234195 79434 325723 -49420 -126957 -10062 75760 -178290 -175145 -239422
18110b39422M8805O2323d3523D6380b27310A33441d7087B92185J0478A20046i3862
$$ -239422 -190617 -128294 -43523 46380 -227310 133441 -47087 292185 302663 120046 -93862
18098H5728b35732l6166J06661N1420A10044E259b09A28935a16769i873D44813
$$ 85728 -235732 -271898 -165237 -113817 110044 5259 -209 128935 -116769 -9873 444813
18086e0623A2519K41355b14712e671A45614J1399k1790O483A3088d30977E9119
$$ -50623 12519 253874 -214712 -5671 145614 157013 135223 141706 13088 -430977 59119
18074B8780e5088k4273j91533D16044c7360M452A13324a04860o3583c1260A20488
$$ 28780 -55088 -79361 -270894 416044 -37360 -32908 113324 -104860 -168443 -31260 120488
18062B16421d6868j20886i054B59234h5041J2379A6412c6395B20K12363d5260
$$ 216421 -46868 -167754 -9054 259234 -85041 -72662 16412 -36395 220 212583 -45260
18050B48754j23699b69484J04005k77387J92462j6271A43655o6699J40606c83404
$$ 248754 125055 -269484 -165479 -442866 -250404 -266675 143655 76956 217562 -383404
18039a05386j08500C7339I489M8786J83441Q6147a42420a5476A02260N3532J2773
$$ -105386 -213886 37339 9489 58275 241716 327863 -142420 -15476 102260 155792 168565
18028A68565c0846j35377C998a22643B80435e8871k45096A39056K38414A47114
$$ 168565 -30846 -166223 3998 -122643 280435 -58871 -303967 139056 377470 147114
18017A12670B4239O5752a74389B34582O6533b5705G1278a95347a3206F8716a01196
$$ 112670 24239 89991 -174389 234582 301115 -25705 71278 -195347 -13206 68716 -101196
18005D3431J31497a41235o8029C91943A45014i8898j81542D8579a60253D3271
$$ 43431 174928 -141235 -209264 391943 145014 -98898 -280440 48579 -160253 43271
17994a15581A99354a44483A37038h9573A45600c88017h043B4553K7432a30745
$$ -115581 199354 -144483 137038 -89573 145600 -388017 -8043 24553 51985 -130745
17983A9586K03031l2328e14155a47658c9868A84770J00420a76584c4994H3064
$$ 19586 222617 190289 -514155 -147658 -39868 184770 285190 -176584 -34994 83064
17972B20338a74200j19258a26088c786A32425n9441J17961Q6658f3183k6150j45284
$$ 220338 -174200 -293458 -126088 -3786 132425 72984 190945 277603 -63183 -89333 -234617
17961b34617R795B06417c07749a0347G4117R6851O6483e7115A20073O7711g4677
$$ -234617 -224822 206417 -307749 -10347 74117 170968 237451 -57115 120073 187784 -74677
17949D4031d2187F319b36973a03880b3973n2855j36302O6634j8864D502J55289
$$ 44031 -42187 6319 -236973 -103880 -23973 -76828 -213130 -146496 -165360 4502 159791
17938A59791D4882b44165C15441b29417a1057j94419C6724b16444C16479E7787
$$ 159791 44882 -244165 315441 -229417 -11057 -205476 36724 -216444 316479 57787
17927a59050A01690a9137j36086e7079A39752d2111A30918k5712c13567B6457
$$ -159050 101690 -19137 -155223 -57079 139752 -42111 130918 105206 -313567 26457
17916c18992e4752J6441o711A07991c5303j45561P1094m37779a1150D2668l488
$$ -318992 -54752 -38311 -45022 107991 -35303 -180864 -109770 -547549 -11150 42668 39180
17905C9180a19722b4334l09813D8641A887a89547n8759B64042b10261F8136R3152
$$ 39180 -119722 -24334 -334147 48641 1887 -189547 -248306 264042 -210261 68136 161288
17894A61288a35329B3886a35049N3720F5304b98428A73200a69998a8983A19869
$$ 161288 -135329 23886 -135049 -81329 65304 -298428 173200 -169998 -18983 119869
17883h4457A21953a40705j74825A29135a24411A21604c69053A57275n2896C159
$$ -84457 121953 -140705 -315530 129135 -124411 121604 -369053 157275 104379 3159
17872H5339a09428q9199c9237q8298C6007Q9068c1657k9311H3901a39217a6134
$$ 85339 -109428 -198627 -39237 -127535 36007 125075 -31657 -60968 83901 -139217 -16134
17860a4233F6830B9344g0796J8895p2572c3732j95039j02837H8137h3152p5094
$$ -14233 66830 29344 -70796 -51901 -124473 -33732 -228771 -331608 88137 -83152 -158246
17849a58246D6401c6913j55812B3998J98506a20300A16239B4943J33712a76949
$$ -158246 46401 -36913 -192725 23998 222504 -120300 116239 24943 158655 -176949
17838G5167b00374J7848A95114b48174J7010E6991a0878A44992j7790f291D9087
$$ 75167 -200374 -182526 195114 -248174 -231164 56991 -10878 144992 127202 -6291 49087
17826c65789F3543r418a56680d9744k4215G1477J98773I6817J44258c0374E8677
$$ -365789 63543 54125 -156680 -49744 -73959 71477 270250 96817 241075 -30374 58677
17814A42248j1895c68418A6229c53306H8324J4113c72280a16657F6356c38934
$$ 142248 130353 -368418 16229 -353306 88324 102437 -372280 -116657 66356 -338934
17803C62926f8736n3138H0534J1686c4528F9527g8246a879A76165N626i8170I0359
$$ 362926 -68736 -121874 80534 92220 -34528 69527 -78246 -1879 176165 181791 -98170 90359
17790A6530K17763F9146e30944C23216j30070b32680G1938N0599N6044a25129
$$ 16530 234293 69146 -530944 323216 193146 -232680 71938 122537 178581 -125129
17779c8076k3704N287k34763J14952j88145d7707E2466b01042a1069j18621m0242
$$ -38076 -61780 -56493 -291256 -176304 -364449 -47707 52466 -201042 -11069 -129690 -169932
17768a69932C27282h2526F9282j28A6636a50517e4400H7539f15525A5399a38488
$$ -169932 327282 -82526 69282 69154 16636 -150517 -54400 87539 -615525 15399 -138488
17756g8639G4499a30584A4546a7274F4435c12398A21848l6410Q4880p1620C4265
$$ -78639 74499 -130584 14546 -17274 64435 -312398 121848 85438 170318 98698 34265
17744I179c1477j08590B56742F2642K00866j29946F2645J20373Q286o5476E2979
$$ 9179 -31477 -140067 256742 62642 263508 133562 62645 183018 191304 125828 52979
17732G828l713i795j13472D7325J60114a5797o8865r7865C71463I5400J10634
$$ 7828 4115 -9795 -123267 47325 207439 -15797 -84662 -182527 371463 95400 206034
17721B06034R0782d764I3835l6446M1071a65968A35162N7936E2397h5045B21648
$$ 206034 296816 -4764 93835 57389 98460 -165968 135162 193098 52397 -85045 221648
17709I2185M463i0826E9068d7034B1394a5976j8249q2068A9400K10745A04424
$$ 92185 96648 -90826 59068 -47034 21394 -15976 -34225 -116293 19400 230145 104424
17697a30325M6656A95113b30455E6742d4525m4974D7320b17067B65379D751K28992
$$ -130325 -83669 195113 -230455 56742 -44525 -89499 47320 -217067 265379 4751 233743
17686B33743H5076K34822a32591l26007A51997B2622e1477n4473A74169m005J61813
$$ 233743 85076 319898 -132591 -458598 151997 22622 -51477 -105950 174169 170164 331977
17675C31977a26966A33030a56921k18718R3947a17823E8361h0969j85854a09996
$$ 331977 -126966 133030 -156921 -375639 -281692 -117823 58361 -80969 -266823 -109996
17664B64981H7361C991N53243B37327f0550A54389K08165A20527a71910B18075
$$ 264981 87361 3991 557234 237327 -60550 154389 362554 120527 -171910 218075
17653b3619j75710k13182J10279N4725e1041F8057d7339n1972G437c32967B03990
$$ -23619 -199329 -412511 -302232 -247507 -51041 68057 -47339 -99311 7437 -332967 203990
17641a47347f9793j06899N4382B2039b20291E518a77643G9757R1693a75437B30014
$$ -147347 -69793 -176692 -122310 22039 -220291 5518 -177643 79757 171450 -175437 230014
17629A53055a375A8955H86h5572g299j62644M7277A91734P3603b02258A38422
$$ 153055 -1375 18955 886 -85572 -7299 -169943 -122666 191734 265337 -202258 138422
17617e2218H4276L73988b03317h7767G0806a46599G6237k0723B3138j610L3840
$$ -52218 84276 458264 -203317 -87767 70806 -146599 76237 55514 23138 21528 55368
17606E5368K30921a3090B77651e72k66659B45562a47557I3665a07127c7662J5536
$$ 55368 286289 -13090 277651 -572 -267231 245562 -147557 93665 -107127 -37662 -22126
17595b2126C83702A50451i4013B30242e2478k05709B46004g1490L0528F5985P1815
$$ -22126 383702 150451 -94013 230242 -52478 -258187 246004 -71490 -40962 65985 137800
17584A37800A4581L27408A0547J39505a25080k9532B45915a61281A34240B4757
$$ 137800 14581 341989 10547 150052 -125080 -154612 245915 -161281 134240 24757
17573A58132a94646C5307a34951A90782I3592J53352a62041j03233e418A82141
$$ 158132 -194646 35307 -134951 190782 93592 246944 -162041 -265274 -5418 182141
17562B28685q7969b73197N7973i4184k3458A00413B8954e26383a8001B95830h6288
$$ 228685 140716 -273197 -215224 -94184 -117642 100413 28954 -526383 -18001 295830 -86288
17550a03246j05490B6246N6292C9442K1071C620a57541P6601A85109f0063A53809
$$ -103246 -208736 26246 82538 39442 60513 3620 -157541 -80940 185109 -60063 153809
17538A47225A9486A178a84191b8621j66702D4080K25142a2366A47163Q2276c77246
$$ 147225 19486 1178 -184191 -28621 -195323 44080 269222 -12366 147163 229439 -377246
17526C57296J11234G5123a57628J718H9391A2904J04597d4489I1604g3963j82665
$$ 357296 468530 75123 -157628 -155910 89391 12904 117501 -44489 91604 -73963 -256628
17515b56628B30195j2114i6445H8734a19491D39822A82977b8149q6002A75307
$$ -256628 230195 218081 -96445 88734 -119491 439822 182977 -28149 -114151 175307
17504f2190p636l6620A51K15917e5351A65161K0447o4875J01184C9717J93237
$$ -62190 -69826 -106446 151 216068 -55351 165161 185608 120733 221917 39717 232954
17493B32954j03980J71774B2990L8752B555J22854P8658j3170b80631E7009J21283
$$ 232954 128974 300748 22990 61742 2555 125409 204067 190897 -280631 57009 178292
17482A78292A995d2441A03597D8611J54884c9885B22582R7840A28453a77265B27409
$$ 178292 1995 -42441 103597 48611 203495 -39885 222582 320422 128453 -177265 227409
17470D2713d0876C82540a21733A47245D243K20688a7331j92195C03632a05630
$$ 42713 -40876 382540 -121733 147245 4243 224931 -17331 -209526 303632 -105630
17459B20976q2562a10179G1317K27192D1930J63824G8807L51741m2890k5822A56042
$$ 220976 138414 -110179 71317 298509 41930 205754 78807 430548 387658 361836 156042
17447B28724M34098k36823a46048E40559A49529J27660G0819J39783o9726O2778
$$ 228724 662822 425999 -146048 540559 149529 277189 70819 210602 140876 203654
17437B03654q3809L31499A78767M9334q3469K58758j28556F6575K27379I8323
$$ 203654 119845 451344 178767 228101 144632 403390 274834 66575 293954 98323
17426E67668G1187N26876C1836L22325R4416A93689r4175M51054A77282J38109
$$ 567668 71187 598063 31836 354161 448577 193689 99514 550568 177282 315391
17416C15391J1039J79038j35964m3610A06700J67111E9739J06103J6085J10046
$$ 315391 326430 505468 369504 325894 106700 273811 59739 165842 181927 291973
17406B91973D2864b07553B73747a090B8137J54554b42939J12578d3191n3905A31252
$$ 291973 42864 -207553 273747 -1090 28137 182691 -242939 -130361 -43191 -97096 131252
17394f7439B8289i3868B15713H2133Q2304J25404b80537B6689g6713B95461A11932
$$ -67439 28289 -93868 215713 82133 164437 289841 -280537 26689 -76713 295461 111932
17382E12047A81735e50668B0495J52773q6057b10693k0780D3035J33592G4984
$$ 512047 181735 -550668 20495 173268 87211 -210693 -231473 43035 176627 74984
17371B9408L72219A16043O5152p4393A2508J48689a00605D32383r0916d9951B3048
$$ 29408 401627 116043 181195 106802 12508 161197 -100605 432383 341467 -49951 23048
17359A23671a9714C5080k727a19826A85429k9028m4098G347L07911o5456B674
$$ 123671 -19714 35080 32353 -119826 185429 156401 112303 7347 315258 249802 2674
17347H2147K62937H1761M7019K57372A68839L7229L22672A01615N8156C7178L86294
$$ 82147 345084 81761 128780 386152 168839 206068 528740 101615 159771 37178 423472
17336D23472a39012O5464A08667a27461I5535K56829E807f1214b0145C53835j12256
$$ 423472 -139012 -73548 108667 -127461 95535 352364 5807 -61214 -20145 353835 241579
17325B41579a44844F7533L6642c1277r980H0436b7286B29097a59552A89773N3316
$$ 241579 -144844 67533 104175 -31277 -41257 80436 -27286 229097 -159552 189773 243089
17314B43089l3061j871k8499b23764G5101J27089C3082P0863B8669K17192J5260
$$ 243089 210028 208157 179658 -223764 75101 202190 33082 103945 28669 245861 261121
17303B61121r7357J47374A40067J39798A16615I598K34828A1203a29334B74707
$$ 261121 163764 311138 140067 279865 116615 9598 244426 11203 -129334 274707
17292b07181A76911J24949H0763a83418b6499l5385B59251J22138j45761j01350
$$ -207181 176911 301860 80763 -183418 -26499 -61884 259251 381389 235628 134278
17282A34278i9646A9466L296J09674L75839A67833E2769N4105J89394j14916K72817
$$ 134278 -99646 19466 22762 132436 508275 167833 52769 106874 296268 181352 454169
17271D54169j56647b105H0031l8458J49276K3160Q6548j11553k9578L39484H81
$$ 454169 297522 -2105 80031 41573 190849 214009 300557 189004 159426 498910 881
17259A0857Q7112m3480J20637m1447A217M61859r0440j27919j11356Q2037K37054
$$ 10857 97969 54489 175126 133679 1217 463076 372636 244717 133361 215398 452452
17248D52452r9950h6920B26216K32835j9561I0844J19985j01180J32167B6434
$$ 452452 352502 -86920 226216 459051 439490 90844 210829 109649 241816 26434
17237c01981B03961M9518o3068r3956L49174k03558b01156C50753j57256h0264
$$ -301981 203961 253479 190411 96455 445629 242071 -201156 350753 193497 -80264
17226A98448J08050K27586i3845B26533a61544b9427B92388H0777K32679f9379
$$ 198448 306498 534084 -93845 226533 -161544 -29427 292388 80777 313456 -69379
17215C29370j09996r544o7575K99869j63302l9269L07662l5176A23647E7724R3348
$$ 329370 219374 209830 142255 442124 278822 239553 547215 512039 123647 57724 151072
17204A51072O6734F1754D121M2766L15493j06577q9699K73090A96938Q0785K8997
$$ 151072 217806 61754 4121 46887 362380 255803 166104 439194 196938 277723 306720
17193C06720B3909J47660M6736E2801D761K07949q1606l2875K44519I3064L06217
$$ 306720 23909 171569 218305 52801 4761 212710 131104 98229 342748 93064 399281
17182C99281A86265P191L25091j24201J3691j28942A27498K06239o8628p8608
$$ 399281 186265 193456 518547 394346 408037 279095 127498 333737 265109 186501
17172A86501K65460j49566A0538L28923j54645J37984A34547J54522J66675p1794
$$ 186501 451961 302395 10538 339461 184816 322800 134547 289069 455744 383950
17162C83950j60982a42139A99659Q9911L80j27110o400C273M19038A19289J96566
$$ 383950 222968 -142139 199659 289570 289950 162840 156440 3273 422311 119289 315855
17151C15855M3556P5360H9934K91931A40297P4241B3485J87571j2615L07335k40097
$$ 315855 359411 434771 89934 381865 140297 214538 23485 211056 198441 505776 265679
17140B65679j4911J773N8718A05183R0410K87153j13986p1796Q2605N9333A77251
$$ 265679 250768 252541 311259 105183 195593 482746 368760 296964 379569 438902 177251
17128d5539F46471A47919J55145L20459r9504A96582K57570K80082l05860m5573
$$ -45539 646471 147919 303064 623523 524019 196582 454152 734234 428374 382801
17118C82801O5599J88573E9371M88039k42491j42968L13052A03382K91371j33057
$$ 382801 448400 636973 59371 547410 304919 161951 475003 103382 394753 261696
17108B61696p312J28366j77884l5318K56880J01847K15707B37515b5345G69996
$$ 261696 254384 382750 204866 169548 426428 528275 743982 237515 -25345 769996
17097A84315N36022k7369B37393Q1470K73637j47985Q9195A83650J4170J43245
$$ 184315 720337 692968 237393 318863 592500 444515 533710 183650 197820 341065
17087C41065P2953j19687M0017j21211J96857l5829j5827K19652j05647N1863
$$ 341065 414018 294331 334348 213137 409994 374165 358338 577990 472343 524206
17077E24206j67001o3174J45900o1950P2537O6943j59878j14485K98808j66295
$$ 524206 357205 294031 439931 377981 450518 517461 357583 243098 541906 375611
17067C75611J65530p3864p8512A11922L68445j01657M14484l49517k1647K93761
$$ 375611 541141 467277 388765 111922 480367 378710 793194 443677 422030 715791
17057G15791J9618j63405k44723A06261O55990l25972M9661J18485k52736q9027
$$ 715791 735409 572004 327281 106261 762251 436279 485940 604425 351689 262662
17047B62662O4952P2409J697K17513R3570C28411K17645J96126k63355k6783J83015
$$ 262662 327614 400023 401720 619233 712803 328411 546056 742182 478827 452044 635059
17036F35059k41750K41641q9902k13620K42894j72516L89864k02202P1328L2191
$$ 635059 393309 634950 545048 331428 574322 401806 791670 589468 660796 692987
17026F92987k33644L57031k82393J1139J98292l45072L88971J26636k63101l4033
$$ 692987 459343 816374 533981 545120 743412 398340 787311 913947 650846 616813
17016F16813P711K92257m06145j07523J91788J76263j44551j03567M25058m54697
$$ 616813 624524 916781 510636 403113 594901 771164 626613 523046 948104 493407
17006D93407K81012q1669J35159p8029r999r1958K1917J95497m13346L03591Q4790
$$ 493407 774419 692750 827909 749880 739881 647923 669840 865337 451991 755582 840372
16995H40372M5757j93328K18768j51422n3203N00983n77577K16042M4229q6094
$$ 840372 886129 692801 911569 760147 706944 1207927 630350 846392 890621 804527
16985H04527k7958K8727j71518J39434K50515J32364n22900N53270n64677J69991
$$ 804527 776569 805296 633778 773212 1023727 1156091 633191 1186461 621784 791775
16975G91775j05769J16191K03036j21302K4738k94744M80908l46432K83380l60547
$$ 791775 686006 802197 1005233 883931 908669 613925 1094833 748401 1031781 671234
16965F71234M85345k51037k9146J73904j06264K27824l36565J06210J000m346
$$ 671234 1156579 905542 876396 1050300 944036 1171860 835295 941505 942505 938159
16955I38159J24522J15253l13574j2034R8779P0413j74928K14673O071j05430
$$ 938159 1062681 1177934 864360 852326 951105 1021518 846590 1061263 1067334 961904
16945I61904Q5077j5975k89086L31507p6367L33138j96278K76248j93595n20727
$$ 961904 1046981 1031006 741920 1073427 997060 1330198 1133920 1410168 1216573 695846
16935F95846M80721n88J31469L9668k46224J03006N9495j64807J06580J01755
$$ 695846 1176567 1175979 1307448 1347116 1100892 1203898 1263393 1098586 1205166 1306921
16925A306921k25552q1509J33065o8078M98071m78811R6615K46553l2842L4353
$$ 1306921 1081369 999860 1132925 1064847 1562918 1084107 1180722 1427275 1394433 1428786
16915A428786K19325r1125k00384J80559M0408n4331J71968r7043m8125O7984
$$ 1428786 1648111 1556986 1356602 1537161 1577569 1523238 1695206 1598163 1550038 1618022
16905A618022k61165M73976n309p5745M4157L08760m95270o3470M19632o1822
$$ 1618022 1356857 1830833 1825524 1749779 1793936 2102696 1607426 1543956 1963588 1901766
16895A901766j3650J04505J04368l97888m8394N15552k97407K65167L5607j74213
$$ 1901766 1888116 1992621 2096989 1699101 1650707 2166259 1868852 2134019 2169626 1995413
16885A995413M0107J80383m7291J85970l90432J77928R2996j5768j48926J23413
$$ 1995413 2035520 2215903 2168612 2354582 1964150 2142078 2235074 2219306 2070380 2193793
16875B193793n2986J46049N07320r1130l39663K42106q7922R1243m5305P9833
$$ 2193793 2140807 2286856 2794176 2703046 2363383 2605489 2517567 2608810 2563505 2643338
16865B643338P4166K51789j95256m3055J75964l46664L00926J76095k82282O39939
$$ 2643338 2717504 2969293 2774037 2730982 2906946 2560282 2861208 3037303 2755021 3394960
16855C394960m90346j0573J5214J2837N15762j41221J71497j43797L55769l10448
$$ 3394960 2904614 2894041 2909255 2922092 3437854 3296633 3468130 3324333 3680102 3369654
16845C369654K76940J80302k0959m119j69218K22903o9148J96259l47841L22911
$$ 3369654 3646594 3826896 3805937 3801818 3632600 3855503 3786355 3982614 3634773 3957684
16835C957684L49803j44364L3317j99743M90375L414Q4403J55147j12155J59902
$$ 3957684 4307487 4163123 4196440 3996697 4487072 4490486 4574889 4730036 4617881 4777783
16825D777783J81319K50395k34549n534M19343l976L34559Q3166J65101r2492
$$ 4777783 4959102 5209497 4974948 4969414 5388757 5384781 5719340 5802506 5967607 5875115
16815E875115K48681P3033J67880q6716M28863l07724L05670J22469J89649K5839
$$ 5875115 6123796 6196829 6364709 6277993 6706856 6399132 6704802 6827271 7016920 7042759
16805G042759N06443J9215Q124M28008j8218J46878K81854J00565L23187K68119
$$ 7042759 7549202 7568417 7576541 8004549 7986331 8133209 8415063 8515628 8838815 9106934
16795I106934j36616N70683K05712K25942M21570M80432j79772R9596O60923J72399
$$ 9106934 8970318 9541001 9746713 9972655 10394225 10874657 10694885 10794481 11455404 11627803
16785A1627803L69056M42172Q9832M00690O03826L37271K51305N74233N43255
$$ 11627803 11996859 12439031 12528863 12929553 13533379 13870650 14121955 14696188 15239443
16776A5239443J54514L28576M88630J234687J97127N39187J089616L08900O10274
$$ 15239443 15393957 15722533 16211163 17445850 17642977 18182164 19271780 19580680 20190954
16767B0190954Q94763M90842R04751N25764R80574J190203R38004J572500N50679
$$ 20190954 21085717 21576559 22481310 23007074 23987648 25177851 26115855 27688355 28239034
16758B8239034J172313J118493J363700J442672J538928J340877J496131K214089
$$ 28239034 29411347 30529840 31893540 33336212 34875140 36216017 37712148 39926237
16750C9926237J793350J898031K205079K239338K511783K899214K531923L017225
$$ 39926237 41719587 43617618 45822697 48062035 50573818 53473032 56004955 59022180
16742E9022180L061525L376466L841429L686629M216589M787003M587940N233488
$$ 59022180 62083705 65460171 69301600 72988229 77204818 81991821 86579761 91813249
16734I1813249M927668O162561N939247O534834O858622P210057P358716P659412
$$ 91813249 96740917 102903478 108842725 115377559 122236181 129446238 136804954 144464366
16726A44464366P615044P796639P665415P406741O353167O522933N228226M319927
$$ 144464366 152079410 159876049 167541464 174948205 181301372 187824305 193052531 197372458
16718A97372458L532791J507805K69763r31003k525803l653162n066777o075214
$$ 197372458 200905249 202413054 202682817 201751814 199226011 195572849 190506072 184430858
16710A84430858o936728p092010q044490p894394q395672p544189p858912p603238
$$ 184430858 177494130 170402120 162357630 154463236 146067564 138523375 130664463 123061225
16702A23061225p276616o621802o696121o421556n772247n546628m919609m569873
$$ 123061225 115784609 109162807 102466686 96045130 90272883 84726255 79806646 75236773
16694G5236773m521084l828324l713234l530328l572096k441689l305670k859792
$$ 75236773 70715689 66887365 63174131 59643803 56071707 53630018 50324348 47464556
16686D7464556j915109k698213k012902k138902j711425j757476j462130j759089
$$ 47464556 45549447 42851234 40838332 38699430 36988005 35230529 33768399 32009310
16678C2009310j531086q11717j651783q61667j454450p16919j285272j059024
$$ 32009310 30478224 29666507 28014724 27153057 25698607 24981688 23696416 22637392
16670B2637392o50104r52167j024778m69559p94053q64602l31539p23040n59247
$$ 22637392 21987288 21035121 20010343 19540784 18746731 17882129 17550590 16827550 16268303
16661A6268303m58243m52396n45033l30303n95391n31181m00013k22709q80163
$$ 16268303 15810060 15357664 14812631 14482328 13886937 13355756 12955743 12733034 11852871
16652A1852871o8153l27954m98685J54782l80939o20690l31435n47688P8443k02770
$$ 11852871 11784718 11456764 10958079 11112861 10731922 10111232 9779797 9232109 9310552 9107782
16642I107782k01970k04701k01985j76819n54484j74816P7180l08735m01993J61856
$$ 9107782 8905812 8701111 8499126 8322307 7767823 7593007 7670187 7361452 6959459 7121315
16632G121315j69351o9927l56635j12723l63330K0540j82742K51988o01706K631
$$ 7121315 6951964 6882037 6525402 6412679 6049349 6069889 5887147 6139135 5537429 5540060
16622E540060K7808j97129k08386J66056k65495j73472n2859k42854k08348L16995
$$ 5540060 5567868 5370739 5162353 5328409 5062914 4889442 4836583 4593729 4385381 4702376
16612D702376k70708l14155J08220r1041J35974k46466L28733k15612J92624o99387
$$ 4702376 4431668 4117513 4225733 4134692 4270666 4024200 4352933 4137321 4329945 3630558
16602C630558Q6664Q6554l21149j56134j2185K17683l06323J12263o9843l32963
$$ 3630558 3717222 3803776 3482627 3326493 3314308 3531991 3225668 3337931 3268088 2935125
16592B935125L92165l149l04457j81671J26154l37127j77853J59192K79621o8338
$$ 2935125 3327290 3324141 3019684 2838013 2964167 2627040 2449187 2608379 2888000 2819662
16582B819662q4417m9405K05511n14771K34256J09058k76552j6602j55344l1280
$$ 2819662 2735245 2685840 2891351 2376580 2610836 2719894 2443342 2426740 2271396 2240116
16572B240116L779K83025o22555K53472k41534L30383j177k82616r6400N8543
$$ 2240116 2243895 2526920 1904365 2157837 1916303 2246686 2245509 1962893 1866493 1925036
16562A925036O06364q39222J3413L75432l38577J16616p8614k0646j63030N0075
$$ 1925036 2531400 1692178 1705591 2081023 1742446 1859062 1780448 1759802 1596772 1646847
16552A646847j26155R6984q5304m9730M62130p404j00668j12125J09859m98173
$$ 1646847 1520692 1617676 1532372 1482642 1944772 1937368 1836700 1724575 1834434 1336261
16542A336261k444J8731K93789j56881J5137q0675J27129q8311n989O6643k15030
$$ 1336261 1333817 1352548 1646337 1489456 1504593 1423918 1551047 1462736 1456747 1523390 1308360
16531A308360k80625N25362l08450L2880m7157J10271l85170M14707R1333l43720
$$ 1308360 1027735 1553097 1244647 1277527 1230370 1340641 955471 1370178 1461511 1117791
16521A117791K53595K7938l43340L80014m40331J04613K63453k72218J3270j58848
$$ 1117791 1371386 1399324 1055984 1435998 995667 1100280 1363733 1091515 1104785 945937
16511I45937M98536k40230M0753k15427P6787k76689K45836l92040L77465J02327
$$ 945937 1444473 1204243 1244996 1029569 1106356 829667 1075503 683463 1060928 1163255
16501A163255k26124J12200K64896o49849M76574j26322m4833J24992j57741j60820
$$ 1163255 937131 1049331 1314227 664378 1140952 1014630 969797 1094789 937048 776228
16491G76228K4735r6928K04001k66468p2745K56307k08376J0998L38457l45712
$$ 776228 800963 704035 908036 641568 568823 825130 616754 627752 966209 620497
16481F20497q4602N04939E00709L27752J09262K8733k82424j47430L80993k10255
$$ 620497 535895 1040834 500709 828461 937723 966456 684032 536602 917595 707340
16471G07340l50640N62025N6505k77230J75436R4854k47408o5412K82440m25257
$$ 707340 356700 918725 975230 698000 873436 968290 720882 655470 937910 512653
16461E12653J5546j2100k6987J05327L4601j25010L34086k52036M42167l69090
$$ 512653 528199 516099 489112 594439 629040 504030 838116 586080 1028247 659157
16451F59157j73049k21085N96729D06989J77307m4877L26405m00622P7875n3854
$$ 659157 486108 265023 861752 406989 584296 539419 865824 465202 543077 489223
16441D89223q7040M41555D16086j18524Q1318K65832K7423r1021j79618L58367
$$ 489223 402183 843738 416086 297562 378880 644712 672135 581114 401496 759863
16431G59863j11017k17964K28329k33508j11296L72420j28181l9017Q7380B94665
$$ 759863 648846 430882 659211 425703 314407 686827 558646 519629 607009 294665
16420D20370L58974l32426A45080M27935j49976p1605K73131B17816N510J66453
$$ 420370 779344 446918 145080 573015 423039 351434 624565 217816 223326 389779
16410C89779J14681j27399o1714L39001A25129L90471J08227B91652J94719j56803
$$ 389779 504460 377061 315347 654348 125129 515600 623827 291652 486371 329568
16400C29568K5739N3181k6827m4833F4562L11650k5581M59769l61421r61n3017
$$ 329568 355307 408488 381661 336828 64562 376212 350631 810400 448979 448018 395001
16389C95001J74904j71210O5383m3030M0537A81992K96421E7137K65113J47732
$$ 395001 569905 398695 464078 421048 461585 181992 478413 57137 322250 469982
16379D69982J39634J43249k54890k44085K79491A63769J09537J87029A91307J63159
$$ 469982 609616 752865 497975 253890 533381 163769 273306 460335 191307 354466
16369C54466j30083J04200p7942M00332j90247B3297J76264M33345j77147m4476
$$ 354466 224383 328583 250641 650973 460726 23297 199561 632906 455759 411283
16359D11283G4309J68325J91701I8179L4446L37994j78546G9102N14451A17778
$$ 411283 74309 242634 434335 98179 132625 470619 292073 79102 593553 117778
16348A74468p1992L09596A64157j1646L4553f586C71034j04326A12811c4103C02590
$$ 174468 102476 412072 164157 152511 187064 -6586 371034 266708 112811 -34103 302590
16336A03737Q3019K30733J05826j979D2155b2615r1926C58080L9882a66054E10100
$$ 103737 186756 417489 523315 521336 42155 -22615 -114541 358080 397962 -166054 510100
16324B94307F6836J87867K42304A74666l2670j2372K34710A15384I607K8376K47170
$$ 294307 66836 254703 497007 174666 141996 129624 364334 115384 9607 37983 285153
16313B85153M9983r6813L6675j5391J42540P6166b09656A09946L2414p1169K36507
$$ 285153 335136 238323 274998 259607 402147 478313 -209656 109946 142360 71191 307698
16302C07698J27133L6330b05136A24749A3122J31669N9983L2448d8571l6231A97766
$$ 307698 434831 471161 -205136 124749 13122 144791 204774 237222 -48571 -84802 197766
16290C19149r6484q5094J35406o8757a9519B70993d6865B48050G1849P3699g1063
$$ 319149 222665 137571 272977 204220 -19519 270993 -46865 248050 71849 145548 -71063
16278C3036J08315k118j2972K54642g4782A83565K3884J33538F7622a00554b5996
$$ 33036 141351 139233 126261 380903 -74782 183565 207449 340987 67622 -100554 -25996
16266E87783b32190B33545J62284a40513A29264J04808H7987R7699b9360m849
$$ 587783 -232190 233545 395829 -140513 129264 234072 87987 185686 -29360 -34209
16256c4209B19795l5924J39816A30202a43736k2963A39604C6368A113c41419e8451
$$ -34209 219795 183871 323687 130202 -143736 -166699 139604 36368 1113 -341419 -58451
16244A89276R0452A37641m0659J3533J06295K2776M2730j01539b1873A99730L8909
$$ 189276 279728 137641 96982 110515 216810 239586 282316 180777 -21873 199730 238639
16233B38639c2481B09194j8489b36820I1410L50170B1540J04312j5438a76439
$$ 238639 -32481 209194 190705 -236820 91410 441580 21540 125852 110414 -176439
16222A27751b17113C30246I4638l3639g9111A40672P6897c06561I3136L60843
$$ 127751 -217113 330246 94638 60999 -79111 140672 217569 -306561 93136 453979
16212D53979k07935l9831r604G2364P66A261K34373q5681a6966d323B00945E6838
$$ 453979 246044 206213 196609 72364 73130 1261 235634 149953 -16966 -4323 200945 56838
16199B5078K85095D0784b05770g0954G100O6488f1906C2327a15688j70417a1579
$$ 25078 310173 40784 -205770 -70954 7100 73588 -61906 32327 -115688 -286105 -11579
16187B79261D1906M8404a13617d3743B12102h1819A63916R2250b68539e5812C5366
$$ 279261 41906 90310 -113617 -43743 212102 -81819 163916 256166 -268539 -55812 35366
16175a37822c3281C5465b11222A43150O1796L3286D3398J48636b44338B1291b35296
$$ -137822 -33281 35465 -211222 143150 204946 238232 43398 192034 -244338 21291 -235296
16163h1832B6138o466K64557c4468j38891B74793J6614e3420A15924h6304A92717
$$ -81832 26138 19672 284229 -34468 -173359 274793 291407 -53420 115924 -86304 192717
16151H313K52302P7643A51838p4525J10166a24697j5801A2098a7219B10782k0525
$$ 8313 260615 338258 151838 77313 187479 -124697 -140498 12098 -17219 210782 190257
16140A90257i0182J1057G0575N2699c0239j5735j12032b0974r8015A23661J00188
$$ 190257 -90182 -79125 70575 123274 -30239 -45974 -158006 -20974 -118989 123661 223849
16129B23849K14148A43940Q8276F922c3062d990F6317b41999F290d15210B0450
$$ 223849 437997 143940 232216 6922 -33062 -4990 66317 -241999 6290 -415210 20450
16117e5270o0924e6445o7628F181a63951j52834C44348A24917C0118b29980A41415
$$ -55270 -116194 -56445 -124073 6181 -163951 -316785 344348 124917 30118 -229980 141415
16105B28719j09413n170h5222A91245p4828J27499k9734C361a84243c2231k58481
$$ 228719 119306 114136 -85222 191245 116417 243916 214182 3361 -184243 -32231 -290712
16094b90712i1692E8410J03829J34890c1397o7559o8192g297A42049J88434j46062
$$ -290712 -91692 58410 162239 297129 -31397 -98956 -167148 -7297 142049 330483 184421
16083A84421A8847i5142I8125A0926J4757h5784k80215C56921a84698H3690b50037
$$ 184421 18847 -95142 98125 10926 25683 -85784 -365999 356921 -184698 83690 -250037
16071d0843m4825B58615g5969L6113D25142g6408q8449i128A41343C7355a07142
$$ -40843 -85668 258615 -75969 -39856 425142 -76408 -164857 -9128 141343 37355 -107142
16059a89584a1607n6585j61223M7545K622K2324r411E6406a21603D2029a70063
$$ -189584 -11607 -68192 -229415 -181870 -179248 -156924 -166335 56406 -121603 42029 -170063
16047H3555d7C0438b2532B26966a16242B1274b10218c2478m0951G6955J27528
$$ 83555 -47 30438 -22532 226966 -116242 21274 -210218 -32478 -73429 76955 204483
16036B04483a5196A63992b61722A4555a95648j29518J5404g0864l0638j91020
$$ 204483 -15196 163992 -261722 14555 -195648 -325166 -309762 -70864 -101502 -292522
16026b92522B86219a36437A7052K28841B2151a88025j2095g649A06899b12161
$$ -292522 286219 -136437 17052 245893 22151 -188025 -200120 -7649 106899 -212161
16015b5180C1891a09425r9182K6679e8473K6376j2908F9902K42104c4868H5227
$$ -25180 31891 -109425 -208607 -181928 -58473 -32097 -45005 69902 312006 -34868 85227
16003A07740d1170c178n1437I5921b25555c3081j26755P6349j5290A26197D2317
$$ 107740 -41170 -3178 -54615 95921 -225555 -33081 -159836 -83487 -98777 126197 42317
15991A74105E5772J87088c39445A26847B0359M09297B02056J80549j64104n5241
$$ 174105 55772 242860 -339445 126847 20359 429656 202056 382605 218501 163260
15981A63260J01108B0492g1329C30861b01609B1211M11436I2149a09596A46724
$$ 163260 264368 20492 -71329 330861 -201609 21211 432647 92149 -109596 146724
15970g3391j41967b3698D1813g8466k7112E8679b35737i9288j53162C15269A12153
$$ -73391 -215358 -23698 41813 -78466 -105578 58679 -235737 -99288 -252450 315269 112153
15958a27470A02413J25047c16827I274M8010P818b01841a1665o8106C21366G7036
$$ -127470 102413 227460 -316827 9274 57284 65102 -201841 -11665 -79771 321366 77036
15946c5352A05982a88903J9924k1014P2234N2281C8567A518a16822A14708b76467
$$ -35352 105982 -188903 -168979 -189993 -117759 -65478 38567 1518 -116822 114708 -276467
15934a03839A76136d0141A19938b59080b9213O59A38794L65660B23434N319A4488
$$ -103839 176136 -40141 119938 -259080 -29213 -28554 138794 504454 223434 228753 14488
15922a97935j47492I8041a28655o2489K4228o2700c860A39514i5893K1703c3560
$$ -197935 -345427 98041 -128655 -191144 -166916 -229616 -3860 139514 -95893 -74190 -33560
15910b6800j01951I9227b46232G3521J13278L1265K6579g9076g331H3308N2096
$$ -26800 -128751 99227 -246232 73521 186799 218064 244643 -79076 -7331 83308 135404
15899A35404a22943a3863j21562K0001j03962A14398J66748P1507b2255k28335
$$ 135404 -122943 -13863 -135425 -115424 -219386 114398 281146 352653 -22255 -250590
15889b50590a06480k4608c8194i530A32378h2318A08762b04539h5443c0126B12165
$$ -250590 -106480 -131088 -38194 -9530 132378 -82318 108762 -204539 -85443 -30126 212165
15877e2847M87k15489C021b16394D13252B6874n678b50888C4832K86716a48978
$$ -52847 -52360 -267849 3021 -216394 413252 26874 21196 -250888 34832 321548 -148978
15865F6251a96792g5218A35249A7357b1073j59891n9415N8113j31289P088J46817
$$ 66251 -196792 -75218 135249 17357 -21073 -180964 -240379 -182266 -313555 -306467 -159650
15854a59650C9581M475J79705a62923B16315r5218k2266r39D1843J9596a28330
$$ -159650 39581 44056 223761 -162923 216315 121097 98831 97892 41843 61439 -128330
15842B0066L4298g3024m8116j84783B51840f7443G0685e1155G2541b4401f872
$$ 20066 54364 -73024 -121140 -305923 251840 -67443 70685 -51155 72541 -24401 -6872
15830h3287A42485J4201b1347O454G248f3619n3126H0808K251b12038A36085i6555
$$ -83287 142485 156686 -21347 -14893 7248 -63619 -116745 80808 83059 -212038 136085 -96555
15817A82203b22953O4265g3972j22168I8119J35123m1005a16613j1620H074b53372
$$ 182203 -222953 -158688 -73972 -196140 98119 233242 192237 -116613 -128233 8074 -253372
15805a90275A05643D5491a07910A49348E0159J97951a41352A59426N1193G7624
$$ -190275 105643 45491 -107910 149348 50159 248110 -141352 159426 210619 77624
15794B66764b78225i8187C15982j38727a11366b4952m3597E0632L5745b41257
$$ 266764 -278225 -98187 315982 177255 -111366 -24952 -68549 50632 86377 -241257
15783d1535k6797m4234H9412J8539Q7280b34359p7740J42195q0055n8468G9349
$$ -41535 -68332 -112566 89412 107951 195231 -234359 -312099 -169904 -249959 -308427 79349
15771e77702a45178C18495B3155a81859H6961h8424C3166a77044A5116f8861D9072
$$ -577702 -145178 318495 23155 -181859 86961 -88424 33166 -177044 15116 -68861 49072
15759g0354A59639i8323D55387A85441m9104C5445Q9665a01201B28952n6797a53816
$$ -70354 159639 -98323 455387 185441 136337 35445 125110 -101201 228952 172155 -153816
15747D3976c362n77711E9909J15077A8645g1671J6779A64416F1436j149B4974
$$ 43976 -3362 -581073 59909 174986 18645 -71671 -54892 164416 61436 60287 24974
15735G8230j3550M5930d7526M415I2791a35473A31847J07038A00855J51993b34160
$$ 78230 64680 110610 -47526 -43111 92791 -135473 131847 238885 100855 252848 -234160
15723a26314A88314o4072J8594c8384B18519A9345K66499A05775D4851J13870
$$ -126314 188314 124242 142836 -38384 218519 19345 285844 105775 44851 158721
15713A58721d50301J17410M5271b8138E1392J20401b41186j54763O4436e1705
$$ 158721 -450301 -332891 -287620 -28138 51392 171793 -241186 -395949 -331513 -51705
15702D6165a40027k88856J93043g8859j56070a3017H928a60706G7073F408a5769
$$ 46165 -140027 -428883 -235840 -78859 -234929 -13017 8928 -160706 77073 6408 -15769
15690B04111a11015F0676b29383C7821J18537c69791d1637f131o0762l49997G8916
$$ 204111 -111015 60676 -229383 37821 156358 -369791 -41637 -6131 -66893 -416890 78916
15678a9432n2482j24628A69650p2596j3280N4950P0347r9276c5281A28640h8005
$$ -19432 -71914 -196542 169650 97054 83774 138724 209071 109795 -35281 128640 -88005
15666e3739A76096b54361E2490j0277e1762I6904b09812q2395a6081D2127M7559
$$ -53739 176096 -254361 52490 42213 -51762 96904 -209812 -292207 -16081 42127 89686
15655H9686a98922i3975L0029A01960a30003A27348c832C8815a8841l7427j00571
$$ 89686 -198922 -93975 -63946 101960 -130003 127348 -3832 38815 -18841 -56268 -156839
15644a56839j18491a17366e868A24645m3978K31545a9943E9520b7324r5312l3100
$$ -156839 -275330 -117366 -5868 124645 80667 312212 -19943 59520 -27324 -122636 -155736
15633a55736L187G9173a1288k43319b1265k8556j26948k1654A0194b05560A0836
$$ -155736 -152549 79173 -11288 -254607 -21265 -49821 -176769 -198423 10194 -205560 10836
15621g2700E9749b80821h7478C51348O4477f1108n4751C89270A63777e843I0303
$$ -72700 59749 -280821 -87478 351348 415825 -61108 -115859 389270 163777 -5843 90303
15609a87456h0713B04697A1002J17408b59811A32237C136a27629A48117B4567
$$ -187456 -80713 204697 11002 128410 -259811 132237 3136 -127629 148117 24567
15598i4181K5684A54893g3715B05972C9054a39971F874K16167K5751H0552b35403
$$ -94181 -68497 154893 -73715 205972 39054 -139971 6874 223041 248792 80552 -235403
15586C4249c450D8869b13421L9870A07189A8101b54604B65985F4945J0186O0582
$$ 34249 -3450 48869 -213421 -173551 107189 18101 -254604 265985 64945 75131 135713
15575A35713B7613a02847k8927C3804Q7080c03468a11631N4953B86725i976q6325
$$ 135713 27613 -102847 -131774 33804 120884 -303468 -111631 -56678 286725 -9976 -96301
15564i6301A9796L71554a05648I3514h1184n8055e1127j16075A47633a79278K1719
$$ -96301 19796 391350 -105648 93514 -81184 -139239 -51127 -167202 147633 -179278 -157559
15553a57559A38342e09228b50348A17575c13140a17057f679n24675A70827A3515
$$ -157559 138342 -509228 -250348 117575 -313140 -117057 -6679 -531354 170827 13515
15542a83681J6722C11596J34600g7928D02619H5728g2940C37814g3760D8334L8396
$$ -183681 -166959 311596 446196 -77928 402619 85728 -72940 337814 -73760 48334 86730
15531H6730J07223F202b08274A28963A4410O7980L1330C1982a7987k760A44068
$$ 86730 193953 6202 -208274 128963 14410 82390 113720 31982 -17987 -20747 144068
15519A30038c1713l09811h8755I6685h1162A02398j3622L14417A70223K4598b1843
$$ 130038 -31713 -341524 -88755 96685 -81162 102398 88776 403193 170223 194821 -21843
15507i6395A27915c70238a22119B1195J2375N6230d2121k92638D4246c42269a09967
$$ -96395 127915 -370238 -122119 21195 33570 89800 -42121 -334759 44246 -342269 -109967
15495B56214J6067b0508A03169e9219m5468J2067j80492B61446C4191b49846m1900
$$ 256214 272281 -20508 103169 -59219 -104687 -92620 -273112 261446 34191 -249846 -291746
15484b91746h5860B6443a23377D03156a63203A53896b23114I4863i5578k26233
$$ -291746 -85860 26443 -123377 403156 -163203 153896 -223114 94863 -95578 -321811
15474c21811J28861f2498p267a048A77435B2389j755J26148P4309R4917j32179
$$ -321811 -192950 -62498 -69765 -1048 177435 22389 20634 146782 221091 316008 183829
15463A83829L71804A98183H0537b41462G6335R2405d0405D4722c35931e4955k4505
$$ 183829 555633 198183 80537 -241462 76335 168740 -40405 44722 -335931 -54955 -79460
15452g9460B52270A02727a57995A13705d51507D5176b5145k61791c7054j63275
$$ -79460 252270 102727 -157995 113705 -451507 45176 -25145 -286936 -37054 -200329
15442b00329R4299C29161A31197b3162j2236B20128J21366A23632d9313n7550
$$ -200329 -106030 329161 131197 -23162 -35398 220128 341494 123632 -49313 -106863
15432a06863B8741a72256f3638C9036K12048h6836B8328K8827J39769A5989L70353
$$ -106863 28741 -172256 -63638 39036 251084 -86836 28328 57155 196924 15989 386342
15421C86342b71929A73360f9485J6720I5869O8534c5955l93625A34155F6165a59613
$$ 386342 -271929 173360 -69485 -52765 95869 164403 -35955 -429580 134155 66165 -159613
15409A46476a16873L8885E5784N646i9336j50079h5726A13100a01092B00809b71681
$$ 146476 -116873 -77988 55784 61430 -99336 -249415 -85726 113100 -101092 200809 -271681
15397i7581K913A00468k746a21153D3764d3128j85801a1395j42918B0932q468
$$ -97581 -94668 100468 97722 -121153 43764 -43128 -228929 -11395 -154313 20932 12464
15386A2464J8809a72266P0690L9669j5086B88880a5442k89901A3259N5707L2480
$$ 12464 31273 -172266 -101576 -61907 -76993 288880 -15442 -305343 13259 68966 101446
15375A01446f8845L4122D4518c7623A4552K8342J42203m4034o0335b69092Q8264
$$ 101446 -68845 -34723 44518 -37623 14552 42894 185097 141063 80728 -269092 -180828
15364a80828j13214P1882A22245b796F4856J71645A8733a30183A9498L1220b74204
$$ -180828 -294042 -222160 122245 -2796 64856 236501 18733 -130183 19498 50718 -274204
15352I5012P2882c1132o5633n5492B19206b63501h0501j08458l5409C95236j45616
$$ 95012 167894 -31132 -96765 -152257 219206 -263501 -80501 -188959 -224368 395236 249620
15341B49620A1515J32305g4384B0283J35807h9623j76572A89921a01726n5787
$$ 249620 11515 143820 -74384 20283 156090 -89623 -266195 189921 -101726 -157513
15331a57513N2675m3251C84008a3616B2248J02394E5945b54116A9339a18965A24610
$$ -157513 -104838 -148089 384008 -13616 22248 124642 55945 -254116 19339 -118965 124610
15319b0037C1988J51531C8610e5185C6219h1425j46062A64889L9777D4800J53358
$$ -20037 31988 183519 38610 -55185 36219 -81425 -227487 164889 204666 44800 198158
15308A98158d5471o9147G6734J01463a80062G1557e4364o6210H3689Q0172p3489
$$ 198158 -45471 -114618 76734 178197 -180062 71557 -54364 -120574 83689 163861 90372
15297I0372m0189d4033j76834A26512O5914r3657i6512D27526B0587K49982H179
$$ 90372 50183 -44033 -220867 126512 192426 98769 -96512 427526 20587 270569 8179
15285H9354b5432n6579G4216J03529d30893I260N7232a63557B60493J03528G3093
$$ 89354 -25432 -82011 74216 177745 -430893 9260 66492 -163557 260493 364021 73093
15273D33684F4032P5871F2042b0405k69326a19497B6075a6548p5340j37424A5647
$$ 433684 64032 139903 62042 -20405 -289731 -119497 26075 -16548 -91888 -229312 15647
15261D5116a81347B1888K95768a24712H1908J201e1468F0333L00468a04584B07006
$$ 45116 -181347 21888 317656 -124712 81908 83109 -51468 60333 360801 -104584 207006
15249E50576j29230J277703G91144L28597k8868D22128A28962e8777l2323A11797
$$ 550576 421346 1699049 791144 1119741 1090873 422128 128962 -58777 -91100 111797
15238a06157f637j17625G7699d1675r1710p4428A92225f9508A70820F3726J62852
$$ -106157 -6637 -124262 77699 -41675 -133385 -207813 192225 -69508 170820 63726 226578
15227B26578I5425J41118J12455b5559A26037h7760C56227j37647o7366J15952
$$ 226578 95425 236543 348998 -25559 126037 -87760 356227 218580 151214 267166
15217B67166j341b99964B12063r8312l4986a63861D0527R1921E0286M65321i5025
$$ 267166 265825 -299964 212063 113751 78765 -163861 40527 132448 50286 515607 -95025
15205h5255k28845D2213A2868f9664B85937B0480L07882i6040b6610A80433p8376
$$ -85255 -314100 42213 12868 -69664 285937 20480 328362 -96040 -26610 180433 102057
15194A02057K61213a11092A78274J38467j21905a09822A80921q5547J75718f4658
$$ 102057 363270 -111092 178274 316741 194836 -109822 180921 95374 271092 -64658
15183a5805j5911B35704a87532I8400K25550a57810C05891G4856J15673a34194
$$ -15805 -31716 235704 -187532 98400 323950 -157810 305891 74856 190529 -134194
15172C18895A07527N3267i5042A56762J89929j17350a38764A93217M2289H029
$$ 318895 107527 160794 -95042 156762 346691 229341 -138764 193217 235506 8029
15161A48146E769b8716B27611D9181j1194a57359A12796C1355K69195k1951b13853
$$ 148146 5769 -28716 227611 49181 37987 -157359 112796 31355 300550 278599 -213853
15149b15654B12451a34114I1891J19091H9452C9356J42453n2778R2016k0383H7114
$$ -215654 212451 -134114 91891 210982 89452 39356 181809 129031 221047 200664 87114
15137a36578D36907m388o7433K0395j06404A25886b63869A2799J29747l8037F599
$$ -136578 436907 432519 365086 385481 279077 125886 -263869 12799 142546 104509 6599
15125C0010J32105C6856J84650o3902E7074J07029K84767B17555K18092E128K26191
$$ 30010 162115 36856 221506 157604 57074 164103 448870 217555 435647 5128 231319
15114B31319b9460B11615j05159J83777L9130b21721A86759J03806I8342J85971
$$ 231319 -29460 211615 106456 290233 329363 -221721 186759 290565 98342 284313
15104B84313r156f3838A8584K47458K08009H011K54527n4671J89059b0551D4675
$$ 284313 275157 -63838 18584 266042 474051 8011 262538 207867 396926 -20551 44675
15092a54262A47745F9912B7419J70905p3101f3841A77746f7180E4644b12217D06262
$$ -154262 147745 69912 27419 198324 125223 -63841 177746 -67180 54644 -212217 406262
15080B6307P7314K7737k0229E1742K06945G0845M4920R2540D3653L05023F1719
$$ 26307 103621 131358 111129 51742 258687 70845 115765 208305 43653 348676 61719
15068A50722k8235M0652K01049H6858J7704J01039i3168B57232r7537M5427A9682
$$ 150722 122487 163139 364188 86858 104562 205601 -93168 257232 159695 205122 19682
15056D28638j04134A57897R9618j2882i0606d1661B9726J20026J41841C6608J36033
$$ 428638 324504 157897 257515 244633 -90606 -41661 29726 149752 291593 36608 172641
15045A72641E2478K2481K31807G8330P5043J74862o9091J41826A79129L74684
$$ 172641 52478 74959 306766 78330 153373 328235 259144 400970 179129 553813
15035E53813k40946l1582c1783C32051B7067J69630m2984K49433j90451n3851
$$ 553813 312867 281285 -31783 332051 27067 196697 153713 403146 212695 158844
15025A58844D1631K20835J4214A01423J35072q7492K60356e7025E0034M26887
$$ 158844 41631 262466 276680 101423 236495 149003 409359 -57025 50034 476921
15015D76921h671B25110a71031B97345A23062K20867p7019K30778j18081e9620
$$ 476921 -8671 225110 -171031 297345 123062 343929 266910 497688 379607 -59620
15004B12154r3914f8112B21459B0446L55534G8181M15925A91445N1863b4641C89620
$$ 212154 118240 -68112 221459 20446 375980 78181 494106 191445 243308 -24641 389620
14992B85093n9947N0381j16185N15643d6170j06392A35690M42406r1936B29234
$$ 285093 225146 275527 159342 674985 -46170 -152562 135690 578096 486160 229234
14981B47330l0138L4004b9315p1764I1617L43045j8965Q9447G9240a0735A25396
$$ 247330 217192 251196 -29315 -101079 91617 434662 415697 505144 79240 -10735 125396
14969C68334j10009F5280K98049I9816a8741D3060M3876A7847f0026A76755K42534
$$ 368334 258325 65280 363329 99816 -18741 43060 86936 17847 -60026 176755 419289
14958D19289I0783J75027r1947O9221L04334C3046K86887b7611j37605D77500
$$ 419289 90783 265810 173863 243084 547418 33046 319933 -27611 -165216 477500
14947B04903J42703O0549k7190A72131J67533A27075J57915M8249F90M63431j46475
$$ 204903 347606 408155 380965 172131 339664 127075 284990 333239 690 464121 317646
14936C17646L5906F3190K20236R0948j79610O1753p1256K10577G1482J46097J46624
$$ 317646 353552 63190 283426 374374 194764 256517 185261 395838 71482 217579 364203
14925C64203J98283J3437j31564B00466K7472m9588J3456L15335A10476K77461
$$ 364203 562486 575923 444359 200466 227938 178350 191806 507141 110476 387937
14915C87937A01180J84831J63262O330A59209L18189q7499Q9317K8945k38591
$$ 387937 101180 286011 449273 455603 159209 477398 389899 479216 508161 269570
14905B69570J6087L34361k04310J45997N5944k23740j46375K7511P5698j42886
$$ 269570 285657 620018 415708 561705 617649 393909 247534 275045 350743 207857
14895B07857M23156A94956N6717n9055O6296K19228j54868K37450j85803J4065
$$ 207857 631013 194956 251673 192618 258914 478142 323274 560724 374921 388986
14885C88986P7176j48051O3756F5580K59115P9369A81877J92756J89833J30110
$$ 388986 466162 318111 381867 65580 324695 404064 181877 374633 564466 694576
14875F94576C43982a6087F44043A45332M04601B67313J88093A82845M2205K75342
$$ 694576 343982 -16087 644043 145332 549933 267313 455406 182845 225050 500392
14865E00392p5393J9131j55760K17051R3635A35990J63771C0478L57417M3O4701
$$ 500392 424999 444130 288370 505421 599056 135990 299761 30478 387895 387938 452639
14854D52639j08837J30757k713j15312K81130A85171K62592p8676K1721J05379
$$ 452639 343802 474559 471846 356534 637664 185171 447763 369087 390808 496187
14844D96187k43880J61647J67229q9515j23929l180M910n6317J11323p1842L83754
$$ 496187 252307 413954 581183 491668 367739 364559 369469 313152 424475 352633 736387
14833G36387k71339B18179K78337r7001Q4095o4513m107L88802l15710O4808j57376
$$ 736387 465048 218179 496516 399515 483610 419097 414990 803792 488082 552890 395514
14822C95514M22716B09471K02289J23620o2987r443L69970k72390j49957N4217
$$ 395514 818230 209471 411760 535380 472393 462950 832920 560530 410573 464790
14812D64790k25699L41168J01743k78948O6445J644k1675r0267M78299k23337
$$ 464790 239091 580259 682002 403054 469499 471143 449468 359201 837500 614163
14802F14163q3170J64070j41849k11025K17371K75482l41144j71173L26590k38741
$$ 614163 530993 695063 553214 342189 559560 835042 493898 322725 649315 410574
14792D10574A66017L38382o0280j35279K94165J9372r3766L00180k45347K32104
$$ 410574 166017 504399 444119 308840 603005 622377 528611 828791 583444 815548
14782H15548k34770k9786l0136O6178Q5240R8034l73891J35777J14624k98968
$$ 815548 580778 550992 520856 587034 672274 770308 396417 532194 646818 347850
14772C47850J93858J85244P4472l06436J91774o8918k89215N66811k30669r7565
$$ 347850 541708 726952 801424 494988 686762 617844 328629 895440 664771 567206
14762E67206J69107P567l39889M43298j97098J19300j38220K88110l28618L59245
$$ 567206 736313 743880 403991 847289 650191 769491 631271 919381 590763 950008
14752I50008k59163K04020m7272o0373k81057N7972K79306j74325j0251P6900
$$ 950008 690845 894865 847593 787220 506163 564135 843441 669116 658865 735765
14742G35765j88526J82256m874j31792L28350l43454J02442J89946l15660p1564
$$ 735765 547239 729495 724621 592829 921179 577725 680167 870113 554453 482889
14732D82889M49052k76080N27582D98296K5873j23065M62951J15043l81228J94178
$$ 482889 931941 655861 1183443 498296 524169 401104 864055 979098 597870 792048
14722G92048L7634q2028M0252J28661l77986J5747P87433n79093k80319L22483
$$ 792048 829682 747654 787906 916567 538581 554328 1341761 762668 482349 804832
14712H04832K32064l42393L12761l74340K85576l51223L63207m0743m2895j19191
$$ 804832 1036896 694503 1007264 632924 918500 567277 930484 889741 846846 727655
14702G27655L42423K0877n27735L03868J27999J58287j65243J48244j04943l32711
$$ 727655 1070078 1090955 563220 867088 995087 1153374 988131 1136375 1031432 698721
14692F98721J05240k9680Q4576j66162J49880L84915n01172P6628J28357K97469
$$ 698721 803961 774281 858857 692695 842575 1227490 726318 802946 931303 1228772
14682A228772N841n25529K30617K9874n4160R2874K65593n31875M15306j30210
$$ 1228772 1234613 709084 939701 969575 915415 1008289 1273882 742007 1157313 1027103
14672A027103J24637j45421K33782j27246K77891m14855j56155O25452m14650
$$ 1027103 1151740 1006319 1240101 1112855 1390746 975891 819736 1445188 1030538
14663A030538J78952J72069n03601M35274k43166Q0767l92303L73641O1843K96038
$$ 1030538 1209490 1381559 877958 1313232 1070066 1150833 758530 1132171 1194014 1490052
14653A490052m56056J75421k73952K18061K41444l05737K42731k2029n4921M1012
$$ 1490052 1033996 1209417 935465 1153526 1394970 1089233 1331964 1309935 1255014 1296026
14643A296026K31095p21387N59462j8621k37580N96584n03957K15922o88j42341
$$ 1296026 1527121 805734 1365196 1346575 1108995 1705579 1201622 1417544 1416856 1274515
14633A274515J2834K51606k65022m5973K85940n0198J95126n1969j28812J8742
$$ 1274515 1287349 1538955 1273933 1227960 1513900 1463702 1658828 1606859 1478047 1496789
14623A496789p4335j83806L88622J31564m02641L6165J3113N22521m31222j9347
$$ 1496789 1422454 1238648 1627270 1758834 1356193 1392358 1405471 1927992 1496770 1477423
14613A477423R9588l54930P9640K61923J24599K2737N4925k38100J92573N5174
$$ 1477423 1577011 1222081 1301721 1563644 1688243 1710980 1765905 1527805 1720378 1775552
14603A775552l15189J88449L27119l42058J22122L66283m64497j78687K64065
$$ 1775552 1460363 1648812 1975931 1633873 1755995 2122278 1657781 1479094 1743159
14594A743159J89444l50431L07875k8262K8960J26629J13226k78552Q2805J91057
$$ 1743159 1932603 1582172 1890047 1861785 1890745 2017374 2130600 1852048 1934853 2125910
14584B125910p7444j94585L02596n35769K66860J86703O5221K65188o16261N14831
$$ 2125910 2048466 1853881 2156477 1620708 1887568 2074271 2139492 2404680 1788419 2303250
14574B303250p2540l3374n5748O8032K1752M02168j82656P1441r0069K58647K56724
$$ 2303250 2230710 2197336 2141588 2209620 2231372 2633540 2450884 2522325 2432256 2690903 2947627
14563B947627k71089K16701R307m58101O35350J09325J62643j35743K34180J50387
$$ 2947627 2676538 2893239 2902546 2444445 3079795 3189120 3351763 3216020 3450200 3600587
14553C600587K90467Q53152N16119J153043J447293L891506Q245893K0813456
$$ 3600587 3891054 4744206 5260325 6413368 7860661 11752167 19998060 40811516
14545D0811516R231904B0769673G848587l542440j445786l87531k38393J2171
$$ 40811516 50043420 20769673 7848587 4306147 2860361 2472830 2234437 2246608
14537B246608J90668r6412J35742R2109m12029J639K98545p0278l1555L3338M05550
$$ 2246608 2437276 2340864 2476606 2568715 2156686 2158325 2456870 2386592 2355037 2388375 2793925
14526B793925m85384k24646L82211k61429O19399k98571L15818n18735L00673
$$ 2793925 2308541 2083895 2466106 2204677 2824076 2525505 2841323 2322588 2623261
14517B623261K16683R233q6213K06500k26108L84471l41754J35967K9140K59703
$$ 2623261 2839944 2849177 2762964 2969464 2743356 3127827 2786073 2922040 2951180 3210883
14507C210883p7943k39161P5121r0804L76224K43174j82717n6161K80165J29961
$$ 3210883 3132940 2893779 2968900 2878096 3254320 3497494 3314777 3258616 3538781 3668742
14497C668742k1503k94939K16532J4915j58278M5519O3214J6484K30091M16566
$$ 3668742 3647239 3352300 3568832 3583747 3425469 3470988 3534202 3550686 3780777 4197343
14487D197343j87758k02130k81992J72896m4435L65236K1811r3133K73256k65120
$$ 4197343 4009585 3807455 3525463 3698359 3653924 4019160 4040971 3947838 4221094 3955974
14477C955974K26173J02559K20180l09590J31074O7868M5983K60513r0974O4333
$$ 3955974 4182147 4284706 4504886 4195296 4326370 4394238 4440221 4700734 4609760 4674093
14467D674093J54831l36414J93495L3211J90665Q2433J66956l09276L59404J56317
$$ 4674093 4828924 4492510 4686005 4719216 4909881 4992314 5159270 4849994 5209398 5365715
14457E365715M7857K633j23902L79146J57598m77710K70241K33047m34026K72902
$$ 5365715 5413572 5416205 5292303 5671449 5829047 5351337 5621578 5854625 5420599 5693501
14447E693501N8723M07296q2290K79365m411k02211Q0613N93997l88417K46666
$$ 5693501 5752224 6159520 6077230 6356595 6352184 6149973 6230586 6824583 6436166 6682832
14437F682832m787j89474M05571o3504L04212p8259P6357M09338m6408K92451
$$ 6682832 6678045 6488571 6894142 6830638 7134850 7056591 7132948 7542286 7495878 7788329
14427G788329q0608k15833J69192L80463k2876R3739J77032J05340p4899L12891
$$ 7788329 7707721 7491888 7661080 8041543 8018667 8112406 8289438 8394778 8319879 8632770
14417H632770J55003N2144N8270L57654j47352K47238K26803p3771O62360l74191
$$ 8632770 8787773 8839917 8898187 9255841 9108489 9355727 9582530 9508759 10171119 9796928
14407I796928M42056O5002L20751K40753j48053L04331L17581k63860N35775J21577
$$ 9796928 10238984 10303986 10624737 10865490 10717437 11021768 11339349 11075489 11611264 11732841
14397A1732841l92419N20291M57672K28733J8048L61148j00150O10910Q8858j8523
$$ 11732841 11340422 11860713 12318385 12547118 12565166 12926314 12826164 13437074 13525932 13507409
14387A3507409L64616M12415L13585K06719K16817L15336M86209Q0770K56105
$$ 13507409 13872025 14284440 14598025 14804744 15021561 15336897 15823106 15903876 16159981
14378A6159981L45249J63575N22220J15434M11643K39238L16441M84904N61321
$$ 16159981 16505230 16668805 17191025 17306459 17718102 17957340 18273781 18758685 19320006
14369A9320006J57983R58950Q6002P1398Q07598O99265R5260N94601J87023O78733
$$ 19320006 19477989 20436939 20522941 20594339 21401937 22101202 22196462 22791063 22978086 23656819
14359B3656819O05960N07709K74046R25432N90595L79140P36268N53000R25477
$$ 23656819 24262779 24770488 25044534 25969966 26560561 26939701 27675969 28228969 29154446
14350B9154446R53605M22379P86612Q50532R01905N80107J316034J080445L72162
$$ 29154446 30108051 30530430 31317042 32167574 33069479 33649586 34965620 36046065 36418227
14341C6418227J420360N74535J189960J198179J154705J020785J492529J355731
$$ 36418227 37838587 38413122 39603082 40801261 41955966 42976751 44469280 45825011
14333D5825011J169046J494248J438413J326301J969309J441805J880470K087551
$$ 45825011 46994057 48488305 49926718 51253019 53222328 54664133 56544603 58632154
14325E8632154J471842K172859K427182J831971K569518K229581K518606K964682
$$ 58632154 60103996 62276855 64704037 66536008 69105526 71335107 73853713 76818395
14317G6818395L033244K359770L466820L022807L512729L928748L950536L763182
$$ 76818395 79851639 82211409 85678229 88701036 92213765 96142513 100093049 103856231
14309A03856231M219134M387285M574936N114918N306792N995951N464846O364183
$$ 103856231 108075365 112462650 117037586 122152504 127459296 133455247 138920093 145284276
14301A45284276O344822P244596P056105P929379Q157854Q554414R691392R448045
$$ 145284276 151629098 158873694 165929799 173859178 182017032 190571446 200262838 209710883
14293B09710883R877522J0715595J1064573J1640917J2328250J2575034J2909258
$$ 209710883 219588405 230304000 241368573 253009490 265337740 277912774 290822032
14286B90822032J4298711J3958099J4097086J4958323J4585321J4627657J4636383
$$ 290822032 305120743 319078842 333175928 348134251 362719572 377347229 391983612
14279C91983612J4123620J3601570J2771200J1895281J0264620Q637469O573309
$$ 391983612 406107232 419708802 432480002 444375283 454639903 463277372 469850681
14272D69850681K995235P57388L98385q03881n170880n783245q000176j0117588
$$ 469850681 472845916 473603304 474001689 473197808 468026928 462243683 454243507 444125919
14264D44125919j1472870j3120571j4290400j5223417j5209249j6169728j5544146
$$ 444125919 432653049 419532478 405242078 390018661 374809412 358639684 343095538
14257C43095538j6323317j5340839j4017962j4459948j3742249j3449385j2601009
$$ 343095538 326772221 311431382 297413420 282953472 269211223 255761838 243160829
14250B43160829j2052161j1347289j0827623j0647546r458616r057487p758355
$$ 243160829 231108668 219761379 208933756 198286210 188827594 179770107 172011752
14243A72011752q255843p489402p708646o705985o232919n558643n413808n696628
$$ 172011752 163755909 156266507 148557861 141851876 135618957 130060314 124646506 118949878
14235A18949878m937014m721126m812373m337413l001644l984683l732608l438211
$$ 118949878 114012864 109291738 104479365 100141952 97140308 93155625 89423017 85984806
14227H5984806l608401l089944k859561k463563l052802k371587k228917j951353
$$ 85984806 82376405 79286461 76426900 73963337 70910535 68538948 66310031 64358678
14219F4358678k213407k002637k325197j993534j617056j327736j249536j729425
$$ 64358678 62145271 60142634 57817437 55823903 54206847 52879111 51629575 49900150
14211D9900150j487676j934674j064899j495254k89868p70979j969364j482834
$$ 49900150 48412474 46477800 45412901 43917647 43627779 42856800 40887436 39404602
14203C9404602j191829q48342p97738p02520j063823j013610q33319q77967r43032
$$ 39404602 38212773 37364431 36566693 35864173 34800350 33786740 32953421 32075454 31132422
14194C1132422o23303m52218j174680n28060p38093r03765n04730o51428l99633
$$ 31132422 30509119 30056901 28882221 28354161 27616068 26712303 26207573 25556145 25156512
14185B5156512o24176r59099j65724l79291l20934o05397o09332l81999r6532
$$ 25156512 24532336 23573237 23407513 23028222 22707288 22101891 21492559 21110560 21014028
14176B1014028q14865m10583j79971p08837m06594j85157k52574l69058l55895
$$ 21014028 20199163 19788580 19608609 18899772 18493178 18308021 18055447 17686389 17330494
14167A7330494q6558n18130q451m88054j30496n22068j4167o20785p9486n34557
$$ 17330494 17243936 16725806 16717355 16229301 16098805 15576737 15562570 14941785 14862299 14327742
14157A4327742n8523n8820l93584L1746n76544m69033j91144J74053n37948K59356
$$ 14327742 14269219 14210399 13816815 13848561 13272017 12802984 12611840 12785893 12247945 12507301
14147A2507301l97765j32719k96246m3621k64446P2637p99337m696J72394l81652
$$ 12507301 12109536 11976817 11680571 11636950 11372504 11445141 10645804 10641108 10813502 10431850
14137A0431850k46611P3830j49923q9120j74112o00569K88553j36906j58180j31891
$$ 10431850 10185239 10259069 10109146 10020026 9845914 9245345 9533898 9396992 9238812 9106921
14127I106921k16871k18220J31856j72110K47344n10702O9007k71886l02054J3308
$$ 9106921 8890050 8671830 8803686 8631576 8878920 8368218 8437225 8165339 7863285 7876593
14117G876593J63715l83700M5422J84192l49101j37800m2232k15518l30782p065
$$ 7876593 8040308 7656608 7702030 7886222 7537121 7399321 7357089 7141571 6810789 6803724
14107F803724J72200k81796l1292r0335M03456p50819L94179m24645M67681n37870
$$ 6803724 6975924 6694128 6662836 6572501 6975957 6225138 6619317 6194672 6662353 6124483
14097F124483o0172l7339j67202N4098J10788l58373J49345j48970j72673K32712
$$ 6124483 6064311 6026972 5859770 5913868 6024656 5666283 5815628 5666658 5493985 5726697
14087E726697k35408J34476m96023j11357J46410k76857L60533j4160r9253k6140
$$ 5726697 5491289 5625765 5129742 5018385 5164795 4887938 5248471 5234311 5135058 5108918
14077E108918j70413K06988j37115l6961m78010L25316j30507K05664o38977J54286
$$ 5108918 4938505 5145493 5008378 4971417 4493407 4818723 4688216 4893880 4254903 4409189
14067D409189k40808J13053J81545l02836k41966N89952j80845l90501K88063
$$ 4409189 4168381 4281434 4462979 4160143 3918177 4508129 4327284 3936783 4224846
14058D224846k29524R1791O2537q6656r4290J21600j78245j59085r329K97526
$$ 4224846 3995322 4087113 4149650 4062994 3968704 4090304 3912059 3752974 3743645 4041171
14048D041171l77314K9024n6322n8963m3157l2013J79149m9628o9846j70295j77763
$$ 4041171 3663857 3692881 3636559 3577596 3534439 3502426 3681575 3631947 3562101 3391806 3214043
14037C214043o2059J58218j14618j02331K95170p0401N7528o4061Q8166j06725
$$ 3214043 3151984 3310202 3195584 3093253 3388423 3318022 3375550 3311489 3399655 3292930
14027C292930j29408l2133k54643M07987m81909Q530l3178K69499m16603L4954
$$ 3292930 3163522 3131389 2876746 3284733 2802824 2811354 2778176 3047675 2631072 2666026
14017B666026O0197L68785m15476j07666o8615J8020J55048r2130k07887J10011
$$ 2666026 2726223 3095008 2679532 2571866 2503251 2521271 2676319 2584189 2376302 2486313
14007B486313j08105j26574L04891j57223J86231j12538Q3926J0438l54773K10214
$$ 2486313 2378208 2251634 2556525 2399302 2585533 2472995 2556921 2567359 2212586 2422800
13997B422800P1256L1812j06274j13074K06150J63277l97410O02114J078268K442284
$$ 2422800 2494056 2525868 2419594 2306520 2512670 2675947 2278537 2880651 3958919 6401203
13987F401203O844930J8957582J9009422k5559677A2465350m207766k411166p45912
$$ 6401203 13246133 32203715 51213137 25653460 12465350 8257584 5846418 5100506
13979E100506l81945j350549K63836k09832p8978k80003j07461m34641L74514
$$ 5100506 4718561 3368012 3631848 3422016 3343038 3063035 2955574 2520933 2895447
13970B895447j90391J07957l14678R8753k89338L76290n27938N70894m77241l47982
$$ 2895447 2705056 2813013 2498335 2597088 2307750 2684040 2156102 2726996 2249755 1901773
13960A901773K81093n4559K5471K18391k87120N9452r2884J8321j18313r9262
$$ 1901773 2182866 2128307 2153778 2372169 2085049 2144501 2051617 2069938 1951625 1852363
13950A852363K05719l23176J37008J73703R6348l22954Q9262j26448n662K37518
$$ 1852363 2058082 1734906 1871914 2045617 2141965 1819011 1908273 1781825 1776163 2013681
13940B013681k7661N1210j45755J49919j64240r4661K66779R49m05295j28380
$$ 2013681 1986020 2037230 1891475 2041394 1877154 1782493 2049272 2050221 1644926 1516546
13930A516546K09353m1634j80278O31516k19830n54273R0249N0115J01556q9211
$$ 1516546 1725899 1684265 1503987 2135503 1915673 1361400 1451649 1501764 1603320 1514109
13920A514109O4094O4624J44577k89463R9174M19011r0725n22797J83863K8327
$$ 1514109 1578203 1642827 1787404 1497941 1597115 2016126 1925401 1402604 1586467 1614794
13910A614794j00363P2446o6124J26574l03834J91145l44773j9935M25628k15023
$$ 1614794 1514431 1586877 1520753 1647327 1343493 1534638 1189865 1169930 1595558 1380535
13900A380535N0375p6157J02794K11727m52574J88672q6177m2487L98857l96701
$$ 1380535 1430910 1354753 1457547 1669274 1216700 1405372 1319195 1276708 1675565 1278864
13890A278864R360J3802K57565J30136l70612K8547J7529k32762J13230j84775
$$ 1278864 1288224 1302026 1559591 1689727 1319115 1347662 1365191 1132429 1245659 1060884
13880A060884r3915L84006m0035o5039K61041m15432L22715l70818N16188m86531
$$ 1060884 966969 1350975 1310940 1245901 1506942 1091510 1414225 1043407 1559595 1073064
13870A073064K34278L8707k29413k77903K83663j5811j66172K45717J12312O915
$$ 1073064 1307342 1346049 1116636 838733 1122396 1106585 940413 1186130 1298442 1305357
13860A305357k58233J77221k40929L55620l30577L55082l41986L28062j06124
$$ 1305357 1047124 1224345 983416 1339036 1008459 1363541 1021555 1349617 1243493
13851A243493q4967K82955l83063N8128M9037j16821O164M3927D35708N19989
$$ 1243493 1158526 1441481 1058418 1116546 1165583 1048762 1054926 1098853 435708 955697
13841I55697K14615j22607J5728L8764k20819K98006k88144L68753n83521M23175
$$ 955697 1170312 1047705 1063433 1102197 881378 1179384 891240 1259993 676472 1099647
13831A099647j30076k75131j9710L50698K64728j98808j96631n3636J98598j65955
$$ 1099647 969571 694440 674730 1025428 1290156 1091348 894717 841081 1039679 873724
13821H73724K34126m76056K54405K79528l66902L38219k53617J38182k30440q0424
$$ 873724 1107850 631794 886199 1165727 798825 1137044 883427 1021609 791169 710745
13811G10745L89887k22779J50198l61556K43578k34241J5353J75831O4424n5808
$$ 710745 1100632 877853 1028051 666495 910073 675832 691185 867016 931440 875632
13801H75632Q0586o9124p7074j51324L56586j41172R2586j04023m8351k74991
$$ 875632 956218 887094 810020 658696 1015282 874110 966696 862673 814322 539331
13791E39331j93696P11636j12133j93960r8120L31533k20444L5276O1661l91240
$$ 539331 345635 1057271 945138 751178 653058 984591 764147 799423 861084 469844
13781D69844L39009r7389J3309p0268J97356J8931j06955K07090k95873K02779
$$ 469844 808853 711464 724773 654505 851861 870792 763837 970927 675054 877833
13771H77833l0960j89945J20223j38312L04639j91982p1686O2229Q2627O6447
$$ 877833 846873 656928 777151 638839 943478 751496 679810 742039 824666 891113
13761H91113m3129j2114j01028l24197K20221K67188D08767L28664J73632k4060
$$ 891113 847984 835870 734842 410645 630866 898054 408767 737431 911063 887003
13751H87003j80602k4141q6242j99872K92700l9685J79941J75375m86526L1957
$$ 887003 706401 682260 596018 396146 688846 649161 829102 1004477 517951 549908
13741E49908J61445C25788r4146M53621j13864K84465K16883C48148N46662j40802
$$ 549908 711353 325788 231642 685263 571399 855864 1072747 348148 894810 754008
13731G54008k46064j3064L38457k33543M62050m56357J9733p0151p9257m2319
$$ 754008 507944 494880 833337 599794 1061844 605487 625220 555069 475812 433493
13721D33493J87905j55860J67292L3487N5633K03943k92858P7926l578n8261k79355
$$ 433493 621398 465538 632830 666317 721950 925893 633035 710961 707383 649122 369767
13710C69767J18513Q3181j21910l5781J74015J31568k70372l0873L1573J68535
$$ 369767 488280 571461 449551 413770 587785 719353 448981 418108 449681 618216
13700F18216r2577M8691J21267j46834M853k12811K00715B66416M50955j84123
$$ 618216 525639 574330 695597 548763 553616 340805 541520 266416 717371 533248
13690E33248L41928l71765J8802J95153j2351K2524M1148l44578Q2581P8344k39389
$$ 533248 875176 503411 522213 717366 705015 727539 768687 424109 506690 585034 345645
13679C45645R8662k07580P33627C48182P9108m4789K72080k79651K11656J27064
$$ 345645 444307 236727 970354 348182 427290 382501 654581 374930 586586 713650
13669G13650j66689K23289k63916J2709B57707j14597N26537B86062j08372J58888
$$ 713650 546961 770250 506334 519043 257707 143110 669647 286062 177690 336578
13659C36578o982N15368l10331H5749N37110B64868K9347r2923M09342j63565
$$ 336578 329596 844964 534633 85749 622859 264868 294215 201292 610634 447069
13649D47069j97842K85958A49038L02574j92733R1260R2754m7127Q1114K59971
$$ 447069 249227 535185 149038 451612 258879 350139 442893 395766 476880 736851
13639G36851l792A52102K63268q5291j07108J46661j40332K07247j93240J65213
$$ 736851 733059 152102 415370 330079 222971 369632 229300 436547 243307 408520
13629D08520o4109A58667K62236Q3426K7495k07842J07097K72B11663J54326J05457
$$ 408520 344411 158667 420903 504329 531824 323982 431079 431351 211663 365989 471446
13618D71446J2160q3951q0638q7001J72323K43842R0785C65591j5968A46284J30738
$$ 471446 483606 399655 319017 232016 404339 648181 738966 365591 349623 146284 277022
13607B77022L5964K93259n9900J30406l16978J40909L30247A94012J14519K04901
$$ 277022 312986 606245 546345 676751 359773 500682 830929 194012 308531 513432
13597E13432q2325j79411R3688K96124B17529P363c6517E85359j05743A78022
$$ 513432 431107 251696 345384 641508 217529 224892 -36517 585359 479616 178022
13586B04582L8142K48914l7693B20156L19462B69216n4681K5434K7425p5663K00735
$$ 204582 242724 491638 453945 220156 539618 269216 214535 239969 267394 191731 392466
13575C92466K67722l26743J00265B01832N13478B16279J17494K2047p824J45352
$$ 392466 660188 333445 433710 201832 715310 216279 333773 355820 347996 493348
13565D93348B20591J03457R9493A26567L01907m5632J40619B47428O2865k5753
$$ 493348 220591 324048 423541 126567 428474 382842 523461 247428 310293 284540
13555B84540N8734j55553R6700K3220P4135j88161J87653j09436F3538N99664
$$ 284540 343274 187721 284421 307641 381776 193615 381268 271832 63538 663202
13545F63202F9441K68759G9594K01242E4719J3363Q9888K10349j06331J60662
$$ 663202 69441 338200 79594 280836 54719 68082 157970 368319 261988 422650
13535D22650C860K71945J79456L4267A39590K06767Q2099m8280o1735J16755r6624
$$ 422650 3860 275805 455261 489528 139590 346357 428456 380176 318441 435196 338572
13524C38572j41202L44112B38028n8399k6316J43539J16836A79769K34264A66003
$$ 338572 197370 541482 238028 179629 153313 296852 413688 179769 414033 166003
13513B29563b8883A70485K73134A54304N5346M51806l04761J36910k07650R1865
$$ 229563 -28883 170485 443619 154304 209650 661456 356695 493605 285955 377820
13503C77820j28173K6717L20522A53438K21971k6112p1301L938P4673J28213m0635
$$ 377820 249647 276364 596886 153438 375409 349297 277996 281934 356607 484820 444185
13492D44185A86745J92052j18595e898D23761j39009J54180R9878A54791K30913
$$ 444185 186745 378797 260202 -5898 423761 284752 438932 538810 154791 385704
13482C85704j12898r2091K46243A38466P9225P807K55520A95228J70287j35200
$$ 385704 272806 180715 426958 138466 217691 225498 481018 195228 365515 230315
13472B30315j13664L20374A73728J64140A44818K13697A3732K96491J89190j30185
$$ 230315 116651 437025 173728 337868 144818 358515 13732 310223 499413 369228
13462C69228f2164B35278b3603D34859A15633a8010B6115M48850K7287H6803K4204
$$ 369228 -62164 235278 -23603 434859 115633 -18010 26115 474965 502252 86803 111007
13451A11007K30171r1933M23338a02670a0670A22196L22297l7849j14735j39155
$$ 111007 341178 249245 672583 -102670 -10670 122196 444493 406644 291909 152754
13441A52754J66278J62864H1043a4915C97610j55062e3486D66787k2011j70213
$$ 152754 319032 481896 81043 -14915 397610 242548 -53486 466787 444776 274563
13431B74563r4667H5538L38697L8353j48507J5402J51776A02894K10733K8817
$$ 274563 179896 85538 424235 462588 314081 329483 481259 102894 313627 342444
13421C42444j23138K08128j60486H0432P3076C0989L91937J13641A19888J12013
$$ 342444 219306 427434 266948 80432 153508 30989 422926 536567 119888 231901
13411B31901J70754I9665J35481k0608J9427H1478K25757K53150H8168J79986
$$ 231901 402655 99665 235146 214538 233965 81478 307235 560385 88168 268154
13401B68154J6953p5718J28782p6492N2710r9886Q7441P101F8248L06688j75066
$$ 268154 285107 209389 338171 261679 314389 214503 301944 309045 68248 374936 199870
13390A99870r9279j3949J17875N2361G6001J80877F44M05424e046C29336c7906
$$ 199870 100591 86642 204517 256878 76001 256878 644 406068 -5046 329336 -37906
13378C99102E1282J89376J81903P6067B2105K24214j01376K28501K06207j33037
$$ 399102 51282 240658 422561 498628 22105 246319 144943 373444 579651 446614
13368D46614E1595J65419a21259C03112j36789L12595o0083A78182p5225J80880
$$ 446614 51595 217014 -121259 303112 166323 478918 418835 178182 102957 283837
13358B83837m7247j02103p447n4482L05257j33597o2565D5291M06439A68999M3952
$$ 283837 236590 134487 127040 72558 377815 244218 181653 45291 451730 168999 212951
13347B12951l229J18279j06708M03935G2411e4048F42758B29067K8488o8857M7103
$$ 212951 209722 328001 221293 625228 72411 -54048 642758 229067 257555 188698 235801
13336B35801b6195D20017d7200A97987e0786E4102N00284j96007A48802l9763
$$ 235801 -26195 420017 -47200 197987 -50786 54102 554386 358379 148802 109039
13326A09039M75106A79082J98261A81027K7502R7432l1660M0541M8669A64105
$$ 109039 584145 179082 377343 181027 208529 305961 274301 314842 363511 164105
13315A23644P2975E1599J72573p3573o8196M0505D5704b12696g5520B23214L0522
$$ 123644 196619 51599 224172 150599 82403 122908 45704 -212696 -75520 223214 253736
13304B53736k5768e0477B74855k476I4963M5247Q9623F8985P9643i9201A55297
$$ 253736 227968 -50477 274855 272379 94963 140210 229833 68985 148628 -99201 155297
13292h8748D48026f4723B57587A19564j8524R4654D8256e7274B99776D1923Q6239
$$ -88748 448026 -64723 257587 119564 101040 195694 48256 -57274 299776 41923 128162
13281A28162C4949a30603H4329J99659A3136f736A89817G7473d5211A47097a0754
$$ 128162 34949 -130603 84329 283988 13136 -6736 189817 77473 -45211 147097 -10754
13269A19107a9104B20795J67485J1704A25045q914L23038A67509a31362A51236
$$ 119107 -19104 220795 388280 399984 125045 116131 439169 167509 -131362 151236
13258A99242F1477Q7674p1768J61580o4423H5183j3375R8791R6514r6921K63714
$$ 199242 61477 149151 77383 238963 174540 85183 71808 170599 267113 170192 433906
13247D33906l6039A59139n9284a4061A27417e1376A84999F6651f3047J2744G6857
$$ 433906 397867 159139 99855 -14061 127417 -51376 184999 66651 -63047 -50303 76857
13235A16438E0408g3853c5957B48026b02027Q8735a0996C42634j63735m3338J45726
$$ 116438 50408 -73853 -35957 248026 -202027 -113292 -10996 342634 178899 135561 281287
13224B81287D4516j4047J5655N4174m1486J00844M546K3997L3509B6877N07263
$$ 281287 44516 30469 46124 100298 58812 159656 164202 188199 221708 26877 534140
13213E34140a09979A7388J69431n4088h4008A7384K00175C2079b27164H9270N2423
$$ 534140 -109979 17388 186819 132731 -84008 17384 217559 32079 -227164 89270 141693
13202A41693c618j3861B65775b469j24197a2220G6578L502J27064a08933C49768
$$ 141693 -3618 -17479 265775 -2469 -126666 -12220 76578 80080 207144 -108933 349768
13190I438L22288A11476a22840A59082g7613C25360j995A2917J95374H5980g766
$$ 9438 331726 111476 -122840 159082 -77613 325360 323365 12917 208291 85980 -7766
13178F3094K35637M6805J16486f1987B30275b05945B8454J16120O5683J00591
$$ 63094 298731 345536 462022 -61987 230275 -205945 28454 144574 210257 310848
13168C10848e3284l673A68597Q7277K8360L05572d6497A62714C5892Q2173K1776
$$ 310848 -53284 -56957 168597 255874 284234 589806 -46497 162714 35892 118065 139841
13157A39841Q5039n3314a6356H1956J83972a26174B06585H8478B518K40368p8984
$$ 139841 224880 171566 -16356 81956 265928 -126174 206585 88478 2518 242886 163902
13146A63902J70022j55160R2509h0491J3280o6994A94343a29175F01921A71151
$$ 163902 333924 178764 271273 -80491 -67211 -134205 194343 -129175 601921 171151
13135A74538a00564D01953j94561k4131n4475J83630a15743B01338o0439L72651
$$ 174538 -100564 401953 207392 183261 128786 312416 -115743 201338 140899 513550
13125E13550d6914a7707l3686D38512A18253a02909C00580D0858g8150A99586
$$ 513550 -46914 -17707 -51393 438512 118253 -102909 300580 40858 -78150 199586
13114A16399a16145L0615L1522A35616g2245A75513m477o9416c2426H6123D0057
$$ 116399 -116145 -85530 -54008 135616 -72245 175513 171036 101620 -32426 86123 40057
13102A36135R0874c39288b2770D4436a39116c3228e769A37928a1388D34309I8528
$$ 136135 227009 -339288 -22770 44436 -139116 -33228 -5769 137928 -11388 434309 98528
13090b36225E09150k36731A03761J2905L7164J81266B9671a27668O3698n8321
$$ -236225 509150 272419 103761 116666 153830 335096 29671 -127668 -63970 -122291
13080a22291A83783J78814A74050d6331n1044M2796D2771J53835H777K83170i3337
$$ -122291 183783 362597 174050 -46331 -97375 -54579 42771 196606 8777 291947 -93337
13068A11Q9532K54389q9094A25267a34335a4620B52988p2951J55076j12322G026
$$ 111 89643 344032 254938 125267 -134335 -14620 252988 180037 335113 222791 7026
13056A48301a90473A56210C3634J73870Q7957C5910J22909b24395J01115C22907
$$ 148301 -190473 156210 33634 207504 295461 35910 158819 -224395 -123280 322907
13045A62262A5838L45416H5380J23437J93231A18663a19534F5583a64286H179
$$ 162262 15838 361254 85380 208817 402048 118663 -119534 65583 -164286 8179
13034H7218K97497e3135A93087l7531Q441A3551J25750f8841j7871B81261o0356
$$ 87218 384715 -53135 193087 155556 163997 13551 139301 -68841 -86712 281261 220905
13023B20905C5525K56118a84863G556K80397p8319n7787b4833m8499K019C26577
$$ 220905 35525 291643 -184863 7556 287953 209634 151847 -24833 -73332 -71313 326577
13011a52678d6374A11161J03053M4908p2627R769i1184k8955e2997O261B92161
$$ -152678 -46374 111161 214214 259122 186495 196264 -91184 -120139 -52997 -46736 292161
12999a20409A23942b21882I7932b06490q4216B37926j18889d51710b6488A46611
$$ -120409 123942 -221882 97932 -206490 -290706 237926 119037 -451710 -26488 146611
12988A85860a59479g1599A40398J72070o8969A07855c2706j1707D9671c9453A9123
$$ 185860 -159479 -71599 140398 312468 243499 107855 -32706 -44413 49671 -39453 19123
12976a5064j00696B62268F0555K83520B045i9335B28315K39505a67928P8402k27684
$$ -15064 -115760 262268 60555 344075 2045 -99335 228315 467820 -167928 -89526 -317210
12965c17210J17222b3268D2212j5049e2214j65872H8267K79906B1217a63045j16997
$$ -317210 -199988 -23268 42212 27163 -52214 -218086 88267 368173 21217 -163045 -280042
12954b80042b7188B78195B9465J57820K5946J37662A06769g8282A72485o8010
$$ -280042 -27188 278195 29465 187285 213231 350893 106769 -78282 172485 104475
12944A04475a28640B70049j5539l5799a4650g034q9009l3222j96120A69168j8438
$$ 104475 -128640 270049 254510 218711 -14650 -7034 -96043 -129265 -325385 169168 150730
12933A50730G2211a21984I5200b4216k09782c9992A7837a20623A49922o2487J7153
$$ 150730 72211 -121984 95200 -24216 -233998 -39992 17837 -120623 149922 87435 104588
12922A04588m0069K3430K3100n4301a62400m6759A73281J3849a40535L5324A33119
$$ 104588 64519 87949 111049 56748 -162400 -209159 173281 187130 -140535 -105211 133119
12910A62627n6483J13292a96609I5203b12761B74081H3811a69678C32795E5355
$$ 162627 106144 219436 -196609 95203 -212761 274081 83811 -169678 332795 55355
12899A55675K24060A0111O8303k8276j6800N9539Q243K54340r6723e7395C62086
$$ 155675 379735 10111 78414 50138 33338 92877 101120 355460 258737 -57395 362086
12887a16489j23914J10136B10178e625D14379A50113Q8414b07796K8814h286F3028
$$ -116489 -240403 -130267 210178 -5625 414379 150113 238527 -207796 -178982 -8286 63028
12875D8562b55229A0622O13a57185c2676k351D8219K67663j54573J69081I0951
$$ 48562 -255229 10622 11235 -157185 -32676 -35027 48219 315882 161309 330390 90951
12863g9149l16522B04477a43256B12280a13691j37151H8371G614c17462I0851
$$ -79149 -395671 204477 -143256 212280 -113691 -250842 88371 7614 -317462 90851
12852E9849f7252K5958j21402c408B07324C5946L68079b01054f1587A19662m4180
$$ 59849 -67252 -41294 -162696 -3408 207324 35946 404025 -201054 -61587 119662 75482
12841G5482J44601c16596a16856j61332J16933M8948J0931J8893E0667Q3450e5311
$$ 75482 220083 -316596 -116856 -278188 -161255 -112307 -101376 -82483 50667 134117 -55311
12829A17610c9127l76326D6607J0019a08008d8345j36311A53333K13695b4224
$$ 117610 -39127 -415453 46607 56626 -108008 -48345 -184656 153333 367028 -24224
12818a21107A1862a46829d552B26289d7686k17763A56059D4586a10343C94577
$$ -121107 11862 -146829 -4552 226289 -47686 -265449 156059 44586 -110343 394577
12807G8501K19125a27080e9138A56350k183a20649A78648d3645H6582m2245L1097
$$ 78501 297626 -127080 -59138 156350 154167 -120649 178648 -43645 86582 44337 75434
12796G5434L25887a35503A99286K1419G42J48999b70862R1195C92268H2577i5266
$$ 75434 401321 -135503 199286 220705 742 149741 -270862 -179667 392268 82577 -95266
12784f3261M916a4331E0473e4513H0691B0013e1592k56902m7502a18954L2577
$$ -63261 -58345 -14331 50473 -54513 80691 20013 -51592 -308494 -355996 -118954 -86377
12773h6377B79972H759J17053c2938j63681E8530j3631L91624I3978J16261a25844
$$ -86377 279972 8759 125812 -32938 -196619 58530 44899 436523 93978 210239 -125844
12761a27090B03005q1892J05203b40395g4980A56562Q7811E2176b0705l5501A51956
$$ -127090 203005 121113 226316 -240395 -74980 156562 244373 52176 -20705 -56206 151956
12749D3158a66259B0307a72865A9438c49093a1708j44406M8068A20236C8618b82172
$$ 43158 -166259 20307 -172865 19438 -349093 -11708 -156114 -108046 120236 38618 -282172
12737e821k34974B15272p8367P3306a23771H0606b42646A48155e9515j49530A03637
$$ -5821 -240795 215272 136905 210211 -123771 80606 -242646 148155 -59515 -209045 103637
12725A85301L3265b50683H1727d8573k08885F7529a94455A24461J26129g7891
$$ 185301 218566 -250683 81727 -48573 -257458 67529 -194455 124461 250590 -77891
12714D6594a5317B43373Q4575b466B12666a18270F7309R5814L6592h4105b8325
$$ 46594 -15317 243373 327948 -2466 212666 -118270 67309 163123 199715 -84105 -28325
12702C39233a92150D43061A40221b08285j12271B55196c9623A06533e5848k7216
$$ 339233 -192150 443061 140221 -208285 -320556 255196 -39623 106533 -55848 -83064
12692h3064m4367c5364B84098a58530B9387b24783B65635a99219b0161B11684
$$ -83064 -127431 -35364 284098 -158530 29387 -224783 265635 -199219 -20161 211684
12681A89418K3646H4695a7736k02128A49501b2076B62014J05339c1208A40272
$$ 189418 213064 84695 -17736 -219864 149501 -22076 262014 367353 -31208 140272
12670I0695d6133a3425F6147N7646a34464C12753H5236a54024C97290h7935B3275
$$ 90695 -46133 -13425 66147 123793 -134464 312753 85236 -154024 397290 -87935 23275
12658a67205A20048C6634a19328C00059p0140q6221O8644c3684A27339b4137A50846
$$ -167205 120048 36634 -119328 300059 229919 143698 212342 -33684 127339 -24137 150846
12646A94040N820J41659A27491h9721L2003A78901B4183i5435A08652k9035d6435
$$ 194040 199860 341519 127491 -89721 -57718 178901 24183 -95435 108652 79617 -46435
12634B00148f2800l4172B12305J08226I1049R1704o3063K49396p3787j45599a88811
$$ 200148 -62800 -96972 212305 320531 91049 182753 119690 369086 295299 149700 -188811
12622D04790A87747G6515M23974B6615J58596a00742q4167C8934J01081i6036
$$ 404790 187747 76515 500489 26615 185211 -100742 -184909 38934 140015 -96036
12611B6792K92557D4213a31089A28984K42552a04895B95947h1707c2971A01132
$$ 26792 319349 44213 -131089 128984 371536 -104895 295947 -81707 -32971 101132
12600D61037B14123R7073A03697J8430K11920A23881M7199J54254A54753k9728
$$ 461037 214123 311196 103697 122127 334047 123881 171080 325334 154753 125025
12590A25025f7202A05978B0685J33398D2274J40148c2605j45197A53904k5959
$$ 125025 -67202 105978 20685 154083 42274 182422 -32605 -177802 153904 127945
12580A27945K5156l9339n0152f9606B02325c36847B34296a45486D5515b10330
$$ 127945 153101 113762 63610 -69606 202325 -336847 234296 -145486 45515 -210330
12569c5726j13874A82692L6972c7874C36158a59304B9104P9076J44368A19672
$$ -35726 -149600 182692 219664 -37874 336158 -159304 29104 108180 252548 119672
12558A05106K02621j09789b29544D1815j9178b23575a00385b3340p5515J6258
$$ 105106 307727 197938 -229544 41815 22637 -223575 -100385 -23340 -98855 -82597
12548h2597k32586A53246F8439o789g4355B6841f2616C3294J29180i6701A0338
$$ -82597 -315183 153246 68439 61650 -74355 26841 -62616 33294 162474 -96701 10338
12536C90109A37281j9744c31396i2611k04008A33435m8775K71585A38996f8928
$$ 390109 137281 117537 -331396 -92611 -296619 133435 84660 356245 138996 -68928
12525B51233a25508A68583b12964d4255B25516r2549b23725a09473j18924m7199
$$ 251233 -125508 168583 -212964 -44255 225516 132967 -223725 -109473 -228397 -275596
12515b75596f74l6995m4827A01674g5514p9684B22341A02377a32044A01274a48132
$$ -275596 -674 -37669 -82496 101674 -75514 -155198 222341 102377 -132044 101274 -148132
12503C6015a22928A25815D629f6101A48753a9045F6476M1956N0186a7961A29690
$$ 36015 -122928 125815 4629 -66101 148753 -19045 66476 108432 158618 -17961 129690
12491C4160b01523L4638m1174A74498b84199M8817d4504k03777g8141j20761G7060
$$ 34160 -201523 -166885 -208059 174498 -284199 -235382 -44504 -248281 -78141 -198902 77060
12479b04658e29H5214a13966K6659g99A09806c5873B6609b45207A17726j5859
$$ -204658 -529 85214 -113966 -87307 -799 109806 -35873 26609 -245207 117726 101867
12468A01867m7767b46711j5966a09340A95192a5193j53724C35362G1812f2504
$$ 101867 54100 -246711 -262677 -109340 195192 -15193 -168917 335362 71812 -62504
12457a99417b3596k04434a6144I6407e3265A04561a80210F2161b11771A67157
$$ -199417 -23596 -228030 -16144 96407 -53265 104561 -180210 62161 -211771 167157
12446A70817M4524J39567E6320f7719J4122B18885c0893k93759B0315h7762P059
$$ 170817 215341 354908 56320 -67719 -53597 218885 -30893 -324652 20315 -87762 -80703
12435h0703B8738d78354a08303B96136c1203L643B92120D548a10055C29329I6731
$$ -80703 28738 -478354 -108303 296136 -31203 -27560 292120 4548 -110055 329329 96731
12423A30891O9254a28304A01119P0487A8830K14403M483C0113M5540a05521C01651
$$ 130891 200145 -128304 101119 171606 18830 233233 237716 30113 75653 -105521 301651
12411f1102H4840a00860M3045k3539k36951A67775a16071C12486J67498A17971
$$ -61102 84840 -100860 -57815 -81354 -318305 167775 -116071 312486 479984 117971
12400a80267l5652A64041b1235A21718e1410P324O147J5720n089j20350A47591
$$ -180267 -215919 164041 -21235 121718 -51410 -44086 -37939 -22219 -27308 -147658 147591
12388A6101c63862a66026c6289E231J56043b58355A24767E9613b11579h1660k72974
$$ 16101 -363862 -166026 -36289 5231 161274 -258355 124767 59613 -211579 -81660 -354634
12377c54634a0638k61067F3410a65551f1696B88214f2147j42741f8251D47294
$$ -354634 -10638 -271705 63410 -165551 -61696 288214 -62147 -204888 -68251 447294
12366C2689R292R773a54660J0662A36897i1485q801B15394c18367C4002A040a89339
$$ 32689 41981 51754 -154660 -143998 136897 -91485 -100286 215394 -318367 34002 1040 -189339
12353B3185R2388P9261h4282K6552A70633o5411a10046J8727H334h0504b8523
$$ 23185 115573 194834 -84282 -57730 170633 105222 -110046 -91319 8334 -80504 -28523
12341A0049Q0639b204l07363b3704A68617C033J51146h1497C07356d5602E9402
$$ 10049 90688 -2204 -309567 -23704 168617 3033 154179 -81497 307356 -45602 59402
12329h655B48246A23658a30359K7872b9711A59678D2249a54410A50702d3576A18304
$$ -8655 248246 123658 -130359 -102487 -29711 159678 42249 -154410 150702 -43576 118304
12317I3546a57788D3119h88A06552B5751Q6233a29146A7095a74808H7858J46065
$$ 93546 -157788 43119 -888 106552 25751 111984 -129146 17095 -174808 87858 233923
12306B33923E0136a21687A98433P1056j7080a36866A49655D6914a35501A60888
$$ 233923 50136 -121687 198433 269489 252409 -136866 149655 46914 -135501 160888
12295A4132Q3707J70124K3817j07182a52268e1228C30299d8231A10560m2954a80807
$$ 14132 97839 267963 291780 184598 -152268 -51228 330299 -48231 110560 67606 -180807
12283A61867H460J73529L8727K51452K8754B12448m5890N1626J97262D4405J03144
$$ 161867 8460 181989 220716 472168 500922 212448 166558 218184 415446 44405 147549
12272A47549J95675j67624C6754e6521A44802e2769j81398A64547N4585P8948
$$ 147549 343224 175600 36754 -56521 144802 -52769 -234167 164547 219132 298080
12262B98080o9457C4585a9128A85505I830K19233g9224m0933B06650a17844F5926
$$ 298080 228623 34585 -19128 185505 9830 229063 -79224 -120157 206650 -117844 65926
12250A48454D7716J21870b67912h3450e076A18116e5730B5968m247b47011C3646
$$ 148454 47716 169586 -267912 -83450 -5076 118116 -55730 25968 21721 -247011 33646
12238A71004q431l9815n0863J78613c7420A80692F2938R3212l9737f923C22914
$$ 171004 162573 122758 71895 250508 -37420 180692 62938 156150 116413 -6923 322914
12226F09832E9783K58995E659c2484B9935M29363q0386j50323N0672A37606d4598
$$ 609832 59783 318778 5659 -32484 29935 459298 378912 228589 279261 137606 -44598
12214C99228j42800G6979Q8700O3326I2797j627C6232K54422h5324C2875K21637
$$ 399228 256428 76979 165679 229005 92797 91170 36232 290654 -85324 32875 254512
12203B54512r1200k9704a83108C47358m4606j0228m0919j00399b1958A04362K20518
$$ 254512 163312 133608 -183108 347358 302752 292524 251605 151206 -21958 104362 324880
12192C24880g852k8647A78992J0395R1375A29206b55686h876C78207A08587g6429
$$ 324880 -7852 -36499 178992 189387 280762 129206 -255686 -8876 378207 108587 -76429
12180B43033A21341f5552C03993K7536D7825K4767K81536g0527B89702A40757
$$ 243033 121341 -65552 303993 331529 47825 72592 354128 -70527 289702 140757
12169A42654J33708Q8842A60568J95864I6787m1880L9867a22829A07975J17889
$$ 142654 276362 365204 160568 356432 96787 54907 94774 -122829 107975 225864
12159B25864J17254R0298F2486J19068c4180d473A79330L4889g0771A47629d8522
$$ 225864 343118 433416 62486 181554 -34180 -4473 179330 214219 -70771 147629 -48522
12147e6052A31546a30505A80129J55213a67543L1035j87454A30039J9868a17610
$$ -56052 131546 -130505 180129 335342 -167543 -136508 -323962 130039 149907 -117610
12136A36788A299i6362A18436a323H0627k1983J59023f3266R615j1138A72379
$$ 136788 1299 -96362 118436 -1323 80627 58644 217667 -63266 -53651 -64789 172379
12124D16279p6572I6657K21608a03960e282A17414A9030K19816G7592J01079G0137
$$ 416279 339707 96657 318265 -103960 -5282 117414 19030 238846 77592 178671 70137
12112D90968C9646a69222G1790b6437m1271J1568k30522Q7466I6834e7534A74689
$$ 490968 39646 -169222 71790 -26437 -67708 -56140 -286662 -199196 96834 -57534 174689
12100e55741C8898b40440E6258i3540q3036q2043F6216f799p1015B2356N5105
$$ -555741 38898 -240440 56258 -93540 -176576 -258619 66216 -6799 -77814 22356 77461
12089G7461i6318j94433J41861C21551A13266b3741A76655b7311A24149K1476
$$ 77461 -96318 -290751 -148890 321551 113266 -23741 176655 -27311 124149 145625
12079A45625g3087L0411j93311A08943E4447J78304q765K15633P74889K75312
$$ 145625 -73087 -42676 -235987 108943 54447 232751 223986 439619 1214508 1489820
12069A489820C40122b19804h3755l32841C10893d458k06277C11083m5287c8913
$$ 1489820 340122 -219804 -83755 -416596 310893 -4458 -210735 311083 265796 -38913
12058A29023c9230o7607B61874g6063D75349c1290o2422H543J84084b09976A17332
$$ 129023 -39230 -106837 261874 -76063 475349 -31290 -93712 8543 192627 -209976 117332
12046d7825n4270I7458f0773A19188b50151g5838A38064b12459f2313B0957b7217
$$ -47825 -102095 97458 -60773 119188 -250151 -75838 138064 -212459 -62313 20957 -27217
12034a2977o0213o3338O2453B41816a44533A49414a65988a9977F4971h3851q2637
$$ -12977 -73190 -136528 -74075 241816 -144533 149414 -165988 -19977 64971 -83851 -166488
12023a66488r3626h9733l7834A2745a25093b7603E8558c0963D98989A20169f3797
$$ -166488 -260114 -89733 -127567 12745 -125093 -27603 58558 -30963 498989 120169 -63797
12011b25771r9780J30296Q5289C7086d5996k0849E9806b39090d8293B24554c28025
$$ -225771 -325551 -195255 -109966 37086 -45996 -66845 59806 -239090 -48293 224554 -328025
11999b1988B47039D9861a69934g5210F1074h2586F249P7089a21388A21532D3581
$$ -21988 247039 49861 -169934 -75210 61074 -82586 6249 83338 -121388 121532 43581
11987E0662l595e0414B13392a19287B60393d43649D10790A25211e4109k20564
$$ 50662 47067 -50414 213392 -119287 260393 -443649 410790 125211 -54109 -274673
11977b74673J35163e4937A20379L0710a84967p1261A23440C8069d0770j53271
$$ -274673 -139510 -54937 120379 151089 -184967 -256228 123440 38069 -40770 -194041
11967a94041O7484m586b2522m5975A69089a95382l3035A60391J10608k6323B2925
$$ -194041 -126557 -131143 -22522 -68497 169089 -195382 -228417 160391 270999 244676 22925
11955d26042F0810K27556a27450I9368a901B33828H9625N1493J15370F1365b13780
$$ -426042 60810 288366 -127450 99368 -1901 233828 89625 141118 256488 61365 -213780
11943B3601K17524a77488m4876N6513K0276B1388K75561G5290B0079R2653J96070
$$ 23601 241125 -177488 -222364 -165851 -145575 21388 296949 75290 20079 112732 308802
11932C08802j44448F729e4091a2585B11817G3206J71086H1696c86461g0338k42790
$$ 308802 164354 6729 -54091 -12585 211817 73206 244292 81696 -386461 -70338 -313128
11921c13128a34155D3654P4524a07103r013I4615d6567k83497a38851O0218B8229
$$ -313128 -134155 43654 118178 -107103 -116116 94615 -46567 -330064 -138851 -78633 28229
11909h4261q6946A10594b02612A36545A5871K66016b1502r5208a2481J95A09272
$$ -84261 -171207 110594 -202612 136545 15871 281887 -21502 -116710 -12481 -12286 109272
11897G1746a42313C22526b09244A7761M1873b50887B07249a23144I2864c18191
$$ 71746 -142313 322526 -209244 17761 59634 -250887 207249 -123144 92864 -318191
11886c0513j3637A62021b26854D7181a45028b5803E2283p875c92236e3893j49948
$$ -30513 -44150 162021 -226854 47181 -145028 -25803 52283 44408 -392236 -53893 -203841
11875b03841A05612l7103J75780a10980A30846h8712l9747j32714k1689A93801
$$ -203841 105612 68509 244289 -110980 130846 -88712 -128459 -261173 -282862 193801
11864b40183A10907b69024N3534B26475G5154b3928A60862C111h8763A56190E8569
$$ -240183 110907 -269024 -215490 226475 75154 -23928 160862 3111 -88763 156190 58569
11852i2323p476A43300C1287J26528d7907A44683b68430A01768f6377H6987R0704
$$ -92323 -99799 143300 31287 157815 -47907 144683 -268430 101768 -66377 86987 177691
11841A77691d50972f6428o4105k0681j07538F1466a0664l07415a35793M1928D7123
$$ 177691 -450972 -66428 -130533 -151214 -258752 61466 -10664 -318079 -135793 -93865 47123
11829d12207A44369J14260b18325A09484J0477J13682f1828o1192b3177B12121
$$ -412207 144369 258629 -218325 109484 119961 233643 -61828 -123020 -23177 212121
11818a79216I5166a46972H753a7608F3618k4202c15521F2405k7020J65888f6166
$$ -179216 95166 -146972 8753 -17608 63618 39416 -315521 62405 35385 201273 -66166
11806B39651B5849c05353B69866a74735O2196j74184a4285A23907a21881A4879
$$ 239651 25849 -305353 269866 -174735 -112539 -286723 -14285 123907 -121881 14879
11795A34475m5184k3047a41609A9961N9298J1809P6626g0396F1728A9560a43850
$$ 134475 89291 66244 -141609 19961 79259 91068 167694 -70396 61728 19560 -143850
11783c30378f514j20663j07872h061B03691G643g9645j35500C4918b26223G6750
$$ -330378 -6514 -127177 -235049 -8061 203691 7643 -79645 -215145 34918 -226223 76750
11771B1143J75936d53H0193a0611c211F3394b50714B21119b12047i8450B27605
$$ 21143 197079 -453 80193 -10611 -3211 63394 -250714 221119 -212047 -98450 227605
11759A27290j4574P620b58016L7741H9670M6496h3930c9786k02786g9001j8469
$$ 127290 112716 120336 -258016 -220275 89670 136166 -83930 -39786 -242572 -79001 -97470
11748i7470A20574a3444D13129A78787a94856A40545R6765g0820o492a9135P22
$$ -97470 120574 -13444 413129 178787 -194856 140545 237310 -70820 -77312 -19135 -18413
11737a8413q1987J1289j61359A28621K45354j39593e1837K1401B37227a8267k95345
$$ -18413 -100400 -89111 -250470 128621 373975 234382 -51837 -30436 237227 -18267 -313612
11726c13612A07997g4338A11615k9209H434N8875c0676k6053E7936j145J49744
$$ -313612 107997 -74338 111615 82406 8434 67309 -30676 -56729 57936 56791 206535
11715B06535f5778I0675C1257d3932j09121O8175J7423K1517j1064E2938R9587
$$ 206535 -65778 90675 31257 -43932 -153053 -84878 -67455 -45938 -57002 52938 152525
11704A52525i2423K2364A85695N0108O7232f1545D0417K6199J06909a96110A93575
$$ 152525 -92423 -70059 185695 235803 303035 -61545 40417 66616 173525 -196110 193575
11692d16579c2724B14924a02817F8605N9402m5277O3762m8950e2612A22579a25570
$$ -416579 -32724 214924 -102817 68605 128007 82730 146492 97542 -52612 122579 -125570
11680A73488P5439J01464a69876B96404b18501D256M36492k9496b6126G0922J5132
$$ 173488 248927 350391 -169876 296404 -218501 4256 440748 411252 -26126 70922 86054
11669H6054a07294B84652q6776g8388B38512a92617l7231c8220A4674J61927j8284
$$ 86054 -107294 284652 197876 -78388 238512 -192617 -229848 -38220 14674 176601 158317
11658A58317D2227a32747B03077c55712C4030J30069p4222g2795m5472A01431
$$ 158317 42227 -132747 203077 -355712 34030 164099 89877 -72795 -118267 101431
11647a80022B98103c6914j11682E1155a52526j29231A47445o4600L002c16198
$$ -180022 298103 -36914 -148596 51155 -152526 -281757 147445 82845 85847 -316198
11636A70111J12221A17102q946C3395c65938A07316J52555a91817B0371K36923
$$ 170111 282332 117102 108156 33395 -365938 107316 259871 -191817 20371 257294
11626B57294C7682O9680c1891m7340A85111K5384f1790b040j66125c1627j32224
$$ 257294 37682 107362 -31891 -79231 185111 210495 -61790 -2040 -168165 -31627 -163851
11615a63851A77382b08565a02445B60315a51686O9239k11450i8262k36074g6035
$$ -163851 177382 -208565 -102445 260315 -151686 -82447 -293897 -98262 -334336 -76035
11604c0239p8981b0342p2431M0611A21646c08326A63030c0708B709L12412a08588
$$ -30239 -109220 -20342 -92773 -52162 121646 -308326 163030 -30708 2709 315121 -108588
11592a2949A02821J8394Q7187A2853R2393d3127C89642A74806L23001p8516H8340
$$ -12949 102821 121215 208402 12853 105246 -43127 389642 174806 497807 419291 88340
11580a05038c2352C83136A33599n1077B3271J82480G5220j5346O9823a74406A70127
$$ -105038 -32352 383136 133599 82522 23271 205751 75220 59874 129697 -174406 170127
11568A45562K6168J11014A37102b56157b1982r1211A08002j3507a31534J3500
$$ 145562 171730 282744 137102 -256157 -21982 -113193 108002 94495 -131534 -118034
11558a18034h813n8671A3182J76958m6066o2154K3310m9626d68087a27634C4682
$$ -118034 -8813 -67484 13182 190140 144074 81920 105230 55604 -468087 -127634 34682
11546B75660C6087D577i844A46097j1050A6842K71303a28682I621d1727A54958
$$ 275660 36087 4577 -9844 146097 135047 16842 288145 -128682 9621 -41727 154958
11534a9051B88575f9181j76062A08640C0712a00167r9872A75244i3830j309l0432
$$ -19051 288575 -69181 -245243 108640 30712 -100167 -200039 175244 -93830 -95139 -125571
11523a25571C76846f8429B61676h1159B93225H2682B4765J11821n3222c16435
$$ -125571 376846 -68429 261676 -81159 293225 82682 24765 136586 83364 -316435
11512C48997a41603O7252I9946J6009R9127J63718B5382M7414a92572A16090J3788
$$ 348997 -141603 -74351 99946 115955 215082 378800 25382 72796 -192572 116090 129878
11501A29878b02269n607m6249B08283L106i3410B05275e6058B47840o172R3511
$$ 129878 -202269 -207876 -254125 208283 211389 -93410 205275 -56058 247840 241668 335179
11490C35179j44355R1817p3592J09952l6295q8048a58250C50585k7827k8936j08758
$$ 335179 190824 282641 209049 319001 282706 194658 -158250 350585 322758 293822 185064
11479A85064P5825H9791D1686M29370B01377b8890B94408j18867k4012o7543J00016
$$ 185064 260889 89791 41686 471056 201377 -28890 294408 175541 151529 83986 184002
11468A84002M8063H7557R2j0765j1911k8925K93830A07304K94421P3222j82073
$$ 184002 232065 87557 87649 76884 64973 36048 329878 107304 401725 474947 292874
11457B92874e0205j47883B0417a21908A61510E0050J36944f746j08261A4006K11750
$$ 292874 -50205 -198088 20417 -121908 161510 50050 186994 -6746 -115007 14006 225756
11446B25756b6641I9320d14225I3159L34074d9757B39986i0011A26004K28904
$$ 225756 -26641 99320 -414225 93159 427233 -49757 239986 -90011 126004 354908
11436C54908j17717j08358o0073j8419h0058A49251E2818B0105i5744m8665M5484
$$ 354908 237191 128833 68760 50341 -80058 149251 52818 20105 -95744 -144409 -98925
11425i8925D9825d231j33713l680e9283j96208A45628a70593A00540b95615D9610
$$ -98925 49825 -4231 -137944 -141624 -59283 -255491 145628 -170593 100540 -295615 49610
11413G6700b27101A67958b0295C38045L7368D9354L27835a23358q2432B83256
$$ 76700 -227101 167958 -20295 338045 375413 49354 377189 -123358 -205790 283256
11402B8536M52126a18260B1278h3961A97705b16852i3379e861l01896B61674a01274
$$ 28536 480662 -118260 21278 -83961 197705 -216852 -93379 -5861 -307757 261674 -101274
11390D3534d2772H5511a28810j52236b6707G0337N5384K68768a34009B242a69518
$$ 43534 -42772 85511 -128810 -281046 -26707 70337 125721 394489 -134009 2242 -169518
11378a2896j73092C56352a15456H5553J2490n459J01386G1490b08989B11165D0093
$$ -12896 -185988 356352 -115456 85553 98043 92584 193970 71490 -208989 211165 40093
11366a16250D0907a34163k6744r1466e7534F3430A4397d4080A09342a66551j51249
$$ -116250 40907 -134163 -160907 -252373 -57534 63430 14397 -44080 109342 -166551 -317800
11355c17800B92770a75873o7423F0265B1190J77552I1048P6243G6050J32378a35037
$$ -317800 292770 -175873 -243296 60265 21190 198742 91048 167291 76050 208428 -135037
11343B63489f6099A83164L3435b94902J16755A94882R5868e8156C17022a58947
$$ 263489 -66099 183164 216599 -294902 -178147 194882 290750 -58156 317022 -158947
11332d9281j92820J00231a6101B21552m1808c8166I9061J53418a68548r1244D2057
$$ -49281 -242101 -141870 -16101 221552 179744 -38166 99061 252479 -168548 -259792 42057
11320C30588J23513a82940M1821A57142a17971D487K31135a23214A60490R2149
$$ 330588 454101 -182940 -141119 157142 -117971 4487 235622 -123214 160490 252639
11310B52639g5676l4452A82764a59692C8011J56878b08793R2445K0703E6423c47473
$$ 252639 -75676 -110128 182764 -159692 38011 194889 -208793 -116348 -95645 56423 -347473
11298a44324A32365m2806J31051h1341j11242J6280A00000d681H5737d66020A90759
$$ -144324 132365 89559 220610 -81341 -192583 -176303 100000 -4681 85737 -466020 190759
11286F7209d199D2608f5473j08885A38175m7959F869a47120p338k18521a23391
$$ 67209 -4199 42608 -65473 -174358 138175 90216 6869 -147120 -154458 -372979 -123391
11274f2465l4164E9544K23823H0321J174C6853a2768A88330C4768J78396b17511
$$ -62465 -96629 59544 283367 80321 81495 36853 -12768 188330 34768 213164 -217511
11262a59269D588O8798a04932E2982b36169A35329d21946E8814k8794L4510a57116
$$ -159269 4588 73386 -104932 52982 -236169 135329 -421946 58814 30020 64530 -157116
11250A40879c33144d0116j67836N4666N6137d6411J9658P262j20653d5135Q41
$$ 140879 -333144 -40116 -207952 -153286 -97149 -46411 -26753 -19491 -140144 -45135 -44294
11239d4294M473k2152j41205A11459Q661J31938G2592i5050A12331N2060c2733
$$ -44294 -39821 -61973 -203178 111459 120120 252058 72592 -95050 112331 164391 -32733
11227c21098a6578l8836B71102g1842I0386c0309o0909G935a5215I256e6868J1326
$$ -321098 -16578 -55414 271102 -71842 90386 -30309 -91218 7935 -15215 9256 -56868 -45542
11215d5542l17371J22570A35439a55995j58893A18074c55041l4340A49605k8765
$$ -45542 -362913 -240343 135439 -155995 -314888 118074 -355041 -389381 149605 120840
11205A20840c00486O7424l6287l63271A37718B4402h5442l4406A60714a46056
$$ 120840 -300486 -233062 -269349 -632620 137718 24402 -85442 -119848 160714 -146056
11194b89992A24546J9392a70657A47787c4282a0032I8000a68632F6602J70491
$$ -289992 124546 143938 -170657 147787 -34282 -10032 98000 -168632 66602 237093
11184B37093a60743a654A35370J48644d7339a943o4965b6660R265A97110c23941
$$ 237093 -160743 -1654 135370 284014 -47339 -1943 -66908 -26660 -17395 197110 -323941
11172A64600c25211k75357K30028A62415E9375J49931b29496c2300A20730a41787
$$ 164600 -325211 -600568 -370540 162415 59375 209306 -229496 -32300 120730 -141787
11161b2247C4767j7164K15573b32299m4983C6662b21668A04055J52019b28217
$$ -22247 34767 17603 233176 -232299 -277282 36662 -221668 104055 256074 -228217
11150G5852j8498i0445A64428a34578k31637J39499H2423b90102C2913M382J99842
$$ 75852 57354 -90445 164428 -134578 -366215 -226716 82423 -290102 32913 37295 237137
11139B37137k0344q7845h6410E2462K68351e7466A91538N2084a6047A67699D9271
$$ 237137 216793 128948 -86410 52462 320813 -57466 191538 243622 -16047 167699 49271
11127C9153L2850J99259P2527H4069A8394J32243k3001C802M59189A67559l3698
$$ 39153 72003 271262 343789 84069 18394 150637 127636 3802 462991 167559 133861
11116A33861d4929A62673c2792A90277K01298b224o2176A79204g8021E8555P7331
$$ 133861 -44929 162673 -32792 190277 391575 -2224 -64400 179204 -78021 58555 135886
11105A35886B4333J71888j6470c944j22855d2330C85553q6626N2483I6315K53504
$$ 135886 24333 196221 179751 -3944 -126799 -42330 385553 298927 351410 96315 349819
11094C49819p6492Q8886A8410h5861g903B68344f8776m2175D37401j57003K8212
$$ 349819 273327 362213 18410 -85861 -7903 268344 -68776 -110951 437401 280398 308610
11083C08610O7452A04155J02060q5991K41045J05019G3229J17440k5161K45370
$$ 308610 376062 104155 206215 120224 361269 466288 73229 190669 165508 410878
11073D10878j51984J90796o6335j4777M4373J80628k30539K74667m5565k25629
$$ 410878 258894 449690 383355 368578 412951 593579 363040 637707 592142 366513
11063C66513M10642k34838J61541A19912M38472k52468J61470B04974N18621o2096
$$ 366513 777155 542317 703858 119912 558384 305916 467386 204974 723595 661499
11053F61499N3407j96178n6759K51959k10177P19398p2640k68102j15289J23814
$$ 661499 714906 518728 461969 713928 503751 1223149 1150509 882407 767118 890932
11043H90932k85772J71563k06596J23351L1576N9063k21371J97691o3872Q6957
$$ 890932 605160 776723 570127 693478 725054 784117 562746 760437 696565 783522
11033G83522k30870K44943q9632j01158L3318J712J47272J35792A86046J1285
$$ 783522 552652 797595 707963 606805 640123 641835 789107 924899 186046 197331
11023A97331N74714p657k34676N7779q512K08688C91865O6030j66512K10945J22094
$$ 197331 772045 764388 529712 587491 578979 787667 391865 457895 291383 502328 624422
11012F24422L43816l48119J94881l38180J7947q4330R8347L1329r2360L08959
$$ 624422 968238 620119 815000 476820 494767 410437 508784 540113 447753 756712
11002G56712j40612K65287l95655L05674l46596P383K72089j42680r5352M43230
$$ 756712 616100 881387 485732 791406 444810 452193 724282 581602 486250 929480
10992I29480j84870L22058k31937J32981j93893Q9541K6025k61692L47729J76452
$$ 929480 744610 1066668 834731 967712 773819 863360 889385 627693 975422 1151874
10982A151874J73532P8615k18872L48520K91603N9024L6758K10782O35517r1576
$$ 1151874 1325406 1404021 1185149 1533669 1825272 1884296 1921054 2131836 2767353 2675777
10972B675777M08186n1483k78208M921p3555k06432m66978J76947O2714l80967
$$ 2675777 3083963 3032480 2754272 2759193 2685638 2479206 2012228 2189175 2251889 1870922
10962A870922L84634p28354M47788l1663K08296O8747j28024m7205l59802j60956
$$ 1870922 2255556 1527202 1974990 1943327 2151623 2220370 2092346 2045141 1685339 1524383
10952A524383l69646l4424k86937J94424j54363D08513j95696E3458Q7086J60870
$$ 1524383 1154737 1120313 833376 1027800 873437 408513 212817 53458 140544 301414
10942C01414J55431m7860f954A99743r7999k5700k1722j952N0424l6796a22552
$$ 301414 456845 408985 -6954 199743 101744 76044 54322 52370 102794 65998 -122552
10930B85343A26639K67401A66089a14442e118C6321K5901k9578K35990G4981Q8279
$$ 285343 126639 394040 166089 -114442 -5118 36321 62222 32644 268634 74981 163260
10919A63260D7540P6563C9252i0235B02572A7374a46910e0518A56659o6923J01413
$$ 163260 47540 124103 39252 -90235 202572 17374 -146910 -50518 156659 89736 191149
10908A91149B6501a01793L9822j27283C6724f8011l5775C5246d6893A38815k2935
$$ 191149 26501 -101793 -61971 -189254 36724 -68011 -103786 35246 -46893 138815 115880
10897A15880b65981G9109a46436F4314g0632F4832c12108B9031b75705c4335A73171
$$ 115880 -265981 79109 -146436 64314 -70632 64832 -312108 29031 -275705 -34335 173171
10885g6509m4504c4765l4965j59110C31959e5185B8188N7560a5854r0764o4782
$$ -76509 -121013 -34765 -69730 -228840 331959 -55185 28188 85748 -15854 -106618 -171400
10874a71400L7299D3742b62953A44458f774C35245b41628F7924K25427E7178b00306
$$ -171400 -134101 43742 -262953 144458 -6774 335245 -241628 67924 293351 57178 -200306
10862B77395D6928R2999E1894b6141j26076E3444j3396a8880R220m0335A04233
$$ 277395 46928 139927 51894 -26141 -152217 53444 40048 -18880 -9660 -49995 104233
10850B09364a13247m8493A70651k884c16178B53998a97874B51690b47945a3476
$$ 209364 -113247 -161740 170651 167767 -316178 253998 -197874 251690 -247945 -13476
10839E1268L6687j8829b2855j12287k1226B83922G1266c5773j8692q5382E68448
$$ 51268 87955 69126 -22855 -135142 -156368 283922 71266 -35773 -54465 -139847 568448
10827C659K28836A14713b30865f2053r9005A56163E6296P6689J94831a01102K7885
$$ 3659 232495 114713 -230865 -62053 -161058 156163 56296 132985 327816 -101102 -73217
10816g3217k03618A7914d31496H3867l1459b54547j78519J52134D0812b33456
$$ -73217 -276835 17914 -431496 83867 52408 -254547 -433066 -280932 40812 -233456
10805a81297g1728A9835c88973C6274a52316B40206c4376A07072b37232G1120
$$ -181297 -71728 19835 -388973 36274 -152316 240206 -34376 107072 -237232 71120
10794a00651F3190i528A81973d0497m7845A70436J09044D7044K85677b2025A7787
$$ -100651 63190 -9528 181973 -40497 -88342 170436 279480 47044 332721 -22025 17787
10782d4498A4818i9225j82475B29217a11997B46569d6167j19911c5231j3895l2267
$$ -44498 14818 -99225 -281700 229217 -111997 246569 -46167 -166078 -35231 -49126 -81393
10771h1393A64629n2827e9597B13272a00091K2884L1934k32063j13485d7998C29861
$$ -81393 164629 111802 -59597 213272 -100091 -77207 -45273 -277336 -390821 -47998 329861
10759a15142k10078A72180b11417j02543a46694k98287i1593n049j22907e121
$$ -115142 -325220 172180 -211417 -313960 -146694 -444981 -91593 -96642 -219549 -5121
10748g5158k2890a1097E5601b82282D750K46577a01091A57800b03797a9469A79920
$$ -75158 -98048 -11097 55601 -282282 4750 251327 -101091 157800 -203797 -19469 179920
10736a23564k26170R7522k3326a07172l8549C75722a10036b4543A01080a52234
$$ -123564 -349734 -252212 -275538 -107172 -145721 375722 -110036 -24543 101080 -152234
10725h3066A30660D9705a93478D1575e13779B17206D7860J58955a041l32418B0018
$$ -83066 130660 49705 -193478 41575 -513779 217206 47860 206815 -1041 -333459 20018
10713i4866k2537N5714B10370b16234c7103m7444K0544b4946B16600b71844k04446
$$ -94866 -117403 -61689 210370 -216234 -37103 -84547 -64003 -24946 216600 -271844 -476290
10702d76290a99657i8951j42613a16620N972j2173A39411o4042b96799A29650
$$ -476290 -199657 -98951 -241564 -116620 -110648 -122821 139411 75369 -296799 129650
10691F0500b58755a15762j32425F3049e2086C16365G5933L6673m6014a67908Q2348
$$ 60500 -258755 -115762 -248187 63049 -52086 316365 75933 112606 66592 -167908 -85560
10680h5560D1273J83269A05406a38665F0932g2221j28190R1731G399f7696L1820
$$ -85560 41273 224542 105406 -138665 60932 -72221 -200411 -108680 7399 -67696 -35876
10669c5876k41030a07030r9269B09900G328J02328a20923b063n6643B4160R9896
$$ -35876 -276906 -107030 -206299 209900 7328 109656 -120923 -2063 -58706 24160 124056
10658A24056j7005C861d32941C8481b87121M3213G3014i6964A25638a38924j52688
$$ 124056 107051 3861 -432941 38481 -287121 -243908 73014 -96964 125638 -138924 -291612
10647b91612F4833b23428L6389K8810A23097R5792D0776A0709b62968j72894G5914
$$ -291612 64833 -223428 -187039 -158229 123097 218889 40776 10709 -262968 -435862 75914
10635c72487D9594K2004h8252j11404H5018h3437m9218D0977a53106H3076J6318
$$ -372487 49594 71598 -88252 -199656 85018 -83437 -132655 40977 -153106 83076 99394
10624I9394L28322C7333j2772m728K01781h7565C4857a13643N4334B59558F5454
$$ 99394 427716 37333 24561 19833 221614 -87565 34857 -113643 -59309 259558 65454
10612C9473b2810G52a74096e3239g351k38347h2994D05706a08273c1948j2429
$$ 39473 -22810 752 -174096 -53239 -7351 -245698 -82994 405706 -108273 -31948 -44377
10601d4377k04560I5552J42455B5955R2114P1019J09482H0806k6685g1331G3092
$$ -44377 -248937 95552 238007 25955 118069 189088 298570 80806 54121 -71331 73092
10589E1702c90789A40513c36363j87097a44731c8284m5594M1310A33670A799a05195
$$ 51702 -390789 140513 -336363 -523460 -144731 -38284 -83878 -42568 133670 1799 -105195
10577e1689p4292j19854O8538h7296p4121K7708J8947A03989g4795C38430b11005
$$ -51689 -125981 -245835 -177297 -87296 -161417 -133709 -114762 103989 -74795 338430 -211005
10565I3213b03090K927f9694k01286j83820J75435E543i3615k2014a4948A8181
$$ 93213 -203090 -200163 -69694 -270980 -454800 -279365 5543 -93615 -115629 -14948 18181
10553I5145b50257A01869b02211C737c86417b8481p5470A62794J49414a70497
$$ 95145 -250257 101869 -202211 3737 -386417 -28481 -103951 162794 312208 -170497
10542a43922C1217J51121d18513I7673a50685D7972R9569F3014a59580J9809c0118
$$ -143922 31217 182338 -418513 97673 -150685 47972 147541 63014 -159580 -139771 -30118
10530c06174C76550g4962F0144c7900m2236n0788c5410F1890a07941d7602j72705
$$ -306174 376550 -74962 60144 -37900 -80136 -130924 -35410 61890 -107941 -47602 -220307
10519b20307a4654A17796b31847J14857c4294D6612a12599m1375K4398G5764c90733
$$ -220307 -14654 117796 -231847 -116990 -34294 46612 -112599 -153974 -129576 75764 -390733
10507I5490e9582A01619C1080e9210j02524c5319C08635j13466K2137d33262B47290
$$ 95490 -59582 101619 31080 -59210 -161734 -35319 308635 195169 217306 -433262 247290
10495B1185b08361a3866C13517d49339A50357J13689b7885A6009e9935D7109R9101
$$ 21185 -208361 -13866 313517 -449339 150357 264046 -27885 16009 -59935 47109 146210
10484A46210K64552j51895P1797L4150K7840m1278C7823a97579I4615a31415C1260
$$ 146210 410762 258867 330664 364814 392654 351376 37823 -197579 94615 -131415 31260
10472A42656a33536R229H1214O2473L2578D5035a01613a5758I3335a12217j28782
$$ 142656 -133536 -124307 81214 143687 176265 45035 -101613 -15758 93335 -112217 -240999
10461b40999A18445a98006j58320A04982J33792i2679q6894f8014A11685a5088
$$ -240999 118445 -198006 -356326 104982 238774 -92679 -179573 -68014 111685 -15088
10450a85008E017a64009N829e9062J2421j30074Q4626k877I5805D48E6h4540D2357
$$ -185008 5017 -164009 -158180 -59062 -46641 -176715 -92089 -94966 95805 448 56 -84540 42357
10436a75451D42755A65814K2779K52235F8333J00611F7819a20425C28054a4631
$$ -175451 442755 165814 188593 440828 68333 168944 67819 -120425 328054 -14631
10425A83416h1226C60258a54132n503e5465I7804a91907d9660A52203E232i2900
$$ 183416 -81226 360258 -154132 -159635 -55465 97804 -191907 -49660 152203 5232 -92900
10413b01993B07108m7607a91318P4205B51509l8250a78974A33799D3944a0846
$$ -201993 207108 159501 -191318 -117113 251509 213259 -178974 133799 43944 -10846
10402f0397B08759H4469P1360G6731b34649I582c0932k5844A37528a0679B12802
$$ -60397 208759 84469 155829 76731 -234649 9582 -30932 -56776 137528 -10679 212802
10390A59427J91926A20504A8020L72339j58513l868n0858c10870B86361a8012
$$ 159427 351353 120504 18020 390359 231846 227978 177120 -310870 286361 -18012
10379G0687a8731B23453J23229P65j36375J8619P6572j4032L25248A78456M01478
$$ 70687 -18731 223453 346682 347447 211072 229691 306263 292231 617479 178456 579934
10368E79934k27698j69384M87435j12416k70575J11759o3733D0566a0759B69708
$$ 579934 352236 182852 670287 557871 287296 399055 335322 40566 -10759 269708
10357D6754J89563p168J86927A20793K36773A34675J49868L49290k17591A76248
$$ 46754 236317 229149 416076 120793 357566 134675 284543 633833 416242 176248
10346B13471J76148j80825J95283J57214j16730A2970M44684F3679l756K35330
$$ 213471 389619 208794 404077 561291 444561 12970 457654 63679 59923 295253
10336B95253H4912l1660K55729G0158K1520a41774b1377j07585C34607j64647
$$ 295253 84912 53252 308981 70158 91678 -141774 -21377 -128962 334607 169960
10326A69960D3343K59257I8379J40780J89397j59651I8021K38907a8849B0584
$$ 169960 43343 302600 98379 239159 428556 268905 98021 336928 -18849 20584
10315B35046j4663c35713d6281B3733m40R6424a65573m8072A17603C1895a200
$$ 235046 220383 -335713 -46281 23733 23293 119717 -165573 -213645 117603 31895 -1200
10303A38782J46342G1009c01516J36573L5272N30G667K04891a31455b8025E3059
$$ 138782 285124 71009 -301516 -164943 -129671 -129141 7667 212558 -131455 -28025 53059
10291a79452B23875c40323A48472J08839L7278G22a97234o5220D5637R1927i7590
$$ -179452 223875 -340323 148472 257311 294589 722 -197234 -262454 45637 137564 -97590
10279a72887M9379C9166i0102d1586o3194B55053a11099o3658E6190i9790B53698
$$ -172887 -123508 39166 -90102 -41586 -104780 255053 -111099 -174757 56190 -99790 253698
10267C2113a40161B68070A18014M5427O4520O0015d6014B55164K35848j53950
$$ 32113 -140161 268070 118014 163441 227961 287976 -46014 255164 491012 337062
10257C37062K03712B35989G3331L2909R0145o8458B0802R8611J48853r8466f4445
$$ 337062 540774 235989 73331 106240 196385 127927 20802 119413 268266 169800 -64445
10245G911b8008m719B5837O734J99391a9272A44834d96065K45289E9967b25424
$$ 7911 -28008 -32727 25837 32571 231962 -19272 144834 -496065 -250776 59967 -225424
10233a61099j86324F8142b61075J27981A4738J97748L3921J0023a95870C79298
$$ -161099 -347423 68142 -261075 -133094 14738 212486 246407 256430 -195870 379298
10222A10970D9325f5390b4256A6954c76680i1631J7416j60113C4029a71931N6307
$$ 110970 49325 -65390 -24256 16954 -376680 -91631 -74215 -234328 34029 -171931 -115624
10211a15624A21157e206k09101B41183a99210j18740J39520c6457A68718Q0659
$$ -115624 121157 -5206 -214307 241183 -199210 -317950 -178430 -36457 168718 249377
10201B49377i0685j78643m5993C63409h612I2340H669L9361a66029E1964a30492
$$ 249377 -90685 -269328 -315321 363409 -8612 92340 8669 48030 -166029 51964 -130492
10189B99464a09612j19167d1639j28313D098K0364h9337A2241i0653H9041a11929
$$ 299464 -109612 -228779 -41639 -169952 4098 24462 -89337 12241 -90653 89041 -111929
10177c17896I3250b17700F6188M1616A8645g0565B6600m513a99592G0783b7935
$$ -317896 93250 -217700 66188 107804 18645 -70565 26600 22087 -199592 70783 -27935
10165C1680a42272O1020j97185q8264C10272a83707j21408Q0648A01107l985q5
$$ 31680 -142272 -81252 -278437 -366701 310272 -183707 -305115 -224467 101107 97122 97037
10154I7037c90175f5661B87134c10807J17257a0858j14860j77168a07326r6214
$$ 97037 -390175 -65661 287134 -310807 -193550 -10858 -125718 -302886 -107326 -203540
10144b03540e7069A19607m2702a63414B9874b07706A1179b80970A04505D9789
$$ -203540 -57069 119607 76905 -163414 29874 -207706 11179 -280970 104505 49789
10133h3170b9021A24485b38023e9767k94745A26391a02721a6448A27297O1435
$$ -83170 -29021 124485 -238023 -59767 -354512 126391 -102721 -16448 127297 188732
10123A88732d089l6697H5025c08141A07849J09904a8750r9744l1447j2919k79148
$$ 188732 -4089 -40786 85025 -308141 107849 217753 -18750 -118494 -149941 -162860 -442008
10112d42008A64072a48613j31858a11200C7739a33330r8424j08293A08652M398
$$ -442008 164072 -148613 -280471 -111200 37739 -133330 -231754 -340047 108652 113050
10102A13050J03482C139b21576m6440a26601A19638c0845D83588a92380b674r935
$$ 113050 216532 3139 -221576 -268016 -126601 119638 -30845 483588 -192380 -2674 -12609
10091a2609E4104a11918E427a58352J8097a3386m18779a85485K6772B64224b74684
$$ -12609 54104 -111918 5427 -158352 -140255 -13386 -432165 -185485 -158713 264224 -274684
10079B7174b2795D33621a57388O8503F6213h3539J1615k58878B48832d1782B87237
$$ 27174 -22795 433621 -157388 -88885 66213 -83539 -71924 -330802 248832 -41782 287237
10067a71818C4124R9793d58481a6700k36147F4068b87031a40143A48761C6215
$$ -171818 34124 133917 -458481 -16700 -252847 64068 -287031 -140143 148761 36215
10056A74060I324b97490J3068a04056C01597a8898A36246R104b32096A124a7876
$$ 174060 9324 -297490 -284422 -104056 301597 -18898 136246 145350 -232096 1124 -17876
10044i7328j49665I5764R0200A8507O3260b30385l1512G1648l3150a13710j5145
$$ -97328 -246993 95764 185964 18507 81767 -230385 -261897 71648 38498 -113710 -128855
10033a28855B73220e6538q8751n4135K6822J0162m905I4790b28863A61990b1645
$$ -128855 273220 -56538 -145289 -199424 -172602 -162440 -167345 94790 -228863 161990 -21645
10021C3244a68577N4918K0866C742K45992c0005B60388a53314B6547K6517J86033
$$ 33244 -168577 -113659 -92793 3742 249734 -30005 260388 -153314 26547 53064 239097
10010B39097l3584d8786o8404b8383A88321a34632p9699A67139a04475a2567l09580
$$ 239097 205513 -48786 -117190 -28383 188321 -134632 -214331 167139 -104475 -12567 -322147
9999c22147d5471A48805a77952j14768J20621M0536j55858P2457K9980f7338j443
$$ -322147 -45471 148805 -177952 -292720 -172099 -131563 -287421 -214964 -184984 -67338 -68781
9988f8781C77076e1223Q216l12280J65395p898j25076J17233f6430j95670f1153
$$ -68781 377076 -51223 -43007 -355287 -189892 -197790 -322866 -205633 -66430 -262100 -61153
9976b1556D17594c98412a03639r3186A70750g4262k78888m4882P1025R6887P1346
$$ -21556 417594 -398412 -103639 -196825 170750 -74262 -353150 -398032 -327007 -230120 -158774
9965a58774a2045A08869c01272D1137e6685k27309C25926A32554a88436K4506
$$ -158774 -12045 108869 -301272 41137 -56685 -283994 325926 132554 -188436 -163930
9955a63930q1600C002J60648n0085b57631m3725B59351q5609b8745G8913L5090
$$ -163930 -245530 3002 163650 113565 -257631 -301356 259351 173742 -28745 78913 114003
9944A14003m4746a6349k0669E0259a4404E5096k604h0648A23848c8008B20537
$$ 114003 69257 -16349 -37018 50259 -14404 55096 52492 -80648 123848 -38008 220537
9932A3206b95929H745h8900C8261P3918a64012j33740J22515n9524N6942G7422
$$ 13206 -295929 8745 -88900 38261 112179 -164012 -297752 -175237 -234761 -177819 77422
9920A96538a24063l7042k31621A18443k6543a17838G7295b53838B76269d51432
$$ 196538 -124063 -161105 -392726 118443 91900 -117838 77295 -253838 276269 -451432
9909g9850B3876c00702B84507b10136j78926A75521a73144k67179g9341m8629
$$ -79850 23876 -300702 284507 -210136 -389062 175521 -173144 -440323 -79341 -127970
9899a27970L3628d2756K1093G4353K48722a23170r0082B21294a05449J7149o2246
$$ -127970 -94342 -42756 -21663 74353 323075 -123170 -213252 221294 -105449 -88300 -150546
9888a50546K8359d8279j45429C868f0895A59426o9693a71744q465l2451E7672
$$ -150546 -122187 -48279 -193708 3868 -60895 159426 89733 -171744 -180209 -212660 57672
9876i9309J3685m3925p171b9362r3683b5359m07825a91502c6075A66472c70815
$$ -99309 -85624 -129549 -136720 -29362 -123045 -25359 -433184 -191502 -36075 166472 -370815
9864a29703A63830b44095G0782c63498h2589H036P8022b82138j3789Q7538j29858
$$ -129703 163830 -244095 70782 -363498 -82589 8036 86058 -282138 -295927 -208389 -338247
9853c38247H6431b63271B54288A00987a57911L5105j00912E3522O1301f3268f95
$$ -338247 86431 -263271 254288 100987 -157911 -122806 -223718 53522 114823 -63268 -695
9841a51307j08685j48533b8185A41466a19155p4361k62292c1822C72136j81353
$$ -151307 -259992 -408525 -28185 141466 -119155 -193516 -455808 -31822 372136 190783
9831A90783P878O4868c43548B32895a29600H4241J23611c21518d7959k5192j94018
$$ 190783 198661 263529 -343548 232895 -129600 84241 207852 -321518 -47959 -73151 -267169
9820b67169D5626J07530b64788D9937i9701C68006A70494a13291j45862R340e6513
$$ -267169 45626 153156 -264788 49937 -99701 368006 170494 -113291 -259153 -249813 -56513
9808C06621i8324q1685F8388b89262a17695K4373A00195a61880q2821J04486B06856
$$ 306621 -98324 -180009 68388 -289262 -117695 -93322 100195 -161880 -244701 -140215 206856
9796b02826A03201a80963a5284A9358K3175f942n7759j4125j41863E6563k0886
$$ -202826 103201 -180963 -15284 19358 42533 -6942 -64701 -78826 -220689 56563 35677
9785C5677d3752Q370Q094k03560A94316a9982l01920f4886A74364j788c44552
$$ 35677 -43752 -35382 -27288 -230848 194316 -19982 -321902 -64886 174364 172576 -344552
9773e6901q3401H0731b50042A24084R0970E1417P2269e55683C46131B8397b57645
$$ -56901 -140302 80731 -250042 124084 215054 51417 123686 -555683 346131 28397 -257645
9761f1221p3616j69713A96419A6771b81189b4709k16782i6840j1834j16046d3698
$$ -61221 -134837 -304550 196419 16771 -281189 -24709 -241491 -96840 -108674 -224720 -43698
9749b1059m07031e8908C8185f4257j06325E7641J76190m4998b72595c9689j17638
$$ -21059 -428090 -58908 38185 -64257 -170582 57641 233831 188833 -272595 -39689 -157327
9738a57327H2044K9559J11897a68643q3985a4161K533A69189a86365B31827B1836
$$ -157327 82044 111603 223500 -168643 -252628 -14161 -11628 169189 -186365 231827 21836
9726d23881a74698E4535J07898a2591k0066k79165f4248j24178A28930H648f1024
$$ -423881 -174698 54535 162433 -12591 -32657 -311822 -64248 -188426 128930 8648 -61024
9714A14705P1043a00515G7392a97740I4350g4511A27308J99886A13767J16461
$$ 114705 185748 -100515 77392 -197740 94350 -74511 127308 327194 113767 230228
9704B30228b3879o3078b4117k51140E86914a75114A73110a948o8558F9062b22857
$$ 230228 -23879 -86957 -24117 -275257 586914 -175114 173110 -1948 -70506 69062 -222857
9692b93814f9186F2233k6652d7321k18568c3678B97233a3861k74070J26071p8954
$$ -293814 -69186 62233 35581 -47321 -265889 -33678 297233 -13861 -287931 -161860 -240814
9681b40814E0940b60894I8440m7475b22819I6556l9407c20741N3190m6131d0997
$$ -240814 50940 -260894 98440 50965 -222819 96556 57149 -320741 -267551 -313682 -40997
9669b72193P0287g8670A68322n837b66350a0737j28366O5951B23274p8817J4776
$$ -272193 -201906 -78670 168322 162485 -266350 -10737 -139103 -73152 223274 144457 159233
9658A59233a7173g426l28504a49026F6360R6241b06323C65187f6545A19460a97673
$$ 159233 -17173 -7426 -335930 -149026 66360 162601 -206323 365187 -66545 119460 -197673
9646h16j16096j09505Q900k42632c1741j27653f2129A04518a0562k4065k51785
$$ -816 -116912 -226417 -217517 -460149 -31741 -159394 -62129 104518 -10562 -34627 -286412
9635b86412B21328b07411D1672b35544A21303L1758a93577A5291a28389A64690
$$ -286412 221328 -207411 41672 -235544 121303 153061 -193577 15291 -128389 164690
9624c04684J12469a346j86987l7636q2073Q0771K2891j02104f8345l9928k45872
$$ -304684 -192215 -1346 -188333 -225969 -308042 -227271 -204380 -306484 -68345 -108273 -354145
9613c54145B7534b34583F2770h5058A46662a23431B7484a50917C3645K10246d23410
$$ -354145 27534 -234583 62770 -85058 146662 -123431 27484 -150917 33645 243891 -423410
9601A90979g8698K9550k15289G7089c08326g8695E1160b585G3959L2709o149b17201
$$ 190979 -78698 -49148 -264437 77089 -308326 -78695 51160 -2585 73959 106668 100519 -217201
9588A49380K6183C5681a22472j29011c5066r5980r5387B17861c93355o3752a71246
$$ 149380 175563 35681 -122472 -251483 -35066 -131046 -226433 217861 -393355 -457107 -171246
9576B59842a86657B25880j03374c02502a17344A99372j7742G8297a58727j1990
$$ 259842 -186657 225880 122506 -302502 -117344 199372 181630 78297 -158727 -170717
9566a70717j26564F1833j8055a29504k24687C8685a80696c8940k7739j76232a15436
$$ -170717 -297281 61833 43778 -129504 -354191 38685 -180696 -38940 -66679 -242911 -115436
9554a35645k171I317K46326b65508C40082a70410c6571o2649q5507J239M7363
$$ -135645 -137816 9317 255643 -265508 340082 -170410 -36571 -99220 -184727 -183488 -136125
9543a36125J9476j1660L3307G5811a18012A91111F8583a92374i0033A7295c62722
$$ -136125 -116649 -128309 -95002 75811 -118012 191111 68583 -192374 -90033 17295 -362722
9531b06312c5308n2874K1187A76542e9613a2351G3995a61185A12220R186a46882
$$ -206312 -35308 -88182 -66995 176542 -59613 -12351 73995 -161185 112220 121406 -146882
9519c14242a45925J7753k56750B2081b41017R1843j52434B83812h8386F9104i9999
$$ -314242 -145925 -128172 -384922 22081 -241017 -149174 -301608 283812 -88386 69104 -99999
9507b59920E1379h3905j55909f1469a667j27364j69165a17905A21858E9884b86703
$$ -259920 51379 -83905 -239814 -61469 -1667 -129031 -298196 -117905 121858 59884 -286703
9495B87072A11707a24785G8371h6712l6324j60360M3547P5237l13157C09780b2681
$$ 287072 111707 -124785 78371 -86712 -123036 -283396 -239849 -164612 -477769 309780 -22681
9483A44457B3645a33017A44738G2166a0006I3822a21605b1044B35609D6620a47935
$$ 144457 23645 -133017 144738 72166 -10006 93822 -121605 -21044 235609 46620 -147935
9471a50309B6643a65128C09102a92621g3529j02903c995q31k20409B9128J08486
$$ -150309 26643 -165128 309102 -192621 -73529 -176432 -3995 -4826 -225235 29128 137614
9460A37614d9295Q725k47499K3109a24601j86301a20219j41921b1495p8922K7773
$$ 137614 -49295 -40570 -288069 -264960 -124601 -310902 -120219 -262140 -21495 -100417 -72644
9449g2644c6166j73840j52215J76659J6105A41555k728h879j11330K4554C6943
$$ -72644 -36166 -210006 -362221 -185562 -169457 141555 138827 -8879 -120209 -95655 36943
9437a86371J8613B4975a75889C06055a44639O6694c5090k09970a070A93411d94808
$$ -186371 -167758 24975 -175889 306055 -144639 -77945 -35090 -245060 -1070 193411 -494808
9425c12535l0492A92422g4755r5101N4477I3173a67718G7860A984b47767K6008
$$ -312535 -343027 192422 -74755 -169856 -115379 93173 -167718 77860 1984 -247767 -221759
9414b21759o0088d4903C6956A5674a69197E2047c04849A47873O647a08472n5297
$$ -221759 -281847 -44903 36956 15674 -169197 52047 -304849 147873 154520 -108472 -163769
9403a63769B6104a23868B24354e0481m82456B6511a69339g2104q2026A0635a38473
$$ -163769 26104 -123868 224354 -50481 -532937 26511 -169339 -72104 -154130 10635 -138473
9391a24914J0534B83830a16064J3622L3958H9661K56655a2756n5620a8810j8830
$$ -124914 -114380 283830 -116064 -102442 -68484 89661 346316 -12756 -68376 -18810 -37640
9380c7640E5070a35515p4444A61462l6688c8275q5449B0137f0130j56761A22391
$$ -37640 55070 -135515 -209959 161462 124774 -38275 -123724 20137 -60130 -216891 122391
9368a18364j22452R2025J5749j164L850A14619b27579C5280a16812L9508B7840
$$ -118364 -240816 -148791 -133042 -134206 -130356 114619 -227579 35280 -116812 -77304 27840
9356c97191B44663K4240a45207P837m6344j21871a27725g192k45761A84642E5703
$$ -397191 244663 268903 -145207 -137370 -183714 -305585 -127725 -7192 -252953 184642 55703
9344h3574F9660a0989B5783i4668f47D5567A3155d20298J93014M8465M4528k0224
$$ -83574 69660 -10989 25783 -94668 -647 45567 13155 -420298 -227284 -178819 -134291 -154515
9332a54515K6085K3180j30901a07093p5706Q9829j14731c5896j56163A44741a39274
$$ -154515 -128430 -105250 -236151 -107093 -182799 -92970 -207701 -35896 -192059 144741 -139274
9320c94556J05534A33291i7470A38574a31534C17997a691A59802a43347A52249
$$ -394556 -289022 133291 -97470 138574 -131534 317997 -1691 159802 -143347 152249
9309b60444A41579a38160B87418A7832g1528k27779O3839j23151i2592j8171p4428
$$ -260444 141579 -138160 287418 17832 -71528 -299307 -235468 -358619 -92592 -110763 -185191
9298a85191G6969b30108q7785g8851L3552A09674a63104m9299B05326m8029f4268
$$ -185191 76969 -230108 -317893 -78851 -45299 109674 -163104 -212403 205326 157297 -64268
9286c39025O8031A21967n4160P5730J6874A3068f4784B1001M365b05006K9717
$$ -339025 -270994 121967 67807 143537 160411 13068 -64784 21001 25366 -205006 -175289
9275a75289j14314n3893h1340j16624K6063F4319a08172M2125m7161M8543F7696
$$ -175289 -289603 -343496 -81340 -197964 -171901 64319 -108172 -66047 -113208 -64665 67696
9263a36368C085L19313C0692a78529e494I9818i2135d2935A1884a35818k92072
$$ -136368 3085 322398 30692 -178529 -5494 99818 -92135 -42935 11884 -135818 -427890
9252d27890b3804k6602J0693m6009B56235j1184d3783J1989A14349B4046h1583
$$ -427890 -23804 -50406 -39713 -85722 256235 245051 -43783 -31794 114349 24046 -81583
9240H7393M6193D167i523m6794E2492r431a0881A79844a64798j28368a28405d8744
$$ 87393 133586 4167 -9523 -56317 52492 43061 -10881 179844 -164798 -293166 -128405 -48744
9227i680B07625L3444p9081C9763a00050A9849d7577b0425D5949b00398Q8542
$$ -9680 207625 241069 161988 39763 -100050 19849 -47577 -20425 45949 -200398 -111856
9216a11856e4905B6711a27070B31927a2189l63474a12711L7076B7062M7983b22993
$$ -111856 -54905 26711 -127070 231927 -12189 -375663 -112711 -75635 27062 75045 -222993
9204c47164C56387F0564K59153a94892k6237m08463L14707J35136A61065P5693
$$ -347164 356387 60564 319717 -194892 -221129 -629592 -314885 -179749 161065 236758
9194B36758a14046k97331Q6331a29333e0051C948a23049b9461j12325k35670B0841
$$ 236758 -114046 -411377 -325046 -129333 -50051 3948 -123049 -29461 -141786 -377456 20841
9182A6243J1604K03606E8248K98776a07700A11782c16001C2370M7771a00566J9851
$$ 16243 27847 231453 58248 357024 -107700 111782 -316001 32370 80141 -100566 -80715
9171h0715r0878O0242k39881O2769B01796C4789J71449k1308D5010b25509C6000
$$ -80715 -171593 -111351 -351232 -288463 201796 34789 206238 184930 45010 -225509 36000
9159A04389a66168G8757a52999j70163B8547J96678C1344J85177b39874A66953
$$ 104389 -166168 78757 -152999 -323162 28547 225225 31344 216521 -239874 166953
9148B04328j272b2017m8495b1911B21816Q0588i7728k6235P84J8728B79551e5237
$$ 204328 203056 -22017 -70512 -21911 221816 302404 -97728 -123963 -123179 -104451 279551 -55237
9135a31845A7136K18605c01546g1430j75394i478B13296e6123j56636A40145b02219
$$ -131845 17136 235741 -301546 -71430 -246824 -9478 213296 -56123 -212759 140145 -202219
9123A91717B4044a35883k3744j40588j00846a19844c1824C93299a29370I0382
$$ 191717 24044 -135883 -159627 -300215 -401061 -119844 -31824 393299 -129370 90382
9112a30144j3770E8626a34695b7078j9208m28A09768E950J73828a09835D8950
$$ -130144 -143914 58626 -134695 -27078 -46286 -46714 109768 5950 179778 -109835 48950
9100F2530a56801j04864B4653a8598n64005a15036F1632J67001e1615j25513B0940
$$ 62530 -156801 -261665 24653 -18598 -582603 -115036 61632 228633 -51615 -177128 20940
9088c37636h6178k28924j85743a62128g389k25755E487a41238B90039c11716q0493
$$ -337636 -86178 -315102 -500845 -162128 -7389 -233144 5487 -141238 290039 -311716 -392209
9077c92209H0585l0837i6210B29235C1742h02H3979i2555k32370A6465h9493L3431
$$ -392209 80585 49748 -96210 229235 31742 -802 83979 -92555 -324925 16465 -89493 -56062
9065e6062j75061G2721g6749A41109c25908a43915B11660D2593c6063A39272a581
$$ -56062 -231123 72721 -76749 141109 -325908 -143915 211660 42593 -36063 139272 -1581
9053A1462d2947R883j89603c3111A29408g277I5094D2933b53325O8723M1100A68542
$$ 11462 -42947 -33064 -222667 -33111 129408 -7277 95094 42933 -253325 -184602 -143502 168542
9040h1436B0669a54720A91638P0141n057a31860D3239Q9591a42590q889M8725
$$ -81436 20669 -154720 191638 261779 256722 -131860 43239 132830 -142590 -151479 -102754
9029a02754a2038d969B44399a28932e1212j73948g6853k9239B06177a70792N3533
$$ -102754 -12038 -4969 244399 -128932 -51212 -225160 -76853 -106092 206177 -170792 -117259
9018a17259n448j72565F9466N5711c11347a02446B50919b25438B37110A01579
$$ -117259 -122707 -295272 69466 125177 -311347 -102446 250919 -225438 237110 101579
9007b5447C56511j21296a95771A80807a7785j95412O501O0813A64846a56268k30785
$$ -25447 356511 235215 -195771 180807 -17785 -213197 -206696 -145883 164846 -156268 -387053
8996c87053A83150a97560Q5123B6423b85769l8584a24338F503c5164l7042B9625
$$ -387053 183150 -197560 -112437 26423 -285769 -324353 -124338 6503 -35164 -72206 29625
8984b09140A16853b13064H4832P9927b87649A99139A1392a59141P8570j19746
$$ -209140 116853 -213064 84832 164759 -287649 199139 11392 -159141 -80571 -200317
8974b00317A74805A1618a02487j29761H0269a9965m90470A61585O2989a30893
$$ -200317 174805 11618 -102487 -232248 80269 -19965 -510435 161585 224574 -130893
8963A36898D3974g3977J1250A413f3051j12616f4517j24989N0914H219J45953
$$ 136898 43974 -73977 -62727 1413 -63051 -175667 -64517 -189506 -138592 8219 154172
8952A54172a31673F7520a5935G3422M0967D9320a29323j133J2956L4313A54206
$$ 154172 -131673 67520 -15935 73422 114389 49320 -129323 -130456 -117500 -83187 154206
8940H1179C5991a24865B11938f5487a5304k71964A48441J22179A08863a40466
$$ 81179 35991 -124865 211938 -65487 -15304 -287268 148441 270620 108863 -140466
8929b8533I9502J13564C9053M23346A25068K67427J091444O032827B478517E18208
$$ -28533 99502 213066 39053 462399 125068 392495 1483939 7516766 2478517 518208
8918B85898D5711a37768k6197E6327J34699G822J53775a53741p4084Q0017A05959
$$ 285898 45711 -137768 -163965 56327 191026 7822 161597 -153741 -227825 -147808 105959
8906A5400R5011G386d4540l35648i8459p4912l7049K1563A11229b45189d2259
$$ 15400 110411 7386 -44540 -380188 -98459 -173371 -210420 -188857 111229 -245189 -42259
8894b6346J2273D146J44932b3487E2875A3376J56464o4915A6815d0300j10055
$$ -26346 -14073 4146 149078 -23487 52875 13376 169840 104925 16815 -40300 -150355
$$ [...]
##END NTUPLES=NMR SPECTRUM
##END=
