
##TITLE=AC1327_PERAH12156_7163865_ym0b1Gj23m
##JCAMPDX= 6.0         $$ Bruker NMR JCAMP-DX V2.0
##DATA TYPE= NMR SPECTRUM
##DATA CLASS= NTUPLES
##ORIGIN= BRUKER
##OWNER= Administrator
$$ 1.72 TOPSPIN		Version 2.1
$$ 2012-12-03 14:37:55.166 -0500  Administrator@X
$$ Compression mode = diff/dup
##.OBSERVE FREQUENCY= 400.02188249412
##.OBSERVE NUCLEUS= ^1H
##.ACQUISITION MODE= SIMULTANEOUS (DQD)
##.ACQUISITION SCHEME= undefined
##.AVERAGES= 64
##.DIGITISER RES= 22
##SPECTROMETER/DATA SYSTEM= spect
##.PULSE SEQUENCE= noesygpps1d.comp
##.SOLVENT NAME= COFFEE_meoh
##.SHIFT REFERENCE= INTERNAL, COFFEE_meoh, 1, 14.96239
##AUDIT TRAIL= $$ (NUMBER, WHEN, WHO, WHERE, PROCESS, VERSION, WHAT)
$$ ##TITLE= Audit trail, TOPSPIN		Version 2.1
$$ ##JCAMPDX= 5.01
$$ ##ORIGIN= Bruker BioSpin GmbH
$$ ##OWNER= Administrator
$$ $$ E:\/data/COFFEE/nmr/AC1327_PERAH12156_7163865_ym0b1Gj23m/12/pdata/1/auditp.txt
$$ ##AUDIT TRAIL=  $$ (NUMBER, WHEN, WHO, WHERE, PROCESS, VERSION, WHAT)
(   1,<2012-12-01 12:28:53.710 -0500>,<Administrator>,<X>,<go>,<TOPSPIN 2.1>,
      <created by zg
	started at 2012-12-01 12:17:21.708 -0500,
	POWCHK enabled, PULCHK disabled,
       configuration hash MD5:
       86 BA 57 50 F2 9D 5C 9B 26 00 A9 28 5F 66 2E 89
       data hash MD5: 64K
       27 15 B8 E3 E9 4E 98 96 60 BA FA 3E 1D 95 F6 FC>)
(   2,<2012-12-01 12:28:56.820 -0500>,<Administrator>,<X>,<proc1d>,<TOPSPIN 2.1>,
      <Start of raw data processing
       efp LB = 0.3 FT_mod = 6 PKNL = 1 PHC0 = 0 PHC1 = 0 SI = 128K 
       data hash MD5: 128K
       8D 5A 6C 7E 24 1C 8A 26 34 56 14 55 E6 9A 7A A2>)
(   3,<2012-12-01 12:28:57.882 -0500>,<Administrator>,<X>,<proc1d>,<TOPSPIN 2.1>,
      <pk PHC0 = -78.72253 PHC1 = 0 
       data hash MD5: 128K
       1E 2B 2D 0F FC 36 BB D3 3C 12 BB B7 35 75 D1 07>)
(   4,<2012-12-01 12:28:58.570 -0500>,<Administrator>,<X>,<proc1d>,<TOPSPIN 2.1>,
      <abs ABSG = 1 
       data hash MD5: 128K
       0C AC 1F 9F 5D 58 1E 7B B4 FC D8 9E 93 F4 E2 12>)
(   5,<2012-12-01 12:28:58.726 -0500>,<Administrator>,<X>,<proc1d>,<TOPSPIN 2.1>,
      <abs ABSG = 2 
       data hash MD5: 128K
       6B D6 45 AC F8 36 F9 9D BF C9 CB CB 38 71 9E 48>)
(   6,<2012-12-01 12:28:58.898 -0500>,<Administrator>,<X>,<proc1d>,<TOPSPIN 2.1>,
      <abs ABSG = 3 
       data hash MD5: 128K
       9F 7C 0A 53 13 1B 3F CB C4 82 11 A1 93 7C 45 55>)
(   7,<2012-12-01 12:28:59.117 -0500>,<Administrator>,<X>,<proc1d>,<TOPSPIN 2.1>,
      <abs ABSG = 4 
       data hash MD5: 128K
       3E A0 4E C3 05 8F B0 AC 83 A7 51 F4 5E 14 62 F7>)
(   8,<2012-12-01 12:28:59.289 -0500>,<Administrator>,<X>,<proc1d>,<TOPSPIN 2.1>,
      <abs ABSG = 5 
       data hash MD5: 128K
       45 5E FF 5A E8 95 BC FC B4 FD B1 06 C1 45 71 81>)
(   9,<2012-12-01 12:29:05.914 -0500>,<Administrator>,<X>,<audit>,<TOPSPIN 2.1>,
      <user comment:
       ICON-NMR User ID: COFFEE
       data hash MD5: 128K
       45 5E FF 5A E8 95 BC FC B4 FD B1 06 C1 45 71 81>)
$$ ##END=
$$ 
$$ $$ hash MD5
$$ [...]
##$TP07= 0
##$TPNAME0= <>
##$TPNAME1= <>
##$TPNAME2= <>
##$TPNAME3= <>
##$TPNAME4= <>
##$TPNAME5= <>
##$TPNAME6= <>
##$TPNAME7= <>
##$TPOAL= (0..7)
0.5 0.5 0.5 0.5 0.5 0.5 0.5 0.5
##$TPOFFS= (0..7)
0 0 0 0 0 0 0 0
##$TUNHIN= 0
##$TUNHOUT= 0
##$TUNXOUT= 0
##$USERA1= <user>
##$USERA2= <user>
##$USERA3= <user>
##$USERA4= <user>
##$USERA5= <user>
##$V9= 5
##$VALIST= <valist>
##$VCLIST= <CCCCCCCCCCCCCCC>
##$VD= 0
##$VDLIST= <DDDDDDDDDDDDDDD>
##$VPLIST= <PPPPPPPPPPPPPPP>
##$VTLIST= <TTTTTTTTTTTTTTT>
##$WBST= 1024
##$WBSW= 4
##$XGAIN= (0..3)
0 0 0 0
##$XL= 0
##$YL= 0
##$YMAX_a= 8359392
##$YMIN_a= -17784770
##$ZGOPTNS= <>
##$ZL1= 120
##$ZL2= 120
##$ZL3= 120
##$ZL4= 120
##$ABSF1= 14.96239
##$ABSF2= -5.595792
##$ABSG= 5
##$ABSL= 3
##$ALPHA= 0
##$AQORDER= 0
##$ASSFAC= 0
##$ASSFACI= 0
##$ASSFACX= 0
##$ASSWID= 0
##$AUNMP= <proc_prof1d_extract.lims>
##$AXLEFT= 0
##$AXNAME= <>
##$AXNUC= <1H>
##$AXRIGHT= 0
##$AXTYPE= 0
##$AXUNIT= <>
##$AZFE= 0.1
##$AZFW= 0.1
##$BCFW= 0
##$BC_mod= 0
##$BYTORDP= 0
##$COROFFS= 0
##$CY= 15
##$DATMOD= 1
##$DC= 0
##$DFILT= <>
##$DTYPP= 0
##$F1P= 0
##$F2P= 0
##$FCOR= 0.5
##$FTSIZE= 131072
##$FT_mod= 6
##$GAMMA= 0
##$GB= 0
##$INTBC= 1
##$INTSCL= 1
##$ISEN= 128
##$LB= 0.3
##$LEV0= 0
##$LPBIN= 0
##$MAXI= 10000
##$MC2= 0
##$MEAN= 0
##$ME_mod= 0
##$MI= 0
##$NCOEF= 0
##$NC_proc= -2
##$NLEV= 6
##$NOISF1= 0
##$NOISF2= 0
##$NSP= 0
##$NTH_PI= 0
##$NZP= 0
##$OFFSET= 14.96239
##$PC= 1
##$PHC0= -78.72253
##$PHC1= 0
##$PH_mod= 1
##$PKNL= yes
##$PPARMOD= 0
##$PPDIAG= 0
##$PPIPTYP= 0
##$PPMPNUM= 2147483647
##$PPRESOL= 1
##$PSCAL= 4
##$PSIGN= 0
##$PYNMP= <proc.py>
##$REVERSE= no
##$SF= 400.020009079411
##$SI= 131072
##$SIGF1= 0
##$SIGF2= 0
##$SINO= 400
##$SIOLD= 131072
##$SPECTYP= <>
##$SREGLST= <1H.CDCl3>
##$SSB= 0
##$STSI= 131072
##$STSR= 0
##$SW_p= 8223.68421052631
##$SYMM= 0
##$S_DEV= 0
##$TDeff= 65536
##$TDoff= 0
##$TI= <>
##$TILT= no
##$TM1= 0
##$TM2= 0
##$TOPLEV= 0
##$USERP1= <user>
##$USERP2= <user>
##$USERP3= <user>
##$USERP4= <user>
##$USERP5= <user>
##$WDW= 1
##$XDIM= 131072
##$YMAX_p= 453700632
##$YMIN_p= -15218
##$CURPLOT= <Network HP LaserJet P1505>
##$CURPRIN= <$Network HP LaserJet P1505>
##$DFORMAT= <normdp>
##$LAYOUT= <+/1D_H.xwp>
##$LFORMAT= <normlp>
##$PFORMAT= <normpl>
##$SURQMSG= 1
$$ End of Bruker specific parameters
$$ ---------------------------------
##NTUPLES= NMR SPECTRUM
##VAR_NAME=  FREQUENCY,     SPECTRUM/REAL,   SPECTRUM/IMAG
##SYMBOL=    X,             R,               I
##VAR_TYPE=  INDEPENDENT,   DEPENDENT,       DEPENDENT
##VAR_FORM=  AFFN,          ASDF,            ASDF
##VAR_DIM=   131072,        131072,          131072
##UNITS=     HZ,            ARBITRARY UNITS, ARBITRARY UNITS
##FACTOR=    0.0627417313425164, 1,          1
##FIRST=     8223.62146879497, -1194,        -64848
##LAST=      0,             1864,            -65051
##MIN=       0,             -15218,          0
##MAX=       8223.62146879497, 453700632,    0
$$ Real data points
##PAGE= N=1
##DATA TABLE= (X++(R..R)), XYDATA
$$ [...]
63259C19393K046K326K817L405L699L770M017M339M326M291N004O244O770O082
$$ 319393 321439 323765 326582 329987 333686 337456 341473 345812 350138 354429 359433 365677 372447 378529
63245C78529N232N327O100O601O638O757P206P677P996Q506R603J1219J2842J4025
$$ 378529 383761 389088 395188 401789 408427 415184 422390 430067 438063 446569 456172 467391 480233 494258
63231D94258J4826J5715J7020J8528J9790K0642K1175K1326K0859J9805J8650
$$ 494258 509084 524799 541819 560347 580137 600779 621954 643280 664139 683944 702594
63220G02594J7925J7744J7744J7476J6890J6382J6284J6324J5881J4713J3114
$$ 702594 720519 738263 756007 773483 790373 806755 823039 839363 855244 869957 883071
63209H83071J1296R134O605L855O25l697q887j3503j6411j8224k0314k2757k4234
$$ 883071 894367 903501 910106 913961 914586 910889 902002 888499 872088 853864 833550 810793 786559
63196G86559k3947k2576k1126j9640j7507j4505j1091p887n126k513M56L828O949
$$ 786559 762612 740036 718910 699270 681763 667258 656167 648280 643154 640641 641097 644925 651874
63183F51874R154J0592J2028J3871J5928J7960J9928K1538K2151K1573K0516J9961
$$ 651874 661028 671620 683648 697519 713447 731407 751335 772873 795024 816597 837113 857074
63171H57074K0175K0654K0888K0753K0247J9202J7605J5909J4606J3336J0910
$$ 857074 877249 897903 918791 939544 959791 978993 996598 1012507 1027113 1040449 1051359
63160A051359O597J134m041q375j2432j6670k0825k4546k7782l0216l1136l0464
$$ 1051359 1057956 1059090 1055049 1046674 1034242 1017572 996747 972201 944419 914203 883067 852603
63148H52603k9154k7943k6361k3793k0874j8780j7577j6319j4613j3010j1794
$$ 852603 823449 795506 769145 745352 724478 705698 688121 671802 657189 644179 632385
63137F32385j0488q833p417o812o730o453n716m860m361m356m440l912k549j059
$$ 632385 621897 613064 605647 598835 592105 585652 579936 575076 570715 566359 561919 558007 555458 554399
63123E54399l45l73l73NK94J11k71l38J82J433L323N080N576M608L283K767L083
$$ 554399 554054 553681 553308 553313 553607 553718 553447 553109 553291 554724 558047 563127 568703 573311 576594 579361 582444
63106E82444L628M307N454O923Q029Q350Q049P368O409N526N311N853O390O110
$$ 582444 586072 590379 595833 602756 610785 619135 627184 634552 640961 646487 651798 657651 664041 670151
63092F70151N072L982L215K576J997J898K493L120K837J617M21k3p3m51j026q56
$$ 670151 675223 679205 682420 684996 686993 688891 691384 694504 697341 698958 699379 699356 699283 698832 697806 696950
63076F96950M97K199K999K673K197K494L434M386N328O672Q155Q827Q508Q397
$$ 696950 697447 699646 702645 705318 707515 710009 713443 717829 723157 729829 737984 746811 755319 763716
63062G63716R548J1384J2664J3385J4619J6664J8653K0136K1838K4408K7460L0406
$$ 763716 773264 784648 797312 810697 825316 841980 860633 880769 902607 927015 954475 984881
63050I84881L3319L6300L8755M0090M0578M0890M1273M1670M2098M2348M1857
$$ 984881 1018200 1054500 1093255 1133345 1173923 1214813 1256086 1297756 1339854 1382202 1424059
63039A424059M0588L9376L8789L8248L7145L6120L6239L7325L8156L8102L7430
$$ 1424059 1464647 1504023 1542812 1581060 1618205 1654325 1690564 1727889 1766045 1804147 1841577
63028A841577L6205L3897L0184K5126J8542J0154N36r006j7775k6173l4535m2157
$$ 1841577 1877782 1911679 1941863 1966989 1985531 1995685 1996221 1987215 1969440 1943267 1908732 1866575
63016A866575m7966n1632n3556n4099n3170n0532m6310m1172l5904l0621k4736
$$ 1866575 1818609 1766977 1713421 1659322 1606152 1555620 1509310 1468138 1432234 1401613 1376877
63005A376877j7983j1172n325l54M764J0562J6540K2103K7254L2083L6158L8916
$$ 1376877 1358894 1347722 1342397 1342043 1346807 1357369 1373909 1396012 1423266 1455349 1491507 1530423
62993A530423M0351M1063M1711M2573M3436M3842M3520M2593M1283L9603L7484
$$ 1530423 1570774 1611837 1653548 1696121 1739557 1783399 1826919 1869512 1910795 1950398 1987882
62982A987882L4960L1851K7529K1430J3727N160l771j3069k2827l2847m2637n1518
$$ 1987882 2022842 2054693 2082222 2103652 2117379 2122539 2118768 2105699 2082872 2050025 2007388 1955870
62970A955870n8881o4584o8970p2216p3879p3358p0658o6505o1925n7815n4480
$$ 1955870 1896989 1832405 1763435 1691219 1617340 1543982 1473324 1406819 1344894 1287079 1232599
62959A232599n1329m7429m2716l8182l4579l1538k8401k5251k2497k0062j7735
$$ 1232599 1181270 1133841 1091125 1052943 1018364 986826 958425 933174 910677 890615 872880
62948H72880j5795j4491j3392j2033j0704r752q692p027n470n126n805o310o250
$$ 872880 857085 842594 829202 817169 806465 796713 788021 780994 775524 770398 764593 758283 752033
62935G52033o276o642o787o518o416o782p179p231p003o493n666n065n286n748
$$ 752033 745757 739115 732328 725810 719394 712612 705433 698202 691199 684706 679040 673975 668689 662941
62921F62941n137l402k148k549l875m705m617m091l539l191l289l761m055l886
$$ 662941 657804 654402 652254 649705 645830 641125 636508 632417 628878 625687 622398 618637 614582 610696
62907F10696l719m132n031n816n967n269l880k341j179m05K25O08N59M53Q58J508
$$ 610696 606977 602845 597814 591998 586031 580762 576882 574541 573362 572957 573182 573790 574349 574802 575660 577168
62891E77168J565R00K09j97p12j380j655j516j756k637l344l255k866k801k796
$$ 577168 578733 579633 579842 579645 578933 577553 575898 574382 572626 569989 566645 563390 560524 557723 554927
62876E54927k385j731j108k95P72J445J207N14P5j62n52q53o04n5M9n88j620k576
$$ 554927 552542 550811 549703 549408 550180 551625 552832 553346 553421 553259 552707 551854 551250 551195 551244 550656 549036 546460
62858E46460l091k968k424k045k084k182k060k029k366k767k838k693k577k357
$$ 546460 543369 540401 537977 535932 533848 531666 529606 527577 525211 522444 519606 516913 514336 511979
62844E11979j921j668k005k715l287l615l851l889l482k666j746j011o51p09r19
$$ 511979 510058 508390 506385 503670 500383 496768 492917 489028 485546 482880 481134 480123 479472 478763 477844
62829D77844j002j157j735k380k311j616j360k016k667k423j764j622j934k010
$$ 477844 476842 475685 473950 471570 469259 467643 466283 464267 461600 459177 457413 455791 453857 451847
62815D51847j819j856k086j988j515j158j080q85l43K77O52Q28J089J665K547
$$ 451847 450028 448172 446086 444098 442583 441425 440345 439460 439117 439394 440046 440874 441963 443628 446175
62800D46175L414L926M209M778N833P019Q002Q896R807J0522J0928J1351J2136
$$ 446175 449589 453515 457724 462502 468335 475354 483356 492252 502059 512581 523509 534860 546996
62787E46996J3234J4438J5612J6539J7172J8156K0370K3677K6916K9527L2332
$$ 546996 560230 574668 590280 606819 623991 642147 662517 686194 713110 742637 774969
62776G74969L6141M0481M4481M8228N2343N6793O1003O4746O7993P0226P0649
$$ 774969 811110 851591 896072 944300 996643 1053436 1114439 1179185 1247178 1317404 1388053
62765A388053O8914O5059N9119N1382M2615L3312K3097J1478j203j4137k6771
$$ 1388053 1456967 1522026 1581145 1632527 1675142 1708454 1731551 1743029 1741826 1727689 1700918
62754A700918l8462m8015n4659n9111o2716o5693o7212o6910o5384o3242o0615
$$ 1700918 1662456 1614441 1559782 1500671 1437955 1372262 1305050 1238140 1172756 1109514 1048899
62743A048899n7647n4602n1404m7764m3873m0279l7076l3826l0371k7048k4085
$$ 1048899 991252 936650 885246 837482 793609 753330 716254 682428 652057 625009 600924
62732F00924k1379j8932j6922j5264j3615j1953j0635r740q833p483n746m121
$$ 600924 579545 560613 543691 528427 514812 502859 492224 482484 473651 466168 460422 456301
62720D56301l208l285l865l858k569n10J141J791J860K118L019M559O418Q226
$$ 456301 453093 449808 445943 442085 439516 439006 440147 441938 443798 445916 448935 453494 459912 468138
62706D68138R946J1882J4171J6481J8467K0229K2162K4564K7604L1327L5497L9784
$$ 468138 478084 489966 504137 520618 539085 559314 581476 606040 633644 664971 700468 740252
62694G40252M4249M9178N4341N8976O2794O6259O9582P2215P3774P4544P4398
$$ 740252 784501 833679 888020 946996 1009790 1076049 1145631 1217846 1291620 1366164 1440562
62683A440562P2064O6431N7958M7892L6628K3823R734m592j8331l1188m2877n2993
$$ 1440562 1512626 1579057 1637015 1684907 1721535 1745358 1755092 1750500 1732169 1700981 1658104 1605111
62671A605111o1364o7894p2264p4319p4480p3324p1052o7904o4489o1120n7345
$$ 1605111 1543747 1475853 1403589 1329270 1254790 1181466 1110414 1042510 978021 916901 859556
62660H59556n2859m8289m4317m0615l6563l2452k9002k6177k3483k1025j9215
$$ 859556 806697 758408 714091 673476 636913 604461 575459 549282 525799 504774 485559
62649D85559j7808j6288j4788j3664j2570j1091r836r614r952r742r056q820q905
$$ 485559 467751 451463 436675 423011 410441 399350 389514 379900 369948 360206 351150 342330 333425
62636C33425q184o574n349n095m856l857k759k464k802k983k640j849r20m44q41
$$ 333425 325241 318667 313318 308223 303367 299510 296751 294287 291485 288502 285862 284013 283093 282649 281808
62621B81808j584j670j034n68o12m82K20Q55Q44N41N22Q12J294K101L075L597
$$ 281808 280224 278554 277520 276952 276340 275858 276078 276933 277777 278318 278840 279652 280946 283047 286122 289719
62605B89719L473L366L876M777N476N807O044O685Q276J0840J3453J5128J6206
$$ 289719 293192 296558 300434 305211 310687 316494 322538 329223 337499 348339 361792 376920 393126
62592C93126J7902K0457K2810K4422K6125K8649L1417L3547L5046L6269L6942
$$ 393126 411028 431485 454295 478717 504842 533491 564908 598455 633501 669770 706712
62581G06712L6579L5112L2421K8011K1963J5447R421L416l363j0373j6263k0686
$$ 706712 743291 778403 810824 838835 860798 876245 885666 889082 885719 875346 859083 838397
62569H38397k4433k7891l0423l1433l1162l0193k8821k7224k5669k4249k2724
$$ 838397 813964 786073 755650 724217 693055 662862 634041 606817 581148 556899 534175
62558E34175k0876j8839j6914j5176j3492j1864j0595r978r881r756r202q327
$$ 534175 513299 494460 477546 462370 448878 437014 426419 416441 406560 396804 387602 379275
62546C79275p508o978o752o746o682o205n398m878m973n155m775l993l333k683
$$ 379275 371767 364789 358037 351291 344609 338404 333006 328128 323155 318000 313225 309232 305899 303216
62532C03216j574k55N25P62J294K499L789M653N355O228P019P377P453P697Q457
$$ 303216 301642 301387 301912 302674 303968 306467 310256 314909 320264 326492 333511 340888 348341 356038 364495
62517C64495R870J1665J3075J3693J4410J6640K0406K4181K6922K9275L2238L5594
$$ 364495 374365 386030 399105 412798 427208 443848 464254 488435 515357 544632 576870 612464
62505F12464L8444M0557M2255M3420M3455M2070L9414L5598L0533K4220J6841
$$ 612464 650908 691465 733720 777140 820595 862665 902079 937677 968210 992430 1009271
62494A009271Q715L78p574j4900k1688k7680l2140l4726l6078l7098l7900l7878
$$ 1009271 1017986 1018364 1010790 995890 974202 946522 914382 879656 843578 806480 768580 730702
62482G30702l6615l4304l1426k8351k5282k2334j9635j7312j5357j3559j1794
$$ 730702 694087 659783 628357 600006 574724 552390 532755 515443 500086 486527 474733
62471D74733j0254r143q267p243o050n049m455m077l511k429q67N92J243J129
$$ 474733 464479 455336 447069 439826 433776 428727 424272 420195 416684 414255 413388 413980 415223 416352
62457D16352J059J447J787J806K312M002O071P171P266P407P981Q492Q817R304
$$ 416352 417411 418858 420645 422451 424763 428765 434836 442007 449273 456680 464661 473153 481970 491274
62443D91274R689R214P894O486N107L176O51j936m697q064j1240j2690j2558j2777
$$ 491274 500963 510177 518071 524557 529664 532840 533491 531555 526858 518794 507554 494864 482306 469529
62429D69529j4119j4952j3841j1772j0553j0308r902q875p661o578n671n032m477
$$ 469529 455410 440458 426617 414845 404292 393984 384082 375207 367546 360968 355297 350265 345788
62416C45788l456j905m87M34J234K035K398K503L326M877N707N162M736N934P963
$$ 345788 342332 340427 339940 340374 341608 343643 346041 348544 351870 356747 362454 367616 372352 378286 386249
62401C86249R054R053R156R726R963R278P695N326K606O44N4m4q19k053k811l183
$$ 386249 395303 404356 413512 423238 433201 442479 450174 455500 458106 458750 458804 458760 457941 455888 453077 449894
62385D49894l994n165n784n604n219m891m342l559k751j656J08K184L925N473
$$ 449894 445900 440735 434951 429347 424128 419237 414895 411336 408585 406929 407037 409221 413146 418619
62371D18619P427R766J2041J4324J6937J9567K1805K4210K7626L1707L5325L8282
$$ 418619 426046 435812 447853 462177 479114 498681 520486 544696 572322 604029 639354 677636
62359F77636M1380M4904M8306N1293N4004N6052N6561N5214N2120M6815L8727
$$ 677636 719016 763920 812226 863519 917523 973575 1030136 1085350 1137470 1184285 1223012
62348A223012K8665J8418Q781o65r604j6550k0963k4391k8538l3280l7383m0223
$$ 1223012 1251677 1270095 1278876 1278211 1268607 1252057 1231094 1206703 1178165 1144885 1107502 1067279
62336A067279m1861m2303m1725m0808l9911l8325l5286l1338k7896k5626k4023
$$ 1067279 1025418 983115 941390 900582 860671 822346 787060 755722 727826 702200 678177
62325F78177k2484k0989j9691j8495j7310j6239j5238j3919j2020r886q159p045
$$ 678177 655693 634704 615013 596518 579208 562969 547731 533812 521792 511906 503747 496702
62313D96702o179n231m236l158j648K71J619J321l83k087k894l220l744m389m755
$$ 496702 490523 485292 481056 477898 476250 476521 478140 479461 479078 476991 474097 470877 467133 462744 457989
62298D57989m882n009n091m974m670m056k867j334k27J88N88J445K238K411K457
$$ 457989 453107 448098 443007 438033 433363 429307 426440 425106 424879 425067 425655 427100 429338 431749 434206
62283D34206L182M547N943P110Q025Q447Q428Q641R394R973R850R801J0656J1694
$$ 434206 437388 441935 447878 454988 463013 471460 479888 488529 497923 507896 517746 527547 538203 549897
62269E49897J1677J1036J1482J3552J6048J7916J9419K1183K3378K6087K9492
$$ 549897 561574 572610 584092 597644 613692 631608 651027 672210 695588 721675 751167
62258G51167L3336L7078M0777M4962M9458N3158N5148N5285N3522M9426M2703
$$ 751167 784503 821581 862358 907320 956778 1009936 1065084 1120369 1173891 1223317 1266020
62247A266020L3628K2919J1718J408p336j5190k3079l0517l6162l9813m2766m5892
$$ 1266020 1299648 1322567 1334285 1335693 1328357 1313167 1290088 1259571 1223409 1183596 1140830 1094938
62235A094938m8503m9459m8476m6024m2647l8846l5011l1194k7360k3898k1234
$$ 1094938 1046435 996976 948500 902476 859829 820983 785972 754778 727418 703520 682286
62224F82286j9017j6462j3537j0948q985p262n711m798m589m467m089l714l384
$$ 682286 663269 646807 633270 622322 613337 606075 600364 595566 590977 586510 582421 578707 575323
62211E75323k645j492o47m58l11L33J082J312J165J303K128L656N669P627Q909
$$ 575323 572678 571186 570539 570081 569770 570103 571185 572497 573662 574965 577093 580749 586418 594045 602954
62196F02954R532J0288J1876J4164J6575J8799K0903K3010K5090K6925K8298K9330
$$ 602954 612486 622774 634650 648814 665389 684188 705091 728101 753191 780116 808414 837744
62184H37744L0376L1203L0633K7663K2724J7236J2143P513L405K23j828k890k976
$$ 837744 868120 899323 929956 957619 980343 997579 1009722 1017235 1020640 1020863 1019035 1016145 1013169
62171A013169j913L28L691Q191J3432J8346K2278K5906L0141L4431L7203L7666
$$ 1013169 1011256 1011584 1015275 1023466 1036898 1055244 1077522 1103428 1133569 1168000 1205203 1242869
62159A242869L6061L2440K6630J9458J2565O798J886k268n319p702j0631j4446
$$ 1242869 1278930 1311370 1338000 1357458 1370023 1376821 1378707 1376439 1371120 1363418 1352787 1338341
62147A338341j8162k1049k3415k5458k6639k6698k6086k4859k2456j9102j6100
$$ 1338341 1320179 1299130 1275715 1250257 1223618 1196920 1170834 1145975 1123519 1104417 1088317
62136A088317j4104j2385j0547r561j0068j0902j0587r283q104p307o377n213
$$ 1088317 1074213 1061828 1051281 1041720 1031652 1020750 1010163 1000880 992776 985469 979092 973879
62124I73879m064k776j109N49J671K426L338M560O141Q337J0910J2717J2894J2060
$$ 973879 969815 967039 965930 966479 968150 970576 973914 978474 984615 992952 1003862 1016579 1029473 1041533
62110A041533J1543J1840J2579J3484J4490J5323J5772J6172J6974J8158J9575
$$ 1041533 1053076 1064916 1077495 1090979 1105469 1120792 1136564 1152736 1169710 1187868 1207443
62099A207443K1464K4014K6901K9789L2858L6177L9139M1174M2484M3376M3481
$$ 1207443 1228907 1252921 1279822 1309611 1342469 1378646 1417785 1458959 1501443 1544819 1588300
62088A588300M2505M1226M0852M1712M3478M6218N0166N4588N7888N9015N8098
$$ 1588300 1630805 1672031 1712883 1754595 1798073 1844291 1894457 1949045 2006933 2065948 2124046
62077B124046N5825N2872M9898M7291M4816M2025L9114L6869L5816L5798L6417
$$ 2124046 2179871 2232743 2282641 2329932 2374748 2416773 2455887 2492756 2528572 2564370 2600787
62066B600787L7393L8430L9144L9246L8730L7911L7278L7008L6466L4515L0644
$$ 2600787 2638180 2676610 2715754 2755000 2793730 2831641 2868919 2905927 2942393 2976908 3007552
62055C007552K5521K0388J6223J3474J2035J1167R965Q287O796N957N509N178
$$ 3007552 3033073 3053461 3069684 3083158 3095193 3106360 3116325 3124612 3131408 3137365 3142874 3148052
62043C148052N226N943P223R020J1640J5089J8757K2172K5414K8366L0389L1398
$$ 3148052 3153278 3159221 3166444 3175464 3187104 3202193 3220950 3243122 3268536 3296902 3327291 3358689
62031C358689L2445L4407L6612L7662L7143L5688L3791L1486K8938K6419K3732
$$ 3358689 3391134 3425541 3462153 3499815 3536958 3572646 3606437 3637923 3666861 3693280 3717012
62020C717012K0369J6310J2149Q537N810L961K543R12j080k806l714l992m104
$$ 3717012 3737381 3753691 3765840 3774377 3780187 3784148 3786691 3787603 3786523 3783717 3780003 3776011 3771907
62007C771907m097l813l267k321m98K307N408Q154J0596J2873J4542J5310J5741
$$ 3771907 3767810 3763997 3760730 3758409 3757911 3760218 3765626 3773780 3784376 3797249 3811791 3827101 3842842
61994C842842J6324J6218J3968R278L269k782q161j2303j4654j5109j4172j2515
$$ 3842842 3859166 3875384 3889352 3898630 3901899 3899117 3890956 3878653 3863999 3848890 3834718 3822203
61982C822203j0682q912o956m396j607J70K53m73o78k52j30q77k289m095o150
$$ 3822203 3811521 3802609 3795653 3791257 3789650 3789820 3790073 3789600 3788922 3788670 3788540 3787663 3785374 3781279 3775129
61967C775129q168j0022j2172j5031j8110k0488k2002k3214k4426k5531k6642
$$ 3775129 3766961 3756939 3744767 3729736 3711626 3691138 3669136 3645922 3621496 3595965 3569323
61956C569323k8008k9332l0001l0002k9884k9801k9226k7718k5402k2709k0147
$$ 3569323 3541315 3511983 3481982 3451980 3422096 3392295 3363069 3335351 3309949 3287240 3267093
61945C267093j8149j6496j4124j0216n468j455J251L494O075Q685J0587J1646
$$ 3267093 3248944 3232448 3218324 3208108 3202640 3201185 3202436 3205930 3212005 3220690 3231277 3242923
61933C242923J2314J3059J4118J5437J6605J7171J7163J7014J6872J6343J5100
$$ 3242923 3255237 3268296 3282414 3297851 3314456 3331627 3348790 3365804 3382676 3399019 3414119
61922C414119J3583J2900J4091J7424K2460K8813L6747M6638N8031O9842Q1719
$$ 3414119 3427702 3440602 3454693 3472117 3494577 3523390 3560137 3606775 3664806 3734648 3816367
61911C816367R4567J09371J26186J44641J64812J86990K11295K38257K69338L06003
$$ 3816367 3910934 4020305 4146491 4291132 4455944 4642934 4854229 5092486 5361824 5667827
61901E667827L48624L96854M50537N09212N70866O31776O87126P30656P53782
$$ 5667827 6016451 6413305 6863842 7373054 7943920 8575696 9262822 9993478 10747260
61892A0747260P46118O97733O01746M56825K69716N6107j62390l64157n32796
$$ 10747260 11493378 12191111 12792857 13249682 13519398 13575505 13413115 13048958 12516162
61883A2516162o59251p41451p82670p89362p69198p30003o79108o22489n64255
$$ 12516162 11856911 11115460 10332790 9543428 8774230 8044227 7365119 6742630 6178375
61874F178375n07143m53162m03448l58073l16767k79689k47049k18427j93107
$$ 6178375 5671232 5218070 4814622 4456549 4139782 3860093 3613044 3394617 3201510
61865C201510j70756j51132j33557j17379j02656q9612p7822o6610n5862m5703
$$ 3201510 3030754 2879622 2746065 2628686 2526030 2436418 2358596 2291986 2236124 2190421
61855B190421l5836k6076j7059r427k799L437Q732J2127J4020J5701J7117J6614
$$ 2190421 2154585 2128509 2111450 2102023 2099224 2102661 2111393 2123520 2137540 2153241 2170358 2186972
61843B186972J3295Q320L376j068n459r963j4186j7458j9009j8379j5917j2477
$$ 2186972 2200267 2208587 2211963 2210895 2205436 2195473 2181287 2163829 2144820 2126441 2110524 2098047
61831B098047q507l956R36N538R462J2544J4139J3367J0229N681L46n998j3350
$$ 2098047 2089540 2085584 2086520 2092058 2101520 2114064 2128203 2141570 2151799 2157480 2157826 2151828 2138478
61818B138478k0749k7059l1892l5356l7452l8148l7609l6012l3405k9878k5560
$$ 2138478 2117729 2090670 2058778 2023422 1985970 1947822 1910213 1874201 1840796 1810918 1785358
61807A785358k0383j4296p806j830L172P599J2258J7719K3939L0219L5792M0780
$$ 1785358 1764975 1750679 1742873 1741043 1744215 1751814 1764072 1781791 1805730 1835949 1871741 1912521
61795A912521M6176N2437N8773O4490P0379P7637Q6019R4325J02431J11466J22025
$$ 1912521 1958697 2011134 2069907 2134397 2204776 2282413 2368432 2462757 2565188 2676654 2798679
61784B798679J33752J46749J61993J80070K00804K24530K52437K85138L22202
$$ 2798679 2932431 3079180 3241173 3421243 3622047 3846577 4099014 4384152 4706354
61775D706354L63783M11588M67532N32394O06545O90859P85766Q89868J000092
$$ 4706354 5070137 5481725 5949257 6481651 7088196 7779055 8564821 9454689 10454781
61766A0454781J112338J220930J317541J390868J426619J407530J315601J137830
$$ 10454781 11567119 12788049 14105590 15496458 16923077 18330607 19646208 20784038
61758B0784038Q72824N34115J48928k46533o14249r22693j153187j301297j373746
$$ 20784038 21656862 22190977 22339905 22093372 21479123 20556430 19403243 18101946 16728200
61749A6728200j383647j346316j276264j185727j084641r81008q80676p86888
$$ 16728200 15344553 13998237 12721973 11536246 10451605 9470597 8589921 7803033
61741G803033p00648o21968n50945m87945m32980l85095l42665l04490k70406
$$ 7803033 7102385 6480417 5929472 5441527 5008547 4623452 4280787 3976297 3705891
61732C705891k40608k14707j91921j71776j53976j37803j22503j08269r6087q6507
$$ 3705891 3465283 3250576 3058655 2886879 2732903 2595100 2472597 2364328 2268241 2181734
61722B181734p9134p3319o8604o4444o0388n6699n4038n2278n0351m7482m3926
$$ 2181734 2102600 2029281 1960677 1896233 1835845 1779146 1725108 1672830 1622479 1574997 1531071
61711A531071m0273l6709l3274l0082k6987k3688k0450j8046j6663j5527j4046
$$ 1531071 1490798 1454089 1420815 1390733 1363746 1340058 1319608 1301562 1284899 1269372 1255326
61700A255326j2617j1914j1973j2390j2883j3263j3334j3266j3616j4631j5893
$$ 1255326 1242709 1230795 1218822 1206432 1193549 1180286 1166952 1153686 1140070 1125439 1109546
61689A109546j6896j7516j7711j7392j6789j6377j6206j5838j5185j4755j4739
$$ 1109546 1092650 1075134 1057423 1040031 1023242 1006865 990659 974821 959636 944881 930142
61678I30142j4581j3784j2566j1283r898q455p473p285p386o955n718l978k199
$$ 930142 915561 901777 889211 877928 868030 859575 852102 844817 837431 830476 824758 820780 818581
61665H18581p92K4M66R06J220Q81l3o19k12Q22J746K373K957L612M216M612M667
$$ 818581 817789 817813 818279 819185 820405 821286 821253 820634 820422 821244 822990 825363 828320 831932 836148 840760 845427
61648H45427M406M217M476M947M979M319L241J889J42j787l350m332m900m937
$$ 845427 849833 854050 858526 863473 868452 872771 876012 877901 878043 876256 872906 868574 863674 858737
61634H58737m145k847j747q26O45K744M609N744O584P394P664P111O323N778N106
$$ 858737 854592 851745 849998 849172 849817 852561 857170 862914 869498 876892 884556 891667 897990 903768 908874
61619I08874L868K178P1k727n772p676p704o762n992n312m213l124k852l272l633
$$ 908874 912742 914920 914991 912264 906492 898816 891112 884350 878358 873046 868833 865709 862857 859585 855952
61604H55952l651l459k957k201j943k753l967m485m326m489n428o577p275p391
$$ 855952 852301 848842 845885 843684 841741 838988 835021 830536 826210 821721 816293 809716 802441 795050
61590G95050p008o221n314m557l887l071k177j436q10k0J044K235L342M295N389
$$ 795050 788042 781821 776507 771950 768063 764992 762815 761379 760569 760549 761593 763828 767170 771465 776854
61575G76854P223R949J2672J4260J4843J5689J7480J9670K1804K4354K7540L0413
$$ 776854 784077 794026 806698 820958 835801 851490 868970 888640 910444 934798 962338 992751
61563I92751L2056L2894L3855L4833L5032L4382L3570L2905L2002L0574K8869
$$ 992751 1024807 1057701 1091556 1126389 1161421 1195803 1229373 1262278 1294280 1324854 1353723
61552A353723K7370K6421K5978K5427K4049K1830J9407J6985J4016J0236O153
$$ 1353723 1381093 1407514 1433492 1458919 1482968 1504798 1524205 1541190 1555206 1565442 1571595
61541A571595K088k353p268j1848j5549j8880k2174k4518k5022k4381k3888k3458
$$ 1571595 1573683 1571330 1564062 1552214 1536665 1517785 1495611 1471093 1446071 1421690 1397802 1374344
61529A374344k1965j9187j6142j3573j1287q944o532l927q11K794O525J0165J3734
$$ 1374344 1352379 1333192 1317050 1303477 1292190 1283246 1276714 1272787 1271976 1274770 1281295 1291460 1305194
61516A305194J7299K1138K5770L1286L7059M2684M8778N6163O4778P4122Q4343
$$ 1305194 1322493 1343631 1369401 1400687 1437746 1480430 1529208 1585371 1650149 1724271 1808614
61505A808614R5980J09003J23037J38313J55462J74421J94302K14205K33435K50859
$$ 1808614 1904594 2013597 2136634 2274947 2430409 2604830 2799132 3013337 3246772 3497631
61495C497631K64691K72786K72790K62400K40226K06438J62399J10236N3310l628
$$ 3497631 3762322 4035108 4307898 4570298 4810524 5016962 5179361 5289597 5342907 5339279
61485E339279n5879j00585j36793j64363j83483j94814j99256j97644j91091j81117
$$ 5339279 5283400 5182815 5046022 4881659 4698176 4503362 4304106 4106462 3915371 3734254
61475C734254j68909j54905j39577j23928j08668r3642p8870o5206n3014m1050
$$ 3734254 3565345 3410440 3270863 3146935 3038267 2944625 2865755 2800549 2747535 2706485
61465B706485k7980j4430k199Q059J7113K5533L3248M0437M7443N3780N8449O1278
$$ 2706485 2678505 2664075 2661876 2669935 2687048 2712581 2745829 2786266 2833709 2887489 2945938 3007216
61453C007216O2773O2887O1218N8402N5868N4019N1915M9104M6520M5106M4631
$$ 3007216 3069989 3132876 3194094 3252496 3308364 3362383 3414298 3463402 3509922 3555028 3599659
61442C599659M4403M4364M4755M5361M5625M5174M3963M2130L9839L7004L3305
$$ 3599659 3644062 3688426 3733181 3778542 3824167 3869341 3913304 3955434 3995273 4032277 4065582
61431D065582K8780K4096J9693J4965R058K130m932j1803j8785k5714l1802l6599
$$ 4065582 4094362 4118458 4138151 4153116 4162174 4164304 4159372 4147569 4128784 4103070 4071268 4034669
61419D034669m0336m3082m4413m4034m2256l9641l6590l3148k8882k3254j6626
$$ 4034669 3994333 3951251 3906838 3862804 3820548 3780907 3744317 3711169 3682287 3659033 3642407
61408C642407j0463n932k705J31K394K979J410j731n721j0196j4872j9542k4201
$$ 3642407 3631944 3626012 3623307 3623438 3625832 3628811 3630221 3628490 3622769 3612573 3597701 3578159 3553958
61395C553958k8463l1091l0993k8355k4052j8292j0706j318R620K2388L7235N3433
$$ 3553958 3525495 3494404 3463411 3435056 3411004 3392712 3382006 3380688 3390308 3412696 3449931 3503364
61383C503364P0034Q7350J06528J27828J50564J74386J99234K24064K46996K66848
$$ 3503364 3573398 3660748 3767276 3895104 4045668 4220054 4419288 4643352 4890348 5157196
61373E157196K83207K94917K99758K95735K81447K55315K16238J65835J08922
$$ 5157196 5440403 5735320 6035078 6330813 6612260 6867575 7083813 7249648 7358570
61364G358570N1087l678n3142r6265j33194j64851j91843k14160k31882k45207
$$ 7358570 7409657 7405979 7352837 7256572 7123378 6958527 6766684 6552524 6320642 6075435
61354F075435k53691k56558k54126k48038k39810k29991k18794k06562j93391
$$ 6075435 5821744 5565186 5311060 5063022 4823212 4593221 4374427 4167865 3974474
61345C974474j79250j64783j51060j38354j26033j13699j01489q9260p6714o4402
$$ 3974474 3795224 3630441 3479381 3341027 3214994 3101295 2999806 2910546 2833832 2769430
61335B769430n3337m3328l2999k1818j0918j388P095J5375K3565L1223L7934M3288
$$ 2769430 2716093 2672765 2639766 2617948 2607030 2605642 2612737 2628112 2651677 2682900 2720834 2764122
61323B764122M7034M9586N1569N2815N2662N1242M9348M7017M3539L9035L4613
$$ 2764122 2811156 2860742 2912311 2965126 3017788 3069030 3118378 3165395 3208934 3247969 3282582
61312C282582L0732K6879K3124K0401J8699J6609J3436J0148P412M185o33o454
$$ 3282582 3313314 3340193 3363317 3383718 3402417 3419026 3432462 3442610 3450022 3454207 3453574 3447120
61300C447120j2046j7175k2099k6518l0238l3892l7932m1663m4406m6711m9354
$$ 3447120 3435074 3417899 3395800 3369282 3339044 3305152 3267220 3225557 3181151 3134440 3085086
61289C085086n1891n3315n3492n2845n1302m8573m4946m0801l5948l0370k4977
$$ 3085086 3033195 2979880 2926388 2873543 2822241 2773668 2728722 2687921 2651973 2621603 2596626
61278B596626k0575j6677j2392p952m405k166r59p98j901l847n790p364q630r364
$$ 2596626 2576051 2559374 2546982 2539030 2534625 2532459 2531500 2530702 2528801 2524954 2519164 2511800 2503170 2493806
61264B493806r220q347p167n703l843k008q02j49O01J921M123P894J4115K3065
$$ 2493806 2484586 2476239 2469072 2463369 2459526 2457518 2456716 2456567 2457168 2459089 2463212 2471106 2485221 2508286
61250B508286L4168M6508N9305P2124Q4896R7520J09324J19287J26832J31664
$$ 2508286 2542454 2588962 2648267 2720391 2805287 2902807 3012131 3131418 3258250 3389914
61240C389914J32532J27017J13173R0902O1362K5931j3401n3321r0008j20780
$$ 3389914 3522446 3649463 3762636 3853538 3914900 3940831 3927430 3874109 3784101 3663321
61230C663321j44459j60639j69346j71352j68054j60859j50909j39209j26754
$$ 3663321 3518862 3358223 3188877 3017525 2849471 2688612 2537703 2398494 2271740
61221B271740j14523j03357r3515q4406p5239o6052n7640n0401m3996l8207l3340
$$ 2271740 2157217 2053860 1960345 1875939 1800700 1734648 1677008 1626607 1582611 1544404 1511064
61210A511064k9460k5952k2261j8379j4337r958n491j653J407M464Q074J1783
$$ 1511064 1481604 1455652 1433391 1415012 1400675 1390717 1385226 1383573 1384980 1389444 1397518 1409301
61198A409301J4925J7511J9775K1544K2510K2613K1712J9553J6456J3347J0778
$$ 1409301 1424226 1441737 1461512 1483056 1505566 1528179 1549891 1569444 1585900 1599247 1610025
61187A610025Q530O389M424K276o90m105o628p784q719j0441j2483j4112j5647
$$ 1610025 1618555 1624944 1629368 1631644 1630954 1626849 1620221 1612437 1603718 1593277 1580794 1566682 1551035
61174A551035j7609j9557k0926k2170k3933k5747k6740k6963k7068k7186k7192
$$ 1551035 1533426 1513869 1492943 1470773 1446840 1421093 1394353 1367390 1340322 1313136 1285944
61163A285944k7524k8679l0228l1194l1150l0264k8830k7339k6391k5825k4628
$$ 1285944 1258420 1229741 1199513 1168319 1137169 1106905 1078075 1050736 1024345 998520 973892
61152I73892k2424k0215j8901j7951j6630j5607j6071j7819j9490k0269k0188
$$ 973892 951468 931253 912352 894401 877771 862164 846093 828274 808784 788515 768327
61141G68327j9234j7360j5178j3505j2331j1081r575p906n832l268r82J95N90
$$ 768327 749093 731733 716555 703050 690719 679638 670063 662157 656325 653057 652075 652270 652860
61128F52860J193K316L614M979O346P055O588N718N813P120Q702R903J0802J1417
$$ 652860 654053 656369 659983 664962 671308 678363 684951 690669 696482 703602 712304 722207 733009 744426
61114G44426J1519J1327J1438J1988J2590J3039J3331J3172J2299J1237J0839
$$ 744426 755945 767272 778710 790698 803288 816327 829658 842830 855129 866366 877205
61103H77205J0985J0511Q549N463K272l11k288m081n914p344p714p177o721o982
$$ 877205 888190 898701 907250 912713 914985 914674 912386 908305 902391 895047 887333 880156 873435 866453
61089H66453p626q186q767r443r859r977j0427j1417j2072j1661j0751j0337j0504
$$ 866453 858827 850641 841874 832431 822572 812595 802168 790751 778679 767018 756267 745930 735426
61076G35426j0724j0775j0450r182o985n093m593m952m876m091l224k500j706
$$ 735426 724702 713927 703477 694295 687310 682217 677624 672672 667796 663705 660481 657981 656275
61063F56275j009p70p76n56j06L79R84J593J576P69P5K42Q15J118J408K030K377
$$ 656275 655266 654496 653720 653164 653058 653437 654421 656014 657590 658359 658434 658676 659491 660609 662017 664047 666424
61046F66424J873J161J146J551J703J872K585L356L527L691M840O669Q149R137
$$ 666424 668297 669458 670604 672155 673858 675730 678315 681671 685198 688889 693729 700398 708547 717684
61032G17684J0093J0834J1028J1306J2411J3779J4389J4432J4690J4929J4448
$$ 717684 727777 738611 749639 760945 773356 787135 801524 815956 830646 845575 860023
61021H60023J3678J3575J4008J4231J4413J5164J6100J6489J6734J7663J8995
$$ 860023 873701 887276 901284 915515 929928 945092 961192 977681 994415 1012078 1031073
61010A031073K0099K1538K4145K7374L0288L3337L7260M1219M4043M6355M9249
$$ 1031073 1051172 1072710 1096855 1124229 1154517 1187854 1225114 1266333 1310376 1356731 1405980
60999A405980N1972N3475N5254N9872O7425P6330Q6684R9573J13696J26272J37200
$$ 1405980 1457952 1511427 1566681 1626553 1693978 1770308 1856992 1956565 2070261 2196533 2333733
60988B333733J49076J63625J81750K06639K42645K91238L52369M29503N28125
$$ 2333733 2482809 2646434 2828184 3034823 3277468 3568706 3921075 4350578 4878703
60979D878703O49514P92129R59110J156814J385886J644727J940634K270225K562545
$$ 4878703 5528217 6320346 7279456 8436270 9822156 11466883 13407517 15677742 18240287
60970A8240287K656234K384571J724523Q61732Q5903l91358n24972l80149m6055
$$ 18240287 20896521 23281092 25005615 25867347 25953250 25561892 25036920 24656771 24610716
60961B4610716L65121O71731O56522K05935n78837j430360k087035k429802k485946
$$ 24610716 24975837 25647568 26304090 26510025 25931188 24500828 22413793 19983991 17498045
60952A7498045k347656k104293j822714j547607j300955j086812r03275p49166
$$ 17498045 15150389 13046096 11223382 9675775 8374820 7288008 6384733 5635567
60944E635567o21684n15268m25950l53302k96694k52967k18947j93202j74095
$$ 5635567 5013883 4498615 4072665 3719363 3422669 3169702 2950755 2757553 2583458
60935B583458j58746j45081j32963j22355j12360j02578r3558q5242p6806o8623
$$ 2583458 2424712 2279631 2146668 2024313 1911953 1809375 1715817 1630575 1553769 1485146
60925A485146o2600n9877n9525n9873n9784n8422n5319n1161m7152m3434l9296
$$ 1485146 1422546 1362669 1303144 1243271 1183487 1125065 1069746 1018585 971433 927999 888703
60914H88703l4945l1478k9066k6738k4156k2051k0611j9030j7015j5254j4024
$$ 888703 853758 822280 793214 766476 742320 720269 699658 680628 663613 648359 634335
60903F34335j2708j1139j0027r611r228q584q137p803o704m818l468l438l774
$$ 634335 621627 610488 600461 590850 581622 573038 564901 557098 550394 545576 542108 538670 534896
60890E34896l226j810j59J569L318M505M709M380M163M054L839L783M228M954
$$ 534896 531670 529860 529701 531270 534588 539093 543802 548182 552345 556399 560238 564021 568249 573203
60876E73203N383N151M226K898J853J628J840J603Q57M23N09J57j282l009l908
$$ 573203 578586 583737 587963 590861 592714 594342 596182 597785 598642 599065 599574 599731 598449 595440 591532
60861E91532m040m296m997n679n927n710n077m107l085k283j621q86l1R84K436
$$ 591532 587492 583196 578199 572520 566593 560883 555806 551699 548614 546331 544710 543824 543793 544777 547213
60846E47213M452O550P955Q441Q650R548J1490J3696J4653J3393J0479P551N793
$$ 547213 551665 558215 566170 574611 583261 592809 604299 617995 632648 646041 656520 664071 669864
60833F69864N136M993N259O205P686Q926R040P634N059K326O00L85J109J671J465
$$ 669864 675000 679993 685252 691457 699143 708069 717109 724743 729802 732128 732728 733113 734222 735893 737358
60818G37358Q25M85P84J408J827J825J668J758K158K386J784J86j780l255m064
$$ 737358 738183 738668 739452 740860 742687 744512 746180 747938 750096 752482 754266 754452 752672 749417 745353
60803G45353m877o337q248r847j0724j1089j1278j1356j1266j1018j0607r990
$$ 745353 740476 734139 725891 716044 705320 694231 682953 671597 660331 649313 638706 628716
60791F28716r152q126o951n732m627l563k263p55M38J077J751L069M644N662O200
$$ 628716 619564 611438 604487 598755 594128 590565 588302 587547 587985 589062 590813 593882 598526 604188 610388
60776F10388P027Q175Q786Q535Q219Q559R308R933J0313J0274R293P379N569M877
$$ 610388 617415 625590 634376 642911 651130 659689 668997 678930 689243 699517 708810 716189 721758 726635
60762G26635N143N467N345M910M511M371M393L982K787J680K151M203N908N753
$$ 726635 731778 737245 742590 747500 752011 756382 760775 764757 767544 769224 771375 775578 781486 787239
60748G87239M576M215N017N831N952N763N620N243M396L228J795j03k292m054
$$ 787239 791815 796030 801047 806878 812830 818593 824213 829456 833852 837080 838875 838772 836480 832426
60734H32426m795m626m127l724l485l285l172l515m598o096p235p582p362o964
$$ 832426 827631 823005 818878 815154 811669 808384 805212 801697 797099 791003 783768 776186 768824 761860
60720G61860o599o464o646o709n992m500k981j900j065m97p85k074l483m216m636
$$ 761860 755261 748797 742151 735442 729450 724950 721969 720069 719004 718507 717722 715648 712165 707949 703313
60705G03313n542o923q051q390p862o684n476m969n050m566k729j76J916L235
$$ 703313 697771 690848 682797 674407 666545 659861 654385 649416 644366 639800 637071 636895 638811 642046
60691F42046M221N037N507N655N629N274M339K867R80j298l609n211n943o659
$$ 642046 646267 651304 656811 662466 668095 673369 677708 680575 681555 680257 676648 671437 665494 658835
60677F58835q118r905j1064j1315j1042j0513r801q989p975o502m819l688l238
$$ 658835 650717 640812 629748 618433 607391 596878 587077 578088 570113 563611 558792 555104 551866
60664E51866k540r89O74J434J367J161J012Q73J057J611J771J086M28P71J620
$$ 551866 549326 548337 549011 550445 551812 552973 553985 554858 555915 557526 559297 560383 560811 561582 563202
60649E63202J812J380J322J906K489K786L023K966J990K38j357k211k425k105
$$ 563202 565014 566394 567716 569622 572111 574897 577920 580886 582876 583114 581757 579546 577121 575016
60635E75016j226j41O60J299K264L471M311M546M496M464M602N133O220P736R593
$$ 575016 573790 573649 574309 575608 577872 581343 585654 590200 594696 599160 603762 608895 615115 622851 632444
60620F32444J1765J3633J4125J3248J2577J3232J4226J3957J2489J1009R723Q011
$$ 632444 644209 657842 671967 685215 697792 711024 725250 739207 751696 762705 772428 780439
60608G80439O168N218N019M241K379L09j374l237n802q572j0672j1685j1700j1234
$$ 780439 786607 791825 796844 801085 803464 803773 802399 799162 793360 784788 774116 762431 750731 739497
60594G39497j1064j1369j1273j0027q274p080o161m398j829K98J374J908K240
$$ 739497 728433 717064 705791 695764 687490 680410 674249 669851 668022 668320 669694 671602 673842
60581F73842K141J803J803J963J526N76n7l73j175k312k579j750j100j288j276
$$ 673842 675983 677786 679589 681552 683078 683654 683597 683224 682049 679737 677158 675408 674308 673020 671744
60566F71744j36J397K176K335K690L342L755L669L121K139J036N05Q17J323J208
$$ 671744 671608 673005 675181 677516 680206 683548 687303 690972 694093 696232 697268 697773 698590 699913 701121
60551G01121L60p00j266p34R89L135M745N830P201R252J1689J4496J8196K2834
$$ 701121 701481 700781 699515 698781 699770 702905 707650 713480 720681 729933 741622 756118 774314 797148
60537G97148K7519L1315L3862L4902L3888L0375K4287J5839N842m078j2431j9057
$$ 797148 824667 855982 889844 924746 958634 989009 1013296 1029135 1034977 1030899 1018468 999411
60525I99411k4471k8267k9357k7811k5123k2337j9058j4726r743m890n75K929
$$ 999411 974940 946673 917316 889505 864382 842045 822987 808261 798518 793628 793053 795982
60513G95982N405P278R377J1686J3139J3075J2150J1539J2012J3968J7430K1665
$$ 795982 801387 808665 818042 829728 842867 855942 868092 879631 891643 905611 923041 944706
60501I44706K5685K9507L4262M0842M9151N8801O9736Q2075R6011J11922J29822
$$ 944706 970391 999898 1034160 1075002 1124153 1182954 1252690 1334765 1430776 1542698 1672520
60490A672520J48969J68883J90263K13685K37825K60439K80340K96027L02364
$$ 1672520 1821489 1990372 2180635 2394320 2632145 2892584 3172924 3468951 3771315
60481C771315K91398K57764K01859J27633M0038n3911j44133k20467k76558l10231
$$ 3771315 4062713 4320477 4522336 4649969 4690007 4636096 4491963 4271496 3994938 3684707
60471C684707l21921l14611k94201k67453k39061k11156j84786j60688j39172
$$ 3684707 3362786 3048175 2753974 2486521 2247460 2036304 1851518 1690830 1551658
60462A551658j20378j04448r0966p8988o8317n9871n3945m9117m3876l8505l4207
$$ 1551658 1431280 1326832 1235866 1156878 1088561 1028690 974745 925628 881752 843247 809040
60451H09040l1120k8373k5524k2803k0258j7753j5468j3662j2166j0778r687q876
$$ 809040 777920 749547 724023 701220 680962 663209 647741 634079 621913 611135 601448 592572
60439E92572p811o364n286n029m904m257l700m054m840m962m396l981l925l685
$$ 592572 584761 578397 573111 568082 563178 558921 555221 551167 546327 541365 536969 532988 529063 525378
60425E25378l142k786k790k714k164j100L06J651K417K637L034L977M777M651
$$ 525378 522236 519450 516660 513946 511782 510682 510988 512639 515056 517693 520727 524704 529481 534132
60411E34132L855L235L108L294L778M545N117M981M295L661L505L965M833N331
$$ 534132 537987 541222 544330 547624 551402 555947 561064 566045 570340 574001 577506 581471 586304 591635
60397E91635M667L357L074M508O261O689O000N483N478N293M663M039L648L289
$$ 591635 596302 599659 602733 607241 613502 620191 626191 631674 637152 642445 647108 651147 654795 658084
60383F58084K948K763K476J674M10r84k400l705m360m003l057k194j553r79n03
$$ 658084 661032 663795 666271 667945 668355 667371 664971 661266 656906 652903 649846 647652 646099 645120 644617
60368F44617m4P42J684J875R74Q9M37J781L025L766M252M406M077L843M421N490
$$ 644617 644573 645315 646999 648874 649848 649937 650374 652155 655180 658946 663198 667604 671681 675524 679945 685435
60352F85435O094O034N938O164O559P153Q084Q988R250Q841Q220P516O495N129
$$ 685435 691529 697563 703501 709665 716224 723377 731461 740449 749699 758540 766760 774276 780771 785900
60338G85900L636K136Q08L6j28j74k98J22J517L272M734O326Q645J1001J2015
$$ 785900 789536 791672 792480 792516 792388 792214 791916 792038 793555 796827 801561 807887 816532 827533 839548
60323H39548J1375R822P731M842J234k585o457j0376j3576j4888j4187j2568j1010
$$ 839548 850923 860745 868476 873318 874552 871967 865510 855134 841558 826670 812483 799915 788905
60310G88905r670q479p570o870o054n034l987k953j974j460j715k205j995q76
$$ 788905 779235 770756 763186 756316 750262 745228 741241 738288 736314 734854 733139 730934 728939 728063
60296G28063N58J807K776L292L078K268J366P08L70M70J012J604J899K085K469
$$ 728063 728621 730428 733204 736496 739574 741842 743208 743916 744286 744756 745768 747372 749271 751356 753825
60281G53825K777K553K018J856K242K712K925L039L302L708M017L913L357L009
$$ 753825 756602 759155 761173 763029 765271 767983 770908 773947 777249 780957 784974 788887 792244 795253
60267G95253L778N740P878R278J0086J0981J2317J4167J6461J8692K0210K1311
$$ 795253 799031 804771 812649 821927 832013 842994 855311 869478 885939 904631 924841 946152
60255I46152K3141K6019K8889L1048L3396L6993M1487M6021N0722N6130O2039
$$ 946152 969293 995312 1024201 1055249 1088645 1125638 1167125 1213146 1263868 1319998 1382037
60244A382037O8173P5104Q3129R1090R7766J03754J10321J17026J22095J24735
$$ 1382037 1450210 1525314 1608443 1699533 1797299 1901053 2011374 2128400 2250495 2375230
60234B375230J25401J24120J20287J13987J05860R5745Q2989O8193N3086L8564
$$ 2375230 2500631 2624751 2745038 2859025 2964885 3060630 3143619 3211812 3264898 3303462
60224C303462K4139R488m866j8398l0793m1178m8478n2668n4500n4041n0749m5023
$$ 3303462 3327601 3337089 3332223 3313825 3283032 3241854 3193376 3140708 3086208 3032167 2981418 2936395
60212B936395l8134l0501k1435j0749P31J2539K5041L8246N1520O4803P8694R2946
$$ 2936395 2898261 2867760 2846325 2835576 2836307 2848846 2873887 2912133 2963653 3028456 3107150 3200096
60200C200096J06102J17053J25674J31623J33881J32026J26657J18046J05672
$$ 3200096 3306198 3423251 3548925 3680548 3814429 3946455 4073112 4191158 4296830
60191D296830Q9656P1426N2193L1883J0322j1655l3039n3523p2682q9136j01478
$$ 4296830 4386486 4457912 4510105 4541988 4552310 4540655 4507616 4454093 4381411 4292275 4190797
60180D190797j09385j13161j12846j08481j00656r0129p7369o2927m7602l1801
$$ 4190797 4081412 3968251 3855405 3746924 3646268 3556139 3478770 3415843 3368241 3336440
60170C336440j5268K026J9287L5624N0811O4973P7904Q8888R6698R9716R6926
$$ 3336440 3321172 3323198 3342485 3378109 3428920 3493893 3571797 3660685 3757383 3857099 3954025
60159C954025Q9081P8140O5275N0305L3287J5670p89j5405k8254l9082m7195n2019
$$ 3954025 4043106 4121246 4186521 4236826 4270113 4285783 4284994 4269589 4241335 4202253 4155058 4103039
60147D103039n3294n1058m5705l7656k6837j3025L200K0573L8459N7359P7797
$$ 4103039 4049745 3998687 3952982 3915326 3888489 3875464 3878664 3899237 3937696 3995055 4072852
60136D072852R9508J22130J45984J71574J98699K26576K54543K82360L10026L37365
$$ 4072852 4172360 4294490 4440474 4612048 4810747 5037323 5291866 5574226 5884252 6221617
60126F221617L63465L86540M04776M17184M23255M22094M12685L94864L69229
$$ 6221617 6585082 6971622 7376398 7793582 8216837 8638931 9051616 9446480 9815709
60117I815709L36143K95726K48737J96492J39879P9288J5631m9504j14695j78557
$$ 9815709 10151852 10447578 10696315 10892807 11032686 11111974 11127605 11078101 10963406 10784849
60107A0784849k38655k91662l34950l67269l87926l96480l93532l80653l59188
$$ 10784849 10546194 10254532 9919582 9552313 9164387 8767907 8374375 7993722 7634534
60098G634534l30174k95650k58583k20814j82194j42353j02253o3282k5961R483
$$ 7634534 7304360 7008710 6750127 6529313 6347119 6204766 6102513 6039231 6013270 6022753
60088F022753M2072P0601R4586J13874J27711J34865J34437J26236J10930R0195
$$ 6022753 6064825 6135426 6230012 6343886 6471597 6606462 6740899 6867135 6978065 7068260
60078G068260O6078L9931J2552j4589l9381o0804p9682r7143j13265j27894j41666
$$ 7068260 7134338 7174269 7186821 7172232 7132851 7072047 6992365 6895222 6781957 6654063 6512397
60067F512397j55105j67330j76650j82134j83841j82032j76925j69059j59010
$$ 6512397 6357292 6189962 6013312 5831178 5647337 5465305 5288380 5119321 4960311
60058D960311j46904j32660j16544r9216q1363o3516m5828k7894r182J0144K9286
$$ 4960311 4813407 4680747 4564203 4464987 4383624 4320108 4274280 4246386 4237204 4247348 4276634
60047D276634M7842O6133Q4301J01678J17224J30020J39079J43450J42865J37685
$$ 4276634 4324476 4390609 4474910 4576588 4693812 4823832 4962911 5106361 5249226 5386911
60037E386911J27917J13035R3178O9765M4360J7553j0473l8776o5727r0037j11359
$$ 5386911 5514828 5627863 5721041 5790806 5835166 5852719 5842246 5803470 5737743 5647706 5536347
60026E536347j29930j45709j57702j64280j64583j59453j50453j38451j23914
$$ 5536347 5406417 5260708 5103006 4938726 4774143 4614690 4464237 4325786 4201872
60017D201872j08132r2661p7542o1407m3789k6006r323O649K3110M0617N9062
$$ 4201872 4093740 4001079 3923537 3862130 3818341 3792335 3783012 3789661 3812771 3853388 3912450
60006C912450P8204R7585J16676J35577J54745J73498J89638K00997K06564K05842
$$ 3912450 3990654 4088239 4204915 4340492 4495237 4668735 4858373 5059370 5265934 5471776
59996E471776J98230J83795J63766J39519J11778Q1323M9555J7532j4751m7433
$$ 5471776 5670006 5853801 6017567 6157086 6268864 6350187 6399742 6417274 6402523 6355090
59986F355090p9656j09946j37044j59749j76601j86386j88701j83846j72871j57742
$$ 6355090 6275434 6165488 6028444 5868695 5692094 5505708 5317007 5133161 4960290 4802548
59976D802548j40458j21580j00481p7331n3722l0964q992J2453L2830N1708O9510
$$ 4802548 4662090 4540510 4440029 4362698 4308976 4278012 4269020 4281473 4314303 4366011 4435521
59965D435521Q6380J01311J13325J22536J29112J32147J30654J25033J16465J05589
$$ 4435521 4521901 4623212 4736537 4859073 4988185 5120332 5250986 5376019 5492484 5598073
59955E598073R2675P8421O3566M8305L3050J9241Q400P74m246o708n806o95R139
$$ 5598073 5690748 5769169 5832735 5881040 5914090 5933331 5941731 5942505 5938259 5931551 5925745 5925050 5934189
59942E934189K3935M3552O7576R5872J28527J65032K04291K45655K89032L33562
$$ 5934189 5958124 6001676 6069252 6165124 6293651 6458683 6662974 6908629 7197661 7531223
59932G531223L77073M17271M52302M79585M95305M95911M79132M43035L85697
$$ 7531223 7908296 8325567 8777869 9257454 9752759 10248670 10727802 11170837 11556534
59923A1556534L07254K11497J04405p939j19242k22462l11457l82870m35392m68121
$$ 11556534 11863788 12075285 12179690 12171751 12052509 11830047 11518590 11135720 10700328 10232207
59913A0232207m81271m77799m62445m38886m08705l72946l33440k92527k52162
$$ 10232207 9750936 9273137 8810692 8371806 7963101 7590155 7256715 6964188 6712026
59904F712026k13194j75015j36389r7146n8592k1784J3753M8867Q3297J16168
$$ 6712026 6498832 6323817 6187428 6090282 6031690 6009906 6023659 6072526 6155823 6271991
59894F271991J47068J75495J99904K18322K29261K31202K22084K00570J67207
$$ 6271991 6419059 6594554 6794458 7012780 7242041 7473243 7695327 7895897 8063104
59885H063104J23421P0235R278n5647j19550j78502k30048k72192l03553l24187
$$ 8063104 8186525 8256760 8266038 8210391 8090841 7912339 7682291 7410099 7106546 6782359
59875F782359l34962l36429l29365l15909k98749k79400k58313k36179k13894
$$ 6782359 6447397 6110968 5781603 5465694 5166945 4887545 4629232 4393053 4179159
59866D179159j91597j69146j47293j27193j08910r1679p5448o0987m8593l7960
$$ 4179159 3987562 3818416 3671123 3543930 3435020 3343341 3267893 3206906 3158313 3120353
59856C120353k9272k3355k0593k0542k2435k5368k8199l0126l1138l1223k9623
$$ 3120353 3091081 3067726 3047133 3026591 3004156 2978788 2950589 2920463 2889325 2858102 2828479
59845B828479k5788k0469j4865r228l534R86K414Q8n131j2320k0963l0106l8345
$$ 2828479 2802691 2782222 2767357 2758129 2754595 2755581 2757995 2758083 2752952 2740632 2719669 2689563 2651218
59832B651218m4850m9533n2247n2583n0477m6292m0462l3601k6462j9160j1089
$$ 2651218 2606368 2556835 2504588 2452005 2401528 2355236 2314774 2281173 2254711 2235551 2224462
59821B224462k467M864R369J1873J4510J8166K2356K7120L3400M1526N0435N8446
$$ 2224462 2221995 2226859 2236228 2248101 2262611 2280777 2303133 2330253 2363653 2405179 2455614 2514060
59809B514060O3985O6058O5166O3320O1950O0099N5804M8735M0238L1288K1967
$$ 2514060 2578045 2644103 2709269 2772589 2834539 2894638 2950442 2999177 3039415 3070703 3092670
59798C092670J2659M234k940q840j2798j3907j2314q907m042K377R957J8415K8550
$$ 3092670 3105329 3109563 3106623 3097783 3084985 3071078 3058764 3049857 3045815 3048192 3058149 3076564 3105114
59785C105114M1187N5529P0280Q6073J04929J27510J52826J80676K12338K48402
$$ 3105114 3146301 3201830 3272110 3358183 3463112 3590622 3743448 3924124 4136462 4384864
59775D384864K87679L28651L70120M09456M41357M58840M54363M20256L50874
$$ 4384864 4672543 5001194 5371314 5780770 6222127 6680967 7135330 7555586 7906460
59766G906460K46960J18292j8609j45902k49516l22042l63043l76725l69024l46239
$$ 7906460 8153420 8271712 8253103 8107201 7857685 7535643 7172600 6795875 6426851 6080612
59756F080612l14682k79469k43206k06833j71649j39432j10849q5223o1904m0675
$$ 6080612 5765930 5486461 5243255 5036422 4864773 4725341 4614492 4529269 4467365 4426690
59746D426690k0909j759J6640L3503M9071O4676Q0979R7394J13483J29697J46552
$$ 4426690 4405781 4404022 4420662 4454165 4503236 4567912 4648891 4746285 4859768 4989465 5136017
59735E136017J64238J83209K04098K26971K51699K78914L09423L42857L78263
$$ 5136017 5300255 5483464 5687562 5914533 6166232 6445146 6754569 7097426 7475689
59726G475689M15827M56433M99634N43544N86636O27828O64718O93617P11635
$$ 7475689 7891516 8347949 8847583 9391127 9977763 10605591 11270309 11963926 12675561
59717A2675561P17277P09054O85784O49032O03647N55385N09453M71330M46565
$$ 12675561 13392838 14101892 14787676 15436708 16040355 16595740 17105193 17576523 18023088
59708A8023088M38397M46851M70440N06928N51856N98488O40522O73399O92222
$$ 18023088 18461485 18908336 19378776 19885704 20437560 21036048 21676570 22349969 23042191
59699B3042191O90476O62504O06317N23229M16533K91888J57573K2652j04815
$$ 23042191 23732667 24395171 25001488 25524717 25941250 26233138 26390711 26413363 26308548
59690B6308548k17420l08259l72886m10691m23298m12434l80162l29831k65194
$$ 26308548 26091128 25782869 25409983 24999292 24575994 24163560 23783398 23453567 23188373
59681B3188373j89050j03487j0466Q8935J95090L08537M28616N53870O82532Q11431
$$ 23188373 22999323 22895836 22885370 22974305 23169395 23477932 23906548 24460418 25142950 25954381
59671B5954381R35040J046407J138141J201571J226049J200620J116512R68426
$$ 25954381 26889421 27935828 29073969 30275540 31501589 32702209 33818721 34787147
59663C4787147P55683M84664J70396j65134m96776p99855j053688j245116j369745
$$ 34787147 35542830 36027494 36197890 36032756 35535980 34736125 33682437 32437321 31067576
59654C1067576j429692j430870j382637j297841j190329j071635r50648q35920
$$ 31067576 29637884 28207014 26824377 25526536 24336207 23264572 22313924 21478004
59646B1478004p37147o64397o26363o28069o67680p34271q09699q74802r16130
$$ 21478004 20740857 20076460 19450097 18822028 18154348 17420077 16610378 15735576 14819446
59637A4819446r28972r15541q80902q30243p68906p02807o37091n74368n15275
$$ 14819446 13890474 12974933 12094031 11263788 10494882 9792075 9154984 8580616 8065341
59628H065341m60492m10992l66680l26436k89871k57583k29336k03484j78937
$$ 8065341 7604849 7193857 6827177 6500741 6210870 5953287 5723951 5520467 5341530
59619E341530j56249j36153j18252j01931q7288p4288o2333n1614m3730l9833
$$ 5341530 5185281 5049128 4930876 4828945 4741657 4667369 4605036 4553422 4509692 4469859
59609D469859l9143m0305m3248m8601n6103o4721p3692q2484r0281r6395j00660
$$ 4469859 4430716 4390411 4347163 4298562 4242459 4177738 4104046 4021562 3931281 3834886 3734226
59598C734226j02792j02139r8780r3975q8721q2613p4970o6276n7641m9499m1671
$$ 3734226 3631434 3529295 3430515 3336540 3247819 3165206 3090236 3023960 2966319 2916820 2875149
59587B875149l4080k6705j9368j2268n971m11N252J1216J6470K0374K3616K6761
$$ 2875149 2841069 2814364 2794996 2782728 2776757 2776346 2781598 2792814 2809284 2829658 2853274 2880035
59575B880035K8947K9201K8072K6841K5870K4898K4249K4527K5658K7377L0179
$$ 2880035 2908982 2938183 2966255 2993096 3018966 3043864 3068113 3092640 3118298 3145675 3175854
59564C175854L4820M1178M8475N6175O4087P2196Q1128R1947J04728J18109J31201
$$ 3175854 3210674 3251852 3300327 3356502 3420589 3492785 3573913 3665860 3770588 3888697 4019898
59553D019898J45063J61216J79461J98338K17171K36290K55602K74096K90741
$$ 4019898 4164961 4326177 4505638 4703976 4921147 5157437 5413039 5687135 5977876
59544E977876L04888L15843L22794L25101L22267L13909L00279K82618K62598
$$ 5977876 6282764 6598607 6921401 7246502 7568769 7882678 8182957 8465575 8728173
59535H728173K41542K19899J96716J69807J37976J03679P2282M7953L1186K0671
$$ 8728173 8969715 9189614 9386330 9556137 9694113 9797792 9870074 9918027 9949213 9969884
59525I969884J6018J7632K5371L8799N7859Q1856J08331J33939J55836J71229
$$ 9969884 9985902 10003534 10028905 10067704 10125563 10207419 10315750 10449689 10605525 10776754
59515A0776754J76511J68127J44290J05304N3064r173p7452j48614k20500k90215
$$ 10776754 10953265 11121392 11265682 11370986 11424050 11414877 11337425 11188811 10968311 10678096
59505A0678096l53365m05920m45945m72775m85887m85761m74621m55046m28654
$$ 10678096 10324731 9918811 9472866 9000091 8514204 8028443 7553822 7098776 6670122
59496F670122l97176l63405l29605k96014k62416k30144k00913j74621j50060
$$ 6670122 6272946 5909541 5579936 5283922 5021506 4791362 4590449 4415828 4265768
59487D265768j27107j06522q8172p1096n4869l9396k3850p432R338K5472M1269
$$ 4265768 4138661 4032139 3943967 3872871 3818002 3778606 3754756 3747324 3756662 3782134 3823403
59476C823403N7825P5314R3277J11991J32022J52856J73657J94846K17158K39420
$$ 3823403 3881228 3956542 4049819 4161810 4293832 4446688 4620345 4815191 5032349 5271769
59466E271769K59164K75366K88619K98415L01928K96057K79332K51491K12609
$$ 5271769 5530933 5806299 6094918 6393333 6695261 6991318 7270650 7522141 7734750
59457G734750J63404J05690M2101k4197q9589j50622k04682k49855k84644l08577
$$ 7734750 7898154 8003844 8045945 8021748 7932159 7781537 7576855 7327000 7042356 6733779
59447F733779l22675l28509l27144l19566l07384k92116k74367k54704k34557
$$ 6733779 6411104 6082595 5755451 5435885 5128501 4836385 4562018 4307314 4072757
59438D072757k15171j96341j77471j59298j43164j29070j15901j03174r1266q0237
$$ 4072757 3857586 3661245 3483774 3324476 3181312 3052242 2936341 2833167 2741901 2661664
59428B661664o9793o0236n2181m5347l8736l1867k4927j8137j1790o447k089K320
$$ 2661664 2591871 2531635 2479454 2434107 2395371 2363504 2338577 2320440 2308650 2302203 2300114 2302434
59416B302434P494J2668J6826K0220K3693K7421L1528L6542M1463M2701L7451
$$ 2302434 2309928 2322596 2339422 2359642 2383335 2410756 2442284 2478826 2520289 2562990 2600441
59405B600441K7662J8622J3987J4041J7986K5206L4389M4058N4470O6707P9312
$$ 2600441 2628103 2646725 2660712 2674753 2692739 2717945 2752334 2796392 2850862 2917569 2996881
59394B996881Q8132R0625Q8998Q8284R2557J03278J19733J40098J62977J88534
$$ 2996881 3085013 3175638 3264636 3352920 3445477 3548755 3668488 3808586 3971563 4160097
59384D160097K17571K49779K84090L20513L60114M03040M47878M93069N37304
$$ 4160097 4377668 4627447 4911537 5232050 5592164 5995204 6443082 6936151 7473455
59375G473455N78142O11603O33824O42334O35836O14165N78958N33410M81094
$$ 7473455 8051597 8663200 9297024 9939358 10575194 11189359 11768317 12301727 12782821
59366A2782821M25520L70268L18224K70611K27702J89946J57039J26423R4505
$$ 12782821 13208341 13578609 13896833 14167444 14395146 14585092 14742131 14868554 14963059
59357A4963059N9350K0712k2136p0448j23660j78839k32785k83001l26393l59262
$$ 14963059 15022409 15043121 15020985 14950537 14826877 14648038 14415253 14132252 13805859 13446597
59347A3446597l79715l89101l90650l87840l84189l82832l85377l91850m01736
$$ 13446597 13066882 12677781 12287131 11899291 11515102 11132270 10746893 10355043 9953307
59338I953307m13838m25407m33244m36036m34205m27536m14907l96647l75057
$$ 9953307 9539469 9114062 8680818 8244782 7810577 7383041 6968134 6571487 6196430
59329F196430l51812l26678k99614k72322k46592k22576j99782j78505j59133
$$ 6196430 5844618 5517940 5218326 4946004 4699412 4476836 4277054 4098549 3939416
59320C939416j41208j24203j08419r4217q1160o8652n6711m5516l4967k5180j6545
$$ 3939416 3798208 3674005 3565586 3471369 3390209 3321557 3264846 3219330 3184363 3159183 3142638
59309C142638q828j036P370J5929K4151L2140M0029M7717N5468O3822P2637Q1185
$$ 3142638 3133810 3132774 3140144 3156073 3180224 3212364 3252393 3300110 3355578 3419400 3492037 3573222
59297C573222Q9308R7566J06109J14420J22272J29756J36275J40690J42640J42599
$$ 3573222 3662530 3760096 3866205 3980625 4102897 4232653 4368928 4509618 4652258 4794857
59287D794857J40549J35962J29089J20942J11886J01755R1452Q2823P6701P2689
$$ 4794857 4935406 5071368 5200457 5321399 5433285 5535040 5626492 5709315 5786016 5858705
59277E858705P0976P2626P7536Q3999R0741R7499J02834J03232R5692P9937N7502
$$ 5858705 5929681 6002307 6079843 6163842 6254583 6352082 6454916 6558148 6653840 6733777 6791279
59266F791279L0138Ql0291n9202q6631j12137j33944j50541j61920j68319j69163
$$ 6791279 6821417 6821425 6791134 6731932 6645301 6533164 6399220 6248679 6086759 5918440 5749277
59255E749277j64314j55077j42788j27597j09680r0451p1333n2296l2808j3384
$$ 5749277 5584963 5429886 5287098 5159501 5049821 4959370 4888037 4835741 4802933 4789549
59245D789549M950K2035L8311N3752O7867Q0358R1051R9762J06656J12115J15971
$$ 4789549 4794499 4816534 4854845 4908597 4976464 5056822 5147873 5247635 5354291 5466406 5582377
59234E582377J17793J18187J18813J20714J23817J28606J36859J50073J68248
$$ 5582377 5700170 5818357 5937170 6057884 6181701 6310307 6447166 6597239 6765487
59225F765487J90881K17878K48658K81391L13927L44287L69462L84954L86588
$$ 6765487 6956368 7174246 7422904 7704295 8018222 8362509 8731971 9116925 9503513
59216I503513L72109L40556K91357K25088J44225N2348m6620j47915k45828l35103
$$ 9503513 9875622 10216178 10507535 10732623 10876848 10929196 10882576 10734661 10488833 10153730
59206A0153730m11743m72380n14304n37056n42797n34365n13986m84371m49409
$$ 10153730 9741987 9269607 8755303 8218247 7675450 7141085 6627099 6142728 5693319
59197E693319m12497l75205l38427l03589k71696k42416k15256j90771j69519
$$ 5693319 5280822 4905617 4567190 4263601 3991905 3749489 3534233 3343462 3173943
59188C173943j50916j34204j19639j07591r7430q8327q0328p3557o7346o1155
$$ 3173943 3023027 2888823 2769184 2661593 2564163 2475836 2395508 2321951 2254605 2193450
59178B193450n5540n1103m7252m3044l8482l4040k9698k5420k1803j9215j6961
$$ 2193450 2137910 2086807 2039555 1996511 1958029 1923989 1894291 1868871 1847068 1827853 1810892
59167A810892j4219j1120q002m492k68L962P304R946J2677J5735J8956K2462K6343
$$ 1810892 1796673 1785553 1777551 1773059 1772791 1776753 1784057 1794003 1806680 1822415 1841371 1863833 1890176
59154A890176L0254L4055L8230M3079M8064N2657N7071O1551O5744O9438P3294
$$ 1890176 1920430 1954485 1992715 2035794 2083858 2136515 2193586 2255137 2320881 2390319 2463613
59143B463613P8111Q3952R0451R7308J04089J10324J16147J21933J27039J29980
$$ 2463613 2541724 2625676 2716127 2813435 2917524 3027848 3143995 3265928 3392967 3522947
59133C522947J30207J28602J25755J21066J14027J05032R4364Q1762O7825N4431
$$ 3522947 3653154 3781756 3907511 4028577 4142604 4247636 4342000 4423762 4491587 4546018
59123D546018M2915L3103K4930J9563J7966J9662K4048L1687M3187N7859P4498
$$ 4546018 4588933 4622036 4646966 4666529 4684495 4704157 4728205 4759892 4803079 4860938 4935436
59112D935436R2592J11923J32022J52782J74386J95767K14290K27682K34970K34823
$$ 4935436 5028028 5139951 5271973 5424755 5599141 5794908 6009198 6236880 6471850 6706673
59102F706673K24625K02460J68837J25525P4291J7966l8687r0761j35056j69502
$$ 6706673 6931298 7133758 7302595 7428120 7502411 7520377 7481690 7390929 7255873 7086371
59092G086371j92387k03564k05257k00260j90266j76681j61572j46471j31477
$$ 7086371 6893984 6690420 6485163 6284903 6094637 5917956 5756384 5609913 5478436
59083E478436j16668j03196r1893q2351p4556o9924o9371p1871p6342q3414r3682
$$ 5478436 5361768 5258572 5166679 5084328 5009772 4939848 4870477 4798606 4722264 4638850 4545168
59072D545168j05621j16973j27051j36091j43510j48410j50847j51189j49236
$$ 4545168 4439547 4322574 4195523 4059432 3915922 3767512 3616665 3465476 3316240
59063C316240j45232j40480j35641j29700j21957j13576j05851r8438r0811q3787
$$ 3316240 3171008 3030528 2894887 2765187 2643230 2529654 2423803 2325365 2234554 2150767
59053B150767p7997p2441o6339o0786n6783n3280m9167m5446m3294m1563l8547
$$ 2150767 2072770 2000329 1933990 1873204 1816421 1763141 1713974 1668528 1625234 1583671 1545124
59042A545124l4794l1742k8960k5224k1042j7586j4227r792n217k316p64J137
$$ 1545124 1510330 1478588 1449628 1424404 1403362 1385776 1371549 1361757 1356540 1354224 1353460 1354597
59030A354597L511N323O943R685J3249J6190J8326K0297K1320J9939J6583J3000
$$ 1354597 1358108 1363431 1370374 1380059 1393308 1409498 1427824 1448121 1469441 1489380 1505963 1518963
59018A518963R565N469J119k140m266o108p196o327l930j487J024M617Q689J1511
$$ 1518963 1528528 1533997 1535116 1532976 1528710 1522602 1515406 1509079 1505149 1503662 1504686 1509303 1517992 1529503
59004A529503J3026J4555J5931J5481J2832R218N134J46n077r141j2262j5675
$$ 1529503 1542529 1557084 1573015 1588496 1601328 1610546 1615680 1615826 1610749 1601608 1589346 1573671
58992A573671j8717j9234j7130j4756j3371j1800r152o338m147k067J98K050L420
$$ 1573671 1554954 1535720 1518590 1503834 1490463 1478663 1469511 1463173 1459026 1456959 1457157 1459207 1462627
58979A462627N044O807P742Q014Q986J0921J2570J3438J4516J6273J7886J9002
$$ 1462627 1467671 1474478 1482220 1490234 1499220 1510141 1522711 1536149 1550665 1566938 1584824 1603826
58967A603826K0444K2543K4560K6127K7739K9336L0047K9777K9504K9779L0267
$$ 1603826 1624270 1646813 1671373 1697500 1725239 1754575 1784622 1814399 1843903 1873682 1903949
58956A903949L0906L2045L3421L4521L5767L7914M0557M2903M5549M9545N4255
$$ 1903949 1934855 1966900 2000321 2034842 2070609 2108523 2149080 2191983 2237532 2287077 2341332
58945B341332N8279O2099O7396P4147Q0848Q7394R5048J03573J11242J17942J25542
$$ 2341332 2399611 2461710 2529106 2603253 2684101 2771495 2866543 2970116 3081358 3199300 3324842
58934C324842J34755J44332J53863J64671J77321J90892K05545K23217K44858
$$ 3324842 3459597 3603929 3757792 3922463 4099784 4290676 4496221 4719438 4964296
58925D964296K69318K95880L25480L58535L94048M31928M73803N20244N69395
$$ 4964296 5233614 5529494 5854974 6213509 6607557 7039485 7513288 8033532 8602927
58916H602927O19537O70832P23007P73238Q17679Q53308Q76828Q83345Q67750
$$ 8602927 9222464 9893296 10616303 11389541 12207220 13060528 13937356 14820701 15688451
58907A5688451Q26449P57040O57957N29897L76922K05701K4757j55634l24970
$$ 15688451 16514900 17271940 17929897 18459794 18836716 19042417 19067174 18911540 18586570
58898A8586570m75288o01857p01459p72138q15007q34221q34206q18217p89690
$$ 18586570 18111282 17509425 16807966 16035828 15220821 14386600 13552394 12734177 11944487
58889A1944487p52631p09918o63046o14096n65917n19760m74856m31222l90827
$$ 11944487 11191856 10481938 9818892 9204796 8638879 8119119 7644263 7213041 6822214
58880F822214l55117l23412k94682k68950k46048k25039k05938j90089j77673
$$ 6822214 6467097 6143685 5849003 5580053 5334005 5108966 4903028 4712939 4535266
58871D535266j66647j55250j43828j33180j22926j12657j02977r4221q5698p7180
$$ 4535266 4368619 4213369 4069541 3936361 3813435 3700778 3597801 3503580 3417882 3340702
58861C340702o9538o3044n6726n0345m5149m1524l7753l2387k6271k1001j6722
$$ 3340702 3271164 3208120 3151394 3101049 3055900 3014376 2976623 2944236 2917965 2896964 2880242
58850B880242j2594q171l318K061P434J2129J6820K3022L0662L7913M3994N0135
$$ 2880242 2867648 2859477 2856159 2858220 2865654 2877783 2894603 2917625 2948287 2986200 3030194 3080329
58838C080329N7174O4298P1125P8868Q8250R8114J07381J16671J26900J37873
$$ 3080329 3137503 3201801 3272926 3351794 3440044 3538158 3645539 3762210 3889110 4026983
58828D026983J49235J61335J74294J87776K02343K19307K38737K59623K82496
$$ 4026983 4176218 4337553 4511847 4699623 4901966 5121273 5360010 5619633 5902129
58819E902129L09593L41630L76896M14425M55564N01166N49708N99595O50744
$$ 5902129 6211722 6553352 6930248 7344673 7800237 8301403 8851111 9450706 10101450
58810A0101450P02245P50602P91920Q23569Q42136Q41996Q17942P67522O89382
$$ 10101450 10803695 11554297 12346217 13169786 14011922 14853918 15671860 16439382 17128764
58801A7128764N81923M45965K87215J14196o4584k40031m01716n40968o53981
$$ 17128764 17710687 18156652 18443867 18558063 18493479 18253448 17851732 17310764 16656783
58792A6656783p40360q00084q33809q44527q36548q13644p79484p38403o93709
$$ 16656783 15916423 15116339 14282530 13438003 12601455 11787811 11008327 10269924 9576215
58783I576215o46352n96959n47985n02186m60125m20895l84290l50742l20206
$$ 9576215 8929863 8332904 7784919 7282733 6822608 6401713 6017423 5666681 5346475
58774E346475k92576k68273k47219k28350k11219j96739j85159j74822j64179
$$ 5346475 5053899 4785626 4538407 4310057 4098838 3902099 3716940 3542118 3377939
58765C377939j53530j43596j33914j23992j14450j05692r7073q8561q1435p5933
$$ 3377939 3224409 3080813 2946899 2822907 2708457 2602765 2505692 2417131 2335696 2259763
58755B259763p0047o2274n3852m6705m0932l5854l1701k8515k5140k1039j7482
$$ 2259763 2189716 2127442 2073590 2026885 1985953 1950099 1918398 1889883 1864743 1843704 1826222
58744A826222j5312j3257j0251p489o336o024n370n085o274q315j0239j2640j6061
$$ 1826222 1810910 1797653 1787402 1779913 1773577 1767553 1762183 1757098 1750824 1742509 1732270 1719630 1703569
58731A703569j9058k0043j9696j9518j9442j8845j8450j9152k0255k0904k1821
$$ 1703569 1684511 1664468 1644772 1625254 1605812 1586967 1568517 1549365 1529110 1508206 1486385
58720A486385k3744k5604k6281k6717k8170k9818l0176k9615k9321k9071k8044
$$ 1486385 1462641 1437037 1410756 1384039 1355869 1326051 1295875 1266260 1236939 1207868 1179824
58709A179824k6549k5088k3069k0318j8307j7889j7489j5497j2883j1255j0190
$$ 1179824 1153275 1128187 1105118 1084800 1066493 1048604 1031115 1015618 1002735 991480 981290
58698I81290q755p879q574r422q554o826o411p400q378r061r841r885q357o479
$$ 981290 972535 964656 956082 946660 938106 931280 924869 917469 909091 900030 890189 880304 871947 865468
58684H65468n831n599m040j617j25K66N84O30n46k480l956n013o122o378m824
$$ 865468 859637 854038 849998 848381 848256 848522 849106 849736 849190 846710 842754 837741 831619 825241 820417
58669H20417k569j352r21M3J415K288L021M375N661N838N293M561K704p60l935
$$ 820417 817848 816496 815575 815618 817033 819321 822342 826717 832378 838216 843509 848070 850774 850014 846079
58654H46079m925m595m571m215k310k4Q38J085K574M836O359P854J0892J4439
$$ 846079 841154 836559 831988 827773 825463 825439 826277 827362 829936 834772 841131 848985 859877 874316
58640H74316J6156J6298J7028J8708K0081K1375K3878K7092K9448L1374L4561
$$ 874316 890472 906770 923798 942506 962587 983962 1007840 1034932 1064380 1095754 1130315
58629A130315L8789M2558M6275N1708N8789O6048P3714Q3303R4577J05953J17569
$$ 1130315 1169104 1211662 1257937 1309645 1368434 1434482 1508196 1591499 1686076 1792029 1909598
58618A909598J31050J46635J63342J81422K01657K22696K41894K58196K71279
$$ 1909598 2040648 2187283 2350625 2532047 2733704 2956400 3198294 3456490 3727769
58609C727769K78454K75537K60442K33194J93332J40653P8300J2036n3212j13612
$$ 3727769 4006223 4281760 4542202 4775396 4968728 5109381 5187681 5199717 5146505 5032893
58599E032893j64576k02335k27137k41672k46890k42521k30903k16420k01191
$$ 5032893 4868317 4665982 4438845 4197173 3950283 3707762 3476859 3260439 3059248
58590C059248j84697j67469j51616j37690j24369j11423j00047r0261q0946p2216
$$ 3059248 2874551 2707082 2555466 2417776 2293407 2181984 2081937 1991676 1910730 1838514
58580A838514o4835n7762m9384m0704l4043k9162k4030j8942j6089j5402j4527
$$ 1838514 1773679 1715917 1666533 1625829 1591786 1562624 1538594 1519652 1503563 1488161 1473634
58569A473634j2823j1700j1105r423o992n912o238n988n200o263r812j3806j7243
$$ 1473634 1460811 1449111 1438006 1428583 1421591 1415679 1409441 1403453 1398253 1391990 1382178 1368372 1351129
58556A351129k1356k6571l1391l4778l6799l6841l4207l0352k7518k5406k2300
$$ 1351129 1329773 1303202 1271811 1237033 1200234 1163393 1129186 1098834 1071316 1045910 1023610
58545A023610j8849j7126j6500j4436j1060q870q093o529m007k667k703k095q52
$$ 1023610 1004761 987635 971135 956699 945639 936769 928676 922147 918140 915473 912770 910675 909823
58532I09823j130k775l175k140k441m782o718p415r012j2152j4466j4843j5027
$$ 909823 908693 905918 902743 900603 898162 893380 886662 879247 870235 858083 843617 828774 813747
58519H13747j5782j5514j3979j3317j3973j3510j0897q272p080o145m766m030
$$ 813747 797965 782451 768472 755155 741182 727672 716775 708503 701423 695278 690512 686482
58507F86482l896k644m34L43o69r21N47J707J698K333M182N239M896N212O837
$$ 686482 682586 679942 679508 679851 679182 678261 678808 680515 682213 684546 688728 693967 698863 704075 710912
58492G10912P631O941P192R529J1751J2238J2175J2222J0879P897N618N105M495
$$ 710912 718543 725484 732676 742205 753956 766194 778369 790591 801470 809367 814985 820090 824585
58479H24585K749J420J144J82j916k933j923q79q81l62J231J798L25j399k342
$$ 824585 827334 828754 829898 830080 828164 825231 823308 822429 821548 821186 822417 824215 824540 823141 820799
58464H20799l870o397q160q762j0071j2239j2840j1304j0066r879q424n181l139
$$ 820799 816929 810532 802372 793610 783539 771300 758460 747156 737090 727211 718787 713606 710467
58451G10467l758m584l875l265l819l771k330j500k038j749J63J405J181K061
$$ 710467 706709 702125 698250 694985 691166 687395 685065 683565 681527 679778 679941 681346 682527 684588
58437F84588N127P767Q465R266J1272J2222J0846R120P900N055K45l244l931m538
$$ 684588 689715 697482 705947 715213 726485 738707 749553 758673 766573 771628 771873 768629 764698 760160
58423G60160o433o756l929j008m05k2K109M147M619N574Q321J0469J0518J0784
$$ 760160 753727 746971 743042 742034 741629 741607 743716 747863 752482 758056 766377 776846 787364 798148
58409G98148J2664J3627J2206J1213J2578J3684J2367J0794J0766R913O302K261
$$ 798148 810812 824439 836645 847858 860436 874120 886487 897281 908047 917960 924262 926523
58397I26523j25k833p425j1305j2210j2041j2665j2379j0134q534q992q698n980
$$ 926523 926398 923565 916140 904835 892625 880584 867919 855540 845406 836872 827880 819182 813202
58384H13202l753l898l459l84K285K162K049M250N782M049K059K983M543L814
$$ 813202 809449 805551 802092 801708 803993 806155 808204 812454 818236 822285 824344 827327 831870 835684
58370H35684K721L667M613L622L371O028Q418P598O286P498Q744P121N293O623
$$ 835684 838405 842072 846685 850307 853678 859706 868124 875722 882008 889506 898250 905371 910664 917287
58356I17287Q946Q941Q235R516J1086J0831J1072J3823J5844J4059J1221J0617
$$ 917287 926233 935174 943409 952925 964011 974842 985914 999737 1015581 1029640 1040861 1051478
58344A051478R959O353K339J059K19k971n790n031l119l111k631Q90M214M060
$$ 1051478 1061437 1067790 1070129 1071188 1071407 1068436 1062646 1057615 1054496 1051385 1048754 1049644 1053858 1057918
58330A057918L645O727J0307J0239Q944J0422J2650J2207J1384J3360J5253J3466
$$ 1057918 1061563 1068290 1078597 1088836 1097780 1108202 1120852 1133059 1144443 1157803 1173056 1186522
58318A186522J1041J2311J5098J5511J5476J8023K0370J9270J7917J9781K1165
$$ 1186522 1197563 1209874 1224972 1240483 1255959 1273982 1294352 1313622 1331539 1351320 1372485
58307A372485J7793J3109J1909J1598Q251N223O879R743R041Q015J1285J5104
$$ 1372485 1390278 1403387 1415296 1426894 1435145 1440368 1447247 1456990 1466031 1474046 1485331 1500435
58295A500435J4136J1880J4169J8204J8427J7398K0173K3694K2752K0691K3111
$$ 1500435 1514571 1526451 1540620 1558824 1577251 1594649 1614822 1638516 1661268 1681959 1705070
58284A705070K6749K5942K4213K7650L2775L3221L2445L7115M3599M4250M1636
$$ 1705070 1731819 1757761 1781974 1809624 1842399 1875620 1908065 1945180 1988779 2033029 2074665
58273B074665M3202M7059M6628M4225M6216M9602M7312M1976M0702M1217L7264
$$ 2074665 2117867 2164926 2211554 2255779 2301995 2351597 2398909 2440885 2481587 2522804 2560068
58262B560068L2317L3540L7558L7010L5538M0964M9490N2550N3425O0620P0676
$$ 2560068 2592385 2625925 2663483 2700493 2736031 2776995 2826485 2879035 2932460 2993080 3063756
58251C063756P4535P5180Q1416R0034R2120R1161R6478J04679J06591J06281J13538
$$ 3063756 3138291 3213471 3294887 3384921 3477041 3568202 3664680 3769359 3875950 3982231 4095769
58240D095769J24105J27787J29315J39689J53878J59711J61904J73479J90523
$$ 4095769 4219874 4347661 4476976 4616665 4770543 4930254 5092158 5265637 5456160
58231E456160K00187K06699K23332K45507K59091K68641K89078L16200L35044
$$ 5456160 5656347 5863046 6086378 6331885 6590976 6859617 7148695 7464895 7799939
58222G799939L50467L78438M14137M41356M66201N07072N58817O03228O47084
$$ 7799939 8150406 8528844 8942981 9384337 9850538 10357610 10916427 11519655 12166739
58213A2166739P11041P89050Q60266R32674J030838J149701J268284J399308J573637
$$ 12166739 12877780 13666830 14527096 15459770 16490608 17640309 18908593 20307901 21881538
58204B1881538J786336K014986K280246K626481L056196L554817M168533M981796
$$ 21881538 23667874 25682860 27963106 30589587 33645783 37200600 41369133 46350929
58196D6350929O035616P357318R049080J1237128J3949299J7160281K0922264
$$ 46350929 52386545 59743863 68792943 80030071 93979370 111139651 132061915
58189A32061915K5298331L0221594L5608002M1389638M6776674M9249590M5073382
$$ 132061915 157360246 187581840 223189842 264579480 311356154 360605744 405679126
58182D05679126L1959779J1646849j0490572k8718110m0021872m4567830m4161312
$$ 405679126 437638905 449285754 438795182 410077072 370055200 325487370 281326058
58175B81326058m0767434l5968046l0869966k6064152k1751219j8001615j4859607
$$ 281326058 240558624 204590578 173720612 147656460 125905241 107903626 93044019
58168I3044019j2273542j0110956q283447o764414n493013m370123l351463k447312
$$ 93044019 80770477 70659521 62376074 55611660 50118647 45748524 42397061 39949749
58160C9949749j630975q39163n2867P20688J521279K338860K910148K772680J660142
$$ 39949749 38318774 37479611 37426744 38147432 39668711 42007571 44917719 47690399 49350541
58151D9350541j81170k129327l614993m405752m578152m341880l900589l392884
$$ 49350541 49169371 47040044 43425051 39019299 34441147 30099267 26198678 22805794
58143B2805794k891473k432492k037050j709117j436220j207562j022093q74642
$$ 22805794 19914321 17481829 15444779 13735662 12299442 11091880 10069787 9195145
58135I195145p50622o41817n52213m82295m23156l71256l32558l06863k84274
$$ 9195145 8444523 7802706 7250493 6768198 6345042 5973786 5641228 5334365 5050091
58126E050091k61942k47652k41854k32967k15786j98187j84342j67618j45759
$$ 5050091 4788149 4540497 4298643 4065676 3849890 3651703 3467361 3299743 3153984
58117C153984j27130j15620j04386r0525q1572q1543q4089q4952q7902r3250r3755
$$ 3153984 3026854 2911234 2806848 2716323 2634751 2553208 2469119 2384167 2296265 2203015 2109260
58106B109260q7253q0816p7632p2155o2609n5689n4088n1689m5762m1960m2625
$$ 2109260 2022007 1941191 1863559 1791404 1728795 1673106 1619018 1567329 1521567 1479607 1436982
58095A436982m2026l7733l5093l5924l4355k8438k4529k5468k5618k2271k0898
$$ 1436982 1394956 1357223 1322130 1286206 1251851 1223413 1198884 1173416 1147798 1125527 1104629
58084A104629k4146k6468k4787k4050k7027k8697k5955k3251k3494k2764j8962
$$ 1104629 1080483 1054015 1029228 1005178 978151 949454 923499 900248 876754 853990 835028
58073H35028j6567j7851j8214j5075j2665j3474j3479j0469q557r874j0160p113
$$ 835028 818461 800610 782396 767321 754656 741182 727703 717234 708677 698803 688643 681530
58061F81530m932o096o746m632l593n689o872m967m120o833r213q656q548j0895
$$ 681530 676598 670502 663756 659124 655531 649842 642970 638003 633883 627050 617837 609181 600633 589738
58047E89738j1853r236p017p763p852m852k414l119l585j491m33k816m698k762
$$ 589738 577885 568649 561632 553869 546017 541165 538751 535632 532047 530556 530123 527307 522609 519847
58033E19847PM94R02L178M290K077j13M84J147n57j871m12J097K98k32J532K680
$$ 519847 519854 520348 521250 524428 528718 530795 530682 531166 532313 531756 529885 529473 530570 530868 530636 532168 534848
58016E34848J027m94L39O20j616k753j30K408R02k048k465j843l226n029m382
$$ 534848 535875 535381 535720 536340 534724 531971 531841 534249 535151 533103 530638 528795 525569 520540 516158
58001E16158k649k340k246n71Q41R8o81N57J549q0k235k522l034o265j0024j1117
$$ 516158 513509 511169 508923 508352 509193 509291 508610 509167 510716 510636 508401 505879 502845 496580 486556 475439
57985D75439j0614j0822j0490p685m219k715k238r37J04l55l44J804L875L626
$$ 475439 464825 454003 443513 435828 431609 428894 426656 425719 425823 425468 425124 426928 430803 434429
57971D34429K876L751M359K450k9l80P2j035k480k164j370k049k797j773p10j778
$$ 434429 437305 441056 445415 447865 447836 447456 447528 446493 444013 441849 440479 438430 435633 433860 433150 431372
57955D31372l362l221k960m885p255p123n314m246l289p55J929K543K292L460
$$ 431372 428010 424789 421829 416944 409689 402566 397252 393006 389717 388962 390891 393434 395726 399186
57941C99186M964M570L374L749M805M123K245J285R19l70j753j788j895m235p739
$$ 399186 404150 408720 412094 415843 420648 424771 427016 428301 429220 428850 427097 425309 423414 419179 411440
57926D11440r928j1010j2467j3497j2632j1069j0616j0031p248l554j701j472
$$ 411440 401512 390502 378035 364538 351906 340837 330221 320190 312942 309388 307687 306215
57914C06215p89L32P16J267L424N814O214N503O101P748Q441Q210Q456Q776P884
$$ 306215 305426 305758 306474 307741 311165 316979 323193 328696 334797 342545 350986 359196 367652 376428 384312
57899C84312O444N753M981K963J122J286K166J491ql29j89j592l799m594m313
$$ 384312 390756 396509 401490 404453 405575 406861 409027 410518 410510 410181 409992 408400 404601 400007 395694
57884C95694m883o029o036n262n271n574m693l361l222l561k783j831k497l595
$$ 395694 390811 384782 378746 373484 368213 362639 357946 354585 351363 347802 345019 343188 340691 337096
57870C37096k614k0J816K854M617O317N935M378M418N965O462N522N185N740N294
$$ 337096 334482 334462 336278 339132 343749 350066 356001 360379 364797 370762 377224 382746 387931 393671 398965
57855C98965L622K651K793K303O18q61j613k592l746l814k861k381k726k851k480
$$ 398965 402587 405238 408031 410334 410952 410091 408478 405886 402140 398326 395465 393084 390358 387507 385027
57840C85027k216j899j148r70k340l944l879k788k596l123k847k159k682m052
$$ 385027 382811 380912 379764 378794 376454 372510 368631 365843 363247 360124 357277 355118 352436 348384
57826C48384m549m249m540n159m880m415n401p054p198o019n547n980n869n430
$$ 348384 343835 339586 335046 329887 325007 320592 315191 308137 300939 294920 289373 283393 277524 272094
57812B72094o059o985o025l600k316k607k311p32M68O52J095K134K643K776M116
$$ 272094 266035 259050 253025 249425 247109 244502 242191 241459 241927 242579 243674 245808 248451 251227 255343
57797B55343O677Q708R663J0447J0648Q734N225K556J452M49q44j118k20M62P57
$$ 255343 262020 270728 280391 290838 301486 310220 315445 318001 319453 319902 319058 317940 317720 318182 318939
57782C18939J746K888K286J80j082q68q89j672j811j229j697l358m077l195k639
$$ 318939 320685 323573 325859 326039 324957 324089 323200 321528 319717 318488 316791 313433 309356 306161 303522
57767C03522l413m101l907l998m701m400k549q58l11L29J769K694K286J687J746
$$ 303522 300109 296008 292101 288103 283402 279002 276453 275595 275284 275613 277382 280076 282362 284049 285795
57752B85795J690J219J448K692L649L734L974M711M852M185L950M325L922K566
$$ 285795 287485 288704 290152 292844 296493 300227 304201 308912 313764 317949 321899 326224 330146 332712
57738C32712J867K198J951P60M79J785K805K511K499L763M691M153L799N133O729
$$ 332712 334579 336777 338728 339488 339967 341752 344557 347068 349567 353330 358021 362174 365973 371106 377835
57723C77835O732N977O355P767Q843R306R703R957R912J0104J0775J1237J1314
$$ 377835 384567 390544 396899 404666 413509 422815 432518 442475 452387 462491 473266 484503 495817
57710D95817J2028J3775J5451J6297J7062J8361J9578K0466K2055K4840K7710
$$ 495817 507845 521620 537071 553368 570430 588791 608369 628835 650890 675730 703440
57699G03440K9823L1941L4881L8341M2203M7265N3634O0172O6602P4383Q4516
$$ 703440 733263 765204 800085 838426 880629 927894 981528 1041700 1108302 1182685 1267201
57688A267201R6242J09024J23760J40885J59082J77239J95903K15495K34689K51751
$$ 1267201 1363443 1472467 1596227 1737112 1896194 2073433 2269336 2484831 2719520 2971271
57678B971271K65731K75005K76351K66852K45636K13086J70343J20735O9883K3107
$$ 2971271 3237002 3512007 3788358 4055210 4300846 4513932 4684275 4805010 4874893 4898000
57668D898000j6193m5747o5365q0293j00557j33554j77463k22836k59253k79838
$$ 4898000 4881807 4836060 4770695 4690402 4589845 4456291 4278828 4055992 3796739 3516901
57658C516901k82515k70102k48581k23259j96659j70247j46135j25654j07984
$$ 3516901 3234386 2964284 2715703 2492444 2295785 2125538 1979403 1853749 1745765
57649A745765r1893p7594o5563n4984m4929l5831k8421k2301j6705j1454o155
$$ 1745765 1653872 1576278 1510715 1455731 1410802 1374971 1346550 1324249 1307544 1296090 1289935
57638A289935%O673J2291J6566K1371K7992L5398M2577N0528O0338P1178Q2009
$$ 1289935 1289935 1296608 1308899 1325465 1346836 1374828 1410226 1452803 1503331 1563669 1634847 1716856
57626A716856R3567J06903J21483J36436J52138J68742J84701J98381K09602K17685
$$ 1716856 1810423 1917326 2038809 2175245 2327383 2496125 2680826 2879207 3088809 3306494
57616C306494K19546K11800J93443J64824J25682P6608K1307l4812q7603j34174
$$ 3306494 3526040 3737840 3931283 4096107 4221789 4298397 4319704 4284892 4197289 4063115
57606D063115j71463j97294k12269k18740k18398k12319k02240j89994j76387
$$ 4063115 3891652 3694358 3482089 3263349 3044951 2832632 2630392 2440398 2264011
57597B264011j61983j48063j35368j23134j10822r9524r0082q1364p2307o4152
$$ 2264011 2102028 1953965 1818597 1695463 1584641 1485117 1395035 1313671 1241364 1177212
57587A177212n8437n4050m8798m2886l8268l5240l2174k8419k5076k2850k1134
$$ 1177212 1118775 1064725 1015927 973041 934773 899533 867359 838940 813864 791014 769880
57576G69880j9435j8036j7010j5924j4583j3108j1446r653q203p285o366n222
$$ 769880 750445 732409 715399 699475 684892 671784 660338 650685 642482 635197 628831 623609
57564F23609m402l997l052j219L63R05J285K348L452M032M965O765Q148Q265Q661
$$ 623609 619207 615210 612158 610939 611302 612207 613492 615840 619292 623324 628289 635054 643202 651467 660128
57549F60128J0868J3573J4668J4787J6206J9165K1945K3935K6114K8931L1988
$$ 660128 670996 684569 699237 714024 730230 749395 771340 795275 821389 850320 882308
57538H82308L5564M0336M5939N1648N7995O5883P4759Q3614R3079J04422J17166
$$ 882308 917872 958208 1004147 1055795 1113790 1179673 1254432 1338046 1431125 1535547 1652713
57527A652713J29803J42179J54844J66623J75130J79211J78565J71343J54763
$$ 1652713 1782516 1924695 2079539 2246162 2421292 2600503 2779068 2950411 3105174
57518C105174J28075R2929N1336N638l9850q0040j12440j37309j54670j63574
$$ 3105174 3233249 3326178 3377514 3383152 3343302 3263262 3150822 3013513 2858843 2695269
57508B695269j64537j60203j52958j43673j33022j22045j11048r9727q8668p9045
$$ 2695269 2530732 2370529 2217571 2073898 1940876 1818831 1707783 1608056 1519388 1440343
57498A440343p0762o2763n5104m8754m3338l7327l0674k5077k1191j7718j3818
$$ 1440343 1369581 1306818 1251714 1202960 1159622 1122295 1091621 1066544 1045353 1027635 1013817
57487A013817j0241p347m022M65N264R458J3349J7374K1150K4425K7834L2084
$$ 1013817 1003576 996229 992207 992672 997936 1007394 1020743 1038117 1059267 1083692 1111526 1143610
57475A143610L7325M3683N1335N9886O8763P8299Q9211J01129J13038J24968J37559
$$ 1143610 1180935 1224618 1275953 1335839 1404602 1482901 1572112 1673241 1786279 1911247 2048806
57464B048806J49903J59696J65681J67977J65647J55876J36412J07372P0216K6817
$$ 2048806 2198709 2358405 2524086 2692063 2857710 3013586 3149998 3257370 3327586 3354403
57454C354403j9696o4829j04678j37206j61326j76281j82638j82571j78135j70116
$$ 3354403 3334707 3269878 3165200 3027994 2866668 2690387 2507749 2325178 2147043 1976927
57444A976927j59057j46341j33498j21206j09534r8521q8195p8674p0315o3190
$$ 1976927 1817870 1671529 1538031 1416825 1307291 1208770 1120575 1041901 971586 908396
57434I08396n6584m9918m3807l9159l5594l2035k8510k5868k3957k1755j9237
$$ 908396 851812 801894 758087 718928 683334 651299 622789 596921 572964 551209 531972
57423E31972j7411j6439j5378j3901j2639j1642j0235q573p673p622p443o940
$$ 531972 514561 498122 482744 468843 456204 444562 434327 425754 418081 410459 403016 396076
57411C96076o956p436p100n581m143l677l642l580l962m766m838l618k131j410
$$ 396076 389120 381684 374584 369003 364860 361183 357541 353961 349999 345233 340395 336777 334646 333236
57397C33236j182q40n59o66r62j246j539j489o21N05O72j59p34m61p3q3o2J25
$$ 333236 332054 331214 330655 329989 329027 327781 326242 324753 324132 324637 325309 325150 324416 323955 323882 323799 323737 323862
57379C23862o2n48m59L11Q44Q75J178J852J910J117N42O24M28m92j142q48l11
$$ 323862 323800 323252 322793 323104 323948 324823 326001 327853 329763 330880 331422 332046 332474 331982 330840 329992 329681
57362C29681r4M38J696K922L484L741L818L075J558M77M10N40M75J075K479L170
$$ 329681 329587 330025 331721 334643 338127 341868 345686 348761 350319 350796 351206 351746 352221 353296 355775 358945
57346C58945K238R98R45J657K054K354L193M024L933L140K422J905J566J963L316
$$ 358945 361183 362181 363126 364783 366837 369191 372384 376408 380341 383481 385903 387808 389374 391337 394653
57331C94653M798N708O397P042O724M949K966K263K693L236L701M402N011N025
$$ 394653 399451 405159 411556 418598 425322 430271 433237 435500 438193 441429 445130 449532 454543 459568
57317D59568M742M718M860M903N061N419N463N016M777N167N623N717N978O753
$$ 459568 464310 469028 473888 478791 483852 489271 494734 499750 504527 509694 515317 521034 527012 533765
57303E33765P483P856Q531R703J0277R573Q749R264J0918J2476J3422J4008J4423
$$ 533765 541248 549104 557635 567338 577615 587188 595937 605201 616119 628595 642017 656025 670448
57290F70448J4918J5949J7424J8701J9844K1613K3670K4483K3990K4522K7688
$$ 670448 685366 701315 718739 737440 757284 778897 802567 827050 851040 875562 903250
57279I03250L1986L5045L6640L7691L7775L5876L2656K9770K7317K3804J8411
$$ 903250 935236 970281 1006921 1044612 1082387 1118263 1150919 1180689 1208006 1231810 1250221
57268A250221J1746M690k232q552j4077j9040k3212k5605k5817k4851k3664k1950
$$ 1250221 1261967 1266657 1264425 1255873 1241796 1222756 1199544 1173939 1148122 1123271 1099607 1077657
57256A077657j9404j6884j5098j3272j0501p347m678k148O15K587K957L070M725
$$ 1077657 1058253 1041369 1026271 1012999 1002498 995151 990473 988325 988940 991527 994484 997554 1002279
57243A002279P344Q863Q859Q781R513J0546J1360J1889J1878J1245J0803J1294
$$ 1002279 1009623 1018486 1027345 1036126 1045639 1056185 1067545 1079434 1091312 1102557 1113360 1124654
57231A124654J2097J2237J2044J2359J2893J2926J2973J3932J5233J5679J5653
$$ 1124654 1136751 1148988 1161032 1173391 1186284 1199210 1212183 1226115 1241348 1257027 1272680
57220A272680J6500J8112J9078J9067J9194K0103K1395K2916K4836K6514K7004
$$ 1272680 1289180 1307292 1326370 1345437 1364631 1384734 1406129 1429045 1453881 1480395 1507399
57209A507399K6724K7053K8199K9008K8898K8431K8021K7590K7489K8214K9190
$$ 1507399 1534123 1561176 1589375 1618383 1647281 1675712 1703733 1731323 1758812 1787026 1816216
57198A816216K9322K8720K8429K8601K8440K7994K8207K9204L0161L0988L2521
$$ 1816216 1845538 1874258 1902687 1931288 1959728 1987722 2015929 2045133 2075294 2106282 2138803
57187B138803L4755L6602L7673L8751M0116M0998M1116M1250M1755M1829M0882
$$ 2138803 2173558 2210160 2247833 2286584 2326700 2367698 2408814 2450064 2491819 2533648 2574530
57176B574530L9472L8318L7514L7188L7801L9210M0358M0470L9879L9374L9373
$$ 2574530 2614002 2652320 2689834 2727022 2764823 2804033 2844391 2884861 2924740 2964114 3003487
57165C003487L9937M0801M1361M1338M1407M2433M4236M5913M7133M8138M8905
$$ 3003487 3043424 3084225 3125586 3166924 3208331 3250764 3295000 3340913 3388046 3436184 3485089
57154C485089M9458N0614N3044N5824N7417N7858N8502N9639O0025N8911N6924
$$ 3485089 3534547 3585161 3638205 3694029 3751446 3809304 3867806 3927445 3987470 4046381 4103305
57143D103305N4683N2164M9764M8355M7745M6518M4021M1267L9286L8015L7354
$$ 4103305 4157988 4210152 4259916 4308271 4356016 4402534 4446555 4487822 4527108 4565123 4602477
57132D602477L7961M0155M3160M6374N0262N5223O0506O5124O9057P2740P6108
$$ 4602477 4640438 4680593 4723753 4770127 4820389 4875612 4936118 5001242 5070299 5143039 5219147
57121E219147P9044Q2097Q5955R0648R6017J02564J11113J21997J35089J50281
$$ 5219147 5298191 5380288 5466243 5556891 5652908 5755472 5866585 5988582 6123671 6273952
57111F273952J67318J85603K04894K26059K50690K80223L16026L60060M14657
$$ 6273952 6441270 6626873 6831767 7057826 7308516 7588739 7904765 8264825 8679482
57102H679482M81748N63375O63375P87865R43583J136540J372944J660217K005387
$$ 8679482 9161230 9724605 10387980 11175845 12119428 13255968 14628912 16289129 18294516
57093A8294516K412506K881978L409811L983529M578840N163997N706849O172522
$$ 18294516 20707022 23589000 26998811 30982340 35561180 40725177 46432026 52604548
57085E2604548O516406O695120O697584O557952O318632N974505N464666M725641
$$ 52604548 59120954 65816074 72513658 79071610 85390242 91364747 96829413 101555054
57077A01555054L745360K563329J236178j78289j609822k972525m185884n196204
$$ 101555054 105300414 107863743 109099921 108921632 107311810 104339285 100153401 94957197
57069I4957197n977426o521032o831575o926526o832781o581999o209094n750594
$$ 94957197 88979771 82458739 75627164 68700638 61867857 55285858 49076764 43326170
57061D3326170n240242m706342m173133l661249l185023k751844k365543k028305
$$ 43326170 38085928 33379586 29206453 25545204 22360181 19608337 17242794 15214489
57053A5214489j738662j491235j280610j103450r55911q32122p27107o38694n64940
$$ 15214489 13475827 11984592 10703982 9600532 8644621 7812499 7085392 6446698 5881758
57044E881758n02147m47246l99837l59906l25603k94959k67809k44179k22769
$$ 5881758 5379611 4932365 4532528 4172622 3847019 3552060 3284251 3040072 2817303
57035B817303k02727j85031j70295j57059j43870j31301j20182j09658r8879q8916
$$ 2817303 2614576 2429545 2259250 2102191 1958321 1827020 1706838 1597180 1498301 1409385
57025A409385q1027p4493o7946o1498n5779n0266m4300l8607l4088l0210k6021
$$ 1409385 1328358 1253865 1185919 1124421 1068642 1018376 974076 935469 901381 871171 845150
57014H45150k1686j7633j3357q269k528M113J2887K4337L7627N2551P0647R3463
$$ 845150 823464 805831 792474 784205 781677 785790 798677 823014 860641 913192 983839 1077302
57002A077302J21674J55775J92869K19785K14302J60692O5945m1963j32620j89683
$$ 1077302 1198976 1354751 1547620 1767405 1981707 2142399 2208344 2166381 2033761 1844078
56992A844078k13034k11355j94895j71690j46369j21114r7421p6514n8635m3194
$$ 1844078 1631044 1419689 1224794 1053104 906735 785621 688200 611686 553051 509857
56982E09857k9962j9649j3584j3105j8436k7380l5958m1374m3719m4140m2629
$$ 509857 479895 460246 446662 433557 415121 387741 351783 310409 266690 222550 179921
56971A79921l8672l2955k6794k0534j3920p359j587L503Q500J3540J8627K4213
$$ 179921 141249 108294 81500 60966 47046 39687 38100 41603 50103 63643 82270 106483
56959A06483L0401L6356M1494M6263N0415N1289M5410L1779J2902o730k2575l1719
$$ 106483 136884 173240 214734 260997 311412 362701 408111 439890 452792 446062 423487 391768
56947C91768l4290l2949l0167k6512k1878j7067j2927r136n034p86L432Q286J4133
$$ 391768 357478 324529 294362 267850 245972 228905 215978 206842 201808 201022 204454 212740 226873
56934B26873K0020K5115L0289L7042M5398N3510N8081N4681L9981J5745j0582
$$ 226873 246893 272008 302297 339339 384737 438247 496328 551009 590990 606735 596153
56923E96153l1288m3723m9436n0082m6538m0605l4593k9257k4080j9279j5768
$$ 596153 564865 521142 471706 421624 375086 334481 299888 270631 246551 227272 211504
56912B11504j3450j1318r032o983n208l593k637k598k532j506r4O96J191K201
$$ 211504 198054 186736 177704 170721 165513 161920 159283 156685 154153 152647 152553 153249 154440 156641
56898A56641L401M171N148P120R228J0209J0696J2275J4897J7274J9262K1830
$$ 156641 160042 164213 169361 176481 185709 195918 206614 218889 233786 251060 270322 292152
56886B92152K5059K8154L0824L2453L0439K1967P752p969k1219l0314l4688l4260
$$ 292152 317211 345365 376189 408642 439081 461048 468800 460831 439612 409298 374610 340350
56874C40350l0438k5527k0528j5009r225m332j96M958J1981J9705K7115L4984
$$ 340350 309912 284385 263857 248848 239623 235291 235095 240053 252034 271739 298854 333838
56862C33838M4516N5730O8057Q1092R3308J00431R6392P6902M3110K541l4368
$$ 333838 378354 434084 502141 583233 676541 776972 873364 950266 993376 995917 961549
56851I61549o0059p3066p6014p1901o3099n2164m1200l0504j9387q032K797J3436
$$ 961549 901490 828424 752410 680509 617410 565246 524046 493542 474155 466123 468920 482356
56839D82356K5107L8324N2958O9309Q7530J06556J25180J42908J56732J57550
$$ 482356 507463 545787 598745 668054 755584 862140 987320 1130228 1286960 1444510
56829A444510J34125Q3346J5586n1270j02591j32579j42879j38742j26040j09541
$$ 1444510 1578635 1661981 1677567 1626297 1523706 1391127 1248248 1109506 983466 873925
56819H73925r2284p5831o0672m6496l2831j9558o586O599K0482L4809M9038O3288
$$ 873925 781641 705810 645138 598642 565811 546253 539667 546266 566748 601557 650595 713883
56807G13883P8249R3863J07624J13341J02483O9872K0150l2762p4678r9589j09397
$$ 713883 792132 885995 993619 1106960 1209443 1279315 1299465 1266703 1192025 1092436 983039
56796I83039j08276r9824q7726p5192o3213n1318l9898k9932k1029j2003l140
$$ 983039 874763 774939 687213 612021 548808 497490 457592 427660 406631 394628 391488
56785C91488M386J1058J8729K7784L6933M5600N3788N8994N5927M0923J5721j3447
$$ 391488 395874 406932 425661 453445 490378 535978 589766 648760 704687 745610 761331 747884
56773G47884l9353n6766o4321o4560o1161n5889m9027m1754l5919l1620k7272
$$ 747884 708531 651765 587444 522884 461723 405834 356807 315053 279134 247514 220242
56762B20242k2357j8115j5224j2830j0355q402p248o168m849l942l698l540l275
$$ 220242 197885 179770 164546 151716 141361 132959 125711 119543 114694 110752 107054 103514 100239
56749A00239l293l278k285m71P29N57k81r26j153q57k11k18j574l042k758j073
$$ 100239 96946 93668 91383 90912 91641 92198 91917 90991 89838 88981 88770 88552 86978 83936 81178 80105
56733H0105k14j080k277k561k201j668q89k51n68j591k191k254k646l138k394
$$ 80105 79891 78811 76534 73973 71772 70104 69215 68964 68396 66805 64614 62360 59714 56576 54182
56718E4182l69J214J367R65Q67P30K87J05M08O22N77P91J288J497J444J532J377
$$ 54182 53813 55027 56394 57359 58226 58956 59243 59348 59756 60378 60955 61746 63034 64531 65975 67507 68884
56701F8884N17M0J428L796M601L192J403N17Lm13J8J179J748J433J384J839J626
$$ 68884 69401 69441 70869 74665 79266 82458 83861 84378 84381 83968 83986 85165 86913 88346 89730 91569 93195
56684I3195N14k02r0k51j011j244o99n88j122q59N89J636J439J165J507J373K28
$$ 93195 93709 93507 93417 93166 92155 90911 90212 89624 88502 87643 88232 89868 91307 92472 93979 95352 95580
56667I5580o15l30m2o87j475j649j806k286k254j531j336k123k702k459k399k916
$$ 95580 94965 94635 94593 93906 92431 90782 88976 86690 84436 82905 81569 79446 76744 74285 71886 68970
56651F8970k791j484k46K40R66K306K900K168J585K020K216J356Q43J778K896
$$ 68970 66179 64695 64449 64689 65655 67961 70861 73029 74614 76634 78850 80206 81049 82827 85723
56636H5723K730J883J469J218P42O91J169R16m35j303p58r6l16k88R06K045J962
$$ 85723 88453 90336 91805 93023 93765 94456 95625 96541 96106 94803 94045 93949 93633 93345 94251 96296 98258
56619I8258J563J820J828P64k39m1N63O51R01J807K151J119o4m10r32k305l010
$$ 98258 99821 101641 103469 104233 103994 103953 104516 105167 106068 107875 110026 111145 111081 110671 109739 107434 104424
56602A04424j901m33j71j56R58K194K085J334J293J504R61J81j32p03j815j873
$$ 104424 102523 102090 101919 101763 102721 104915 107000 108334 109627 111131 112092 112273 112141 111438 109623 107750
56586A07750n1J671J425M29N64J139O80k0M09J066N29j96N16J730J587P19R42
$$ 107750 107699 109370 110795 111224 111788 112927 113607 113587 113996 115062 115591 115395 115911 117641 119228 119947 120889
56569A20889J820J654P81Q37J677J938J853K666L994M479M419N120O302O577N851
$$ 120889 122709 124363 125144 125981 127658 129596 131449 134115 138109 142588 147007 152127 158429 165006 170857
56554A70857N016M076K794K210L160M280L854K606K277K574K032Q35J91j59j297
$$ 170857 175873 179949 182743 184953 188113 192393 196247 198853 201130 203704 205736 206571 206762 206603 205306
56539B05306k827l604l865m359m470l520k687l234m066l626k771l071l663k753
$$ 205306 202479 198875 195010 190651 186181 182661 179974 176740 172674 169048 166277 163206 159543 156790
56525A56790j077o75j266r93J20N13J35J05N9j118k639k848k286k763l984m126
$$ 156790 155713 155038 153772 152779 152899 153412 153547 153652 153711 152593 149954 147106 144820 142057 138073 133947
56509A33947l132k559k599k157j390j287j350n10L75j71j129l74J537K114J023
$$ 133947 130815 128256 125657 123500 122110 120823 119473 118963 119338 119167 118038 117664 119201 121315 122338
56494A22338K50N48Q49R44J613K353J932J011J227K080J665J76l84L55R87J283
$$ 122338 122588 123136 123985 124929 126542 128895 130827 131838 133065 135145 136810 136986 136602 136957 137944 139227
56478A39227K190L222K968J998K147L154L155K258K335L432L702K857K510L037
$$ 139227 141417 144639 147607 149605 151752 154906 158061 160319 162654 166086 169788 172645 175155 178192
56464A78192L244L094L689M571M254L301L625M857M761L195K258K364J752J36
$$ 178192 181436 184530 188219 192790 197044 200345 203970 208827 213588 216783 219041 221405 223157 223293
56450B23293o47m7M34K69N08R97K94j255j612n64Kl75k09O57O00n09r33m19o01
$$ 223293 222646 222599 223033 223302 223810 224807 225101 223846 222234 221670 221672 221297 221088 221745 222345 221836 220903 220484 219883
56431B19883j665j906j153j159k103k156j124j009k225k790k094j954l007l514
$$ 219883 218218 216312 215159 214000 211897 209741 208617 207608 205383 202593 200499 198545 195538 192024
56417A92024k798k450l037k915j491m49n84m93L49L38j142k295j849p64k2O28
$$ 192024 189226 186776 183739 180824 179333 178884 178300 177807 178156 178494 177352 175057 173208 172444 172422 173050
56401A73050R82K04q97k85J858L040K390J706K034K314K027K015K087J057l40
$$ 173050 174032 174236 173339 173054 174912 177952 180342 182048 184082 186396 188423 190438 192525 193582 193242
56386A93242l2J470J415k88n75J522L259L061K824L813M234K873J394J096Q10
$$ 193242 193210 194680 196095 195807 195232 196754 200013 203074 205898 209711 213945 216818 218212 219308 220118
56371B20118o6J09J928L201K536J604J946K458J962J360J385R86l88j512j775
$$ 220118 220052 220161 222089 225290 227826 229430 231376 233834 235796 237156 238541 239527 239139 237627 235852
56356B35852k142k573j495R71K449K187K189L254L470J980O56M17l97k240k689
$$ 235852 233710 231137 229642 230613 233062 235249 237438 240692 244162 246142 246798 247215 246818 244578 241889
56341B41889n75J751K250J977K114J753O66Q45L076N202N826O407P736P952O197
$$ 241889 241314 243065 245315 247292 249406 251159 251825 252670 255746 260948 266774 273181 280917 288869 295066
56326B95066M795N373O210N744N354O201O715N774N124O079O956O327N744O727
$$ 295066 299861 305234 311444 317188 322542 328743 335458 341232 346356 352435 359391 365718 371462 378189
56312C78189P994Q124P970Q174P338N053L560M057M472L148J534R25R8j534j973
$$ 378189 386183 394307 402277 410451 417789 422842 426402 430459 434931 438079 439613 440538 440636 439102 437129
56297D37129m92K74j221k518j589m39j144j944o87J165J563J774L719O240P494
$$ 437129 436637 436911 435690 433172 431583 431144 430000 428056 427369 428534 430097 431871 435590 441830 449324
56282D49324Q341J0099J1615J1763J2239J4652J7352J8290J8497J9821K1781K3435
$$ 449324 457665 467764 479379 491142 503381 518033 535385 553675 572172 591993 613774 637209
56270F37209K5761K9350L2527L4450L7241M2384M8038N2592N7696O4891P2576
$$ 637209 662970 692320 724847 759297 796538 838922 886960 939552 997248 1062139 1134715
56259A134715P9337Q6971R7100J08058J18268J29257J42072J54166J63268J70939
$$ 1134715 1214052 1301023 1398123 1506181 1624449 1753706 1895778 2049944 2213212 2384151
56249B384151J78761J84428J85229J82017J76109J65712J49250J28954J07258
$$ 2384151 2562912 2747340 2932569 3114586 3290695 3456407 3605657 3734611 3841869
56240C841869Q3052N5433K7683L358j8351l9166n7030o9305p7494q4309q9031
$$ 3841869 3924921 3980354 4008037 4011395 3993044 3953878 3896848 3827543 3750049 3665740 3576709
56229C576709r0189q9890r0890r2103r1462r0542r1954r4750r6832r9202j03468
$$ 3576709 3486520 3396630 3305740 3213637 3122175 3031633 2939679 2844929 2748097 2648895 2545427
56218B545427j07710j09289j09244j09758j09842j07696j04578j02123r8654r2388
$$ 2545427 2437717 2328428 2219184 2109426 1999584 1891888 1787310 1685187 1586533 1494145
56208A494145q5411q0218p5344o8697o2047n7636n3711m8055m2670l9988l7781
$$ 1494145 1408734 1328516 1253172 1184475 1122428 1064792 1011081 963026 920356 880368 842587
56197H42587l2989k7495k4766k3780k1669j9367j9090j9033j6238j2236j0329
$$ 842587 809598 782103 757337 733557 711888 692521 673431 654398 638160 625924 615595
56186F15595r712p687n159m523m593l059j428k060k932q15K817M471M624N677
$$ 615595 605883 598196 593037 588514 583921 580862 579434 577374 574442 573627 576444 580915 585539 591216
56172E91216O735O014N574P931J0750J0647R456J0727J2988J2625J0595J0040
$$ 591216 597951 603965 609539 617470 628220 638867 648323 659050 672038 684663 695258 705298
56160G05298J0031Q075O036O944Q622P140L977L129L775K623R06K002M522M921
$$ 705298 715329 723404 729440 736384 745006 752146 756123 759252 763027 765650 766556 768558 773080 778001
56146G78001M595P286J1822J4544J6623K1651K8371L3146L7449M5401N6162O6219
$$ 778001 782596 789882 801704 816248 832871 854522 882893 916039 953488 998889 1055051 1121270
56134A121270P6821R1336J07349J19312J26838J32399J33197J24071J07012Q9528
$$ 1121270 1198091 1289427 1396776 1516088 1642926 1775325 1908522 2032593 2139605 2229133
56124B229133P4970O2377N3625N1633N2638M9030L9220K7101J3577k742j8115
$$ 2229133 2304103 2366480 2420105 2471738 2524376 2573406 2612626 2639727 2653304 2650562 2632447
56113B632447k6303k8115l0228l5512m2547n2817o9183q8216j02747j11237j16527
$$ 2632447 2606144 2578029 2547801 2512289 2469742 2416925 2347742 2259526 2156779 2045542 1929015
56102A929015j17353j10163r7721q6377p6225o3192m9194m0209l5714l0111k3515
$$ 1929015 1811662 1701499 1603778 1517401 1441176 1377984 1328790 1288581 1252867 1222756 1199241
56091A199241k0853k1385j9606j5719j4808j6311j4851j0743r093r323o442j911
$$ 1199241 1178388 1157003 1137397 1121678 1106870 1090559 1075708 1064965 1055872 1046549 1040107 1038196
56079A038196j897n255m882o34P66j386q66L252N318M510N852R431J0177Q690
$$ 1038196 1036299 1031044 1026162 1025528 1026294 1024908 1024042 1027294 1032612 1037122 1042974 1052405 1062582 1071272
56065A071272J0577J4883J5157J2014J2333J5988J6229J3338J4456J9386K0324
$$ 1071272 1081849 1096732 1111889 1123903 1136236 1152224 1168453 1181791 1196247 1215633 1235957
56054A235957J6617J5919J9503K0401J7583J7838K1820K2446J9082J9086K3310
$$ 1235957 1252574 1268493 1287996 1308397 1325980 1343818 1365638 1388084 1407166 1426252 1449562
56043A449562K4381K1411K1827K6620K8474K6582K8191L3408L3947K9318K8422
$$ 1449562 1473943 1495354 1517181 1543801 1572275 1598857 1627048 1660456 1694403 1723721 1752143
56032A752143L2653L3552K9846L0219L6255L9418L8015M0199M6927M9338M6333
$$ 1752143 1784796 1818348 1848194 1878413 1914668 1954086 1992101 2032300 2079227 2128565 2174898
56021B174898M7122N2931N4452N0751N1982N9607O3241O0987O3124P1621P6327
$$ 2174898 2222020 2274951 2329403 2380154 2432136 2491743 2554984 2615971 2679095 2750716 2827043
56010B827043P5654P9893Q9759R3501R0030R2195J02098J06728J03633J06320
$$ 2827043 2902697 2982590 3072349 3165850 3255880 3348075 3450173 3556901 3660534 3766854
56000C766854J18076J25733J26127J32649J48160J58362J59978J67863J85694
$$ 3766854 3884930 4010663 4136790 4269439 4417599 4575961 4735939 4903802 5089496
55991E089496J98356K02323K13740K36626K54068K61440K76191L03495L25700
$$ 5089496 5287852 5490175 5703915 5940541 6194609 6456049 6732240 7035735 7361435
55982G361435L37864L58869L94361M25119M45934M78001N28061N75291O14193
$$ 7361435 7699299 8058168 8452529 8877648 9323582 9801583 10329644 10904935 11519128
55973A1519128O68019P43200Q15739Q80841R67731J085723J207608J328010J482403
$$ 11519128 12187147 12930347 13746086 14626927 15594658 16680381 17887989 19215999 20698402
55964B0698402J684973J908546K152613K465312K869762L342961L902269M633942
$$ 20698402 22383375 24291921 26444534 28909846 31779608 35122569 39024838 43658780
55956D3658780N601820O821023Q361920J0368340J2917215J5978797J9564755
$$ 43658780 49260600 56081623 64443543 74811883 87729098 103707895 123272650
55949A23272650K3757229K8535836L3792982L9528662M5441552M9762248M8898940
$$ 123272650 147029879 175565715 209358697 248887359 294328911 344091159 392990099
55942C92990099L9434191K1276342j290015k2074212l6655804m4012042m5511532
$$ 392990099 432424290 453700632 452410617 430336405 393680601 349668559 304157027
55935C04157027m3182771l8803676l3703989k8700055k4133233k0108178j6688390
$$ 304157027 260974256 222170580 188466591 159766536 135633303 115525125 98836735
55928I8836735j3873929j1558487r627395q039563o764903n723331m843724m116761
$$ 98836735 84962806 73404319 63776924 55737361 48972458 43249127 38405403 34288642
55920C4288642l538936l062831k646302k295858k019837j787513j571559j384999
$$ 34288642 30749706 27686875 25040573 22744715 20724878 18937365 17365806 15980807
55912A5980807j240830j117056r93917q86158q07466p39729o66227o00626n55536
$$ 15980807 14739977 13622921 12629004 11742846 10935380 10195651 9529424 8928798 8373262
55903H373262n15180m65491m20342l92609l68523l34896l03807k86962k72047
$$ 8373262 7858082 7392591 6972249 6579640 6211117 5876221 5572414 5285452 5013405
55894E013405k47347k24479k14649k06370j88209j70765j65132j61233j47980
$$ 5013405 4766058 4541579 4326930 4120560 3932351 3761586 3596454 3435221 3287241
55885C287241j34301j30361j27508j16076j04435j01732r9545q8797p7650p5095
$$ 3287241 3152940 3022579 2895071 2778995 2674560 2572828 2473283 2384486 2306836 2231741
55875B231741p3351o3784n4339n4210n6373n1792m6312m7391m8348m1784l5051
$$ 2231741 2158390 2094606 2040267 1986057 1929684 1877892 1831580 1784189 1735841 1694057 1659006
55864A659006l6758m0693l8199l4050l5165l5779k8630j9703j7724j9681k0075
$$ 1659006 1622248 1581555 1543356 1509306 1474141 1438362 1409732 1390029 1372305 1352624 1332549
55853A332549k3425l4055m4042m4658m0248l8407l6407k9601k3117k2595k2804
$$ 1332549 1309124 1275069 1231027 1186369 1146121 1107714 1071307 1041706 1018589 995994 973190
55842I73190j7585j1804j1595j2180p359j947k713n659m234j823m371q627r232
$$ 973190 955605 943801 932206 920026 912667 910720 908007 902348 898114 896291 891920 883293 874061
55829H74061r611j4501j9355j8409j5844j7837k0906j9169j5947j7127j9858j8798
$$ 874061 864450 849949 830594 812185 796341 778504 757598 738429 722482 705355 685497 666699
55817F66699j6841j8831k1091j8115j3401j3004j4218j1323o805o267p603n578
$$ 666699 649858 631027 609936 591821 578420 565416 551198 539875 533070 526803 519200 513622
55805E13622k049j564j849J411N319M965L007M465O820M892P52p35j522n937j1132
$$ 513622 511573 510009 508160 509571 514890 519855 522862 527327 534147 539039 539791 539056 537534 531597 520465
55790E20465j1736r912j1242j4384j4232j1752j1405j2179j0158o858o260o711
$$ 520465 508729 498817 487575 473191 458959 447207 435802 423623 413465 406607 400347 393636
55778C93636m173l87M34l83N14O33m159j0859j3427j2647j3358j4943j3207r297
$$ 393636 389463 389076 389510 389127 389641 390274 386115 375256 361829 349182 335824 320881 307674 298377
55764B98377p937q874q204o288o464p740o500l699l038l786k600m94q73k668k355
$$ 298377 290440 281566 273362 267074 260610 252870 246370 242671 239633 235847 233247 232753 231880 229212 226857
55749B26857q29j421l179l024k244l997o582o275m529n331p507o965m488m012
$$ 226857 226028 224607 221428 218404 216160 212163 205581 199306 194777 189446 181939 174974 170486 166474
55735A66474m935l482k34R33J77R66L121L314J444K11m80k576m730m274k760l449
$$ 166474 161539 158057 157823 158756 158933 159899 163020 166334 167778 167989 167509 164933 160203 155929 153169 149720
55719A49720m980l805j177j200l432m010k648k067j936L1K389J964K58J289M306
$$ 149720 144740 140935 139758 138558 135126 131116 128468 126401 124465 124496 126885 128849 129107 130396 134702
55704A34702N285M469N552Q273Q675O198L984K625M4k879l020r76j93o00P56L395
$$ 134702 139987 144456 150008 158281 166956 173154 177138 179763 179807 176928 173908 172932 172739 172139 172895 176290
55688A76290M007K889L362N108M563J791N39J376J121p40j237R6M69n27l50R96
$$ 176290 180297 183186 186548 191656 196219 198010 198549 199925 201046 200306 199069 199165 199634 199107 198757 199753
55672A99753O66j426k303j581j852l214l009j362j226k539k088K93J245J51Q5
$$ 199753 200419 198993 196690 195109 193257 190043 187034 185672 184446 181907 179819 180112 181357 181508 181593
55657A81593J690K005M78L37K488L649K218Q32J273J710P41l27r01k453m970o157
$$ 181593 183283 185288 185766 186103 188591 192240 194458 195290 196563 198273 199014 198687 197786 195333 190363 184206
55641A84206n568n554o955p811p345p201p789p423o035n688o575o487n161m981
$$ 184206 178638 173084 166129 158318 150973 143772 135983 128560 122525 116837 110262 103775 98614 93633
55627I3633o445p005n483l742l001k335j646k249l646l559k009j490k376k161
$$ 93633 87188 80183 74700 70958 67957 65622 63976 61727 58081 54522 52513 51023 48647 46486
55613D6486j72J093L85m35o8L22K2M4M74Jj113r41M91R05k70j149j068j407k250
$$ 46486 46314 47407 47792 47357 47289 47611 47633 47677 48151 48152 47039 46098 46589 47494 47224 46075 45007 43600 41350
55594D1350j974p22n37j465j303J81O73l40o54M62R91J08l99L11Q22O02Q61J521
$$ 41350 39376 38654 38117 36652 35349 35530 36203 35863 35209 35671 36662 36770 36371 36682 37504 38106 38967 40488
55576D0488R00q31j484q67j116k433k498r33l14j584k493j810j213j651j654o47
$$ 40488 41388 40557 39073 38206 37090 34657 32159 31226 30912 29328 26835 25025 23812 22161 20507 19860
55560A9860l02j120j211J19R67L65r4O05J320J386J676K134J511K99N45K091K574
$$ 19860 19558 18438 17227 17346 18313 18678 18584 19189 20509 21895 23571 25705 27216 27515 28060 30151 32725
55543C2725J723J748K837K522M71m33R27K126J789J686K682K890J669J293K666
$$ 32725 34448 36196 39033 41555 42026 41593 42520 44646 46435 48121 50803 53693 55362 56655 59321
55528E9321L357J981N83O04M21q94j264M38J873J195O1J78K37j126k520k651k937
$$ 59321 62678 64659 65242 65846 66267 65373 64109 64547 66420 67615 67676 67854 68091 66965 64445 61794 58857
55511E8857m566n797m870l009k115j847j348j325k215k680k032j756k761l560
$$ 58857 54291 48494 43624 40615 38500 36653 35305 33980 31765 29085 27053 25297 22536 18976
55497A8976l031k344k361j914m86J61r32j990j631j153A597d14j115l60p02o92
$$ 18976 15945 13601 11240 9326 8840 9001 8069 6079 4448 3295 1597 -414 -1529 -1889 -2591 -3283
55481c283N50J176j83j712j405j99K52M47J206J418J37j163q97N3K82K49P15Q41
$$ -3283 -2733 -1557 -1740 -3452 -4857 -5056 -4804 -4357 -3151 -1733 -1596 -2759 -3656 -3603 -3321 -3072 -2357 -1516
55463a516j5o82k68J87j16k25K16k76k072k984j787m75q24j487q64m9l72o50L24
$$ -1516 -1531 -2213 -2481 -2294 -2410 -2635 -2419 -2695 -4767 -7751 -9538 -10013 -10837 -12324 -13188 -13237 -13609 -14259 -13935
55444a3935J079R9j156q20J20n3n52R3R95O60j25K4L34l17p22N78K182J882K91
$$ -13935 -12856 -12757 -13913 -14733 -14613 -14666 -15218 -15125 -14130 -13470 -13595 -13571 -13237 -13554 -14276 -13698 -11516 -9634 -9343
55425i343m60k81n03r08l57O30O32j36m03j62k46l99J37J017J476J605J489N36
$$ -9343 -9803 -10084 -10587 -11495 -11852 -11222 -10590 -10726 -11129 -11291 -11537 -11936 -11799 -10782 -9306 -7701 -6212 -5676
55407e676q80q98R49K342J538O0r2K42n42j534r80L92O23k07o36n64p72q47m4
$$ -5676 -6556 -7454 -6505 -4163 -2625 -2565 -2657 -2415 -2957 -4491 -5471 -5079 -4456 -4663 -5299 -5863 -6635 -7482 -7526
55388g526P62K80r60j583j535j362p84K38M68n12r71K18J310N25q54p58J86K26
$$ -7526 -6764 -6484 -7444 -9027 -10562 -11924 -12708 -12470 -12002 -12514 -13485 -13267 -11957 -11432 -12286 -13044 -12858 -12632
55370a2632k10K39Q86L58m26K52J615J649O62N39J270J297O11N29R72P47P0J22
$$ -12632 -12842 -12603 -11717 -11359 -11785 -11533 -9918 -8269 -7607 -7068 -5798 -4501 -3890 -3361 -2389 -1642 -1572 -1450
55352a450N94K60n15l89L06O8j004j466j120j035j270r18j44K9k79q3N48P59O34
$$ -1450 -856 -596 -1111 -1500 -1194 -1126 -2130 -3596 -4716 -5751 -7021 -7939 -8083 -8054 -8333 -8416 -7868 -7109 -6475
55333f475Q01Q19j07j384j796j393r37l43N96R53Q5p92m04L25p3r10o02M55P22
$$ -6475 -5674 -4855 -4962 -6346 -8142 -9535 -10472 -10815 -10219 -9266 -9181 -9973 -10377 -10052 -10125 -11035 -11637 -11182 -10460
55314a0460K71L19Q28R12P75R99Q75k44j037j85R15J50j589j704j05R01M78M1
$$ -10460 -10189 -9870 -9042 -8130 -7355 -6356 -5481 -5725 -6762 -6947 -6032 -5882 -7471 -9175 -9280 -8379 -7901 -7860
55296g860L55O41M91K57l30j579k298j179O73J105K08j49L79N48K41M67R01K63
$$ -7860 -7505 -6864 -6373 -6116 -6446 -8025 -10323 -11502 -10829 -9724 -9516 -9665 -9286 -8738 -8497 -8030 -7129 -6866
55278f866r56r88jl3j440k194j155M30J214J336J240Q21L03J89K08j63k99O81
$$ -6866 -7822 -8810 -8811 -8844 -10284 -12478 -13633 -13203 -11989 -10653 -9413 -8592 -8289 -8100 -7892 -8055 -8354 -7673
55260g673J978K000Q91J61J67k0n42o05k26j15j30K31L50n26j394q49M14O65J33
$$ -7673 -5695 -3695 -2804 -2643 -2476 -2496 -3038 -3643 -3869 -3984 -4114 -3883 -3533 -4059 -5453 -6302 -5888 -5223 -5090
55241e090K87Q95N02n42n01N78R80M15K40N92K41o98p16K59O95L26L84b94A30
$$ -5090 -4803 -3908 -3406 -3948 -4449 -3871 -2891 -2476 -2236 -1644 -1403 -2101 -2817 -2558 -1863 -1537 -1153 -294 130
55221e26m82A15K020J169m0n25q23H40l45J125J521K54j065A072A45d21g0A561
$$ -526 -1008 115 2135 3304 3264 2739 1916 840 495 1620 3141 3395 2330 1072 145 -421 -70 1561
55202C491R12j30m47n70n05N09J951K096P74k00L2K84k26o20l28j6Q9O23J245
$$ 3491 4403 4273 3826 3256 2751 3260 5211 7307 8081 7881 7913 8197 7971 7351 7023 7007 7096 7719 8964
55183H964O76p95j243k13N05m4o59m92m29r75j209q55r85E86g87J36C62L79k44
$$ 8964 9640 8845 7602 7389 7894 7850 7191 6699 6270 5295 4086 3231 2246 586 -787 -651 362 741 497
55164D97J91M93j81D66K95Q35j19C03c96aC85f7q04o76q02q94l38L05J70l74m35
$$ 497 688 1181 1000 466 761 1596 1477 303 -396 -1 385 -67 -871 -1547 -2349 -3243 -3581 -3276 -3106 -3480 -3915
55143c915k7L93Q35J230d72b11J02H56J691J286L90l9j71m49n39j99l5l60m49
$$ -3915 -3942 -3549 -2714 -1484 -472 -211 -109 856 2547 3833 4223 4184 4013 3564 3025 2826 2791 2431 1982
55124A982J62Q06R64J140J649J878J597J622K222K310J259Q8j92j57o94j433j602
$$ 1982 2144 2950 3914 5054 6703 8581 10178 11800 14022 16332 17591 17679 17487 17330 16636 15203 13601
55107A3601j393j364j433j365j396j532j194j66R71J777K300K251J198j89o14
$$ 13601 12208 10844 9411 8046 6650 5118 3924 3758 4729 6506 8806 11057 12255 12066 11452
55092A1452j82k66j031j032K17J407J816K306L079K727Q65m55M09K199K694J620
$$ 11452 11270 11004 9973 8941 9158 10565 12381 14687 17766 20493 21358 20903 21312 23511 26205 27825
55076B7825J23j161k033k026j135k27L23J078J967J849O03k19J22L59l27p32O0
$$ 27825 27948 26787 24754 22728 21593 21366 21689 22767 24734 26583 27186 26967 27089 27448 27121 26389 26449
55059B6449Q60N48Q8N34R46K99l61J57P61j22j607j729o18O0m9l6P9m94j418j505
$$ 26449 27309 27857 27945 28479 29425 29724 29363 29520 30281 30159 28552 26823 26205 26265 26216 26180 26259 25765 24347 22842
55039B2842o89J01O39J385K035J788Q44J82J21K21K94L60M9q61j721j823j406
$$ 22842 22153 22254 22893 24278 26313 28101 28945 29127 29248 29469 29763 30123 30172 29311 27590 25767 24361
55022B4361r67l65M52P69J82n11n50l59m29k06O84J271P34k0K38J000R79K28k10
$$ 24361 23394 23029 23481 24250 24432 23921 23371 23012 22583 22377 23061 24332 25066 25046 25284 26284 27263 27491 27281
55003B7281m8K58O18J043R86K06m66m20l82j016j508r77j85k43p30p13o31j214
$$ 27281 27233 27491 28109 29152 30138 30344 29878 29458 29076 28060 26552 25575 25390 25147 24417 23704 23073 21859
54985B1859j520k08J882K543J347L5j10M85J061J459J616J438J241J276J087L27
$$ 21859 20339 20131 22013 24556 25903 25938 25828 26313 27374 28833 30449 31887 33128 34404 35491 35818
54969C5818k71R0Q46R13M50M36R47J282J387J779K287K241J734J542J944K656
$$ 35818 35547 35637 36483 37396 37846 38282 39229 40511 41898 43677 45964 48205 49939 51481 53425 56081
54953E6081L552M534N105N079N224O202P567Q696R914J1552J2796J2741J1702
$$ 56081 59633 64167 69272 74351 79575 85777 93344 102040 111954 123506 136302 149043 160745
54940A60745J0185P540L254j333m413o220q329j0958j2728j2895j2073j0916r591
$$ 160745 170930 178470 181724 180391 175978 169758 161429 150471 137743 124848 112775 101859 92268
54927I2268q436p742p032n697m127l020k098p85L62L84l89q30p69p89p23P1J244
$$ 92268 83832 76090 69058 63361 59234 56214 54116 53331 53693 54077 53688 52858 52089 51300 50577 50648 51892
54910E1892J840J943K500L721M972O010P008P730Q044Q757J0439J1935J1630R751
$$ 51892 53732 55675 58175 61896 66868 72878 79886 87616 95660 104417 114856 126791 138421 148172
54896A48172P732N737K704j329m955p470r470j1170j1857j1349j0458r651q614
$$ 148172 155904 161641 164345 163016 158061 150591 141121 129951 118094 106745 96287 86636 78022
54883G8022p313o271n493m341k733j455j054j331j836k120j675n55K98K27j22
$$ 78022 70709 64438 58945 54604 51871 50416 49362 48031 46195 44075 42400 41845 42143 42370 42248
54868D2248O9L54j04r19j177j042j168j233o68j93q45j960k065j264q26p87j03
$$ 42248 42317 42671 42567 41648 40471 39429 38261 37028 36360 36167 35322 33362 31297 30033 29207 28420 28317
54851B8317J058J356O07l2k42p62j374r21L67P18m86j824k180k007j751r74K44
$$ 28317 29375 30731 31338 31306 31064 30302 28928 28007 28374 29092 28606 26782 24602 22595 20844 19870 20114
54834B0114Q29M94L41R85J582J474J238J343J301Q77P34J082J115M93O6L33N55
$$ 20114 20943 21437 21778 22763 24345 25819 27057 28400 29701 30578 31312 32394 33509 34002 34068 34401 34956
54817C4956R3m92n52l17j72Q1N78J064J591K466L218K944J956J602K091K116J209
$$ 34956 35049 34557 34005 33688 33516 33597 34175 35239 36830 39296 42514 45458 47414 49016 51107 53223 54432
54800E4432O81J450K640L404M455O454Q395R062R021R635J0991J2163J2748J2847
$$ 54432 55113 56563 59203 62607 67062 73516 81911 90973 99994 109629 120620 132783 145531 158378
54786A58378J2074R952O861L645N37k572n318p163q232q990r441r274q555p608
$$ 158378 170452 180404 187265 190910 191447 188875 183557 176394 168162 159172 149731 140457 131902 124294
54772A24294o547n424m484l821l170k466k085k116j960j191k82J42K75P08J360
$$ 124294 117747 112323 107839 104018 100848 98382 96297 94181 92221 91030 90748 90890 91165 91873 93233
54757I3233J687J749K355L955N825O805O780P045Q907J2020J4631J5554J5272
$$ 93233 94920 96669 99024 102979 108804 115609 122389 129434 138341 150361 164992 180546 195818
54744A95818J4788J4177J2800J0297O621J800l467p673j0018j1516j3470j5438
$$ 195818 210606 224783 237583 247880 254501 256301 252834 245161 235143 223627 210157 194719
54732A94719j5948j4781j3088j1531r835q087o909o323n754n248n280n412m617
$$ 194719 178771 163990 150902 139371 129536 121449 114540 108217 102463 97215 91935 86523 81906
54719H1906l085k194k364k478j771r13o66p50o32l13J02O68J099J023P65R24J165
$$ 81906 78821 76627 74263 71785 70014 69101 68435 67685 67053 66740 66842 67510 68609 69632 70397 71321 72486
54702G2486O72k49n15j45j92p04n51M12Q46J93l80rN66O05O11J045J276P99J83
$$ 72486 73158 72909 72394 72249 72057 71353 70802 71214 72060 72253 71873 71864 72430 73035 73646 74691 75967 76766 76949
54683G6949r3m94j189j285k80Q76J217J094J214J447J506J710K130K112J551J431
$$ 76949 76856 76362 75173 73888 73608 74484 75701 76795 78009 79456 80962 82672 84802 86914 88465 89896
54667H9896K209K855K537K063K450L241L463L332L611M087L964L200K351J600
$$ 89896 92105 94960 97497 99560 102010 105251 108714 112046 115657 119744 123708 126908 129259 130859
54653A30859Q71L27j7n20j049p47N50J630J584J176J572K545L170L478M194N340
$$ 130859 131730 132057 132040 131520 130471 129724 130274 131904 133488 134664 136236 138781 141951 145429 149623 154963
54637A54963O254O609O523O101N621N596N882N372L323L78k445m967p268q814
$$ 154963 161217 167826 174349 180450 186071 191667 197549 202921 206244 206622 204177 199210 191942 183128
54623A83128r230r187r431r547q730p219n915n027m135l138k308j690j224j039
$$ 183128 173898 164711 155280 145733 137003 129784 123869 118842 114707 111569 109261 107571 106347 105308
54609A05308r89m63P22J816K163K049J902J482O05j41l34n17j246k026k171j944
$$ 105308 104319 103856 104578 106394 108557 110606 112508 113990 114595 114454 114120 113603 112357 110331 108160 106216
54593A06216j977k256k549l024l563l372k316j614k069k604j913o57m30j238j770
$$ 106216 104239 101983 99434 96410 92847 89475 87159 85545 83476 80872 78959 78302 77872 76634 74864
54578G4864j690j844k373k359j559r67j242j750j635q82j03J02o12j998l036k790
$$ 74864 73174 71330 68957 66598 65039 64072 62830 61080 59445 58563 58460 58562 57950 55952 52916 50126
54562E0126j512l58k5k12l51l17l82q21j484j642o38J060K083J815J153J078J276
$$ 50126 48614 48256 48231 48019 47668 47351 46969 46148 44664 43022 42384 43444 45527 47342 48495 49573 50849
54545E0849R36J72k99l22k53j55Q6K43K02M93J572K917L621L591L375L223L081
$$ 50849 51785 51957 51658 51336 51083 50928 51014 51257 51459 51952 53524 56441 60062 63653 67028 70251 73332
54528G3332L166L706M414M826M859M531L624K232R69L6j139k791m115m558m752
$$ 73332 76498 80204 84618 89444 94303 98834 102458 104690 105659 105695 104556 101765 97650 93092 88340
54513H8340n244n241l936k230j606j937j983j593j738k515k846k257j497j146
$$ 88340 83096 77855 73919 71689 70083 68146 66163 64570 62832 60317 57471 55214 53717 52571
54499E2571q55m24l29p86j175r39l23J68M92Q18J106J129Q03L01LJ38M22L17j57
$$ 52571 51716 51292 50963 50177 49002 48063 47740 47908 48400 49218 50324 51453 52256 52557 52560 52698 53120 53437 53280
54480E3280l59KM79P55J132J669J723J018L24K45J97m75j192j085m92l19m37k9
$$ 53280 52921 52923 53402 54157 55289 56958 58681 59699 60023 60268 60465 59990 58798 57713 57221 56902 56465 56436
54462E6436Q55J331J002K63n25j112j031j46P47Q52N09M42M44r9q36q98m28l35
$$ 56436 57291 58622 59624 59887 59362 58250 57219 57073 57820 58672 59181 59623 60067 59968 59132 58234 57806 57471
54444E7471p76j045q54n62k83Q3J20o45j697k073j805j636j580r79R3P46P07N94
$$ 57471 56695 55650 54796 54234 53951 54034 54154 53509 51812 49739 47934 46298 44718 43739 43832 44578 45285 45879
54426D5879P40P80N34K77M9l38o54n36k32j52J00J072K087J849M56n26j47R54
$$ 45879 46619 47399 47933 48210 48259 47921 47267 46731 46499 46347 46447 47519 49606 51455 51911 51385 51238 52192
54408E2192J813K189K141J727J396J710K396K528J930J498J972L157M465N468
$$ 52192 54005 56194 58335 60062 61458 63168 65564 68092 70022 71520 73492 76649 81114 86582
54394H6582N855N610N250N184N011M227L286K998L126K722J695Q57M98N8p92j779
$$ 86582 92437 98047 103297 108481 113492 117719 121005 124003 127129 129851 131546 132403 132901 132959 132167 130388
54378A30388k685l342l201k121j293j996l549m079l243k571k881l110k265r77
$$ 130388 127703 124361 121160 119039 117746 115750 112201 108122 104879 102308 99427 96317 94052 93075
54364I3075l25l90p40j224j612j386n99j36n36j216j375r64m23p7m3j65P0R02
$$ 93075 92750 92360 91620 90396 88784 87398 86799 86663 86127 84911 83536 82572 82149 82072 82029 81864 81934 82836
54346H2836J707J740J367J503K097K284J943J879K401L031L677M674N559N205
$$ 82836 84543 86283 87650 89153 91250 93534 95477 97356 99757 102788 106465 111139 116698 121903
54332A21903L541J832R09L55k69p47j131j928l002l504l276l047k957k448j906
$$ 121903 125444 127276 128185 128540 128271 127524 126393 124465 121463 117959 114683 111636 108679 106231 104325
54317A04325k635m582n847n332m164l591l178k326j870k627l592l323k185j561
$$ 104325 101690 97108 91261 85929 81765 78174 74996 72670 70800 68173 64581 61258 59073 57512
54303E7512j624j432q25o37j185j741j612q90j61k1o55j521j748j189n33j75K13
$$ 57512 55888 54456 53631 52994 51809 50068 48456 47566 47405 47384 46729 45208 43460 42271 41738 41563 41776
54286D1776O75N47l30j006p60j44R4J45L47K32n29j052l32J106J863J558J017
$$ 41776 42451 42998 42668 41662 40902 40758 40852 40997 41344 41576 41047 39995 39663 40769 42632 44190 45207
54269D5207P94N48r3r02j305q81K51J313J438O78q3l80n56p57m54M13R38O22K81
$$ 45207 46001 46549 46456 45554 44249 43368 43619 44932 46370 47048 46965 46585 46029 45272 44818 45231 46169 46791 47072
54250D7072O50J070O03l32o42l35k81o74q58n59j37J75M15L86n7l80J25J210J880
$$ 47072 47722 48792 49395 49063 48421 48086 47805 47131 46273 45714 45577 45752 46167 46553 46496 46116 46241 47451 49331
54231D9331J594P03k28p70n20N31J503J257k61j754j886n78R67J403M21j039j869
$$ 49331 50925 51628 51400 50630 50110 50641 52144 53401 53140 51386 49500 48922 49889 51292 51713 50674 48805
54214D8805j965k002k133j738o40L23M09l0k50j67o7Q4L77M72Q6l96m14l5L07
$$ 48805 46840 44838 42705 40967 40327 40650 41059 41029 40779 40612 40545 40629 41006 41478 41564 41168 40754 40719 41026
54195D1026M81N79N51L78K40J14k96q52q11P5R49R03J60m45n73l59J06N59L82
$$ 41026 41507 42086 42637 43015 43255 43369 43073 42221 41410 41485 42434 43337 43497 43052 42479 42120 42226 42785 43167
54176D3167n98j576j704j138n17J6N40P57M44R9K47N23K97j99k61J54M99N76N64
$$ 43167 42569 40993 39289 38151 37634 37650 38190 38947 39391 39490 39737 40260 40557 40358 40097 40251 40750 41326 41890
54157D1890L99o6n29o20n16m94k58M43J021Q29L59N52J173J073L3q53q53n23n55
$$ 41890 42289 42223 41694 41074 40558 40064 39806 40249 41270 42099 42458 43010 44183 45256 45289 44436 43583 43060 42505
54138D2505p25n44j86j38l93n89o41p71j001j017o39j05J94K40L65O73Q27O01
$$ 42505 41780 41236 41050 40912 40519 39930 39289 38518 37517 36500 35861 35756 35950 36190 36555 37228 38055 38656
54120C8656L50L90K82n31j515j469k20J034J375J172J035Q47M58L42P93J187Q77
$$ 38656 39006 39396 39678 39147 37632 36163 35943 36977 38352 39524 40559 41406 41864 42206 42999 44186 45063
54103D5063J64l82q61j524j943j602p51Q9Q94J653J811J102K72L2l2n77j178j073
$$ 45063 45227 44845 43984 42460 40517 38915 38164 38253 39147 40800 42611 43713 43985 44017 43985 43408 42230 41157
54085D1157n91n17n91k2Q87J079N57L97R05J142N05m06p60l70N12J346J241j83
$$ 41157 40566 40049 39458 39436 40323 41402 41959 42356 43261 44403 44908 44502 43742 43372 43884 45230 46471 46288
54067D6288j739j693oJ486J447M84j60k18n8K71Q68J370J311P84L25L44R70J991
$$ 46288 44549 42856 42850 44336 45783 46267 46107 45889 45831 46102 46970 48340 49651 50435 50760 51104 52074 54065
54049E4065K757K588J589O75N18Q39J041J095J396K019K588K814K862L049L350
$$ 54065 56822 59410 60999 61674 62192 63031 64072 65167 66563 68582 71170 73984 76846 79895 83245
54034H3245L403L051K684K789L299L758M056M459M917M983M665M613N062N365
$$ 83245 86648 89699 92383 95172 98471 102229 106285 110744 115661 120644 125309 129922 134984 140349
54020A40349N049M601M564M553L961L033K384J971J419R03P43N46k36j183j392
$$ 140349 145398 149999 154563 159116 163077 166110 168494 170465 171884 172787 173530 174076 173840 172657 171265
54005A71265r43q92j867l494n102o134o031m694l010k104k076k230k324k685l217
$$ 171265 170322 169430 167563 164069 158967 152833 146802 142108 139098 136994 134918 132688 130364 127679 124462
53990A24462l363l045k750k558k114j497j271j431j286o06n3j92p46j175j343
$$ 124462 121099 118054 115304 112746 110632 109135 107864 106433 105147 104541 104488 104296 103550 102375 101032
53975A01032j383j385j377j232o67J74M92j66r75q04J75Q56R58J235J884K132
$$ 101032 99649 98264 96887 95655 94988 95162 95654 95488 94513 93709 93884 94740 95698 96933 98817 100949
53959A00949J657J262J567K099K151J723J106L87j51P8J009J609J137K08n1N42
$$ 100949 102606 103868 105435 107534 109685 111408 112514 112901 112750 112828 113837 115446 116583 116791 116740 117282
53943A17282J197J296R65P00P58R85J127J322K081L497M662M552L337K218J912
$$ 117282 118479 119775 120740 121440 122198 123183 124310 125632 127713 131210 135872 140424 143761 145979 147891
53928A47891J975J694R54J00n43p16l26L63R71J523K323L343M207M661M636M017
$$ 147891 149866 151560 152514 152614 152071 151355 151029 151392 152363 153886 156209 159552 163759 168420 173056 177073
53912A77073K980K330K766L966N061N827O536O936O437N236M176L408K319Q91
$$ 177073 180053 182383 185149 189115 194176 200003 206539 213475 219912 225148 229324 232732 235051 235942
53898B35942l0j40j94o87j136j150j212j748k339k533k668l260m147m881n402
$$ 235942 235912 235772 235578 234891 233755 232605 231393 229645 227306 224773 222105 218845 214698 209817 204415
53883B04415n798n938n785n532n110m219l168k907l681m498m501m078l877l538
$$ 204415 198617 192679 186894 181362 176252 172033 168865 165958 162277 157779 153278 149200 145323 141785
53869A41785k471j277j223k388l429l322k556k249k654k994k592j724j241j505
$$ 141785 139314 138037 136814 134426 130997 127675 125119 122870 120216 117222 114630 112906 111665 110160
53855A10160k071k462k778l144l025j800J8J032N57o20j293j145p66q44j499k117
$$ 110160 108089 105627 102849 99705 96680 94880 94898 95930 96487 95867 94574 93429 92663 91819 90320 88203
53839H8203j833n00Q70J144L32o52j239j485j346p12p2j13n31k92P48J492J219
$$ 88203 86370 85870 86740 87884 88216 87564 86325 84840 83494 82782 82710 82597 82066 81774 82522 84014 85233
53822H5233M68n9m26p95p94l16o4n36j053o08P52K064K633K539K232K079K124
$$ 85233 85701 85642 85216 84421 83627 83311 83247 82711 81658 81050 81802 83866 86499 89038 91270 93349 95473
53805I5473K060J674J312J515K224K909L408L954M415M398M144M349M938N051
$$ 95473 97533 99207 100519 102034 104258 107167 110575 114529 118944 123342 127486 131835 136773 141824
53791A41824M453L888L773L653L306L200L316K780J394K81K31N02K31j11K11O70
$$ 141824 146277 150165 153938 157591 160897 164097 167413 170193 171587 171868 172099 172601 172832 172721 172932 173602
53775A73602L61l92o65o41j336k779l782l463k128o57K41K65l33r03j089j158
$$ 173602 173963 173571 172906 172265 170929 168150 164368 160905 158777 158120 158361 158626 158293 157390 156301 155143
53759A55143j341j397j237j290j715j913j532j192j420j621j044j32J57j16j32
$$ 155143 153802 152405 151168 149878 148163 146250 144718 143526 142106 140485 139441 139309 139466 139350 139218
53744A39218K56M75L71L00K83L4k05J54R88J438R98j5j038j666j641j075o04p14
$$ 139218 139474 139949 140320 140620 140903 140937 140732 140886 141874 143312 144310 144295 143257 141591 139950 138875 138271 137557
53726A37557j079j078p20m15j74K08M66J79m25p11n96m58l33K8M53N24L31K75
$$ 137557 136478 135400 134680 134265 134091 134299 134765 134944 134519 133808 133212 132754 132421 132449 132902 133426 133757 134032
53708A34032K74L8k5Q51K466L600L519K757K214K166K450K965L669M440N194N782
$$ 134032 134306 134344 134319 135170 137636 141236 144755 147512 149726 151892 154342 157307 160976 165416 170610 176392
53692A76392N822N016L682K552K037K005K228K620L114L703M455N211N481N035
$$ 176392 182214 187230 190912 193464 195501 197506 199734 202354 205468 209171 213626 218837 224318 229353
53678B29353M256L512K583J289J62k04j06k17m67l51m4k13q08j103r43r43j316
$$ 229353 233609 237121 239704 240993 241155 240951 240845 240628 240161 239810 239766 239553 238745 237642 236699 235756 234440
53661B34440j507j244j021j216j473j383j093q82p37o14o13p07p25p95j166j546
$$ 234440 232933 231689 230668 229452 227979 226596 225503 224621 223884 223270 222657 221950 221225 220430 219264 217718
53645B17718j298m55J33j3m52p00r23j324j532j192o12k71j14J90O63J176J780
$$ 217718 216420 215965 216098 216085 215633 214933 214010 212686 211154 209962 209350 209079 208965 209155 209818 210994 212774
53628B12774K433K690K270J587J256J305J380J464J776K156K229K217K777L919
$$ 212774 215207 217897 220167 221754 223010 224315 225695 227159 228935 231091 233320 235537 238314 242233
53614B42233M627M124L006K539L113L950M375M652N291O062O350O154O046O242
$$ 242233 246860 250984 253990 256529 259642 263592 267967 272619 277910 283972 290322 296476 302522 308764
53600C08764O326O129O117O591P027O766O055N736O092O544O519O091N663N427
$$ 308764 315090 321219 327336 333927 340954 347720 353775 359511 365603 372147 378666 384757 390420 395847
53586C95847N328N314N361N353N146M795M584M721M966M788M014L135K719K658
$$ 395847 401175 406489 411850 417203 422349 427144 431728 436449 441415 446203 450217 453352 456071 458729
53572D58729K394J758J164R14Q24O92O13P26R70J218J289Q24l13j478j751j081
$$ 458729 461123 462881 464045 464959 465783 466475 467088 467814 468784 470002 471291 472115 471802 470324 468573 467492
53556D67492l11N0K94N61L69l98r71p87l43k55j93L38Q87O64j68p36o96l80m1
$$ 467492 467181 467231 467525 468086 468455 468057 467086 466299 465956 465701 465508 465846 466733 467397 467229 466493 465797 465417 465376
53537D65376K79M19M53J004K393L812M248L936L902M427M927N238N834O764P454
$$ 465376 465655 466074 466527 467531 469924 473736 477984 481920 485822 490249 495176 500414 506248 513012 520466
53522E20466P740Q154Q992R881J0553J1235J2035J2695J3217J4085J5491J6924
$$ 520466 528206 536360 545352 555233 565786 577021 589056 601751 614968 629053 644544 661468
53510F61468J7818J8148J8257J8500J9201K0483K2002K3259K4211K5167K6133
$$ 661468 679286 697434 715691 734191 753392 773875 795877 819136 843347 868514 894647
53499H94647K6869K7510K8476K9675L0496L0829L1379L2622L4002L4596L4218
$$ 894647 921516 949026 977502 1007177 1037673 1068502 1099881 1132503 1166505 1201101 1235319
53488A235319L3443L2775L2134L1214L0102K9407K9612L0407L0945L0916L0900
$$ 1235319 1268762 1301537 1333671 1364885 1394987 1424394 1454006 1484413 1515358 1546274 1577174
53477A577174L1405L2028L2035L1292L0127K8660K6951K5445K4588K4126K3386
$$ 1577174 1608579 1640607 1672642 1703934 1734061 1762721 1789672 1815117 1839705 1863831 1887217
53466A887217K2062K0181J7678J4714J2065J0452R632Q911Q200P667O724M392
$$ 1887217 1909279 1929460 1947138 1961852 1973917 1984369 1994001 2002912 2011112 2018779 2025503 2029895
53454B029895P39l143o560r635j2268j3855j4453j5248j7314k0452k3631k6048
$$ 2029895 2030634 2027491 2020931 2011296 1999028 1985173 1970720 1955472 1938158 1917706 1894075 1868027
53442A868027k7506k8271k8886k9760l0816l1777l2650l3461l3858l3643l3394
$$ 1868027 1840521 1812250 1783364 1753604 1722788 1691011 1658361 1624900 1591042 1557399 1524005
53431A524005l3705l3955l2928l0572k8124k6379k4838k2878k0742j9010j7845
$$ 1524005 1490300 1456345 1423417 1392845 1364721 1338342 1313504 1290626 1269884 1250874 1233029
53420A233029j7081j6358j5014j2617r746p422n602l216N4L142N226O968R426
$$ 1233029 1215948 1199590 1184576 1171959 1162213 1154791 1149189 1145973 1146027 1149169 1154395 1161363 1170789
53407A170789J2519J5299J7307J8921K0702K2846K5093K6981K8425L0066L2534
$$ 1170789 1183308 1198607 1215914 1234835 1255537 1278383 1303476 1330457 1358882 1388948 1421482
53396A421482L5452L7840L9476M1077M3072M5117M7018M9176N1788N4518N7257
$$ 1421482 1456934 1494774 1534250 1575327 1618399 1663516 1710534 1759710 1811498 1866016 1923273
53385A923273O0329O3589O6213O7869O9314P1283P3563P5615P7283P8457P8842
$$ 1923273 1983602 2047191 2113404 2181273 2250587 2321870 2395433 2471048 2548331 2626788 2705630
53374B705630P8560P8227P7965P7204P5854P4615P3526P1268O6853O1082N5325
$$ 2705630 2784190 2862417 2940382 3017586 3093440 3168055 3241581 3312849 3379702 3440784 3496109
53363C496109M9715M3680L7561L2421K8468K4860K0930J6618J1770N961p47p557
$$ 3496109 3545824 3589504 3627065 3659486 3687954 3712814 3733744 3750362 3762132 3768093 3767346 3759789
53351C759789j3703j9072k4086k9310l5150m1660m8661n6029o3595p0611p5912
$$ 3759789 3746086 3727014 3702928 3673618 3638468 3596808 3548147 3492118 3428523 3357912 3282000
53340C282000p8882p9933p9764p8670p6861p4875p3148p1656p0305o9260o8525
$$ 3282000 3203118 3123185 3043421 2964751 2887890 2813015 2739867 2668211 2597906 2528646 2460121
53329B460121o7725o6649o5479o4204o2437o0215n8245n6743n4833n1778m8139
$$ 2460121 2392396 2325747 2260268 2196064 2133627 2073412 2015167 1958424 1903591 1851813 1803674
53318A803674m4884m1956l8699l5214l2231k9906k7713k5475k3573k1995k0018
$$ 1803674 1758790 1716834 1678135 1642921 1610690 1580784 1553071 1527596 1504023 1482028 1462010
53307A462010j7135j3764j0786q648p112n684m185k813j631k57J544L134L650
$$ 1462010 1444875 1431111 1420325 1411677 1404565 1398881 1394696 1391883 1390252 1389995 1391539 1394673 1398323
53294A398323L426L916N848Q251R855J0756J1967J3948J6341J8784K1250K3844
$$ 1398323 1401749 1405665 1411513 1419764 1429619 1440375 1452342 1466290 1482631 1501415 1522665 1546509
53282A546509K6785L0252L3842L6537L7803L8247L8718L9142L8901L7876L6473
$$ 1546509 1573294 1603546 1637388 1673925 1711728 1749975 1788693 1827835 1866736 1904612 1941085
53271A941085L4990L3594L2568L1873L0809K8731K5863K2775J9574J6280J3581
$$ 1941085 1976075 2009669 2042237 2074110 2104919 2133650 2159513 2182288 2201862 2218142 2231723
53260B231723J2185J1566J0290P628M093M40l072o283q898j0987j3278j6396k0096
$$ 2231723 2243908 2255474 2265764 2273392 2277485 2277925 2274853 2268570 2259672 2248685 2235407 2219011 2198915
53247B198915k3534k6260k8708l1568l4775l7452l9025m0004m1162m2306m2689
$$ 2198915 2175381 2149121 2120413 2088845 2054070 2016618 1977593 1937589 1896427 1854121 1811432
53236A811432m2436m2475m2913m2650m1131l9391l8564l8271l7290l5306l3137
$$ 1811432 1768996 1726521 1683608 1640958 1599827 1560436 1521872 1483601 1446311 1411005 1377868
53225A377868l1745l1615l2554l3520l3284l1864l0648l0506l0606k9798k8156
$$ 1377868 1346123 1314508 1281954 1248434 1215150 1183286 1152638 1122132 1091526 1061728 1033572
53214A033572k6279k4033k1318j9175j8666j9150j9171j8645j8700j9542k0079
$$ 1033572 1007293 983260 961942 942767 924101 904951 885780 867135 848435 828893 808814
53203H08814j9764j9308j9279j9216j8592j7635j6748j5917j5015j4168j3489
$$ 808814 789050 769742 750463 731247 712655 695020 678272 662355 647340 633172 619683
53192F19683j2968j2678j2686j2827j3040j3565j4309j4456j3516j2296j1851
$$ 619683 606715 594037 581351 568524 555484 541919 527610 513154 499638 487342 475491
53181D75491j1965j1713j1181j1190j1564j1130r633q206p630p452p245p444q265
$$ 475491 463526 451813 440632 429442 417878 406748 397115 388909 381279 373827 366582 359138 350873
53168C50873q887q483p307o118n212m591m442m794n197n233n029m907m915m949
$$ 350873 341986 333503 326196 320078 314866 310275 305833 301039 295842 290609 285580 280673 275758 270809
53154B70809m940m714m138l492l229l281l130k633k149j819j451j228j641k513
$$ 270809 265869 261155 257017 253525 250296 247015 243885 241252 239103 237284 235833 234605 232964 230451
53140B30451k865k189j128n26m45n50p58j052j172j031r72j166j174n84K94P98
$$ 230451 227586 225397 224269 223743 223298 222748 221990 220938 219766 218735 217763 216597 215423 214839 215133 215931
53124B15931P90O60P07Q37Q34P03P71J310K106K530K324K056K336K908L058K706
$$ 215931 216721 217381 218088 218925 219759 220462 221233 222543 224649 227179 229503 231559 233895 236803 239861 242567
53108B42567K343K096J652J068P63O79K10p98j828k597l412m327m809m560m001
$$ 242567 244910 247006 248658 249726 250489 251168 251378 250580 248752 246155 242743 238416 233607 229047 225046
53093B25046l613l425l418l713m109m194m139m575n346n388m313l190l000l177
$$ 225046 221433 218008 214590 210877 206768 202574 198435 193860 188514 183126 178813 175623 172623 169446
53079A69446k670j741j633k703l883m026l087j863j137j131j473j549j086l22
$$ 169446 166776 165035 163402 160699 156816 152790 149703 147840 146703 145572 144099 142550 141464 141142
53065A41142L52P01N86k8q21j277j266j143j130j081r78j043j170q10J02P29L59
$$ 141142 141494 142195 142781 142753 141932 140655 139389 138246 137116 136035 135057 134014 132844 132034 132136 132865 133224
53048A33224n78j122r98p07o28o33n00k14J39L58J67m40r88r62m36Ork91m20k67
$$ 133224 132646 131524 130526 129819 129191 128558 128058 127844 127983 128341 128508 128068 127080 126118 125682 125688 125679 125388 124968 124701
53028A24701j35l75q97j182r03l95k30m75p35q21q76q63m36M35J191J263O77p8
$$ 124701 124566 124191 123294 122112 121209 120814 120584 120109 119374 118553 117677 116814 116378 116813 118004 119267 119944 119866
53010A19866m95l24K91P94P07J96q7J97P41J021P71J33l87k27M96Q29J61p49p20
$$ 119866 119371 119047 119338 120132 120839 121035 120948 121145 121886 122907 123678 123811 123424 123197 123693 124522 124683 123934 123214
52991A23214J16N04J5l42J84R15Q59J76k66j56J55L98O04Q35J138J488J610J223
$$ 123214 123330 123834 123849 123507 123691 124606 125465 125641 125375 125219 125374 125772 126376 127211 128349 129837 131447 132670
52973A32670P83J255K788M167M249L438L070L721M791N507N697N569N363N197
$$ 132670 133453 134708 137496 141663 145912 149350 152420 156141 160932 166439 172136 177705 183068 188265
52959A88265M999M488L472K137R42K64J49K83K15r8k28J9L6q14k022k384j673
$$ 188265 193264 197752 201224 203361 204303 204567 204716 204999 205214 205116 204888 204907 204943 204129 202107 199723 198050
52942A98050r79j171j851k254k325k372k331k014j594j376j401j627k007k154
$$ 198050 197071 195900 194049 191795 189470 187098 184767 182753 181159 179783 178382 176755 174748 172594
52928A72594j555m63J16k33p21n57o7M1k28m58o57r39r45l81K19J19n57j066j138
$$ 172594 171039 170576 170692 170459 169738 169181 169114 169155 168927 168469 167812 166873 165928 165547 165766 165885 165328 164262 163124
52909A63124j084j022p31k19K16M01L76J29l19p25q45o87l31J80N62M00j43l43
$$ 163124 162040 161018 160287 160068 160284 160685 161061 161190 160871 160146 159301 158614 158283 158463 159025 159425 159282 158939
52891A58939k0L5o69j280o80Q57J926J664M03j022j872j684o95J08l4o39p10j43
$$ 158939 158919 158954 158285 157005 156325 157182 159108 160772 161175 160153 158281 156597 155902 156010 155976 155337 154627 154484
52873A54484L11K99K89O25J041J205J148R73O36K14M1L08P80R75N94j72p36o96
$$ 154484 154795 155094 155383 156008 157049 158254 159402 160375 161011 161225 161266 161574 162354 163329 163923 163751 163015 162319
52855A62319l52k66l25J45J184J881J686J302J671K712L695M232M250L622K664
$$ 162319 161967 161701 161376 161521 162705 164586 166272 167574 169245 171957 175652 179884 184134 187756 190420
52840A90420K395L367M704N259N158N191N137M007J799l34j660k535l390m086
$$ 190420 192815 196182 200886 206145 211303 216494 221631 225638 227437 227103 225443 222908 219518 215432
52826B15432m524m925n245n104m512l923l448k803k080j836k156k479k514k554
$$ 215432 210908 205983 200738 195634 191122 187199 183751 180948 178868 177032 174876 172397 169883 167329
52812A67329k685k486j852j334j258j205q02m66q34j878k929l407l169k453j678
$$ 167329 164644 162158 160306 158972 157714 156509 155707 155241 154407 152529 149600 146193 143024 140571 138893
52797A38893j203j138j476k154k801k757j871q88n34n33k68l3o62k011k967k991
$$ 138893 137690 136552 135076 132922 130121 127364 125493 124605 124071 123538 123270 123237 122575 120564 117597 114606
52781A14606k669k499k203j587j129j145j165p54l15m81j129j524j166j94P48
$$ 114606 111937 109438 107235 105648 104519 103374 102209 101455 101140 100659 99530 98006 96840 96646 97394
52766I7394R35K01p33j065j001j384k257k664k067j097m83j90n7l71j161j685
$$ 97394 98329 98530 97797 96732 95731 94347 92090 89426 87359 86262 85779 85589 85532 85161 84000 82315
52750H2315j467j139j453k017j873r84j87L7j55o96j703k711k735j442K41J039
$$ 82315 80848 79709 78256 76239 74366 73382 73195 73232 73077 72381 70678 67967 65232 63790 64031 65070
52734F5070O18k47n49%P64Q69J40o93q27k34M61P59O09K11j75k47J74R18J494
$$ 65070 65688 65441 64892 64892 65656 66525 66665 65972 65145 64911 65372 66131 66740 66951 66776 66529 66703 67621 69115
52715F9115J480Q71J30j06M03J114J119J22j149j682j173j44P55J302J655K039
$$ 69115 70595 71466 71596 71490 71893 73007 74126 74248 73099 71417 70244 70100 70855 72157 73812 75851
52699G5851K529K957L043K642K019J730K181L131L815L710L168K965L180L001
$$ 75851 78380 81337 84380 87022 89041 90771 92952 96083 99898 103608 106776 109741 112921 115922
52685A15922J931O16j3r0n20j534k305k209j676j461j656j851j888j930k014j947
$$ 115922 117853 118469 118456 118366 117846 116312 114007 111798 110122 108661 107005 105154 103266 101336 99322 97375
52669I7375j671j403j384j663k072k446k736k914k779k141j271p98r23j032o11
$$ 97375 95704 94301 92917 91254 89182 86736 84000 81086 78307 76166 74895 74097 73174 72142 71531
52654G1531p3j67p92j190j169j250j563j468o57K15M24J15j60l14n87r18r60o01
$$ 71531 71458 71291 70499 69309 68140 66890 65327 63859 63202 63417 63841 63956 63796 63482 62895 61977 61017 60416
52636F0416o5L78N74N05L75M00N18N09M72P07J046Q83J34m36k41K90M44K93L90
$$ 60416 60351 60729 61303 61808 62183 62583 63101 63610 64082 64789 65835 66718 66852 66416 66175 66465 66909 67202 67592
52617F7592P02O21j3o14o96m99n14p16o08M7Q40J195J083J050J482K030K084J598
$$ 67592 68294 68915 68902 68288 67592 67093 66579 65863 65255 65302 66142 67337 68420 69470 70952 72982 75066 76664
52599G6664J069Q08O31L96K40K42K18J17J78M38M75j9p10j014p61j54O82J710
$$ 76664 77733 78541 79172 79568 79808 80050 80268 80385 80563 81001 81476 81457 80747 79733 78972 78818 79500 81210
52581H1210K613K796J974N61m90m21O17J610J634P81n1k19K14R03J619K081K012
$$ 81210 83823 86619 88593 89154 88664 88243 88860 90470 92104 92885 92834 92615 92829 93732 95351 97432 99444
52564I9444J598J470J892K359K315J893J571J426J110M88j14l09o0K61K52q4k54
$$ 99444 101042 102512 104404 106763 109078 110971 112542 113968 115078 115566 115452 115143 115083 115344 115596 115512 115258
52547A15258J17P33R94Q23O40N85L65l6j67J28L82K76J47K68K86q7l29K06J161
$$ 115258 115375 116108 117102 117925 118565 119150 119515 119479 119312 119440 119822 120098 120245 120513 120799 120712 120383 120589 121750
52528A21750J532J014L11J04L47O75J008J428J785J759J191K36q19j705k118j739
$$ 121750 123282 124296 124607 124711 125058 125733 126741 128169 129954 131713 132904 133140 132321 130616 128498 126759
52512A26759n92N54O86l16j394j597j251j226j406q51O23K014K481K107J204j14
$$ 126759 126167 126721 127407 127091 125697 124100 122849 121623 120217 119366 119989 122003 124484 126591 127795 127681
52496A27681j337j590r24n83j236j929j616p46k91m7P53J759J967J530J566K124
$$ 127681 126344 124754 123830 123247 122011 120082 118466 117720 117429 117382 118135 119894 121861 123391 124957 127081
52480A27081J955N91p14p86j63o3n68p04L1J111J869K211K376K298J593J78j276
$$ 127081 129036 129627 128913 128127 127964 127901 127333 126629 126660 127771 129640 131851 134227 136525 138118 138296 137020
52463A37020j809j233l75K0J50M97P63K90o61j015l43N71R43R87J280J745J872
$$ 137020 135211 133978 133603 133623 133773 134270 135033 135323 134662 133647 133304 133875 134818 135805 137085 138830 140702
52446A40702J534J057O97M75M10M95N74N19N03P71J258J632J656J408J128J038
$$ 140702 142236 143293 143990 144465 144875 145370 145944 146463 146966 147737 148995 150627 152283 153691 154819 155857
52430A55857J182J346J114K42j001j938j981j176k43Qn85j397j699j365q31n42
$$ 155857 157039 158385 159499 159741 158740 156802 154821 153645 153402 153410 152825 151428 149729 148364 147533 146991
52414A46991o77j256k102k761k796k278j690j305r32l95k6l01j082j583j135Q4
$$ 146991 146314 145058 142956 140195 137399 135121 133431 132126 131194 130799 130773 130472 129390 127807 126672 126756
52398A26756J243J728J611J265P77O1n64n23K00Q06O63J65J24N80Q11M63O3J80
$$ 126756 127999 129727 131338 132603 133380 133441 132877 132354 132554 133360 134023 134188 134312 134892 135703 136166 136229 136409
52380A36409N99P35N96Q27J769K891L391L162K840K864K865K247J194N41O78J106
$$ 136409 137008 137743 138339 139166 140935 143826 147217 150379 153219 156083 158948 161195 162389 162930 163608 164714
52364A64714J308J494K083K833L115K868K620K571K295J553Q44Q06J412K079K364
$$ 164714 166022 167516 169599 172432 175547 178415 181035 183606 185901 187454 188298 189104 190516 192595 194959
52349A94959K245J892J524J482K006K881L495L477L039K636K372K078J794J779
$$ 194959 197204 199096 200620 202102 204108 206989 210484 213961 217000 219636 222008 224086 225880 227659
52335B27659J975J897J361R40J280K114K519K090J421J287J795K534L128L428
$$ 227659 229634 231531 232892 233832 235112 237226 239745 241835 243256 244543 246338 248872 252000 255428
52321B55428L400L104K703K387K483L419N229P032P614O713N380M830N330O392
$$ 255428 258828 261932 264635 267022 269505 272924 278153 285185 292799 299512 304892 309722 315052 321444
52307C21444P512Q343Q658Q643Q980J0108J1569J2497J2637J2555J2914J3834
$$ 321444 328956 337299 345957 354600 363580 373688 385257 397754 410391 422946 435860 449694
52295D49694J4892J5541J5596J5419J5468J5659J5511J4988J4745J5251J6090
$$ 449694 464586 480127 495723 511142 526610 542269 557780 572768 587513 602764 618854
52284F18854J6489J6137J5271J4302J3673J3653J3868J3484J2192J0604R348Q304
$$ 618854 635343 651480 666751 681053 694726 708379 722247 735731 747923 758527 767875 776179
52272G76179P157O115N407M639L368J939R47K42p06j732k153j896j575j514j443
$$ 776179 783336 789451 794858 799497 802865 804804 805751 805993 805287 803555 801402 799506 797931 796417 794974
52257G94974j239j155j220j066n23K13J021J962K895L571M094M834N806O768P774
$$ 794974 793735 792580 791360 790294 789771 789984 791005 792967 795862 799433 803527 808361 814167 820935 828709
52242H28709Q984J0042J0394J0241J0443J1320J2279J2797J2995J3006J2507J1312
$$ 828709 837693 847735 858129 868370 878813 890133 902412 915209 928204 941210 953717 965029
52230I65029R931R079Q916Q954Q440O865M544K629J944J890J142n52k101k732
$$ 965029 974960 984039 992955 1001909 1010349 1017214 1021758 1024387 1026331 1028221 1029363 1028811 1026710 1023978
52216A023978k929l412m094m586m956n338n439n089m811n161n931o553o900p117
$$ 1023978 1021049 1017637 1013543 1008957 1004001 998663 993224 988135 983324 978163 972232 965679 958779 951662
52202I51662p054o534n882n515n176m253k737j328n83m27n33o63n77p5P14J320
$$ 951662 944608 938074 932192 926677 921501 917248 914511 913183 912600 912173 911640 910977 910400 910325 911039 912359
52186I12359J435J222J040J006R71Q05N64K86j50p69j191r51k53M2n29j382j730
$$ 912359 913794 915016 916056 917062 918033 918838 919402 919688 919538 918769 917578 916627 916374 916416 915887 914505 912775
52169I12775j674j815k086j852j163r28j628k667l314l592l781l732l247k581
$$ 912775 911101 909286 907200 905348 904185 903257 901629 898962 895648 892056 888275 884543 881296 878715
52155H78715k079j687j301j190j568k089k325k393k611k899l059l347m110n062
$$ 878715 876636 874949 873648 872458 870890 868801 866476 864083 861472 858573 855514 852167 848057 842995
52141H42995n606n734n941o199n790m439l041k733l500m189l877k906k365k815
$$ 842995 837389 831655 825714 819515 813725 809286 806245 803512 800012 795823 791946 789040 786675 783860
52127G83860l714m129l715k872k248k288l026l948m196l361k031j171r61p28O
$$ 783860 780146 776017 772302 769430 767182 764894 761868 757920 753724 750363 748332 747161 746200 745472 745478
52112G45478R82J825K651L676M744N626O410P242P938Q244Q351Q776R779J1144
$$ 745478 746460 748285 750936 754612 759356 764982 771392 778634 786572 794816 803167 811943 821722 832866
52098H32866J2516J3840J5376J7238J8863J9330J8476J7360J7092J7497J7598
$$ 832866 845382 859222 874598 891836 910699 930029 948505 965865 982957 1000454 1018052
52087A018052J7171J6821J6604J5736J3976J2220J1125J0123Q464O442M798L558
$$ 1018052 1035223 1052044 1068648 1084384 1098360 1110580 1121705 1131828 1140292 1146734 1151532 1155090
52075A155090K312J126K84m30j471k824m203n568o784p266o768o073o081o502
$$ 1155090 1157402 1158528 1158812 1158382 1156911 1154087 1149884 1144316 1137532 1130266 1123498 1117425 1111344 1104842
52061A104842o426n846n556n692n463m482l357k696k318j701o01R65K768M181
$$ 1104842 1098416 1092570 1087014 1081322 1075859 1071377 1068020 1065324 1063006 1061305 1060704 1061669 1064437 1068618
52047A068618M589M136L639L640L966M235M223L811L129K795L287M113M333L944
$$ 1068618 1073207 1077343 1080982 1084622 1088588 1092823 1097046 1100857 1103986 1106781 1110068 1114181 1118514 1122458
$$ [...]
##END NTUPLES=NMR SPECTRUM
##END=
