
##TITLE=AC1327_PERAH12156_7163865_ym0b1Gj23m
##JCAMPDX= 6.0         $$ Bruker NMR JCAMP-DX V2.0
##DATA TYPE= NMR SPECTRUM
##DATA CLASS= NTUPLES
##ORIGIN= BRUKER
##OWNER= Administrator
$$ 1.72 TOPSPIN		Version 2.1
$$ 2013-01-29 21:08:21.886 -0500  Administrator@X
$$ Compression mode = diff/dup
##.OBSERVE FREQUENCY= 400.02188249412
##.OBSERVE NUCLEUS= ^1H
##.ACQUISITION MODE= SIMULTANEOUS (DQD)
##.ACQUISITION SCHEME= undefined
##.AVERAGES= 64
##.DIGITISER RES= 22
##SPECTROMETER/DATA SYSTEM= spect
##.PULSE SEQUENCE= noesygpps1d.comp
##.SOLVENT NAME= COFFEE_meoh
##.SHIFT REFERENCE= INTERNAL, COFFEE_meoh, 1, 14.96277
##AUDIT TRAIL= $$ (NUMBER, WHEN, WHO, WHERE, PROCESS, VERSION, WHAT)
$$ ##TITLE= Audit trail, TOPSPIN		Version 2.1
$$ ##JCAMPDX= 5.01
$$ ##ORIGIN= Bruker BioSpin GmbH
$$ ##OWNER= Administrator
$$ $$ E:\/data/COFFEE/nmr/AC1327_PERAH12156_7163865_ym0b1Gj23m/22/pdata/1/auditp.txt
$$ ##AUDIT TRAIL=  $$ (NUMBER, WHEN, WHO, WHERE, PROCESS, VERSION, WHAT)
(   1,<2013-01-29 21:08:16.011 -0500>,<Administrator>,<X>,<go>,<TOPSPIN 2.1>,
      <created by zg
	started at 2013-01-29 20:56:46.199 -0500,
	POWCHK enabled, PULCHK disabled,
       configuration hash MD5:
       86 BA 57 50 F2 9D 5C 9B 26 00 A9 28 5F 66 2E 89
       data hash MD5: 64K
       FC FF 6D 87 D6 13 B2 6F C4 98 45 1E 75 7B FC 59>)
(   2,<2013-01-29 21:08:19.121 -0500>,<Administrator>,<X>,<proc1d>,<TOPSPIN 2.1>,
      <Start of raw data processing
       efp LB = 0.3 FT_mod = 6 PKNL = 1 PHC0 = 0 PHC1 = 0 SI = 128K 
       data hash MD5: 128K
       DA 08 6B 5B EF 6C 10 D0 BE 46 74 55 08 CF A2 92>)
(   3,<2013-01-29 21:08:20.183 -0500>,<Administrator>,<X>,<proc1d>,<TOPSPIN 2.1>,
      <pk PHC0 = -76.99768 PHC1 = 0 
       data hash MD5: 128K
       3B 78 01 B5 F9 F2 C6 43 42 C4 1F E5 15 C8 F6 71>)
(   4,<2013-01-29 21:08:20.871 -0500>,<Administrator>,<X>,<proc1d>,<TOPSPIN 2.1>,
      <abs ABSG = 1 
       data hash MD5: 128K
       11 31 8A 87 91 A2 08 82 66 52 08 50 24 60 80 81>)
(   5,<2013-01-29 21:08:21.058 -0500>,<Administrator>,<X>,<proc1d>,<TOPSPIN 2.1>,
      <abs ABSG = 2 
       data hash MD5: 128K
       05 6B 58 A9 13 9E C0 1D CB E2 F1 0C 54 3E EA A0>)
(   6,<2013-01-29 21:08:21.230 -0500>,<Administrator>,<X>,<proc1d>,<TOPSPIN 2.1>,
      <abs ABSG = 3 
       data hash MD5: 128K
       62 F4 D3 4A B8 7F 4F 1A A6 FD 4B E8 83 B1 66 9F>)
(   7,<2013-01-29 21:08:21.386 -0500>,<Administrator>,<X>,<proc1d>,<TOPSPIN 2.1>,
      <abs ABSG = 4 
       data hash MD5: 128K
       7C 7D 3A 06 7E 76 1C AF BD EA CE 55 1A 70 8A 83>)
(   8,<2013-01-29 21:08:21.558 -0500>,<Administrator>,<X>,<proc1d>,<TOPSPIN 2.1>,
      <abs ABSG = 5 
       data hash MD5: 128K
       63 09 17 65 C7 71 3B F0 9B 18 15 82 2D EE 11 12>)
$$ ##END=
$$ 
$$ $$ hash MD5
$$ $$ 99 D7 9A 4B 28 95 B0 43 AD B1 E0 3F FE 42 D1 98
##$RELAX= 
##$RELAX= 
##$RELAX= 
##$RELAX= 
##$RELAX= 
##$RELAX= 
##$RELAX= 
##$RELAX= 
$$ Bruker specific parameters
$$ --------------------------
##$DU= <E:\>
##$EXPNO= 22
$$ [...]
##$TP07= 0
##$TPNAME0= <>
##$TPNAME1= <>
##$TPNAME2= <>
##$TPNAME3= <>
##$TPNAME4= <>
##$TPNAME5= <>
##$TPNAME6= <>
##$TPNAME7= <>
##$TPOAL= (0..7)
0.5 0.5 0.5 0.5 0.5 0.5 0.5 0.5
##$TPOFFS= (0..7)
0 0 0 0 0 0 0 0
##$TUNHIN= 0
##$TUNHOUT= 0
##$TUNXOUT= 0
##$USERA1= <user>
##$USERA2= <user>
##$USERA3= <user>
##$USERA4= <user>
##$USERA5= <user>
##$V9= 5
##$VALIST= <valist>
##$VCLIST= <CCCCCCCCCCCCCCC>
##$VD= 0
##$VDLIST= <DDDDDDDDDDDDDDD>
##$VPLIST= <PPPPPPPPPPPPPPP>
##$VTLIST= <TTTTTTTTTTTTTTT>
##$WBST= 1024
##$WBSW= 4
##$XGAIN= (0..3)
0 0 0 0
##$XL= 0
##$YL= 0
##$YMAX_a= 8788767
##$YMIN_a= -18651147
##$ZGOPTNS= <>
##$ZL1= 120
##$ZL2= 120
##$ZL3= 120
##$ZL4= 120
##$ABSF1= 14.96277
##$ABSF2= -5.595411
##$ABSG= 5
##$ABSL= 3
##$ALPHA= 0
##$AQORDER= 0
##$ASSFAC= 0
##$ASSFACI= 0
##$ASSFACX= 0
##$ASSWID= 0
##$AUNMP= <proc_prof1d_extract.lims>
##$AXLEFT= 0
##$AXNAME= <>
##$AXNUC= <1H>
##$AXRIGHT= 0
##$AXTYPE= 0
##$AXUNIT= <>
##$AZFE= 0.1
##$AZFW= 0.1
##$BCFW= 0
##$BC_mod= 0
##$BYTORDP= 0
##$COROFFS= 0
##$CY= 15
##$DATMOD= 1
##$DC= 0
##$DFILT= <>
##$DTYPP= 0
##$F1P= 0
##$F2P= 0
##$FCOR= 0.5
##$FTSIZE= 131072
##$FT_mod= 6
##$GAMMA= 0
##$GB= 0
##$INTBC= 1
##$INTSCL= 1
##$ISEN= 128
##$LB= 0.3
##$LEV0= 0
##$LPBIN= 0
##$MAXI= 10000
##$MC2= 0
##$MEAN= 0
##$ME_mod= 0
##$MI= 0
##$NCOEF= 0
##$NC_proc= -2
##$NLEV= 6
##$NOISF1= 0
##$NOISF2= 0
##$NSP= 0
##$NTH_PI= 0
##$NZP= 0
##$OFFSET= 14.96277
##$PC= 1
##$PHC0= -76.99768
##$PHC1= 0
##$PH_mod= 1
##$PKNL= yes
##$PPARMOD= 0
##$PPDIAG= 0
##$PPIPTYP= 0
##$PPMPNUM= 2147483647
##$PPRESOL= 1
##$PSCAL= 4
##$PSIGN= 0
##$PYNMP= <proc.py>
##$REVERSE= no
##$SF= 400.020008930399
##$SI= 131072
##$SIGF1= 0
##$SIGF2= 0
##$SINO= 400
##$SIOLD= 131072
##$SPECTYP= <>
##$SREGLST= <1H.CDCl3>
##$SSB= 0
##$STSI= 131072
##$STSR= 0
##$SW_p= 8223.68421052631
##$SYMM= 0
##$S_DEV= 0
##$TDeff= 65536
##$TDoff= 0
##$TI= <>
##$TILT= no
##$TM1= 0
##$TM2= 0
##$TOPLEV= 0
##$USERP1= <user>
##$USERP2= <user>
##$USERP3= <user>
##$USERP4= <user>
##$USERP5= <user>
##$WDW= 1
##$XDIM= 131072
##$YMAX_p= 411257493
##$YMIN_p= -211045
##$CURPLOT= <Network HP LaserJet P1505>
##$CURPRIN= <$Network HP LaserJet P1505>
##$DFORMAT= <normdp>
##$LAYOUT= <+/1D_H.xwp>
##$LFORMAT= <normlp>
##$PFORMAT= <normpl>
##$SURQMSG= 1
$$ End of Bruker specific parameters
$$ ---------------------------------
##NTUPLES= NMR SPECTRUM
##VAR_NAME=  FREQUENCY,     SPECTRUM/REAL,   SPECTRUM/IMAG
##SYMBOL=    X,             R,               I
##VAR_TYPE=  INDEPENDENT,   DEPENDENT,       DEPENDENT
##VAR_FORM=  AFFN,          ASDF,            ASDF
##VAR_DIM=   131072,        131072,          131072
##UNITS=     HZ,            ARBITRARY UNITS, ARBITRARY UNITS
##FACTOR=    0.0627417313425164, 1,          1
##FIRST=     8223.62146879497, 3167,         -68416
##LAST=      0,             4812,            -68560
##MIN=       0,             -211045,         0
##MAX=       8223.62146879497, 411257493,    0
$$ Real data points
##PAGE= N=1
##DATA TABLE= (X++(R..R)), XYDATA
$$ [...]
64491 77001 76357 75237 73745 72344 71391 70915 70932 71659 73204 75146 76664 77076 76223 74460 72408 70656
64475 70656 69576 69352 70057 71553 73366 74870 75699 75892 75643 75101 74440 73924 73752 73940 74305 74499 74195 73512
64457 73512 73159 73787 75200 76600 77646 78792 80413 82092 83076 83129 82642 82169 82090 82412 82673 82367 81708 81604
64439 81604 82513 83749 84363 84302 84091 83674 82393 80154 77896 76631 76452 76721 76900 76941 77126 77776 79018 80633
64421 80633 82206 83490 84567 85616 86580 87164 87189 86957 87142 88129 89517 90504 90783 90750 90785 90781 90575 90401 90484
64402 90484 90483 89799 88346 86640 85214 84275 83804 83629 83449 83117 82892 83113 83662 83964 83532 82380 81010 80129
64384 80129 80159 80848 81595 82267 83325 84899 86231 86533 85989 85294 84544 83302 81609 80149 79459 79601 80567
64367 80567 82261 84082 85290 85956 86843 88180 89279 89652 89716 89926 89919 89158 87926 87004 86577 86111 85188 83969
64349 83969 82865 82217 82292 83209 84719 86292 87550 88568 89660 90942 92169 93052 93630 94128 94402 93946 92733
64332 92733 91655 91606 92391 93148 93661 94404 95308 95528 94810 94228 94893 96555 98188 99395 100476 101482 102117
64315 102117 102441 102850 103322 103410 103107 103022 103467 103956 103918 103429 102792 101847 100261 98432 97480 98132 99841 101301
64297 101301 101699 101254 100583 99951 99382 99200 99915 101506 103251 104549 105534 106657 107998 109445 111283 114016
64281 114016 117594 121311 124635 127737 130981 134242 137069 139398 141704 144409 147312 149739 151165 151582
64267 151582 151278 150393 148881 146872 144813 143079 141569 139952 138216 136670 135385 134023 132403 130905 129941
64252 129941 129205 127902 125784 123568 122140 121613 121374 120864 120059 119330 119100 119585 120599 121617 122261 122762 123750
64235 123750 125576 128040 130728 133362 135791 137990 140202 142810 145908 149227 152570 156045 159702 163201
64221 163201 166064 167982 168705 167987 166026 163688 161839 160559 159321 157794 156102 154391 152574 150558 148402
64206 148402 146225 144186 142527 141442 140903 140795 141089 141684 142303 142833 143579 144863 146528 148139 149443 150312
64190 150312 150520 150158 150003 150842 152510 154234 155742 157305 158744 159360 159095 158888 159477 160512 161305 161775 162114
64173 162114 162084 161370 160353 159853 160186 160925 161543 161970 162581 163836 165806 167945 169581 170767 172358 175080
64157 175080 178868 183266 188000 192865 197650 202650 208836 216899 226323 235938 245193 254516 264616 275890
64143 275890 288294 301244 313804 325362 335958 345522 353180 357990 360165 360676 359640 355964 348922
64130 348922 339381 328965 318446 307516 295897 284132 273247 263876 255828 248412 241184 234363 228484
64117 228484 223752 219972 216954 214664 212900 211228 209450 207913 207098 207105 207794 209258 211778 215248 218958
64102 218958 222162 224736 227089 229517 231891 234126 236694 240360 245385 251258 257286 263215 269138 275046
64088 275046 280843 286763 293420 301229 309886 318553 326511 333463 339220 343385 345654 346268 345778 344151 340590
64073 340590 334604 327004 319377 312634 306516 300472 294462 288797 283671 279124 275145 271626 268484 265926
64059 265926 264225 263156 262149 261170 260897 261733 263198 264807 266990 270467 275031 279728 284196 289132 295353
64044 295353 302958 311545 320723 330171 339625 349225 359677 371677 385044 398594 411062 422212 432882
64031 432882 443817 454635 464337 472680 480479 488383 495981 502536 508094 513335 518680 524176 530038 536656
64017 536656 543964 551342 558165 564110 568931 572361 574310 574877 574139 572167 569226 565719 561993 558387 555226
64002 555226 552493 549798 547146 545477 545890 548470 552484 557617 564295 572708 582291 592509 603687 616679
63988 616679 632022 649625 669041 689887 712271 736822 764041 793630 824879 857678 892654
63977 892654 930280 970499 1013393 1059534 1109315 1162558 1219326 1280682 1348072 1422225 1503237
63966 1503237 1591714 1689478 1799302 1924404 2068140 2233852 2424919 2645105 2898808 3190960
63956 3190960 3526950 3912759 4354662 4858014 5425882 6058563 6753989 7508310 8316308
63947 8316308 9171602 10066298 10990017 11929164 12867105 13784799 14661200 15473970 16201302
63938 16201302 16824321 17328567 17704049 17944501 18046370 18007705 17827675 17507553 17052724
63929 17052724 16473998 15787290 15012216 14170369 13283362 12370964 11450264 10536168 9642215
63920 9642215 8780577 7961491 7193025 6481196 5829893 5240653 4712860 4244272 3831302
63911 3831302 3469043 3151825 2874354 2632320 2421782 2238349 2077443 1935367 1809699
63902 1809699 1698608 1600182 1512569 1434332 1364234 1300762 1242241 1187434 1135901 1087730 1043035
63891 1043035 1001563 962509 924739 887418 850560 814824 780765 748367 717276 687234 658166
63880 658166 630058 603043 577561 554153 532922 513303 494593 476742 460362 445856 432783
63869 432783 420409 408721 398325 389247 380395 370674 360399 351091 343921 338726 334534 330660 327101
63856 327101 324122 321720 319520 317216 315112 314099 314844 317040 319657 321945 323980 326252 328985 331995
63842 331995 334958 337586 339534 340307 339378 336521 332064 326664 320720 314070 306412 297918 289238 280964 273287
63827 273287 266110 259224 252363 245391 238509 232110 226304 220856 215650 210992 207190 203992 200693 196846
63813 196846 192705 188938 185965 183625 181435 179108 176798 174888 173591 172802 172265 171819 171449 171095 170480 169246
63797 169246 167407 165523 164203 163417 162536 161106 159349 157736 156357 154912 153167 151135 148853 146264 143425
63782 143425 140781 139100 138951 140097 141510 142270 142406 142522 142720 142430 141385 140140 139260 138537 137548 136571 136288
63765 136288 136807 137581 138211 138739 139181 139322 139110 138835 138772 138953 139316 139758 140064 140068 139931 140001 140435 141215 142447 144265
63745 144265 146431 148420 149979 151404 153234 155830 159164 162791 166223 169584 173745 179426 186370 193782
63731 193782 201401 209689 219093 229664 241285 253756 266622 279417 292087 304746 316992 327887
63719 327887 336542 342372 345010 344577 341870 337642 331775 323851 314352 304449 294578 284126 272694 260753
63705 260753 248918 237510 227146 218713 212182 206350 200405 194940 190744 187403 184009 180603 177913
63692 177913 176030 174367 172764 171709 171501 171918 172842 174524 177105 180348 184026 188280 193461 199764 207017
63677 207017 214782 222936 232124 243149 255661 268086 279376 290252 302028 314582 326274 335557
63665 335557 341787 344650 343875 339784 333316 325132 315230 303716 291342 278890 266508 254125 242187
63652 242187 231505 222533 215155 209053 203889 199248 194894 191198 188894 188108 187891 187171 186127 186116 188018
63637 188018 191161 194266 197038 200128 203795 207558 211384 216251 222912 230696 238352 245731 253929 263824
63623 263824 275192 287361 300189 314125 329643 346876 365668 385868 407565 430978 455958
63612 455958 481692 507090 531439 554441 575620 593920 608098 617521 622467 623645 621585 616751
63600 616751 610237 603838 598972 595658 592866 589688 585654 580190 572608 562752 551017 537522 521919
63587 521919 504336 485881 467867 450971 435358 420914 407019 392864 378620 365674 355097
63576 355097 346463 338811 332071 326688 322406 318531 315094 312766 311792 312019 313879 318237 325089 333379 342383
63561 342383 352495 364381 378167 393855 411822 432359 455134 479553 505319 532324 560284
63550 560284 588794 617398 645247 670919 692953 710579 723874 733376 739706 743514 745679 747521
63538 747521 750517 755535 762399 770312 778495 786143 792079 795013 794133 789053 779263 764120 743450 717788
63524 717788 688064 655421 621295 587163 554050 522503 492871 465243 439277 414722 392071
63513 392071 372088 354642 338681 323571 309925 298784 290443 284252 279182 274326 269274 264308 259991
63500 259991 256374 253009 249880 247889 247996 250149 253368 256705 259887 263212 267115 271830 277398 284033
63486 284033 292356 302956 315706 329756 344251 358762 373109 387163 400926 414313 426605 436492
63474 436492 442941 445828 445568 442452 436569 428156 417742 406010 393645 381175 368923 357189 346457
63461 346457 337136 329057 321527 313984 306445 299310 292975 287630 283146 279090 275150 271609 269102 267884
63447 267884 267627 267982 269000 270911 273795 277653 282575 288755 296423 305641 315998 326761 337784 350072
63433 350072 364877 382333 401608 422262 444684 469140 495320 523141 553134 585445 619167
63422 619167 653310 687845 722988 757809 790324 818831 842467 860568 872281 877115 875515 868730
63410 868730 858417 846366 834227 823079 813162 803964 794500 783690 770728 755235 737113 716348
63398 716348 693010 667328 639798 611288 582961 555788 530039 505502 482321 461355 443534
63387 443534 429028 417225 407332 398892 391821 386234 382272 380075 379821 381607 385228 390295 396703 404738
63373 404738 414448 425270 436716 449177 463416 479479 496824 515558 536713 560985 587853 616278
63361 616278 645744 676179 707262 738126 767430 793407 814211 828657 836651 838892 836490 830847
63349 830847 823371 815005 806266 797735 789996 782968 775897 768148 759459 749249 736449 720482 701765
63336 701765 680816 657505 631769 604541 577245 550682 524974 500327 477257 456288 437808
63325 437808 421991 408475 396446 385396 375451 366659 358502 350619 343463 337640 333037 329175 325969
63312 325969 323391 320891 318005 315263 313637 313207 313125 312728 311934 310702 308936 306895 304981 303170 301343
63297 301343 300052 300085 301190 302123 302136 301688 301484 301572 301752 302259 303590 305961 309136 312476 315136 316653 317429
63280 317429 318234 319287 320336 321478 323147 325284 327315 329155 331357 333976 336081 336951 337065 337400 338322
63265 338322 339771 341951 345085 348762 352231 355286 358346 361737 365278 368523 371093 372911 374321 375835
63251 375835 377567 379251 381015 383674 387757 392648 397347 401794 406763 412511 418304 423434 428082 432940
63237 432940 438467 444941 452802 462472 473949 486896 501087 516493 532978 550236 568089 586659
63225 586659 606092 626229 646627 666834 686516 705367 723129 739795 755673 771126 786335
63214 786335 801451 816879 833087 850002 866722 881989 894846 904763 911261 913787 912032 906218
63202 906218 896821 884066 867919 848674 827305 805026 782588 760296 738648 718542 700662 685027
63190 685027 671488 660423 652495 647824 645822 645934 648101 652462 659035 667955 679594 693991 710393
63177 710393 727812 745975 765277 785807 806932 828043 849249 870888 892657 913804 934159
63166 934159 954363 974759 994486 1012140 1027160 1040070 1051250 1059884 1064361 1063572 1057616 1047330
63154 1047330 1033363 1015822 994706 970503 944185 916675 888526 860156 832157 805173 779648
63143 779648 755857 733993 713979 695446 678214 662619 648988 637001 626107 616414 608525 602433
63131 602433 597234 592137 587172 582646 578489 574568 571109 568314 565932 563727 562048 561440 561925 563153 565034
63116 565034 567657 570764 573872 576902 580202 584000 588301 593321 599459 606697 614380 621787 628647 635067
63102 635067 641304 647765 654898 662851 671291 679660 687499 694522 700546 705464 709245 711961 713836 715233
63088 715233 716457 717622 718688 719502 719785 719324 718308 717225 716275 715184 713882 713031 713470 715276 717755 720261
63072 720261 722677 725190 728051 731634 736326 742111 748429 754634 760660 767241 775432 785749 797756 810645
63058 810645 824236 839147 856037 875059 896146 919251 944134 970452 998472 1029191 1063247
63047 1063247 1100086 1138644 1178426 1219375 1261218 1303672 1346893 1390894 1434751 1477300 1518475
63036 1518475 1559081 1599348 1638693 1676968 1714881 1752820 1790124 1825943 1860041 1892166 1921275
63025 1921275 1945999 1965471 1979112 1985866 1984324 1973639 1954121 1926959 1893449 1854391 1810180 1761739
63013 1761739 1711225 1661351 1613832 1568915 1526495 1487250 1452442 1423155 1400057 1383466 1373179
63002 1373179 1368488 1368812 1374241 1385156 1401507 1422748 1448392 1478282 1512265 1549740 1589641 1630910
62990 1630910 1673001 1715810 1759013 1801782 1843434 1884084 1924122 1963084 1999563 2032290 2060752
62979 2060752 2084582 2102856 2114273 2117704 2112364 2097814 2074053 2041377 2000106 1950809 1894835 1834066
62967 1834066 1769916 1702986 1633994 1564550 1496655 1431693 1370201 1312231 1257623 1206265 1158502
62956 1158502 1115090 1076438 1042077 1011127 982998 957403 934080 912973 894488 879003 866102
62945 866102 854621 843497 832345 821271 810398 799719 789325 779604 771013 763541 756548 749421
62933 749421 742239 735490 729203 722839 716056 709101 702342 695916 689983 684813 680317 675883 670961 665508
62919 665508 659684 653543 647322 641570 636615 632177 627817 623450 619178 615010 611100 607821 605164 602400
62905 602400 598877 594964 591769 590025 589580 589766 589883 589540 588878 588418 588440 588679 588799 588767 588451 587319 585071
62888 585071 582252 579649 577225 574228 570252 565649 560971 556582 552853 550073 547919 545468 542124 538349
62874 538349 535213 533295 532221 531248 530123 529162 528533 527787 526472 524976 524188 524251 524249 523378 521825 520174 518481
62857 518481 516541 514569 512898 511208 508745 505246 501178 497169 493680 491072 489346 487886 485987 483647
62843 483647 481273 478741 475459 471470 467782 465281 463798 462482 460615 457794 453966 449743 446334 444563
62829 444563 444052 443665 442629 440903 438721 436216 433491 430663 427743 424743 421939 419779 418347 417111 415396
62814 415396 413076 410697 408998 408408 408894 410017 411125 411756 412125 413108 415516 419344 423812 428068 431819
62799 431819 435433 439662 445152 451939 459384 466797 474046 481408 489066 497158 506185 516765 528894 541945
62785 541945 555600 570359 586924 605500 625972 648426 673126 700289 730138 762922 798733
62774 798733 837556 879770 926141 977073 1032164 1090714 1152158 1215594 1279428 1342159 1403189
62763 1403189 1462145 1517556 1566880 1607902 1639548 1661369 1672850 1673509 1663259 1642398 1611451 1571210
62751 1571210 1522876 1468104 1408928 1347440 1285266 1223267 1161789 1101078 1041443 983418 927974
62740 927974 876326 829158 786206 746800 710546 677240 646562 618357 592933 570494 550466
62729 550466 531970 514895 499897 487341 476774 467486 459059 451259 443945 437374 432205 428893 427201
62716 427201 426435 425981 425597 425476 426119 427978 431123 435400 440901 448100 457503 469333 483440 499331 516399
62701 516399 534448 554006 575883 600478 627786 658046 692045 730682 774444 823293 876798
62690 876798 934305 995206 1059146 1125898 1195028 1265695 1336615 1406082 1472179 1533161 1587514
62679 1587514 1633574 1669442 1693595 1705366 1704534 1690745 1663812 1624528 1574792 1517042 1453782 1387374
62667 1387374 1319623 1251468 1183394 1116189 1051031 988903 930275 875315 824038 776278 731862
62656 731862 690893 653649 620221 590401 563787 539805 517836 497579 479111 462360 446877
62645 446877 432384 419129 407272 396409 386260 377318 369963 363291 355845 347486 339563 333143 327952
62632 327952 323222 318641 314079 309230 304072 299205 295208 292049 289386 287034 284913 283039 281819 281792 282764
62617 282764 283733 284048 284133 284650 285465 285973 286016 285946 286143 287020 289165 292727 296808 300187 302700 305370 309127
62600 309127 314048 320038 327611 337295 348501 359740 370300 381349 394949 412079 432004 453551
62588 453551 476518 501532 529016 558812 590644 624338 659415 694812 729162 761249 790195
62577 790195 815417 836373 852213 861890 864927 861940 854042 841769 824983 803781 779143 752574
62565 752574 725374 698231 671287 644623 618831 594870 573015 552318 531653 511173 492115
62554 492115 475293 460434 446979 434700 423318 412275 401362 391050 381732 372984 364055 354913
62542 354913 346379 339235 333431 328252 323191 318578 315193 313277 312231 311393 310658 310109 309664 309637 311045 314460
62526 314460 318962 323204 327280 332478 339280 346838 354566 363008 372688 383210 394115 405742 418626
62513 418626 432816 448413 466085 486426 509453 535324 564789 598170 634501 672560 712213
62502 712213 753848 796738 838855 878154 913403 943915 969214 989010 1002938 1010304 1010447 1003382
62490 1003382 989779 970476 946246 917832 885908 851211 814910 778482 742908 708399 675344
62479 675344 644976 618433 595357 574153 553745 534664 518356 505635 495778 487046 478244 469771
62467 469771 462806 457557 452996 448534 445083 443841 444697 446568 448788 451350 454155 456944 459921 463689
62453 463689 468615 474730 482000 490066 497968 504907 511296 518287 526253 534335 541497 547295 551504 553649
62439 553649 553319 550496 545331 537842 527998 515896 501906 486883 472098 458498 446012 433974 422232
62426 422232 411401 401974 393715 386135 379235 373492 369259 366418 364579 363562 363605 365010 367562 370565
62412 370565 373636 377255 382291 389083 397134 405467 413106 419537 425075 430650 436925 443647 449950 455008
62398 455008 458291 459636 459428 458378 456767 454246 450698 446793 443187 439632 435544 431125 427203 424137
62384 424137 421647 419582 418132 417277 416745 416636 417515 419766 423406 428671 436229 446584 459627 474962
62370 474962 492378 511928 533865 558603 586504 617683 652219 690339 732047 776732 823538
62359 823538 872010 921923 972606 1022997 1072289 1119963 1165215 1206855 1243775 1274935 1298887
62348 1298887 1314062 1319954 1317617 1308783 1294716 1275965 1252728 1225191 1193792 1159359 1122842 1084908
62336 1084908 1046068 1007082 968837 931763 895795 861019 828013 797503 769989 745646 724108
62325 724108 704293 685017 666089 648494 633288 620543 609477 599278 589650 580823 573239 567065
62313 567065 561981 557521 553503 549828 546009 541350 535614 529159 522447 515851 509922 505218 501605 498178
62299 498178 494198 489866 485979 482996 480669 478421 476024 473975 473198 474191 476528 479375 482368 485746 489778
62284 489778 494456 499648 505151 510697 516270 522372 529528 537547 545707 553620 561518 569745 578466 587830
62270 587830 597967 608808 620374 633191 647926 664742 683600 705132 730458 760090 793706
62259 793706 831073 872367 917434 965663 1016989 1072107 1130962 1191536 1250648 1305445 1353668
62248 1353668 1393250 1422651 1441472 1450077 1448763 1437819 1418222 1391611 1359470 1322696 1281872 1237614
62236 1237614 1190678 1142121 1093295 1045438 999328 955570 915036 878650 846710 818727 793963
62225 793963 771941 752498 735551 720942 708411 697687 688573 680807 673851 667016 660003 653255 647735
62212 647735 644262 642888 642695 642434 641699 641445 642912 646133 650011 653946 658713 665438 674268 684544 695871
62197 695871 708450 722574 738421 756303 776588 799191 823448 848731 875029 902770 932092
62186 932092 962389 992596 1021781 1049299 1074463 1096447 1114740 1129388 1140468 1147649 1150843 1151128
62174 1151128 1150422 1150153 1150830 1152972 1157703 1165998 1177871 1192908 1211328 1233980 1261249 1292200 1324850
62161 1324850 1357185 1388014 1416814 1442686 1463748 1478151 1485800 1488513 1488155 1485029 1478290 1467468
62149 1467468 1453034 1435775 1416187 1394494 1370946 1346060 1320781 1296315 1273594 1252850 1233772
62138 1233772 1216021 1199600 1184874 1172244 1161610 1152220 1143367 1135245 1128745 1124347 1121692 1120448 1121057
62125 1121057 1124200 1129777 1136921 1144961 1154041 1164790 1177660 1192683 1209708 1228657 1249445 1271674
62113 1271674 1294726 1318248 1342316 1366890 1391505 1415910 1440650 1466379 1492860 1519418 1546330
62102 1546330 1574888 1605905 1638916 1673094 1708207 1744407 1781842 1820920 1862266 1905920 1951132
62091 1951132 1997500 2045744 2096857 2150942 2207447 2265910 2325745 2385619 2443856 2499529 2552892
62080 2552892 2605005 2657259 2710736 2765338 2819658 2872092 2921838 2968575 3011816 3051371 3088149
62069 3088149 3123859 3160040 3197808 3238014 3280817 3325308 3370345 3415692 3461603 3507499 3551968
62058 3551968 3594075 3633832 3671202 3705551 3736559 3765064 3792365 3818946 3844209 3867246 3887580
62047 3887580 3905323 3920860 3934413 3945910 3955412 3963539 3971180 3978775 3986138 3993003 3999422 4005618 4011766
62034 4011766 4017988 4024187 4029702 4033458 4034757 4033835 4031387 4027587 4021797 4013250 4001828 3988045 3972367
62021 3972367 3954881 3935668 3915245 3894342 3873447 3852918 3833470 3816111 3801538 3789941 3781396
62010 3781396 3776083 3774093 3775498 3780755 3790605 3805391 3824898 3848927 3877443 3909930 3945245 3982485
61998 3982485 4021341 4061064 4099566 4134129 4162702 4184083 4197488 4202721 4200474 4191711 4176848 4156106
61986 4156106 4130407 4101320 4070154 4037635 4004177 3969869 3934335 3897263 3859041 3820299 3780975
61975 3780975 3740449 3698501 3655510 3611700 3566946 3521447 3475990 3431245 3387214 3343540 3300076
61964 3300076 3257098 3215174 3174866 3136366 3099584 3064731 3032471 3003120 2976102 2950782 2927520
61953 2927520 2907256 2890386 2876800 2866805 2861082 2859829 2862864 2870605 2883929 2902795 2925933 2952235
61941 2952235 2981672 3014448 3050053 3087668 3126820 3167006 3207194 3246373 3284301 3321174 3356800
61930 3356800 3390514 3421731 3450173 3475694 3498219 3517786 3534607 3549466 3564189 3581386 3603510
61919 3603510 3632587 3670990 3721794 3787849 3870977 3972676 4095239 4241455 4413333 4611902
61909 4611902 4838416 5095261 5385506 5712021 6077406 6484545 6936823 7437564 7989045
61900 7989045 8591306 9240694 9927958 10636267 11339958 12004794 12590139 13053332 13356144
61891 13356144 13471914 13390652 13120080 12683048 12113116 11449233 10729858 9987923 9248699
61882 9248699 8530566 7846566 7205187 6610972 6065757 5569822 5122174 4720600 4362241
61873 4362241 4044140 3762987 3514758 3295372 3101832 2932311 2785033 2657465 2546799
61864 2546799 2450955 2368906 2300272 2244868 2202542 2172981 2155476 2148974 2152524 2165584 2187744 2218231
61852 2218231 2255932 2299847 2349189 2402910 2459313 2516185 2571046 2621306 2664696 2699918 2726545
61841 2726545 2744074 2751618 2749132 2738639 2723567 2706964 2690874 2677095 2667506 2663331 2664758 2671530
61829 2671530 2683228 2698581 2715079 2729844 2740568 2745233 2741471 2727022 2700924 2663825 2617149 2562331
61817 2562331 2500884 2434732 2366124 2297251 2230053 2166268 2107451 2054784 2008884 1969948 1938202
61806 1938202 1914133 1898218 1890513 1890608 1897926 1911984 1932624 1960188 1995354 2038422 2088889 2146070
61794 2146070 2210081 2281914 2362607 2452806 2553228 2665097 2789926 2929293 3085186 3260369
61784 3260369 3458078 3681484 3933723 4218503 4540582 4905766 5320600 5792044 6327235
61775 6327235 6933386 7617783 8387757 9250391 10211575 11274290 12436535 13689266 15013959
61766 15013959 16379257 17737879 19026701 20171795 21097246 21735407 22037243 21981371 21578552
61757 21578552 20868723 19911655 18775842 17529275 16232846 14936083 13675614 12476316
61749 12476316 11353803 10316713 9368426 8508400 7733291 7038013 6416829 5863970 5373473
61740 5373473 4938886 4553754 4212411 3910027 3642069 3404266 3193176 3006309 2841530
61731 2841530 2696571 2569073 2456725 2357388 2269358 2191359 2121838 2058468 1998905 1941938 1887332
61720 1887332 1834760 1783598 1733700 1685420 1638793 1593507 1549881 1508949 1471280 1436524 1404502
61709 1404502 1375808 1350828 1328929 1309221 1291378 1275033 1259144 1242887 1226684 1211433 1196978
61698 1196978 1182186 1166328 1149605 1132421 1114905 1097254 1079898 1063112 1046808 1030721 1014559
61687 1014559 998144 981808 966492 952973 941020 929720 918569 907887 898193 889591 881800 874482
61675 874482 867558 861448 856945 854514 853730 853643 853654 853781 854216 854928 855734 856434 856826 856803 856458 856055 855913 856383
61657 856383 857706 859735 861983 864224 866875 870530 875170 880058 884420 888084 891522 895346 899619 903551
61643 903551 906056 906710 905985 904509 902443 899763 896804 894186 892436 892036 893654 897933 905005 914441 925618
61628 925618 938016 951280 965145 979165 992327 1003076 1009992 1012529 1011151 1006916 1000897 993670 985223
61615 985223 975462 964787 953917 943266 932933 923240 914653 907033 899512 891390 882630 873298 863228
61602 863228 852646 842418 833081 824187 815219 806583 798940 792033 785045 777858 771061 764908 759108 753624
61588 753624 748836 744877 741575 739156 738265 739053 740956 743650 747637 753534 761314 770637 781518 794233
61574 794233 808834 825139 843021 862483 883597 906620 931976 959863 989928 1021522 1054157
61563 1054157 1087550 1121315 1154890 1187867 1220243 1252146 1283278 1312814 1340101 1365411 1389703
61552 1389703 1413574 1436722 1458523 1478748 1497404 1514219 1528734 1540683 1549786 1555248 1555941 1551217
61540 1551217 1541221 1526447 1507401 1484901 1460343 1435346 1411117 1388212 1366720 1346596 1327881
61529 1327881 1310775 1295556 1282436 1271466 1262605 1255932 1251891 1251207 1254343 1261149 1271314 1285179 1303725
61516 1303725 1327730 1357367 1392819 1434801 1484202 1541632 1607754 1683686 1770592 1869136 1979865
61505 1979865 2103940 2242922 2397846 2569026 2756765 2961696 3184032 3422513 3674014
61496 3674014 3933696 4195110 4450051 4688495 4899266 5071754 5197953 5273502 5297466 5271880
61486 5271880 5201642 5093973 4956894 4797847 4623606 4440775 4255498 4072612 3895511 3726813
61476 3726813 3568801 3423289 3291507 3174231 3071780 2983999 2910631 2851697 2807185 2776338
61466 2776338 2757656 2749706 2751769 2763611 2784895 2814860 2852364 2896021 2944269 2995423 3047921 3100732
61454 3100732 3153461 3205787 3256837 3305530 3351573 3395727 3438996 3482025 3525423 3570001 3616242
61443 3616242 3663933 3712667 3762331 3812778 3863514 3914114 3964539 4014594 4063489 4110259 4153996
61432 4153996 4193117 4225118 4247974 4261450 4266258 4262294 4248567 4224652 4191326 4149917 4101927 4049266
61420 4049266 3993958 3937469 3880903 3825831 3774189 3727301 3685630 3649489 3619310 3595226 3577119
61409 3577119 3565107 3559273 3558804 3562103 3567844 3575221 3583103 3589796 3593897 3594674 3591410 3583214 3570023 3553287
61395 3553287 3535176 3517450 3501350 3488167 3479599 3477811 3485312 3504471 3537060 3584518 3648540 3730898
61383 3730898 3832799 3955005 4098556 4264644 4453575 4664453 4895924 5146470 5413600
61374 5413600 5693127 5979238 6264536 6539779 6794308 7017448 7199853 7334443 7417456 7449087
61364 7449087 7432450 7371594 7270884 7135733 6972272 6785576 6579073 6356244 6121891 5881153
61354 5881153 5638158 5396378 5159343 4929914 4709380 4498242 4297555 4108722 3932384
61345 3932384 3768345 3616311 3476068 3347350 3230367 3126126 3035368 2957391 2890698 2834696
61335 2834696 2790013 2757324 2736607 2727375 2728623 2738506 2755040 2777440 2806139 2841122 2880802 2922860
61323 2922860 2965672 3008588 3051252 3093163 3133758 3172545 3209083 3242986 3273991 3302078 3327583
61312 3327583 3351122 3373212 3394025 3413556 3431834 3448647 3463176 3474230 3480844 3482526 3479042 3470326
61300 3470326 3456611 3438312 3415659 3388601 3357103 3321328 3281450 3237533 3189792 3138905 3085966
61289 3085966 3032144 2978543 2926324 2876718 2830682 2788599 2750653 2717546 2690445 2669923 2655163
61278 2655163 2644662 2637586 2634030 2634101 2637302 2642888 2650301 2659039 2668487 2678096 2687414 2695833 2702673 2707662
61264 2707662 2710910 2712220 2710850 2706178 2698355 2688171 2676778 2665810 2657361 2653436 2655696 2665975 2686568
61251 2686568 2719495 2765649 2824978 2897244 2982201 3079200 3186906 3303234 3425154 3548533
61241 3548533 3668169 3777799 3870178 3937985 3975494 3979515 3948876 3883747 3786240 3661385 3516648
61230 3516648 3359963 3198034 3035910 2877296 2724866 2580544 2445780 2321682 2208944
61221 2208944 2107728 2017592 1937636 1866893 1804678 1750409 1703269 1662376 1627238 1597586 1572755
61210 1572755 1551755 1534104 1520111 1510155 1504216 1502240 1504330 1510193 1518998 1530222 1544044 1560451
61198 1560451 1578566 1597469 1617057 1637242 1656746 1673705 1687406 1698628 1708257 1716302 1722362 1726354
61186 1726354 1728424 1728523 1726314 1721342 1713279 1702122 1687992 1670619 1649399 1624360 1596682 1567701 1537666
61173 1537666 1506092 1473161 1440013 1407662 1376209 1345277 1314630 1284226 1254120 1224568 1195903
61162 1195903 1168142 1140883 1113733 1086711 1060312 1035282 1012158 990865 970969 952433 935648
61151 935648 920363 905157 888578 870488 851627 832286 812370 792559 774338 758627 745202
61140 745202 733668 724159 716739 710877 706053 702444 700595 700773 702931 706893 712243 718362 724897 731910
61126 731910 739434 747318 755713 765206 776081 787818 799758 811907 824633 837793 850678 862809
61114 862809 874370 885820 897318 908656 919576 930049 940100 949340 956800 961511 963226 962376 959432
61101 959432 954618 948144 940186 930607 919245 906693 894250 882711 871541 859635 846566 832739
61089 832739 818585 804092 789046 773327 756985 740390 724327 709633 696613 684867 673728
61078 673728 662867 652612 643728 636743 631440 627189 623840 621931 621830 622974 624337 625458 626654 628324
61064 628324 630454 632810 635218 637471 639203 640100 640187 639783 639178 638389 637277 635888 634617 633935 633970 634505 635393
61047 635393 636806 639014 642113 646082 650960 656838 663749 671699 680666 690504 700926 711623 722279
61034 722279 732521 742181 751682 761735 772404 782807 792057 800158 807553 814168 819540 823734 827478
61021 827478 831302 835110 838679 842056 845321 848467 851755 855752 860802 866888 874213 883391 894721 907677
61007 907677 921539 936244 952394 970832 992582 1018718 1049776 1085513 1125616 1170251 1219474
60996 1219474 1272536 1328448 1386995 1448753 1514509 1585310 1662706 1748161 1842469 1946253 2060614
60985 2060614 2186587 2324769 2476800 2647057 2842106 3069330 3337445 3657407 4040812
60976 4040812 4498316 5042492 5691978 6470085 7400694 8511317 9840276 11429952 13300456
60967 13300456 15425398 17729790 20097382 22365073 24321138 25753662 26551965 26785960
60959 26785960 26682037 26505210 26442620 26562588 26831501 27129085 27253193 26961242 26067945
60950 26067945 24541520 22519376 20232470 17904340 15692699 13684110 11911647 10372853
60942 10372853 9046176 7905977 6930067 6098782 5392938 4795014 4290097 3864254 3503589
60933 3503589 3195725 2930721 2699934 2495771 2313346 2150595 2005746 1876030 1759448
60924 1759448 1655777 1564518 1483346 1409779 1342899 1282100 1225541 1171390 1119498 1070417 1023839
60913 1023839 979514 938641 902542 870601 841098 813537 788671 766696 747038 729617 714786
60902 714786 702065 690277 679020 668946 660644 654171 649488 646369 644086 642105 640932 641331 643034
60889 643034 645159 647626 651113 655774 660944 665913 670124 672850 673606 672673 670441 666687 661331 655278 649344
60874 649344 642843 634540 624666 614652 605222 596179 587813 580866 575050 569124 562744 556861 552075 547957
60860 547957 544372 542090 541544 542119 543223 545122 548199 552313 557311 563372 570352 577624 584952 592908 602126
60845 602126 612816 625167 639423 655293 671957 688849 705778 722313 737934 752759 767162
60834 767162 780536 791517 799593 805547 810156 813573 816191 818859 821716 823942 825104 825733 826040 825200
60820 825200 822555 818523 813586 807391 799638 791004 782211 772854 762105 750091 737754 725682 713791
60807 713791 701888 689934 678012 666502 656080 647232 639970 634180 629803 626542 623912 621816 620608
60794 620608 620506 621473 623672 627311 631936 636734 641682 647506 654287 661142 667626 674379 681833 689222 695559
60779 695559 700777 705272 709121 712431 715725 719287 722769 726069 729885 734789 740437 746319 752608 759582
60765 759582 766909 774207 781586 788942 795493 800925 806197 812136 817781 821318 822359 822240 822242 822509 822651 822450
60749 822450 821835 820952 820460 821161 823104 825350 826735 826748 825715 824329 822916 821077 818245 814455 810132 805244
60733 805244 799441 793073 787173 782062 776844 770732 764027 757290 750450 743476 737020 731470 726003 719591
60719 719591 712514 705947 700418 695624 691457 688234 685907 683791 681248 678203 675036 672261 670129 668334
60705 668334 666461 664851 664439 665455 667025 668448 670046 672176 674265 675609 676363 676804 676354 674349 671275
60690 671275 668072 664603 659836 653284 645276 636070 625797 615142 605044 595639 586343 576994 568152
60677 568152 560262 553263 547065 541768 537418 534098 532190 531999 533186 535066 537291 539768 542279 544858
60663 544858 548206 552942 558552 563706 567507 569956 571544 573015 575195 578293 581590 584430 587115 590208
60649 590208 593552 596920 601076 606926 613865 620208 625213 629502 633569 637195 640587 644806 650521 657286
60635 657286 664534 672440 681270 690662 700095 709510 718921 727933 736184 743871 751367 758492 764583 769141
60621 769141 772219 774233 775491 775793 774524 771260 766159 759640 751917 743184 733970 724867 716071 707550
60607 707550 699494 692177 685601 679806 675384 673138 673249 675090 677698 680182 682028 683443 685150 687397
60593 687397 689510 690817 691508 692065 692496 692929 694389 697913 703107 708548 713468 718108 722603 726569 729854
60578 729854 732729 735153 736618 736905 736340 735188 733426 731124 728414 725067 720694 715337 709339 702787 695677
60563 695677 688286 680683 672246 662669 653138 645341 639347 633626 627238 620859 615486 611372 608661 607967
60549 607967 609639 613145 617709 623004 628941 635440 642801 651737 662701 675651 690571 707637 726787
60536 726787 747883 771489 798783 830313 865247 901750 937427 969423 995111 1013080 1022992 1024529
60524 1024529 1017399 1002421 981695 957454 931597 906384 884347 866889 853790 844499 839089 837530
60512 837530 839028 842722 848312 855421 863136 870832 878750 887131 895546 903859 913236 925363 941020 960151
60498 960151 983068 1010924 1045237 1087487 1139047 1200975 1273931 1358572 1455991 1567649 1695081
60487 1695081 1839631 2002121 2182829 2382224 2601531 2841705 3101461 3376498 3659843
60478 3659843 3941127 4204988 4431807 4602028 4700780 4719656 4656691 4516685 4311240 4056803
60468 4056803 3771504 3472752 3175740 2891986 2628469 2388277 2172079 1979095 1807656
60459 1807656 1655947 1522425 1405461 1303076 1213392 1134958 1066326 1005905 952680 906451
60449 906451 866776 832197 801208 773445 749172 728033 709190 692323 677525 664322 651744
60438 651744 639434 627926 617651 608331 599568 591417 584051 577347 571157 565747 561612 558916 557305
60425 557305 556225 555404 555042 555532 556920 558681 560096 560889 561482 562651 564876 567948 571265 574544 578064
60410 578064 582055 586163 589804 592884 595717 598433 600966 603547 606626 610226 613858 617136 620072 622745
60396 622745 625167 627513 630033 632686 635349 638414 642623 648173 654430 660561 665956 670178 673217 675846
60382 675846 678914 682113 684146 684323 683205 681481 679121 676108 673155 670981 669404 667819 666169 664874
60368 664874 664113 663689 663404 663224 663251 663714 664704 665892 666931 668208 670586 674264 678491 682643 686885 691480
60352 691480 696147 700550 704871 709441 714387 719980 726696 734446 742328 749669 756801 764298 771869 778539
60338 778539 783569 786740 788114 787974 786750 784689 781907 778880 776390 774762 773707 773145 773557 775225 777846
60323 777846 781213 785515 790497 795044 798197 799954 800515 799464 796404 791820 786595 781099 775401 769901
60309 769901 764986 760446 755872 751379 747384 743974 741049 738744 737217 736280 735681 735427 735546 735995 737149
60294 737149 739847 744467 750411 756834 763329 769511 774747 778862 782447 785786 788125 788743 788186 787708 788002
60279 788002 789151 791193 793872 796289 797722 798609 800060 802763 806914 812655 819818 827623 835451 843637
60265 843637 852879 863354 875103 888748 904928 923383 943513 965635 990901 1020138 1053404 1090401
60253 1090401 1130730 1174053 1220713 1271877 1328514 1390652 1458227 1532032 1612994 1701033 1795532
60242 1795532 1896447 2003918 2117047 2234026 2353178 2473030 2591633 2706779 2816697
60233 2816697 2919772 3013955 3097387 3169278 3229135 3275425 3306157 3320801 3320643 3307341 3282097
60222 3282097 3246261 3201771 3150915 3096415 3041700 2990159 2944005 2904451 2872804 2850569 2838693
60211 2838693 2837644 2848223 2871424 2907624 2956769 3019281 3095709 3185437 3286628 3397488 3516561
60200 3516561 3641664 3769536 3896844 4020647 4137621 4243757 4335444 4410491 4467920 4507235
60190 4507235 4528026 4529775 4511939 4474647 4419331 4348349 4264214 4169753 4068639 3964844 3861611
60179 3861611 3761638 3668082 3584379 3512992 3455103 3411592 3383535 3371675 3376139 3396743 3432821
60168 3432821 3482722 3544274 3615824 3696112 3782977 3872904 3961925 4046356 4122684 4187595 4238471
60157 4238471 4273577 4292012 4294119 4281654 4256752 4220907 4175848 4125059 4073257 4024342 3980943
60146 3980943 3945931 3922882 3914572 3922084 3945982 3987582 4048677 4130950 4236197 4366377 4522842
60135 4522842 4706005 4916103 5153753 5419505 5713363 6034889 6382941 6754916 7146680
60126 7146680 7553294 7969124 8387176 8799313 9197571 9574708 9923381 10235779 10504706
60117 10504706 10724556 10891049 11000786 11051451 11041728 10970604 10837525 10644052 10395267 10099458
60107 10099458 9766877 9408738 9036283 8659837 8288650 7931419 7596118 7288872 7013515
60098 7013515 6772622 6568518 6403008 6276687 6189041 6138927 6124740 6144399 6195260 6273640
60088 6273640 6374347 6491140 6617683 6747636 6874026 6989596 7088222 7165578 7218457 7244430
60078 7244430 7242608 7214064 7160934 7085436 6989847 6876615 6747819 6604957 6449718 6284693
60068 6284693 6112930 5937075 5759342 5582170 5408600 5241917 5084884 4939210 4805900
60059 4805900 4686233 4582015 4494657 4424495 4371576 4336620 4320388 4322511 4341890 4378155 4431814
60048 4431814 4502966 4590665 4693343 4808861 4934034 5064918 5197634 5328201 5451779 5563162
60038 5563162 5658135 5733570 5786427 5813997 5815258 5790893 5741744 5668399 5572474 5457118 5325834
60027 5325834 5181908 5029365 4873329 4718719 4569321 4428301 4298510 4181776 4078903
60018 4078903 3990933 3919515 3865693 3829377 3810573 3810041 3828194 3864478 3918686 3991964 4085561 4199282
60006 4199282 4331877 4482177 4648855 4829497 5020533 5217585 5415283 5607293 5787304
59997 5787304 5949903 6090453 6204971 6290727 6346512 6371948 6366975 6332182 6268952 6179022 6064561
59986 6064561 5928952 5776794 5613013 5442725 5271831 5106375 4950782 4807618 4679222
59977 4679222 4568356 4477006 4406066 4356742 4330687 4327898 4345952 4382389 4436610 4508388 4595776
59966 4595776 4695725 4805592 4922731 5043610 5164806 5284086 5399272 5506934 5603670 5687989
59956 5687989 5759615 5817756 5861704 5892554 5912650 5923662 5926857 5925161 5923310 5925798 5936027 5957681
59944 5957681 5995652 6055164 6140775 6256425 6405553 6590893 6814668 7078918 7384880 7731960
59934 7731960 8117680 8538260 8988220 9459113 9938993 10412833 10862937 11269639 11613218
59925 11613218 11876436 12046157 12114073 12077569 11940398 11712070 11406263 11039259 10628348 10190004
59915 10190004 9738844 9288010 8849439 8432730 8044113 7687371 7365545 7081191 6835666
59906 6835666 6629389 6462758 6336046 6248634 6199269 6187058 6211435 6271232 6364404 6488562
59896 6488562 6641017 6818158 7015108 7225620 7441745 7653859 7851598 8024676 8162777
59887 8162777 8255784 8295518 8277399 8200230 8065251 7876467 7641274 7369238 7069973 6752668
59877 6752668 6426884 6102055 5785591 5482169 5195000 4926991 4680465 4456535 4255264
59868 4255264 4076237 3918913 3782686 3666561 3568599 3485951 3415802 3355863 3303673 3256051
59858 3256051 3210013 3163896 3117023 3068791 3018955 2968576 2919847 2875000 2835674 2802820 2776474
59847 2776474 2755985 2741071 2732262 2729497 2730703 2732443 2731590 2725703 2712596 2690853 2660634 2623071 2579211
59834 2579211 2530506 2479880 2430804 2385233 2343441 2305822 2273650 2247918 2228604 2215530 2209109
59823 2209109 2209889 2218098 2233948 2257846 2290015 2330315 2378548 2434438 2497213 2565439 2637181 2710076
59811 2710076 2781694 2850433 2915801 2977331 3033565 3082586 3122924 3153254 3171960 3178250 3173557 3160874
59799 3160874 3142963 3122075 3100924 3082530 3069089 3062157 3063931 3077167 3103645 3143816 3198317 3268973
59787 3268973 3358148 3467985 3600619 3758378 3943534 4158457 4406131 4689678 5010784 5368395
59777 5368395 5757988 6170389 6590364 6996495 7362755 7661208 7866231 7960390 7939309 7812037
59767 7812037 7597262 7318796 7002019 6670288 6341579 6027565 5735376 5469528 5232436
59758 5232436 5024648 4845682 4694600 4569941 4469834 4392484 4336322 4299950 4282567 4284187
59748 4284187 4304622 4342497 4396151 4465312 4550854 4653036 4771288 4905916 5058853 5232305
59738 5232305 5427543 5645417 5887287 6155146 6451486 6779162 7140595 7537028 7969284
59729 7969284 8439084 8948258 9496218 10079039 10691026 11325707 11974638 12626494 13268583
59720 13268583 13889099 14478051 15027819 15534780 16000800 16432824 16841342 17239411 17641923
59711 17641923 18063888 18518139 19013986 19557069 20149340 20788451 21466828 22171199 22883124
59702 22883124 23580360 24238318 24831398 25335150 25729486 26001383 26145623 26164454 26067705 25872486
59692 25872486 25600896 25276718 24923734 24565713 24225758 23924356 23678080 23500169 23401813
59683 23401813 23392911 23482300 23677667 23985169 24409381 24953845 25621029 26410567 27317078 28329175
59673 28329175 29428718 30588777 31771650 32929569 34007607 34946623 35686933 36175112
59665 36175112 36372586 36261313 35844663 35145954 34206254 33079805 31826579 30504953 29167280
59656 29167280 27857743 26610740 25449565 24385763 23419068 22538089 21722258 20944656 20175315
59647 20175315 19385888 18556036 17678677 16760362 15817028 14868797 13935984 13035986 12181257
59638 12181257 11379451 10634850 9949017 9320871 8747852 8227557 7757715 7335078 6955632
59629 6955632 6615874 6312770 6042704 5801901 5587916 5399414 5234398 5090092 4964611
59620 4964611 4857195 4766452 4689727 4624611 4569683 4523299 4482833 4445438 4408354 4368283 4321967
59609 4321967 4267937 4206444 4137399 4059870 3974002 3881774 3785186 3685340 3584060 3484701 3390019
59598 3390019 3300417 3215395 3135651 3062713 2997559 2940728 2892898 2854236 2823862 2800832 2784996
59587 2784996 2776240 2773771 2776936 2785824 2800229 2818891 2840551 2864866 2891384 2918509 2944501 2968845
59575 2968845 2991838 3013571 3034230 3054760 3076459 3100454 3128097 3161038 3200179 3245388 3297015
59564 3297015 3356917 3427227 3508877 3602014 3707070 3824701 3955506 4100616 4261810 4440338
59554 4440338 4636443 4850643 5084366 5338404 5611560 5901643 6206755 6524556 6851176
59545 6851176 7182000 7512833 7839388 8156683 8460380 8748307 9019634 9273210 9507887
59536 9507887 9723928 9922829 10105886 10273680 10426501 10564517 10688278 10800322 10906031
59527 10906031 11011879 11122747 11240986 11366697 11497275 11626740 11746490 11846825 11917442
59518 11917442 11947507 11926840 11847664 11705398 11498718 11229763 10903929 10528785 10113340 9668208
59508 9668208 9205034 8734445 8264844 7803432 7357197 6931899 6531020 6156825 5811664
59499 5811664 5497088 5212503 4956107 4726732 4523721 4345620 4190438 4056928 3944302
59490 3944302 3850851 3774138 3712673 3666475 3635847 3620443 3619660 3633310 3661739 3705578 3765343 3841134
59478 3841134 3933070 4042101 4169815 4317218 4484453 4671923 4880656 5110950 5361405 5629654
59468 5629654 5912824 6206496 6504220 6798736 7082496 7346149 7578047 7766926 7904642
59459 7904642 7985723 8005967 7963465 7860352 7701910 7494427 7245231 6963851 6660975 6345967
59449 6345967 6026387 5709149 5400219 5103100 4819206 4550066 4298078 4065084 3851400
59440 3851400 3656505 3479732 3320142 3176591 3048192 2934218 2833630 2745138 2667488 2599298
59430 2599298 2539141 2486420 2441625 2405030 2375742 2352716 2335959 2325828 2321768 2322677 2327913 2337013
59418 2337013 2349123 2363736 2381392 2402694 2427287 2454800 2485949 2521484 2560833 2602905 2647292
59407 2647292 2693222 2738307 2780345 2820187 2861363 2907307 2960536 3023974 3100896 3193215 3301202
59396 3301202 3424968 3564863 3720480 3890974 4077041 4281756 4509467 4764827 5052744
59387 5052744 5377842 5743405 6151286 6602428 7096413 7630477 8199570 8796790 9412606
59378 9412606 10034114 10646576 11236167 11791250 12302455 12763484 13171893 13527982 13833211
59369 13833211 14090481 14304736 14481007 14621521 14725592 14791577 14817255 14798773 14731412 14611940
59359 14611940 14439311 14213817 13937896 13618346 13266392 12895084 12517225 12144655 11786829
59350 11786829 11448920 11131975 10834610 10553138 10280608 10008207 9728700 9437680 9131917
59341 9131917 8808758 8468064 8113328 7750159 7384625 7023001 6671291 6333922 6013676
59332 6013676 5713087 5434689 5179535 4946875 4735858 4546550 4378901 4231876 4104205
59323 4104205 3995059 3903550 3828368 3768240 3722132 3689037 3668429 3660748 3666360 3684164 3712441
59312 3712441 3750988 3801058 3863161 3936286 4019287 4111491 4211610 4317416 4426837 4538116
59302 4538116 4648617 4754797 4853716 4943488 5022117 5087259 5137478 5172543 5192424 5197432 5189619
59291 5189619 5172555 5149296 5121861 5092991 5066821 5047139 5036286 5036315 5049828 5078881 5124180 5186002
59279 5186002 5264901 5360833 5472463 5597743 5734228 5878295 6024986 6169048 6305523 6429319
59269 6429319 6535356 6619598 6679334 6712784 6719544 6701263 6660513 6599154 6519374 6426240 6327298
59258 6327298 6229193 6136178 6051962 5980623 5924510 5882775 5853059 5833502 5822402 5817315 5815678 5815640
59246 5815640 5815680 5814327 5810807 5805249 5798108 5790501 5785234 5786179 5796465 5818654 5856856 5916865 6003539
59233 6003539 6119529 6267165 6449917 6670965 6931446 7230623 7566179 7933122 8322941
59224 8322941 8724173 9122788 9502125 9844446 10133778 10356736 10501168 10556530 10516948 10382773
59214 10382773 10158809 9852801 9476311 9044776 8574700 8081207 7578415 7079945 6597184
59205 6597184 6137778 5706596 5307011 4940447 4606176 4302903 4029814 3785524 3567381
59196 3567381 3372763 3200045 3047592 2913091 2794559 2690640 2599188 2517146 2442658 2375791
59186 2375791 2316299 2262402 2212878 2168582 2130448 2097433 2067909 2041739 2019540 2001181 1986438
59175 1986438 1975955 1970110 1968005 1969017 1974211 1984776 2000062 2018655 2040498 2066523 2096999 2131603
59163 2131603 2170382 2213419 2260394 2311655 2368847 2433197 2504013 2580073 2661647 2749877 2844926
59152 2844926 2946009 3052519 3163938 3279242 3397321 3517233 3637143 3753986 3865037
59143 3865037 3968803 4063439 4145629 4212335 4262613 4296592 4313981 4315042 4301940 4277619 4244244
59132 4244244 4204124 4161049 4119045 4080508 4046941 4020632 4004182 3999230 4007171 4030377 4071304 4131153
59120 4131153 4210741 4311749 4435598 4582003 4750164 4940550 5153886 5389156 5644100 5916687
59110 5916687 6204093 6500620 6798113 7087631 7358962 7599557 7796738 7941747 8030830 8063416
59100 8063416 8041569 7971272 7862049 7724190 7566724 7397334 7222236 7045335 6868150 6690557
59090 6690557 6511183 6327737 6138327 5942462 5740279 5531597 5316912 5098623 4879906
59081 4879906 4662660 4447682 4236330 4030685 3832258 3641676 3459463 3286179 3122139
59072 3122139 2967868 2824374 2692007 2569636 2455918 2350789 2254679 2166965 2086446 2012804
59062 2012804 1946310 1886557 1832574 1783743 1739473 1698421 1659198 1621497 1585671 1551687 1519398
59051 1519398 1489165 1461246 1435254 1411143 1389934 1372478 1358396 1347263 1339785 1336552 1336571 1338372
59039 1338372 1341542 1345737 1349198 1350088 1348762 1347209 1346872 1348359 1352559 1360361 1371698 1386188 1404049 1425061
59025 1425061 1447440 1469210 1489955 1509727 1527083 1539985 1548006 1552041 1552482 1549460 1544370 1539419 1535905
59012 1535905 1534238 1534970 1538337 1543538 1550133 1559415 1572651 1588545 1604152 1617664 1628608 1636055 1638762
58999 1638762 1636720 1630774 1621003 1607186 1590460 1572849 1555526 1538962 1524054 1511381 1500137 1489677
58987 1489677 1481337 1476773 1475297 1475043 1475989 1479496 1485435 1492400 1500427 1510858 1523499 1536488 1549255
58974 1549255 1563373 1580117 1599244 1620395 1643696 1668645 1694267 1720683 1748935 1779227 1810994
58963 1810994 1844496 1880393 1917910 1955446 1993000 2032036 2072961 2114818 2157452 2201843 2248121
58952 2248121 2295409 2343989 2395701 2451935 2512988 2579461 2652384 2731852 2817533 2910687 3013743
58941 3013743 3127763 3252265 3387570 3535193 3695750 3868617 4053944 4253064 4466911
58932 4466911 4696209 4943489 5212744 5506930 5828091 6180107 6568699 6998135 7470274
58923 7470274 7987413 8553481 9171360 9841113 10561506 11330715 12143995 12992138 13862841
58914 13862841 14741253 15607774 16437004 17200445 17869707 18417646 18819818 19057939 19122672
58905 19122672 19013720 18739182 18315233 17764174 17110842 16380351 15597819 14787128 13968440
58896 13968440 13157553 12367350 11607979 10885583 10203161 9563401 8969155 8421127 7917394
58887 7917394 7455832 7035095 6652820 6305136 5988671 5701127 5439389 5199280 4977982
58878 4977982 4774650 4587945 4415098 4254259 4105633 3969314 3843923 3728293 3622460
58869 3622460 3525999 3437208 3354915 3279222 3209667 3144660 3083653 3027925 2978207 2933536 2893434
58858 2893434 2859108 2831271 2808665 2790077 2776078 2767631 2764782 2767848 2778055 2795694 2819303 2847906
58846 2847906 2882424 2923772 2971299 3024371 3083875 3150902 3225544 3308130 3399979 3501699 3612411
58835 3612411 3732067 3863053 4008133 4168080 4342555 4532019 4737666 4960785 5203387
58826 5203387 5468449 5758750 6076612 6425326 6809255 7231847 7695100 8201569 8755020
58817 8755020 9358128 10011007 10712423 11460167 12248851 13068677 13906685 14746875 15568064
58808 15568064 16343945 17046925 17650944 18130991 18464009 18633538 18633134 18465005 18137926 17667883
58798 17667883 17077866 16393819 15640640 14841823 14019790 13193892 12378924 11586596 10826778
58789 10826778 10106172 9427753 8793084 8203692 7659266 7156878 6693694 6268731 5880731
58780 5880731 5526493 5202844 4908162 4640260 4394940 4168517 3959832 3767995 3590259
58771 3590259 3424155 3269652 3126925 2993737 2867392 2747775 2636262 2532955 2437065 2348671
58761 2348671 2267971 2193936 2125638 2063819 2009515 1962291 1921292 1886558 1857756 1833249 1812115
58750 1812115 1795521 1784465 1777880 1774614 1775410 1780942 1789758 1800158 1812242 1825832 1838084 1845601 1847454
58737 1847454 1843975 1834216 1817152 1794110 1767525 1738385 1707006 1674976 1643900 1613289 1581878 1549961
58725 1549961 1518334 1486246 1452660 1418360 1384576 1350655 1315365 1279488 1244882 1211994 1180399
58714 1180399 1150668 1123515 1098216 1073986 1051834 1032918 1016251 1000259 985417 972968 962255
58703 962255 951756 941792 933759 927509 921821 916665 912696 909248 905057 900262 895640 890690 884472 877461
58689 877461 870485 862797 853227 842361 831581 820977 810228 800435 792921 787200 782216 778486 777034
58676 777034 777401 778800 782009 787908 795461 803304 811897 821738 831023 837815 843197 849550 856913 863781
58662 863781 870193 877067 883475 887634 889782 891255 891565 889319 885231 881371 878157 874929 872723 873486 877099
58647 877099 882014 888281 897167 908430 920847 934921 952242 972624 994693 1018781 1046499 1077972
58635 1077972 1112354 1150514 1194355 1243896 1298002 1357575 1425109 1501397 1585696 1679010 1784306
58624 1784306 1903532 2037156 2186542 2354076 2540847 2746543 2971281 3214918 3474618
58615 3474618 3745252 4021451 4296444 4559297 4796238 4994890 5145472 5239375 5270444 5238096
58605 5238096 5146923 5003655 4816862 4598400 4361280 4115578 3868468 3627123 3398084 3184098
58595 3184098 2984920 2801233 2634747 2484821 2348631 2225002 2114988 2018352 1932688 1856482
58585 1856482 1790230 1733995 1686580 1647502 1617246 1595045 1578627 1566377 1557701 1551466 1546254 1541894
58573 1541894 1538611 1535413 1531740 1529840 1532733 1540572 1551732 1566377 1585479 1606996 1626524 1641299
58561 1641299 1650147 1650198 1637675 1612148 1576641 1533575 1483998 1430538 1377197 1325770 1275776 1227949
58549 1227949 1184465 1145649 1109866 1076750 1047230 1020564 994957 971054 951022 934175 917429
58538 917429 900276 885280 873231 861930 850418 840402 832510 824909 816634 808822 801629 793361 783600
58525 783600 774031 765332 756314 746736 737796 729425 720335 711193 704379 700231 696877 693947 692922 693606
58511 693606 694160 694930 698287 704218 710175 715832 723748 734578 745899 756822 769508 784930 801272
58498 801272 817844 836551 857978 879856 900939 922759 946037 968788 989342 1007922 1024097
58487 1024097 1036114 1043782 1048614 1050297 1046587 1037458 1025520 1011582 993805 972094 949117 925960
58475 925960 901004 874304 848854 826236 805135 785330 768827 755728 743322 730697 719929
58464 719929 711374 702365 692202 683767 678342 673320 667091 661785 659035 657182 654857 653367 653563 654310
58450 654310 655779 660128 667182 673753 679033 686254 697226 709868 723152 739628 760597 783220 804916
58437 804916 826363 847827 866879 882087 894608 903838 906030 899729 888254 874469 857683 838019
58425 838019 818909 802374 786409 769914 755668 745580 737518 729848 724674 723599 724644 726316 730394
58412 730394 737825 746283 754675 765654 780760 797466 813693 830583 848033 862396 871647 878009
58400 878009 882602 882553 876514 867787 858695 847236 832804 819700 810943 803790 795404 787847 783277 779441
58386 779441 774381 770623 770180 770157 767874 765701 766301 767629 767107 766295 767008 767349 765941 765565 768264 771431
58370 771431 773016 775811 782207 789590 795480 802246 812042 822037 829505 836892 847066 858337 868847
58357 868847 880920 896270 912004 926149 941855 961108 979702 993630 1004994 1016251 1024263 1025824
58345 1025824 1023641 1020959 1015656 1005609 994560 986530 979628 971352 964579 962159 961161 958897 959011 964966
58331 964966 973029 978636 984229 993796 1005050 1014295 1023775 1036854 1050962 1062573 1074216 1089415 1105830
58318 1105830 1120479 1136454 1157198 1179581 1199852 1220638 1244480 1266376 1280804 1290383 1299585 1305960
58306 1305960 1305988 1303526 1303567 1303504 1299522 1295755 1297808 1302972 1306193 1310007 1319072 1330615 1340034 1350190 1365419
58291 1365419 1382209 1395887 1410598 1432280 1457684 1480877 1504591 1534289 1567106 1597945 1630684
58280 1630684 1671842 1718836 1765872 1815511 1872753 1933695 1991830 2049332 2109947 2167213 2212424
58269 2212424 2247917 2279846 2304809 2317133 2322411 2329642 2336648 2337693 2338517 2348623 2365303 2380743
58257 2380743 2398235 2425485 2458700 2489821 2522880 2566371 2616123 2663002 2710761 2768509 2832591
58246 2832591 2894314 2958413 3034597 3118035 3198189 3279745 3374158 3477840 3580219 3685930 3806506
58235 3806506 3937482 4067145 4200638 4351143 4514548 4678190 4847316 5036543 5242499
58226 5242499 5452262 5671301 5914627 6178208 6449109 6735702 7056288 7406472 7771455
58217 7771455 8161829 8601542 9089435 9610834 10177980 10818224 11531723 12305055 13157893
58208 13157893 14129778 15231091 16458920 17852718 19480700 21385089 23606846 26257783
58200 26257783 29500515 33464811 38256118 44033272 50992203 59293444 69124881 80841282
58192 80841282 94925732 111830383 132038924 156309024 185567623 220263060 259680721
58185 259680721 301655089 342494848 377051475 399581777 405780856 394869525 369954035
58178 369954035 336309169 299101171 262116822 227639695 196750316 169662099 146124605
58171 146124605 125790283 108336178 93414095 80665536 69807875 60634697 52942494
58164 52942494 46522574 41210187 36877331 33384164 30588638 28395124 26750670 25606087
58156 25606087 24919197 24681751 24909661 25623313 26858288 28652534 30971606 33658144 36467743
58147 36467743 39097291 41139354 42101204 41616663 39689807 36697080 33150202 29477351
58139 29477351 25967018 22787390 19994787 17564530 15456722 13647291 12104377 10779249
58131 10779249 9636611 8665042 7848234 7154211 6560776 6063450 5649717 5291419 4970568
58122 4970568 4688285 4441218 4212839 3994816 3794008 3611352 3435511 3263653 3107248
58113 3107248 2970745 2844530 2724785 2620304 2533516 2453882 2376134 2306640 2245876 2182927
58103 2182927 2113674 2047309 1988925 1932363 1875959 1828578 1793623 1762558 1730310 1701981 1678526
58092 1678526 1650735 1613693 1573398 1533491 1489097 1439282 1392022 1351031 1310346 1267203 1227619
58081 1227619 1194190 1160857 1125012 1092671 1066518 1040749 1012730 987981 968610 948439 924780
58070 924780 903742 888728 874649 858569 845205 836679 827416 814554 803289 796737 790373 781421
58058 781421 774053 770242 764938 755245 745280 737399 727768 715082 704422 697847 690255 679096 669153
58045 669153 663214 657132 648784 642843 641693 640422 635877 632187 632329 632655 630793 630683 634595 638147 638386
58030 638386 638938 642089 643587 640645 637549 637983 639040 638058 638233 642123 646423 648467 651267 657049 662399
58015 662399 664901 668034 674448 680761 684141 687750 694528 701661 706354 711203 718753 726483 732072 738029
58001 738029 746223 753383 756772 758750 760999 759840 752179 740736 728647 714249 696021 677327 661267
57988 661267 645855 629102 613859 602860 593808 584158 575949 571296 567850 563344 559928 559548 559800 558861
57974 558861 559567 563989 568859 571103 573058 577304 581199 581675 580880 581778 582502 580400 577672 577645 579087 579220
57958 579220 578837 579584 579712 577317 574360 572924 570969 566294 561094 558094 555790 552113 549152 549465 551216
57943 551216 551666 552073 554330 556166 554657 551459 549672 548407 545128 540518 536389 531573 524477 517012 511476
57928 511476 506121 498137 488413 479170 469698 458796 448592 441540 436253 430515 425669 423733 423098 421543
57914 421543 420740 423146 427047 429384 431017 434624 439711 444282 449197 456358 464711 472340 480308 490064
57900 490064 499417 505538 509786 515171 521251 525979 530253 535902 541213 543301 543099 543425 543838 541959 538179
57885 538179 534505 530448 524620 518767 515543 513697 510056 504924 501038 498520 495446 492191 490624 489952
57871 489952 487823 484756 483300 483690 484371 485827 489683 494851 498681 501210 504366 507863 509825 510650 512368
57856 512368 514794 516039 515995 515765 514711 511867 509163 509230 510911 510899 509045 508056 508724 509462 510024 511687 514118
57839 514118 515678 516492 517821 518976 518271 516265 514646 512829 509207 504749 501606 499017 494503 488312 482703
57824 482703 477556 470728 462262 454156 446359 436959 426165 416230 407678 399313 391679 386595 383437 379682
57810 379682 375087 371592 369284 366321 362859 361100 361188 360791 359147 358018 358335 359293 361026 364862 370653
57795 370653 377059 384520 394710 407110 419535 431947 446013 460705 472188 478659 481808 483012
57783 483012 481660 477984 474068 470913 467382 462843 458136 453384 447707 441595 436730 432938 428207 422225
57769 422225 417032 413593 410626 407501 405515 405463 406463 407916 410383 413924 417699 421493 425594 429256 431546
57754 431546 433502 436918 441219 444188 445539 446937 448717 449684 450139 451958 455375 458637 461098 463773 466715
57739 466715 468789 470298 472874 476589 480065 483558 488787 495482 501371 505959 511229 518119 525466 532848
57725 532848 541267 550488 558925 566890 576774 589175 601940 613907 626604 641333 657466 674561
57713 674561 693362 713816 734844 756875 781898 810340 840662 872636 908104 947913 991222
57702 991222 1038569 1092370 1153519 1220827 1295066 1380246 1479469 1592517 1719033 1861043 2020640
57691 2020640 2197913 2392902 2607072 2840954 3092159 3356676 3629580 3903012 4165751
57682 4165751 4406170 4613822 4777912 4887903 4938059 4929868 4869293 4764204 4625360 4466434
57672 4466434 4300400 4137155 3985200 3852537 3743819 3658491 3592845 3541247 3493787 3435835
57662 3435835 3353482 3239737 3095737 2928779 2750436 2573442 2407026 2255161 2119423 2001373
57652 2001373 1901279 1817118 1746702 1689244 1643812 1608358 1581627 1564215 1556525 1557546 1566687 1584833
57640 1584833 1612521 1649127 1694965 1752052 1821671 1903360 1997386 2105940 2230601 2370945 2526905
57629 2526905 2700060 2890942 3097185 3315654 3543842 3777177 4006787 4221622 4411054
57620 4411054 4564475 4671247 4723841 4720197 4662216 4554027 4402899 4219234 4013312 3793250
57610 3793250 3566713 3341836 3124424 2916353 2718492 2533248 2362608 2205942 2061819
57601 2061819 1930215 1811219 1703575 1606254 1519459 1442374 1372128 1306985 1248379 1197686 1153064
57590 1153064 1111781 1073646 1039642 1009016 980360 954077 931171 910818 891552 873715 858389
57579 858389 844910 831645 818434 806274 795476 785949 778335 773038 769027 765243 762228 760840 760532
57566 760532 760454 761120 763424 767108 771665 777533 784951 793023 801402 811450 824202 838710 853995 871030
57552 871030 891119 913910 938813 966809 998941 1034617 1073394 1116997 1167565 1225369 1290233
57541 1290233 1363644 1447302 1540970 1644022 1757838 1884461 2024088 2175990 2340539 2517797
57531 2517797 2704930 2897029 3089297 3276074 3448748 3597097 3712442 3788191 3819086 3802784
57521 3802784 3741820 3642194 3510704 3355055 3184697 3008525 2832005 2658247 2490732 2332886
57511 2332886 2186028 2050244 1926533 1815912 1717261 1628430 1548882 1479080 1418042 1363892
57501 1363892 1316242 1275772 1241860 1212852 1188280 1168819 1154384 1144160 1138018 1136076 1137441 1141293
57489 1141293 1148630 1161097 1178738 1200791 1227923 1261673 1302392 1349811 1404922 1469234 1542837
57478 1542837 1625414 1718588 1825017 1945508 2079026 2224982 2383246 2552220 2728867 2910128
57468 2910128 3092019 3267387 3426420 3559330 3657405 3712911 3720955 3681795 3599795 3480526
57458 3480526 3330447 3158180 2973300 2783497 2594290 2410563 2236174 2072534 1919744
57449 1919744 1778768 1650723 1534860 1429496 1334367 1249782 1174227 1105342 1042779 987572
57439 987572 939064 895095 855000 819732 789038 761078 734976 711345 690160 670453 652234
57428 652234 636336 622246 608402 594836 583164 573713 564933 556004 547714 540370 533094 525725 519290
57415 519290 513985 508592 502509 496555 491329 486470 481864 477944 474495 470837 467356 465166 464161 463165
57401 463165 462003 461524 461587 461073 460050 459758 460199 459900 458493 457441 457631 458169 458245 458388 459172 460212 461041 461612
57383 461612 461608 460664 459492 459274 459809 459713 458530 457033 455552 453732 451940 451033 450655 449604 448026 447361 447997
57366 447997 448854 449390 450075 450741 450538 449842 450173 451854 453574 454607 455583 456790 457690 458427 459930 462135 463904
57349 463904 464969 466133 467447 468216 468959 471163 474755 477962 480069 482161 484771 487043 488767 490961 493802
57334 493802 496172 497939 500469 504116 507370 509438 511558 514792 518459 521750 525063 528702 532000 534679
57320 534679 537551 541082 544794 548664 553424 558929 563992 568393 573277 579096 585083 591198 598426 606526
57306 606526 613783 619876 626756 635656 645348 654526 663946 675003 687921 702415 718406 735154 751451
57293 751451 767577 785310 805204 825879 846762 869303 894361 920691 947393 975648 1006373
57282 1006373 1038076 1068741 1098270 1127384 1155560 1181485 1204231 1222697 1235274 1241338 1241732 1236730
57270 1236730 1225138 1206638 1183361 1157778 1130497 1101520 1072117 1043821 1016759 990410 965042
57259 965042 941280 919261 899268 882052 867599 854782 843085 833390 826276 820989 816871 814243
57247 814243 812990 811980 810887 810928 812728 815070 816822 818431 820419 822150 823376 825337 828923 833222 837171
57232 837171 841188 845897 850682 854810 858649 862719 866853 871277 876902 883598 889898 895468 901957 910207
57218 910207 918624 925795 932783 941140 950380 959238 967949 977470 987768 998513 1010236 1023250 1036566
57205 1036566 1049303 1061951 1074966 1087505 1098944 1110268 1122501 1134985 1146604 1157542 1168560
57194 1168560 1179703 1190906 1202702 1215269 1227941 1240504 1253564 1266994 1279772 1292132 1305872
57183 1305872 1321560 1337551 1352981 1369615 1389384 1412130 1437079 1464369 1493610 1523104 1552145
57172 1552145 1582076 1613524 1644794 1674638 1704411 1735662 1767813 1800149 1833864 1869971 1907134
57161 1907134 1943613 1979569 2015601 2051047 2085697 2121116 2158285 2195942 2233183 2271448 2311804
57150 2311804 2352593 2392110 2431508 2472675 2515420 2559154 2605161 2654564 2706029 2758022 2811413
57139 2811413 2867458 2925353 2984414 3046507 3113497 3184208 3256679 3331519 3410298 3492549 3577157
57128 3577157 3664894 3756952 3852918 3952833 4059215 4174288 4297240 4426809 4564367 4711661
57118 4711661 4867885 5031979 5205674 5391399 5589430 5799837 6024902 6267043 6527202
57109 6527202 6808104 7116248 7458031 7837444 8260922 8741406 9295036 9938315 10692137
57100 10692137 11584607 12647085 13913237 15426559 17243263 19422473 22018214 25084224
57092 25084224 28677823 32851264 37644758 43091894 49219314 56028061 63479326 71502003
57084 71502003 79998937 88837951 97863186 106936432 115923338 124556307 132286555 138340290
57076 138340290 142015758 142987465 141370821 137555448 132005836 125161187 117409097 109073262
57068 109073262 100412715 91642755 82953811 74507410 66425447 58794367 51678423 45127130
57060 45127130 39176759 33850168 29152499 25064843 21545921 18542718 15998437 13853137
57052 13853137 12045591 10520053 9230014 8135435 7200756 6397132 5702771 5099082 4569079
57043 4569079 4100241 3685290 3318387 2992925 2703596 2447226 2220016 2016457 1832213
57034 1832213 1665764 1516062 1380688 1257310 1144843 1042112 947142 858747 777331 703398
57024 703398 636606 576648 523544 476637 434662 397044 363767 333974 306233 280298 257114
57013 257114 236976 219171 203538 190865 181518 175094 171722 172458 178132 188956 205602 229741 263278
57000 263278 307879 365626 439707 534172 652675 796574 963343 1145801 1330661 1495846
56990 1495846 1611642 1651439 1606970 1493583 1339639 1171343 1006465 856223 726573 617205
56980 617205 522897 437396 355738 274758 194270 117640 48988 -10277 -61056 -103814 -138307
56969 -138307 -165194 -185710 -200075 -208127 -211045 -210478 -206354 -197446 -183675 -165942 -144029 -116725 -83959
56956 -83959 -47286 -8761 28723 60300 80564 86754 79631 61854 37005 9508 -16756 -40189
56944 -40189 -60781 -78220 -91960 -102394 -110128 -114446 -114192 -109729 -102222 -91257 -74864 -51673 -21477
56930 15924 60355 109371 157966 199948 228842 238898 227937 199547 160942 118482 76072 36550
56917 1971 -27604 -53597 -76681 -96414 -112822 -126729 -138487 -147872 -155262 -161519 -166733 -170376 -172529
56904 -172529 -173726 -173909 -172829 -171035 -169016 -165850 -160235 -152392 -143345 -132819 -119654 -103886 -86544
56891 -86544 -67571 -45733 -20439 7991 39713 75060 113021 151426 188303 221282 246149 258423
56879 258423 256893 244144 223795 198960 173016 149293 129233 112501 99231 90559 86784 86929
56867 86929 90734 99572 114882 137099 166654 204732 252582 310933 379831 457334 537627 611221
56855 611221 667502 697436 696073 665229 613868 553661 493154 436441 386029 344345 312422 289567
56843 289567 275292 270279 275191 290047 315114 351179 398995 459872 536571 631659 744417 869981
56831 869981 1000204 1122807 1220471 1275356 1277906 1231438 1148412 1043751 931134 821560 721853
56820 721853 634405 559320 496645 446496 408417 381724 366078 361442 368163 387257 419874 466351
56808 466351 526391 599652 684650 776357 865233 938602 983461 990554 958826 896421 815903 728121
56796 728121 640545 558962 487360 426206 373574 328611 292266 264824 245149 232715 228240 231806
56784 231806 242384 259870 285668 320506 362992 410353 458428 500368 527705 534431 519682 486695
56772 486695 440911 389032 337309 289135 245114 205579 171484 142750 117939 96322 78473
56761 78473 64134 51414 39039 27752 18534 11041 4757 148 -2467 -4015 -5647 -7613 -9816 -12373
56747 -12373 -15021 -17117 -18718 -20603 -22805 -24390 -25074 -25758 -27047 -28547 -29989 -31678 -33447 -34553 -34975
56732 -34975 -35504 -36323 -36935 -37595 -39143 -41127 -41906 -41042 -39895 -39466 -39377 -39416 -40192 -41644 -42669 -42845 -42829 -42610
56714 -42610 -41228 -38778 -36749 -35742 -34826 -33809 -34016 -35879 -37860 -38823 -39509 -40555 -40996 -40080 -38826 -38408
56698 -38408 -38467 -38194 -37655 -36973 -35719 -34174 -33644 -34457 -35118 -34491 -33298 -32433 -31376 -29418 -26978 -24613 -22137
56681 -22137 -19724 -18431 -18550 -18822 -18206 -16988 -15397 -12917 -9941 -8344 -9146 -11149 -12858 -14155 -15153 -15266
56665 -15266 -14625 -14636 -15805 -16644 -15990 -14688 -13755 -12668 -10860 -9116 -8001 -6576 -4174 -1862 -632 211
56648 1378 2000 1376 718 1413 2969 4309 5652 7473 9051 9770 10581 12500 14916 16962 19141 22008
56632 22008 24605 25896 26443 27071 27234 26435 25813 26480 27472 27225 25888 24457 22825 20517 18234 16803
56616 16803 15597 13709 11708 10571 9919 8976 8183 8196 8326 7610 6387 5305 3944 2037 808 1374 2957
56599 2957 4313 5661 7498 8837 8611 7684 7596 8347 9195 10397 12217 13420 12854 11544 11267 12048 12940
56582 12940 14145 16277 18488 19457 19498 19823 20592 21537 23472 27129 31302 34116 35413 36187 36695 36969 38111
56565 38111 41015 44754 48139 51827 56919 62666 67727 72568 78258 83907 87746 90019 92465 95624
56551 95624 98884 102403 106647 110639 112966 113939 114695 114900 113529 111141 109007 106722 103060 98585 95067
56536 95067 92771 90581 88244 86214 83907 80461 76717 74097 72076 69087 65373 62451 60290 57485
56522 57485 53940 50961 48951 47338 46438 47034 48406 49075 49208 50087 51631 52780 53895 56317 59876 63155
56506 63155 65931 69021 72148 74365 76210 78982 82268 84620 86274 88572 91143 92364 92341 92630 93240
56491 93240 92741 91247 90338 89954 88284 85064 82241 80933 80355 80101 80903 82659 84159 85243 86957 89263
56475 89263 90886 91743 93245 95879 98683 101337 104512 107994 110775 113125 116298 120032 122712 124116 125641
56460 125641 127746 129641 131544 134637 138545 141410 142730 143656 144386 143963 142868 142969 144431 145371 145132 145244
56444 145244 146566 148059 149053 150204 151606 152347 152534 153358 154694 155103 154617 154887 156011 155881 153439 150040
56428 150040 146804 143129 138666 134422 131004 127854 124780 122185 119456 115550 111398 109141 108591 107215
56414 107215 104159 101459 100587 100581 100477 100835 101899 102758 103287 104558 106555 107872 108240 108822 109472 108549 106098
56397 106098 104375 104352 104561 104218 104554 106073 107387 107917 108870 110494 111227 110823 111429 114195 117485 119752 121499
56380 121499 123148 123744 123258 123537 125469 127639 129058 130701 133132 135286 136863 139241 142665 145273 146296
56365 146296 147487 149891 151954 152411 152325 152707 152840 152649 153980 157677 161880 164956 167592 170355 171869 171359
56349 171359 170558 171135 172508 173921 176288 180142 184046 186863 189463 192607 195448 197703 200882 205735 210841
56334 210841 215303 220376 226882 233577 239733 246625 254706 262016 267355 272423 278802 285412 291011 296695
56320 296695 303685 310906 316830 321643 325729 328280 329201 330087 331566 332015 330558 328800 327948 326928 325105
56305 325105 323981 324273 324191 322673 321441 321733 321926 320666 319452 319753 320395 320268 320765 323060 325787 327925
56289 327925 331198 336959 343616 349855 357529 368395 380765 392455 404422 418369 433375 448125
56277 448125 464098 483249 504671 526708 550268 577007 606339 637327 671443 710379 753184
56266 753184 798690 848870 906713 972468 1044879 1124424 1212619 1309895 1416747 1535023 1665472
56255 1665472 1805810 1953561 2108662 2271072 2438238 2607280 2776938 2944688 3104721
56246 3104721 3251675 3383809 3499779 3595357 3666714 3714290 3740200 3744525 3727573 3693067 3645522
56235 3645522 3586749 3518168 3443732 3366879 3287047 3202783 3115824 3028634 2940558 2850153 2758689
56224 2758689 2667484 2574408 2477011 2376691 2275863 2173622 2068391 1962379 1859061 1758499
56214 1758499 1659343 1563108 1472046 1385011 1300033 1219024 1145460 1079142 1017606 960808 910056
56203 910056 864122 820801 780772 745768 714684 685547 659414 638156 620342 603464 588180
56192 588180 576085 565501 554012 543072 535490 530342 524996 520173 518231 518324 518101 518480 522013 528091
56178 528091 534243 540387 547459 553948 558372 562993 570411 578739 584864 589869 596156 601910 604028 604077 605515
56163 605515 607275 606119 603294 602652 603922 603978 603136 604144 606439 607463 608261 611769 617095 621527 626665
56148 626665 636343 649913 663885 678795 698141 721884 747584 776808 813848 859125 910293 968770
56136 968770 1038719 1120581 1212021 1313890 1428284 1551505 1675600 1795950 1911010 2016298
56126 2016298 2106408 2182417 2250263 2312253 2366725 2414552 2458139 2494635 2517829 2526744 2525504 2515580
56114 2515580 2495622 2467958 2437114 2401879 2356298 2298184 2229345 2148600 2053207 1947132 1839526
56103 1839526 1734741 1631649 1532368 1442894 1364631 1293647 1228895 1173074 1125179 1080638 1039426
56092 1039426 1005803 979582 955848 933561 915998 902502 888607 874726 865791 861738 857268 851505
56080 851505 848761 849170 847939 844682 844127 846743 848179 848734 853563 862485 869517 873640 880059 889672 897543
56065 897543 903205 912061 924944 936571 945925 957731 972200 983940 992710 1004386 1019631 1032647
56053 1032647 1042718 1055596 1071782 1085347 1096248 1111538 1132120 1150814 1166095 1184872 1208730
56042 1208730 1230514 1247983 1267839 1292455 1315689 1335763 1359239 1388133 1416095 1441450 1470778
56031 1470778 1505507 1538505 1568210 1602311 1643015 1682688 1718548 1757278 1800494 1840550 1875670
56020 1875670 1914111 1958210 1999860 2037016 2078638 2127642 2175413 2219160 2267742 2324014 2378845
56009 2378845 2429457 2486012 2552878 2621416 2688561 2763767 2849798 2936018 3019007 3110113 3214006
55998 3214006 3320232 3424989 3539988 3670079 3803998 3937464 4082839 4245176 4412196
55989 4412196 4579288 4759970 4959614 5164407 5369281 5590259 5835548 6092284 6356603
55980 6356603 6647521 6975087 7325272 7693451 8100808 8559452 9055378 9585943 10178438
55971 10178438 10850140 11588308 12393436 13302041 14341684 15508082 16815946 18326619 20097028
55962 20097028 22157721 24581469 27518922 31125087 35510511 40808022 47214300 54914598
55954 54914598 64062186 74918115 87926354 103567878 122271647 144624839 171529433
55947 171529433 203815421 241492717 283226199 326129996 365645672 395892420 411257493
55940 411257493 408848391 389973527 359301151 322482581 284184296 247469621 214007415
55933 214007415 184406532 158580319 136177980 116859330 100295733 86119275 73993787
55926 73993787 63679487 54972734 47642337 41470740 36298357 31980264 28348211 25256549
55918 25256549 22622041 20381750 18451707 16759395 15276644 13985452 12843909 11814836
55910 11814836 10894815 10084736 9360036 8696471 8097183 7567928 7090912 6647554 6242956
55901 6242956 5884272 5557412 5247551 4961232 4706671 4472476 4246384 4035676 3849115
55892 3849115 3677008 3508257 3349580 3209436 3079770 2951454 2831404 2726995 2629247 2528535
55882 2528535 2431909 2348208 2270591 2190189 2112991 2046890 1985239 1919259 1854208 1797781 1744528
55871 1744528 1686969 1630694 1583625 1541221 1496494 1453861 1418964 1385294 1345058 1303535 1269051
55860 1269051 1238319 1205151 1174329 1153337 1138921 1124935 1115153 1115434 1121121 1124769 1128883 1138704 1149497
55847 1149497 1152911 1149200 1141975 1127945 1103321 1073762 1046787 1020493 990100 958902 932078 906186
55835 906186 875614 843434 815486 789724 761667 734387 712818 693900 672487 651502 636258
55824 636258 624253 610462 597267 589140 582762 572434 560363 551770 544644 534198 522901 516297
55812 516297 513110 508919 505398 506474 509402 509050 507179 508359 510561 508911 505096 503910 504048 501266 497180
55797 497180 495837 494821 488767 478830 469934 461473 449406 434926 422465 411507 398623 385208 375155
55784 375155 367202 357537 347555 341213 337177 331473 325494 323445 324165 323350 321591 322173 322981 318701 309499
55769 309499 299836 290372 278709 266556 258333 253688 248657 243110 240103 239153 237087 234265 233172 232225
55755 232225 227824 221149 216101 211906 204615 194571 185543 177777 168829 160018 154984 152756 149151 144213
55741 144213 141498 140892 139014 136035 135261 136419 136059 134231 134195 135849 135884 134283 134262 135915 136156 134894 135065
55724 135065 136473 135583 131669 127515 124003 119620 115192 113432 113714 112729 110286 109148 109466 108911 108026 109803
55708 109803 114076 117901 121410 127658 136616 144912 151719 159458 168475 176278 182294 188168 193262 195077
55694 195077 194289 194186 194969 193728 190117 186804 184236 180276 175297 172307 171578 170304 167988 167153 168333
55679 168333 169440 170446 173643 178835 183210 186368 190378 194610 195786 193777 192111 192006 191036 188527 187094
55664 187094 187713 188178 187600 187721 188680 188090 185486 183311 182474 181262 179445 179034 180036 179879 177925 176175
55648 176175 174663 170673 163619 156297 150184 143668 135889 128237 121020 112778 103815 96402 90694 84449
55634 84449 77407 71795 67941 63733 58992 55879 54324 51686 47724 45184 44546 43009 39749 37357 36741
55619 36741 35460 32639 30822 31227 31723 31270 31846 34073 35318 34146 32576 32017 30984 28755 27237 27177
55603 27177 26435 23971 21863 21493 21401 20706 20878 22339 23034 22175 21778 22811 23565 23434 24284 26309 26656 24305
55585 24305 22278 22668 23351 22045 19952 18808 17803 16039 14837 15100 15386 14878 15218 17237 18914 18786
55569 18786 18348 18972 19432 18694 18096 18657 19123 18713 18777 19754 19691 17829 16502 17275 18409 18388 18707 20666 22533
55550 22533 22519 21790 22055 22859 23588 25341 28393 30647 31075 31952 35218 39305 42035 43940 46239 48232
55534 48232 49372 51321 55267 59501 62182 64174 66727 68778 69028 68388 67927 66793 64508 62837 62827 62428
55518 62428 59608 55462 51622 47107 40661 33918 29247 26315 23561 21151 19782 18409 15935 13500
55504 13500 12533 12187 11104 9870 9303 8150 5124 1490 -934 -2710 -5256 -8072 -9908 -11102 -12333
55489 -12333 -12754 -11716 -10747 -11387 -12671 -13026 -12958 -13557 -14101 -13680 -13511 -15007 -17033 -17594 -16887 -16323 -15951 -15163
55471 -15163 -14527 -14644 -14602 -13701 -13170 -14042 -15054 -14875 -14569 -15483 -16572 -16416 -16048 -16991 -18155 -17564 -15696 -14295
55453 -14295 -13300 -11870 -11067 -12437 -14960 -16383 -16673 -17291 -17990 -17294 -15511 -14444 -14432 -14244 -13550 -13202 -13443
55436 -13443 -13894 -14822 -16485 -17853 -17882 -17296 -17340 -17709 -17527 -17253 -17638 -17895 -17005 -15777 -15460 -15395 -14231 -12472
55418 -12472 -11566 -11450 -11189 -11078 -11919 -13060 -13360 -13240 -13742 -14449 -14410 -14093 -14345 -14452 -13386 -11970 -11610 -11864
55400 -11864 -11444 -10594 -10243 -9822 -8270 -6252 -5127 -4628 -3816 -3316 -4210 -5658 -5991 -5383 -5175 -5462 -5613 -6188
55382 -6188 -7863 -9374 -8999 -7343 -6309 -6159 -5999 -6189 -7626 -9343 -9497 -8164 -6826 -5801 -4590 -3966
55366 -3966 -5040 -6925 -7939 -8456 -9989 -12127 -13167 -13251 -14036 -15620 -16580 -16779 -17382 -18226 -17901 -16464 -15557
55349 -15557 -15776 -16245 -16727 -17846 -19270 -19903 -19829 -20025 -20451 -20428 -20364 -20884 -20954 -19341 -17291 -17011 -18062 -18069 -16633
55330 -16633 -15531 -15232 -14388 -12938 -12600 -13763 -14650 -14227 -13439 -13020 -12476 -11816 -12010 -13121 -14035 -14410 -14942 -15463
55312 -15463 -14910 -13405 -12307 -11980 -11507 -10649 -10005 -9272 -7670 -6122 -6531 -8673 -10202 -10042 -9456 -9463 -9639 -9863
55294 -9863 -10833 -12285 -12939 -12746 -13065 -14137 -14615 -14025 -13523 -13650 -13560 -13010 -12933 -13437 -13328 -12236 -11176 -10485 -9294
55275 -9294 -7594 -6716 -7082 -7532 -7527 -7981 -9243 -10226 -10241 -9877 -9490 -8732 -8021 -8466 -9754 -10183 -9389 -8964 -9748
55256 -9748 -10638 -10796 -10877 -11160 -10588 -8745 -6922 -6175 -5971 -5693 -5777 -6492 -7236 -7921 -9439 -11965 -14263 -15420
55238 -15420 -15678 -15072 -13062 -10235 -8525 -8781 -9683 -9807 -9230 -8469 -7518 -6636 -6513 -6896 -6599 -5394 -4346
55221 -4346 -3854 -3160 -2218 -1984 -2323 -1753 -93 848 188 -567 -166 350 -397 -1928 -3113 -4007 -5053 -5846 -5994
55202 -5994 -6006 -6277 -6353 -6154 -6520 -7643 -8386 -8108 -7744 -8078 -8336 -7594 -6278 -5254 -4557 -3955 -3624 -3476 -3033
55183 -3033 -2581 -3118 -4546 -5372 -4938 -4370 -4586 -4999 -5064 -5377 -6186 -6440 -5450 -4101 -3344 -2833 -2060 -1437 -1267
55164 -1267 -1056 -770 -1326 -2892 -4196 -4518 -4850 -6071 -7505 -8444 -9478 -11057 -12207 -12025 -11141 -10464 -9804
55147 -9804 -8936 -8626 -9218 -9472 -8252 -6284 -4959 -4387 -3845 -3172 -2580 -2018 -1665 -2005 -2632 -2226 -593 719
55128 783 759 1891 3615 4934 6099 7452 8036 7056 5537 4905 4914 4503 3744 3362 3227 2780 2235 2025 1843
55109 1843 1413 1368 2157 2953 2898 2485 2525 2682 2358 2153 3101 5118 7354 9328 10726 11026 10415 10187 11046
55090 11046 11951 11726 10855 10516 10836 11341 12173 13528 14773 15347 15751 16529 17153 17105 17100 18037 19577 20906 22002
55071 22002 23042 23591 23562 23917 25215 26471 26714 26511 26618 26405 25218 24183 24853 26857 28562 29358 29676
55054 29676 29458 28317 26724 25530 24726 23959 23665 24319 25188 25190 24432 23649 22803 21541 20329 19806 19644 19295
55036 19295 19100 19393 19430 18614 17859 18186 18823 18406 17293 16917 17467 18034 18501 19501 20831 21632 21902 22333
55018 22333 22900 23080 23112 23573 24074 23779 22845 21937 20849 19099 17370 16703 16701 16169 15184 14817 15181 15480 15716
54999 15716 16519 17435 17276 16279 16132 17589 19617 21178 22402 23640 24700 25435 26036 26525 26821 27286 28172
54982 28172 28727 28025 26564 25811 26185 26676 26494 25941 25586 25678 26429 27887 29544 30900 32332 34460 36966
54965 36966 39115 41168 44156 48375 53159 57980 62737 67202 71281 75671 81254 88025 95505 103810
54951 103810 113232 123267 133199 143171 153315 162314 168271 170784 170767 168472 163204 154947 144843 133971
54937 133971 122851 112124 102491 93939 86064 78958 72763 66805 60447 54469 50183 47540 45538 44136
54923 44136 44115 45258 46419 47385 48971 51198 53146 54800 57352 61244 65469 69323 73515 79099 86518
54908 86518 96016 107635 120370 132498 143111 152250 159426 163432 164002 162264 158985 153559 145325 134822
54894 134822 123227 111499 100518 91072 83125 75849 68819 62511 57419 53427 50199 47435 44672
54881 44672 41724 39299 38275 38300 38075 37020 35636 34257 32608 30778 29459 28943 28857 29034 29650 30383 30456
54864 30456 29738 28803 27845 26524 24977 23866 23297 22801 22493 23054 24414 25601 26137 26439 26603 26039 24676
54847 24676 23406 22824 22514 22017 21561 21480 21733 22257 22998 23470 23202 22700 22953 23905 24533 24567 24862 25814 26705
54828 26705 27062 27394 28043 28454 28339 28489 29602 31052 31645 31124 30308 30068 30634 31638 32590 33468 34831 37109
54810 37109 40064 43262 46594 49803 52205 53748 55749 59489 64654 70339 76966 85687 96353 107749
54796 107749 119530 132173 145078 156611 166166 174390 181067 184623 184257 180985 175993 169437 161425
54783 161425 152722 143916 135172 127225 121106 116397 111310 105177 99360 95052 91715 88631 86422 85826
54769 85826 86139 86092 85511 85145 85586 87086 89754 93317 97358 102154 108430 116068 124165 132682 142729 154745
54753 154745 167699 180691 193959 207498 219969 229894 236873 240814 241100 237461 230658 221431 209709
54740 209709 195688 180730 166319 152999 141002 130900 122733 115453 108202 101385 95746 91195 87324
54727 87324 84176 81677 79090 75900 72527 69554 67000 64947 63932 64071 64663 65261 66117 67040 67073 66117
54711 66117 65609 66524 67843 68143 67643 67462 67745 67835 67544 66980 65791 63895 62457 62834 64824 66959 68239
54694 68239 68637 68289 67286 66136 65588 65959 67083 68611 69975 70526 70251 69879 69832 69653 68962 68302 68428 69326
54676 69326 70545 71981 73767 75896 78375 81215 83952 85879 87075 88494 90742 93612 97005 101171
54662 101171 105698 109538 112584 115965 120097 123846 126468 128946 132284 135807 138512 140983 144450 148743
54648 148743 152686 156018 159571 163943 169087 174858 180960 186731 191796 196378 200228 201964 200470 196273
54634 196273 190588 183690 175269 165779 156319 147563 139669 132743 126609 120698 114914 109939 105947 101954
54620 101954 97341 93049 90191 88392 86714 85342 84995 85428 85856 86285 87100 87976 88503 89275 91021 93243
54604 93243 95062 96771 99096 101512 102820 102931 102462 101099 98160 94497 91898 90499 88621 85465 82255
54589 82255 80249 79038 77542 75464 73075 70519 67969 65823 64195 62638 60683 58298 55815 53819
54575 53819 53001 53534 54676 55449 55495 54864 53452 51425 49758 49362 49864 50038 49263 47867 46393 45384 45513
54558 45513 46974 48926 50356 51220 51966 52407 52097 51398 51042 50867 50196 49281 49141 50034 51224 52370 53992
54541 53992 56378 59031 61388 63316 64799 66004 67736 70964 75656 80703 85076 88516 91174 93258
54527 93258 95029 96483 97103 96433 94670 92206 88975 84977 81015 77992 75822 73878 72076 70525 68553
54512 68553 65372 61539 58484 56636 55200 53825 53186 53613 54287 54302 53678 52911 52204 51478 50656 49743 49026
54495 49026 49133 50343 51909 52708 52465 51846 51563 51969 53202 54934 56234 56507 56421 57043 58283 59119 59224
54478 59224 59370 60195 61448 62573 63287 63495 63241 62822 62450 61955 61237 60652 60373 59865 58752 57719 57668 58400
54460 58400 59014 59145 58867 57962 56444 55278 55226 55392 54380 52666 52258 53933 56293 57746 58054 57573 56301
54443 56301 54263 51984 50116 49128 49330 50483 51529 51608 51223 51489 52447 53187 53379 53495 53638 53455 53130 53172
54425 53172 53212 52348 50746 49543 49116 48869 48847 49948 52144 54043 54783 55080 55769 56626 57276 58074 59291 60402
54407 60402 60977 61461 62466 64011 65847 67796 69433 70399 71380 73750 77774 82101 85557 88513 91924
54392 91924 95958 100170 104297 108274 112044 115723 119347 122197 123209 122318 120602 118859 116953 114780 112766
54377 112766 110948 108623 105478 102181 99312 96597 93774 91352 89828 88829 87646 86090 84368 82735
54363 82735 81593 81301 81515 81394 80691 80002 79736 79681 79818 80609 82105 83613 84634 85341 85928 86352 86985 88466
54345 88466 90595 92421 93822 95841 98966 102256 104876 107414 110844 115044 119202 122888 125969 128072
54331 128072 128903 128608 127381 125317 122956 121100 119599 117229 113337 108760 104551 100692 96714 92717 88976
54316 88976 85371 81899 79110 77196 75348 72714 69478 66354 63581 61078 58998 57495 56389 55533 54955
54301 54955 54280 52706 50007 46927 44185 41874 40174 39663 40307 41025 40970 40487 40224 40148 40046 40151 40488 40454
54283 40454 39813 39374 39914 41058 41969 42441 42661 42595 42315 42266 42512 42397 41572 40613 40006 39380 38458 37838 38060
54264 38060 38727 39368 40289 41719 43062 43894 44776 46032 46665 45714 43844 42312 41185 39957 39251 40240 42625
54247 42625 44715 45531 45615 45739 45903 45833 45586 45453 45743 46577 47558 48040 48117 48730 50119 51030 50289 48459 46902
54228 46902 45909 44957 44185 44198 44708 44726 44024 43218 42480 41372 39996 39188 39398 40242 41202 41971 42158 41531 40553
54209 40553 39841 39216 38114 36848 36452 37272 38605 39810 40859 41640 41646 40716 39475 38757 38923 39769 40697 41031
54191 41031 40669 40235 40146 39846 38641 36974 36010 36117 36635 37106 37783 38849 39952 40746 41196 41208 40629 39817
54173 39817 39580 40233 41183 41656 41448 40826 40082 39381 38730 37957 36914 35730 34757 34318 34601 35573 36844 37886
54155 37886 38570 39181 39788 40069 39965 39903 40010 39777 39018 38503 39009 40309 41813 43582 45868 48129 49436
54138 49436 49609 49130 48258 47009 45701 44686 43805 42920 42601 43405 44759 45546 45592 45574 45653 45317 44601 44331 44888
54119 44888 45613 45766 45304 44490 43428 42262 41247 40362 39384 38459 38110 38532 39334 40136 40954 41956 43209
54102 43209 44694 46252 47505 48189 48417 48310 47645 46324 44908 44083 43799 43496 43009 42655 42652 43077 44198 46089
54084 46089 47932 48459 47250 45134 43298 42368 42228 42228 41656 40429 39198 38437 37769 36716 35766 35982 37728
54067 37728 40425 43349 46039 48073 49154 49462 49406 49167 48908 49123 50178 51723 53121 54195 55020 55446
54051 55446 55534 56085 57862 60511 63060 65189 67180 68892 69830 70123 70545 71541 73056 75159 77987 81097
54035 81097 83797 86149 88895 92425 96537 101103 106095 111037 115411 119597 124519 130291 136111 141533
54021 141533 146880 152274 157168 161110 164181 166439 167732 168302 168835 169633 170306 170455 170053 169027 167189 164715
54005 164715 162096 159415 156264 152474 148384 144380 140777 138058 136491 135455 133880 131480 128882 126576
53991 126576 124471 122504 120833 119292 117432 115275 113323 111690 110029 108382 107316 106956 106686 106061 105324
53976 105324 104731 104108 103396 103027 103331 104023 104583 104807 104804 104791 104929 105080 104812 104057 103547 104024 105140 105814 105539
53957 105539 104716 103861 103192 102913 103133 103519 103638 103564 103619 103821 104270 105625 108267 111330 113658 115388 117475
53940 117475 119975 122167 124154 126829 130147 132942 134698 136077 137365 137896 137513 137203 137593 138058 138028 138060
53924 138060 138864 140276 141892 143741 145666 147052 147953 149609 153038 157838 163063 168480 174252 180183 186038
53909 186038 191973 197928 203255 207628 211738 216443 221748 227116 232114 236245 238919 240231 241129 242214
53895 242214 243064 243211 242940 242430 241007 238149 234552 231294 228529 225836 223262 221039 218672 215275 210620
53880 210620 205124 199131 192867 186853 181612 177096 172913 168843 164723 160278 155602 151435 148357 146084
53866 146084 144071 142293 140789 138932 136063 132549 129375 126806 124234 121269 118253 115559 113014 110213
53852 110213 107074 103953 101396 99764 98916 98295 97465 96462 95514 94654 93677 92299 90283 87744 85384 84121
53836 84121 84272 85363 86694 87777 88332 88356 88205 88081 87485 85820 83521 81808 81234 81263 81373 81729 82481 83344
53818 83344 84210 85368 86681 87383 87198 86845 86924 87109 87082 87425 88820 90980 93134 95119 97345 100087 103387
53801 103387 107188 111076 114392 117121 120160 124187 128780 133218 137565 142305 147385 152316 156864 161073
53787 161073 164969 168718 172649 176602 179774 181730 183063 184492 185841 186564 186754 186898 187031 186852 186382 185808
53771 185808 184909 183265 180922 178285 175537 172562 169275 165714 162049 158779 156581 155610 155239 154679 153521
53756 153521 151643 149324 147650 147882 149815 151505 151327 149755 148466 148249 148536 148563 148187 147652 147159 146682 146000
53739 146000 145072 144336 144145 143937 142672 140226 137561 135378 133509 131829 130653 129873 128891 127961 128325 130283
53723 130283 132336 133163 133234 133450 133443 132575 131568 131532 132112 132178 131809 132030 132896 133500 133802 134973 137679 141236 144700
53704 144700 147880 151056 154486 158312 162342 165940 168675 170958 173525 176633 180330 184998 190752 196738
53690 196738 201924 206353 210788 215422 219807 223763 227418 230584 233038 235271 238026 241180 243909 245889
53676 245889 247585 249490 251726 254181 256400 257653 257881 258229 259793 262200 264198 265325 266062 266718 267147
53661 267147 267326 267260 266557 265006 263283 262170 261393 260258 258990 258245 257580 255847 253117 250856 249988 249938 249849
53644 249849 249651 249507 249163 248333 247101 245664 244207 243099 242688 242893 243536 244826 246829 248714 249424 249025
53628 249025 248553 248658 249257 250279 251758 253247 254160 254742 255805 257528 259422 261408 263876 266721 269368
53613 269368 271889 275038 279050 283357 287602 291934 296234 300174 304264 309755 317078 325324 333624 342093
53599 342093 350938 359530 367028 373393 379348 385755 393225 401832 410938 419730 427997 436048 444013 451816
53585 451816 459583 467379 474696 481044 486865 492981 499293 505055 510289 515786 521710 527381 532553 537638
53571 537638 542404 545750 547274 547951 548655 549037 548451 547106 545543 543737 541402 538687 535971 533336 530611
53556 530611 527592 524045 520037 516347 513924 512775 512014 511114 510282 509447 507825 504997 501706 499078 497540
53541 497540 496839 496579 496373 495939 495368 494991 494875 494867 495078 495811 497072 498735 501062 504323 508045 511500 514937
53524 514937 519441 525505 532543 539836 547130 554371 561826 570476 581230 593642 606388 619061 632394
53511 632394 646728 661587 676968 693620 711563 729670 747385 765744 786050 808496 832645
53500 832645 858223 884815 911795 939280 968317 999540 1032498 1066752 1102577 1139876 1177502
53489 1177502 1214469 1251064 1287905 1324747 1361026 1396914 1432961 1469245 1505627 1542343 1579708
53478 1579708 1617673 1656202 1695577 1735813 1776327 1816567 1856416 1895632 1933559 1969716 2004013
53467 2004013 2036227 2066149 2094411 2122023 2148716 2173005 2194363 2214030 2232988 2250538 2265900
53456 2265900 2279924 2294003 2308223 2321704 2333730 2343327 2348766 2349005 2345053 2338577 2329756 2317796 2302837
53443 2302837 2285730 2266238 2243126 2216116 2186401 2155027 2121871 2086492 2049094 2010337 1970794
53432 1970794 1930768 1890203 1848846 1806856 1765019 1723926 1683437 1643513 1605030 1568950 1535073
53421 1535073 1502492 1470996 1441125 1413102 1386675 1361968 1339650 1320200 1303752 1290660 1281566
53410 1281566 1276708 1275566 1277269 1281160 1287232 1296278 1309232 1325972 1345251 1366200 1389404 1415920
53398 1415920 1445865 1478682 1514165 1552267 1592293 1633430 1675959 1721046 1769300 1820364 1873956
53387 1873956 1930448 1990232 2053128 2118716 2186918 2258105 2332833 2411340 2493153 2577428 2663967
53376 2663967 2753460 2846361 2941942 3038957 3136786 3235348 3334266 3432769 3530198 3626024 3719636
53365 3719636 3810620 3898906 3984049 4064726 4139632 4208607 4272233 4330668 4383719 4431784 4475760
53354 4475760 4515862 4551283 4581150 4605212 4623396 4635161 4639552 4635759 4623517 4602985 4573988 4535257
53342 4535257 4484818 4421498 4345905 4259940 4165919 4066482 3964527 3862335 3760814 3659951
53332 3659951 3559715 3460225 3361586 3264127 3168452 3074760 2982455 2890917 2800275 2710982 2623150
53321 2623150 2536875 2452794 2371659 2293714 2219056 2148283 2082202 2021136 1964956 1913459 1866287
53310 1866287 1822892 1782995 1746614 1713356 1682358 1653509 1627980 1606828 1589669 1575454 1563820
53299 1563820 1554877 1548294 1543565 1540696 1539709 1539989 1541047 1543435 1547828 1553662 1559834 1566519 1575175 1586833
53285 1586833 1601371 1618428 1638089 1660609 1686207 1715162 1747584 1783190 1821744 1863257 1907214
53274 1907214 1952189 1997085 2042204 2088218 2134635 2180379 2225364 2270262 2314960 2358439 2400022
53263 2400022 2439625 2476950 2511577 2543828 2574403 2603190 2629414 2652938 2674352 2693786 2710542
53252 2710542 2723835 2732891 2736541 2733947 2725754 2713352 2696864 2675020 2647118 2613907 2576231 2533994
53240 2533994 2487024 2436027 2382134 2326216 2268973 2211045 2152699 2093946 2035175 1977149 1920359
53229 1920359 1864952 1811203 1759246 1708396 1657620 1606714 1556182 1505962 1455311 1404123 1353404
53218 1353404 1304099 1256194 1209233 1163084 1118092 1075139 1035573 1000213 968290 938096 908732
53207 908732 880551 853993 829008 805614 783981 763668 743690 723656 704062 685273 667042
53196 667042 649231 632248 616479 601932 588498 575853 563170 549772 536127 523309 511484
53185 511484 499813 487816 475698 463362 450319 436864 424153 412726 401958 391293 380953
53174 380953 371133 361545 352244 343824 336370 329181 321976 315341 309518 303763 297501 291199 285510 280437
53160 280437 275861 272027 268901 265874 262634 259602 256981 254209 250909 247631 245143 243568 242602 241831 240604
53145 240604 238522 236395 235692 236652 237955 238603 238904 239135 238711 237599 237212 238662 241125 243154 244770 246985
53129 246985 249887 252531 254441 256179 258501 261638 265051 267440 267613 265916 264095 263117 262006 259583 256316
53114 256316 253356 250610 247201 243249 239765 237005 234133 230397 225636 219859 213423 207567 203640 201656
53100 201656 200362 198680 196383 193589 190490 187557 185155 182928 180253 177211 174366 171728 168776 165521
53086 165521 162714 160830 159528 158246 156762 155086 153349 151895 150992 150409 149725 149041 148870 149322 149876 149958
53070 149958 149313 147828 145535 142904 140756 139683 139665 140171 140484 140106 139151 138147 137277 136147 134664 133660
53054 133660 134028 135515 136944 137546 137505 137294 137122 137081 137294 137732 138188 138483 138503 138089 137161 135927 134788 134051
53036 134051 133857 134133 134479 134398 133903 133553 133618 133606 133031 132261 132048 132486 132927 132801 132042 130879 129712 129073 129206
53017 129206 129695 129914 129830 129983 130706 131725 132560 133024 133295 133678 134305 134951 135216 134986 134551 134195 133894 133541 133227
52998 133227 133140 133405 134109 135187 136213 136689 136690 136868 137696 139145 141226 144246 148252 152739 157247 161746 166088
52981 166088 169695 172313 174624 177499 180939 184220 186755 188338 188878 188426 187359 186107 184804 183379 181748
52966 181748 179741 177260 174649 172460 170615 168417 165697 163330 162173 162023 162098 161953 161449 160471 159294 158664
52950 158664 158870 159148 158670 157641 156809 156377 156135 156142 156517 156916 157029 157249 158102 159261 159889 159777 159448 159380 159757
52931 159757 160689 161989 162932 162883 162019 160944 159948 159145 158809 158858 158556 157500 156507 156537 157161 157045 155721 153897
52913 153897 152325 151356 151374 152436 153536 153363 151974 150730 150493 150895 151517 152622 154280 155705 156061 155351
52897 155351 154113 152809 151835 151591 152065 152748 153176 153332 153452 153863 155002 157083 159591 161575 162579 162941
52881 162941 163176 163524 164085 164912 165906 166969 168182 169464 170210 169913 169069 168878 170006 172145 174686 177243
52865 177243 179532 181407 183115 185075 187347 189679 191972 194228 196282 198079 199952 201991 203466 203720
52851 203720 203408 203869 205280 206319 205759 203624 200723 197888 195775 194613 193916 193122 192505 192731 193541 193803
52835 193803 192969 191567 190096 188332 185956 182932 179093 174338 169518 166078 164365 163207 161582 159716
52821 159716 158052 156239 153993 152047 151259 151347 151366 150980 150485 150003 149428 148852 148351 147600 146276 144624 143089
52804 143089 141698 140312 139148 138520 138290 138065 137687 137105 136054 134395 132512 130939 129814 129014 128469 127849
52788 127849 126398 123762 120757 118685 117955 117855 117492 116489 114955 113358 112355 112209 112342 111907 110730 109319
52772 109319 108073 106969 105978 105212 104534 103483 101794 99673 97484 95437 93656 92257 91203 90305 89454
52757 89454 88717 88181 87897 87959 88363 88740 88523 87534 86187 84975 83964 82949 81879 80863 79884 78899 78148
52740 78148 77963 78165 78002 76957 75335 73760 72400 71143 70271 70306 71108 71809 71893 71815 72289 73442 75071 77134
52722 77134 79453 81369 82458 83388 85326 88458 91701 93996 95402 96791 98835 101470 104075 106081 107529
52707 107529 108958 110596 111874 112025 110957 109183 107144 105060 103210 101796 100615 99346 98053 96906
52693 96906 95615 93761 91628 90014 89130 88301 86861 84831 82681 80937 80018 79842 79535 78170 75920 73832
52677 73832 72397 71093 69559 68370 68164 68654 69176 69723 70759 72200 73208 73045 71787 70152 68774 67706
52661 67706 66611 65408 64514 64229 64165 63744 63084 62807 63003 63054 62606 62099 62025 62230 62299 62230 62339 62747 63293 63751
52641 63751 63992 64064 64199 64563 65017 65381 65806 66445 66925 66744 66207 66364 67790 69946 71908 73216 73848 73889
52623 73889 73571 73243 73071 73062 73404 74352 75688 76850 77689 78526 79328 79492 78717 77497 76423 75540 74695 73993
52605 73993 73506 73031 72547 72495 73219 74509 76009 77661 79362 80611 80972 80642 80236 80195 80686 81788 83471
52588 83471 85536 87679 89487 90443 90351 89767 89527 89841 90394 91247 92878 95196 97397 99156 101100 103672
52572 103672 106287 108237 109705 111183 112471 113052 113107 113369 114185 115256 116132 116507 116298 115894 116033 116997 118257
52555 118257 119329 120513 122248 124112 125231 125475 125575 126112 126993 127957 129068 130517 132216 133699 134348 133877
52539 133877 132694 131546 130665 129593 128073 126732 126441 127221 128218 128620 128308 127708 127234 126892 126320 125360 124561
52522 124561 124790 126257 128201 129549 129600 128222 126043 124435 124487 125713 126484 126122 125784 126824 128974 130820
52506 130820 131533 131437 131274 131627 132752 134381 135822 136679 137273 137998 138655 138861 138779 138889 139302 139715 139871 139697
52488 139697 139248 138790 138628 138613 138297 137803 137964 139212 140918 142383 143847 145878 148246 150158 151371 152366
52472 152366 153596 155052 156424 157306 157487 157289 157271 157383 156933 155660 154188 153030 151901 150489 149096 147893
52456 147893 146363 144264 142287 140875 139217 136532 133607 131776 130899 129744 128030 126682 126139 125800 125262
52441 125262 124852 124686 124273 123357 122294 121345 120397 119556 119243 119501 119884 120176 120516 120769 120537 119928 119596 119855
52423 119855 120329 120562 120347 119470 117872 116100 114948 114563 114555 114866 115722 116814 117446 117549 117682 117972 118025 118007 118718
52404 118718 120232 121502 121809 121718 122043 122680 123138 123477 124043 124755 125353 125972 126899 128035 129091 130092 131320
52387 131320 132999 135263 138128 141247 144070 146431 148648 150796 152366 152957 152945 153141 154100 155970 158575
52372 158575 161370 163697 165393 166840 168303 169649 170920 172556 174654 176559 177705 178465 179593 181119
52358 181119 182434 183331 184362 186133 188632 191346 193743 195647 197354 199414 202104 205121 207893 210137
52344 210137 211973 213601 215107 216642 218538 221024 223805 226118 227431 228079 229002 230791 233214 235686 237889
52329 237889 239743 241152 242127 242956 243894 244876 245870 247304 249684 252923 256438 259878 263420 267401 271965
52314 271965 276932 281755 285829 289175 292621 296927 302050 307605 313623 320189 326736 332581 338054 344259
52300 344259 351675 359757 368015 376716 386315 396836 408043 419681 431390 442940 454681 467165
52288 467165 480185 492815 504657 516423 529001 542481 556424 570570 584857 599109 613067
52277 613067 626547 639393 651492 662952 673960 684486 694467 704164 713783 722777 730235 736109 741334
52264 741334 746508 751138 754638 757389 760211 763140 765299 765910 765170 764184 764116 765124 766149 766046 764869 763585
52248 763585 762657 761690 760625 760320 761471 763675 766182 769053 772937 778093 784321 791581 800043 809596 819815
52233 819815 830345 840985 851501 861793 872177 883112 894607 906154 917286 927992 938574
52222 938574 949161 959370 968424 975790 981750 987215 992809 998276 1002791 1005741 1007188 1007734 1007953 1007841
52208 1007841 1006873 1004714 1001675 998247 994462 990162 985717 981853 978719 975689 972200 968367 964604 961072
52194 961072 957654 954152 950374 946298 942190 938322 934690 931334 928770 927550 927457 927666 927633 927243 926258 924365
52178 924365 921853 919463 917397 915198 912725 910468 908650 906804 904608 902393 900392 898200 895506 892730
52164 892730 890421 888548 886870 885454 884254 882644 879984 876364 872351 868359 864665 861591 859112 856623
52150 856623 853617 850346 847388 844866 842569 840475 838568 836393 833419 829762 826047 822551 818967 815059
52136 815059 811149 807746 804842 801751 797700 792645 787339 782506 778123 773791 769528 765701 762313 758981
52122 758981 755566 752205 748733 744822 740805 737481 734837 731777 727551 722768 718535 715305 713091 712103
52108 712103 712419 713455 714421 715144 716037 717589 720206 724070 728811 733854 739469 746787 756234 766588 776370
52093 776370 785688 795992 808408 823010 839350 856837 874726 892418 909841 927137 944196 960873
52081 960873 977333 993696 1009683 1025025 1039836 1054056 1067035 1078366 1088657 1098652 1107904 1115216
52069 1115216 1120240 1123736 1126345 1127954 1128355 1127796 1126685 1125258 1123583 1121377 1117915 1112797 1106866 1101663
52055 1101663 1097775 1094237 1089796 1084254 1078352 1072806 1067793 1063177 1058967 1055594 1053680 1053425 1054292 1055533
52041 1055533 1056905 1058598 1060655 1062876 1065254 1068100 1071642 1075780 1080202 1084523 1088359 1091651 1094875 1098622
52027 1098622 1102873 1106920 1110043 1112057 1113219 1113834 1114076 1114075 1114054 1114216 1114356 1113711 1111568 1108122 1104312 1100648
52011 1100648 1096565 1091253 1084798 1078066 1071631 1065199 1058025 1049572 1039776 1028792 1016549 1002651 986984
51998 986984 970240 953436 936830 919825 902056 883968 866063 848148 829730 810738 791417
51987 791417 771879 752110 732136 711936 691580 671626 652758 634767 616493 597313 578006
51976 578006 559597 541971 524358 506726 489848 474333 460286 447674 436300 425621 415296
51965 415296 405796 397818 391208 385057 378701 372107 365467 359034 353261 348439 344257 340159 336055 332249
51951 332249 328893 325977 323636 321885 320217 318073 315587 313370 311740 310645 310040 309653 308545 305760 301558
51936 301558 297403 294601 293250 292529 291536 289869 287736 285562 283330 280542 277087 273726 271292 269695 268284
51921 268284 266850 265682 264869 264226 263778 263699 263785 263545 262783 261759 260802 260099 259669 259274 258560 257488 256278 254777
51903 254777 252526 249793 247732 246937 246601 245839 245055 244998 245249 244797 243696 242885 242672 242568 242412 242427 242317 241537
51885 241537 240469 240147 240789 241671 242464 243566 244992 246120 246692 246992 246848 245710 243950 242899 243063 243482
51869 243482 243383 243414 244516 246458 248271 249493 250250 250693 250997 251560 252624 253959 255279 256663 258312 260224
51853 260224 262232 263964 264788 264395 263495 263261 263915 264591 264726 264772 265257 265952 266456 266879 267358 267444 266484 264366
51835 264366 261526 258582 256165 254685 254045 253924 254288 255186 256159 256727 257458 259544 262904 265661 266070 264286
51819 264286 261720 259376 257477 256140 255528 255497 255577 255286 254299 252622 250725 249128 247777 246296 244848 244006
51803 244006 243673 242924 241334 239666 238777 238493 238039 237006 235416 233447 231600 230581 230484 230509 229968 229098 228464
51786 228464 228104 227760 227418 227052 226336 225185 224135 223604 223140 222030 220283 218432 216695 214997 213592 212965
51770 212965 213200 213965 215083 216629 218487 220223 221448 222116 222448 222774 223351 224210 225295 226683 228412 230078
51754 230078 231033 231056 230346 228787 225862 221653 217347 214245 212566 211611 210708 209648 208525 207623 207229 207194 206842
51737 206842 205631 203766 201882 200403 199442 199129 199685 201162 203238 205230 206407 206555 206186 205968 206017 206020 205819
51720 205819 205339 204191 202086 199597 197752 196731 195729 194265 192843 192008 191474 190633 189359 187954 186744
51705 186744 185990 185704 185423 184702 183932 183941 184697 185254 185228 185345 186072 186693 186438 185756 185715 186701 188389 190508 192985
51686 192985 195703 198693 202224 206412 211122 216563 223310 231378 239835 247652 254323 259365 262172 262902
51672 262902 262685 262314 261497 259949 258308 257126 255767 253274 249755 246038 242572 239493 237101 235302 233141
51657 233141 229940 226446 223812 221874 219534 216534 213706 211600 209935 208354 206782 204957 202511 199605
51643 199605 196841 194485 192372 190482 188979 187780 186703 185908 185628 185619 185493 185365 185554 185827 185602 184741 183545
51626 183545 182163 180688 179610 179458 180059 180741 181134 181297 181321 181383 181841 182682 183258 183210 183210 184017 185325 186497 187891
51607 187891 190228 193007 194975 196149 197899 200768 203615 205472 207041 209510 212833 216073 218908 221894
51593 221894 225533 229759 234238 238727 243136 247520 252006 256623 261342 266283 271629 277245 282607 287193
51579 287193 290820 293573 295563 296734 296817 295596 293297 290591 288118 286201 285005 284501 284185 283478 282735 283263
51563 283263 285776 289390 292739 295552 298452 301680 304928 308156 311685 315541 319409 323134 326644 329528
51549 329528 331336 332226 332680 332750 332190 331188 330270 329620 329066 328629 328425 328234 327787 327227 326590 325144 322182 318280
51531 318280 314785 311957 308590 303671 297695 292119 288124 285919 284617 282692 279254 274984 271292 268588
51517 268588 265975 262537 258157 253149 247998 243540 240549 238730 236872 234254 231350 228876 226767 224450
51503 224450 221690 218847 216593 215466 215360 215413 214761 213417 212060 211063 210200 209227 208249 207507 207155 207133 206969
51486 206969 206038 204476 203364 203423 204052 204440 205049 206903 209788 212478 214708 217616 222039 227499 233114 238477
51470 238477 243355 247583 251625 256356 261929 267571 272757 277722 282635 287223 291504 295930 300399 304058
51456 304058 306571 308680 311009 313080 314113 314026 313082 311215 308339 304793 300957 296838 292414 287834 282947
51441 282947 277235 270702 264220 258532 253416 248295 243242 238889 235700 233703 232564 231626 230219 228167
51427 228167 225742 223119 220473 218566 218397 220004 222328 224604 227160 230467 234147 237417 239969 241905
51413 241905 243284 244164 244693 244812 244223 242834 240770 237873 233920 229460 225574 222396 218648 213164 206256
51398 206256 199174 192873 187713 183643 180122 176377 172245 168309 164906 161669 158356 155340 152798 150226
51384 150226 147405 145134 144240 144365 144386 143595 141959 139767 137625 136290 135871 135633 135105 134812 135322 136162 136411
51367 136411 135889 135024 133925 132375 130481 128625 126971 125553 124581 124130 123802 123264 122823 122953 123458 123673 123341
51350 123341 122880 122994 124300 126987 130450 133555 135677 137217 138905 141016 143489 146250 149013 151340 153336
51335 153336 155757 158949 162252 164966 167384 170294 173942 178020 182152 185857 188524 190001 190699 190662 189241
51320 189241 186287 182840 179795 176616 172391 167532 163264 159792 156202 152010 147720 143830 140301 137096
51306 137096 134398 132159 130101 128233 126771 125640 124686 124207 124530 125152 125098 124157 122971 121915 120675 119079
51290 119079 117516 116276 115124 113871 112803 112215 112027 112139 112764 114023 115520 116675 117354 117854 118357 118663
51274 118663 118623 118609 119298 120819 122401 123153 123028 122583 121985 120944 119576 118503 117826 116772 114848 112596 110678
51257 110678 108861 106668 104426 102878 102066 101386 100558 99838 99379 98995 98530 98046 97698 97693 98131 98743 99124 99412
51239 99412 100172 101337 102024 101871 101741 102457 103553 104133 104264 104603 105182 105569 105793 106110 106245 105923 105798 106732
51221 106732 108349 109374 109334 108941 108862 109155 109850 111049 112412 113471 114500 116076 117847 118811 118984 119606 121392
51204 121392 123617 125358 126669 127964 129055 129529 129584 129879 130803 132182 133437 133863 133188 131967 131101 130931
51188 130931 131233 131977 133365 135105 136420 137040 137521 138292 138987 139056 138503 137702 136891 136166 135546 134810 133573 131745
51170 131745 129644 127577 125643 123910 122408 120951 119432 118207 117745 117889 118077 118176 118463 118758 118418 117340
51154 117340 116293 115942 116204 116831 117980 119795 121958 124037 125846 127168 127574 126898 125509 123879 122271
51139 122271 121052 120737 121307 121921 121748 120768 119441 117968 116363 114921 113978 113299 112154 110122 107613 105518
51123 105518 104438 104216 104130 103568 102568 101626 101064 100697 100122 99136 97882 96810 96477 97159 98544 99945 100865
51106 100865 101294 101539 101881 102344 102751 103031 103424 104194 105237 106321 107677 109770 112365 114488 115660 116507
51090 116507 117701 118952 119662 119992 120492 121160 121706 122346 123470 124833 125945 126999 128531 130372 131883 133029
51074 133029 134280 135625 136749 138078 140397 143340 145483 146321 147033 148774 151191 153230 154626 155918 157546
51059 157546 159526 161619 163352 164208 164108 163439 162504 161426 160597 160554 161144 161423 160692 159163 157385 155615 153985
51042 153985 152716 151789 150894 150022 149653 150070 150842 151329 151344 151203 151383 152160 153236 153773 153268 152253 151628 151527
51024 151527 151574 151930 153037 154372 154660 153621 152380 151794 151478 150987 150843 151563 152630 153354 154122 155778 158262
51007 158262 160742 162802 164693 166557 168135 169263 170216 171515 173628 176702 180447 184460 188694 193236
50993 193236 197691 201417 204547 208054 212527 217561 222728 228430 235293 243281 251994 261279 271011 280723
50979 280723 290112 299629 310064 321765 334682 348901 364787 382865 403777 427959 455065 484142
50967 484142 514726 547399 583019 621857 663750 708465 755479 803911 853165 903252 954116
50956 954116 1005055 1055139 1103731 1150177 1193465 1232624 1267153 1296831 1321573 1341826 1358524
50945 1358524 1372363 1383557 1392494 1399932 1406284 1411474 1415933 1420832 1426764 1432975 1438493 1443203 1447047
50932 1447047 1449016 1447861 1443140 1434586 1421093 1401477 1375893 1345415 1310505 1270898 1226881 1179528
50920 1179528 1129643 1077432 1023428 968972 915456 863627 813828 766480 722127 681239 644020
50909 644020 610261 579528 551597 526528 504246 484499 467355 453060 441132 430379 420340
50898 420340 411966 406144 402206 398726 395192 391992 389302 387039 385547 385195 385515 385738 386088 387462 389850
50883 389850 392175 393876 395642 398266 401609 405108 408667 412653 417435 423151 429608 436330 443153 450768
50869 450768 460114 471142 482738 494112 505800 519040 534470 551729 570174 589853 611768 637083
50857 637083 666123 698478 734217 774454 820310 871818 928505 990669 1059378 1135324 1218362
50846 1218362 1308044 1403886 1505145 1610959 1720759 1834056 1949771 2066133 2181035 2291960
50836 2291960 2395813 2489703 2572041 2642411 2700527 2746139 2779982 2803960 2819996 2829277 2833020
50825 2833020 2833435 2833453 2835605 2841406 2851502 2866077 2885045 2907840 2932914 2957417 2977583 2989639 2990607
50812 2990607 2978640 2952856 2912809 2858157 2789078 2706921 2613851 2511646 2401464 2285057 2165463
50801 2165463 2045885 1928471 1814839 1707223 1608144 1519196 1440957 1373841 1318171 1273537
50791 1273537 1239003 1214100 1199049 1193993 1198622 1212472 1234980 1265225 1302105 1344668 1391647 1440837
50779 1440837 1489602 1536007 1578941 1617297 1649761 1675413 1693909 1705098 1709048 1706421 1698162 1684805
50767 1684805 1666592 1644079 1617872 1587836 1553251 1513801 1469849 1421940 1370860 1318109 1265425
50756 1265425 1213793 1163640 1115964 1072236 1033056 997889 966465 939554 917991 901734 890355
50745 890355 883747 881776 883833 889296 898127 910661 927226 948261 974348 1005738 1042224 1083760
50733 1083760 1130859 1184087 1243482 1308710 1379428 1455160 1535026 1617733 1701639 1784788 1865224
50722 1865224 1941406 2012068 2075791 2131103 2176919 2212468 2236931 2249815 2251722 2244165 2228563 2205972
50710 2205972 2177921 2146894 2115703 2086768 2061963 2042548 2028981 2021104 2018510 2020318 2024806 2029916
50698 2029916 2034166 2036453 2035009 2027324 2011169 1985146 1948504 1901514 1846192 1785600 1722025 1656630
50686 1656630 1590998 1527808 1469345 1416317 1368865 1327985 1295102 1270862 1255162 1248023 1249809 1260877
50674 1260877 1281634 1312733 1354788 1408134 1473174 1550496 1640178 1741269 1852262 1971616 2097372
50663 2097372 2226576 2355516 2480314 2597237 2703099 2795900 2874826 2939451 2989507 3025634
50653 3025634 3049558 3062830 3065835 3058504 3041427 3015634 2981776 2940237 2891722 2837196 2777635 2714503
50641 2714503 2650103 2586761 2525935 2468783 2417174 2373225 2337849 2310608 2290999 2279064 2274488
50630 2274488 2275847 2281219 2289165 2298728 2308795 2317953 2325017 2329448 2331085 2329701 2325142 2318032 2309992 2302777
50616 2302777 2297314 2293917 2293223 2296273 2303650 2315149 2330396 2349056 2370126 2391697 2411956 2429925
50604 2429925 2444890 2455821 2462037 2463906 2461902 2455155 2441662 2419858 2389204 2349279 2299230 2238697
50592 2238697 2168839 2092016 2010578 1926200 1840149 1753823 1668868 1586945 1509448 1437277 1370653
50581 1370653 1309128 1252082 1199406 1151557 1108826 1070923 1037533 1008879 985218 966096 950692
50570 950692 938755 930505 925734 923871 924979 929804 938604 950718 965630 983654 1005187 1030049 1058186
50557 1058186 1090444 1127991 1171333 1220414 1275237 1335937 1402544 1475158 1553977 1638802 1728780
50546 1728780 1822848 1919868 2018040 2114836 2208010 2296123 2377639 2450400 2513000 2566262 2612486
50535 2612486 2653477 2690027 2722948 2753532 2782856 2811346 2839137 2866352 2892947 2918795 2944119
50524 2944119 2969749 2997183 3028565 3066089 3110778 3161933 3218151 3278553 3342597 3409064 3475885
50513 3475885 3540719 3601048 3654035 3697076 3728521 3747278 3751873 3740635 3712841 3669087 3610598
50502 3610598 3538801 3455609 3363494 3265229 3164061 3064043 2969339 2882915 2806421 2741430 2690026
50491 2690026 2653731 2632397 2624643 2628988 2644162 2668555 2699882 2735276 2771353 2804216 2829771 2844226
50479 2844226 2844379 2827571 2791737 2735823 2660361 2567711 2461666 2346647 2226938 2106109 1986645
50468 1986645 1870103 1757853 1651621 1553016 1462559 1379667 1303680 1234548 1172456 1117326 1068864
50457 1068864 1026659 990083 958619 932397 911761 896038 883563 873411 866294 863038 862927 864512
50445 864512 867526 872860 880928 891189 903278 917534 934153 952676 972654 994114 1017087 1041240
50433 1041240 1066376 1092867 1121308 1151975 1184739 1219179 1254724 1291068 1328560 1367749 1408369
50422 1408369 1449088 1488516 1526309 1563248 1600375 1638128 1676060 1713352 1749632 1785254 1820784
50411 1820784 1856620 1893329 1931850 1972720 2015276 2058233 2101021 2144020 2187423 2230432 2271697
50400 2271697 2310154 2345229 2376485 2403197 2424124 2437776 2443116 2439880 2428032 2407115 2376506 2336107
50388 2336107 2286342 2227650 2160492 2085821 2005203 1920611 1834485 1749675 1668626 1592619 1522275
50377 1522275 1458659 1403261 1357012 1320115 1292871 1275767 1268451 1269342 1276719 1289674 1307457 1328307
50365 1328307 1349458 1368134 1382184 1389915 1389768 1380404 1361228 1332967 1297656 1257692 1214706 1169413
50353 1169413 1122419 1074825 1027958 982818 939954 899697 862347 828154 797088 768651 742212
50342 742212 717731 695891 677251 661460 647629 635191 624065 614309 606232 600548 597731 597317 598463
50329 598463 601009 605248 610779 616619 622677 630220 640404 653020 667124 682159 697904 713878 729667
50316 729667 745642 762786 781744 802404 824224 846689 869615 893368 918614 945422 972596
50305 972596 998253 1021155 1041451 1060174 1078218 1095781 1112507 1127914 1141535 1152721 1160663 1164861
50293 1164861 1165590 1163709 1160069 1155229 1149535 1143017 1135182 1125221 1112593 1097328 1079896 1060986 1041244
50280 1041244 1020760 998847 974757 948754 922119 896025 870753 846113 822168 799199 777259
50269 777259 756135 735733 716292 698201 681677 666573 652556 639619 628375 619571 613265 608647
50257 608647 604785 601425 599087 598464 599766 602496 605838 609253 612621 615856 618772 621493 624635 628683
50243 628683 633369 637983 642104 645683 648661 650960 652646 653631 653409 651654 649001 646606 644867 643125 640733
50228 640733 637817 634753 631397 627220 622011 616151 610229 604491 598674 592516 586460 581520 578266 576282
50214 576282 575029 574753 575891 577973 580013 581952 584773 588947 593581 597442 600234 602482 604658 606889
50200 606889 609188 611561 613965 616331 618484 620027 620593 620180 618943 616737 613284 608781 603864 598870 593587
50185 593587 587795 581580 575012 567954 560410 552624 544684 536402 527714 518904 510263 501888 493897 486583
50171 486583 480241 475027 470936 467709 464969 462709 461362 460962 460692 459868 458953 458691 458587 457316 454607 451555
50155 451555 448920 446240 442974 439526 436558 434144 432079 430351 428857 427324 425870 424919 424228 422850 420483
50140 420483 418070 416509 415628 414984 414811 415422 416412 417317 418457 420205 422004 423029 423513 424496 426493 429211
50124 429211 432374 436055 440204 444518 448740 452655 455950 458542 460912 463675 466939 470443 474048 477700
50110 477700 481220 484515 487719 490723 492971 494173 494932 496149 498120 500615 503438 506454 509445 512571
50096 512571 516617 522255 529291 537122 545592 554873 564900 575519 586854 598996 611769 625382 640749
50083 640749 658375 677368 696446 715558 735593 756879 779177 803063 830059 861127 895910
50072 895910 933758 974730 1019336 1068193 1122308 1183121 1251837 1329098 1415464 1511650 1618009
50061 1618009 1734143 1859061 1991088 2127316 2263552 2395053 2517132 2625405 2716530 2789438
50051 2789438 2845696 2888506 2921621 2949033 2974604 3001013 3028869 3056794 3081932 3100227 3106845
50040 3106845 3097147 3067554 3015746 2940806 2843906 2728745 2600782 2465649 2328050 2191712
50030 2191712 2059753 1934772 1818548 1711779 1614263 1525513 1445278 1373452 1309565 1252586
50020 1252586 1201363 1155306 1114616 1079754 1050555 1025889 1004413 985558 969471 956013 944320
50009 944320 933641 924113 916227 909903 904617 900241 897082 895095 893627 892100 890533 889236 888313 887656
49995 887656 887135 886545 885460 883357 879962 875534 870730 865975 860968 855137 848708 842880 838638 835727 833259
49980 833259 831016 829639 829647 830904 833123 836361 840824 846494 853159 860735 869525 880238 893604 909729
49966 909729 927845 946959 966681 987361 1009602 1033948 1060901 1090886 1124206 1161166 1202215
49955 1202215 1247835 1298524 1355112 1418936 1491564 1574544 1669576 1778503 1902770 2043030 2199429
49944 2199429 2371689 2558327 2755974 2959806 3164367 3363732 3551648 3722774 3874262
49935 3874262 4006122 4120547 4221333 4313290 4400815 4486304 4569832 4649714 4722608 4783275 4825330
49924 4825330 4842801 4831015 4786768 4708953 4599435 4462684 4304218 4129509 3943843 3751918
49914 3751918 3557057 3361390 3167025 2976468 2791714 2613769 2443513 2282483 2132284
49905 2132284 1993544 1865877 1748530 1640863 1542487 1453273 1373024 1301057 1236442 1178673
49895 1178673 1127640 1082795 1042863 1006622 973520 943273 915321 889026 864063 840242 817226
49884 817226 794728 772754 751399 730583 710189 690309 671228 653356 637191 623031 610686
49873 610686 599731 590053 581823 574945 568986 563633 558778 554149 549443 544917 541204 538391 535929 533700
49859 533700 532452 532764 534251 536279 538901 542448 546697 551095 555478 559966 564482 569013 574113 580385
49845 580385 587570 594761 601556 608505 616442 625951 637486 651427 667796 686336 707142 730994 758885
49832 758885 791465 829100 872320 922073 979618 1046227 1122917 1210452 1309612 1421201 1545417
49821 1545417 1680965 1824828 1972799 2120114 2261658 2392117 2506613 2601748 2676475 2732292
49811 2732292 2772698 2802346 2826188 2848672 2872854 2899645 2927527 2952794 2970089 2973211 2956243
49800 2956243 2914701 2846196 2750598 2630164 2489650 2335776 2175795 2015913 1860508 1712362
49790 1712362 1573339 1444881 1328004 1223010 1129445 1046514 973489 909629 853879 804989
49780 804989 761980 724279 691345 662409 636659 613532 592730 574097 557550 542998 530266
49769 530266 519131 509361 500624 492486 484742 477709 471879 467238 463175 459150 455264 452066 449921 448604
49755 448604 447428 445803 443770 441963 440931 440637 440782 441367 442568 444175 445589 446384 446564 446262 445604 444934
49739 444934 444785 445446 446733 448294 449927 451586 453346 455403 457821 460198 461860 462516 462500 462360 462394 462625
49723 462625 462921 463045 462792 462203 461489 460773 460072 459477 459097 458907 458887 459210 459933 460657 460930 460957 461409 462502 463748
49704 463748 464705 465483 466296 467092 467909 469198 471352 474144 476983 479614 482336 485573 489318 492945 495696
49689 495696 497581 499651 502992 507389 511415 513911 515007 515569 516130 516634 516909 517031 517286 517872 518537 518627 517807
49672 517807 516723 516531 517682 519489 520960 521673 521822 521813 521996 522440 522848 523015 523364 524595 526744 529050 530874
49655 530874 532237 533368 534281 535062 536014 537221 538352 539205 539996 540915 541830 542666 543617 544670 545411 545667 545862
49638 545862 546345 546795 546793 546610 546924 547997 549562 551340 553255 555272 557367 559581 561903 564243 566593 569026
49622 569026 571435 573663 575961 578870 582505 586425 590381 594586 598996 603003 606354 609765 614027 619003
49608 619003 624193 629865 636803 645139 654209 663528 673282 683745 694881 706656 719340 733211 748172
49595 748172 763806 779770 796143 813418 832030 851944 872900 895009 918619 943533 968968
49584 968968 994617 1021210 1049597 1079800 1111510 1145068 1181153 1219659 1259569 1300000 1340992
49573 1340992 1383278 1427602 1474190 1522531 1571639 1620820 1670082 1719717 1769649 1819404 1868402
49562 1868402 1916029 1961708 2005202 2046555 2085406 2120681 2151366 2177320 2198991 2216605 2229977
49551 2229977 2238803 2242663 2241036 2233926 2222397 2208041 2191934 2174392 2155591 2136011 2116250 2096643
49539 2096643 2077121 2057486 2038119 2020402 2005904 1994976 1986688 1980327 1976313 1975344 1977513 1982901 1992165
49526 1992165 2005541 2021876 2039735 2059131 2081104 2105818 2132265 2159882 2189320 2221242 2255209
49515 2255209 2290085 2324875 2358799 2391074 2421036 2448132 2471609 2490505 2504037 2511708 2513032 2507560
49503 2507560 2495230 2476336 2451152 2419906 2383103 2341446 2295416 2245325 2191765 2135640 2077687
49492 2077687 2018325 1958042 1897662 1838171 1780407 1724739 1670891 1618281 1566825 1517150 1469822
49481 1469822 1424741 1381599 1340363 1300894 1262647 1225463 1190152 1157527 1127284 1098624 1071529
49470 1071529 1046459 1023128 1000722 979171 959019 940092 921491 903121 886031 870866 857037
49459 857037 843855 831491 820283 809992 800341 791610 784078 777528 771798 767183 763703 760499 756606
49446 756606 751929 747040 742432 738376 735039 732203 729250 725896 722642 720191 718796 718524 719579 721875
49432 721875 724685 727303 729745 732470 735854 740352 746668 754986 764362 773645 782940 793569 806501 821151
49418 821151 835623 847779 856228 860890 862812 863324 863422 863973 866007 870282 876678 884472 893163 902707 913036
49403 913036 923790 934634 945584 956995 969295 982647 996608 1010277 1023059 1035215 1047412
49392 1047412 1059843 1072112 1083879 1095177 1106016 1116087 1125222 1133973 1143360 1153932 1165189 1176097
49380 1176097 1186227 1196300 1207532 1220462 1234541 1248811 1262826 1276851 1291436 1307053 1324082
49369 1324082 1342814 1363240 1384946 1407500 1431049 1456255 1483433 1511954 1540932 1570454 1601679
49358 1601679 1635598 1672154 1710755 1751129 1793271 1837012 1882263 1929455 1979115 2031127 2084880
49347 2084880 2140112 2197135 2256317 2317885 2382207 2449677 2520132 2592863 2667357 2743705 2822141
49336 2822141 2902552 2984503 3067440 3150691 3233593 3315728 3396806 3476323 3553540 3627778 3698436
49325 3698436 3764724 3825728 3880758 3929390 3971273 4006159 4034004 4054703 4067898 4073523 4072445 4066065
49313 4066065 4055318 4040540 4022070 4000440 3976100 3949740 3922900 3897449 3874147 3852365 3831440
49302 3831440 3811805 3794571 3780565 3770051 3762918 3758829 3757561 3759360 3764622 3773251 3784824 3799348
49290 3799348 3817179 3838089 3861158 3885771 3912004 3939767 3968365 3997273 4026601 4056212 4085064
49279 4085064 4112042 4136941 4160017 4180926 4198673 4212246 4220771 4223267 4218875 4207375 4189164 4164782
49267 4164782 4134468 4097918 4054474 4003986 3947601 3887229 3824144 3758633 3691060 3622425 3553637
49256 3553637 3485066 3417243 3351174 3287348 3225224 3164396 3105625 3049877 2996923 2945842 2896570
49245 2896570 2850019 2806811 2766654 2728871 2692949 2658631 2626050 2595642 2567500 2540957 2515275
49234 2515275 2490430 2466711 2443870 2421382 2399349 2378409 2358777 2339914 2321208 2302541 2284231
49223 2284231 2266783 2250586 2235553 2221232 2207563 2195207 2184738 2175869 2167930 2160665 2153960 2147251
49211 2147251 2140019 2132669 2126113 2120514 2115142 2109323 2102825 2095376 2086683 2077088 2067634 2059213 2051975 2045509
49197 2045509 2039145 2032246 2024781 2017581 2011483 2006312 2001317 1996526 1992885 1991014 1990513 1990653 1991108 1991829 1992882
49182 1992882 1994633 1997554 2001529 2005798 2009809 2013702 2017856 2022414 2027450 2033095 2039289 2045841 2052918 2061014
49168 2061014 2070204 2079872 2089470 2099129 2109320 2120316 2132246 2145280 2159413 2174446 2190425 2207790
49156 2207790 2226815 2247304 2269138 2292735 2318561 2346501 2376108 2407299 2440335 2475273 2511815
49145 2511815 2549629 2588514 2628288 2668837 2710251 2752613 2795625 2838625 2881010 2922582 2963538
49134 2963538 3004248 3044916 3085363 3125131 3163890 3201577 3238039 3272792 3305386 3335894 3364739
49123 3364739 3392035 3417372 3440320 3460894 3479368 3495831 3510111 3522134 3532237 3541119 3549476 3557538
49111 3557538 3564891 3570905 3575488 3579368 3583491 3588289 3593754 3599985 3607206 3615233 3623494 3631849 3640951 3651451
49097 3651451 3663267 3676049 3689899 3705004 3720922 3737054 3753653 3771502 3790540 3809650 3828058
49086 3828058 3846144 3864522 3883130 3901736 3920676 3940420 3960756 3980935 4000326 4018544 4035339
49075 4035339 4050751 4065053 4078114 4089333 4098624 4106913 4114983 4122275 4127632 4130913 4133027 4134514 4135035
49062 4135035 4134303 4132696 4130636 4127892 4123793 4117785 4109679 4099678 4088289 4075930 4062595 4048142 4032801
49049 4032801 4017008 4000776 3983617 3965115 3945278 3924409 3902974 3881548 3860552 3840073 3820162
49038 3820162 3801156 3783261 3766091 3749163 3732814 3718122 3705835 3695858 3687811 3681617 3677378 3675047
49026 3675047 3674407 3675173 3677095 3680200 3684983 3692101 3701779 3713577 3726605 3739920 3753052 3766368 3780661
49013 3780661 3796099 3811962 3827686 3843655 3860407 3877571 3894363 3910734 3927141 3943337 3958382
49002 3958382 3971866 3984219 3995649 4005629 4013751 4020270 4025386 4028610 4029346 4027738 4024619 4020936 4017377
48989 4017377 4014116 4010639 4006220 4000789 3995054 3989610 3984316 3978653 3972290 3965056 3956718 3947020 3935704 3922479
48975 3922479 3907243 3890427 3872727 3854468 3835552 3815955 3795791 3774833 3752607 3729132 3705057
48964 3705057 3680830 3656201 3630752 3604460 3577499 3549916 3521847 3493777 3466437 3440647 3417207
48953 3417207 3396382 3377430 3359231 3341689 3325934 3312853 3301954 3292143 3283178 3275865 3271097 3269230
48941 3269230 3270262 3274064 3280302 3288364 3297552 3307504 3318439 3330837 3344768 3359861 3376242 3395100
48929 3395100 3417644 3443650 3471745 3501164 3532465 3566439 3603052 3641764 3682241 3724387 3768184
48918 3768184 3813769 3861213 3910060 3959672 4010239 4062796 4117944 4175180 4233805 4293865 4355775
48907 4355775 4419649 4485529 4553701 4624313 4697105 4771933 4849073 4928626 5010213 5093671 5179394
48896 5179394 5267536 5357628 5449537 5543953 5641065 5739543 5837954 5936628 6036821 6138333 6239309
48885 6239309 6338399 6435868 6532220 6626836 6718441 6806106 6889273 6967495 7040675 7109059 7172482
48874 7172482 7229933 7280275 7323092 7358491 7386414 7406551 7418673 7422661 7418357 7405735 7385108 7356827
48862 7356827 7320859 7277051 7225936 7168896 7107222 7041155 6970115 6893849 6813022 6728606 6641113
48851 6641113 6550788 6458208 6364134 6268823 6172124 6074497 5977342 5881955 5788516 5696517 5605817
48840 5605817 5516796 5429713 5344597 5261840 5182379 5106977 5035606 4967743 4903226 4842602 4786646
48829 4786646 4735537 4688585 4644793 4603695 4565661 4531524 4501958 4477049 4456170 4438467 4423774
48818 4423774 4413047 4407501 4407357 4411791 4419964 4431590 4446469 4464225 4484770 4508446 4535273 4564541
48806 4564541 4595553 4628365 4663358 4700527 4739727 4781248 4825527 4872406 4921189 4971373 5022950
48795 5022950 5076073 5130797 5187055 5244666 5303501 5363806 5425927 5489449 5553126 5616315 5680135
48784 5680135 5746462 5815862 5887142 5958788 6030154 6101173 6171756 6241842 6311544 6380805 6449116
48773 6449116 6515862 6580768 6643782 6704636 6762659 6816954 6866721 6911503 6951154 6985537 7014265
48762 7014265 7036761 7052475 7061013 7062265 7056601 7044744 7027252 7004262 6975901 6942659 6904981 6862653
48750 6862653 6814924 6761249 6701674 6636579 6566283 6490869 6410239 6324455 6234190 6140647 6044883
48739 6044883 5947445 5848846 5750125 5652628 5557538 5465883 5378627 5296189 5218100 5143627 5072628
48728 5072628 5005362 4941710 4881260 4824118 4770985 4722322 4678036 4638044 4602535 4571298 4543317
48717 4543317 4517459 4493426 4471821 4453487 4438901 4427996 4420349 4415681 4414260 4416608 4422791 4432239
48705 4432239 4444325 4458810 4475590 4494345 4514764 4536975 4561433 4588508 4618335 4651013 4686672
48694 4686672 4725290 4766662 4810722 4857774 4908236 4962095 5018806 5077839 5139238 5203464 5270823
48683 5270823 5341247 5414518 5490307 5567927 5646459 5725408 5804974 5885407 5966239 6046288 6124244
48672 6124244 6199090 6270232 6337459 6400533 6458568 6510053 6553781 6589528 6617518 6637511 6648926
48661 6648926 6651727 6646687 6634651 6615840 6589966 6556685 6515927 6468017 6413725 6354124 6290288 6222970
48649 6222970 6152398 6078390 6000863 5920337 5837766 5753860 5668834 5582754 5495599 5406821 5315511
48638 5315511 5221550 5126223 5031135 4936811 4842885 4749453 4657513 4568174 4481979 4399068 4319408
48627 4319408 4242700 4168437 4096265 4026050 3957678 3891070 3826423 3764037 3703777 3644986 3587037
48616 3587037 3529834 3473772 3419391 3367013 3316498 3267356 3219267 3172397 3127065 3083271 3040774
48605 3040774 2999502 2959646 2921477 2885221 2850895 2818094 2786314 2755749 2727333 2701538 2677567
48594 2677567 2654384 2632144 2611847 2593768 2577165 2561676 2548116 2537473 2529660 2523672 2518655 2514438
48582 2514438 2511226 2509103 2507894 2507485 2508258 2510906 2515564 2521382 2527422 2533877 2541913 2552279 2564475 2577284
48568 2577284 2589726 2601548 2613240 2625668 2639213 2653125 2666014 2677101 2686768 2695923 2705202 2714710
48556 2714710 2724163 2733184 2741775 2750466 2759698 2769188 2778338 2787238 2796741 2807549 2819675 2832889 2847108
48543 2847108 2862141 2877475 2892640 2907577 2922520 2937685 2953120 2968668 2984013 2998941 3013394
48532 3013394 3027074 3039242 3049309 3057520 3064671 3071346 3077868 3084715 3092385 3100947 3110284 3120629 3132264
48519 3132264 3144826 3157709 3171070 3185719 3201969 3219396 3237888 3258119 3280732 3305711 3332857
48508 3332857 3362256 3394079 3428481 3465820 3506304 3549251 3593500 3638799 3685990 3735468 3786276
48497 3786276 3837162 3887689 3937724 3986651 4033837 4079291 4123040 4164284 4201909 4235466 4264937
48486 4264937 4289790 4309142 4322724 4331073 4334697 4333560 4327451 4316532 4301499 4283368 4262955 4240469
48474 4240469 4215789 4189205 4161497 4133095 4103641 4072644 4040060 4005925 3969923 3931808 3891861
48463 3891861 3850465 3807515 3762651 3715678 3666417 3614605 3560463 3504916 3448677 3391494 3332908
48452 3332908 3273339 3213738 3154391 3094851 3034944 2975214 2916468 2859468 2804977 2753458 2704749
48441 2704749 2658502 2614869 2574165 2536058 2499769 2465152 2432854 2403302 2376157 2351061 2328338
48430 2328338 2308609 2292011 2278133 2266524 2257010 2249609 2244252 2240563 2238006 2236311 2235672 2236357 2238347
48417 2238347 2241592 2246316 2252552 2259518 2266005 2271482 2276459 2281731 2287586 2293752 2299647 2304619 2308445 2311852
48403 2311852 2316233 2322494 2330284 2338442 2346037 2352851 2359093 2364925 2370352 2375468 2380609 2386094 2391817 2397354
48389 2397354 2402579 2407885 2413575 2419287 2424364 2428664 2432651 2436846 2441580 2447184 2453966 2461860 2470431 2479385
48375 2479385 2488868 2499276 2510895 2523752 2537559 2551815 2566148 2580595 2595438 2610919 2627288
48364 2627288 2644896 2663770 2683181 2702041 2719882 2737156 2754621 2772746 2791656 2811127 2830419
48353 2830419 2848616 2865527 2882029 2899224 2917366 2935831 2953937 2971476 2988531 3005118 3021176
48342 3021176 3036797 3052292 3067926 3083511 3098335 3111755 3123941 3135901 3148548 3161840 3175004
48331 3175004 3187595 3200036 3212997 3226410 3239407 3251265 3262201 3273096 3284604 3296700 3308994
48320 3308994 3321208 3333278 3345228 3357112 3369066 3381314 3394140 3407821 3422490 3438027 3454119
48309 3454119 3470493 3487078 3504042 3521734 3540504 3560342 3580697 3600781 3620148 3638988 3657964
48298 3657964 3677784 3698699 3720236 3741565 3762301 3782755 3803230 3823423 3842850 3861476 3879275
48287 3879275 3895349 3908214 3917035 3921928 3922985 3919684 3911480 3898337 3880386 3857644 3830381 3799189
48275 3799189 3764312 3725438 3682549 3636466 3588090 3537685 3485421 3432138 3378893 3326132 3274001
48264 3274001 3223069 3173998 3126621 3080086 3033906 2988320 2943704 2900202 2857862 2816540 2775736
48253 2775736 2735095 2695106 2656719 2620212 2584965 2550435 2516761 2484140 2452102 2419843 2387055
48242 2387055 2354143 2321683 2289840 2258333 2226962 2196092 2166386 2137987 2110271 2082691 2055561
48231 2055561 2029628 2005097 1981549 1958701 1936656 1915445 1894818 1874629 1855020 1836090 1817655
48220 1817655 1799356 1780782 1761522 1741484 1721207 1701518 1682762 1664576 1646437 1628173 1610025
48209 1610025 1592435 1575738 1559712 1543504 1526315 1508115 1489353 1470176 1450408 1430256 1410330
48198 1410330 1390883 1371624 1352532 1334186 1316907 1300097 1283046 1266051 1250075 1235379 1221170
48187 1221170 1206772 1192564 1179322 1166977 1154593 1141623 1128626 1116500 1105400 1094968 1085384
48176 1085384 1077458 1071535 1066894 1062647 1058744 1055635 1053338 1051494 1050161 1049916 1051044 1053168 1055846 1059191
48162 1059191 1063673 1069438 1076013 1082659 1089047 1095577 1102928 1111259 1120104 1129112 1138496 1148457 1158628 1168603
48148 1168603 1178763 1189938 1202262 1214879 1226909 1238284 1249547 1261162 1273116 1284970 1296261
48137 1296261 1307026 1317855 1329230 1340959 1352586 1364188 1376301 1389079 1402006 1414536 1426716
48126 1426716 1439009 1451763 1464972 1478426 1491978 1505699 1519698 1533821 1547781 1561663 1575965
48115 1575965 1591027 1606840 1623607 1641961 1662311 1684600 1709251 1737655 1771029 1809494 1853337
48104 1853337 1904594 1965849 2037246 2115397 2194734 2268269 2327151 2362117 2367944 2346851 2307140
48093 2307140 2258660 2209368 2164394 2126262 2095448 2071486 2054038 2042960 2037635 2036707 2038632 2042440
48081 2042440 2048131 2056354 2067509 2081086 2096038 2111659 2127662 2143565 2158774 2173444 2188493 2204347
48069 2204347 2220186 2234939 2248527 2261693 2274998 2288488 2302019 2315382 2328202 2340036 2350440
48058 2350440 2358864 2364946 2369133 2372482 2375469 2377491 2377949 2377206 2375826 2373420 2369130 2363055 2356224 2349131
48044 2349131 2341097 2331325 2319958 2307767 2295254 2282438 2269204 2255518 2241348 2226603 2211223 2195371
48032 2195371 2179533 2164230 2149407 2134293 2118172 2101281 2084546 2068304 2051662 2033355 2013077
48021 2013077 1991680 1970112 1948464 1926145 1902692 1878053 1852218 1825033 1796602 1767508 1738283
48010 1738283 1708909 1679160 1649256 1619715 1590705 1562104 1534169 1507520 1482282 1457762 1433251
47999 1433251 1408760 1384800 1361843 1340223 1320097 1301156 1282767 1264736 1247551 1231560 1216355
47988 1216355 1201457 1187281 1174704 1163808 1153651 1143403 1133269 1124082 1116310 1109650 1103501 1097637
47976 1097637 1092375 1088080 1084642 1081644 1079000 1077087 1076071 1075406 1074290 1072461 1070311 1068295 1066472 1064599
47962 1064599 1062441 1059979 1057298 1054273 1050413 1045178 1038479 1030700 1022263 1013350 1004001 994155 983564 971972
47948 971972 959465 946379 932855 918825 904428 890045 875776 861336 846618 831983 817787
47937 817787 804086 791014 779029 768429 758946 750119 741776 733902 726454 719613 713901 709637 706548
47924 706548 704130 702119 700392 698851 697773 697886 699679 702884 706980 711846 717533 723803 730350 737204
47910 737204 744457 751890 759319 766964 774980 782938 790299 797082 803497 809219 813748 817270 820428 823294
47896 823294 825266 826033 826014 825721 825190 824122 822166 819083 815116 811071 807494 803799 798874 792648 786435
47881 786435 781529 778011 775133 772329 769520 766876 764680 763210 762510 762413 762850 763885 765391 767073 768905
47866 768905 771196 774118 777517 781289 785500 789950 794035 797328 800036 802671 805566 808840 812485 816231
47852 816231 819698 822905 826323 830137 833840 836909 839468 841811 843575 844049 843168 841563 839625 837150 834087
47837 834087 830985 828287 825579 822059 817482 812190 806345 799680 792068 783863 775519 767211 759016 751064
47823 751064 743225 734962 725925 716541 707651 699619 692105 684635 677071 669609 662695 656845 652114 647726
47809 647726 642763 637266 632178 628093 624621 621241 618163 615905 614438 613283 612213 611408 611061 611241 611935
47794 611935 612915 613776 614529 615908 618556 622016 625101 627297 629338 632300 636544 641672 647173 652845 658797
47779 658797 665278 672565 680902 690451 701109 712355 723515 734343 745254 756933 769839 784100
47767 784100 799505 815398 830962 845918 860773 876132 892109 908604 925635 942853 959095
47756 959095 973141 984853 995048 1004308 1012435 1019028 1023990 1027435 1029514 1030411 1030090 1028081 1023994 1018300
47742 1018300 1012048 1005661 998484 989708 979295 967835 955973 944268 933189 922794 912577 901990
47730 901990 891046 880249 870004 860319 850995 841918 833122 824668 816531 808653 801070 793874 786960
47717 786960 780082 773348 767437 763005 759991 757832 756307 755801 756716 759017 762427 766838 772387 779258 787353
47702 787353 796019 804218 811259 817325 823071 828803 834330 839416 843913 847523 849931 851189 851507 850641 848000
47687 848000 843550 838153 832779 827675 822502 816899 810701 803995 797254 791197 786167 781861 777878 774286
47673 774286 771453 769565 768633 768721 769800 771448 773170 775064 777943 782661 789436 797802 806998 816387 825716
47658 825716 835141 844964 855230 865720 876388 887669 900025 913160 926005 937657 948120 957891
47646 957891 967079 975347 982587 989027 994601 998767 1001193 1002194 1002179 1001087 998691 995172 991008 986653 982629
47631 982629 979556 977522 975733 973339 970463 967874 965858 964066 962406 961383 961381 962124 963002 963525 963316 962053
47615 962053 959613 956044 951324 945374 938264 930055 920456 909012 895675 880864 864961 848153 830751
47602 830751 813260 795966 778785 761629 744573 727566 710309 692615 674767 657436 641336
47591 641336 626796 613494 600746 588260 576427 565650 555642 545836 536136 526760 517703 509046
47579 509046 501565 496124 492378 488883 484640 479886 475228 470797 466534 462594 459080 455888 453119 451126
47565 451126 449826 448628 447392 446815 447312 448116 448168 447655 448046 450658 455523 461485 467099 471696 475893 480933
47549 480933 487259 493950 499759 504385 508441 512537 516829 521231 525507 529193 531802 533224 533714 533439 532210
47534 532210 529692 525866 521247 516562 512084 507448 502206 496391 490222 483636 476615 469738 463695 458191
47520 458191 452109 444925 437352 430419 424588 420012 416804 414522 412071 408773 405156 402139 399818 397592
47506 397592 395050 392118 388621 384385 379682 375060 370748 366551 362217 357643 352979 348805 345802 343836
47492 343836 341741 338586 334874 331922 330283 329456 328972 328934 329308 329463 328887 328004 327712 328195 328496 327507 325308
47475 325308 323321 322966 324292 326175 327701 328879 330004 330995 331768 332721 334317 336421 338580 340747 343220
47460 343220 345935 348339 350060 351374 352909 355141 358199 361933 366063 370277 374269 377785 380887 384136
47446 384136 388080 392416 396000 398025 399017 400393 403115 406917 410653 413296 414822 416255 418626 421839
47432 421839 424913 427345 429731 432794 436397 439940 443325 446998 451342 456488 462547 469525 477068 484625
47418 484625 491906 499068 506669 515484 526047 538134 550996 564190 577807 591803 605813 619896
47406 619896 634769 650756 667099 682848 697882 712395 726003 738211 749286 759667 768746 775281
47394 775281 779012 780907 781663 780823 777717 772578 766303 759447 751754 742544 731468 719000 706085 693197
47380 693197 680010 666283 652637 639950 628327 617263 606581 596502 586997 577837 569286 562103
47368 562103 556744 553090 550854 549741 549305 549338 550376 553139 557442 562222 566753 571224 576109 581615 587810
47353 587810 594651 601736 608623 615454 622729 630431 638000 645100 651593 656762 659533 659802 658604 656602
47339 656602 653261 647969 641129 633514 625250 616154 606450 596423 585861 574567 563045 551949 541188
47326 541188 530326 519570 509584 500472 491723 483135 475084 467773 460838 453866 446814 439834 433175 427408
47312 427408 423218 420631 418736 416471 413578 410629 408368 407180 407046 407653 408521 409256 409853 410734 412352 414670
47296 414670 417117 419157 420818 422485 424224 425637 426398 426629 426532 426046 425169 424349 424090 424188 423864 422737 421289
47279 421289 420167 419406 418635 417783 417138 416772 416408 416043 416311 417827 420317 422790 424602 426027 427674 429690
47263 429690 431825 434063 436788 440271 444250 448148 451665 455026 458747 463260 468720 475035 481897 488853
47249 488853 495565 502137 508996 516325 523787 530982 537883 544490 550310 554767 558029 560836 563496 565692
47235 565692 567342 568829 570081 570264 568992 567187 565974 565202 563914 561928 559961 558295 556274 553388 550106
47220 550106 547233 544944 542824 540511 537999 535492 533226 531395 530192 529925 530891 532953 535494 538144 541423
47205 541423 546251 552881 560623 568581 576315 583917 591824 600528 610058 619818 629254 638515 647998 657434
47191 657434 666072 673723 680946 688009 694292 698995 701999 703674 704165 703188 700392 695752 689688 682772 675237
47176 675237 666896 657803 648739 640578 633336 626373 619503 613307 608361 604747 602465 601683 602316 603863 605981
47161 605981 608851 612729 617497 622947 629194 636538 645109 654924 666062 678626 692581 707629 723163
47148 723163 738547 753729 769352 785719 801799 815864 827135 836209 843882 850346 855699 860397
47136 860397 864661 867928 869412 868924 866767 863159 858105 851677 844180 836258 828833 822465 816637 810195
47122 810195 802806 795462 789226 784033 779150 774359 769976 766010 761942 757406 752642 748237 744654 742026
47108 742026 740213 739039 738528 738840 739960 741690 743928 746718 750000 753588 757439 761563 765656 769290 772531
47093 772531 775927 779638 783013 785233 785937 785038 782413 778129 772618 766316 759432 752182 744825 737213 728823
47078 728823 719522 709854 700267 690593 680662 670845 661479 652250 642830 633704 625643 618540 611529 604245
47064 604245 597386 591893 587983 585061 582338 579529 577129 575932 576143 577115 578139 579241 580947 583569 587023
47049 587023 591143 595798 600791 605961 611295 616797 622344 627730 632640 636549 639122 640842 642760 645348
47035 645348 648080 650485 653034 656422 660425 664109 666925 669053 670880 672772 675227 678719 683300 688643
47021 688643 694379 700195 705935 711969 719086 727527 736408 744641 752196 759906 768262 777017 785833 794593
47007 794593 803096 811082 818678 826389 834501 842871 851278 859635 867886 876066 884392 892974 901488 909434
46993 909434 916541 922576 927084 930003 932266 935016 938206 940646 941529 941213 940373 939210 937797 936530 935585
46978 935585 934357 932012 928418 924220 920156 916615 913676 911184 908828 906414 904062 902059 900568 899614
46964 899614 899199 899273 899681 900302 901226 902671 904755 907390 910320 913202 915804 918273 921195 925190 930293 935799
46948 935799 940849 945227 949403 953760 958014 961637 964627 967528 970758 974260 977738 980769 982722 983171
46934 983171 982618 982259 982682 983202 982861 981651 980325 979310 978451 977626 976984 976495 975742 974397 972768 971731 972164
46917 972164 974285 977469 980842 984092 987538 991382 995329 999122 1003074 1007778 1013543 1020309 1027780 1035348
46903 1035348 1042343 1048725 1055228 1062484 1070367 1078559 1087232 1096567 1105908 1114143 1120846 1126571 1132080 1137688
46889 1137688 1143170 1147816 1150699 1151352 1150154 1147736 1144268 1139710 1134443 1129028 1123565 1117805 1111833 1106128
46875 1106128 1101109 1097113 1094635 1094063 1095308 1098198 1103033 1110081 1118719 1127794 1136815 1146215 1156432 1167340
46861 1167340 1178499 1189376 1199369 1208179 1216149 1223734 1230816 1237131 1243074 1249222 1255296 1260587 1265358
46848 1265358 1270720 1277010 1283356 1289198 1295164 1302015 1309644 1317676 1326173 1335146 1344214 1353392 1363396 1374360
46834 1374360 1384964 1393781 1401029 1408115 1415820 1423838 1431777 1439610 1447105 1453689 1459090 1463539 1467286 1470424
46820 1470424 1473188 1475776 1477803 1478568 1478148 1477652 1478042 1479112 1480068 1480757 1481819 1483737 1486300 1489116 1492309
46805 1492309 1496463 1502073 1509238 1517740 1527200 1537254 1547855 1559441 1572553 1587236 1603028 1619566
46793 1619566 1636866 1654848 1672969 1690559 1707296 1723033 1737433 1750179 1761343 1771150 1779459 1785881
46781 1785881 1790305 1792915 1793802 1792965 1790647 1787236 1782813 1777184 1770357 1762663 1754396 1745791 1737263 1729155
46767 1729155 1721203 1712755 1703644 1694387 1685368 1676379 1667134 1657759 1648357 1638608 1628217 1617548 1607345
46754 1607345 1597974 1589253 1580967 1573195 1566191 1560213 1555472 1551954 1549220 1546639 1544101 1542479 1543055 1546297
46740 1546297 1551362 1557065 1563196 1570480 1579347 1589373 1600105 1611787 1624786 1638873 1653562 1668764
46728 1668764 1684476 1700251 1715720 1731334 1747738 1764495 1780237 1794161 1806698 1818633 1830239
46717 1830239 1841379 1851738 1860765 1867981 1873574 1878289 1882638 1886710 1890715 1894995 1899444 1903669 1908001
46704 1908001 1913557 1920956 1929586 1938566 1947833 1957771 1968216 1978385 1987562 1995510 2002411 2008571 2013918
46691 2013918 2017629 2018565 2016244 2010992 2003091 1992298 1978380 1961576 1942250 1920609 1897065 1872357
46679 1872357 1846937 1820558 1792798 1763637 1733336 1702230 1670964 1640407 1610924 1582084 1553471
46668 1553471 1525438 1498724 1473658 1450094 1427780 1406427 1385685 1365404 1345689 1326498 1307487
46657 1307487 1288513 1269974 1252365 1235817 1220304 1205968 1192964 1181258 1170805 1161700 1154014 1147871
46645 1147871 1143739 1142168 1143023 1145542 1149390 1155142 1163359 1173638 1184986 1196730 1208722 1221046 1233823
46632 1233823 1246931 1259607 1270804 1280185 1288348 1295784 1302173 1307050 1310562 1313038 1314334 1314216 1312986
46619 1312986 1311268 1309457 1307899 1307190 1307837 1309943 1313637 1319421 1327662 1338107 1350337 1364318 1380081
46606 1380081 1397288 1415570 1434817 1454648 1474101 1492502 1510187 1527758 1544957 1560870 1574859
46595 1574859 1586602 1595577 1601163 1603167 1601726 1597050 1589689 1580624 1570386 1558471 1544323 1528511 1512215
46582 1512215 1495915 1479441 1462969 1446960 1431232 1415046 1398255 1381571 1365574 1350155 1335027
46571 1335027 1320120 1305327 1290494 1275818 1261809 1248645 1235997 1223518 1211158 1198971 1187035
46560 1187035 1175589 1164911 1155036 1145910 1137725 1130784 1125081 1120290 1116050 1112057 1108147 1104497 1101374
46547 1101374 1098473 1095092 1091372 1088687 1088084 1088958 1090039 1091153 1093003 1095719 1098845 1102578 1107733 1114345
46533 1114345 1121413 1128231 1135113 1142557 1150604 1159286 1168874 1179284 1189913 1200370 1210829 1221449 1232073
46520 1232073 1242695 1253646 1265158 1277299 1290473 1305355 1322081 1340026 1358518 1377271 1396121
46509 1396121 1414961 1434034 1453742 1474150 1495282 1517729 1542017 1567391 1592231 1615928 1639321
46498 1639321 1663081 1686749 1709869 1732862 1755945 1778049 1797832 1815163 1830715 1844524 1855845
46487 1855845 1864171 1869673 1872835 1874325 1875058 1875654 1875794 1874570 1871467 1866732 1860981 1854802 1848585 1842353 1835816
46472 1835816 1828772 1821270 1813217 1804188 1793928 1782753 1771084 1758853 1745703 1731413 1715783 1698377
46460 1698377 1678920 1657769 1635556 1612425 1588023 1562170 1535238 1507911 1480817 1454283 1428156
46449 1428156 1402079 1376226 1351606 1329264 1309321 1291171 1274527 1259845 1247658 1237926 1230220 1224323
46437 1224323 1220417 1218819 1219679 1222849 1227890 1234161 1241123 1248788 1257820 1268897 1281761 1295104 1307606
46424 1307606 1318964 1329674 1340013 1349606 1357881 1364533 1369506 1372912 1375033 1376086 1375963 1374468 1371768
46411 1371768 1368354 1364653 1361039 1357982 1355669 1353622 1351395 1349659 1349786 1352262 1356325 1361463 1368418 1378166
46397 1378166 1390699 1405489 1422559 1442275 1464411 1488263 1513534 1540389 1568726 1598044 1628142
46386 1628142 1659346 1691900 1725504 1759517 1793262 1826054 1857270 1886542 1913702 1938492 1960527
46375 1960527 1979554 1995434 2007784 2015877 2019203 2018073 2013476 2006234 1996417 1983744 1968456 1951386
46363 1951386 1933032 1913037 1891063 1867907 1845074 1823332 1802380 1782062 1763137 1746517 1732369
46352 1732369 1720510 1711170 1704768 1701296 1700477 1702342 1707172 1715069 1726129 1740859 1759879 1783268 1810694
46339 1810694 1842156 1878035 1918301 1962140 2008600 2057283 2108216 2161244 2215794 2271049 2326163
46328 2326163 2380269 2432388 2481454 2526565 2567180 2602875 2632848 2655892 2671085 2678301 2677911 2670186
46316 2670186 2655360 2634091 2607368 2575846 2539554 2498376 2452668 2403384 2351862 2299594 2247969
46305 2247969 2197940 2149945 2104265 2061431 2022142 1986826 1955524 1928223 1905114 1886278 1871350
46294 1871350 1859857 1851927 1848258 1849250 1854478 1863257 1875366 1890898 1909665 1931261 1955514 1982424
46282 1982424 2011727 2043035 2076304 2111653 2148684 2186536 2224674 2263120 2301796 2340206 2377962
46271 2377962 2414994 2450889 2484500 2514666 2540960 2563428 2581985 2596516 2607210 2614273 2617521 2616673
46259 2616673 2611879 2603488 2591492 2575677 2556280 2534021 2509535 2483252 2455899 2428676 2402611 2377988
46247 2377988 2354637 2332636 2312464 2294435 2278249 2263357 2249724 2238005 2228795 2221926 2216712 2212746
46235 2212746 2210093 2208778 2208474 2208734 2209196 2209507 2209432 2209103 2208746 2207996 2206013 2202512 2198253 2194031 2189523 2183604
46219 2183604 2175634 2166011 2155539 2144712 2133652 2122360 2110795 2098878 2086587 2074015 2061234 2048151
46207 2048151 2034593 2020706 2007177 1994782 1983606 1973011 1962587 1952779 1944156 1936414 1928746 1921062
46195 1921062 1914174 1908729 1904669 1901844 1900431 1900500 1901885 1904880 1910389 1918838 1929406 1940885 1952892 1965792
46181 1965792 1979861 1995124 2011691 2029560 2048193 2066857 2085298 2103630 2121724 2139235 2156215
46170 2156215 2173151 2190216 2206891 2222531 2237081 2251128 2265336 2279943 2294778 2309665 2324654
46159 2324654 2339790 2354934 2370054 2385450 2401204 2416615 2430838 2444078 2457449 2471499 2485628
46148 2485628 2499184 2512329 2525481 2538665 2551977 2565859 2580234 2594051 2606512 2618133 2629760
46137 2629760 2641104 2651257 2660265 2669035 2677865 2686251 2694175 2702484 2711682 2721139 2729850 2737307 2743449
46124 2743449 2748484 2753072 2758099 2763834 2769652 2774778 2778945 2782239 2784821 2787014 2789246 2791655 2794101 2796627
$$ [...]
##END NTUPLES=NMR SPECTRUM
##END=
