
##TITLE=AC1328_GUAAH12157_6609849_rhbDizuonw
##JCAMPDX= 6.0         $$ Bruker NMR JCAMP-DX V2.0
##DATA TYPE= NMR SPECTRUM
##DATA CLASS= NTUPLES
##ORIGIN= BRUKER
##OWNER= Administrator
$$ 1.72 TOPSPIN		Version 2.1
$$ 2012-08-02 03:38:59.125 -0500  Administrator@TOPSPIN
$$ Compression mode = diff/dup
##.OBSERVE FREQUENCY= 400.02188249412
##.OBSERVE NUCLEUS= ^1H
##.ACQUISITION MODE= SIMULTANEOUS (DQD)
##.ACQUISITION SCHEME= undefined
##.AVERAGES= 8
##.DIGITISER RES= 22
##SPECTROMETER/DATA SYSTEM= spect
##.PULSE SEQUENCE= zg30
##.SOLVENT NAME= COFFEE_meoh
##.SHIFT REFERENCE= INTERNAL, COFFEE_meoh, 1, 14.98509
##AUDIT TRAIL= $$ (NUMBER, WHEN, WHO, WHERE, PROCESS, VERSION, WHAT)
$$ ##TITLE= Audit trail, TOPSPIN		Version 2.1
$$ ##JCAMPDX= 5.01
$$ ##ORIGIN= Bruker BioSpin GmbH
$$ ##OWNER= Administrator
$$ $$ C:\Bruker\TOPSPIN/data/COFFEE/nmr/AC1328_GUAAH12157_6609849_rhbDizuonw/10/pdata/1/auditp.txt
$$ ##AUDIT TRAIL=  $$ (NUMBER, WHEN, WHO, WHERE, PROCESS, VERSION, WHAT)
(   1,<2012-08-02 03:38:37.343 -0500>,<Administrator>,<TOPSPIN>,<go>,<TOPSPIN 2.1>,
      <created by zg
	started at 2012-08-02 03:37:29.125 -0500,
	POWCHK enabled, PULCHK disabled,
       configuration hash MD5:
       6B 1B 68 BB D9 2E 58 E2 7F 35 AD 54 07 DF 0E 41
       data hash MD5: 64K
       98 4F 2E 13 3B 24 35 4F 66 90 4E 21 D4 7B F9 C9>)
(   2,<2012-08-02 03:38:47.062 -0500>,<Administrator>,<TOPSPIN>,<proc1d>,<TOPSPIN 2.1>,
      <Start of raw data processing
       efp LB = 0 FT_mod = 6 PKNL = 1 PHC0 = 0 PHC1 = 0 SI = 32K 
       data hash MD5: 32K
       85 61 58 75 F2 DC 8E E8 F6 3A 05 52 3A 8B CD 3E>)
(   3,<2012-08-02 03:38:47.843 -0500>,<Administrator>,<TOPSPIN>,<proc1d>,<TOPSPIN 2.1>,
      <pk PHC0 = 178.0444 PHC1 = 0 
       data hash MD5: 32K
       B5 2C B4 03 AC BF 22 5B 7F E5 27 94 01 75 44 E9>)
(   4,<2012-08-02 03:38:48.296 -0500>,<Administrator>,<TOPSPIN>,<proc1d>,<TOPSPIN 2.1>,
      <abs ABSG = 1 
       data hash MD5: 32K
       6F F7 0E D1 2C A7 5D 20 94 80 18 2E 2C 2A 05 45>)
(   5,<2012-08-02 03:38:48.562 -0500>,<Administrator>,<TOPSPIN>,<proc1d>,<TOPSPIN 2.1>,
      <abs ABSG = 2 
       data hash MD5: 32K
       12 4E 5C 82 4B DA 1E 01 D8 3E CB 5F D7 CA 05 DB>)
(   6,<2012-08-02 03:38:48.937 -0500>,<Administrator>,<TOPSPIN>,<proc1d>,<TOPSPIN 2.1>,
      <abs ABSG = 3 
       data hash MD5: 32K
       D9 E1 70 D4 9F 3E DC AF 1F B0 EF 53 7D 05 06 34>)
(   7,<2012-08-02 03:38:49.421 -0500>,<Administrator>,<TOPSPIN>,<proc1d>,<TOPSPIN 2.1>,
      <abs ABSG = 4 
       data hash MD5: 32K
       55 1F 11 E3 48 2F 3B 8A D6 40 96 42 8D 9D A9 2F>)
(   8,<2012-08-02 03:38:49.703 -0500>,<Administrator>,<TOPSPIN>,<proc1d>,<TOPSPIN 2.1>,
      <abs ABSG = 5 
       data hash MD5: 32K
       60 01 71 2F 09 3C 59 81 D7 A1 6A 87 C4 91 BB 56>)
$$ ##END=
$$ 
$$ $$ hash MD5
$$ $$ A0 C3 6F 36 C4 81 03 41 A4 8E 54 DA 4F 58 3B 82
##$RELAX= 
##$RELAX= 
##$RELAX= 
##$RELAX= 
##$RELAX= 
##$RELAX= 
##$RELAX= 
$$ Bruker specific parameters
$$ --------------------------
$$ [...]
##$TP= (0..7)
150 150 150 150 150 150 150 150
##$TP07= 0
##$TPNAME0= <>
##$TPNAME1= <>
##$TPNAME2= <>
##$TPNAME3= <>
##$TPNAME4= <>
##$TPNAME5= <>
##$TPNAME6= <>
##$TPNAME7= <>
##$TPOAL= (0..7)
0.5 0.5 0.5 0.5 0.5 0.5 0.5 0.5
##$TPOFFS= (0..7)
0 0 0 0 0 0 0 0
##$TUNHIN= 0
##$TUNHOUT= 0
##$TUNXOUT= 0
##$USERA1= <user>
##$USERA2= <user>
##$USERA3= <user>
##$USERA4= <user>
##$USERA5= <user>
##$V9= 5
##$VALIST= <valist>
##$VCLIST= <CCCCCCCCCCCCCCC>
##$VD= 0
##$VDLIST= <DDDDDDDDDDDDDDD>
##$VPLIST= <PPPPPPPPPPPPPPP>
##$VTLIST= <TTTTTTTTTTTTTTT>
##$WBST= 1024
##$WBSW= 4
##$XGAIN= (0..3)
0 0 0 0
##$XL= 0
##$YL= 0
##$YMAX_a= 471585
##$YMIN_a= -620375
##$ZGOPTNS= <>
##$ZL1= 120
##$ZL2= 120
##$ZL3= 120
##$ZL4= 120
##$ABSF1= 14.98509
##$ABSF2= -5.573092
##$ABSG= 5
##$ABSL= 3
##$ALPHA= 0
##$AQORDER= 0
##$ASSFAC= 0
##$ASSFACI= 0
##$ASSFACX= 0
##$ASSWID= 0
##$AUNMP= <proc_prof1d_extract_pilot.lims>
##$AXLEFT= 0
##$AXNAME= <>
##$AXNUC= <1H>
##$AXRIGHT= 0
##$AXTYPE= 0
##$AXUNIT= <>
##$AZFE= 0.1
##$AZFW= 0.1
##$BCFW= 0
##$BC_mod= 0
##$BYTORDP= 0
##$COROFFS= 0
##$CY= 15
##$DATMOD= 1
##$DC= 0
##$DFILT= <>
##$DTYPP= 0
##$F1P= 0
##$F2P= 0
##$FCOR= 0.5
##$FTSIZE= 32768
##$FT_mod= 6
##$GAMMA= 0
##$GB= 0
##$INTBC= 1
##$INTSCL= 1
##$ISEN= 128
##$LB= 0
##$LEV0= 0
##$LPBIN= 0
##$MAXI= 10000
##$MC2= 0
##$MEAN= 0
##$ME_mod= 0
##$MI= 0
##$NCOEF= 0
##$NC_proc= -8
##$NLEV= 6
##$NOISF1= 0
##$NOISF2= 0
##$NSP= 0
##$NTH_PI= 0
##$NZP= 0
##$OFFSET= 14.98509
##$PC= 1
##$PHC0= 178.0444
##$PHC1= 0
##$PH_mod= 1
##$PKNL= yes
##$PPARMOD= 0
##$PPDIAG= 0
##$PPIPTYP= 0
##$PPMPNUM= 2147483647
##$PPRESOL= 1
##$PSCAL= 4
##$PSIGN= 0
##$PYNMP= <proc.py>
##$REVERSE= no
##$SF= 400.02
##$SI= 32768
##$SIGF1= 0
##$SIGF2= 0
##$SINO= 400
##$SIOLD= 32768
##$SPECTYP= <>
##$SREGLST= <1H.CDCl3>
##$SSB= 0
##$STSI= 32768
##$STSR= 0
##$SW_p= 8223.68421052631
##$SYMM= 0
##$S_DEV= 0
##$TDeff= 65536
##$TDoff= 0
##$TI= <>
##$TILT= no
##$TM1= 0
##$TM2= 0
##$TOPLEV= 0
##$USERP1= <user>
##$USERP2= <user>
##$USERP3= <user>
##$USERP4= <user>
##$USERP5= <user>
##$WDW= 1
##$XDIM= 32768
##$YMAX_p= 461327595
##$YMIN_p= -762834
##$CURPLOT= <Network HP LaserJet P1505>
##$CURPRIN= <$Network HP LaserJet P1505>
##$DFORMAT= <normdp>
##$LAYOUT= <+/1D_H.xwp>
##$LFORMAT= <normlp>
##$PFORMAT= <normpl>
##$SURQMSG= 1
$$ End of Bruker specific parameters
$$ ---------------------------------
##NTUPLES= NMR SPECTRUM
##VAR_NAME=  FREQUENCY,     SPECTRUM/REAL,   SPECTRUM/IMAG
##SYMBOL=    X,             R,               I
##VAR_TYPE=  INDEPENDENT,   DEPENDENT,       DEPENDENT
##VAR_FORM=  AFFN,          ASDF,            ASDF
##VAR_DIM=   32768,         32768,           32768
##UNITS=     HZ,            ARBITRARY UNITS, ARBITRARY UNITS
##FACTOR=    0.250966925370066, 1,           1
##FIRST=     8223.43324360094, -35768,       68042
##LAST=      0,             -92824,          57157
##MIN=       0,             -762834,         0
##MAX=       8223.43324360094, 461327595,    0
$$ Real data points
##PAGE= N=1
##DATA TABLE= (X++(R..R)), XYDATA
$$ [...]
19452a5780m3833j09810c6912k97648E990d6682A45811a44211F6879j5086Q5903
$$ -15780 -59613 -169423 -36912 -334560 5990 -46682 145811 -144211 66879 51793 137696
19441A37696l9706a6609A1089Q0317a63131H8648I666K1533b13268k9911p5747
$$ 137696 97990 -16609 11089 91406 -163131 88648 9666 31199 -213268 -243179 -318926
19430c18926A41166b5932k8204C01434D8421b58471A1502a76063m5970H2399K7132
$$ -318926 141166 -25932 -54136 301434 48421 -258471 11502 -176063 -222033 82399 109531
19419A09531b74245B26900c396A43037d34039B13444k9560B487c2241E8164c1383
$$ 109531 -274245 226900 -3396 143037 -434039 213444 183884 2487 -32241 58164 -31383
19407a10802A13047b21213A44952a53395A38728O64a69716k35947h9921L5930
$$ -110802 113047 -221213 144952 -153395 138728 139392 -169716 -405663 -89921 -53991
19397e3991l6695A25269C625e9744j37009C8743J19729c39237J26544Q5533k5738
$$ -53991 -90686 125269 3625 -59744 -196753 38743 158472 -339237 -212693 -127160 -152898
19386a52898H009c520E9674L0886N5466a92233p0606R0237B77835a63426G5664
$$ -152898 8009 -3520 59674 90560 146026 -192233 -262839 -172602 277835 -163426 75664
19374A05904B6580a20523m8033l1722B3316a88939K7833A8449h6334j31511R8847
$$ 105904 26580 -120523 -168556 -200278 23316 -188939 -161106 18449 -86334 -217845 -118998
19363a18998I0151a09800j23924J16685l8223K5293i588l44407b9303l1316E085
$$ -118998 90151 -109800 -233724 -117039 -155262 -129969 -9588 -353995 -29303 -60619 5085
19351a3985k26080h760r2647A67146k6559a59133F2765J32734a00255B59722a25113
$$ -13985 -240065 -8760 -101407 167146 140587 -159133 62765 195499 -100255 259722 -125113
19339a51919N6105j67390A699a01888G9917i9702n0484d1883j09346A48015N4583
$$ -151919 -95814 -263204 1699 -101888 79917 -99702 -150186 -41883 -151229 148015 202598
19328B02598q7611A5123n065b2928l30761D3545a66266n5336D3313c01093f0887
$$ 202598 114987 15123 10058 -22928 -353689 43545 -166266 -221602 43313 -301093 -60887
19316C4690P0405a63276A49768n3123C509a33867A89273b38348l3877J21649L3358
$$ 34690 105095 -163276 149768 96645 3509 -133867 189273 -238348 -272225 -150576 -117218
19305a17218K4709l496d0159l38206J20081D2733J12693b25637g2433j77080A9012
$$ -117218 -92509 -96005 -40159 -378365 -258284 42733 155426 -225637 -72433 -249513 19012
19293a77920j25989C02923g5854B5127a18794A9317i5725A93165a91589h1051
$$ -177920 -303909 302923 -75854 25127 -118794 19317 -95725 193165 -191589 -81051
19282C4987a02317d6313J2262l5664J8107k12218M3372d3361l593D30085i7116
$$ 34987 -102317 -46313 -34051 -69715 -51608 -263826 -220454 -43361 -46954 430085 -97116
19270f5464A2555a92280j53251a24761j55619e0081l07961j19695A68682a75876
$$ -65464 12555 -192280 -345531 -124761 -280380 -50081 -358042 -477737 168682 -175876
19259d10491c0349A07473a41643A9757c59338a30120l6827A07120K45902p3248
$$ -410491 -30349 107473 -141643 19757 -359338 -130120 -166947 107120 353022 279774
19249B79774f7012n5163A41393A9674c26738Q4734K4987C0589c4174a4462m3747
$$ 279774 -67012 -122175 141393 19674 -326738 -242004 -217017 30589 -34174 -14462 -58209
19238e8209k5832m9723j55470A79534m7069d5042D1640a95314j96612a59811A29231
$$ -58209 -84041 -133764 -289234 179534 132465 -45042 41640 -195314 -391926 -159811 129231
19226b39216Q6541N2792A6778D543K44705a17412j02356E3725a10419A09330b04224
$$ -239216 -152675 -99883 16778 4543 249248 -117412 -219768 53725 -110419 109330 -204224
19214C9395e8680A12967e9099E8049c3144A97934B3501e5339b0634k58230a26242
$$ 39395 -58680 112967 -59099 58049 -33144 197934 23501 -55339 -20634 -278864 -126242
19202a19156K3145k9708n5335A29702a41256f9151a0449G8515A2141b82174O531
$$ -119156 -96011 -125719 -181054 129702 -141256 -69151 -10449 78515 12141 -282174 -275643
19191b75643A1042g6238j40414K2786B66808i0631E0633b13156B00362c96344
$$ -275643 11042 -76238 -216652 -193866 266808 -90631 50633 -213156 200362 -396344
19180H6638b00991K919b8372k5773k54565a11847A5505a82737k33885G7118a17514
$$ 86638 -200991 -198072 -28372 -54145 -308710 -111847 15505 -182737 -416622 77118 -117514
19168A20861a33279A06049c45135B2918A648J53945c61097h8284k06188E0516
$$ 120861 -133279 106049 -345135 22918 1648 155593 -361097 -88284 -294472 50516
19157a06624A38965a73362N651D58051f8626q9405L2462q7499B66856b6185k67081
$$ -106624 138965 -173362 -167711 458051 -68626 -158031 -125569 -213068 266856 -26185 -293266
19146b93266m3743f4623k4080A12191l7372b02644B15293E2855d0281j29373C19293
$$ -293266 -337009 -64623 -88703 112191 74819 -202644 215293 52855 -40281 -169654 319293
19134a89873B62108E4557B5940J84637a17138F0869d66694A34491g4760B02985
$$ -189873 262108 54557 25940 210577 -117138 60869 -466694 134491 -74760 202985
19123c55022A14613K35416b52231B04768m4488a26012e3603a7457l80847a43456
$$ -355022 114613 350029 -252231 204768 160280 -126012 -53603 -17457 -398304 -143456
19112a38570n7254C53811b20923k0209J06066A46218m8784c39291A52714c4579
$$ -138570 -195824 353811 -220923 -241132 -135066 146218 97434 -339291 152714 -34579
19101A36035L0476b22730C79061c77582I2301c21599H8359e1969j1522b111o0484
$$ 136035 166511 -222730 379061 -377582 92301 -321599 88359 -51969 -63491 -2111 -62595
19090f2595G672i0676C31217a51374P2845B63744b57443a2344k49063E2216B0496
$$ -62595 7672 -90676 331217 -151374 -78529 263744 -257443 -12344 -261407 52216 20496
19078h3524m74409C67983j29433a68533M7463l0765A76357a22195c5026n6017
$$ -83524 -557933 367983 238550 -168533 -121070 -151835 176357 -122195 -35026 -91043
19068i1043j37391B7007g9755G349b8968G640a76642B12920b09881N169b6245
$$ -91043 -228434 27007 -79755 7349 -28968 7640 -176642 212920 -209881 -204712 -26245
19056c8940I1567A3822b34765H254a43568B02107d46128A21484d2542J7928I8365
$$ -38940 91567 13822 -234765 8254 -143568 202107 -446128 121484 -42542 -24614 98365
19044b3764a146m8418m8273a908j13678j47459e9053I3576J63594J742p4182m6450
$$ -23764 -1146 -49564 -97837 -1908 -115586 -263045 -59053 93576 257170 258912 184730 138280
19032A38280h9805o6728G5505b01674I3992J24785a03371l3475I7988K52338C3802
$$ 138280 -89805 -156533 75505 -201674 93992 218777 -103371 -136846 97988 350326 33802
19020b29531A7764b59223f6423A02656N8847c21720A06051i0812j44773A85837
$$ -229531 17764 -259223 -66423 102656 161503 -321720 106051 -90812 -235585 185837
19009C3495A630O6485J76937b43899d6365A53624c15972A66531a16743K6741m5957
$$ 33495 1630 68115 245052 -243899 -46365 153624 -315972 166531 -116743 -90002 -135959
18998a35959m9562h7727o4192j58167a18923F1329a46699K562a0391j33647A52705
$$ -135959 -185521 -87727 -151919 -310086 -118923 61329 -146699 -144137 -10391 -144038 152705
18986e8626a8837m96194H3540c23150d5874B2466q465K48100e9746A9990b76064
$$ -58626 -18837 -515031 83540 -323150 -45874 22466 14001 262101 -59746 19990 -276064
18974A76804i6530C40360N43792k19507k05646j87511C3072K85821g3760l85612
$$ 176804 -96530 340360 884152 664645 458999 271488 33072 318893 -73760 -459372
18964d59372H6524a861j4169j39500B59582g2351G7539K0159a44002e7132P819
$$ -459372 86524 -1861 -16030 -155530 259582 -72351 77539 97698 -144002 -57132 -49313
18953d9313j68214A1478K18836R2544A14907K5700L2983p4853c38812D8552b8090
$$ -49313 -217527 11478 230314 322858 114907 140607 173590 98737 -338812 48552 -28090
18941b95398A58782p4630a22741B47824a87131N5104K0429A35387M0033D9728
$$ -295398 158782 84152 -122741 247824 -187131 -132027 -111598 135387 175420 49728
18930C4415A2513b91774G1241J96860b3319A4937K1627b29761J02118A62656b44070
$$ 34415 12513 -291774 71241 268101 -23319 14937 36564 -229761 -127643 162656 -244070
18918E7480J52181f8728B38040a14620G8449d069j73345d6420G7535J99278K13645
$$ 57480 209661 -68728 238040 -114620 78449 -4069 -177414 -46420 77535 276813 490458
18907D90458Q0884B54854h4347o0276j68865h083m1286A01286e2322j128G8829
$$ 490458 571342 254854 -84347 -144623 -313488 -8083 -49369 101286 -52322 -53450 78829
18895B799J49964a87415M6625N1033E0025d152j89905A29990d2591j74459f453
$$ 2799 152763 -187415 -140790 -89757 50025 -4152 -194057 129990 -42591 -217050 -6453
18883B7338a05268j75499a981H4370e11081A44951O4287b65595a11716B1974b50772
$$ 27338 -105268 -280767 -1981 84370 -511081 144951 209238 -265595 -111716 21974 -250772
18871g0227A6436b4920A63788a83529j96745a075j39170H1909a55879a0856k25859
$$ -70227 16436 -24920 163788 -183529 -380274 -1075 -140245 81909 -155879 -10856 -236715
18860b36715j82386h3453b7472q1749C36516B5006b18343o3123f1812b7535E8091
$$ -236715 -419101 -83453 -27472 -109221 336516 25006 -218343 -281466 -61812 -27535 58091
18848c5447m0010J5314a9789k534A40024f9427B1733a31125j7417m5017M3992
$$ -35447 -75457 -60143 -19789 -22323 140024 -69427 21733 -131125 -148542 -193559 -149567
18837a49567a2851H978h4787j30380A82503A4579b01994o2195A87994h9529c7283
$$ -149567 -12851 8978 -84787 -215167 182503 14579 -201994 -264189 187994 -89529 -37283
18825c3799j10099E914a47116G6314a91641B8637J67712I7036c0643A2106K28944
$$ -33799 -143898 5914 -147116 76314 -191641 28637 196349 97036 -30643 12106 241050
18814B41050a24757F7362b05831g8794I0956K32694j17663r3822K55981A62193
$$ 241050 -124757 67362 -205831 -78794 90956 323650 205987 112165 368146 162193
18803B57442i0496A16725d71616A73899o9996f8389J7037j23655J9311C5343O0427
$$ 257442 -90496 116725 -471616 173899 103903 -68389 -51352 -175007 -155696 35343 95770
18792I5770f2434B4003a76680I705a97872H0034a75290a8556D5936c7290R206
$$ 95770 -62434 24003 -176680 9705 -197872 80034 -175290 -18556 45936 -37290 -28084
18781b8084A04396a1241A70880G9445a24673A62874p5446H806a08248H427d22503
$$ -28084 104396 -11241 170880 79445 -124673 162874 87428 8806 -108248 8427 -422503
18769A11283a36581j44740H93c4083B89334m4252f1779H002J19615g2082q3357
$$ 111283 -136581 -281321 893 -34083 289334 245082 -61779 8002 127617 -72082 -155439
18758a55439A14239A3781a89833C092c20297a05227k08141J21608N7308M7135
$$ -155439 114239 13781 -189833 3092 -320297 -105227 -313368 -191760 -134452 -87317
18748h7317l1845n7050c5612m0994k57734c6548F3952J5247b06097o0180K1025
$$ -87317 -119162 -176212 -35612 -76606 -334340 -36548 63952 79199 -206097 -266277 -245252
18737b45252i6583A20115A8278Q052J14425C9810a50594J4030b1808A54939C0121
$$ -245252 -96583 120115 18278 26330 140755 39810 -150594 -136564 -21808 154939 30121
18725a35861k1434j04831l5648n7210k2655C1698J29449a616r7119B61425b04333
$$ -135861 -157295 -262126 -297774 -354984 -377639 31698 161147 -1616 -98735 261425 -204333
18713d801a281j36111i108j43214B0409c37044g0714q7427d7994r2910k2664B9784
$$ -4801 -1281 -137392 -9108 -152322 20409 -337044 -70714 -158141 -47994 -140904 -163568 29784
18700b72053j20953f2204j9138C7704c23721a33790B37705a06206B8447c7962
$$ -272053 -393006 -62204 -81342 37704 -323721 -133790 237705 -106206 28447 -37962
18689F838e05015a45141B3394h1947o1457A46154a05336b703A29788i4934A78332
$$ 6838 -505015 -145141 23394 -81947 -143404 146154 -105336 -2703 129788 -94934 178332
18677B10345c48439I2792l2383i4171B10208a30949l37433a61316M204A7416b59668
$$ 210345 -348439 92792 60409 -94171 210208 -130949 -468382 -161316 -157112 17416 -259668
18665G9378l3966a2870k76650J26079O394B90259p1663C7001b8747j93053B34512
$$ 79378 45412 -12870 -289520 -163441 -157047 290259 218596 37001 -28747 -221800 234512
18653a30640M7735Q359J2294F6708J0034r229e79269a17370j04357M7599A62925
$$ -130640 -82905 -74546 -62252 66708 76742 67513 -579269 -117370 -221727 -174128 162925
18641C22048a24558N7030J7127B90244c30453I7387b47782A24650k3287L2068
$$ 322048 -124558 -67528 -50401 290244 -330453 97387 -247782 124650 101363 133431
18631A33431n0073g1485n3402I8490J20759a9295B30890r3650e1606j20342p2744
$$ 133431 83358 -71485 -124887 98490 219249 -19295 230890 137240 -51606 -171948 -244692
18620b44692I1510i816r011F1489c8789H8036b84770j43569B43425b19516A17234
$$ -244692 91510 -9816 -18827 61489 -38789 88036 -284770 -428339 243425 -219516 117234
18608I0063a29575a6114P808G6695A2014Q4947b37109A46015a87602A43319l3490
$$ 90063 -129575 -16114 -8306 76695 12014 96961 -237109 146015 -187602 143319 109829
18597A09829i4350M6000E8725j2572a59089j08355D8191J33125c4901j49167P9928
$$ 109829 -94350 -48350 58725 46153 -159089 -267444 48191 181316 -34901 -184068 -104140
18586a04140I9937j2433b5020C0134a15299M6276J5603o343j21972b5254m181
$$ -104140 99937 87504 -25020 30134 -115299 -69023 -53420 -59763 -181735 -25254 -29435
18575b9435B2086b96904J18987e0910j33072I5092c79346J74345A94429F1006
$$ -29435 22086 -296904 -177917 -50910 -183982 95092 -379346 -205001 194429 61006
18564B1640a17927A08016l0535R0865E1713Q0959h155C5082a82763k54872d5203
$$ 21640 -117927 108016 77481 168346 51713 132672 -8155 35082 -182763 -437635 -45203
18552B277J78293H2997d5026l11287B11053e4975A13752D0296c2039j63268M6584
$$ 2277 180570 82997 -45026 -356313 211053 -54975 113752 40296 -32039 -195307 -148723
18541a48723D0112c3529q7721q7795Q9166k76513C30244G4367A770M2959a74794
$$ -148723 40112 -33529 -121250 -209045 -119879 -396392 330244 74367 1770 44729 -174794
18529C62362D1819d4805j2401A68811B0895a7971m7706E99966A37786a02715l39147
$$ 362362 41819 -44805 -57206 168811 20895 -17971 -65677 599966 137786 -102715 -441862
18518d41862A15481b14254R7799d0227k0376k72418d3367B4421b54926J7580k9863
$$ -441862 115481 -214254 -116455 -40227 -60603 -333021 -43367 24421 -254926 -237346 -267209
18507b67209J32043B7278a90914m2911L6859E2077A4575c47028a52228O5868A57839
$$ -267209 -135166 27278 -190914 -233825 -196966 52077 14575 -347028 -152228 -86360 157839
18495a15777A60922G9808J60789f7506j10379g0541L1778k06216h2533k2968J0354
$$ -115777 160922 79808 240597 -67506 -177885 -70541 -38763 -244979 -82533 -105501 -95147
18484i5147p4461L0039j86076A45206a71190A07037c63842A99007a79951A5356
$$ -95147 -169608 -139569 -325645 145206 -171190 107037 -363842 199007 -179951 15356
18473h6116E371J13915E7951e3051k47237A34099a24314A2787h3409R837B1573
$$ -86116 5371 119286 57951 -53051 -300288 134099 -124314 12787 -83409 -73572 21573
18461C627a45497B87090a19965G6284a37042m1445B4859f754I5224a44631a2321
$$ 3627 -145497 287090 -119965 76284 -137042 -178487 24859 -6754 95224 -144631 -12321
18449a52425k07629D1827M0469b36570D8559i7497D7738f7760q2153j28021B01089
$$ -152425 -360054 41827 82296 -236570 48559 -97497 47738 -67760 -149913 -277934 201089
18437A89975Q4493A36500b23605C2094b51867d6595E2224M6959B2204i735l9797
$$ 189975 274468 136500 -223605 32094 -251867 -46595 52224 99183 22204 -9735 -49532
18426d9532j72383A63210A808R0221f4232E1169J29615d0828A29619J93446b22526
$$ -49532 -221915 163210 1808 92029 -64232 51169 180784 -40828 129619 323065 -222526
18414i3062j58982A1841g8l37770A84374a07579o3920f3465k09185A03621l2198
$$ -93062 -252044 11841 -78 -337848 184374 -107579 -171499 -63465 -272650 103621 71423
18403G1423b42687h4159R501k41306i9208M1520B18888a38499A04569N2685a11917
$$ 71423 -242687 -84159 -74658 -315964 -99208 -57688 218888 -138499 104569 157254 -111917
18391b51512b1188j56413P4736A36141N7983J48509I8659a91282D672c92772A80880
$$ -251512 -21188 -177601 -102865 136141 194124 342633 98659 -191282 4672 -392772 180880
18379c0564j90007h0681A54552E3517P2580b41149O8534F8361J23596H9835j1297
$$ -30564 -220571 -80681 154552 53517 126097 -241149 -172615 68361 191957 89835 78538
18368G8538A4733J42883a89997i0940M3220G55a23883M7159J8160J546B23594
$$ 78538 14733 157616 -189997 -90940 -47720 755 -123883 -76724 -58564 -57018 223594
18356a16713H1952B8421a68002A57438a03636R270k08676A12331b59396a3122
$$ -116713 81952 28421 -168002 157438 -103636 -94366 -303042 112331 -259396 -13122
18345b57071a03869B47028H9715d073k58928C655d9936j81971p22k89218g5091
$$ -257071 -103869 247028 89715 -4073 -263001 3655 -49936 -231907 -232629 -521847 -75091
18333a96040A26888L32427D6027c0638q9048E7019a78937I4747a83151B53362
$$ -196040 126888 459315 46027 -30638 -119686 57019 -178937 94747 -183151 253362
18322a64185O9587G4337N8751a17259C32672j53532b34891j1942A95883Q5884
$$ -164185 -94598 74337 133088 -117259 332672 179140 -234891 -246833 195883 281767
18312B81767A8274g4404G6427J12541A5684e7720K5058k19096H7196J2960J743
$$ 281767 18274 -74404 76427 188968 15684 -57720 -32662 -251758 87196 100156 101899
18301A01899a67364L4860B2121P5537k130m5613f5087H8137n823a5130o5729B2139
$$ 101899 -167364 -132504 22121 97658 95528 49915 -65087 88137 82314 -15130 -80859 22139
18288E5425b11705M3738f1248D95a08247j34481A86790c663r7048r839L4877J3742
$$ 55425 -211705 -167967 -61248 495 -108247 -242728 186790 -3663 -100711 -110550 -75673 -61931
18276f1931D38445j91311l9846B4651e5058j7002A40284C9101L5723c08089A86014
$$ -61931 438445 247134 207288 24651 -55058 -72060 140284 39101 74824 -308089 186014
18264H1367n167d5364k14821f0598k44977B18232a7024B48688d0081J6464F7125
$$ 81367 76200 -45364 -260185 -60598 -305575 218232 -17024 248688 -40081 -23617 67125
18252a43199N7829n8019B08472d5753I4784d4791B1548K21545J176j14934a66039
$$ -143199 -85370 -143389 208472 -45753 94784 -44791 21548 243093 244269 129335 -166039
18240g7154k4947R950q8005j2934K5879k31858A042b3794p2689M7680a4655j38940
$$ -77154 -102101 -92151 -180156 -193090 -167211 -399069 1042 -23794 -96483 -48803 -14655 -153595
18228a53595A00576a94743E7036a10814C8245b32289c4949l33370D4535a93508
$$ -153595 100576 -194743 57036 -110814 38245 -232289 -34949 -368319 44535 -193508
18217a06247i006j15946N8230k1573J5315B9854Q9183a73215b8768H7399g1116
$$ -106247 -9006 -124952 -66722 -88295 -72980 29854 119037 -173215 -28768 87399 -71116
18205D2004d6970j64893j24726A21283J02291r0221g5347E962a04868A04929k8599
$$ 42004 -46970 -211863 -336589 121283 223574 133353 -75347 5962 -104868 104929 76330
18194G6330C2060h3543B36113j15674e4603p389m8700j09990h8174O93K4179D1004
$$ 76330 32060 -83543 236113 120439 -54603 -61992 -110692 -220682 -88174 -87481 -63302 41004
18181c3098j76435L3022k2118B040a71625C40583K3044c06971N4258B99466q0091
$$ -33098 -209533 -176511 -198629 2040 -171625 340583 363627 -306971 -252713 299466 219375
18170B19375l2325E4139j1030a20430H4313a2286A96995f0157k3708C72320H3878
$$ 219375 187050 54139 43109 -120430 84313 -12286 196995 -60157 -83865 372320 83878
18158a20390p0840E2695D806e5652j06385J1053j35579f3062j02589I3846J27256
$$ -120390 -191230 52695 4806 -55652 -162037 -150984 -286563 -63062 -165651 93846 221102
18147B21102j08902c01005J16853j67315C42046e7752o8371B43619d11515A16420
$$ 221102 112200 -301005 -184152 -351467 342046 -57752 -126123 243619 -411515 116420
18136b9111A15799a87640I2667a79540b3616G2440A7026g6739h613B7519b09035
$$ -29111 115799 -187640 92667 -179540 -23616 72440 17026 -76739 -8613 27519 -209035
18124E0130b75246E9279P1434K47853A66131q1196J16092H105a54211O8275E3290
$$ 50130 -275246 59279 130713 378566 166131 84935 201027 8105 -154211 -85936 53290
18112b70464B7644g7932j90907C42645p9529j13413c7619a2016p7397A41111j5113
$$ -270464 27644 -77932 -268839 342645 263116 149703 -37619 -12016 -89413 141111 125998
18101A25998j8403B7648J10320c52525B95765b5583l8531j24510b8074o7230A93568
$$ 125998 107595 27648 137968 -352525 295765 -25583 -64114 -188624 -28074 -95304 193568
18089b19090A2319M0700b7360A41806K3498a26597E4976K24335a45665B83653
$$ -219090 12319 53019 -27360 141806 165304 -126597 54976 279311 -145665 283653
18078A95046a2832d265G077e890C49134d717j44456n1603I2453c66106K1949J45881
$$ 195046 -12832 -4265 7077 -5890 349134 -4717 -149173 -200776 92453 -366106 -344157 -198276
18066a98276O0417O5667L1463j95151A42862b55532e5721D1579k0695J1810L5043
$$ -198276 -137859 -72192 -40729 -235880 142862 -255532 -55721 41579 20884 32694 67737
18055F7737l1638b80620J32616A5695b16432D05955F7476J00002C070g5291e153
$$ 67737 36099 -280620 -148004 15695 -216432 405955 67476 167478 3070 -75291 -5153
18043B09364C4542N36839f5849A13388G22c5G128i7276A69530E1470a13422c7234
$$ 209364 34542 571381 -65849 113388 722 -35 7128 -97276 169530 51470 -113422 -37234
18030b80093Q5593C50712j20169n804q6119q147B440g7746A7543b47740A58444
$$ -280093 -194500 350712 230543 224739 138620 130473 2440 -77746 17543 -247740 158444
18018b14120E37693b74285f9150k45977b7891G4536b7344q9616Q31g467B17726
$$ -214120 537693 -274285 -69150 -315127 -27891 74536 -27344 -116960 -116129 -7467 217726
18006C11974a10689A09853h8767G024e2037E20815b08714C6221M7443R0476a58138
$$ 311974 -110689 109853 -88767 7024 -52037 520815 -208714 36221 83664 174140 -158138
17994b54081A41053J41008E763a6145p7238A92943F5222g1085A5254J99451Q2578
$$ -254081 141053 282061 5763 -16145 -93383 192943 65222 -71085 15254 214705 297283
17983B97283A35654Q773J23344l8649n0427d880m3161B4295a28186B01028c5531
$$ 297283 135654 144427 267771 229122 178695 -4880 -48041 24295 -128186 201028 -35531
17971a24138H3286a2666k5729A55788F764L52143A58825C1389L0925e7131A10952
$$ -124138 83286 -12666 -38395 155788 6764 358907 158825 31389 62314 -57131 110952
17959f2522C80881A05334A0685J88766M4515h645q5100A6850h687r3412D7001
$$ -62522 380881 105334 10685 199451 243966 -8645 -93745 16850 -8687 -102099 47001
17947C45166A20274i9062B8179c13306D2162O2695J88510A30301D3613a33078
$$ 345166 120274 -99062 28179 -313306 42162 104857 293367 130301 43613 -133078
17936a40340B50840f36B7013O7468O542f737A0441J32514F8816L0360k2423k2211
$$ -140340 250840 -636 27013 94481 101023 -6737 10441 142955 68816 99176 76753 54542
17924E4542J41382n2671L8639d9868k13632A85328M6411A13311d2338q3701l2985
$$ 54542 195924 143253 181892 -49868 -263500 185328 231739 113311 -42338 -126039 -159024
17913a59024A15440B3039c5819H7587c98979B28534B9532a63497P6732A36563
$$ -159024 115440 23039 -35819 87587 -398979 228534 29532 -163497 -86765 136563
17902a3996k8129B39038k8963I1342a6219A05561c8690n980r6162l3780k5744
$$ -13996 -42125 239038 210075 91342 -16219 105561 -38690 -44670 -140832 -174612 -200356
17891b00356A50428c44285B23216b91237B27342b14317e6820r7032D24614A72063
$$ -200356 150428 -344285 223216 -291237 227342 -214317 -56820 -153852 424614 172063
17880A64329h8629A52159a64505J3995d0537B65716O7368c9936j81006A07615
$$ 164329 -88629 152159 -164505 -150510 -40537 265716 333084 -39936 -220942 107615
17869c842A30758K88715G0383J55848b64081k0910F2800K16819j31205P5488n0841
$$ -3842 130758 419473 70383 226231 -264081 -284991 62800 279619 148414 223902 173061
17858A73061i6168a3906B1478d17160H4285B6732K72312a61815Q0005B8051d2348
$$ 173061 -96168 -13906 21478 -417160 84285 26732 299044 -161815 -81810 28051 -42348
17846i4821M1224B84991b26974A34456J27752F0001P560g3744A20494a09545j35895
$$ -94821 -53597 284991 -226974 134456 262208 60001 67561 -73744 120494 -109545 -245440
17835b45440G997J20720a81015q0709A26170K05981d4883F8345L16156b79457
$$ -245440 7997 128717 -181015 -261724 126170 332151 -44883 68345 384501 -279457
17824F7044c00735P5466A79870m9153i9154b1036E5901J36411k2322N8267r1259
$$ 67044 -300735 -225269 179870 130717 -99154 -21036 55901 192312 169990 228257 136998
17813A36998h1009B6150K85734B0779a2899E5624b9767p6620A55726a959j51257
$$ 136998 -81009 26150 311884 20779 -12899 55624 -29767 -106387 155726 -1959 -153216
17802a53216G6009J4943C5510J11583a36345C70215b1036F2103c49479H1661C5120
$$ -153216 76009 90952 35510 147093 -136345 370215 -21036 62103 -349479 81661 35120
17790g397A94741Q2188h005A80404J14620I5055O8040c00814B35576l0897a96613
$$ -7397 194741 276929 -8005 180404 295024 95055 163095 -300814 235576 204679 -196613
17778b00645l7525B40524o5128G4122K50844A26686a70378A19116N4729D1393
$$ -200645 -238170 240524 175396 74122 324966 126686 -170378 119116 173845 41393
17767B08709a89596B92201O339c3906L781H945J50297A4587N1664L8187J45521
$$ 208709 -189596 292201 298540 -33906 -30125 8945 159242 14587 66251 104438 249959
17756B49959k0347F8521a09591c7102G9633a94701P8230C38104j02173J87178
$$ 249959 229612 68521 -109591 -37102 79633 -194701 -116471 338104 235931 423109
17746D23109I9526b1765A28146l4275A8336K48969a14399a1B06367k1633J25177
$$ 423109 99526 -21765 128146 93871 18336 267305 -114399 -11 206367 184734 309911
17735C09911a11367A93149k9681g716A66448d7785A10739J45628M8847B9298K63431
$$ 309911 -111367 193149 163468 -7716 166448 -47785 110739 256367 305214 29298 292729
17724B92729d5944B12642F8117J57879E9774B2978d9524H1964L17685c1824C02475
$$ 292729 -45944 212642 68117 225996 59774 22978 -49524 81964 399649 -31824 302475
17712E9171A417J64451J6377H5267a89002B13804o9916g6015A21124J06137m8364
$$ 59171 1417 165868 182245 85267 -189002 213804 143888 -76015 121124 227261 178897
17701A78897c16996a1428G6559J82922I4677R2265l4995e2689A26686F698R7860
$$ 178897 -316996 -11428 76559 259481 94677 186942 151947 -52689 126686 6698 104558
17690A04558K34870F0628K12447J24565a97343B45980C2776K44152d3027C28819
$$ 104558 339428 60628 273075 397640 -197343 245980 32776 276928 -43027 328819
17679B33784r1095a50925B56865m8646I3154h4177B76023j11644b17262K2908
$$ 233784 142689 -150925 256865 208219 93154 -84177 276023 164379 -217262 -194354
17669a94354A03392A5705J19443F0229P9814J88761P3819k7964E2628c02622C3915
$$ -194354 103392 15705 135148 60229 140043 328804 402623 374659 52628 -302622 33915
17657a01012D51415k11468h7308A12452K47473A45270K41757G0834a89014B39651
$$ -101012 451415 239947 -87308 112452 359925 145270 387027 70834 -189014 239651
17646B60096a37064I4722g3468F7092J64691F9098A9038L03351J7013B4750J99724
$$ 260096 -137064 94722 -73468 67092 231783 69098 19038 322389 339402 24750 224474
17635B24474B0334a88569C09867P2786p827G1452c3675P110k14340H9067a33091
$$ 224474 20334 -188569 309867 382653 374826 71452 -33675 -26565 -240905 89067 -133091
17623A66448a49905k7834A70415k9964P6573p8006J52078c0648L236p2761A65164
$$ 166448 -149905 -177739 170415 140451 217024 139018 291096 -30648 -27412 -100173 165164
17611b2899B52252G0061a505D0633L12446q7290l2443F3058B3129J55145L56686
$$ -22899 252252 70061 -1505 40633 353079 265789 233346 63058 23129 178274 534960
17600E34960A6507a05074a6389A14747d1129B28990h8683a6787A36079Q466i4378
$$ 534960 16507 -105074 -16389 114747 -41129 228990 -88683 -16787 136079 144545 -94378
17588B11526J50793a26280q410E2138c7512A48563B9591K27617J74473k03142
$$ 211526 362319 -126280 -134690 52138 -37512 148563 29591 257208 431681 228539
17578B28539J5875a42567F3581J66982a79514f254A87810N7484F4568J43272J38483
$$ 228539 244414 -142567 63581 230563 -179514 -6254 187810 245294 64568 207840 346323
17567C46323C8752b19254B91885f1161A10932K19519E3179K74684j55889A4986
$$ 346323 38752 -219254 291885 -61161 110932 330451 53179 327863 171974 14986
17556E60133B49165n4379g3934B74045r1302p1648L7340J40320E9939L2518L82078
$$ 560133 249165 194786 -73934 274045 182743 111095 148435 288755 59939 92457 474535
17545D74535L1778B23828L17112A67674J3593L3713J18662E1950K61381A54729
$$ 474535 506313 223828 540940 167674 181267 214980 333642 51950 313331 154729
17534C39628A49709K31264a45232B61088J53233m656M7881O38936j10038M07883
$$ 339628 149709 380973 -145232 261088 414321 409665 457546 1096482 986444 1394327
17524A394327l84672J37078p455n45933R8028C05084J07751Q084m7818J67180
$$ 1394327 1009655 1146733 1139278 593345 691373 305084 412835 420919 373101 540281
17514E40281j9988O9967L60122l57131M33105k58932K59925l43744J58390j86886
$$ 540281 520293 590260 950382 593251 1026356 767424 1027349 683605 841995 655109
17504F55109j06672j42866j40415J07372M2617K2113j31902M4298p9744o9076
$$ 655109 548437 405571 265156 372528 415145 437258 305356 349654 269910 200834
17494B00834G5660N85326l01649d8913B52736J77897J22573A94633K09960m4848
$$ 200834 75660 660986 359337 -48913 252736 430633 553206 194633 404593 359745
17484C59745j08805P2382B771J08096K01375P8590l6568a6669E77012L5111B52304
$$ 359745 250940 323322 2771 110867 312242 390832 354264 -16669 577012 612123 252304
17472A82716M61249j90626j70694L84320A1650L52115m7218O4735A04881L71428
$$ 182716 643965 453339 282645 666965 11650 363765 316547 381282 104881 476309
17462D76309k25935J75360E826M54081B16516J70120j07449J08422E6154K37892
$$ 476309 250374 425734 5826 459907 216516 386636 279187 387609 56154 294046
17452B94046Q0j34183J35922q5930J25589j51266J17186K7893J30623j10367R3897
$$ 294046 294126 159943 295865 209935 335524 184258 301444 329337 459960 349593 443490
17441D43490j09581K76081J0637B71670j00511R0322j15410K58819m3521J14039
$$ 443490 333909 609990 620627 271670 171159 261481 146071 404890 361369 475408
17431D75408J31758F7332K46121A55000L81202A86708J76873i6353C05781J22170
$$ 475408 607166 67332 313453 155000 536202 186708 363581 -96353 305781 427951
17421D27951q1609n5905k2006M00140k57336k9728p6946J12854J24171j9430j92726
$$ 427951 346342 290437 268431 668571 411235 381507 304561 417415 541586 522156 329430
17410C29430J00067A85673L70695p2962E0607P64587B47590I3945m2173O1119
$$ 329430 429497 185673 556368 483406 50607 815194 247590 93945 51772 112891
17400A12891M3539D7440L49002K90498F620M2172L4320K25025A19238K79452j87515
$$ 112891 156430 47440 396442 686940 6620 48792 83112 308137 119238 398690 211175
17389B11175J67398J46812n0464M149B19716r590J65802j85587J65785l2409R6479
$$ 211175 378573 525385 474921 479070 219716 210126 375928 190341 356126 323717 420196
17378D20196j35274J20603q9100K98868A7124K62127K50226J21801A77580a4908
$$ 420196 284922 405525 316425 615293 17124 279251 529477 651278 177580 -14908
17367A43416J95919H6865J47076p8391b8093B54808J36959n8814J26201N548k05947
$$ 143416 339335 86865 233941 155550 -28093 254808 391767 332953 459154 464702 258755
17356B58755n8743J90740r6602e2828B97623q9212J4372L7901H4682j9643K61535
$$ 258755 200012 390752 294150 -52828 297623 208411 222783 260684 84682 65039 326574
17345C26574P6402j96528J51326K25532A02064Q9757J38196H8107J90797K42292
$$ 326574 402976 206448 357774 583306 102064 191821 330017 88107 278904 521196
17335E21196I5868J34752L12391f326H1297L59175b6934D57555B26093b25567
$$ 521196 95868 230620 543011 -6326 81297 440472 -26934 457555 226093 -225567
17324H3052M82536A63352M6934P2183J83052J04568c7351D78901A93779J84385
$$ 83052 565588 163352 210286 282469 465521 570089 -37351 478901 193779 378164
17314C78164K16499l7022B07140O4237K75386p5517I5548K03615J43925j05284
$$ 378164 594663 557641 207140 271377 546763 471246 95548 299163 443088 337804
17304C37804j12931P7094J32776k4171p5849L25458j79245r6625j32259K87092
$$ 337804 224873 301967 434743 410572 334723 660181 480936 384311 252052 539144
17294E39144B50874J25767O9832K9778q0702L09998l32361L75816k56433F3367
$$ 539144 250874 376641 446473 476251 395549 705547 373186 749002 492569 63367
17283C40994j35372p2934L79917B21217M01537j59659j14546J88092A87957J62726
$$ 340994 205622 132688 512605 221217 622754 463095 348549 536641 187957 350683
17273C50683M5002a41381A80834J26686p1135J77810N9560c0863B88892K33184
$$ 350683 395685 -141381 180834 307520 236385 414195 473755 -30863 288892 522076
17263E22076j31904J5312k7180j00949F3782L81733j8548J27808j84982J8738
$$ 522076 390172 405484 378304 277355 63782 445515 426967 554775 369793 388531
17253C88531J99680k71876L41643C18841p79R3194j91345J59475c04865D48122
$$ 388531 588211 316335 657978 318841 318062 411256 219911 379386 -304865 448122
17242D99047j87592m2890K49049m5043O8010B65608J04811Q9367k1063j03032
$$ 499047 311455 268565 517614 472571 540581 265608 370419 459786 438723 335691
17232C35691P9918i2838E59865A16884L15487j01622O5196K558L46245j35657
$$ 335691 415609 -92838 559865 116884 432371 330749 395945 398503 744748 609091
17222F09091o6240J20976k12464k23381L49689k23548Q0112A27088M47701A51354
$$ 609091 542851 663827 451363 227982 577671 354123 434235 127088 574789 151354
17211D19567K3060A88888M04757l964j54989j22425J0549J33818j4133M0331R7980
$$ 419567 442627 188888 593645 589681 434692 312267 322816 456634 442501 482832 580812
17200E80812B22022K28760r9890A60831N02793k59679j6974J32668p9029j5837
$$ 580812 222022 450782 350892 160831 663624 403945 386971 519639 440610 424773
17190D24773L41755B87551K61756A72118M3850R5002J83060k33198M22959k12159
$$ 424773 766528 287551 549307 172118 215968 310970 494030 260832 683791 471632
17180D71632K35561k57564A15633O89484l83313J71717A99003M88176k46677J50232
$$ 471632 707193 449629 115633 805117 421804 593521 199003 687179 440502 590734
17170E90734j08089o5445J2644A31484N07324p3728j13500L23876l45690K53773
$$ 590734 482645 417200 429844 131484 638808 565080 451580 775456 429766 683539
17160F83539J9994j72581K24246j43487m0765J40552J78441l45044j7934K88726
$$ 683539 703533 530952 755198 611711 570946 711498 889939 544895 526961 815687
17150H15687P6110o5496j30761o0724p3558k60455Q34016m00323k0743C10282
$$ 815687 891797 826301 695540 634816 561258 300803 1134819 734496 713753 310282
17139E96652K25426l11948O9767L5081n6523k01906P918J09198M45308N7209l40569
$$ 596652 822078 510130 579897 614978 558455 356549 364467 473665 918973 976182 635613
17128F35613L54772l99697j13314K11851K03632J93636D55470J05998J60588k29987
$$ 635613 990385 590688 477374 689225 892857 1086493 455470 561468 722056 492069
17118D92069J19690k3387Q5147O1487K12832j59412q7283J20468j80389o1321
$$ 492069 611759 588372 673519 735006 947838 788426 701143 821611 641222 579901
17108E79901O7213J21364k8539J53735j85985j40252A4185P65737L402j25344
$$ 579901 647114 768478 739939 893674 707689 567437 14185 779922 783324 657980
17098F57980L74435m29755Q4557J94086J85306n22929J4058N417L91619M7750
$$ 657980 1032415 602660 687217 881303 1066609 543680 557738 563155 954774 1002524
17088A002524k38734N9061J80620n6294j85687l8712J25550K39965j71401j60921
$$ 1002524 763790 822851 1003471 947177 761490 722778 848328 1088293 916892 755971
17078G55971K9758r570N8596J62543k32163J18202L2958J29864r5762k84976L99432
$$ 755971 785729 776159 834755 997298 765135 883337 916295 1046159 950397 665421 1064853
17067A064853l15224J45108j15670K39888k72095M94352l26524P7563j66126K11876
$$ 1064853 749629 894737 779067 1018955 746860 1241212 914688 992251 826125 1038001
17057A038001N5541R1207l86803L37500o262J05718j26375n50351M39795j81230
$$ 1038001 1093542 1184749 797946 1135446 1129184 1234902 1108527 558176 997971 816741
17047H16741N4670R7336j45321K47748K85490j16030m3285q0195R0428N6390k13793
$$ 816741 871411 968747 823426 1071174 1356664 1240634 1197349 1117154 1207582 1263972 1050179
17036A050179q6546J54059l2770n8486n6232j44680N10063q5696j54272K00639
$$ 1050179 963633 1117692 1084922 1026436 970204 825524 1335587 1249891 1095619 1296258
17026A296258m81141J29116N1876j2454o2599J15967K7695O9899J63886J30781
$$ 1296258 815117 944233 996109 983655 921056 1037023 1064718 1134617 1298503 1429284
17016A429284R3763l07854k5102Q0404J32032m1877J27858j54928n5246j78072
$$ 1429284 1523047 1215193 1190091 1270495 1402527 1360650 1488508 1333580 1278334 1100262
17006A100262L99364N1836k05363K4627L22k44103M53831p6625J67627l71386
$$ 1100262 1499626 1551462 1346099 1370726 1371048 1126945 1580776 1504151 1671778 1300392
16996A300392J46668R996R799J60709k04159M65264m61776K5181j28897P5511
$$ 1300392 1447060 1457056 1466855 1627564 1423405 1888669 1426893 1452074 1323177 1398688
16986A398688J86399j09294K51709p155o9231j63315k3354M1235j59735K59747
$$ 1398688 1585087 1475793 1727502 1720347 1651116 1487801 1464447 1505682 1345947 1605694
16976A605694Q6071j63003q6546J95660k59851M54230j86522j94309K58729k63956
$$ 1605694 1691765 1528762 1442216 1637876 1378025 1832255 1645733 1451424 1710153 1446197
16966A446197L77749M7457k1803p6234J27476K74933k18803l7526Q5129l89788
$$ 1446197 1823946 1871403 1849600 1773366 1900842 2175775 1956972 1919446 2004575 1614787
16956A614787L19096J47588k08691L9889J90191J05948l64338J88553j39460Q5175
$$ 1614787 1933883 2081471 1872780 1912669 2102860 2208808 1844470 2033023 1893563 1978738
16946A978738J02615J79484k85501j32836J33670J51434j8819K14269k2429k74875
$$ 1978738 2081353 2260837 1975336 1842500 1976170 2127604 2108785 2323054 2300625 2025750
16936B025750N55596J0579l89432J28245P25139q62886K82073J20509j76416M45222
$$ 2025750 2581346 2591925 2202493 2330738 3055877 2192991 2475064 2595573 2419157 2864379
16926B864379o38993M14267l87265O91153l80721j12239L05421k6327P0040M7214
$$ 2864379 2225386 2639653 2252388 2943541 2562820 2450581 2756002 2729675 2799715 2846929
16916B846929m8888K00337k18796K02068j06368j37229K92038O5079J19571k98335
$$ 2846929 2798041 2998378 2779582 2981650 2875282 2738053 3030091 3095170 3214741 2916406
16906B916406M6188K71942j16007P6773j89248J90453q9977K57743m06836M89973
$$ 2916406 2962594 3234536 3118529 3195302 3006054 3196507 3106530 3364273 2957437 3447410
16896C447410K04227n76201L19324K43876O5184J56427j42114j79901K33034p1998
$$ 3447410 3651637 3075436 3394760 3638636 3703820 3860247 3718133 3538232 3771266 3699268
16886C699268L60969n1682k00452L5093Q3723q9831M490J12333R288M33614m9521
$$ 3699268 4060237 4008555 3808103 3843196 3926919 3837088 3841578 3953911 3963199 4396813 4347292
16875D347292O0087r1224k579P7329Q963R3102O38985m43176l1141M7931J58208
$$ 4347292 4407379 4316155 4313576 4390905 4399868 4492970 5131955 4688779 4657638 4705569 4863777
16864D863777J60092K80074j58007K14270n6387L78727j23774j96198J19384K22093
$$ 4863777 5023869 5303943 5145936 5360206 5303819 5682546 5558772 5362574 5481958 5704051
16854E704051k54030N72661r9021L32846j33868N6266j19928N47020j40138q2544
$$ 5704051 5450021 6022682 5923661 6256507 6122639 6178905 6058977 6605997 6465859 6383315
16844F383315L01408k7894R7036Q25218p28239J23508Q12638m91378j12549O12000
$$ 6383315 6684723 6656829 6753865 7579083 6850844 6974352 7786990 7295612 7183063 7795063
16834G795063j26188K87866m4962J26584L16382r3027L89220K32244J45339j56770
$$ 7795063 7668875 7956741 7911779 8038363 8354745 8261718 8650938 8883182 9028521 8871751
16824H871751J25112N71782j71921L44219o270N08535j42927r6235K88122N30441
$$ 8871751 8996863 9568645 9396724 9740943 9734673 10243208 10100281 10004046 10292168 10822609
16814A0822609P4203L12997L17504K86142K89410k55162L00785L30557P6409O58474
$$ 10822609 10896812 11209809 11527313 11813455 12102865 11847703 12148488 12479045 12555454 13213928
16804A3213928L9803J76006O43699j24690O45049L60872J43865N94129j04402
$$ 13213928 13253731 13429737 14073436 13948746 14593795 14954667 15098532 15692661 15588259
16795A5588259M48394L41168O81177L5677P85585K85595M58323K71091M84643
$$ 15588259 16036653 16377821 17058998 17094675 17880260 18165855 18624178 18895269 19379912
16786A9379912j2731J102930L65543N76814N25884Q09334O6054Q23859O71587
$$ 19379912 19367181 20470111 20835654 21412468 21938352 22747686 22813740 23637599 24309186
16777B4309186Q38540M52677Q30828R68537M71656Q74741P99422O78700J002757
$$ 24309186 25147726 25600403 26431231 27399768 27871424 28746165 29545587 30224287 31227044
16768C1227044R97680Q96944R91245J045729R77581J154851J112945J410579J001010
$$ 31227044 32224724 33121668 34112913 35158642 36136223 37291074 38404019 39814598 40815608
16759D0815608J201210J468378J538910J604026Q88636J836089J578510J757910
$$ 40815608 42016818 43485196 45024106 46628132 47516768 49352857 50931367 52689277
16751E2689277J508022J789204J404359J978355K019861J656250K215539K248714
$$ 52689277 54197299 55986503 57390862 59369217 61389078 63045328 65260867 67509581
16743F7509581J669262K162942K281920J936604K356207J767246K354838K102680
$$ 67509581 69178843 71341785 73623705 75560309 77916516 79683762 82038600 84141280
16735H4141280K357976J900045J878827K359596J750600J649101J680085J609211
$$ 84141280 86499256 88399301 90278128 92637724 94388324 96037425 97717510 99326721
16727I9326721J661866J100470R84119N51477J018077L06259J22868L67878r8014
$$ 99326721 100988587 102089057 103073176 103624653 104642730 104948989 105071857 105439735 105341721
16718A05341721o78110k72819j079297j269410p08210j360327j477567j553788
$$ 105341721 104663611 104390792 103311495 102042085 101333875 99973548 98495981 96942193
16710I6942193j977045j637363k038449k129544j486388k439901k130866k171744
$$ 96942193 94965148 93327785 91289336 89159792 87673404 85233503 83102637 80930893
16702H0930893k283676k231722k148272k089473k376321k443680j763231j950691
$$ 80930893 78647217 76415495 74267223 72177750 69801429 67357749 65594518 63643827
16694F3643827j560428k376136j604188k321946j608112j521625j440929j529751
$$ 63643827 62083399 59707263 58103075 55781129 54173017 52651392 51210463 49680712
16686D9680712j999430j317170j404940j960171j342584j060606j094552j163708
$$ 49680712 47681282 46364112 44959172 42999001 41656417 40595811 39501259 38337551
16678C8337551j340647j086710j067082j115848j214997j031824q18760o58084
$$ 38337551 36996904 35910194 34843112 33727264 32512267 31480443 30661683 30003599
16670C0003599j035527o43589p86928j051064m47091r34004m71824o89125q05130
$$ 30003599 28968072 28324483 27537555 26486491 26039400 25105396 24633572 23944447 23139317
16661B3139317n19828m18374p91131n78191m45558m70734p19178l26595m85332
$$ 23139317 22619489 22201115 21409984 20831793 20386235 19915501 19196323 18869728 18384396
16652A8384396n21933n05545n36129N118n86911k76152k59219n90836l78168j6281
$$ 18384396 17862463 17356918 16820789 16825907 16238996 15962844 15703625 15112789 14734621 14718340
16642A4718340n90103j02335p47407l99472n1122j66215n80143J41435m80692
$$ 14718340 14128237 14025902 13278495 12879023 12827901 12661686 12081543 12222978 11742286
16633A1742286R8114n35567m2694o13263K42812n11127q6946J00517l68284l46136
$$ 11742286 11840400 11304833 11262139 10648876 10891688 10380561 10293615 10394132 10025848 9679712
16623I679712Q1813j80420k83158l88521k06988o0279J00670l62717l33581l4928
$$ 9679712 9761525 9581105 9297947 8909426 8702438 8642159 8742829 8380112 8046531 8011603
16613H011603r8186P8070j56070k52514L38527p79042L60855j66415o43386L58401
$$ 8011603 7913417 7991487 7835417 7582903 7921430 7142388 7503243 7336828 6693442 7051843
16603G051843k77271N6545m52180j48888O0261N4296n29722P6177J01761L48096
$$ 7051843 6774572 6831117 6378937 6230049 6290310 6344606 5814884 5891061 5992822 6340918
16593F340918m34281j22660k21908m8775O8747q0168m70576L13283o52396N20807
$$ 6340918 5906637 5783977 5562069 5513294 5582041 5501873 5031297 5344580 4692184 5212991
16583E212991l09792j67227J52354j36301m3809j63548J1964p813L81140p17035
$$ 5212991 4903199 4735972 4888326 4752025 4708216 4544668 4556632 4548819 4929959 4212924
16573D212924j18621J66409l9062J83380k99368J44555j91385j11078m4381j98825
$$ 4212924 4094303 4260712 4221650 4405030 4105662 4250217 4058832 3947754 3903373 3704548
16563C704548k25729L57797l05054M67309m76341K70384l13821K05669k86628
$$ 3704548 3478819 3836616 3531562 3998871 3522530 3792914 3479093 3684762 3398134
16554C398134J05745j18629L7134K9825j33917m9481m05840J28065O8573K32433
$$ 3398134 3503879 3385250 3422384 3452209 3318292 3268811 2862971 2991036 3059609 3292042
16544C292042l27264j80946K74642R6392j63907k12201K37006k1970j82065l18014
$$ 3292042 2964778 2783832 3058474 3154866 2990959 2778758 3015764 2993794 2811729 2493715
16534B493715J8537J75860m9699K21782j97332r2533k90665K44601K87637j8535
$$ 2493715 2512252 2688112 2638413 2860195 2662863 2570330 2279665 2524266 2811903 2793368
16524B793368m74083J51917j26992r111J78322m07332M34852l25860K31164j78824
$$ 2793368 2319285 2471202 2344210 2335099 2513421 2106089 2540941 2215081 2446245 2267421
16514B267421M6570L6645k49876L16083l10589J29371j33874N4080m4921K2698
$$ 2267421 2313991 2350636 2100760 2416843 2106254 2235625 2101751 2155831 2110910 2133608
16504B133608O3629n7551j15574j72918L48760m43067K35970L8600p0030j34392
$$ 2133608 2197237 2139686 2024112 1851194 2199954 1756887 1992857 2031457 1961427 1827035
16494A827035n9135J00361p5569J08256j55970J77834Q3186j47375j56937O2481
$$ 1827035 1767900 1868261 1792692 1900948 1744978 1922812 2005998 1858623 1701686 1764167
16484A764167j75413r273K27335j35739J85823k46183j36035N14504p47882j27649
$$ 1764167 1588754 1579481 1806816 1671077 1856900 1610717 1474682 1989186 1241304 1113655
16474A113655M27501j07224j36006L50276o3754K11759l72607l07037J97966l45820
$$ 1113655 1541156 1433932 1297926 1648202 1584448 1796207 1423600 1116563 1314529 968709
16464I68709O7567J92728P9869K82577j64475j53614N1462K2390r6468K60581
$$ 968709 1036276 1229004 1308873 1591450 1426975 1273361 1324823 1347213 1250745 1511326
16454A511326l40757K25239k72908R6123p8487n894P8537K87699l3015l28935
$$ 1511326 1170569 1395808 1122900 1219023 1140536 1134642 1213179 1500878 1467863 1138928
16444A138928L35635k17856k50370K0198M6836J54270P3374J08561k43136o1833
$$ 1138928 1474563 1256707 1006337 1026535 1073371 1227641 1301015 1409576 1166440 1104607
16434A104607P7345j10704j00011J39873K89165l64853J73078k23590k22480K02428
$$ 1104607 1181952 1071248 971237 1111110 1400275 1035422 1208500 984910 762430 964858
16424I64858P9042K12375j88895l7313l02532M02288j80757N1350L21254l23378
$$ 964858 1043900 1256275 1067380 1030067 727535 1129823 949066 1000416 1321670 998292
16414I98292m1468K33199j92162k23407J32552J73955m12909N77571n32822J29969
$$ 998292 956824 1190023 997861 774454 907006 1080961 668052 1245623 712801 842770
16404H42770q5052m6934J58180O165j26356M92552P9182l13290l1969l5904R3988
$$ 842770 757718 710784 868964 875129 748773 1241325 1320507 1007217 975248 939344 1033332
16393A033332m51307n9566L71512l99148M42156D26128N04358q3347Q2802k11855
$$ 1033332 582025 522459 893971 494823 936979 426128 930486 847139 929941 718086
16383G18086J00226L67863D90157N06094j57200l96563M88108l94388M33078p9596
$$ 718086 818312 1186175 490157 996251 839051 442488 930596 536208 969286 889690
16373H89690O8664j28658K8361l37508M21546D67616J45901k2889K74667k49525
$$ 889690 958354 829696 858057 520549 942095 467616 613517 590628 865295 615770
16363F15770L16526C94459K52704P42q6381K35912k03952k11930p2374P03626
$$ 615770 932296 394459 647163 647905 561524 797436 593484 381554 309180 1012806
16353A012806k50555L1727p4899l9745j66576N50222m05891J06584l32494L69316
$$ 1012806 762251 793978 719079 679334 512758 1062980 657089 763673 431179 800495
16343H00495k94990J44850k8230k14359K26863L9653k57984N19173l27941j9170
$$ 800495 505505 650355 622125 407766 634629 674282 416298 935471 607530 588360
16333E88360K8580k02240J26583J03623k78455j58865M58021n0032r7193k5825
$$ 588360 616940 414700 541283 644906 366451 207586 665607 615575 518382 492557
16323D92557L2910K02658k30030J15061k57356J47802B48370J96687K82251k20564
$$ 492557 525467 728125 498095 613156 355800 503602 248370 445057 727308 506744
16313E06744J76999k39616J28650l2505J10474j98149J51721k02489L23935j79519
$$ 506744 683743 444127 572777 540272 650746 452597 604318 401829 725764 546245
16303E46245J8318q2135J5198J10751J38069j83128A55092L92566j24471L43012
$$ 546245 564563 482428 497626 608377 746446 563318 155092 547658 423187 766199
16293G66199k82606B05663L33819J43263p2756m1540k41608O7809j6007K15343
$$ 766199 483593 205663 539482 682745 609989 568449 326841 394650 378643 593986
16283E93986o2555p5304j45447R6808K3944j15990M03454j59008j35410A28463
$$ 593986 531431 456127 310680 407488 431432 315442 718896 559888 424478 128463
16272F5333J79405J08954J19794A47810b0040A52295K51099p3243A43997L49570
$$ 65333 244738 353692 473486 147810 -20040 152295 403394 330151 143997 493567
16262D93567j47684j49484M1522P5009j7579j30953K93521J35410k62122j29293
$$ 493567 345883 196399 237921 312930 295351 164398 457919 593329 331207 201914
16252B01914Q9156L85367n511a10235F15132B73903K47753E9042L45427m0575
$$ 201914 291070 676437 670926 -110235 615132 273903 521656 59042 404469 363894
16242C63894o0107L21528k8238l8559k39657L1987j41534R785q8554K2424K00235
$$ 363894 303787 625315 597077 558518 318861 350848 209314 219099 130545 152969 353204
16231C53204j59751K73995q2764l6004j9900R9620J25359A89145E8486J45308
$$ 353204 193453 467448 384684 348680 328780 428400 553759 189145 58486 203794
16221B03794j6624b911B43036K20386A03490J23220J11511j31814J56710A44431
$$ 203794 187170 -2911 243036 463422 103490 226710 338221 206407 363117 144431
16210B35272J09183c00099A81043J17493P4095j8713j19333Q1309j04776M03701
$$ 235272 344455 -300099 181043 298536 372631 353918 234585 315894 211118 614819
16200F14819C01197B5577M63954A70422n9569J40911A17107K20720j16076o347
$$ 614819 301197 25577 489531 170422 110853 251764 117107 337827 221751 215404
16190B15404J55582M4410n4617j12417K83318I8930b60845F4938O44107B19500
$$ 215404 370986 415396 360779 248362 531680 98930 -260845 64938 709045 219500
16179C66229m7552A18959n1837J59944m515r6650J52157A07009P2217K17277p1877
$$ 366229 318677 118959 67122 227066 222551 125901 278058 107009 179226 396503 324626
16168C24626A36168K80840j67361J67638E7522g9161B20125K50927a5972D08648
$$ 324626 136168 417008 249647 417285 57522 -79161 220125 471052 -15972 408648
16157A24785K51493C423N37492a36186D21559A59983N8047Q9811K97625r6531
$$ 124785 376278 3423 540915 -136186 421559 159983 218030 307841 605466 508935
16147E08935k48645K7061B6586R7259Q7885e6062A87435M4647K57751D3196Q5706
$$ 508935 260290 287351 26586 123845 211730 -56062 187435 232082 489833 43196 128902
16136A28902Q8487N5776g670B53487Q5571j58242K65003B1201K54963K38143A94683
$$ 128902 217389 273165 -7670 253487 339058 180816 445819 21201 276164 514307 194683
16124A40630K14177A31259P9550p2547R7815p5558K23762A08674b18534D42060
$$ 140630 354807 131259 210809 138262 236077 160519 384281 108674 -218534 442060
16113F8239a4236k37773B39741L816l4171m8314a41j55402A08765J03340j4498
$$ 68239 -14236 -252009 239741 243557 209386 161072 -141 -155543 108765 212105 197607
16102A97607Q087L8721j06721M9127K00186j5657j81235N217M5965j04291n5247
$$ 197607 205694 244415 137694 186821 387007 371350 190115 195332 241297 137006 81759
16091H1759b3000A39337C288K00481n7519L5419K7382l1888f954B52221K01473
$$ 81759 -23000 139337 3288 203769 146250 181669 209051 177163 -6954 252221 453694
16080D53694A18301j1618a1612p584j2049B62347J15859h5937a4428G8270J1284
$$ 453694 118301 106683 -11612 -19196 -31245 262347 378206 -85937 -14428 78270 89554
16069H9554b43162A20277B5110K08271a37973B31927C1543e8369I0115i4097B24650
$$ 89554 -243162 120277 25110 233381 -137973 231927 31543 -58369 90115 -94097 224650
16057d6162B47230A06850G474O3634d0719A33201J63943G8839Q8172b79296A17053
$$ -46162 247230 106850 7474 71108 -40719 133201 297144 78839 167011 -279296 117053
16045A55409K40059j46365a14716C65269I7279a12408B03794a02683l413L4680
$$ 155409 395468 249103 -114716 365269 97279 -112408 203794 -102683 -106096 -71416
16035g1416K2722D72828i0488A09257f5905I1710L3729b6279F3917d3510j0357
$$ -71416 -48694 472828 -90488 109257 -65905 91710 125439 -26279 63917 -43510 -53867
16024e3867H8039J32219A03781D8835P1278d7414n1087g455p2603l9201e4383
$$ -53867 88039 220258 103781 48835 120113 -47414 -98501 -7455 -80058 -119259 -54383
16012a45052A03221b05511r187e8268j93624k4117A56031M776J52389a0158l82985
$$ -145052 103221 -205511 -214698 -58268 -251892 -276009 156031 160807 313196 -10158 -393143
16001c93143F2569E135b88704A42902b98227A63159q255J25642I7753b2063p7679
$$ -393143 62569 5135 -288704 142902 -298227 163159 154904 280546 97753 -22063 -99742
15990i9742C00507j24159J62510L40231L50342J92907K50743j78643n53897k0106
$$ -99742 300507 176348 338858 679089 1029431 1222338 1473081 1294438 740541 720435
15980G20435C05824C2402K42398F6895J0118K32988a09321C31185A36638d143
$$ 720435 305824 32402 274800 66895 77013 310001 -109321 331185 136638 -4143
15969A12851f1886F166J25460b20665B84110k0239L4332a29682B94898E7584Q8570
$$ 112851 -61886 6166 131626 -220665 284110 263871 298203 -129682 294898 57584 146154
15958A46154b35499G3470j4201a7173j1236A72129D5008c02238E29165d0359C4808
$$ 146154 -235499 73470 59269 -17173 -28409 172129 45008 -302238 529165 -40359 34808
15946b55121F5197M653M2336A4782J62236G4090P4133b34031h078k5502h030B37480
$$ -255121 65197 69850 112186 14782 177018 74090 148223 -234031 -8078 -33580 -8030 237480
15933B42627F2059M1325b18596j42391B39019p1192i129k47285a9215n1103k3942
$$ 242627 62059 103384 -218596 -360987 239019 167827 -9129 -256414 -19215 -70318 -94260
15922i4260B99785b5180C38113j58856M4552f4458j65083A58937d9714Q971A69105
$$ -94260 299785 -25180 338113 179257 223809 -64458 -229541 158937 -49714 -40743 169105
15910G7386c0772C827J28164J46294H7958J63205R0547A065c4978j93784L7808
$$ 77386 -30772 3827 131991 278285 87958 251163 341710 1065 -34978 -228762 -190954
15899a90954g0774j98868F433J00617E0470a90414A66645b92666D3737i4274j45849
$$ -190954 -70774 -269642 6433 107050 50470 -190414 166645 -292666 43737 -94274 -240123
15888b40123d0663C8648M32882b0202A31165D4276J45043b7756D5566Q9913L26185
$$ -240123 -40663 38648 471530 -20202 131165 44276 189319 -27756 45566 135479 461664
15877D61664c3720A41422d6194k80579I3309K19745B6847N0944g879C8517K3511
$$ 461664 -33720 141422 -46194 -326773 93309 313054 26847 77791 -7879 38517 62028
15866F2028K21629a04487d1612A00444R0075D9526J02636l8421E3685b56101A95685
$$ 62028 283657 -104487 -41612 100444 190519 49526 152162 113741 53685 -256101 195685
15854f9877H2670N5964a20144B10125N9161a13820o6248E9222J14612G4311M5695
$$ -69877 82670 138634 -120144 210125 269286 -113820 -180068 59222 173834 74311 120006
15843A20006O791N8883g8147J1237I4869L79437G9246L1647f1142A36538a46824
$$ 120006 126797 185680 -78147 -66910 94869 474306 79246 110893 -61142 136538 -146824
15831i5355K8344b6345I921L19814A51944J32895C4832a15549n7530c905B43038
$$ -95355 -67011 -26345 9921 329735 151944 284839 34832 -115549 -173079 -3905 243038
15819a72850P4692D8163K50022j45521a63069P5811j0459B23921h5648I8967c7602
$$ -172850 -98158 48163 298185 152664 -163069 -87258 -97717 223921 -85648 98967 -37602
15807c6268j57091a0096q5856E2988J28231J68634A19827a00029K966G7282g5470
$$ -36268 -193359 -10096 -95952 52988 181219 349853 119827 -100029 -97063 77282 -75470
15795e9472l5403j35281j5727J20652G0657L01063I1143D0245K53848a53886B79264
$$ -59472 -94875 -230156 -245883 -125231 70657 371720 91143 40245 294093 -153886 279264
15783A16663a86425K8445j6752B85369b59372A27505d9787C07954p2804e8099
$$ 116663 -186425 -157980 -174732 285369 -259372 127505 -49787 307954 235150 -58099
15772a49371O9202B79524A31967D1647m518K2813d3382r4453A5951b55484J27044
$$ -149371 -80169 279524 131967 41647 37129 59942 -43382 -137835 15951 -255484 -128440
15761a28440j98332I7567a68371E16497A09956N9351k9624A2542K8559j743J23879
$$ -128440 -326772 97567 -168371 516497 109956 169307 139683 12542 41101 39358 163237
15750A63237B1009n716J64946F5998J85254d3184B81154b86427a12378k59859
$$ 163237 21009 15293 180239 65998 251252 -43184 281154 -286427 -112378 -372237
15740c72237b1818A25094n419A3947l587e7234j35059C92835G7541J97618m0409
$$ -372237 -21818 125094 119675 13947 10360 -57234 -192293 392835 77541 275159 234750
15729B34750d53911d8140a8898A99209b49734P6564p7370A33611i0684J2272B43051
$$ 234750 -453911 -48140 -18898 199209 -249734 -173170 -250540 133611 -90684 -78412 243051
15717b2157C4245a26742J4866L7602A36983B0997g5413j17533F0572g1917o8773
$$ -22157 34245 -126742 -111876 -74274 136983 20997 -75413 -192946 60572 -71917 -140690
15706a40690A10594b88298H3272J81194k5565b89608G3381J1417R6546o7678i1116
$$ -140690 110594 -288298 83272 264466 238901 -289608 73381 84798 181344 113666 -91116
15694i5494j19545B73410H7150i4708K4113H0633b313j57761N1993A86709a1762
$$ -95494 -215039 273410 87150 -94708 -70595 80633 -2313 -160074 -108081 186709 -11762
15682e1624k43789A64156J4353m2501l3922O5390A9396O3073a08939L1683j04687
$$ -51624 -295413 164156 178509 136008 102086 167476 19396 82469 -108939 -77256 -181943
15671a81943A11581J34693d5972n5988I0955g8131k1221L1603j88643q5470E6306
$$ -181943 111581 246274 -45972 -101960 90955 -78131 -99352 -67749 -256392 -341862 56306
15659C3576b91103A67207a77019M4980A27222E3785a25858j131M354J2912o6076
$$ 33576 -291103 167207 -177019 -132039 127222 53785 -125858 -126989 -122635 -109723 -175799
15648a75799G4594R4634C4126J29218p042M1805b6119A83999a40753C4549J23801
$$ -175799 74594 169228 34126 163344 156302 198107 -26119 183999 -140753 34549 158350
15637A58350j8599a85851D28014G6846f3609A76371a74445h0968A47416c6793
$$ 158350 139751 -185851 428014 76846 -63609 176371 -174445 -80968 147416 -36793
15626G8466K05695a47934A82019H0234B5951J84629q7411g1215j3260m0269c7957
$$ 78466 284161 -147934 182019 80234 25951 210580 123169 -71215 -84475 -124744 -37957
15614A34768b83501J01030d8144a6379k38798M5702c2720q5553q8820c1241j50975
$$ 134768 -283501 -182471 -48144 -16379 -255177 -209475 -32720 -118273 -207093 -31241 -182216
15603a82216k23080f4913m7313C0753a28531N2949m5291D3517a72048G8989a92193
$$ -182216 -405296 -64913 -112226 30753 -128531 -75582 -120873 43517 -172048 78989 -192193
15591C09377b28275R4947I6414a44627C6875b41492A02218e1740B72530J7255
$$ 309377 -228275 -133328 96414 -144627 36875 -241492 102218 -51740 272530 289785
15581B89785b20398A41024a48218e3616H5743R6906A0713L8584P6685j8710g0447
$$ 289785 -220398 141024 -148218 -53616 85743 182649 10713 49297 125982 107272 -70447
15569I496a76744k7637P8107E3181Q0109a71213D4865a2096j36900H2123K2956
$$ 9496 -176744 -204381 -126274 53181 133290 -171213 44865 -12096 -148996 82123 105079
15558A05079g6189j74499B14699B0138b21895i8725m98669B32534A3434J10326
$$ 105079 -76189 -250688 214699 20138 -221895 -98725 -597394 232534 13434 123760
15548A23760R7925M4459a12691A09222b74721A11848J62637a15387E8112J99410
$$ 123760 221685 266144 -112691 109222 -274721 111848 274485 -115387 58112 257522
15538B57522A26533g3923B33755Q5451d2556p6425I5244a33365B33222a8937k01653
$$ 257522 126533 -73923 233755 319206 -42556 -118981 95244 -133365 233222 -18937 -220590
15527b20590C21780a93469f866B69787e3027A39182A2395J84277K8341b02989
$$ -220590 321780 -193469 -6866 269787 -53027 139182 12395 196672 225013 -202989
15516d936H2350K85986A33239n4849A2627N8309Q0199O9594F1451c2355g377d99
$$ -4936 82350 368336 133239 78390 12627 70936 151135 220729 61451 -32355 -7377 -499
15503b16949F7366a6002E31410k64521E496M08677A61550L07492j37648q6830
$$ -216949 67366 -16002 531410 266889 5496 414173 161550 469042 331394 244564
15493B44564K03278k23860a40853B32804a27458J5592I6033R046N0929e868o4043
$$ 244564 447842 223982 -140853 232804 -127458 -111866 96033 105079 156008 -5868 -69911
15482f9911B82052l7114R4557j57794J45083I9141O5134M68847j47819J15160
$$ -69911 282052 244938 339495 181701 326784 99141 164275 633122 485303 600463
15472F00463p4721A64101o2108J57524b7765A90333B1702e4952G2107M02381j62620
$$ 600463 525742 164101 101993 259517 -27765 190333 21702 -54952 72107 474488 311868
15461C11868C4216G050L01019H4095l1105N926B0851i5849l0396I4777M8585c3665
$$ 311868 34216 7050 308069 84095 52990 58916 20851 -95849 -126245 94777 143362 -33665
15448A9790b40761G4628j0373L39009j4699q7890N78437K76694m4887m52567r4990
$$ 19790 -240761 74628 64255 403264 388565 300675 879112 1155806 1110919 658352 563362
15437E63362B05204J57077j38545K41933a08796A10900e1873G7835J32777m5062
$$ 563362 205204 362281 223736 465669 -108796 110900 -51873 77835 210612 165550
15427A65550i9263k22802a8045r0570e3288m1496A59027a72850D99797A03364
$$ 165550 -99263 -322065 -18045 -108615 -53288 -94784 159027 -172850 499797 103364
15416b18312G5252b05682A3079i2719A8188R461K32988b73123A63055g1383m8294
$$ -218312 75252 -205682 13079 -92719 18188 27649 260637 -273123 163055 -71383 -119677
15405a19677b629B01897b79407f049A21737B8976a04663L1716E0951e747A43897
$$ -119677 -2629 201897 -279407 -6049 121737 28976 -104663 -72947 50951 -5747 143897
15393C90938e8384B9869j2801J36068a92843D048M41458p7077j84062b5111k89435
$$ 390938 -58384 29869 17068 153136 -192843 4048 445506 368429 184367 -25111 -314546
15382c14546C5479d3158q3479m3860A42424m1334M9170L91222j28406j94303K41864
$$ -314546 35479 -43158 -126637 -170497 142424 101090 150260 541482 413076 218773 460637
15371D60637J045B1705M96839k26875m4646o3229c7062h671G0846K05444a42241
$$ 460637 461682 21705 518544 291669 247023 183794 -37062 -8671 70846 276290 -142241
15359a9435A13510L32871l7923A33574J9824J59031j02218k3401m1088G0087O3309
$$ -19435 113510 446381 408458 133574 153398 312429 210211 186810 145722 70087 133396
15348A33396k9911m464P5339L82980k63626j18180O01325B98124j24765J60098
$$ 133396 103485 99021 174360 557340 293714 175534 776859 298124 173359 333457
15338C33457q0136m0344F4377J59295K07758A0314J44499P3781R5723J23754k22473
$$ 333457 253321 212977 64377 223672 431430 10314 154813 228594 324317 448071 225598
15327B25598a2397A84634b7893B76409j23342K58390e1129C47983I7538J3169
$$ 225598 -12397 184634 -27893 276409 153067 411457 -51129 347983 97538 110707
15317A10707b67580A85013b8401C45164N1470A46733K24616A7997K1923J81659
$$ 110707 -267580 185013 -28401 345164 396634 146733 371349 17997 39920 221579
15307B21579l7457h4890b1902D77559G6054a0510j41660A35437h7849B03580p0750
$$ 221579 184122 -84890 -21902 477559 76054 -10510 -152170 135437 -87849 203580 132830
15296A32830D551J57363J86563r5720b57578b9042o2898j51512C4911K5795N0800
$$ 132830 4551 161914 348477 252757 -257578 -29042 -91940 -243452 34911 60706 111506
15285A11506Q4318b3040B3482J29805a03063C7756a40214A25236K04841H9644
$$ 111506 195824 -23040 23482 153287 -103063 37756 -140214 125236 330077 89644
15274A34662b67307B91686a61524B25505G7171g521B55058L5077F597b3024A02933
$$ 134662 -267307 291686 -161524 225505 77171 -7521 255058 290135 6597 -23024 102933
15262A17081M3260J61174p0068p7255f2578C46810A43609F1527a10400J1037B79413
$$ 117081 160341 321515 251447 174192 -62578 346810 143609 61527 -110400 -99363 279413
15250B32493A1688J02174b1262B77921I4507K21811I8669J72535L17743P47597
$$ 232493 11688 113862 -21262 277921 94507 316318 98669 271204 588947 1336544
15240A336544Q09964o95401N66304q44507D81907k21385n1121K733b1886j70168
$$ 1336544 2146508 1451107 2017411 1172904 481907 260522 209401 212134 -21886 -192054
15230a92054E8140b88372i5871k16280J09377a4380m9013E8877g5351D4264c46484
$$ -192054 58140 -288372 -95871 -312151 -202774 -14380 -63393 58877 -75351 44264 -346484
15218A11358M10360A83839a64382A0486R4023a16697L7538h735C92316j44612
$$ 111358 521718 183839 -164382 10486 104509 -116697 -79159 -8735 392316 247704
15208B47704H3748K40357B3664J49264K86760N789b73251a11219A38387c57276
$$ 247704 83748 324105 23664 172928 459688 465477 -273251 -111219 138387 -357276
15197C58036a25476c6049Q208C15915a46892H2710a41957F6576J26132Q5002b20154
$$ 358036 -125476 -36049 -27841 315915 -146892 82710 -141957 66576 192708 277710 -220154
15185E45469A04155N6749K72597j15315K639o8932a55252B33964e5529D9175f8667
$$ 545469 104155 160904 433501 318186 320825 251893 -155252 233964 -55529 49175 -68667
15173B75046A07131e1568A77258F1228d520n7948E3059a05174d7082k1574B77002
$$ 275046 107131 -51568 177258 61228 -4520 -62468 53059 -105174 -47082 -68656 277002
15161a93704g3113k745b8871k6968C65322h7012A71876b32454h8036H4086m964
$$ -193704 -73113 -75858 -28871 -55839 365322 -87012 171876 -232454 -88036 84086 79122
15150G9122K60757j25037J94736k03168a13468A16005K90237a6852I1390R8166
$$ 79122 339879 214842 409578 206410 -113468 116005 406242 -16852 91390 189556
15140A89556p6141f0525A05573A6148L97108j80975Q9024F9389A3455K57281J79167
$$ 189556 113415 -60525 105573 16148 413256 232281 321305 69389 13455 270736 449903
15129D49903D1927L6604Q5176c32162B02235J608p8473R2906A08629K23516n8684
$$ 449903 41927 78531 163707 -332162 202235 203843 125370 218276 108629 332145 273461
15118B73461K5989L81023B10464J28600C6348a21257A27861L75141A832M11760
$$ 273461 299450 680473 210464 339064 36348 -121257 127861 503002 1832 413592
15108D13592a26191B16407D4841L80445h6776A59809L9491J35700A38925Q171
$$ 413592 -126191 216407 44841 425286 -86776 159809 199300 335000 138925 147096
15098A47096e9805E2805L45590n1190H6148J37766J50959A50500K7456N0547m3709
$$ 147096 -59805 52805 398395 347205 86148 223914 374873 150500 177956 228503 184794
15087A84794K21659j55713E9385k6075J34678q2957J94183J1649B7974K01231
$$ 184794 406453 250740 59385 33310 167988 85031 279214 290863 27974 229205
15077B29205o674J4720A01233K09764h2110B52622d5496B38503h8718D63914a87967
$$ 229205 222531 237251 101233 310997 -82110 252622 -45496 238503 -88718 463914 -187967
15065E09996A12807j8039J63085o2316K11152K17787k97247I2424j0442k5288
$$ 509996 112807 94768 257853 195537 406689 624476 327229 92424 81982 56694
15055E6694L7779M58563o0726j16015p1024F1795J94390N9401P7929l2649P1747
$$ 56694 94473 553036 492310 376295 305271 61795 256185 315586 393515 360866 432613
15044D32613j9458q885J31279o361I3922N15231A45185K34173j26324E5108M02683
$$ 432613 413155 404270 535549 529188 93922 609153 145185 379358 253034 55108 457791
15033D57791p3811j5386K39320J29097l3886r7090j81612Q2802j28341O1915J22489
$$ 457791 383980 368594 607914 737011 703125 606035 424423 507225 378884 440799 563288
15022E63288J00114j30982l3984j91758K69145j03879B10006J24965N4599l9584
$$ 563288 663402 532420 498436 306678 575823 471944 210006 334971 389570 349986
15012C49986K99351j17065J42742l24285k8796M87376B90080M44011C29924L9877
$$ 349986 649337 532272 675014 350729 321933 809309 290080 734091 329924 369801
15002C69801D5131M63235J82840B72507J70619O8732K4116k58126J96095n2433
$$ 369801 45131 508366 691206 272507 443126 511858 535974 277848 473943 421510
14992D21510P5988A51534L96264r2453j80746M10853B61446J38342L57688l61404
$$ 421510 497498 151534 547798 455345 274599 685452 261446 399788 757476 396072
14982C96072N78070J77517l40528K56055m34696q7549k05848m476J57300K04850
$$ 396072 974142 1151659 811131 1067186 632490 544941 339093 334617 491917 696767
14972F96767j38055K99297J53214n00788R717J41095k93601L82592C07489J05057
$$ 696767 558712 858009 1011223 510435 520152 661247 367646 750238 307489 412546
14962D12546j28783j06972M09038j58387p5939J25687q6310I5195N5488K18234
$$ 412546 283763 176791 585829 427442 351503 477190 390880 95195 150683 368917
14952C68917R1178r6234K57859J16243C33952J70186k12316M11197L77646n09818
$$ 368917 460095 363861 621720 737963 333952 504138 291822 703019 1080665 570847
14942E70847K72279l24892J52366D5249N42614N8692j80009B25903L45564N8940
$$ 570847 843126 518234 670600 45249 587863 646555 466546 225903 571467 630407
14932F30407O59039m68266P47114n41820K19020M98375j3615j15302K13770p7344
$$ 630407 1289446 821180 1568294 1026474 1245494 1743869 1730254 1614952 1828722 1751378
14922A751378j45838r8132J77550N77680R9406M9902k42747j85397m71931J52170
$$ 1751378 1605540 1507408 1684958 2262638 2362044 2411946 2169199 1983802 1511871 1664041
14912A664041n80244m19253K14448C82802L61746k74844O3286R7067k10179L1495
$$ 1664041 1083797 664544 878992 382802 744548 469704 532990 630057 419878 451373
14902D51373k8181j22532R3898j76416K55256J21290k42480K06999j7763B15122
$$ 451373 423192 300660 394558 218142 473398 594688 352208 559207 541444 215122
14891B74582J14760L5997K72393k69072K27810m2675n2447M55709J4254K96677
$$ 274582 389342 425339 697732 428660 656470 613795 561348 1017057 1031311 1327988
14881A327988l14005k17974J54862l46485n3151J36946C16839J82166j50974K67749
$$ 1327988 1013983 796009 950871 604386 551235 688181 316839 499005 348031 615780
14871F15780M6024l3155j23698j36345N17305k88612L95611k17894N8913m00497
$$ 615780 661804 628649 504951 368606 885911 597299 992910 775016 833929 433432
14861D33432K91226l24958j47060F2348N08796k23898O4840J62718j48721M1349
$$ 433432 724658 399700 252640 62348 571144 347246 412086 574804 426083 467432
14851D67432j80898L9948K66460o7779K8967J50098K42299N2068L78721k13989
$$ 467432 286534 326482 592942 525163 554130 704228 946527 998595 1377316 1163327
14841A163327j49285r7486J49683P7283k05793j47994L6907j90802J00217J02720
$$ 1163327 1014042 916556 1066239 1143522 937729 789735 826642 635840 736057 838777
14831H38777m4520j24737n5039j37617L1482R5380K15902L5072C10448K86493
$$ 838777 794257 669520 614481 476864 508346 603726 819628 854700 310448 596941
14821E96941P4575Q9646Q4565J95618k89110J09621k67122M59412q7356m5705
$$ 596941 671516 761162 845727 1041345 752235 861856 594734 1054146 966790 921085
14811I21085m5946p5310R984r1605K77440R8259K9996l3454l78991j57812p4873
$$ 921085 875139 799829 809813 718208 995648 1093907 1123903 1090449 711458 553646 478773
14800D78773K87965k41664K18601q4555o0738N0196j11127k01351M51978j67498
$$ 478773 766738 525074 743675 659120 598382 648578 537451 336100 788078 620580
14790F20580J56555j30275k05515J97272K10007m4444k92713K56768j63682N8762
$$ 620580 777135 646860 441345 638617 848624 804180 511467 768235 604553 663315
14780F63315K6311L78252j73208k77717L61139n9865O5200J65199l65501J30643
$$ 663315 689626 1067878 894670 616953 978092 918227 983427 1148626 783125 913768
14770I13768k49818L083j56445J22887n647K68959m03100L37715l83463M60879
$$ 913768 663950 667033 510588 633475 627828 896787 493687 831402 447939 908818
14760I08818j38401m2713N90221E87139J86467K1545R648j70751J09116J20768
$$ 908818 770417 727704 1317925 587139 773606 795151 804799 634048 743164 863932
14750H63932k12208r3441J57961R588B84092K90184Q014L10402j03336j48028
$$ 863932 651724 558283 716244 725832 284092 574276 582290 892692 789356 641328
14740F41328j9847J24778L981M21947l80366K34876k54694K29858L8363J49547
$$ 641328 621481 746259 750240 1172187 791821 1026697 772003 1001861 1040224 1189771
14730A189771M41642L04894k37862j18957L28757j89209l23976j23955q9204O2791
$$ 1189771 1631413 1936307 1698445 1579488 1908245 1719036 1395060 1271105 1181901 1244692
14720A244692k60877o0570J09242K4992k7838l16892K92745J21436l07849J20151
$$ 1244692 983815 923245 1032487 1057479 1029641 712749 1005494 1126930 819081 939232
14710I39232m2464L7686R2780q4199L57020j79472M91808j86701Q33591j44337
$$ 939232 896768 934454 1027234 943035 1300055 1120583 1612391 1425690 2259281 2114944
14700B114944l34379l95492j83077J14561P0589k42419k89122K06378l80254M27703
$$ 2114944 1780565 1385073 1201996 1316557 1387146 1144727 855605 1061983 681729 1109432
14690A109432R72q3122j45011k36626J46496L4439L7115j3893J35509J29432N5338
$$ 1109432 1110404 1027282 882271 645645 792141 826580 863695 849802 985311 1114743 1170081
14679A170081k85033K94599k21017Q5685L25103o63164P0398J76301L30404k80505
$$ 1170081 885048 1179647 958630 1044315 1369418 706254 776652 952953 1283357 1002852
14669A002852p6007k0114r5621M8295J11036L02827l24531k41980O81784j98184
$$ 1002852 926845 906731 811110 859405 970441 1273268 948737 706757 1388541 1190357
14659A190357m48845N97166o37478M91691j5884L16607k047N0679k87778k87468
$$ 1190357 741512 1338678 701200 1192891 1177007 1493614 1491567 1542246 1254468 967000
14649I67000M21738j51824L94084n44085L77013k76218K03598k25026n8787J87907
$$ 967000 1388738 1236914 1630998 1086913 1463926 1187708 1391306 1166280 1107493 1295400
14639A295400K8410j6242j45701J58835l1526J92039j16329K6535j54474J77220
$$ 1295400 1323810 1307568 1161867 1320702 1289176 1481215 1364886 1391421 1236947 1414167
14629A414167l08872J07077J28651M82545m64040j39096M22540l45998K14336
$$ 1414167 1105295 1212372 1341023 1823568 1359528 1220432 1642972 1296974 1511310
14620A511310J1522J17251k49534N7133l03028N09934j55631j69727K68518l2256
$$ 1511310 1522832 1640083 1390549 1447682 1144654 1654588 1498957 1329230 1597748 1565492
14610A565492j16758J32062j24994J41746j05017j71845L38938O6398J29268k9406
$$ 1565492 1448734 1580796 1455802 1597548 1492531 1320686 1659624 1726022 1855290 1825884
14600A825884l09123n1719K91339P2262l76887J5537j43419N26321J00547J07860
$$ 1825884 1516761 1465042 1756381 1828643 1451756 1467293 1323874 1850195 1950742 2058602
14590B058602m56224J12644J16787K62162k42046l7786J34215j66272J784J78705
$$ 2058602 1602378 1715022 1831809 2093971 1851925 1814139 1948354 1782082 1783866 1962571
14580A962571K18110k06996l55966N55099k83011o154L29275j95539J03390L07613
$$ 1962571 2180681 1973685 1617719 2172818 1889807 1883653 2212928 2017389 2120779 2428392
14570B428392n1397k18105j6044q4201L14376J21435m07547K02068K00838L69820
$$ 2428392 2376995 2158890 2142846 2058645 2373021 2494456 2086909 2288977 2489815 2859635
14560B859635k96254K64323m75984L21580M36567J04378k52264N09831L87971
$$ 2859635 2563381 2827704 2351720 2673300 3109867 3214245 2961981 3471812 3859783
14551C859783N07326R09643J857382L346129P665965K1202558K711644A9180967
$$ 3859783 4367109 5276752 7134134 10480263 18146228 39348786 42060430 19180967
14542H711643l638871j363314p23091J9940j45935J038381K382389k344768j038145
$$ 8711643 5072772 3709458 2986367 3006307 2860372 3898753 6281142 3936374 2898229
14533B898229l29957j01164k73746O9539P0416j38737K55160l270j83339L84566
$$ 2898229 2568272 2467108 2193362 2262901 2333317 2194580 2449740 2446470 2263131 2647697
14523B647697j26976l8394L9422j71579P8230J42112J43327j80862L02903j94426
$$ 2647697 2520721 2482327 2521749 2350170 2428400 2570512 2713839 2532977 2835880 2641454
14513B641454L83739l07112K35635j89837P1151J12981M7642O7872O0634k48625
$$ 2641454 3025193 2718081 2953716 2763879 2835030 2948011 2995653 3063525 3124159 2875534
14503B875534j51398J14265K5611q484N97292j21491J2171j27803M22750n38146
$$ 2875534 2724136 2838401 2864012 2855528 3452820 3331329 3343500 3215697 3638447 3100301
14493C100301J95873r1161K87373j36197K04530L0865J97572l20421L68198K48272
$$ 3100301 3296174 3205013 3492386 3356189 3560719 3591584 3789156 3468735 3836933 4085205
14483D085205o08242K87996j9969R4834J37187j17679K62985l37725K12831R4220
$$ 4085205 3476963 3764959 3744990 3839824 3977011 3859332 4122317 3784592 3997423 4091643
14473D091643j2030j03006L71203J67723j42793M9192K28797K66580k22452k55424
$$ 4091643 4079613 3976607 4347810 4515533 4372740 4421932 4650729 4917309 4694857 4439433
14463D439433K95730j75534L96247j35075K5796k23143M41409Q4385j55M2151
$$ 4439433 4735163 4559629 4955876 4820801 4846597 4623454 5064863 5149248 5149093 5191244
14453E191244R0658O378k26341L20989q8279L36267k55719m06221P20972J63174
$$ 5191244 5281902 5288280 5061939 5382928 5294649 5630916 5375197 4968976 5689948 5853122
14443E853122j57349L59267m98881N42235J97857K69195P1072N1274k46460N07816
$$ 5853122 5695773 6055040 5556159 6098394 6296251 6565446 6636518 6687792 6441332 6949148
14433F949148m92767L86760m2069O471J42328J32912J56625P8329J13001M42223
$$ 6949148 6456381 6843141 6801072 6807543 6949871 7082783 7239408 7317737 7430738 7872961
14423G872961j65899N55461K22605l8642o5947l20827K81529K55409M4259J12743
$$ 7872961 7707062 8262523 8485128 8446486 8380539 8059712 8341241 8596650 8640909 8753652
14413H753652J29425J36274k0643K78045n2976L92017Q1011O32079j17451J29533
$$ 8753652 8883077 9019351 8998708 9276753 9223777 9615794 9696805 10328884 10211433 10340966
14403A0340966k90902L79732k06569M74319J16974J1792K84151K67748j88453
$$ 10340966 10050064 10429796 10223227 10697546 10814520 10826312 11110463 11378211 11189758
14394A1189758K34614O02224P3126K39117K82014k92196N10268J92119Q0391N56900
$$ 11189758 11424372 12026596 12099722 12338839 12620853 12328657 12838925 13031044 13111435 13668335
14384A3668335M97852j72629N99370L61681K30670n14346N31678N48322K492L89470
$$ 13668335 14166187 13993558 14592928 14954609 15185279 14670933 15202611 15750933 15753425 16142895
14374A6142895O46343l8692J97683L41703P40019L06487O7984P41642M54179J69503
$$ 16142895 16789238 16750546 16948229 17289932 18029951 18336438 18404422 19146064 19600243 19769746
14364A9769746K14822L26000N82535L46336L26330P15546L06350L55192O74280
$$ 19769746 19984568 20310568 20893103 21239439 21565769 22281315 22587665 22942857 23617137
14355B3617137P64364k54252R82298P68378P02944K16253Q47791R78033L70462
$$ 23617137 24381501 24127249 25109547 25877925 26580869 26797122 27644913 28622946 28993408
14346B8993408J031661M89307Q73091O81683R25793O87458J045990R85970J129475
$$ 28993408 30025069 30514376 31387467 32069150 32994943 33682401 34728391 35714361 36843836
14337C6843836P68827J253058J225240P44646J411261J247163J501460J209779
$$ 36843836 37612663 38865721 40090961 40835607 42246868 43494031 44995491 46205270
14329D6205270J281947J716626J663949J486356J743035J760242J708435K259568
$$ 46205270 47487217 49203843 50867792 52354148 54097183 55857425 57565860 59825428
14321E9825428J909060K274458K425526J801039K414785K844132K769091K462226
$$ 59825428 61734488 64008946 66434472 68235511 70650296 73494428 76263519 78725745
14313G8725745L368437L308638L483007L757321L520800M167914L761749M812736
$$ 78725745 82094182 85402820 88885827 92643148 96163948 100331862 104093611 108906347
14305A08906347M817257N048519N272336N993337O080956O148074P208161P110517
$$ 108906347 113723604 118772123 124044459 130037796 136118752 142266826 149474987 156585504
14297A56585504P592832Q183782Q572881R099396J0072103J0182892J0741177
$$ 156585504 164178336 172362118 180934999 190034395 200106498 210289390 221030567
14290B21030567J1938457J1788246J3188725J3254001J4064468J4431691J5231138
$$ 221030567 232969024 244757270 257945995 271199996 285264464 299696155 314927293
14283C14927293J5267610J5560294J5820717J5874038J5658628J4684217J4327092
$$ 314927293 330194903 345755197 361575914 377449952 393108580 407792797 422119889
14276D22119889J3123071J1305818Q141680M490993J558821N87323n5248l257718
$$ 422119889 435242960 446548778 454690458 459181451 460740272 461327595 461272347 458014629
14268D58014629o375163o454344r684508r894980j1273674j1756509j2673121
$$ 458014629 451639466 445185122 435500614 425605634 414331960 402575451 389902330
14261C89902330j3983130j3784527j3463773j4273584j4381653j4644104j4311805
$$ 389902330 375919200 362134673 348670900 334397316 320015663 305371559 291059754
14254B91059754j4348203j4061829j3461490j3240167j2731000j1476136j1434403
$$ 291059754 276711551 262649722 249188232 235948065 223217065 211740929 200306526
14247B00306526q972221r101013r420851q248672p709757p710149p371568o679482
$$ 200306526 191334305 182233292 172812441 164563769 156854012 149143863 141772295 135092813
14239A35092813n987010n791140n511941n103530n208209m754369m118169m178627
$$ 135092813 129105803 123314663 117802722 112699192 107490983 102736614 98618445 94439818
14231I4439818l099340m318702l542031l078065l040392k939481k794473k911771
$$ 94439818 91340478 87021776 83479745 80401680 77361288 74421807 71627334 68715563
14223F8715563k334002k479675k047141k320116j668662k298223j457119j968595
$$ 68715563 66381561 63901886 61854745 59534629 57865967 55567744 54110625 52142030
14215E2142030j866417j088011j628318j328032j696725j157957j464814j010827
$$ 52142030 50275613 49187602 47559284 46231252 44534527 43376570 41911756 40900929
14207D0900929l87203j236717j635471j223079r06244q10508q35497n94984j077518
$$ 40900929 40513726 39277009 37641538 36418459 35512215 34701707 33866210 33271226 32193708
14198C2193708j237108o32343o22930q25061m04028p49361q66951m67795j296573
$$ 32193708 30956600 30324257 29701327 28876266 28472238 27722877 26855926 26388131 25091558
14189B5091558k83330m40625q83196k56291m78809q66826M5023p74338n05562
$$ 25091558 24808228 24367603 23484407 23228116 22749307 21882481 21927504 21153166 20647604
14180B0647604k91085m56011m04116l45432m75367l53753l25075o04858j16518
$$ 20647604 20356519 19900508 19496392 19150960 18675593 18321840 17996765 17391907 17275389
14171A7275389k13472l94223n70296j84727k42660l13328k42879m90375o7718
$$ 17275389 17061917 16667694 16097398 15912671 15670011 15356683 15113804 14623429 14555711
14162A4555711o55077q0559L9188l77779l14211m06691J22349j83500m39859K87158
$$ 14555711 13900634 13820075 13859263 13481484 13167273 12760582 12882931 12699431 12259572 12546730
14152A2546730o48828m37413j55482K32843k46633m31650J38755l8715l46346
$$ 12546730 11897902 11460489 11305007 11537850 11291217 10859567 10998322 10959607 10613261
14143A0613261n80504J73608j13404p1882m30517k86394K60750q7340k92031J1339
$$ 10613261 10032757 10206365 10092961 10021079 9590562 9304168 9564918 9477578 9185547 9196886
14133I196886p23716K59321O010m87321m0082p2602M8053j90579j94558R0957
$$ 9196886 8473170 8732491 8738501 8251180 8211098 8138496 8186549 7995970 7801412 7892369
14123G892369n940k11861k53320j00387k97041L57707l31098l6804j55660R3079
$$ 7892369 7886429 7674568 7421248 7320861 7023820 7381527 7050429 7013625 6857965 6951044
14113F951044j85330l23844J50952l19474L46617k90290k68415L8078p689k00566
$$ 6951044 6765714 6441870 6592822 6273348 6619965 6329675 6061260 6099338 6091649 5891083
14103E891083j10235K72017j68804j34753J15376l44640J42871n2215j32354l4172
$$ 5891083 5780848 6052865 5884061 5749308 5864684 5520044 5662915 5610700 5478346 5444174
14093E444174R3381m36809j42801P32208r50488N54975k09578j69793l64920K96439
$$ 5444174 5537555 5100746 4957945 5690153 4739665 5294640 5085062 4915269 4550349 4846788
14083D846788J47739m93371K77725m23792L03141k6946O4683n28453L76204q5244
$$ 4846788 4994527 4501156 4778881 4355089 4658230 4631284 4695967 4167514 4543718 4458474
14073D458474k42998R2143K0502j86033k9475l55719M79494j48942q3182m8857
$$ 4458474 4215476 4307619 4328121 4142088 4112613 3756894 4236388 4087446 4004264 3955407
14063C955407j86850K3206M80351k9104l03483r505R2818m46323M30285l42783
$$ 3955407 3768557 3791763 4272114 4243010 3939527 3930022 4022840 3576517 4006802 3664019
14053C664019j59156k09528j4780L89335l50081R1549k33945J205J56256N6685
$$ 3664019 3504863 3295335 3280555 3669890 3319809 3411358 3177413 3178618 3334874 3391559
14043C391559k0718K0380o29086J49203O24976o35862K2220J51207k65698j13534
$$ 3391559 3370841 3391221 2762135 2911338 3536314 2900452 2922672 3073879 2808181 2694647
14033B694647J81487m2024J966R334k00124J31712k29248L02428k13221r6709
$$ 2694647 2876134 2834110 2836076 2845410 2645286 2776998 2547750 2850178 2636957 2540248
14023B540248k12571N82037l76935M2312q7490j51099J11215j12796J75985k13619
$$ 2540248 2327677 2909714 2532779 2575091 2487601 2336502 2447717 2334921 2510906 2297287
14013B297287m59772O77168m19541M29130r3629n9293l40543J75590j00685K2035
$$ 2297287 1837515 2514683 2095142 2524272 2430643 2371350 2030807 2206397 2105712 2127747
14003B127747Q9638k33382J85263P0360k14870j6004P28l50088l1723L9783J92127
$$ 2127747 2217385 1984003 2169266 2239626 2024756 2008752 2009480 1659392 1627669 1667452 1859579
13992A859579j39461L48047J8656J151316K135547N258406J7636875J8963574
$$ 1859579 1720118 2068165 2086821 3238137 5373684 10632090 28268965 47232539
13984D7232539k0982487j2255056n552262j921583j434671n59442m29263l60700
$$ 47232539 26250052 13994996 8442734 6521151 5086480 4527038 4097775 3737075
13976C737075o46291j93048k92494K79774j15213O1369m76237j05215p8323J1629
$$ 3737075 3090784 2897736 2605242 2885016 2769803 2831172 2354935 2249720 2171397 2183026
13966B183026l81029L94977j53736J74383l0201m55300L65424K868m50858J77763
$$ 2183026 1801997 2196974 2043238 2217621 2187420 1732120 2097544 2100412 1649554 1827317
13956A827317M1132J91768l98945K74449q0355k2252l2166J22399j56397J95938
$$ 1827317 1868449 2060217 1661272 1935721 1855366 1833114 1800948 1923347 1766950 1962888
13946A962888m28025k53705M19475K45516l50653L41386k70996K53217l02379
$$ 1962888 1534863 1281158 1700633 1946149 1595496 1936882 1665886 1919103 1616724
13937A616724J76893j0568j56856k41945K17020k32017J5734L17960K3162K54946
$$ 1616724 1793617 1783049 1626193 1384248 1601268 1369251 1384985 1702945 1726107 1981053
13927A981053l89594j07126J57098j99926J48598j78421J56851j81920l31574
$$ 1981053 1591459 1484333 1641431 1441505 1590103 1411682 1568533 1386613 1055039
13918A055039K60977p5418K55101k24775N48144p96719M20597l1690k23557K71882
$$ 1055039 1316016 1240598 1495699 1270924 1819068 1022349 1442946 1411256 1187699 1459581
13908A459581l62279L58299k02511J19504j51475L55720j28405k65002J65966
$$ 1459581 1097302 1455601 1253090 1372594 1221119 1576839 1448434 1183432 1349398
13899A349398p74k87274K18792R1980k02060L39902l48655K65084l09934j50917
$$ 1349398 1348624 1061350 1280142 1372122 1170062 1509964 1161309 1426393 1116459 965542
13889I65542L3911J03563J62594j31173P2765M11078j47183k71634j23677n117
$$ 965542 999453 1103016 1265610 1134437 1207202 1618280 1471097 1199463 1075786 1070669
13879A070669j97486J92588k3319j2567J41690j40964L12254q5702j1207j9089
$$ 1070669 873183 1065771 1042452 1029885 1171575 1030611 1342865 1257163 1245956 1226867
13869A226867l64444M66320j21818j11674r0792j58701K67813j26365L4938q9551
$$ 1226867 862423 1328743 1206925 1095251 1004459 845758 1113571 987206 1022144 932593
13859I32593M032J87705l00131K83988j10882j59748J12902k41202L37430P2216
$$ 932593 936625 1124330 824199 1108187 997305 837557 950459 709257 1046687 1118903
13849A118903k60006J54970K26692l25535J37354l83193K52601r5899M369O165
$$ 1118903 858897 1013867 1240559 915024 1052378 669185 921786 825887 830256 836421
13839H36421R3226K00848l34423M1128J68302l42023J75588j12247L09284j80559
$$ 836421 929647 1130495 796072 837200 1005502 663479 839067 726820 1036104 855545
13829H55545l15310L61701j41655K40625j22502k62196L52740l61442K75205j73733
$$ 855545 540235 901936 760281 1000906 878404 616208 968948 607506 882711 708978
13819G08978J74906K5701K6477p7414m0476j60249K04405o3136M9188R4490j69188
$$ 708978 883884 909585 936062 858648 818172 657923 862328 799192 848380 942870 773682
13808G73682l77224N31190l1919m8504O4403l26735J42478K4495j77931M05726
$$ 773682 396458 927648 895729 847225 911628 584893 727371 751866 573935 979661
13798I79661o5225J70880l6932E23678J02659j68257K67395K40112k28000j66922
$$ 979661 914436 1085316 1048384 523678 626337 458080 725475 965587 737587 570665
13788E70665N9928J36446M6110q2829j62911P0612J53012j46481K4702n1305k22253
$$ 570665 630593 767039 813149 730320 567409 638021 791033 644552 669254 617949 395696
13777C95696n8202P7756J13211n7598M2404j04551R8248q1331Q8129J10051N4048
$$ 395696 337494 415250 528461 470863 513267 408716 506964 425633 513762 623813 677861
13766F77861J0170q8609j0283q1754L32582C09552K71540B85884L91096L7641
$$ 677861 688031 599422 589139 507385 839967 309552 581092 285884 676980 714621
13756G14621k15861J16345L01727m50375L26090l03737K3785j10276K37317m9850
$$ 714621 498760 615105 916832 466457 792547 488810 512595 402319 639636 589786
13746E89786l031k03090J81024M1147r7432k15690I3519O18734o583j57705J48490
$$ 589786 586755 383665 564689 605836 508404 292714 93519 712253 705670 547965 696455
13735F96455k46726J23862K59693j28248j24036K6095o9491K5051L52232D42364
$$ 696455 449729 573591 833284 705036 581000 607095 537604 562655 914887 442364
13724F81927l6615n6714B82892K89358A93759L46550J27551j00634k63295K91578
$$ 681927 645312 588598 282892 572250 193759 540309 667860 567226 303931 595509
13714E95509M9741l02738L80662k14546K69616k77854o3683J38321k37469R5937
$$ 595509 645250 342512 723174 508628 778244 500390 436707 575028 337559 433496
13704D33496K10211k48516K13237k07128K09704Q9065l34993j18561L16197N9069
$$ 433496 643707 395191 608428 401300 611004 700069 365076 246515 562712 621781
13694F21781j64674l1273j58389n7453L22507j79448K44873K2407C07301R2609
$$ 621781 457107 425834 267445 209992 532499 353051 597924 620331 307301 399910
13684C99910N8033J64695j71003J78474B63199J70417k1153J01786B45507J48349
$$ 399910 457943 622638 451635 630109 263199 433616 412463 514249 245507 393856
13674C93856l6960J8261P0552N0411L4050n7163L21Q8923J14230B93518N4462
$$ 393856 356896 375157 445709 496120 530170 473007 473328 562251 676481 293518 347980
13663C47980K73045j67506k24613K47239J74881m8480j48644A59123E1147J18358
$$ 347980 621025 453519 228906 476145 651026 602546 453902 159123 51147 169505
13653A69505J14295K16446j21783o0311K98952O8197A67804M83445k67926J83623
$$ 169505 283800 500246 378463 318152 617104 685301 167804 651249 383323 566946
13643E66946B68458J30026o5370q0822O2600N9252A72573P3243K7448A33658o0883
$$ 566946 268458 398484 333114 252292 314892 374144 172573 245816 273264 133658 72775
13632G2775J46528L1936J91976J35268j06703F004J58098L23210k2108J86316
$$ 72775 219303 251239 443215 578483 471780 6004 164102 487312 465204 651520
13622F51520B23800J51246L5329J01195r2985m0827A84359K41114k12374J910
$$ 651520 223800 375046 410375 511570 418585 377758 184359 425473 213099 215009
13612B15009A03278L88718q9500m4076A74882M03731B71329K7624k2604I2224
$$ 215009 103278 491996 402496 358420 174882 578613 271329 298953 276349 92224
13601F46303B72037p2765p2354R9927c9087E77457j94545j4386O4772K03212A09710
$$ 646303 272037 199272 126918 226845 -39087 577457 382912 368526 433298 636510 109710
13589B15065j3083L66303P3865k21198E0564L51928J03960l7767A33828j1988
$$ 215065 201982 568285 642150 420952 50564 402492 506452 468685 133828 121840
13579A21840J90153M218A36419K87485A48804K61338M7336r3342E5352N05933
$$ 121840 311993 316211 136419 423904 148804 410142 457478 364136 55352 561285
13569E61285A27818M6665B6804J56030G5650J55335J7312J02020I2265J56146
$$ 561285 127818 174483 26804 182834 75650 230985 248297 350317 92265 248411
13559B48411q2037Q4363K71657G1237K01777N3440J14611K04984I5347j6371L23034
$$ 248411 166374 250737 522394 71237 273014 326454 441065 646049 95347 78976 402010
13548D02010c7947B35508q6948L3858l1353E9910M59949E4626J97119H5030L8023
$$ 402010 -37947 235508 148560 182418 151065 59910 519859 54626 251745 85030 123053
13537A23053J86524j49528A1460R4691L5572c5216B05222E9145J86403A01038
$$ 123053 309577 160049 11460 106151 141723 -35216 205222 59145 245548 101038
13526B10853A7847a28038A60633L3499M5616M9211O3946A07624K47027G1227J45628
$$ 210853 17847 -128038 160633 194132 239748 288959 352905 107624 354651 71227 216855
13515B16855J04786b3612B09800O2348q8317J30472N0358L12B3632J41835Q035
$$ 216855 321641 -23612 209800 272148 183831 314303 364661 364973 23632 165467 173502
13504A73502J96352j40389J66623A42335m0395j5531J19568K98761B16647N4352
$$ 173502 369854 229465 396088 142335 101940 86409 205977 504738 216647 270999
13494B70999J44612H5897L38466A05500a49333C60631j75605M62K75056A76722
$$ 270999 415611 85897 424363 105500 -149333 360631 185026 185488 460544 176722
13483B74573J99660E4406Q4570K03572n434d5710B30785Q8648J99566k09401a416
$$ 274573 474233 54406 138976 342548 337114 -45710 230785 319433 518999 309598 -1416
13471I9705b8738G8738J15245P908d3977C86550j47930M7922j06689O17G8714
$$ 99705 -28738 78738 193983 201891 -43977 386550 238620 286542 179853 180470 78714
13459D92746k02189J87716c8650C06621j4735r3066r5614O3743J88284j03033
$$ 492746 290557 478273 -38650 306621 291886 198820 103206 166949 355233 252200
13449B52200h1516A85643Q8768P5367E5525a95873C20334A8972J31836P9990q0004
$$ 252200 -81516 185643 274411 349778 55525 -195873 320334 18972 150808 230798 150794
13438A50794i177B4502J65848a32996A47163J08214k8526P8615F5988O2920L46010
$$ 150794 -9177 24502 190350 -132996 147163 255377 226851 305466 65988 128908 474918
13427D74918a23980D4621J93940P1397a977E876a21665B54769p9054n1086Q5750
$$ 474918 -123980 44621 238561 309958 -1977 5876 -121665 254769 175715 124629 210379
13416B10379J43967A45004b8197A42069J13051a20349C38144d9853A3473a2592
$$ 210379 354346 145004 -28197 142069 255120 -120349 338144 -49853 13473 -12592
13405A24187J02552F3998g7537E86440k08343D7702O8981a27256C57840A48898
$$ 124187 226739 63998 -77537 586440 378097 47702 116683 -127256 357840 148898
13394F9515J23569P115L9343L1138j01895l7581L2141L34707j36944A57299B3485
$$ 69515 193084 200199 239542 270680 168785 131204 163345 498052 361108 157299 23485
13382F59022B36608B532Q7771J04632L47804A58053b9581F5193K82870A56893
$$ 659022 236608 2532 90303 194935 542739 158053 -29581 65193 348063 156893
13371e8595D51532B07192E262O43090B43967J20402N2019A22368g3918C98154
$$ -58595 451532 207192 5262 648352 243967 364369 416388 122368 -73918 398154
13360C2809L95324J37320A59997J43944j9184k5985A07168L18581a4660B41437
$$ 32809 428133 565453 159997 303941 284757 258772 107168 425749 -14660 241437
13349G3391J12276O9638I8065J28009A2214L43555a74440C59425k2049j12680
$$ 73391 185667 255305 98065 226074 12214 355769 -174440 359425 337376 224696
13339B24696Q4565A40513K18103A77170n1138k8072L27156A22134L68604c0702
$$ 224696 309261 140513 358616 177170 126032 97960 425116 122134 490738 -30702
13328C28689o4045Q265J81999A85134Q2825Q7450a55968B89449a42396m138F3217
$$ 328689 264644 272909 454908 185134 267959 355409 -155968 289449 -142396 -146534 63217
13316C23310K87639B39121l9956J69403k2849r3552D5427J52590N3550j14243
$$ 323310 610949 239121 199165 368568 345719 252167 45427 198017 251567 137324
13306A37324L981M3979R3620K48g589F12842A35788K93351E918M46870B18911
$$ 137324 141305 185284 278904 279152 -7589 612842 135788 429139 5918 452788 218911
13294A19232n5132J08204b1730A17627a34533J8778B27010I7600h917A31458c0611
$$ 119232 64100 172304 -21730 117627 -134533 -115755 227010 97600 -8917 131458 -30611
13282C34181A0684i396E7754b23221d3205o9117F1671k8231J42332C6543K29133
$$ 334181 10684 -9396 57754 -223221 -43205 -112322 61671 33440 175772 36543 265676
13271B65676J14461b2165j88897A44222c02411C5938a09488p8735A31585f7414
$$ 265676 380137 -22165 -211062 144222 -302411 35938 -109488 -188223 131585 -67414
13260a31044B5706L08547E9255P7199C0901b09444o3966B26751j09092c8150A40865
$$ -131044 25706 334253 59255 136454 30901 -209444 -273410 226751 117659 -38150 140865
13248A82469R3967q5088Q7271b47421J22568d9000j74567A63415o2234l461L5831
$$ 182469 276436 191348 278619 -247421 -124853 -49000 -223567 163415 101181 97720 133551
13237A33551J3510E4113J9697A5484J1728K28402J9163a88216h9409M0750C3232
$$ 133551 147061 54113 73810 15484 27212 255614 274777 -188216 -89409 -48659 33232
13225A07311D5417J90706a85101C64018f5272k1756D3107d76D50382c25395A06645
$$ 107311 45417 236123 -185101 364018 -65272 -87028 43107 -476 450382 -325395 106645
13213a00895A39100a57829C65557q2617a24919C96584a27078A49971J55655j10592
$$ -100895 139100 -157829 365557 282940 -124919 396584 -127078 149971 305626 195034
13203A95034B925f0874q508B39211B0551L30148A47153K4091A4257a50827A43376
$$ 195034 2925 -60874 -69382 239211 20551 350699 147153 171244 14257 -150827 143376
13191A83942a92699C59070j27323a28616A53539a12830a0066F5010a07948C6218
$$ 183942 -192699 359070 231747 -128616 153539 -112830 -10066 65010 -107948 36218
13180h800A73301J7806q1063R899a9393n9600A25928a77979G3200a27063j10674
$$ -8800 173301 191107 110044 119943 -19393 -78993 125928 -177979 73200 -127063 -237737
13169b37737B34057c7807A4470J52155D5154a67353j48816P0321b7667A8347L87366
$$ -237737 234057 -37807 14470 166625 45154 -167353 -316169 -245848 -27667 18347 405713
13158D05713e0206B18101b73022c5447A97238D990f2821B49886b0880n2329j49071
$$ 405713 -50206 218101 -273022 -35447 197238 4990 -62821 249886 -20880 -73209 -222280
13147b22280A74465N11544G3674M33995A35046N5249E4919c0834D17236A60749
$$ -222280 174465 686009 73674 507669 135046 190295 54919 -30834 417236 160749
13136a49186E6422a4028B1369J00728a8372B27455g1562m052A71380g0185G6516
$$ -149186 56422 -14028 21369 122097 -18372 227455 -71562 -75614 171380 -70185 76516
13124A41572a91731B6389J31c12720a55851A3513L28071I6412K12877b29976a11410
$$ 141572 -191731 26389 26520 -312720 -155851 13513 341584 96412 309289 -229976 -111410
13112a0243A96661m0269h310r2745A39640c1703B38493O948A08056b14320B39732
$$ -10243 196661 156392 -8310 -101055 139640 -31703 238493 245441 108056 -214320 239732
13100A02768e1317b3511E0232b85764f9142K2602o6097A50671C64a62178G0034
$$ 102768 -51317 -23511 50232 -285764 -69142 -46540 -112637 150671 364 -162178 70034
13088C38081c8657A33126c9281j6413D81666A05639a71640f6708A51657F2039
$$ 338081 -38657 133126 -39281 -55694 481666 105639 -171640 -66708 151657 62039
13077a0212B9691J94264f9007A51709f7719A69389J7381e090m8619E9902b09632
$$ -10212 29691 223955 -69007 151709 -67719 169389 186770 -5090 -53709 59902 -209632
13065I9198p158m5589L2807J83473P382j03115F2933p609a0831A72744a9189H5833
$$ 99198 92040 46451 79258 262731 270113 166998 62933 55324 -10831 172744 -19189 85833
13052h1705A91590l3477D2733J13225E5167j6997M8838K5270a20095A7462a82247
$$ -81705 191590 158113 42733 155958 55167 38170 87008 112278 -120095 17462 -182247
13040e9481H0834B7319g9922E0086J0996N9435J31541a27777J3171A25687d9306
$$ -59481 80834 27319 -79922 50086 61082 120517 252058 -127777 -114606 125687 -49306
13028e2407C29439p008h0502D1374e9525k43897B13101b7790Q659k13774B75700
$$ -52407 329439 322431 -80502 41374 -59525 -303422 213101 -27790 -19131 -232905 275700
13016A24682R0616a21383A07392b22156D0604d5192C1200J18364J19697k0569
$$ 124682 215298 -121383 107392 -222156 40604 -45192 31200 149564 269261 248692
13006B48692B739K14117a46034B74253O6347A56748j7450a11086A78538P1527
$$ 248692 2739 216856 -146034 274253 340600 156748 139298 -111086 178538 250065
12996B50065o3490N4566P8325g8849k4934e0012A24779i826r4182m1905j66502
$$ 250065 186575 241141 319466 -78849 -103783 -50012 124779 -9826 -104008 -145913 -312415
12985c12415A9073d6609A11944E980a3925A86208F1246J65910g1309B56596J80344
$$ -312415 19073 -46609 111944 5980 -13925 186208 61246 227156 -71309 256596 436940
12974D36940a51945E2007K17077j11101J1114l8620d7830l5982C46821j48509
$$ 436940 -151945 52007 269084 157983 169097 130477 -47830 -83812 346821 198312
12964A98312H8523b5428A11992b28290p9308c5021l11536D0229M9753L4655e5323
$$ 198312 88523 -25428 111992 -228290 -307598 -35021 -346557 40229 89982 124637 -55323
12952c9305J8124p5798C14645b36772F2011K15536D6125g4611B0760h985r0129
$$ -39305 -21181 -96979 314645 -236772 62011 277547 46125 -74611 20760 -8985 -99114
12941i9114O480q977p8820M4871A49527F5573b3242A27566M413b31062B84406
$$ -99114 -92634 -101611 -180431 -135560 149527 65573 -23242 127566 131979 -231062 284406
12929E0655M27809a90573Q3556a8346A77988a83624D640g7254C05354D1447F715
$$ 50655 478464 -190573 -107017 -18346 177988 -183624 4640 -77254 305354 41447 6715
12917A06161N1436a38237B21662A01419L07362A98632L46308A44329c9535n4475
$$ 106161 157597 -138237 221662 101419 408781 198632 544940 144329 -39535 -94010
12907i4010A76340B0111a71111d3859K373A0517K52121h865j81438B69098b55641
$$ -94010 176340 20111 -171111 -43859 -41486 10517 262638 -8865 -190303 269098 -255641
12895A13995n6373k2285J09873C9409R089a99724C27236h7767A8908c7988k5458
$$ 113995 57622 35337 145210 39409 48498 -199724 327236 -87767 18908 -37988 -63446
12884f3446B01263L7999i2483c6325n6786F9554c04832A21696O7216d3660G1708
$$ -63446 201263 239262 -92483 -36325 -93111 69554 -304832 121696 188912 -43660 71708
12872H2056b25062B4596a82143c1756m5641A01047a05867A98232a77687l0371
$$ 82056 -225062 24596 -182143 -31756 -77397 101047 -105867 198232 -177687 -208058
12862b08058o1389C64424A58339m7651P276a73029I6814D668J05875h9955b583
$$ -208058 -269447 364424 158339 110688 117964 -173029 96814 4668 110543 -89955 -2583
12850E2597c81244b7490J3532C1889J91342k4875g2108r180H8428a26000p2920
$$ 52597 -381244 -27490 -13958 31889 223231 198356 -72108 -81288 88428 -126000 -198920
12839a98920i5099L6332j88874e5232A95105l8040J01982b98490H4444f9660j02573
$$ -198920 -95099 -58767 -247641 -55232 195105 157065 259047 -298490 84444 -69660 -172233
12828a72233K5778c8425f411E7907c25687H8496P6117d13383A49746e4735A3556
$$ -172233 -146455 -38425 -6411 57907 -325687 88496 164613 -413383 149746 -54735 13556
12816b934k14045M9171N4641k39243D9058a88611M6644C8225c0683j877k7563
$$ -2934 -216979 -167808 -113167 -352410 49058 -188611 -141967 38225 -30683 -32560 -60123
12805f0123m76909C25918A8631a36229r4444H6845A6397L47746I4108b77256D6523
$$ -60123 -537032 325918 18631 -136229 -230673 86845 16397 364143 94108 -277256 46523
12793h6620L4635B3561e8384C73993H6532J10197c4524j71747G8620f6371J5841
$$ -86620 -51985 23561 -58384 373993 86532 196729 -34524 -206271 78620 -66371 -50530
12782e0530A11832e4435j11468C7620f343H4642b5486O569A02564i9813k8998
$$ -50530 111832 -54435 -165903 37620 -6343 84642 -25486 -18917 102564 -99813 -128811
12771a28811d1720A11400L9514a04399A36687c14745J52427N3440r2671d3929
$$ -128811 -41720 111400 150914 -104399 136687 -314745 -162318 -108878 -201549 -43929
12760a92906O9923Q271B71393G1353e7706a336m5115D7815n175O8472A2976d4095
$$ -192906 -122983 -114712 271393 71353 -57706 -1336 -46451 47815 42640 111112 12976 -44095
12747b26863A16715n6846a286B7019a45187k6386N2966B9403e3217B13564A5080
$$ -226863 116715 59869 -1286 27019 -145187 -171573 -118607 29403 -53217 213564 15080
12735B34249j12000a06406m9622B21312G4014f4720O845j49805e356o0539l5657
$$ 234249 122249 -106406 -156028 221312 74014 -64720 -57875 -207680 -5356 -65895 -101552
12724a01552j20776G9255a02411B56466q0272q4058k9659J00192d0567e843r8916
$$ -101552 -222328 79255 -102411 256466 176194 92136 62477 162669 -40567 -5843 -104759
12713a04759G5287K37436j8176q7079q8207K45941d15944a49359A40390a07148
$$ -104759 75287 312723 294547 207468 119261 365202 -415944 -149359 140390 -107148
12702b91374D1415o503J62325q9409e3375E8205a47519B23585b16555a126l28996
$$ -291374 41415 34912 197237 107828 -53375 58205 -147519 223585 -216555 -1126 -330122
12691c30122A05905d8525j41012A69265f4740o0332o0499G2943a07625B28545
$$ -330122 105905 -48525 -189537 169265 -64740 -125072 -185571 72943 -107625 228545
12680G2397A4559a59688A0193J46281O1185K9129H1783N3533a42506N5301I4142
$$ 72397 14559 -159688 10193 156474 217659 246788 81783 135316 -142506 -87205 94142
12668c8364H8703A0779a88244D02598h9391c7513H9238R8313E0618K33185g4948
$$ -38364 88703 10779 -188244 402598 -89391 -37513 89238 187551 50618 283803 -74948
12656f4650j52011e0373n445D36041A2784J29783a7126b825l3490k13156g9445
$$ -64650 -216661 -50373 -55818 436041 12784 142567 -17126 -2825 -36315 -249471 -79445
12644D4717P1952h6063D7814a63923o2084m851O472J00091A24294E3340M8698
$$ 44717 116669 -86063 47814 -163923 -226007 -230858 -224386 -124295 124294 53340 102038
12633A02038a27919A25532b41803O8218A56557a19269C8672J94458a47573A33816
$$ 102038 -127919 125532 -241803 -173585 156557 -119269 38672 233130 -147573 133816
12622B28944p205e40626b59654B11417r9146K4348a89260c0249B67960b14943
$$ 228944 221739 -540626 -259654 211417 112271 136619 -189260 -30249 267960 -214943
12611A27459C0745c8409B41063M2666E2467K10778B3904P6245a45235B16157j7138
$$ 127459 30745 -38409 241063 283729 52467 263245 23904 100149 -145235 216157 199019
12600A99019I9362J64108A23836n2104J63524a13471n1730B40903j05324C1187
$$ 199019 99362 263470 123836 71732 235256 -113471 -165201 240903 135579 31187
12589A70054D1238J85376E264A331h5761B64693f3549r8314b6507A56476f5699
$$ 170054 41238 226614 5264 1331 -85761 264693 -63549 -161863 -26507 156476 -65699
12577H4319K56400A13809D660J12998a1056j14087C025J78818D6660M5149C7872
$$ 84319 340719 113809 4660 117658 -11056 -125143 3025 181843 46660 91809 37872
12565I1756c32869a1974o844j53156E7173d4523e121C05594k1252a80468k7259
$$ 91756 -332869 -11974 -18818 -171974 57173 -44523 -5121 305594 284342 -180468 -207727
12554b07727J03710d3092j92938l9380B3628L33504F0643a67594A20918L29237
$$ -207727 -104017 -43092 -236030 -275410 23628 357132 60643 -167594 120918 450155
12544D50155B1765a0693K843q9578J6566j79912A03358B6857a8339j54510o4744
$$ 450155 21765 -10693 -7850 -97428 -80862 -260774 103358 26857 -18339 -172849 -237593
12533b37593d5002j10012B7011a84455L6245A1851b2016j5817C0988Q6266O947
$$ -237593 -45002 -155014 27011 -184455 -148210 11851 -22016 -37833 30988 117254 124201
12522A24201c52212J5506A09069i602j12443j49033d072A57104c4645m9017G4979
$$ 124201 -352212 -336706 109069 -9602 -122045 -271078 -4072 157104 -34645 -83662 74979
12510b7268I0724b31429E872J80336C1806J93323a27816D8487r868L7793b3049
$$ -27268 90724 -231429 5872 186208 31806 225129 -127816 48487 38619 76412 -23049
12498c2293j6943Q801j9868l7922G5576i7754A04990b50466J16468N308G6010
$$ -32293 -49236 -40435 -60303 -98225 75576 -97754 104990 -250466 -133998 -128690 76010
12486G4297e9320D534F36f5648D5606L5233h4797j83197B89160B9456b93016g2757
$$ 74297 -59320 4534 636 -65648 45606 80839 -84797 -267994 289160 29456 -293016 -72757
12473a13364a1653m26461d8852r4635C60532a88502M2952A75448a28119I9019
$$ -113364 -11653 -438114 -48852 -143487 360532 -188502 -145550 175448 -128119 99019
12462b22066C9401L2867J49446G0343A6344Q5540b50995j7992A49406J16406i4344
$$ -222066 39401 72268 221714 70343 16344 101884 -250995 -268987 149406 265812 -94344
12450a70988P1753B55044d16730a17000a725B15689H7893o093P722a17395C76120
$$ -170988 -99235 255044 -416730 -117000 -1725 215689 87893 81800 89522 -117395 376120
12438F6150c3186k48796B1444J62712q5080J25608a60172n0403C052c76680H995
$$ 66150 -33186 -281982 21444 184156 99076 224684 -160172 -210575 3052 -376680 8995
12426A93215d6316A07345d9076j14186A8062c45490J71202A2469c53825e0049
$$ 193215 -46316 107345 -49076 -163262 18062 -345490 -174288 12469 -353825 -50049
12415c40084A68355l6613F4742a63249c6244j10856F1942g6131B29837b27519
$$ -340084 168355 131742 64742 -163249 -36244 -147100 61942 -76131 229837 -227519
12404a12056C5207J86193h8281E9679L3883a50366j67599I4701o065L217b5061
$$ -112056 35207 221400 -88281 59679 93562 -150366 -317965 94701 88636 91853 -25061
12392B94037F7958J13484M0187p0300h7886B00221d7860k45151A24076B6989g4403
$$ 294037 67958 181442 221629 151329 -87886 200221 -47860 -293011 124076 26989 -74403
12380C1516K98433c71112D1055J39097M0712f56E18014A37138K681b0361k376
$$ 31516 329949 -371112 41055 180152 220864 -656 518014 137138 139819 -20361 -22737
12369b2737G741J11800a2329E0605e7089B26142b08061f3030A4053L91041g2646
$$ -22737 7741 119541 -12329 50605 -57089 226142 -208061 -63030 14053 405094 -72646
12357a64407J7224D1611c9217A43698d2102B65089r3416R066G1551l0921a82287
$$ -164407 -147183 41611 -39217 143698 -42102 265089 171673 180739 71551 40630 -182287
12345A54396a6014j54409A94983b0381H2090J28406M9545k5531a3067A00066c53428
$$ 154396 -16014 -170423 194983 -20381 82090 210496 260041 234510 -13067 100066 -353428
12333b05366A71494b36302B80438J9240K7007A17613e2377A66095a28H3635N7970
$$ -205366 171494 -236302 280438 299678 326685 117613 -52377 166095 -128 83635 141605
12322A41605F4035O6958J1152L8647M7994J79659k6730I6835k1985K68651A36550
$$ 141605 64035 130993 142145 180792 228786 408445 381715 96835 74850 343501 136550
12310a75362B49777p9935a978p7533D1806a21662c0318A3081K85089i2295L099
$$ -175362 249777 169842 -1978 -79511 41806 -121662 -30318 13081 298170 -92295 -89196
12299h9196B88250G0088O6696O0043J58357d63318K19944C2420b08809E8343J68052
$$ -89196 288250 70088 136784 196827 355184 -463318 -243374 32420 -208809 58343 226395
12288B26395n5030a4154A81537g3206B98624G8236f9920j55649B0530K01532o5457
$$ 226395 171365 -14154 181537 -73206 298624 78236 -69920 -225569 20530 222062 156605
12277A56605L1473g7008C26170j34622l2271m4359a24250B01880I9402L10946
$$ 156605 188078 -77008 326170 191548 159277 114918 -124250 201880 99402 410348
12267D10348k3650r1332r1714r6460K06394M6764K15586A09548K93815j33242
$$ 410348 386698 295366 203652 107192 313586 360350 575936 109548 403363 270121
12257B70121A08393a41188e5745C11832a28803A62615g3508B12679r238E8892
$$ 270121 108393 -141188 -55745 311832 -128803 162615 -73508 212679 203441 58892
12246B80378j39061O6867p9760o2827b64423C08965b50388B10720m6538J92193
$$ 280378 141317 208184 128424 65597 -264423 308965 -250388 210720 164182 356375
12236C56375A04122M7059a9559B21506B1997M1821a10128A50589F0090d5644B81062
$$ 356375 104122 151181 -19559 221506 21997 63818 -110128 150589 60090 -45644 281062
12224B50222A20282O7518g5854A55649J10289I4984O8031a60784B98939A31796
$$ 250222 120282 187800 -75854 155649 265938 94984 163015 -160784 298939 131796
12213C01789R1429j83532E4321a13801G4356N8576R5856j13913a67374d2132C7835
$$ 301789 393218 209686 54321 -113801 74356 132932 228788 114875 -167374 -42132 37835
12201A00145J85728a00701m548B71493K7520n3605I6109j7059a17189D24474F9621
$$ 100145 285873 -100701 -105249 271493 299013 245408 96109 79050 -117189 424474 69621
12189B66645P3192A64814b5251A56089J30203J18006j04229Q9645K0104B629a44054
$$ 266645 339837 164814 -25251 156089 286292 404298 300069 389714 409818 2629 -144054
12177C53896i1622o3479C70450B7137K81936G7802J42961r9885m2357e3071A56641
$$ 353896 -91622 -155101 370450 27137 309073 77802 220763 120878 78521 -53071 156641
12165A9779R4995R7649A00113P8699L2939F2584J63075G9598M4183c67593B32256
$$ 19779 114774 212423 100113 178812 211751 62584 225659 79598 123781 -367593 232256
12153h576j32780A79699e5628C5819b66272F6424K8863J21887o4255a52750B36791
$$ -8576 -141356 179699 -55628 35819 -266272 66424 95287 217174 152919 -152750 236791
12141B24330N6122A3105J10968d01410h5202D2502a57961A22360D3861J64959
$$ 224330 280452 13105 124073 -401410 -85202 42502 -157961 122360 43861 208820
12131B08820F3496b06159L467G8378P2803a21907F4442a58541E9983K69697l9997
$$ 208820 63496 -206159 -202692 78378 151181 -121907 64442 -158541 59983 329680 289683
12120B89683g7973F29450H5441K5135J36408m1801e405A49121o0760J56459e4659
$$ 289683 -77973 629450 85441 110576 246984 205183 -5405 149121 88361 244820 -54659
12108C05570p1874A01268L04428H8301m1805e0471H4724k9599J36706C0438J53939
$$ 305570 233696 101268 405696 88301 46496 -50471 84724 55125 191831 30438 184377
12097A84377a3237j67779C7764a16374a9118B29539a18180G2235f8542C74883
$$ 184377 -13237 -181016 37764 -116374 -19118 229539 -118180 72235 -68542 374883
12086C27636N5517A84835B3877M6029k9457K09116E4511J41135A9426J11967a19912
$$ 327636 383153 184835 23877 69906 40449 249565 54511 195646 19426 131393 -119912
12074C89992A65750a43933A42215J95849m277G585K03952J05224h2479D91408
$$ 389992 165750 -143933 142215 338064 333787 7585 211537 316761 -82479 491408
12063C06396A2883J65083H6316J9135K3585b138F4067j0687c4081H1926e6512
$$ 306396 12883 177966 86316 105451 129036 -2138 64067 53380 -34081 81926 -56512
12051C83550K460a44302C15140K71702a96509A13867B6811a54520I6369P1069
$$ 383550 386010 -144302 315140 586842 -196509 113867 26811 -154520 96369 167438
12041A67438b66415A37335c83987D4956O6340h4403A19460M892D6014b46687J10902
$$ 167438 -266415 137335 -383987 44956 111296 -84403 119460 124352 46014 -246687 -135785
12030a35785p3003G1662b36185J16248J0008K694F1595a38911r8438a18428j22451
$$ -135785 -208788 71662 -236185 -119937 -109929 -107235 61595 -138911 -237349 -118428 -240879
12019b40879E23a11323A76531r984q2874K03445j33743C6226r500O1274a61343
$$ -240879 523 -111323 176531 166547 83673 287118 153375 36226 26726 88000 -161343
12007e9718H2603a34771D5264O0340K6650J27342h9209m8725A34814D6499O9464
$$ -59718 82603 -134771 45264 105604 132254 259596 -89209 -137934 134814 46499 115963
11996A15963M4828a60636c6654j07337G9721b72204G6770Q4936b83115H5745b16416
$$ 115963 160791 -160636 -36654 -143991 79721 -272204 76770 161706 -283115 85745 -216416
11984b66686i137D9815L5291i1856n6069G386c37011O0633A16730M1869f2231
$$ -266686 -9137 49815 85106 -91856 -147925 7386 -337011 -276378 116730 158599 -62231
11972A55297D7791c90028A26156R7694b2909C07784B966J48764J2137k8902j1148
$$ 155297 47791 -390028 126156 223850 -22909 307784 2966 151730 163867 134965 123817
11961A23817k1625i0161A02529c0625j22894e4676D3051J16002I511c4084l603
$$ 123817 102192 -90161 102529 -30625 -153519 -54676 43051 159053 9511 -34084 -37687
11950c7687E3439c14299A90466b85925j9682C85227a10247j41866A5472J9430
$$ -37687 53439 -314299 190466 -285925 -305607 385227 -110247 -252113 15472 34902
11940C4902b31539E1007A6981a91659n4267F5227B4423L7081J28476a95333b7653
$$ 34902 -231539 51007 16981 -191659 -245926 65227 24423 61504 189980 -195333 -27653
11928A6806P019K3149J99803j06469K55454p2897e7712k0543K5483j52271j53155
$$ 16806 23825 46974 246777 140308 395762 322865 -57712 -78255 -52772 -205043 -358198
11917c58198a21287j56854E19151B06217b35580e9553B00520e2780l6676j29712
$$ -358198 -121287 -278141 519151 206217 -235580 -59553 200520 -52780 -89456 -219168
11907b19168R0976A33020j1446d5041j53108A12827L89265a06864b3882B0407
$$ -219168 -128192 133020 121574 -45041 -198149 112827 502092 -106864 -23882 20407
11896A05088E1768a63058j6741G3829h0671j75679i0989j95627j87384A8403a90615
$$ 105088 51768 -163058 -179799 73829 -80671 -256350 -90989 -286616 -474000 18403 -190615
11884H01b19505B2249h7640b2268E4661a34924j39282R1055H6727a88686k8787
$$ 801 -219505 22249 -87640 -22268 54661 -134924 -274206 -183151 86727 -188686 -217473
11873b17473m9010a20928j88115b8592k26640D5435a45610B89775g795l5082G3160
$$ -217473 -266483 -120928 -309043 -28592 -255232 45435 -145610 289775 -7795 -42877 73160
11861B66828i4795A88334f25849B92573a32406A25158A1388b93351J23956d6536
$$ 266828 -94795 188334 -625849 292573 -132406 125158 11388 -293351 -169395 -46536
11850e7598j81559A30850d02397h8270l39510J60880c7653A26387f3784c01o2378
$$ -57598 -239157 130850 -402397 -88270 -427780 -266900 -37653 126387 -63784 -301 -62679
11839f2679G0579M03617a78582O1608e8164j31285l1402l9509J17756f8897I1966
$$ -62679 70579 474196 -178582 -116974 -58164 -189449 -220851 -260360 -142604 -68897 91966
11827c08540R5871A42597E4725b15414b7332m8726l4275b7148A71743a55095o6980
$$ -308540 -212669 142597 54725 -215414 -27332 -76058 -110333 -27148 171743 -155095 -222075
11816b22075C1979c1525B76668b97110m1389J25705A94123A8785c734j82640j04756
$$ -222075 31979 -31525 276668 -297110 -338499 -212794 194123 18785 -3734 -186374 -291130
11805b91130J5679k7416B59867F7407J5854h1076j92621n4042K7330B50978a32625
$$ -291130 -275451 -302867 259867 67407 83261 -81076 -273697 -327739 -300409 250978 -132625
11793i4488p7004k34223a04030c9144r4548q3793r0769B19833A174J36160e8761
$$ -94488 -171492 -405715 -104030 -39144 -133692 -217485 -308254 219833 1174 137334 -58761
11781f837A17478m0478J87767a44664A4133g1852A54940D869a70542A27231b62376
$$ -6837 117478 77000 264767 -144664 14133 -71852 154940 4869 -170542 127231 -262376
11769C30555j42756J48228f895D301N978g9318p6690A8334g6959A84408J461e790
$$ 330555 187799 336027 -6895 4301 10279 -79318 -156008 18334 -76959 184408 185869 -5790
11756e7820j95431J06053K2993j31399a7424F2883a92400A5679b21042Q1877G781
$$ -57820 -253251 -147198 -124205 -255604 -17424 62883 -192400 15679 -221042 -139165 7781
11744d2886A89134R9646a38022C10827E1265K0973d2711B4028N8771L7999m8901
$$ -42886 189134 288780 -138022 310827 51265 72238 -42711 24028 82799 120798 71897
11733G1897h3971A96116a87811O3501A89953a61074B24272e1501q9169r7456c4004
$$ 71897 -83971 196116 -187811 -124310 189953 -161074 224272 -51501 -140670 -238126 -34004
11721B22570k5803h6442A80696m0021g6914G6831L82639G654J83254a35996A46813
$$ 222570 196767 -86442 180696 140675 -76914 76831 459470 7654 190908 -135996 146813
11709C26687a0412n579D6451b8646A20730P4125J29256A07945A3826M5407L9324
$$ 326687 -10412 -15991 46451 -28646 120730 194855 324111 107945 13826 59233 98557
11698I8557C0537J91173a25026o1553H3805k3629c87609A9871K39981a16343C01948
$$ 98557 30537 221710 -125026 -186579 83805 60176 -387609 19871 259852 -116343 301948
11686i871I7464a14871j67770G209P7341f1099F9294A0710Q2570a811j08611c4815
$$ -9871 97464 -114871 -282641 7209 84550 -61099 69294 10710 93280 -1811 -110422 -34815
11673a10303p548B34434g0714D5551L25005A21293b83886F5119a59444c9469E8309
$$ -110303 -117851 234434 -70714 45551 370556 121293 -283886 65119 -159444 -39469 58309
11661e1928q4313j61903A81071a21474K2374A65898G664J27314a41044I9543m6526
$$ -51928 -136241 -298144 181071 -121474 -99100 165898 7664 134978 -141044 99543 53017
11650E3017O1332k0858e9911k91157A12708c7630j46196A95441B82R4386b84137
$$ 53017 114349 93491 -59911 -351068 112708 -37630 -183826 195441 282 94668 -284137
11638b30434a3876C90102h4091B62464a01187A69913n6955j7142a69105B6754
$$ -230434 -13876 390102 -84091 262464 -101187 169913 112958 95816 -169105 26754
11627i2750A76477L8738Q8598b54479e3723a6736j31651F0311M8156b3864l9864
$$ -92750 176477 215215 303813 -254479 -53723 -16736 -148387 60311 108467 -23864 -63728
11616f3728K4228A6325K02308e8219j61676d8583A15726D4371a04082A17805b80642
$$ -63728 -39500 16325 218633 -58219 -219895 -48583 115726 44371 -104082 117805 -280642
11604A94013k5936b05808O1456j44423i0477C9324Q8253K38260a34448B44628
$$ 194013 168077 -205808 -144352 -288775 -90477 39324 127577 365837 -134448 244628
11593B11762O7106a23431a6455B43480G3093K512e2013I7223J89643d243q7067
$$ 211762 278868 -123431 -16455 243480 73093 75605 -52013 97223 286866 -4243 -91310
11582i1310F3762a35346A82702m8003J03913l2111e9948n4976B0757d2504A0360
$$ -91310 63762 -135346 182702 134699 238612 206501 -59948 -114924 20757 -42504 10360
11570E7532M9599a40184A00650L1886D3517L75058J23900k03362A36253b72109
$$ 57532 107131 -140184 100650 132536 43517 418575 542475 339113 136253 -272109
11559I8392P1506m5915B1610d5216A70209J9216l7157a15118d8123H0141f681
$$ 98392 169898 123983 21610 -45216 170209 189425 152268 -115118 -48123 80141 -6681
11547B95199d7379D4367a37310B17361B5206J34959O4900i2798k16342I4202K60212
$$ 295199 -47379 44367 -137310 217361 25206 160165 225065 -92798 -309140 94202 354414
11536C54414a01431a0627o1779A76747H4594M4063D0903a46767F46627G1953b39514
$$ 354414 -101431 -10627 -72406 176747 84594 128657 40903 -146767 646627 71953 -239514
11524a51343O4684J3684l887A84124J53175A07073O5576d025D3081d11558a28019
$$ -151343 -86659 -72975 -76862 184124 337299 107073 172649 -4025 43081 -411558 -128019
11512g8635I8001M4737E2601K64210I455a94351b047C10419a7196D4007K60846
$$ -78635 98001 142738 52601 316811 9455 -194351 -2047 310419 -17196 44007 304853
11501C04853Q127D6188e552E037J21160C700J80395p2703O7507p7763q227a17048
$$ 304853 312980 46188 -5552 5037 126197 3700 184095 111392 178899 101136 92909 -117048
11488B09484a3099k46416A47395K02004M365j01554J6434D6520N362c95649B98892
$$ 209484 -13099 -259515 147395 349399 353764 252210 268644 46520 51882 -395649 298892
11476A09492L7541D0660N4387a22910A82438l0992K47069A30091j5039M1875J22173
$$ 109492 147033 40660 95047 -122910 182438 151446 398515 130091 115052 156927 279100
11465B79100K2578l4832D3685Q8965J55533l0075b7581C45529p5869j09155K6054
$$ 279100 301678 266846 43685 132650 288183 258108 -27581 345529 269660 160505 186559
11454A86559F7175l3127J51338B4508L37708b46285A2569a8485B36242j10883
$$ 186559 67175 34048 185386 24508 362216 -246285 12569 -18485 236242 125359
11444A25359D2929a03644b156o3830l6829f418j23149M154G7376a71435O2012
$$ 125359 42929 -103644 -2156 -65986 -102815 -6418 -129567 -125413 77376 -171435 -109423
11433a09423A79643C5950O3955a80286C86343A24575e7924j70067A01952I87M8810
$$ -109423 179643 35950 99905 -180286 386343 124575 -57924 -227991 101952 987 49797
11422D9797b23929A80473A1425J41288a70655c001k12751L3976g434B93365K35554
$$ 49797 -223929 180473 11425 152713 -170655 -3001 -215752 -181776 -7434 293365 528919
11411E28919C4913c84077C95916r1500c28816a6430n8977A38944O5557a80145
$$ 528919 34913 -384077 395916 304416 -328816 -16430 -75407 138944 204501 -180145
11400a07680A68300C1822N9133O1650Q2295C5850a52095c7248B40625c41818g0286
$$ -107680 168300 31822 90955 152605 234900 35850 -152095 -37248 240625 -341818 -70286
11388b83011H3025B3287a13747B00846c05766B72934a7836k6297A86901m9219
$$ -283011 83025 23287 -113747 200846 -305766 272934 -17836 -44133 186901 137682
11378A37682C3207J72426E7622a2279B81191j14509D0343a864C8527g0486E8429
$$ 137682 33207 205633 57622 -12279 281191 166682 40343 -1864 38527 -70486 58429
11366f1135F079b43078P8637k2774R56k82720A30753a51653E4610K7629R5937
$$ -61135 6079 -243078 -164441 -187215 -186259 -468979 130753 -151653 54610 82239 178176
11355A78176b44230I9150l7861M4827a68763a3885k80962m6310b9881m57352A89543
$$ 178176 -244230 99150 61289 106116 -168763 -13885 -294847 -341157 -29881 -487233 189543
11343B9867h5490b5694B88084b48394b5812j72580i3628I0729b26593o994d9821
$$ 29867 -85490 -25694 288084 -248394 -25812 -198392 -93628 90729 -226593 -233587 -49821
11331F6755d0149o1869B6173a86665A50490b07195m6255I2824f6605o448j45493
$$ 66755 -40149 -102018 26173 -186665 150490 -207195 -253450 92824 -66605 -73053 -218546
11320b18546i0525b0896l53184B98399c9090B12216a19807b3482a0507j80729
$$ -218546 -90525 -20896 -374080 298399 -39090 212216 -119807 -23482 -10507 -191236
11310a91236B1766d4886F4157a60626d0430A30446n6055J6349f2592B47330f8723
$$ -191236 21766 -44886 64157 -160626 -40430 130446 74391 90740 -62592 247330 -68723
11298h373m23671g5531p6789m5144A39429c47150j71685A38434d836n9013B13660
$$ -8373 -432044 -75531 -152320 -197464 139429 -347150 -518835 138434 -4836 -63849 213660
11286b28876K7319A8090J05645i3185m0418k48649a46033j38186H3276a97036
$$ -228876 -201557 18090 123735 -93185 -133603 -382252 -146033 -284219 83276 -197036
11275g8917k93878C163g2044A85065k1714d17144g0063k37535a36965o8785I557
$$ -78917 -372795 3163 -72044 185065 163351 -417144 -70063 -307598 -136965 -205750 9557
11263a79540P3611i103q7346E9972j5418c728A32302l6362d66423B3678O9386
$$ -179540 -105929 -9103 -96449 59972 44554 -3728 132302 95940 -466423 23678 93064
11252I3064g4423l1284C35764A27318a37890j50970Q1118g0040r2152D2351R5428
$$ 93064 -74423 -105707 335764 127318 -137890 -288860 -207742 -70040 -162192 42351 137779
11241A37779b14256d3102k8868L1160a0707B86725c14153H532b19061R7775l2849
$$ 137779 -214256 -43102 -71970 -40810 -10707 286725 -314153 8532 -219061 -121286 -154135
11230a54135k914Q703I0614b22685j00226o6540B844N5622a42953e6104k06132
$$ -154135 -157049 -148346 90614 -222685 -322911 -389451 2844 58466 -142953 -56104 -262236
11219b62236k5155F7741h6582j13215B22324b97972I5824g8567C61502e023l45131
$$ -262236 -287391 67741 -86582 -199797 222324 -297972 95824 -78567 361502 -5023 -350154
11208c50154D3998n903g7522G1063J19215e2527G3670c47938J62667A1122a67810
$$ -350154 43998 38095 -77522 71063 190278 -52527 73670 -347938 -185271 11122 -167810
11196a92420b5823N892A50029J88568A01675g7976l6699c0254k9774o7790B3558
$$ -192420 -25823 -19931 150029 338597 101675 -77976 -114675 -30254 -60028 -127818 23558
11184b99905R6164I9915a58795F122M0104K11731b63j53056I0562a05383j722
$$ -299905 -203741 99915 -158795 6122 46226 257957 -263 -153319 90562 -105383 -107105
11173a07105C0142c8271A33242K04212a96738B35253h6247p2384A432h590j01915
$$ -107105 30142 -38271 133242 337454 -196738 235253 -86247 -158631 1432 -8590 -110505
11162a10505j77845A05368b87542a05754j4518A06838D6241g7281A00687a6616
$$ -110505 -288350 105368 -287542 -105754 -120272 106838 46241 -77281 100687 -16616
11151d0418J1408m48643a61575m2968R2711G4554L835d3406E8088a01713j60682
$$ -40418 -29010 -477653 -161575 -204543 -111832 74554 78389 -43406 58088 -101713 -262395
11140b62395p421l347A11388g8983j1731j90923O4555a06450A82655e2933C86766
$$ -262395 -269816 -273163 111388 -78983 -90714 -281637 -217082 -106450 182655 -52933 386766
11128F6532a24890q0813g8105a3955C7090J0899R0275h5340F5646c1384A26369
$$ 66532 -124890 -205703 -78105 -13955 37090 47989 138264 -85340 65646 -31384 126369
11116A01560h4785p2306e780I6664N6052g865F5531e6999C12894a00029A47104
$$ 101560 -84785 -157091 -5780 96664 152716 -7865 65531 -56999 312894 -100029 147104
11104B03537C440K91274A36180b17955o3045A99204a3607k42711g1642A14323
$$ 203537 3440 294714 136180 -217955 -281000 199204 -13607 -256318 -71642 114323
11093B41496b19106j18406B62123a06685A97305I4671D6344K36761c92755f0277
$$ 241496 -219106 -337512 262123 -106685 197305 94671 46344 283105 -392755 -60277
11082B22079g0737L1977B68305r92a15231B82845j17080J71729L9879j84176a708
$$ 222079 -70737 -38760 268305 267313 -115231 282845 165765 337494 377373 193197 -1708
11070H4449K08902j35151D7920J17138B1981K93174B5571M08680A59061L03688
$$ 84449 293351 158200 47920 165058 21981 315155 25571 434251 159061 462749
11060D62749j10438k2118J88853j99791J97693j3500K64886l60657J42485k30187
$$ 462749 352311 330193 519046 319255 516948 503448 768334 407677 550162 319975
11050C19975M15363k32229J25929B82593K39239K84639n8044k20066K04719Q9993
$$ 319975 735338 503109 629038 282593 521832 806471 748427 528361 733080 823073
11040H23073L393K28051D27790J71607L5279n1551A66123N81918k22779J11231
$$ 823073 826466 1054517 427790 599397 634676 583125 166123 748041 525262 636493
11030F36493k71008M87652k87746j24991l0399K19737K50087r3032C85908L85834
$$ 636493 365485 853137 565391 440400 410001 629738 879825 786793 385908 771742
11020G71742j11689k909K59432k42856B22642L83772L50r7385j88869K45902n8999
$$ 771742 660053 657144 916576 673720 222642 606414 606764 509379 320510 566412 507413
11009E07413k7729O8897A91011M09152j20710J37886k09242j21477n5849L04369
$$ 507413 479684 548581 191011 600163 479453 617339 408097 286620 230771 535140
10999E35140N01623D73714j03808J81616j2637j46689M01687j40000j44615O2689
$$ 535140 1036763 473714 369906 551522 538885 392196 793883 653883 509268 571957
10989E71957j95420J99307K32067j17900j00554L8051L39368k21904j5161j06255
$$ 571957 376537 575844 807911 690011 589457 627508 966876 744972 729811 623556
10979F23556O2550j4356K91297q1898K37739l39920Q91483m88595M63436K17133
$$ 623556 686106 671750 963047 881149 1118888 778968 1670451 1181856 1645292 1862425
10969A862425L48507j14053R4487L4249j13284K34335l63247m39538j03678K4495
$$ 1862425 2210932 2096879 2191366 2225615 2112331 2346666 1983419 1543881 1440203 1464698
10959A464698K21941m99445L26770o8603r0335j70411K66746l2532K03480l1931
$$ 1464698 1686639 1187194 1513964 1445361 1355026 1184615 1451361 1418829 1622309 1590378
10949A590378k69095j86777N698j73681j93176L64911n11797r3469j31770j10046
$$ 1590378 1321283 1134506 1140204 966523 773347 1138258 626461 532992 401222 291176
10939B91176A08625J7861J11961Q0393G2773j4132c7453H9648A3998O33079B1320
$$ 291176 108625 126486 238447 318840 72773 58641 -37453 89648 13998 647077 21320
10927a66717l4022Q5715G9481Q2091m1731P8355R034k0377g7414B8589J57184
$$ -166717 -200739 -115024 79481 161572 119841 198196 207230 186853 -77414 28589 185773
10916A85773f958R85q0913l37353a96336B18069o4963F0196b76089J02639O1052
$$ 185773 -6958 -5973 -86886 -424239 -196336 218069 153106 60196 -276089 -173450 -112398
10905a12398A17043d40303A45633h9189j75111A00045N5215d5637A53981J46381
$$ -112398 117043 -440303 145633 -89189 -264300 100045 155260 -45637 153981 300362
10895C00362A46612i5505C7556e8722a440I8468b03461C04077i744l23732R9738
$$ 300362 146612 -95505 37556 -58722 -1440 98468 -203461 304077 -9744 -333476 -233738
10884b33738n6686H6325e761A32054f322A28526D8959J20363o5139P9597d20779
$$ -233738 -290424 86325 -5761 132054 -6322 128526 48959 169322 104183 183780 -420779
10872a04841B865a88227A66158O9926E9834a91362h8301j0604A78661a6830k86634
$$ -104841 2865 -188227 166158 236084 59834 -191362 -88301 -98905 178661 -16830 -303464
10861c03464a11850A51269j7688k1414J14778b16609K0897P6828a7329k86794
$$ -303464 -111850 151269 133581 112167 226945 -216609 -195712 -118884 -17329 -304123
10851c04123I3674H775a90597a2278G2544e3140m809l1836B24126c41856b21n4299
$$ -304123 93674 8775 -190597 -12278 72544 -53140 -57949 -89785 224126 -341856 -221 -54520
10839e4520o9631B88621a31481B38617A9873a26183D08671e1608n8988B92609
$$ -54520 -124151 288621 -131481 238617 19873 -126183 408671 -51608 -110596 292609
10828b4055k27750D689J6834a31689C25652b12878m1106F5582M2608f9722A7293
$$ -24055 -251805 4689 21523 -131689 325652 -212878 -253984 65582 108190 -69722 17293
10816a71928J2043l0056j984A34929a24898r1642A18680R7389a290j34453C2142
$$ -171928 -159885 -189941 -191925 134929 -124898 -216540 118680 216069 -1290 -135743 32142
10804b01770A34082f571k74867j19328a6743B4437e8849k48404M2965A5360K17661
$$ -201770 134082 -6571 -281438 -400766 -16743 24437 -58849 -307253 -264288 15360 233021
10793B33021a76580M1786J8417K6399B02701b58084N5462f4917B7089J6220A3385
$$ 233021 -176580 -134794 -116377 -89978 202701 -258084 -202622 -64917 27089 43309 13385
10781D3693d74079F5843M8208a00681A33911P901b32420m9135C14301d260j65650
$$ 43693 -474079 65843 114051 -100681 133911 141812 -232420 -281555 314301 -4260 -169910
10770a69910N0007N4600k62040c2817p1148p3163A04180A020a84235A61774c97759
$$ -169910 -119903 -65303 -327343 -32817 -103965 -177128 104180 1020 -184235 161774 -397759
10758c71392a43522A64418b42760a01548B01828f2192b7778k86222M9881H2439
$$ -371392 -143522 164418 -242760 -101548 201828 -62192 -27778 -314000 -264119 82439
10747C32078a70664g9788A44448a26129l91307a23042l9031H7322g1849A15599
$$ 332078 -170664 -79788 144448 -126129 -517436 -123042 -162073 87322 -71849 115599
10736b75422D6621e871l29873A27105e9534j0705A08711i7009F4010f1300p5273
$$ -275422 46621 -5871 -335744 127105 -59534 -70239 108711 -97009 64010 -61300 -136573
10725a36573m253c8749q5468F9980C700f6513k53313I5225B0747i1063C1624R5574
$$ -136573 -140826 -38749 -124217 69980 3700 -66513 -319826 95225 20747 -91063 31624 127198
10713A27198a74916G3420a94393k0329Q4026F9731J39250i139j82215N5021A39411
$$ 127198 -174916 73420 -194393 -214722 -130696 69731 208981 -9139 -191354 -136333 139411
10701A20305b04010b5618j16218k3749d1866B666N2023h9939G6043l8011a42338
$$ 120305 -204010 -25618 -141836 -165585 -41866 2666 54689 -89939 76043 38032 -142338
10689A41814i7567A45142a54628c7991m8021e540D38924G6637r191J23872e9999
$$ 141814 -97567 145142 -154628 -37991 -86012 -5540 438924 76637 67446 191318 -59999
10677a07889A6444c53491J10027C0663d8950l2471o7618a2799m4362A34009J04429
$$ -107889 16444 -353491 -243464 30663 -48950 -81421 -149039 -12799 -57161 134009 238438
10666B38438a35396k4642j90993g2097j89933I820R9734J24124b91075J00908
$$ 238438 -135396 -160038 -351031 -72097 -262030 9820 109554 233678 -291075 -190167
10656a90167C7487K43254a69337c090A00307L0336b14092l7694a8274j834j48716
$$ -190167 37487 280741 -169337 -3090 100307 130643 -214092 -251786 -18274 -20108 -168824
10645a68824j71697a28309J3083b3561k9578j43662j48480c7424A3423h4348G9238
$$ -168824 -340521 -128309 -115226 -23561 -53139 -196801 -345281 -37424 13423 -84348 79238
10633b47509a16917j19937J00698q8360R2919f602j25092c2789J2205B24498g6524
$$ -247509 -116917 -236854 -136156 -224516 -131597 -6602 -131694 -32789 -20584 224498 -76524
10621A0576J81908b84531a23126B5616H402a03256a3228A49477E3703R0080F2781
$$ 10576 192484 -284531 -123126 25616 8402 -103256 -13228 149477 53703 143783 62781
10609b26918M83M9380f4466M34j51939a64F1491e0564q349n7701D94962a11306
$$ -226918 -226435 -177055 -64466 -64032 -215971 -164 61491 -50564 -58913 -116614 494962 -111306
10596a28197k1443k11355K5637j00781a00531a2534k93436h5055C5780a96383
$$ -128197 -149640 -360995 -335358 -436139 -100531 -12534 -305970 -85055 35780 -196383
10585A37145b1499k03710j03971G1560J74048A03468K24404C3773M4178a50178
$$ 137145 -21499 -225209 -329180 71560 245608 103468 327872 33773 77951 -150178
10574H3776c1826A06747i9001A68524a9170k37949A27570F0719i7926B90587a40070
$$ 83776 -31826 106747 -99001 168524 -19170 -257119 127570 60719 -97926 290587 -140070
10562c7734B55706n2515h0749B0421b00721G8932b15811A29344B388Q5637M4311
$$ -37734 255706 203191 -80749 20421 -200721 78932 -215811 129344 2388 88025 132336
10551A32336b08794H7694a62523G1427a69037n0772C8421c9441k7685B06560a76418
$$ 132336 -208794 87694 -162523 71427 -169037 -219809 38421 -39441 -67126 206560 -176418
10539a03331o1233B0337h8085q60A8310N4359J05337a75080j8624P6344A2238
$$ -103331 -164564 20337 -88085 -88945 18310 72669 178006 -175080 -193704 -117360 12238
10527f66003f1965q3313B0495a60171A14945a25188j04805A09932k9255h4042
$$ -666003 -61965 -145278 20495 -160171 114945 -125188 -229993 109932 80677 -84042
10516a62515k13521O752a83969r8464b2718j96794g4270o8781b4119l25870a65087
$$ -162515 -376036 -369284 -183969 -282433 -22718 -219512 -74270 -143051 -24119 -349989 -165087
10504g9506j8903k07612P4409E1460a53751k4036j25450b8476j31552E2203L4216
$$ -79506 -98409 -306021 -231612 51460 -153751 -177787 -303237 -28476 -160028 52203 86419
10493H6419b0345D9596b71010d0024o4428G0015b81541h8825b4012j78514j055
$$ 86419 -20345 49596 -271010 -40024 -104452 70015 -281541 -88825 -24012 -202526 -203581
10482b03581B1682c6822n6826B6117K81115H0405j2072N99377j13715K466o2307
$$ -203581 21682 -36822 -93648 26117 307232 80405 68333 667710 553995 556461 494154
10471D94154o9162q1297E0761L5376K02842A32827P0220J08092A8015a39301A44764
$$ 494154 424992 343695 50761 86137 288979 132827 203047 311139 18015 -139301 144764
10459C57383c39033a60278C61963c05429D4443c09779a48140n0843A97370D9387
$$ 357383 -339033 -160278 361963 -305429 44443 -309779 -148140 -198983 197370 49387
10448g4086E5532b06641r5388h5129k3979n201A84831b93879L2513B4172b37155
$$ -74086 55532 -206641 -302029 -85129 -109108 -114309 184831 -293879 -261366 24172 -237155
10436c84099a43468f809o4478F3277J93114o289b25542a6335k74289B22585H0670
$$ -384099 -143468 -6809 -71287 63277 256391 250102 -225542 -16335 -290624 222585 80670
10424a02452A14611a4165B16245p2561i6220r5466c897H8923j435K10553a39197
$$ -102452 114611 -14165 216245 143684 -96220 -191686 -3897 88923 87488 298041 -139197
10412i8490J7135A22982a00751A33613M3247J27644e6179k66660J53974H6700
$$ -98490 -81355 122982 -100751 133613 176860 304504 -56179 -322839 -168865 86700
10401a84127B17540Q57a60336l206j09145P1924B95907A09896c85833A58883a80772
$$ -184127 217540 218397 -160336 -163542 -272687 -200763 295907 109896 -385833 158883 -180772
10389E1457K19603h1883A34291B9701a42071k6594D95527E5440J78680a99338
$$ 51457 271060 -81883 134291 29701 -142071 -168665 495527 55440 234120 -199338
10378a97391F4695f4300A85531P0458j26097m3784j8885i7347p3993C7752J98904
$$ -197391 64695 -64300 185531 255989 129892 86108 67223 -97347 -171340 37752 236656
10367B36656K3004d5716B31381J56991j66441K99968A46896L8845o8222L28917
$$ 236656 259660 -45716 231381 388372 221931 521899 146896 185741 117519 446436
10357D46436r7011k2959a16284B60814j25795K1903L6915K30494j03643N2703
$$ 446436 349425 326466 -116284 260814 135019 156922 193837 424331 320688 373391
10347C73391p4683i6486E88246k68803O2621J4240j43683J19070n7925A55532
$$ 373391 298708 -96486 588246 319443 382064 396304 252621 371691 313766 155532
10336A7628j679K01877c958A16319J37574a4936A57421f8767H8897b26940c3592
$$ 17628 15949 217826 -3958 116319 253893 -14936 157421 -68767 88897 -226940 -33592
10324a65232F4287a25073f2436C44701j58411J23007d6380B69755b05995B53009
$$ -165232 64287 -125073 -62436 344701 186290 309297 -46380 269755 -205995 253009
10313B13836a64573k3457C01216J02201a33586e5088A68426p1634a74105k41557
$$ 213836 -164573 -188030 301216 403417 -133586 -55088 168426 96792 -174105 -415662
10303d15662A75510A3360L0309b31468Q0836j30593H9656a69817F4579J28099
$$ -415662 175510 13360 43669 -231468 -150632 -281225 89656 -169817 64579 192678
10293A92678b11046c5802j27794j7786N3490I9384b83198A02203l016h9172J6841
$$ 192678 -211046 -35802 -163596 -181382 -127892 99384 -283198 102203 99187 -89172 -72331
10282g2331C74979a03851d3154B4070a28302e572G4233m6a7322A65484J5962a45730
$$ -72331 374979 -103851 -43154 24070 -128302 -5572 74233 74187 -17322 165484 181446 -145730
10269h966q2285D6420J90354e7323j66146A72525o9602c79501a04744K4683A03997
$$ -8966 -91251 46420 236774 -57323 -223469 172525 102923 -379501 -104744 -80061 103997
10257a11910D8948j5102N7096O0925k9642R0140a66385A20213A1050L2730J18242
$$ -111910 48948 33846 90942 151867 122225 212365 -166385 120213 11050 43780 162022
10246A62022E753Q80P9570b13643A55297b08191i8944M6719I334Q7556d5421G2246
$$ 162022 5753 6633 86203 -213643 155297 -208191 -98944 -52225 9334 96890 -45421 72246
10233b04393P4517B19179c04686J48686A44039f0464j05834e1541k72207a44904
$$ -204393 -129876 219179 -304686 -156000 144039 -60464 -166298 -51541 -323748 -144904
10222a04403k70702J09589P2975B4369a98166B44349d8583J9163G8173B5161c2954
$$ -104403 -375105 -265516 -192541 24369 -198166 244349 -48583 -29420 78173 25161 -32954
10210a90703D76810B0749E241J33383b17920c9875A19363b03101D3790h3120m5741
$$ -190703 476810 20749 5241 138624 -217920 -39875 119363 -203101 43790 -83120 -128861
10199a28861r1270d3654P787j09842b7594l32147a78790j06931I0476e2583k56422
$$ -128861 -220131 -43654 -35867 -145709 -27594 -359741 -178790 -285721 90476 -52583 -309005
10188c09005A39154M3060b1280A17214b43654H8223a39451q2782C9854K39460
$$ -309005 139154 182214 -21280 117214 -243654 88223 -139451 -222233 39854 279314
10178B79314a82187b7297j89108A69292j7302a13934B55409B4569j0544N9581
$$ 279314 -182187 -27297 -216405 169292 151990 -113934 255409 24569 14025 73606
10168G3606d4214B27881a23180A93257a37413n5207f1531b8110l74446b560o9450
$$ 73606 -44214 227881 -123180 193257 -137413 -192620 -61531 -28110 -402556 -2560 -72010
10157g2010o5364A17139b89530a22745C1761j3846g2910n5898M8221H8678a33682
$$ -72010 -137374 117139 -289530 -122745 31761 17915 -72910 -128808 -80587 88678 -133682
10145d2777B5691b91171H5758f8579j87k5538I8832f8013D20282A02488J24088
$$ -42777 25691 -291171 85758 -68579 -68766 -94304 98832 -68013 420282 102488 226576
10134B26576g7101H6034c04183g566o9579B85003E195c05646r9874b9110G0540
$$ 226576 -77101 86034 -304183 -7566 -77145 285003 5195 -305646 -405520 -29110 70540
10122a7817A26894k9986a20144q9484e4849A41977b40530h4145d0125j03535G9076
$$ -17817 126894 96908 -120144 -209628 -54849 141977 -240530 -84145 -40125 -143660 79076
10110b16287A61619p2669a19178a1416j82223A3821K25839E8706c89324A04350
$$ -216287 161619 88950 -119178 -11416 -193639 13821 239660 58706 -389324 104350
10099c00564E9753a21720J3693M7357B61479F9066e0229k02368L4865d649n6178
$$ -300564 59753 -121720 -108027 -60670 261479 69066 -50229 -252597 -217732 -4649 -60827
10088f0827N934A55190e7348l08769G3605q796P7890a40290f5148j25945a7450
$$ -60827 -54893 155190 -57348 -366117 73605 64809 142699 -140290 -65148 -191093 -17450
10076a78904n8747F6901a44501p5437l9790k8934d8103A07870a77063n7486A3795
$$ -178904 -237651 66901 -144501 -219938 -259728 -288662 -48103 107870 -177063 -234549 13795
10064i2612C2790a284m2886j5669j1546k35990G0737K09667q6241B0577h9316
$$ -92612 32790 -1284 -44170 -59839 -71385 -307375 70737 280404 194163 20577 -89316
10052d226A21358c84052R9826A43687a15145k2276k17991a36572A49585b3882
$$ -4226 121358 -384052 -284226 143687 -115145 -137421 -355412 -136572 149585 -23882
10041I8436i2150A35001Q665D4452A6818b37667R6312D2734a51731k8371O8787
$$ 98436 -92150 135001 143666 44452 16818 -237667 -141355 42734 -151731 -180102 -111315
10030a11315k3874r6102B8582e667l66120a29861L2431C3867C060e3879m6225
$$ -111315 -135189 -231291 28582 -5667 -371787 -129861 -97430 33867 3060 -53879 -100104
10019a00104M1833l25260c124p5762i507C713a8639B35607i6459B1542h2040j39730
$$ -100104 -58271 -383531 -3124 -78886 -9507 3713 -18639 235607 -96459 21542 -82040 -221770
10007b21770a7336C1145a49925j89889K3311a39534N7906A24963E2716L41894
$$ -221770 -17336 31145 -149925 -339814 -316503 -139534 -81628 124963 52716 394610
9997C94610a24073m198j07070J14969c6989C4059A2816N79355b50092F3868j9218
$$ 394610 -124073 -128271 -235341 -120372 -36989 34059 12816 592171 -250092 63868 44650
9986D4650a98972i4246r2452O2744k3738l14316K03693D42128b2245k10899i4780
$$ 44650 -198972 -94246 -186698 -123954 -147692 -462008 -258315 442128 -22245 -233144 -94780
9974a02221j82038b5844l6052j05785A50985a25458a0954l1028B12043A6458O5333
$$ -102221 -284259 -25844 -61896 -167681 150985 -125458 -10954 -41982 212043 16458 81791
9963H1791n939b22913A25989f7141m72066i5476B3581n250b18204M5372r908m3891
$$ 81791 75852 -222913 125989 -67141 -539207 -95476 23581 18331 -218204 -172832 -182740 -226631
9951b26631B27228c33457F7704a98211k3399q7651e2691p1124j24485B88438g4957
$$ -226631 227228 -333457 67704 -198211 -221610 -309261 -52691 -123815 -248300 288438 -74957
9939a71191O0676K0072L8349j07550o1516D6455b38068F2197K87965a86614j57918
$$ -171191 -110515 -90443 -52094 -159644 -221160 46455 -238068 62197 350162 -186614 -344532
9928c44532J15388a2940n6796l086j24183M1998f5572j22956A79436d844k9508
$$ -344532 -229144 -12940 -69736 -72822 -197005 -155007 -65572 -188528 179436 -4844 -34352
9917c4352j92935P0325P5534J4975e538E6376J0736B6008F15N4713a41087n0340
$$ -34352 -227287 -156962 -81428 -66453 -5538 56376 67112 26008 615 55328 -141087 -191427
9905a91427k6596A4948a01185j90675e2529A09592a75278p8325d4190A00961a66606
$$ -191427 -218023 14948 -101185 -291860 -52529 109592 -175278 -253603 -44190 100961 -166606
9893C54911a46456a9209l52740a3076q6222H4018a32082k7059D6257b78245f5594
$$ 354911 -146456 -19209 -371949 -13076 -99298 84018 -132082 -159141 46257 -278245 -65594
9881a53799J5193O2910q599q7514A50921a80008d6331D1053c61658c3331j07877
$$ -153799 -138606 -75696 -84295 -171809 150921 -180008 -46331 41053 -361658 -33331 -141208
9870a41208J4205A71813d25973D657a46994J4312M2560A0345L01102A25368K46816
$$ -141208 -127003 171813 -425973 4657 -146994 -132682 -90122 10345 311447 125368 372184
9859C72184j28684f6926r088r6230m6091L2120A80110G0159O9882a19018l4628
$$ 372184 243500 -66926 -76014 -172244 -218335 -186215 180110 70159 140041 -119018 -153646
9848a53646E25088b24080B27262h3010o5543b5893o4527a9878k31950g6748A57002
$$ -153646 525088 -224080 227262 -83010 -148553 -25893 -90420 -19878 -251828 -76748 157002
9836c9664m9258b957C9130K19713b26398P0678D0137K76292a31491e3297b1562
$$ -39664 -88922 -2957 39130 258843 -226398 -155720 40137 316429 -131491 -53297 -21562
9824F8172e6722A11709b96666J43194K2779o0308P3413M0711j35197e0618k34665
$$ 68172 -56722 111709 -296666 -153472 -130693 -191001 -117588 -76877 -212074 -50618 -285283
9813b85283f1434B00356e1174F4724r910b05586o2202P7788A51207H282L1779
$$ -285283 -61434 200356 -51174 64724 54814 -205586 -267788 -190000 151207 8282 40061
9802D0061A9475q240c946r0465r6582j16892i4836k46520h2078a2702k86929e9098
$$ 40061 19475 11235 -3946 -94411 -190993 -307885 -94836 -341356 -82078 -12702 -299631 -59098
9789a93658j1203q949Q5615e6952m34792F4982a80522N0839C8337a20656r8046
$$ -193658 -204861 -213810 -128195 -56952 -491744 64982 -180522 -129683 38337 -120656 -218702
9778b18702A80384a95126d3805B32899d68063d5366k20874j94314J31922f6439
$$ -218702 180384 -195126 -43805 232899 -468063 -45366 -266240 -460554 -328632 -66439
9767B02957c20419d5000o2168d0520G1773R136h2768j8228c0948B82612q7838
$$ 202957 -320419 -45000 -107168 -40520 71773 80909 -82768 -100996 -30948 282612 194774
9756A94774A5751a75334j82819a67274J2810A73044b69221a1113A49062l9010
$$ 194774 15751 -175334 -358153 -167274 -154464 173044 -269221 -11113 149062 110052
9746A10052d486A4398J63686C5037g1080B60944a28439m6612P2287r2320f1954
$$ 110052 -4486 14398 178084 35037 -71080 260944 -128439 -175051 -102764 -195084 -61954
9734d44739C7420d4419A01793a29650j39632f660b160k3116A08072d48108B1373
$$ -444739 37420 -44419 101793 -129650 -269282 -6660 -2160 -25276 108072 -448108 21373
9722I9769a28013j04413B650h0880l06964P6923F1533a24564j77606k4254B2519
$$ 99769 -128013 -232426 2650 -80880 -387844 -310921 61533 -124564 -302170 -326424 22519
9710d35260d8686j08889Q887k93873A49805l9618f8274l95913e3682k35130i5045
$$ -435260 -48686 -157575 -148688 -442561 149805 110187 -68274 -464187 -53682 -288812 -95045
9698b08937b7529q7644q1661H3846c51532G9900a92500B40126F3213M9945d7435
$$ -208937 -27529 -115173 -196834 83846 -351532 79900 -192500 240126 63213 113158 -47435
9686i3847A19314J0730J75215a07946e1631k77368B0493L64902b53369j10613
$$ -93847 119314 130044 305259 -107946 -51631 -328999 20493 385395 -253369 -363982
9676c63982A04143h7741m3433k66760B94417J23260a41670C73457D3377a37415
$$ -363982 104143 -87741 -131174 -397934 294417 417677 -141670 373457 43377 -137415
9665C1228c56077a24939k30294a20837D3505f3369j28751F9190i9926n4166A08969
$$ 31228 -356077 -124939 -355233 -120837 43505 -63369 -192120 69190 -99926 -154092 108969
9653a10324j11546d2015B27007j2004f7887E5405a0749C3803h9671r4109P8385
$$ -110324 -221870 -42015 227007 215003 -67887 55405 -10749 33803 -89671 -183780 -105395
9642a05395A35575F0258a8710A53476b27037d0516J6386B42618I9623b87894i4943
$$ -105395 135575 60258 -18710 153476 -227037 -40516 -24130 242618 99623 -287894 -94943
9630c78028g7028c6593m6117C2080a91817I3931b72396M6434A00862a22729E7766
$$ -378028 -77028 -36593 -82710 32080 -191817 93931 -272396 -225962 100862 -122729 57766
9618G879K29925a85972O4548A14173a78092j09100o5221a07758d0293I4421e3874
$$ 7879 237804 -185972 -121424 114173 -178092 -287192 -352413 -107758 -40293 94421 -53874
9606f0889j60267j08480h5675F8479h7943A53218c40871R8902q1920J42476M0500
$$ -60889 -221156 -329636 -85675 68479 -87943 153218 -340871 -241969 -323889 -181413 -140913
9595a40913A55142M6394b74721h8968D942b55858a01205j62264k77055a63806
$$ -140913 155142 201536 -274721 -88968 4942 -255858 -101205 -263469 -540524 -163806
9584C0388a80482L5153A87683a79907F0469G283J28335a40527e529A52465G1531
$$ 30388 -180482 -145329 187683 -179907 60469 7283 135618 -140527 -5529 152465 71531
9572a36580A71620a28155j52855A23162d62382c7097F4858J06315p5197b13329
$$ -136580 171620 -128155 -281010 123162 -462382 -37097 64858 171173 95976 -213329
9561G050a15595C20249i2483m14196i4214j6127I8616c0343j32952k36346h7421
$$ 7050 -115595 320249 -92483 -506679 -94214 -110341 98616 -30343 -163295 -399641 -87421
9549F8103N3589a07997a6179k97267g0287p917B6890c25313a39524o7517A46562
$$ 68103 121692 -107997 -16179 -313446 -70287 -78204 26890 -325313 -139524 -207041 146562
9537d42823H233R6516d4543j94683k7121e9717K4519j9515k5816j03743Q8363
$$ -442823 8233 104749 -44543 -239226 -266347 -59717 -35198 -54713 -80529 -184272 -95909
9526i5909A26225k9200j1353b33556L4955A20875b3901C19459c30485J54227j82625
$$ -95909 126225 97025 85672 -233556 -198601 120875 -23901 319459 -330485 -176258 -358883
9515c58883B15474A0282k88J08185e7149b3290k57257f4438E43681i1176j8831
$$ -358883 215474 10282 9994 118179 -57149 -23290 -280547 -64438 543681 -91176 -110007
9504a10007j62720r1119J6631H8823k4218Q5432a06625K0296l88287A23983B4492
$$ -110007 -272727 -363846 -347215 88823 64605 150037 -106625 -86329 -474616 123983 24492
9492c64049E0807a55941j63047J23734j37391F7978J46234c84417e2369a3085
$$ -364049 50807 -155941 -318988 -195254 -332645 67978 214212 -384417 -52369 -13085
9481C59878j67103B7823Q5571a25611A19923b4929B89681A20101b57418a26573
$$ 359878 192775 27823 113394 -125611 119923 -24929 289681 120101 -257418 -126573
9470d17492A93881a89935d3480r8648d8574D838a4419A27962J30165b47778c2132
$$ -417492 193881 -189935 -43480 -142128 -48574 4838 -14419 127962 258127 -247778 -32132
9458a90861j38812J57753r6754A00019K04096H7013b7874l39451a26704k66926
$$ -190861 -329673 -171920 -268674 100019 304115 87013 -27874 -367325 -126704 -393630
9448c93630A68896b28393I7704K84813i9753H6266g2198E4007a96226A04823A5150
$$ -393630 168896 -228393 97704 382517 -99753 86266 -72198 54007 -196226 104823 15150
9436I8982b42523B9530f7909B42116A1316J77636G1917a29990i059j51994e2848
$$ 98982 -242523 29530 -67909 242116 11316 188952 71917 -129990 -9059 -161053 -52848
9424a58439D8484L597a05285M016d3425h845l7230I4906O5433c8587B93422a30734
$$ -158439 48484 52081 -105285 -101269 -43425 -8845 -46075 94906 160339 -38587 293422 -130734
9411e7395k34010A07322b24760A4780b16458O3417A79669m0202b62357k9460G4714
$$ -57395 -291405 107322 -224760 14780 -216458 -153041 179669 139467 -262357 -291817 74714
9399g4560r958k07309C4159b1841j08481c7933A71821m2802M6266a45292f1852
$$ -74560 -84518 -291827 34159 -21841 -130322 -37933 171821 129019 175285 -145292 -61852
9387c4911k94804e3884A62684G7326c26447j30045b08472K8459H7038J79950c7632
$$ -34911 -329715 -53884 162684 77326 -326447 -456492 -208472 -180013 87038 266988 -37632
9375B49689g3178k01208R9020A58533b0412q6862B13305d46019A97064d1838k16096
$$ 249689 -73178 -274386 -175366 158533 -20412 -107274 213305 -446019 197064 -41838 -257934
9364b57934q3236A55039J55399i0477A46337f6123d663l4895k07618B47635I6836
$$ -257934 -341170 155039 310438 -90477 146337 -66123 -4663 -39558 -247176 247635 96836
9352b96907J02017J5493A04155a92199e7621m2131B6231N3123K4815j8865b60813
$$ -296907 -194890 -179397 104155 -192199 -57621 -99752 26231 79354 104169 85304 -260813
9340i7436Ok17400P1635E3298d1334l50645G6579O8746a14932A3303K3372b33841
$$ -97436 -97430 -314830 -243195 53298 -41334 -391979 76579 145325 -114932 13303 36675 -233841
9327A04415e2426B92550a95505k51461A58994E4963g8857C17839B5217a20341
$$ 104415 -52426 292550 -195505 -446966 158994 54963 -78857 317839 25217 -120341
9316C21090f439j38464C2192L7292M6435a38886B5434I438c038A19578h4804A62666
$$ 321090 -6439 -144903 32192 69484 115919 -138886 25434 9438 -3038 119578 -84804 162666
9303A1707A07J49878a8118l01070J10344c7417G7083a07709j79111R9389m3541
$$ 11707 107 149985 -18118 -319188 -208844 -37417 77083 -107709 -286820 -187431 -230972
9292b30972F8009b16011D8149b13964R4012A37510c09076J10113P8583k02802
$$ -230972 68009 -216011 48149 -213964 -119952 137510 -309076 -198963 -120380 -323182
9282c23182A5381L883P167a94906B2661C949c09961c3590j67933a5730A58861
$$ -323182 15381 19264 26431 -194906 22661 3949 -309961 -33590 -201523 -15730 158861
9270e9170B20131a90189N0899F9072l0059P8314A2366c40082q8037i6883H3610
$$ -59170 220131 -190189 -139290 69072 39013 117327 12366 -340082 -428119 -96883 83610
9258A99587f3239l79293e3112m2056j14671k69710C6624a53984I5017r489K64706
$$ 199587 -63239 -442532 -53112 -95168 -209839 -479549 36624 -153984 95017 85528 350234
9247C50234A20826g1296C64874a09240j20145L7594Q6385G4410c6601B16298b83808
$$ 350234 120826 -71296 364874 -109240 -229385 -191791 -105406 74410 -36601 216298 -283808
9235d9970m51640C27415A41678e49713a84916H906O0389K847p650a79535A61157
$$ -49970 -501610 327415 141678 -549713 -184916 8906 69295 72142 64492 -179535 161157
9223g8006A5412Q1153b45324R1225A80938d81212b4744j42883P8298p3004F128
$$ -78006 15412 96565 -245324 -154099 180938 -481212 -24744 -167627 -89329 -162333 6128
9211a99316b5119l4210A19253D2246f7937q5087H9633a29144B04536B1341P5452
$$ -199316 -25119 -59329 119253 42246 -67937 -153024 89633 -129144 204536 21341 96793
9200I6793b70882a32667d2461j05749A09524b94978j46407G3658a04215d1644
$$ 96793 -270882 -132667 -42461 -148210 109524 -294978 -441385 73658 -104215 -41644
9189a82657D68400k22958b13940d7029B6994c04225a7952F7387b30708A75063
$$ -182657 468400 245442 -213940 -47029 26994 -304225 -17952 67387 -230708 175063
9178b8408n0047j51031B4534b29433D1104b68388a11073M9915C38268G6753d4135
$$ -28408 -78455 -229486 24534 -229433 41104 -268388 -111073 -61158 338268 76753 -44135
9166b20362c1803j46654B0072a95511C3522g5591j10400C56033h0517A51191a58121
$$ -220362 -31803 -178457 20072 -195511 33522 -75591 -185991 356033 -80517 151191 -158121
9154d50287A43098R0710c6665F2886a74610j2406H6092c0221A34960a12790j31740
$$ -450287 143098 233808 -36665 62886 -174610 -187016 86092 -30221 134960 -112790 -244530
9143b44530M7601n088j04252I3025D6475b57923B8095g9565a821j08576m3771
$$ -244530 -196929 -202017 -306269 93025 46475 -257923 28095 -79565 -1821 -110397 -154168
9132a54168j05835J1405J07216c6060k783l0688b3643B9466d807r2001E5148d6319
$$ -154168 -260003 -248598 -141382 -36060 -38843 -69531 -23643 29466 -4807 -96808 55148 -46319
9119A5333K4012i4590K1879m6984j91257g8585L6582B99283E4425b69268G6509
$$ 15333 39345 -94590 -72711 -119695 -310952 -78585 -42003 299283 54425 -269268 76509
9107A489b44566P7710K7206A54209B1738J9642b80490J12072c4052D3349O021
$$ 1489 -244566 -166856 -139650 154209 21738 41380 -280490 -168418 -34052 43349 49370
9096D9370Q5667e3970j21470A32184e7156k80776l388J58806c2987k51851Q0997
$$ 49370 135037 -53970 -175440 132184 -57156 -337932 -341320 -182514 -32987 -284838 -203841
9085b03841J5802f1290l67020a415p8697E5439j2078a87131A5485L6675e7358
$$ -203841 -188039 -61290 -428310 -1415 -80112 55439 43361 -187131 15485 52160 -57358
9073a34499k9910r8219f3705B46385b06819m8969a27140A01874M7568a36297j50711
$$ -134499 -164409 -262628 -63705 246385 -206819 -255788 -127140 101874 149442 -136297 -287008
9062b87008H5168J11469c5875J2998q6393c3578A0721b68783f1090k2785D5639
$$ -287008 85168 196637 -35875 -22877 -109270 -33578 10721 -268783 -61090 -83875 45639
9050d24978B4875c3969p7578m1938o2053B97120j41961g4310A4641J59222d12611
$$ -424978 24875 -33969 -111547 -153485 -215538 297120 155159 -74310 14641 173863 -412611
9038i2522B16326j2295O3285a54286G05J2330c1715P022A90758b9409j04976l1686
$$ -92522 216326 204031 267316 -154286 705 13035 -31715 -24693 190758 -29409 -134385 -166071
9026a66071k30216a5192D07392a48742D2063a05753j489n5552D0123b33808B48446
$$ -166071 -396287 -15192 407392 -148742 42063 -105753 -107242 -162794 40123 -233808 248446
9014E0971b2523k94629A1035g0164n3921j79295e4727A09263c40742J63812o716
$$ 50971 -22523 -317152 11035 -70164 -124085 -303380 -54727 109263 -340742 -176930 -183646
9003a83646A31572b50530A28883O831F6803e4875B23143f1079a1373j62667r1347
$$ -183646 131572 -250530 128883 135714 66803 -54875 223143 -61079 -11373 -174040 -265387
8992b65387D0181a83184k1102H7295Q1618a40636C0273i9120A08258d12068d211
$$ -265387 40181 -183184 -204286 87295 168913 -140636 30273 -99120 108258 -412068 -4211
8980c321k70981k8163m3039C3816O9540a51005q6949r2908Q5363B73296a32860
$$ -3321 -274302 -302465 -345504 33816 103356 -151005 -237954 -330862 -245499 273296 -132860
8968c93823f9987b6747j07485l8772C547b34117A26500h8966D0700d13854H1029
$$ -393823 -69987 -26747 -134232 -173004 3547 -234117 126500 -88966 40700 -413854 81029
8956a19630N5056E4233J33a11972M4398j08063B46999f2550q3369L6927B98714
$$ -119630 -64574 54233 54366 -111972 -67574 -175637 246999 -62550 -145919 -108992 298714
8944b27425d435k1601o5642A93368b24341m9018a02991G2729a11594m0806f8778
$$ -227425 -4435 -26036 -91678 193368 -224341 -273359 -102991 72729 -111594 -152400 -68778
8932A47865K09238A56084K14830a4905A28427n3448L8918J50897o3880L10969
$$ 147865 357103 156084 370914 -14905 128427 74979 113897 264794 200914 511883
8922E11883J91971L30064J975441R108354m969908B453455I25917m45725j65148
$$ 511883 703854 1033918 3009359 12117713 7147805 2453455 925917 480192 315044
8913C15044q3750a27761D7181J67854J70294j38059p6590J51610a3776A39032
$$ 315044 231294 -127761 47181 215035 385329 247270 170680 322290 -13776 139032
8902C17111c86521a42252j53223h2977j38518l6276c5430A65273b05895A0189
$$ 317111 -386521 -142252 -295475 -82977 -221495 -257771 -35430 165273 -205895 10189
8891b56916A979a56118A14945b14107A7155N4636b9154B4203J21307J11860F5498
$$ -256916 1979 -156118 114945 -214107 17155 71791 -29154 24203 145510 257370 65498
8879A81534c0738g309k69208J07021A58199b8051m12918B20093a2930k61027B20470
$$ 181534 -30738 -7309 -276517 -169496 158199 -28051 -440969 220093 -12930 -273957 220470
8867b24800B21099a92963A28590J99e8754H2916a35575D8007G350K32986J71398
$$ -224800 221099 -192963 128590 128789 -58754 82916 -135575 48007 7350 240336 411734
$$ [...]
##END NTUPLES=NMR SPECTRUM
##END=
