
##TITLE=AC1328_GUAAH12157_6535940_7y3JOrinaq
##JCAMPDX= 6.0         $$ Bruker NMR JCAMP-DX V2.0
##DATA TYPE= NMR SPECTRUM
##DATA CLASS= NTUPLES
##ORIGIN= BRUKER
##OWNER= Administrator
$$ 1.72 TOPSPIN		Version 2.1
$$ 2012-07-17 21:24:43.656 -0500  Administrator@TOPSPIN
$$ Compression mode = diff/dup
##.OBSERVE FREQUENCY= 400.02188249412
##.OBSERVE NUCLEUS= ^1H
##.ACQUISITION MODE= SIMULTANEOUS (DQD)
##.ACQUISITION SCHEME= undefined
##.AVERAGES= 8
##.DIGITISER RES= 22
##SPECTROMETER/DATA SYSTEM= spect
##.PULSE SEQUENCE= zg30
##.SOLVENT NAME= COFFEE_meoh
##.SHIFT REFERENCE= INTERNAL, COFFEE_meoh, 1, 14.98509
##AUDIT TRAIL= $$ (NUMBER, WHEN, WHO, WHERE, PROCESS, VERSION, WHAT)
$$ ##TITLE= Audit trail, TOPSPIN		Version 2.1
$$ ##JCAMPDX= 5.01
$$ ##ORIGIN= Bruker BioSpin GmbH
$$ ##OWNER= Administrator
$$ $$ C:\Bruker\TOPSPIN/data/COFFEE/nmr/AC1328_GUAAH12157_6535940_7y3JOrinaq/10/pdata/1/auditp.txt
$$ ##AUDIT TRAIL=  $$ (NUMBER, WHEN, WHO, WHERE, PROCESS, VERSION, WHAT)
(   1,<2012-07-17 21:24:36.812 -0500>,<Administrator>,<TOPSPIN>,<go>,<TOPSPIN 2.1>,
      <created by zg
	started at 2012-07-17 21:23:30.234 -0500,
	POWCHK enabled, PULCHK disabled,
       configuration hash MD5:
       6B 1B 68 BB D9 2E 58 E2 7F 35 AD 54 07 DF 0E 41
       data hash MD5: 64K
       34 E1 59 E3 B5 F8 08 25 68 47 A4 1E DE 14 34 6A>)
(   2,<2012-07-17 21:24:39.515 -0500>,<Administrator>,<TOPSPIN>,<proc1d>,<TOPSPIN 2.1>,
      <Start of raw data processing
       efp LB = 0 FT_mod = 6 PKNL = 1 PHC0 = 0 PHC1 = 0 SI = 32K 
       data hash MD5: 32K
       27 59 05 B4 BC 68 B5 24 C4 73 A3 5C 29 0A A8 D9>)
(   3,<2012-07-17 21:24:39.921 -0500>,<Administrator>,<TOPSPIN>,<proc1d>,<TOPSPIN 2.1>,
      <pk PHC0 = 176.7975 PHC1 = 0 
       data hash MD5: 32K
       F3 7B 76 DB 0A 83 A2 73 ED 70 47 84 F1 45 1A D7>)
(   4,<2012-07-17 21:24:40.031 -0500>,<Administrator>,<TOPSPIN>,<proc1d>,<TOPSPIN 2.1>,
      <abs ABSG = 1 
       data hash MD5: 32K
       70 AB 0F 9D EB 20 DB C9 E6 9F C2 1A F6 F5 B2 96>)
(   5,<2012-07-17 21:24:40.062 -0500>,<Administrator>,<TOPSPIN>,<proc1d>,<TOPSPIN 2.1>,
      <abs ABSG = 2 
       data hash MD5: 32K
       54 C0 D4 D0 C5 81 9F 0F 51 C0 65 52 9B 21 D3 67>)
(   6,<2012-07-17 21:24:40.093 -0500>,<Administrator>,<TOPSPIN>,<proc1d>,<TOPSPIN 2.1>,
      <abs ABSG = 3 
       data hash MD5: 32K
       8A 19 10 7E 50 7B 18 9C F8 14 60 98 CE FF 62 3D>)
(   7,<2012-07-17 21:24:40.125 -0500>,<Administrator>,<TOPSPIN>,<proc1d>,<TOPSPIN 2.1>,
      <abs ABSG = 4 
       data hash MD5: 32K
       4C F6 95 12 B1 5D 29 AA EE 0B 37 42 61 56 63 D5>)
(   8,<2012-07-17 21:24:40.156 -0500>,<Administrator>,<TOPSPIN>,<proc1d>,<TOPSPIN 2.1>,
      <abs ABSG = 5 
       data hash MD5: 32K
       B0 84 90 80 F8 C9 17 8B 04 17 43 BE 5E 07 52 44>)
$$ ##END=
$$ 
$$ $$ hash MD5
$$ $$ DA C8 36 53 A2 5C 18 A8 58 AB DA 75 0A 7B 43 3A
##$RELAX= 
##$RELAX= 
##$RELAX= 
##$RELAX= 
##$RELAX= 
##$RELAX= 
##$RELAX= 
$$ Bruker specific parameters
$$ --------------------------
$$ [...]
##$TP= (0..7)
150 150 150 150 150 150 150 150
##$TP07= 0
##$TPNAME0= <>
##$TPNAME1= <>
##$TPNAME2= <>
##$TPNAME3= <>
##$TPNAME4= <>
##$TPNAME5= <>
##$TPNAME6= <>
##$TPNAME7= <>
##$TPOAL= (0..7)
0.5 0.5 0.5 0.5 0.5 0.5 0.5 0.5
##$TPOFFS= (0..7)
0 0 0 0 0 0 0 0
##$TUNHIN= 0
##$TUNHOUT= 0
##$TUNXOUT= 0
##$USERA1= <user>
##$USERA2= <user>
##$USERA3= <user>
##$USERA4= <user>
##$USERA5= <user>
##$V9= 5
##$VALIST= <valist>
##$VCLIST= <CCCCCCCCCCCCCCC>
##$VD= 0
##$VDLIST= <DDDDDDDDDDDDDDD>
##$VPLIST= <PPPPPPPPPPPPPPP>
##$VTLIST= <TTTTTTTTTTTTTTT>
##$WBST= 2048
##$WBSW= 25
##$XGAIN= (0..3)
0 0 0 0
##$XL= 0
##$YL= 0
##$YMAX_a= 501792
##$YMIN_a= -641917
##$ZGOPTNS= <>
##$ZL1= 120
##$ZL2= 120
##$ZL3= 120
##$ZL4= 120
##$ABSF1= 14.98509
##$ABSF2= -5.573092
##$ABSG= 5
##$ABSL= 3
##$ALPHA= 0
##$AQORDER= 0
##$ASSFAC= 0
##$ASSFACI= 0
##$ASSFACX= 0
##$ASSWID= 0
##$AUNMP= <proc_prof1d_extract_pilot.lims>
##$AXLEFT= 0
##$AXNAME= <>
##$AXNUC= <1H>
##$AXRIGHT= 0
##$AXTYPE= 0
##$AXUNIT= <>
##$AZFE= 0.1
##$AZFW= 0.1
##$BCFW= 0
##$BC_mod= 0
##$BYTORDP= 0
##$COROFFS= 0
##$CY= 15
##$DATMOD= 1
##$DC= 0
##$DFILT= <>
##$DTYPP= 0
##$F1P= 0
##$F2P= 0
##$FCOR= 0.5
##$FTSIZE= 32768
##$FT_mod= 6
##$GAMMA= 0
##$GB= 0
##$INTBC= 1
##$INTSCL= 1
##$ISEN= 128
##$LB= 0
##$LEV0= 0
##$LPBIN= 0
##$MAXI= 10000
##$MC2= 0
##$MEAN= 0
##$ME_mod= 0
##$MI= 0
##$NCOEF= 0
##$NC_proc= -8
##$NLEV= 6
##$NOISF1= 0
##$NOISF2= 0
##$NSP= 0
##$NTH_PI= 0
##$NZP= 0
##$OFFSET= 14.98509
##$PC= 1
##$PHC0= 176.7975
##$PHC1= 0
##$PH_mod= 1
##$PKNL= yes
##$PPARMOD= 0
##$PPDIAG= 0
##$PPIPTYP= 0
##$PPMPNUM= 2147483647
##$PPRESOL= 1
##$PSCAL= 4
##$PSIGN= 0
##$PYNMP= <proc.py>
##$REVERSE= no
##$SF= 400.02
##$SI= 32768
##$SIGF1= 0
##$SIGF2= 0
##$SINO= 400
##$SIOLD= 32768
##$SPECTYP= <>
##$SREGLST= <1H.CDCl3>
##$SSB= 0
##$STSI= 32768
##$STSR= 0
##$SW_p= 8223.68421052631
##$SYMM= 0
##$S_DEV= 0
##$TDeff= 65536
##$TDoff= 0
##$TI= <>
##$TILT= no
##$TM1= 0
##$TM2= 0
##$TOPLEV= 0
##$USERP1= <user>
##$USERP2= <user>
##$USERP3= <user>
##$USERP4= <user>
##$USERP5= <user>
##$WDW= 1
##$XDIM= 32768
##$YMAX_p= 473217239
##$YMIN_p= -774849
##$CURPLOT= <Network HP LaserJet P1505>
##$CURPRIN= <$Network HP LaserJet P1505>
##$DFORMAT= <normdp>
##$LAYOUT= <+/1D_H.xwp>
##$LFORMAT= <normlp>
##$PFORMAT= <normpl>
##$SURQMSG= 1
$$ End of Bruker specific parameters
$$ ---------------------------------
##NTUPLES= NMR SPECTRUM
##VAR_NAME=  FREQUENCY,     SPECTRUM/REAL,   SPECTRUM/IMAG
##SYMBOL=    X,             R,               I
##VAR_TYPE=  INDEPENDENT,   DEPENDENT,       DEPENDENT
##VAR_FORM=  AFFN,          ASDF,            ASDF
##VAR_DIM=   32768,         32768,           32768
##UNITS=     HZ,            ARBITRARY UNITS, ARBITRARY UNITS
##FACTOR=    0.250966925370066, 1,           1
##FIRST=     8223.43324360094, -143320,      157937
##LAST=      0,             -87628,          8007
##MIN=       0,             -774849,         0
##MAX=       8223.43324360094, 473217239,    0
$$ Real data points
##PAGE= N=1
##DATA TABLE= (X++(R..R)), XYDATA
$$ [...]
$$ plain form
19544 13693 30247 -272773 -246474 61084 140340 117318 -52114 -280944 -490835 178557 71862
19532 111036 -112320 149027 -217124 -261057 -276610 -216800 184355 -183611 25696 -190100
19521 81742 123733 -126748 -19262 -109562 93636 -154209 -170858 28510 -328984 -142455 55065
19509 205113 -143114 239093 -112919 206669 183683 102701 -6154 179592 -110434 -164894
19499 -164894 23262 111026 -46636 -323 -191538 -21358 -430996 159574 139570 35820 -113407
19487 -130108 -33497 -277868 172391 -117137 -38234 -30160 -71244 -68727 -365147 -24097 30587
19475 -363347 -232499 -100869 -104207 -300904 -472010 -42113 83186 -94689 247612 272454 43117
19463 3386 21407 6975 1424 -436304 1068 -64590 -96582 321844 -94804 -74413 74968 -295806
$$ packed form
19544A3693J6554b72773K6299F1084P9256k3022e2114k28830k09891A78557G1862
19532A11036a12320A49027b17124m3933j5553N9810A84355a83611B5696a90100
19521H1742M1991a26748a9262r0300I3636a54209j6649B8510c28984a42455E5065
19509B05113a43114B39093a12919B06669k2986q0982f154A79592a10434n4460
19499a64894B3262Q7764d6636c23j91215b1358m09638A59574k0004C5820a13407
19487a30108c3497k44371A72391a17137c8234Q074m1084K517k96420b4097C0587
19475c63347J30848a00869l338j96697j71106d2113H3186i4689B47612K4842D3117
19463C386J8021F975A424d36304A068f4590l1992C21844i4804K0391G4968b95806
$$ plain form
19450 -109885 4861 -395623 -127292 -122206 -247899 -219581 143079 -83733 -68453 -62147 -126382
19439 -126382 -419425 26349 -86805 -97275 5277 -97183 -9317 44111 156503 -28925 -158024
19428 -158024 29651 27409 -174084 32189 -128729 -85924 -115235 149823 -56133 -318748 -273598
19417 -273598 38598 -39860 189081 212688 -569005 -297909 108738 -91958 -222393 -129604
19407 -129604 134601 -94666 -251885 -193270 28512 297505 -67770 43013 -22577 -392734 213566
19395 -61801 -142570 84866 -406621 -257983 13030 -292406 -116671 72830 -7636 -171730 98663
19383 13459 163145 -368248 226738 -242632 15719 -170295 -48762 -116399 -104451 -97947 -81987
19372 -81987 -159039 93454 20363 -228758 -183368 103395 -143353 68148 269639 241223 277365
$$ packed form
19450a09885D861c95623a27292N086j25693K8318A43079h3733J5280O306o4235
19439a26382k93043B6349h6805j0470E277i7183i317D4111J12392b8925j29099
19428a58024B9651k242a74084C2189a28729M2805k9311A49823e6133k62615M5150
19417b73598C8598c9860A89081K3607e69005K71096A08738i1958j30435R2789
19407a29604A34601i4666j57219N8615B8512K68993f7770D3013b2577l70157B13566
19395f1801q0769H4866d06621J48638A3030b92406a16671G2830g636j64094I8663
19383A3459J49686c68248B26738b42632A5719a70295d8762o7637J1948O504J5960
19372h1987p7052I3454B0363b28758M5390A03395a43353F8148K01491k8416L6142
$$ plain form
19361 277365 42132 -104946 355038 -248142 78363 -217875 284714 -3512 -275636 411880
19350 -4299 150093 71648 -200604 -53395 67328 -405592 -487678 -265598 -21910 -332935 119177
19338 -65893 14987 164622 13024 -20741 -437672 -231001 -544326 -104124 -41538 -16425 -150302
19327 -150302 78746 -135291 -47164 4593 180197 232580 243 -153215 -253809 426556 -1771
19315 -331779 124872 232566 -254050 379952 77127 200234 -52931 -186252 -1792 -73380
19305 -73380 75906 -164496 -66220 26303 -167963 42335 -180674 -4622 85237 94331 172923
19294 172923 10969 -306935 -322846 49748 -146274 -157659 64323 -286642 -171825 96755 150319
19283 150319 -170687 -24068 -87859 -125048 -125672 324270 34876 66423 148859 -93171 -3181 99063
$$ packed form
19361B77365D2132a04946C55038b48142G8363b17875B84714c512k72124D11880
19350d299A50093G1648b00604e3395F7328d05592q2086K22080b1910l11025A19177
19338f5893A4987J49635A3024b0741m16931K06671l13325a04124d1538a6425j33877
19327a50302G8746a35291d7164D593J75604N2383B43a53215j00594D26556a771
19315c31779A24872J07694b54050C79952G7127J23107e2931j33321a792p1588
19305g3380G5906a64496f6220B6303a67963D2335a80674d622H5237R094P8592
19294A72923A0969c06935j5911D9748a46274j1385F4323b86642J14817I6755N3564
19283A50319a70687b4068o3791l7189o24C24270C4876L1547Q2436i3171c181I9063
$$ plain form
19270 -181828 181891 -319774 -258969 162079 -274727 -120181 -45071 -270550 -25055 266439
19259 -54118 -105209 -178873 -248219 11544 -48083 -365851 344834 48900 167106 3895 -7918
19247 108466 -329808 -71192 -48068 -28211 17905 -359236 392290 -210355 -121803 -13308 49583
19235 273292 -7449 -233711 -36474 -303933 -191767 -58904 63959 -240839 149999 -178540
19224 88428 146355 -118609 -354280 55417 -3393 -107229 49935 28285 42435 -227684 116895
19212 -427391 -81255 126392 -130039 143529 -168189 -277352 -136433 -41754 -237297 261625
19201 -224963 352143 72507 425702 -372513 65073 -407295 -45687 -93276 -186764 -1975 -181996
19190 -181996 -400634 208771 -177271 265064 -235480 -175437 -178833 80100 -81466 -64100 8847
$$ packed form
19270a81828A81891c19774O0805A62079b74727a20181d5071k25479b5055B66439
19259e4118n1091p3664o9346A1544d8083l17768C44834D8900J18206C895g918
19247A08466c29808g1192K3124J9857A7905c59236C92290b10355Q8552a3308D9583
19235B73292g449k26262c6474k67459J12166e8904F3959b40839A49999a78540
19224H8428N7927a18609k35671E5417c393j03836D9935k1650J4150b27684A16895
19212d27391h1255A26392a30039A43529a68189j09163a36433d1754j95543B61625
19201b24963C52143G2507L53195c72513F5073d07295d5687m7589r3488a975j80021
19190a81996k18638B08771a77271B65064b35480O0043l396H0100h1466J7366H847
$$ plain form
19178 -74486 -122890 -152000 -368538 -153303 163178 -363156 -68435 -213146 -67790 -317973
19168 -317973 -432653 -137514 58797 9468 -69493 226865 -307570 -205009 -16773 124311
19157 -106462 -22368 -281438 36963 -53462 -86646 -6532 -68650 -186573 -160289 -114191 -282405
19146 -282405 -38924 -250142 -25347 -186125 -56899 -227668 106266 -18239 -275848 35939
19135 7399 -27523 -89307 -20010 157651 -52804 11674 -139362 -97442 -164159 -216867 -36820
19123 238092 -23073 134832 -181137 277926 -774849 -283186 -105657 -118479 152313 -74224
19112 -167378 -148986 -71369 -49529 443181 -369608 46967 62391 -368627 -192422 297448
19101 -152341 -117029 -155207 144044 42090 -249169 51461 497728 -118347 -32290 -48490 -142684
$$ packed form
19178g4486m8404k9110k16538a53303A63178c63156f8435j44711f7790k50183
19168c17973j14680a37514E8797I468f9493B26865c07570J02561a6773A24311
19157a06462b2368k59070C6963e3462l3184f532o2118j17923K6284M6098j68214
19146b82405c8924k11218b5347j60778e6899j70769A06266a8239k57609C5939
19135G399b7523o1784b0010A57651e2804A1674a39362M1920o6717n2708c6820
19123B38092b3073A34832a81137B77926g74849b83186a05657j2822A52313g4224
19112a67378J8392g1369K1840D43181c69608D6967J5424c68627J76205B97448
19101a52341L5312l8178A44044D2090b49169E1461M46267a18347c2290j6200r4194
$$ plain form
19090 -142684 -97526 70546 179408 54471 214251 18396 68876 45950 -32413 38692 -110671
19078 -141282 -10032 -140651 92427 4993 -14665 -111306 -67176 219743 -89759 -184492 -154464
19067 -154464 -3633 -74068 -86953 -137191 -235714 50052 31111 203236 188280 50571 280147
19056 280147 -278500 -32489 -382258 17819 -113582 121045 101337 -214593 165357 135316
19046 135316 -10243 325349 -280838 262359 221411 -344345 -263438 30965 96633 219737
19036 219737 136581 83630 17405 -72755 -90386 359670 219066 316808 336559 -304129 -90715
19024 253291 115614 -25608 185770 63711 -221431 143194 -85175 181999 -215853 73129
19013 -97227 -70225 17501 81432 -31845 -204497 237890 6932 21211 135745 -166164 161854
$$ packed form
19090a42684M5158G0546J08862E4471J59780A8396N0480k2926c2413C8692a10671
19078a41282a0032j30619I2427D993a4665r6641M4130B19743h9759r4733L0028
19067a54464c633p0435j2885n0238r8523E0052j8941J72125j4956E0571K29576
19056B80147b78500c2489l49769A7819a13582A21045j9708b14593A65357l0041
19046A35316a0243C25349b80838B62359m0948c44345Q0907C0965O5668J23104
19036B19737q3156n2951A7405g2755j7631C59670j40604R7742J9751c04129i0715
19024B53291A15614b5608A85770F3711b21431A43194h5175A81999b15853G3129
19013i7227K7002A7501O3931c1845j72652B37890F932J4279J14534a66164A61854
$$ plain form
19001 -311917 42959 320138 -336795 -114617 -149487 -327343 -53415 -27811 -193056 -158080
18991 -158080 25616 70187 31185 -48340 -390620 -267279 -214747 62144 -165396 -137407 153255
18979 -37762 246463 -220811 42067 -195055 -363687 -192697 -49592 -896 -116570 202935 -334942
18967 291082 -198456 -116146 -225773 -234360 -186347 249461 -32503 -3553 -84013 162457 150249
18956 150249 -159569 -104953 69019 -38248 339265 -196704 252049 -269684 -3647 80026 -150129
18944 -251451 364314 48629 150056 -167777 -102311 -258129 263363 -171900 150260 21516
18933 -149896 -140001 75532 73525 -45745 213943 5955 -20593 245965 28043 -75056 -81275 48514
18920 -10396 -272061 -251477 -575518 -141863 230833 102916 314760 -79383 79632 -98257
$$ packed form
19001c11917D2959K77179c36795a14617l4870j77856e3415K5604j65245L4976
18991a58080B5616M4571C1185d8340l42280J23341N2532F2144a65396K7989A53255
18979c7762B46463b20811D2067a95055j68632J70990d9592h96j15674B02935c34942
18967B91082a98456Q2310j09627q587M8013B49461c2503c553q0460A62457j2208
18956A50249a59569N4616F9019c8248C39265a96704B52049b69684c647H0026a50129
18944b51451C64314D8629J01427a67777O5466j55818B63363a71900A50260B1516
18933a49896R895G5532k007d5745B13943E955b0593B45965B8043g5056o219D8514
18920a0396k61665K0584l24041a41863B30833A02916K11844g9383G9632i8257
$$ plain form
18909 25912 49658 -124897 74095 -14773 -203768 -100658 344516 -150704 -50481 84360 -60771
18897 152319 -416827 -46527 -18394 83859 103027 181024 71792 261479 83536 -270739 228331
18885 199369 -267272 -322718 -124644 221142 -49169 -90246 283312 -81678 -214823 42614
18874 82913 -44968 90075 -409953 -58584 167615 204253 -5089 -145971 -207357 49682 -352345
18862 -363794 -329256 -160072 341198 -175697 -222794 -51797 49739 -130933 104991 125837
18852 125837 7917 20886 103269 366306 -108403 7421 -201534 125676 -181409 27024 -114099
18840 16446 -35307 -46241 -406161 -290406 -338302 281828 341301 -104544 -45562 -375510 -7115
18828 211560 -97849 -95700 -197001 -144821 -54370 213484 -145565 -111440 -112917 267224 159801
$$ packed form
18909B5912K3746a24897G4095a4773j88995a00658C44516a50704e0481H4360f0771
18897A52319d16827d6527a8394H3859J9168P7997G1792J89687H3536b70739B28331
18885A99369b67272n5446a24644B21142d9169m1077B83312h1678j33145D2614
18874H2913d4968I0075d09953e8584A67615L6638e089j40882o1386D9682c52345
18862c63794L4538a60072C41198a75697m7097e1797D9739a30933A04991K0846
18852A25837G917J2969Q2383K63037a08403G421b01534A25676a81409B7024a14099
18840A6446c5307j0934l59920J15755m7896B81828N9473a04544d5562l29948g115
18828B11560i7849K149j01301N2180e4370B13484a45565L4125j477B67224j07423
$$ plain form
18817 159801 86036 -258741 -141839 223636 -141029 -52526 -100175 -110716 76128 81258 130748
18806 130748 -339893 32644 -155819 -10504 -136426 13067 -77365 14389 54940 1743 51979
18795 51979 -273620 -327769 -243141 -27114 28995 -291577 -113921 84013 -76659 -100071 -155156
18784 -155156 71481 -137478 -220830 -198903 213366 -160436 -72544 -86321 103540 45606 55371
18773 55371 -151355 73885 -118526 166114 -263307 81542 -51656 -61371 -5719 -229206 322295
18761 140724 15546 13840 -165476 -4114 -182424 151868 -207933 181685 -381 -227656 47245
18749 -608 -301926 74209 127315 26887 -20535 -43631 79626 148786 -55588 71883 139979 248335
18737 248335 68446 -12807 -270470 -46213 -200609 177732 -184591 59242 177607 -205091
$$ packed form
18817A59801p3765b58741J16902B23636a41029e2526m7649j0541G6128N130M9490
18806A30748c39893C2644a55819a0504j25922A3067g7365A4389M0551A743N0236
18795E1979b73620n4149Q4628b7114B8995b91577a13921H4013g6659k3412n5085
18784a55156G1481a37478q3352K1927B13366a60436g2544j3777A03540D5606R765
18773E5371a51355G3885a18526A66114b63307H1542e1656r715e719k23487C22295
18761A40724A5546j706a65476d114j78310A51868b07933A81685c81k27275D7245
18749f08l01318G4209N3106B6887b0535k3096G9626O9160e5588G1883O8096J08356
18737B48335F8446a2807k57663d6213j54396A77732a84591E9242J18365b05091
$$ plain form
18726 -39560 -121141 -336511 197973 -66453 113514 89450 -467642 2634 -334109 58370 -31035
18714 -101467 -130251 180574 -1443 17659 186950 48189 66944 224294 -99947 -268153 -148412
18703 -148412 -326572 -161130 66104 -106045 -82132 -7151 247834 -118307 51758 40456 -499015
18691 117045 129087 166470 -381640 -63415 -51325 -97936 -36572 17860 241534 -132413 -220244
18680 -220244 12151 145145 9282 -76870 -214556 23457 34145 -133171 66223 -278692 10057
18668 -185066 -409553 -209094 326145 -20252 18546 -212503 -49864 10942 -287391 -20519
18657 -335308 -188315 294090 -262348 -213222 -16881 -180752 -215926 34460 -85494 -251114
18647 -251114 27089 4157 -45918 -9360 -176633 225946 -130475 -349976 60497 -349533 92377
$$ packed form
18726c9560q1581k15370A97973f6453A13514k4064d67642B634c34109E8370c1035
18714a01467k8784A80574a443A7659J69291D8189J8755J57350i9947j68206J19741
18703a48412j78160a61130F6104a06045K3913g151B47834a18307E1758j1302d99015
18691A17045J2042L7383c81640f3415J2090m6611c6572A7860K23674a32413q7831
18680b20244A2151J32994I282g6870j37686B3457J0688a33171F6223b78692A0057
18668a85066k24487K00459C26145b0252A8546b12503d9864A0942b87391b0519
18657c35308J46993B94090b62348M9126a6881j63871l5174C4460h5494j65620
18647b51114B7089D157d5918i360j67273B25946a30475k19501F0497c49533I2377
$$ plain form
18635 -79112 -32826 -181383 -37112 69364 -128162 -270310 -220889 140202 98878 -287762 -97122
18623 -195240 -62032 212251 13946 -164479 130244 -138564 156223 -148375 -15700 131595
18612 47832 -173556 74726 4548 85360 109990 -70594 -115967 -218749 161215 -342762 -106240
18600 -100912 -180886 -92000 -106987 119083 -144905 177225 -109034 -130464 -242651 -95984
18589 176062 146877 -148303 173495 62706 110325 -58787 4953 183393 -25691 -72715 15942
18577 -381213 -147334 66853 -69401 190777 -76446 -248996 -58603 -129079 -70166 369916 -135816
18565 96958 -57489 -78878 -51940 -139475 -229044 218097 -7130 344326 -171355 96045 -181382
18553 -138708 -197928 493554 -33184 -2259 92840 28995 -183830 -87546 -288061 -219782 -239067
$$ packed form
18635g9112c2826j48557c7112F9364a28162j42148M9421A40202m1324b87762i7122
18623a95240f2032B12251A3946a64479A30244a38564A56223a48375a5700A31595
18612D7832a73556G4726D548Q0812K4630g0594m5373j02782A61215c42762a06240
18600a00912p9974Q8886j4987A19083a44905A77225a09034k1430j12187i5984
18589A76062k9185a48303A73495F2706M7619e8787D953J78440b5691m7024A5942
18577c81213a47334F6853f9401A90777g6446j72550e8603p0476N8913C69916a35816
18565I6958e7489k1389K6938q7535q9569B18097g130C44326a71355I6045a81382
18553a38708n9220D93554c3184b259I2840B8995a83830h7546k00515O8279j9285
$$ plain form
18542 -239067 -124463 -104764 -184767 -127880 284248 -192613 -109153 -44882 11957 206984 154745
18531 154745 -158844 -99798 -121565 3359 -213459 22062 -189698 -370654 -60709 30933 390009
18520 390009 -63059 -188055 24549 40393 -310630 -302234 -96968 53833 -438762 211540 -136501
18508 -39472 -95211 156644 -25183 73695 109253 -49583 -424849 -147132 -221432 -50683 -218788
18497 -218788 -240713 -333749 18939 -113980 -120667 120109 -317777 115406 149134 171947 297661
18486 297661 10735 -89227 73448 -110958 -125139 271075 328394 25050 -516383 313570 -264227
18474 -129299 40963 212788 -42146 -50263 10917 -107612 -309988 167549 -51539 -73291 -391567
18463 -391567 -149858 75732 59543 53394 149188 117994 103510 72128 -462302 -209781 -56188
$$ packed form
18542b39067J14604J9699q0003N6887B84248a92613Q3460d4882A1957J95027n2239
18531A54745a58844N9046k1767C359b13459B2062a89698j80956f0709C0933L59076
18520C90009f3059j24996B4549J5844c10630Q396i6968E3833d38762B11540a36501
18508c9472n5739A56644b5183G3695L5558d9583l75266a47132p4300e0683j68105
18497b18788k1925r3036A8939a13980o687A20109c17777A15406L3728K2813J25714
18486B97661A0735h9227G3448a10958j4181B71075N7319B5050e16383C13570b64227
18474a29299D0963J71825d2146q117A0917a07612k02376A67549e1539k1752l18276
18463c91567a49858G5732j6189o149R5794l1194j4484l1382d62302b09781e6188
$$ plain form
18451 -94510 -108724 -210421 51289 36835 -281710 -220622 -90300 -213916 -33136 91954 315052
18440 315052 -226673 -489 -163876 -229704 -102656 -406106 -97264 132089 -233267 -167873 -263837
18429 -263837 -37997 -90528 -100464 357957 -178430 -29180 -77106 -358590 79256 -179458 -112475
18418 -112475 -362989 -160892 195443 104736 -161551 31392 -276058 -83206 135679 -211960
18407 289310 202463 85291 -32346 -290114 -61788 -24294 86447 -158210 35808 78261 40213
18396 40213 53999 52830 -130310 223014 -63060 74099 -145377 -121856 -80991 -121764 -275315
18385 -275315 -33074 -193197 -70579 62486 -130352 -168719 150793 106080 -20321 -322126 -206971
18374 -206971 42141 -151863 18481 225115 111261 73322 62252 -330974 -57278 135015
$$ packed form
18451i4510j4214j01697E1289j4454b81710O1088i0300j23616c3136I1954K23098
18440C15052b26673d89j63387o5828a02656l03450i7264A32089b33267O5394r5964
18429b63837c7997n2531r936C57957a78430b9180m7926k81484G9256a79458O6983
18418a12475k50514a60892A95443r0707a61551C1392b76058h3206A35679b11960
18407B89310q6847H5291c2346k57768f1788b4294H6447a58210C5808M2453l8048
18396D0213J3786j169a30310B23014f3060G4099a45377K3521M0865m0773j53551
18385b75315c3074j60123g0579F2486a30352l8367A50793m4713b0321l01805J15155
18374b06971D2141a51863A8481K06634A11261l7939j1070c30974e7278A35015
$$ plain form
18363 -159010 -71905 -76836 -128935 77165 -49163 145914 -107399 5907 -5788 183972 -194560
18351 -33639 -312360 100158 -18487 23530 249937 -291385 124345 8953 94202 247787 -62767
18339 229220 -279604 89911 263660 151523 -176997 285534 -53351 -225264 -33180 197470
18328 -308403 -152858 -2198 -11206 -154554 -358961 -46948 174792 -131795 -295745 -15253 -20287
18317 -20287 -44882 220231 -6396 129031 -25544 -389774 52001 63365 -61118 -249526 235752
18305 99058 -42937 -15503 169225 -72140 -110256 -150854 126504 200742 126582 69995 -232879
18293 -58530 -422096 77054 -207096 -86762 -254693 214858 48268 -253545 190707 -253735
18282 238088 -416 50525 318424 -167689 207045 -25729 5231 -125600 -80252 -106563 -94016
$$ packed form
18363a59010g1905m931n2099G7165d9163A45914a07399E907e788A83972a94560
18351c3639k78721A00158a8487B3530K26407b91385A24345H953Q5249J53585f2767
18339B29220b79604H9911J73749j12137a76997B85534e3351j71913c3180A97470
18328c08403a52858b198r008j43348k04407d6948A74792a31795j63950a5253n034
18317b0287k4595B20231f396A29031b5544l64230E2001J1364f1118j88408B35752
18305I9058d2937a5503A69225g2140l8116m0598A26504P4238p4160n6587b32879
18293e8530l63566G7054b07096h6762j67931B14858D8268b53545A90707b53735
18282B38088d16E0525K67899a67689B07045b5729E231a25600M5348k6311J2547
$$ plain form
18271 -94016 -76939 141130 -85975 384638 380856 55735 228895 -26431 -297912 221652 -109627
18259 -163991 -6259 80245 153679 176372 -332747 78775 -212685 -68838 -25923 -299146 25061
18247 -132551 43021 -120955 60820 189396 7964 -68351 -90331 32635 -319557 130616 -249336
18235 -282928 -197594 127571 -172222 26758 125659 -168269 79625 121719 24617 250536 -268140
18223 -289431 -126908 -25433 36915 239564 56518 -34404 -186254 292890 -174104 -369633
18213 -369633 -15736 117956 -196293 -336556 91676 434813 82945 -30362 -76990 -52673 -184247
18202 -184247 80634 14430 72459 210767 250246 -111098 6847 239665 144319 -272777 -9930
18190 -55309 319719 -77662 -213032 63216 57959 -125274 -240599 -114039 -249721 11682 -123163
$$ packed form
18271i4016J7077A41130h5975C84638l782E5735J73160b6431k71481B21652a09627
18259a63991f259H0245P3434K2693c32747G8775b12685f8838b5923k73223B5061
18247a32551D3021a20955F0820J28576G964f8351k1980C2635c19557A30616b49336
18235b82928Q5334A27571a72222B6758R8901a68269G9625M2094B4617K25919b68140
18223b89431a26908b5433C6915K02649E6518c4404j51850B92890a74104j95529
18213c69633a5736A17956a96293j40263I1676L43137H2945c0362m6628K4317j31574
18202a84247H0634A4430N8029J38308L9479a11098F847K32818r5346b72777i930
18190e5309C19719g7662j35370F3216n257a25274j15325a14039j35682A1682a23163
$$ plain form
18178 -126756 342136 254568 -123772 -286783 -212084 11668 -109841 144912 66095 361215
18168 361215 -33857 -20281 -238727 -262790 45521 89336 192047 -145673 -141609 108195 79113
18157 79113 88222 -161985 -537190 -275597 -21359 191245 182047 64895 -348691 110815 -33034
18145 -6269 -85531 -101481 92393 -65336 -299505 -61578 267195 295298 -45174 -308681 129085
18133 -194 194747 -74154 114338 205415 -151861 63727 -79034 109399 -10709 -119088 80223
18121 -128706 66360 118372 -8911 49505 91042 -23267 87691 176579 -23751 -297581 -144708
18109 -22692 21248 86458 25880 -138677 -158990 274590 216588 -43203 -130652 56142 355556
18098 355556 -67642 -240170 126965 33974 223454 -255935 -105496 -358586 244075 -342123
$$ packed form
18178a26756C42136q7568a23772j63011P4699A1668a09841A44912F6095K95120
18168C61215c3857J3576k18446k4063D5521M3815J02711a45673M064A08195k9082
18157G9113R109a61985l75205K61593b1359A91245r198F4895c48691A10815c3034
18145f269p9262j5950I2393f5336k34169f1578B67195K8103d5174k63507A29085
18133a94A94747g4154A14338R1077a51861F3727g9034A09399a0709j08379H0223
18121a28706F6360N2012h911D9505M1537b3267H7691Q8888b3751k73830a44708
18109b2692B1248O5210B5880a38677k0313B74590n8002d3203q7449E6142K99414
18098C55556f7642j72528A26965C3974J89480b55935a05496k53090B44075c42123
$$ plain form
18087 -138044 107205 -88172 -166115 41513 12804 -219920 -275435 -317898 106184 139778 -48681
18075 30217 98110 -194106 -176830 44494 -461495 9304 -293969 -146417 86937 -49938 140093
18063 45215 -365538 37531 -6591 110037 -131196 39974 304788 -66692 -39063 -187905 62174
18051 26295 -304035 187334 208957 -28892 43111 -193448 -289054 20891 33375 178339 -110804
18039 41107 -443199 -33578 -94785 -124867 294535 -173421 -288552 -103576 -79896 192452
18028 99938 211372 -330230 -274816 153464 54115 272067 -148961 199239 -350342 -152642
18017 189814 -147570 110191 43894 -252889 135912 -101811 -208612 22122 -116004 44942
18006 -1966 351086 -383284 74577 -83858 -357634 186447 -127487 368207 100041 340599
$$ packed form
18087a38044A07205h8172p7943D1513A2804b19920n5515m2463A06184L3594d8681
18075C0217O7893a94106J7276D4494d61495I304b93969a46417H6937d9938A40093
18063D5215c65538C7531f591A10037a31196C9974K64814f6692K7629j48842F2174
18051B6295c04035A87334K1623b8892D3111a93448r5606B0891J2484J44964a10804
18039D1107d43199c3578o1207l0082B94535a73421j15131a03576K3680A92452
18028I9938J11434c30230N5414A53464E4115K17952a48961A99239c50342a52642
18017A89814a47570A10191D3894b52889A35912a01811j06801B2122a16004D4942
18006a966C51086c83284G4577h3858k73776A86447a27487C68207A00041K40558
$$ plain form
17996 340599 190023 135962 -166493 76880 -22098 -245794 4620 175384 -275473 -289198 -8548
17984 106508 -90811 -324622 -87490 80512 34310 -88705 -48664 1950 -207455 -54934 115368
17972 -70714 83233 260252 -31970 80158 175823 -628197 -165018 -187665 2036 -254021 -154386
17961 -154386 52033 99511 311629 -127647 -157708 23503 176042 176445 -89227 -139168 93433
17949 -83832 -29026 208607 337840 1076 335388 -254047 -150701 189882 -97427 -65472 -228702
17938 -228702 24058 58094 -299246 -171391 65407 97791 -107074 130377 478635 85817
17927 167242 -156271 262596 -48482 5311 -350191 -287645 -416124 101032 -170541 -73518
17916 -262313 53839 115453 60437 124375 17591 69807 -59770 -50884 -176616 150042 394558
$$ packed form
17996C40599j50576n4061a66493G6880b2098k23696D620J70764b75473j3725h548
17984A06508i0811k33811h7490H0512C4310h8705M0041A950b07455e4934A15368
17972g0714H3233J77019c1970H0158R5665f28197a65018k2647B036b54021R9635
17961a54386E2033M7478K12118a27647l0061B3503J52539M03h9227m9941I3433
17949h3832b9026B08607J29233A076L34312b54047J03346A89882i7427L1955j63230
17938b28702B4058L4036b99246J27855F5407L2384a07074A30377L48258H5817
17927A67242a56271B62596d8482E311c50191O2546j28479A01032a70541g3518
17916b62313E3839O1614n5016O3938A7591N2216e9770Q886j25732A50042K44516
$$ plain form
17905 394558 162116 252971 -120608 -79983 131272 -112164 -28972 -28251 -189793 -32175 -58112
17894 -58112 41248 -79145 226906 -111970 -406869 -25102 -184675 -392674 -89136 121630
17883 148501 263901 41451 -108269 -84860 23030 -125851 -299006 81721 -337926 -51502
17872 170028 34054 -253275 -65404 180915 186981 144313 170893 122370 31747 135260 -43564
17860 20069 -131818 -148285 -114422 70793 -53404 124340 -353232 -164948 40250 335736 -16824
17848 236427 225129 -188646 194166 -169310 104221 -51591 92386 68367 75136 50607 -94981
17836 -211700 142936 -124702 -107565 -120564 224805 -77421 -252087 -207278 228707 10472
17825 174789 255083 194202 -35574 255 203444 218618 -31645 178226 132171 83024 -101563
$$ packed form
17905C94558A62116R0855a20608M0625A31272a12164b8972P21j61542c2175k5937
17894e8112D1248g9145B26906a11970k94899b5102j59573k07999h9136A21630
17883A48501J15400D1451a08269K3409B3030a25851j73155H1721c37926e1502
17872A70028C4054b53275f5404A80915O066m2668K6580m8523C1747J03513d3564
17860B0069a31818j6467L3863G0793e3404A24340c53232a64948D0250K95486a6824
17848B36427j1298a88646A94166a69310A04221e1591I2386k4019O769k4529i4981
17836b11700A42936a24702J7137j2999B24805g7421j74666M4809B28707A0472
17825A74789Q0294o0881c5574B55K03189J5174c1645A78226m6055m9147a01563
$$ plain form
17813 -130671 304819 -162449 160440 -89834 51382 -186018 -106147 -5786 -235267 225146
17802 28716 -82148 -51855 212648 89839 192539 416380 -395511 121573 -175202 2441 28069
17791 28069 -172221 -187775 276698 -124391 -209944 -28547 63213 -232633 -203971 -254180 -99147
17779 276459 221507 -94595 -9009 748 123632 149795 -216327 -282908 -132452 -88577 -58668
17768 -58668 63601 -375959 -203098 195453 -163840 195613 148732 360481 61469 254012
17758 254012 201381 -108705 -164437 45703 265821 -67206 111155 131549 -102517 70174 -436269
17746 394741 -136241 -228405 389776 -65192 -92569 316058 -36730 226919 -304531 262580
17735 -25401 71983 -130974 -119758 -241990 -267101 -5548 -10772 2001 -130872 -342503 89447
$$ packed form
17813a30671C04819a62449A60440h9834E1382a86018P9871e786k29481B25146
17802B8716h2148L0293B12648H9839J02700K23841c95511A21573a75202B441K5628
17791B8069a72221j5554B76698a24391q5553b8547F3213b32633K8662n0209i9147
17779B76459n4952i4595i009G48J22884K6163b16327o6581a32452M3875K9909
17768e8668F3601c75959J72861A95453a63840A95613m6881K11749F1469J92543
17758B54012n2631a08705n5732D5703K20118f7206A11155K0394a02517G0174d36269
17746C94741a36241r2164C89776f5192k7377C16058c6730B26919c04531B62580
17735b5401G1983a30974J1216j22232k5111e548n224B001a30872k11631H9447
$$ plain form
17723 -202431 -13993 22204 165059 222826 31655 37709 442400 -124811 271046 134711 -167926
17711 24774 23692 -51002 -388369 295418 110221 94958 4960 141039 67103 -230245 157
17699 85055 -122082 -91130 63622 281249 362596 179467 94871 -27682 -54047 -40101 53929
17687 87091 74118 -81668 122563 28815 117141 339837 142414 223796 -262965 -290405 164891
17675 184245 -44438 -448697 372066 -212246 21635 -140489 -220406 20530 -192700 -22332
17664 98562 -211860 -81888 -65361 310779 -214788 149583 -138541 -111795 214940 11281
17653 -76605 85326 232305 80570 -9874 444637 -102614 331083 19458 70349 -189441 45629
17641 89540 229308 -72948 195843 113283 -140608 -133506 461 -257309 -75533 198890 79593
$$ packed form
17723b02431a3993B2204J42855N7767C1655O054M04691a24811B71046A34711a67926
17711B4774j082e1002l37367B95418A10221j5263D960J36079F7103b30245A57
17699H5055a22082L0952F3622K17627Q1347A79467q4596b7682k6365J3946E3929
17687H7091j2973h1668A22563B8815Q8326K22696A42414Q1382b62965k7440A64891
17675A84245d4438m04259C72066b12246B1635a40489p9917B0530a92700b2332
17664I8562b11860h1888J6527C10779b14788A49583a38541K6746B14940A1281
17653g6605H5326J46979H0570i874D44637a02614C31083A9458N0891a89441D5629
17641H9540J39768g2948A95843q2560a40608P102D61b57309g5533A98890G9593
$$ plain form
17629 36121 -11711 -8060 155806 395449 190075 -201594 185359 204399 231134 55802 339523
17618 339523 -131599 74947 174421 89843 -86075 -40621 58615 -58552 -329347 -55848 -192969
17607 -192969 -103994 -107437 64682 241681 52216 69745 39137 208228 100556 165340 49633
17595 118538 178721 -57657 2069 -176367 32194 134185 -187206 -82423 -6557 -56379 176118
17583 -217907 -146372 -80733 218757 237640 96226 131132 39936 47854 -92553 222476 86576
17571 -94073 -131704 251974 250138 -127086 267894 100909 3687 348041 167599 -305459 -200200
17560 -200200 -139491 187981 -37053 -97820 -115031 137776 133203 -264982 -200853 328720 -30919
17548 13381 185352 -263153 100875 69910 84941 29564 -241691 -16043 -106591 55440 51386
$$ packed form
17629C6121a1711L651A55806K39643A90075b01594A85359J9040K6735E5802K83721
17618C39523a31599G4947R9474q4578h6075d0621E8615e8552k70795e5848j37121
17607a92969Q8975l443F4682J76999E2216J7529l0608J69091A00556O4784D9633
17595A18538O0183e7657B069a76367C2194J01991a87206h2423f557m9822A76118
17583b17907P1535O5639B18757J8883I6226L4906C9936P918i2553B22476H6576
17571i4073l7631B51974j836a27086B67894A00909C687L44354A67599c05459J05259
17560b00200O0709A87981c7053o0767j7211A37776m573b64982O4129C28720c0919
17548A3381J71971b63153A00875l0965J5031B9564b41691a6043r0548E5440m054
$$ plain form
17537 51386 80244 150709 236505 181881 -14610 184560 109883 107057 549736 -317235 79658
17525 -77404 106516 102894 240549 133792 180554 138126 155210 187226 89095 7796 166441
17514 166441 84728 114999 479169 -170356 67509 -54800 389727 58126 272433 255667 -99033
17502 51182 358386 145741 11971 327096 41825 -44144 420479 279636 33545 -19355 283646
17490 175632 -18004 38345 137785 -90701 7750 337313 39979 152551 282162 315905 202060
17479 202060 386413 61695 -108981 181094 -49679 358322 19809 147360 -167732 316987
17468 70086 55445 137640 -197108 18824 56916 309211 -22456 -342538 83122 -11747 161298
17456 408970 -106758 -84188 135335 51656 269723 253968 298182 548323 290744 547603
$$ packed form
17537E1386K8858P0465Q5796n4624a4610A84560p4677k826M42679c17235G9658
17525g7404A06516l622J37655j06757M6762m2428J7084L2016H9095G796J58645
17514A66441q1713L0271L64170a70356F7509e4800C89727E8126K14307j6766i9033
17502E1182L07204A45741A1971L15125D1825d4144D20479j40843C3545a9355B83646
17490A75632a8004C8345R9440i0701G750L29563C9979J12572J29611L3743j13845
17479B02060J84353F1695a08981A81094d9679C58322A9809J27551a67732C16987
17468G0086j4641Q2195a97108A8824L8092K52295b2456l20082H3122a1747A61298
17456D08970a06758K2570A35335E1656K18067j5755M4214K50141k57579K56859
$$ plain form
17446 547603 -9505 99101 -64982 83741 175008 328182 166218 279020 120766 261127 119128
17434 189055 -54333 185584 242380 344488 89388 -76547 305155 203288 386293 446784
17424 446784 519280 203657 358047 185989 -74957 357998 245012 515128 472895 427578
17414 427578 357248 448095 213171 404102 311438 200010 89803 279452 48706 410003
17404 410003 -146327 474146 146879 107675 -174773 254036 -392277 282446 311660 -138219
17393 224231 324848 -351954 87279 159842 19316 -139457 369262 -201377 232944 322841
17383 322841 269560 110744 57795 58808 243836 88262 158560 197257 482579 203059 -346263
17371 -86534 264760 -25965 5404 -14134 20062 194223 278316 72161 116327 -128315 -305056
$$ packed form
17446E47603i505I9101f4982H3741R1267J53174j61964J12802A20766J40361A19128
17434A89055e4333A85584N6796J02108H9388g6547C05155j01867J83005O0491
17424D46784P2496B03657J54390j72058g4957C57998j12986K70116m2233m5317
17414D27578p0330R0847B13171J90931r2664j11428H9803J89649D8706L61297
17404D10003a46327D74146A46879l9204a74773B54036c92277B82446K9214a38219
17393B24231J00617c51954H7279P2563A9316a39457C69262b01377B32944Q9897
17383C22841n3281A10744n2949J013J85028H8262P0298L8697K85322B03059c46263
17371h6534B64760b5965E404a4134B0062J74161Q4093G2161M4166a28315j76741
$$ plain form
17360 -305056 224089 139846 47750 198853 -84946 212962 241758 309872 24534 456397 66070
17348 100640 8535 610948 69503 287673 173484 140471 452000 197773 141513 92133 291870
17337 291870 15083 -66513 13635 129762 83465 299722 414141 -70948 14744 264438 -46037
17325 138045 211346 232205 164693 252874 187542 583835 -93949 172396 114391 306428 -515535
17313 434349 -88776 -102225 -105673 -15069 390178 -31768 166464 391272 -218343 316230 100533
17301 92594 -105692 193854 388557 4500 -90603 205770 247929 300008 309826 114071 -81115
17289 472617 47680 290813 204187 94886 164058 12526 148936 335406 74242 23280 221948
17278 221948 252710 229503 6133 155146 -34346 222039 209689 203718 174135 115358 25944
$$ packed form
17360c05056B24089q4243D7750J51103h4946B12962K8796O8114B4534M31863F6070
17348A00640H535O02413F9503K18170j14189l3013L11529A97773n6260m9380J99737
17337B91870A5083f6513A3635J16127m6297K16257J14419g0948A4744K49694d6037
17325A38045P3301K0859o7512Q8181o5332L96293i3949A72396n8005J92037e15535
17313D34349h8776j3449l448a5069C90178c1768A66464K24808b18343C16230A00533
17301I2594a05692A93854J94703D500i0603B05770M2159N2079R818A14071h1115
17289D72617D7680K43133q6626I4886O9172A2526J36410J86470G4242B3280J98668
17278B21948L0762k3207F133J49013c4346B22039j2350n971k9583n8777B5944
$$ plain form
17266 373915 153141 168149 -185265 101838 11975 -197605 211627 271135 125032 518301
17256 518301 -44089 26042 151010 7635 125137 316668 -33684 295720 5303 -41314 89904
17244 -85406 214635 328523 -130949 10258 125995 174024 494521 214425 475826 465502
17234 465502 187169 456088 148564 145576 509155 105301 289559 149034 575922 417538
17224 417538 389848 154211 397846 179226 287579 47900 72714 14006 138491 565619
17214 565619 398489 243047 396979 500054 175664 421285 230298 196332 253247 97145
17203 692389 94371 237509 -6277 286318 242363 421103 337601 221441 -64657 282307 59360
17191 301970 534850 498854 119750 476488 108895 83266 224720 259660 448887 676124
$$ packed form
17266C73915A53141J5008a85265A01838A1975a97605B11627N9508A25032L93269
17256E18301d4089B6042J24968G635J17502J91531c3684B95720E303d1314H9904
17244h5406B14635J13888a30949A0258J15737M8029L20497B14425K61401j0324
17234D65502A87169K68919A48564k988L63579A05301J84258j40525M26888j58384
17224D17538k7690A54211K43635A79226J08353D7900K4814A4006J24485M27128
17214E65619j67130j55442J53932J03075A75664K45621j90987l3966N6915I7145
17203F92389I4371J43138f277B86318m3955J78740q3502j16160f4657B82307E9360
17191C01970K32880l5996A19750L56738A08895k5629J41454L4940J89227K27237
$$ plain form
17181 676124 267770 430944 165150 163939 343183 250105 580187 49779 589317 122172
17170 376964 297294 649584 187904 11837 15301 435814 236789 356960 222572 104566
17159 317917 357934 462470 490732 143877 163160 389260 359852 229424 191327 455641
17149 455641 138343 303462 223097 263890 229413 373103 370125 -4030 117288 189788 240897
17138 240897 361747 306224 499358 -7734 236199 237380 221384 103021 476468 -114459 363862
17126 621025 391478 415046 318820 409170 239336 164897 416050 -12106 494267 385947
17116 385947 152751 25104 -9263 193171 601280 554845 395579 191866 310694 376536
17106 376536 373128 496923 374721 279504 427467 469627 162508 -47410 277755 382929
$$ packed form
17181F76124B67770J63174A65150j211J79244r3078L30082D9779N39538A22172
17170C76964p9670L52290A87904A1837L464M20513j99025J20171j34388A04566
17159C17917M0017J04536K8262A43877J9283K26100k9408j30428l8097K64314
17149D55641A38343J65119q0365M0793l4477J43690k978d030A17288P2500N1109
17138B40897J20850n5523J93134g734B36199J181j5996A03021L73447a14459C63862
17126F21025k29547K3568r6226R0350j69834p4439K51153a2106D94267j08320
17116C85947A52751B5104i263A93171M08109m6435j59266A91866J18828O5842
17106C76536l408J23795j22202r5217J47963M2160A62508d7410B77755J05174
$$ plain form
17096 382929 595216 508467 409452 696681 505194 625520 487370 331167 498774 553239
17086 553239 561651 293799 638656 483299 274782 532802 256180 513746 309467 370945
17076 370945 226322 625480 563149 272825 356751 468443 374186 360608 189454 251660
17066 251660 425240 550579 632411 992054 562673 506073 799320 757050 775865 491946
17056 491946 375853 342592 405924 574108 737301 595662 422374 543667 503269 545103
17046 545103 635162 771449 411541 539015 978379 429927 355441 534355 579649 585718
17036 585718 343195 391321 278678 475308 762004 609634 605380 552318 613352 679823 612628
17025 612628 664293 669380 529587 598309 743135 619459 846012 852036 642076 889177 690903
$$ packed form
17096C82929K12287q6749r9015K87229j91487J20326j38150j56203J67607N4465
17086E53239Q412k67852L44857j55357k08517K58020B56180K57566k04279O1478
17076C70945j44623L99158o2331B72825Q3926J11692r4257j3578j71154O2206
17066B51660J73580J25339Q1832L59643m29381n6600K93247m2270J8815k83919
17056D91946j16093l3261O3332J68184J63193j41639j73288J21293m0398M1834
17046E45103R0059J36287l59908J27474M39364D29927p4486J78914M5294O069
17036E85718k42523M8126j12643J96630K86696j52370m254n3062O1034O6471o7195
17025F12628N1665N087j39793O8722J44826j23676K26553O024k09960K47101j98274
$$ plain form
17014 690903 562874 610886 625304 688445 448440 578324 612622 548687 888494 371711
17003 603306 749520 588045 572832 718372 545874 686693 750606 673533 1004697 598437
16993 598437 552879 751442 964220 578735 867666 829881 886964 903166 1019962 895692
16983 895692 906717 1097348 1035297 567714 543036 542110 843912 936054 951483 687926 807450
16972 807450 1145934 842192 1064306 943758 831357 761816 1173131 1049261 842295 953669
16962 953669 624128 941339 1005720 1007545 977146 956363 949910 1035932 961114 1066862 950887
16951 950887 1058350 1003789 1221722 1114164 1003320 1349167 1321875 1214068 1222327 1014505
16941 1014505 1271596 1403020 1158434 1253753 1262667 1014157 1197369 1454258 1144208 1327491
$$ packed form
17014F90903j28029M8012J4418O3141k40005J29884L4298o3935L39807C71711
17003F03306J46214j61475j5213J45540j72498J40819O3913p7073L31164m06260
16993E98437m5558J98563K12778l85485K88931l7785N7083J6202J16796j24270
16983H95692J1025J90631o2051m67583k4678r26L01802R2142J5429k63557J19524
16972H07450L38484l03742K22114j20548j12401o9541M11315j23870k06966J11374
16962I53669l29541L17211O4381J825l0399k0783o453Q6022p4818J05748j15975
16951I50887J07463n4561K17933j07558j10844L45847k7292j07807Q259k07822
16941A014505K57091J31424k44586R5319Q914k48510J83212K56889l10050J83283
$$ plain form
16931 1327491 1142671 1290769 1296265 1399811 1091385 1296905 1677815 1400749 1277305 1332312
16921 1332312 1412266 1358039 1419518 1546059 1360821 1272923 1672406 1474530 1353557 1530453
16911 1530453 1507309 1608522 1920031 1454210 1356591 1660722 1643497 1588981 1883748 1723402
16901 1723402 1638480 1752351 1887633 1958887 1555436 1762673 1745796 1744881 2036841 2281329
16891 2281329 1993123 1930695 2257152 1880144 1784025 2205278 2102147 2019172 2116351 2137545
16881 2137545 2127023 1908268 2064176 2275698 2287766 2113997 2179450 2234071 2549094 2515013
16871 2515013 2525978 2410027 2524172 2705254 2557375 2640512 2714373 2658155 2806174 2844366
16861 2844366 3251735 3049977 3032752 2491602 2624820 3134749 2896600 3343524 3343785 3010735
$$ packed form
16931A327491j84820J48098N496J03546l08426K05520L80910k77066j23444N5007
16921A332312P9954n4227O1479J26541j85238q7898L99483j97876j20973J76896
16911A530453k3144J01213L11509m65821r7619L04131j7225n4516K94767j60346
16901A723402q4922J13871J35282P1254m03451K07237j6877r15K91960K44488
16891B281329k88206o2428L26457l77008r6119M21253j03131q2975R7179K1194
16881B137545j0522k18755J55908K11522J2068j73769O5453N4621L15023l4081
16871B515013J0965j15951J14145J81082j47879Q3137P3861n6218J48019L8192
16861B844366M07369k01758j7225n41150J33218N09929k38149M46924K61l33050
$$ plain form
16851 3010735 2871657 3380908 3155563 3414465 3421269 3437708 3375528 3345377 3553158 3575572
16841 3575572 3457751 3607684 3999615 3762249 4049723 3924478 4207305 4043317 4117063 4177229
16831 4177229 4263212 4364085 4730460 4596790 4234848 4969342 4961783 5183048 4724312 4981565
16821 4981565 5597381 5182968 5106586 5457695 5942839 5913030 6087590 6374543 6062376 6288923
16811 6288923 6558397 6634191 6828567 6850889 6807381 6794199 7484569 7534824 7538186 7607970 8093582
16800 8093582 7971631 7969352 8527870 8631013 9213294 9174987 9219119 9259897 9519621 9830159
16790 9830159 10429926 10631500 10775450 11078508 11502729 11741493 12069498 12244204 12862863
16781 12862863 12892588 13555063 13886695 14389003 14800119 15376548 15596480 16296632 16731071
$$ packed form
16851C010735j39078N09251k25345K58902O804J6439o2180l0151K07781K2414
16841C575572j17821J49933L91931k37366K87474j25245K82827j63988P3746O0166
16831D177229Q5983J00873L66375j33670l61942P34494p559K21265m58736K57253
16821D981565O15816m14413p6382L51109M85144k9809J74560K86953l12167K26547
16811F288923K69474P5794J94376K2322m3508j3182O90370N0255L362O9784M85612
16800H093582j21951k279N58518J03143N82281l8307M4132M0778K59724L10538
16790I830159N99767K01574J43950L03058M24221K38764L28005J74706O18659
16781A2862863K9725O62475L31632N02308M11116N76429K19932P00152M34439
$$ plain form
16772 16731071 17269220 17575064 18249395 19021086 19655064 20503086 20946994 21957016 22668999
16763 22668999 23378313 24383188 25278798 26529779 27652608 28652031 29706374 31296414
16755 31296414 32377017 33519765 35311216 36678938 38370882 40530296 42337889 44166019
16747 44166019 46849944 48918683 51131984 53990823 57113087 59975262 63628835 66971429
16739 66971429 70968839 74907794 79218480 84259017 88942120 94232619 100097016 105945964
16731 105945964 112831602 119479218 126668939 133866893 141833887 149384812 157181989 165445273
16723 165445273 172562303 179902960 186766580 192625861 197660210 201034234 203489849 204774359
16715 204774359 203779301 202156583 199027851 194515412 189005368 182365514 175065021 167417417
$$ packed form
16772A6731071N38149L05844O74331P71691O33978Q48022M43908J010022P11983
16763B2668999P09314J004875Q95610J250981J122829R99423J054343J590040
16755C1296414J080603J142748J791451J367722J691944K159414J807593J828130
16747D4166019K683925K068739K213301K858839L122264K862175L653573L342594
16739F6971429L997410L938955M310686N040537M683103N290499N864397N848948
16731A05945964O885638O647616P189721P197954P966994P550925P797177Q263284
16723A65445273P117030P340657O863620N859281N034349L374024K455615J284510
16715B04774359r95058j622718l128732m512439n510044o639854p300493p647604
$$ plain form
16707 167417417 159481247 151215412 142955439 135151625 127245119 119453108 112386718 105699001
16699 105699001 99094795 92951532 87882296 82512022 77329098 72898790 68447991 64569388
16691 64569388 61093520 57564648 54338816 51394125 48737425 46137224 43631155 41555746
16683 41555746 39523477 37620293 36000475 34170143 32656682 31265191 29697657 28487730
16675 28487730 27349315 26482310 25209801 23862780 22849345 22268700 21233564 20409377
16667 20409377 19657498 18778038 18335081 17705287 16992806 16292575 15707536 15341133 14904760
16658 14904760 14330097 13787275 13302703 12979195 12726762 11792008 11536804 11491833 11141216
16649 11141216 10858251 10333525 10347921 9830748 9702889 9250621 9133764 8584519 8343907
$$ packed form
16707A67417417p936170q265835q259973p803814p906506p792011p066390o687717
16699A05699001o604206o143263n069236n370274n182924m430308m450799l878603
16691F4569388l475868l528872l225832k944691k656700k600201k506069k075409
16683D1555746k032269j903184j619818j830332j513461j391491j567534j209927
16675B8487730j138415q67005j272509j347021j013435n80645j035136q24187
16667B0409377p51879q79460m42957o29794p12481p00231n85039l66403m36373
16658A4904760n74663n42822m84572l23508k52433r34754k55204m4971l50617
16649A1141216k82965n24726J4396n17173j27859m52268j16857n49245k40612
$$ plain form
16640 8343907 8568300 8287177 7833068 7808488 7567205 7426334 7057376 6957965 7022162 6680132
16630 6680132 6695834 6220311 5798371 6177451 6071999 5417902 5981373 5627678 5351205 5305865
16620 5305865 5245705 5468494 5012765 5066227 4968280 4709472 4551800 4180921 4275632 4302786
16610 4302786 4468408 3931564 3935098 3934984 3920610 3685746 3944370 3571891 3786466 3804818 3394778
16599 3394778 3622761 3341430 3403955 3190579 3417294 3324036 3307078 3333785 2952972 2852670
16589 2852670 2763772 2823017 2466322 2745846 2732108 2555877 2938649 2565924 2722929 2544838
16579 2544838 2460237 2756690 2543437 2482972 2354051 2376825 2574219 1852046 2158086 2581761
16569 2581761 2210485 2217476 2198421 2239092 2112512 1769735 2060746 1922000 1743115 1945062
$$ packed form
16640H343907K24393k81123m54109k4580k41283j40871l68958r9411O4197l42030
16630F680132J5702m75523m21940L79080j05452o54097N63471l53695k76473m5340
16620E305865o0160K22789m55729N3462r7947k58808j57672l70879R4711K7154
16610D302786J65622n36844L534j14j4374k34864K58624l72479K14575J8352m10040
16599C394778K27983k81331O2525k13376K26715r3258j6958K6707l80813j00302
16589B852670q8898N9245l56695K79524j3738j76231L82772l72725J57005j78091
16579B544838q4601K96453k13253o0465j28921K2774J97394p22173L06040M23675
16569B581761l71276O991j9055M0671j26580l42777K91011j38746j78885K01947
$$ plain form
16559 1945062 1619273 1737667 1855525 1536650 1470567 1462061 1420627 1979136 1418970 1660189
16549 1660189 1927529 1817360 1745645 1568542 1277847 1750365 1339091 1623477 1495243 1485783
16539 1485783 1418246 1540062 1293998 1375726 1491309 1484620 1436355 1479306 1320432 1575374
16529 1575374 1447565 1045706 1401817 1039170 1099014 1092229 1412557 943975 1353808 922940
16519 922940 1012021 826087 794592 948755 892992 1399045 726850 848894 960267 943456
16509 943456 798766 1070896 765007 601116 586115 920261 1265895 809812 887752 740354
16499 740354 1092517 1017080 710106 1054990 1133359 1036838 1096560 568798 826155 769776
16489 769776 988311 280894 558876 1114041 662830 798116 651369 1008142 617739 713344
$$ packed form
16559A945062l25789J18394J17858l18875o6083q506m1434N58509n60166K41219
16549A660189K67340j10169p1715j77103k90695M72518m11274K84386j28234r460
16539A485783o7537J21816k46064Q1728J15583o689m8265M2951j58874K54942
16529A575374j27809m01859L56111l62647N9844o785L20328m68582M09833m30868
16519I22940Q9081j85934l1495J54163n5763N06053o72195J22044J11373j6811
16509I43456j44690K72130l05889j63891j5001L34146L45634m56083P7940j47398
16499G40354L52163p5437l06974L44884P8369r6521N9722n27762K57357n6379
16489G69776K18535B80894K77982N55165m51211J35286j46747L56773l90403R5605
$$ plain form
16479 713344 635187 750044 966084 642146 792817 851527 842099 92133 597533 480627
16469 480627 592514 566637 538816 496466 538243 568578 393069 797670 494092 644487
16459 644487 763878 185873 534313 458355 876453 557053 765130 651807 427394 696363
16449 696363 631766 537534 616562 860337 582828 558379 239122 574121 317984 196114
16439 196114 431433 416528 460026 6973 687213 716717 634751 487615 587497 407757 684231
16428 684231 513338 587039 600978 694191 332558 155117 373305 490189 338761 548530
16418 548530 627257 520310 400557 397649 501846 496023 548993 574889 460687 451469 464615
16407 464615 65503 569794 280528 186414 698359 200359 408584 508069 454394 691118
$$ packed form
16479G13344p8157J14857K16040l23938J50671N8710r428I2133N05400j16906
16469D80627J11887k5877k7821m2350M1777L0335j75509M04601l03578J50395
16459F44487J19391A85873L48440p5958M18098l19400K08077j13323k24413K68969
16449F96363o4597r4232P9028K43775k77509k4449B39122L34999k56137j21870
16439A96114K35319j4905M3498F973O80240K9504q1966j47136R9882j79740K76474
16428F84231j70893P3701J3939R3213C32558A55117K18188J16884j51428K09769
16418E48530P8727j06947j19753k908J04197n823N2970K5896j14202r218J3146
16407D64615F5503N04291B80528r4114N11945B00359K08225R9485n3675K36724
$$ plain form
16397 691118 369232 429432 412457 228847 35654 460097 374322 246704 339665 54441 78184
16386 78184 411007 324580 134292 344237 106532 356214 251630 161094 73348 424967
16376 424967 235599 453079 228351 274274 354565 442553 122839 314305 392658 168238
16365 17317 294393 474840 430395 52525 144006 523937 323914 74414 78175 38507 -281651
16353 254588 284655 -150096 328228 105232 213586 78589 512127 88734 445714 74494
16342 -56288 478762 60561 327360 404903 -107294 354125 512767 122726 19729 242673
16332 242673 30560 -199797 93541 38282 43448 -180991 951 141785 76185 415379 100673
16320 75090 164706 41368 -68092 324855 142936 379454 280500 162151 252176 359332 212551
$$ packed form
16397F91118l21886O0200j6975j83610C5654M24443q5775j27618R2961E4441K3743
16386G8184L32823q6427A34292K09945A06532K49682j04584r0536G3348L51619
16376D24967j89368K17480k24728M5923Q0291Q7988A22839J91466P8353A68238
16365A7317K77076J80447m4445E2525R1481L79931k00023G4414L761C8507b81651
16353B54588L0067a50096C28228A05232J08354G8589M33538H8734L56980G4494
16342e6288D78762F0561K66799P7543a07294C54125J58642A22726A9729K22944
16332B42673C0560a99797I3541C8282N166a80991I51J40834o5600L39194A00673
16320G5090Q9616D1368f8092C24855A42936K36518r8954j18349R0025J07156j46781
$$ plain form
16309 212551 215603 282341 120403 356325 92927 7676 277969 387734 -96852 -78619 -12948
16297 -76950 84999 145118 -44357 254319 309386 239351 323999 361860 -5125 203161 273091
16286 273091 81669 329875 111500 -51447 234589 130372 73184 373950 171143 377794
16276 377794 344454 -109941 -86880 226941 22616 9503 18441 204721 -216843 348987 -31209
16264 134336 -27607 121154 449020 140498 108021 398850 210520 119027 59294 480103
16254 480103 -80307 228621 -19957 114361 263968 349046 292947 143863 -23134 -84293 -245826
16243 -245826 78716 -70920 126778 -89366 132660 -48517 96247 -67731 187400 19947 189907
16232 189907 -164965 -167558 115961 227551 -227650 15705 180063 113522 103390 67793 192465
$$ packed form
16309B12551L052O6738A20403K35922I2927G676K70293J09765i6852J8233a2948
16297g6950H4999O0119d4357B54319N5067p0035Q4648L7861e125B03161O9930
16286B73091H1669K48206A11500e1447B34589j04217n7188L00766A71143K06651
16276C77794l3340a09941K3061B26941B2616I503Q938J86280b16843C48987c1209
16264A34336b7607A21154L27866A40498l2477K90829j88330r1493E9294M20809
16254D80103h0307B28621a9957A14361J49607Q5078n6099A43863b3134o1159j61533
16243b45826G8716g0920A26778h9366A32660d8517I6247f7731A87400A9947J69960
16232A89907a64965k593A15961J11590b27650A5705J64358o6541j0132l5597J24672
$$ plain form
16221 192465 36474 -95158 -69487 3322 43543 -60800 -99978 -36814 205033 53952 140035
16210 140035 -224127 -78137 -89709 8373 -292572 68587 -119345 232472 -192724 188594
16199 -284025 -168660 316464 397274 -101105 317555 -136678 111630 112692 221722 8346
16188 259688 26388 -36675 -12505 -38526 71043 35345 -25352 40332 190537 -76965 -362217
16177 -362217 109912 110995 -100700 44960 -92254 99278 -119900 264742 176527 243833 -56763
16165 219907 103955 -215879 145522 -63428 -63078 255027 -28537 -12206 -53970 320004 16980
16153 33044 42028 92992 147871 91682 206439 -55729 1621 -164695 36362 113917 -86544 68214
16140 91902 23442 -61599 -16895 177912 -93453 38738 -12930 214074 105363 26448 -333311
$$ packed form
16221A92465C6474i5158K5671C322M0221f0800l9178c6814B05033E3952Q6083
16210A40035b24127g8137j1572H373b92572F8587a19345B32472a92724A88594
16199b84025J15365C16464Q0810a01105C17555a36678A11630J062J09030H346
16188B59688B6388c6675a2505k6021G1043C5345b5352D0332J50205g6965k85252
16177c62217A09912J083a00700D4960i2254I9278a19900B64742q8215O7306e6763
16165B19907A03955b15879A45522f3428L50B55027b8537a2206m1764C20004A6980
16153C3044Q984N0964N4879n6189J14757e5729A621a64695C6362P7555h6544F8214
16140I1902B3442f1599a6895A77912i3453C8738a2930B14074A05363B6448c33311
$$ plain form
16128 344868 148484 261310 6786 98231 -88897 -135756 76606 69129 -153612 146360 -277731
16116 -275900 -52912 109037 253371 -204116 -62552 -91316 17141 552287 275482 -143595
16105 -176267 112528 -142509 271101 -89526 6403 -183769 37036 -93636 209359 -259050
16094 -46578 150239 -329846 260105 -208849 -6673 219287 203767 -118051 12297 267223
16084 267223 -8145 78703 147155 -89693 220930 47941 -31023 -126259 -89192 156830 -129084
16072 51100 79894 45596 123929 192103 32921 269632 56907 -163543 276298 -176811 419957
16060 -36487 69259 -236053 -46821 43487 -222181 185219 -124847 -307355 -90475 -406803
16050 -406803 -262471 189436 -386133 -109515 145259 32438 -224559 -169329 37505 -414619
$$ packed form
16128C44868A48484J12826F786R1445h8897m6859G6606p477a53612A46360b77731
16116b75900e2912A09037J44334b04116f2552k8764A7141N35146B75482a43595
16105a76267A12528a42509B71101h9526F403a83769C7036i3636B09359b59050
16094d6578A50239c29846B60105b08849f673B19287j5520a18051A2297K54926
16084B67223h145G8703O8452h9693B20930D7941c1023r5236L7067A56830a29084
16072E1100K8794l4298P8333O8174C2921K36711E6907a63543B76298a76811D19957
16060c6487F9259b36053d6821D3487b22181A85219a24847j82508i0475l16328
16050d06803J44332A89436c86133a09515A45259C2438b24559N5230C7505d14619
$$ plain form
16039 -149609 -115853 197973 -306799 -155450 -17452 -277079 -476645 -58453 26538 114203
16029 114203 104959 -46469 147057 283735 65998 -163089 -388938 -35239 -135468 95010 208028
16018 208028 -15308 -331896 250586 34747 23669 -122040 162029 73113 -301222 -79607
16007 111905 -256569 -276737 -121951 27201 -103042 -312176 83365 -118015 41470 69873
15997 69873 -191149 259724 -91986 -153635 -249179 81892 88767 -171842 372097 10698 -86627
15985 278572 132998 1167 498821 64612 188081 284146 23320 88257 9414 29648 7178
15973 -28286 61281 -122067 -234837 -406097 -20324 109475 -81864 -66151 -56540 -63468 -159781
15962 -159781 23443 -18782 158124 -262126 -49921 -71406 76143 -3055 -51992 81768 -246977
$$ packed form
16039a49609L3756A97973c06799J51349a7452k59627j99566e8453B6538Q7665
16029A14203r244d6469A47057J36678F5998a63089k25849c5239j00229I5010J13018
16018B08028a5308l16588B50586C4747j1078a22040A62029G3113c01222g9607
16007A11905b56569k0168a21951B7201a03042k09134H3365a18015D1470K8403
15997F9873a91149B59724i1986o1649r5544H1892O875a71842C72097A0698h6627
15985B78572A32998A167M97654F4612J23469R6065B3320O4937I414K0234G178
15973b8286F1281a22067j12770j71260b0324A09475h1864J5713R611o928r6313
15962a59781B3443a8782A58124b62126d9921k1485G6143c055m8937H1768b46977
$$ plain form
15950 -6544 49036 72064 179993 -106449 -113465 -52635 -101181 -192789 -422343 10627 -198569
15938 -50109 -4840 -116039 -134080 110980 -48276 -148718 63498 -30782 205920 44067 214497
15927 214497 -44583 -118024 179158 -433648 -473463 4413 -54472 11433 -65604 412814 -64040
15915 -50540 -112288 -244246 167120 -374712 -419038 -205898 -429141 -128086 -307726 -128759
15904 259669 47786 -225432 -49529 -2967 -58415 -66636 68809 -41025 -50220 159463 153513 -197026
15891 -47570 -4853 -132628 179253 -38083 -183191 13475 -312384 -58294 42862 149115 -185315
15879 -170900 -231605 -262146 -36092 -402031 45307 72272 62232 -155683 -66551 -195365 -30986
15867 -32961 -26294 -55310 -101422 83523 101658 207370 385670 -134538 -19865 -207375 -34262
$$ packed form
15950f544D9036K3028J07929a06449p016e2635m8546r1608k29554A0627a98569
15938e0109d840j11199j8041A10980d8276j00442F3498c0782B05920D4067J70430
15927B14497d4583p3441A79158d33648l9815D413e4472A1433f5604D12814f4040
15915e0540o1748j31958A67120c74712m4326b05898k23243a28086j79640a28759
15904B59669D7786b25432d9529b967n5448q221F8809d1025r195A59463n950a97026
15891d7570d853j27775A79253c8083j45108A3475c12384e8294D2862J06253a85315
15879a70900o0705l0541c6092l65939D5307K6965j0040a55683f6551j28814c0986
15867c2961O667k9016m6112H3523J8135J05712J78300a34538a9865j87510c4262
$$ plain form
15855 -107171 100917 -169107 -35319 339620 -360535 -211300 -85205 -106916 103196 -307314
15844 102903 -184724 -65588 59504 -40084 224824 166332 -141002 115514 -5942 158600 122143
15833 122143 -34467 -122691 165870 117451 -157700 -234000 9041 -295232 -147140 -375486 19706
15821 107941 160069 -605858 6491 -135897 -114318 -181308 285230 -57829 88938 -383884 65534
15809 -601090 -154707 113867 325819 -128303 -151068 140213 59764 359015 91070 106543
15799 106543 -2585 -144350 -265717 -111910 -163137 -110390 54565 97018 -54011 -283573 -176928
15788 -176928 -140368 -656 58834 -185807 147474 -173671 409456 -95929 -443411 -64218 21315
15776 130299 132134 22504 129906 -172912 118074 -294255 83239 -34372 148735 165579 -391638
$$ packed form
15855a07171A00917a69107c5319C39620c60535J49235h5205k1711A03196c07314
15844A02903a84724f5588E9504d0084B24824n8492a41002A15514e942A58600l6457
15833A22143c4467q8224A65870m8419a57700p6300I041b95232a47140k28346A9706
15821A07941N2128f05858F491a35897K1579o6990B85230e7829H8938c83884F5534
15809f01090a54707A13867K11952a28303k2765A40213E9764K99251I1070J5473
15799A06543b585j41765j21367a11910n1227N2747E4565M2453e4011k29562J06645
15788a76928L6560f56E8834a85807A47474a73671D09456i5929l47482f4218B1315
15776A30299J835B2504J07402a72912A18074b94255H3239c4372A48735J6844c91638
$$ plain form
15764 44401 -223900 -212592 -55218 96471 -33930 197906 229380 -210724 -18997 197293 -336686
15752 34762 46401 119667 205675 37589 -126387 -110505 64921 35839 26020 -205434 63861
15740 -60767 19125 -249811 -53488 -406358 -118900 -49061 -278612 -17567 22891 109825 -195035
15728 -99302 50595 -21625 227684 55948 -236921 -749 103540 -333974 -134330 72194 -211496
15716 44939 15331 -88058 -13319 -123464 -52759 -166380 -78880 -226842 -4781 222605 140883
15705 140883 130250 227649 -198708 84372 -207167 -112865 131597 240474 217745 6722 -155941
15693 257308 49810 206385 100228 92439 -74541 102860 -2910 -32681 -110049 -46629 257010
15681 77796 -139846 129707 114546 121544 119082 -37322 -156125 198329 30710 -23761 -181368
$$ packed form
15764D4401b23900J1308e5218I6471c3930A97906L1474b10724a8997A97293c36686
15752C4762J1639P3266Q6008C7589a26387J5882F4921k9082r819b05434F3861
15740f0767A9125b49811e3488l52870a18900d9061k29551a7567B2891Q6934a95035
15728i9302E0595b1625B27684E5948b36921g49A03540c33974a34330G2194b11496
15716D4939A5331h8058a3319j10145e2759j13621g8880j47962d781B22605q1722
15705A40883j0633R7399a98708H4372b07167R4302A31597J08877k2729F722a55941
15693B57308D9810J56575A00228p789g4541A02860b910k9771p7368d6629B57010
15681G7796a39846A29707j5161O998k462c7322j18803A98329C0710b3761j57607
$$ plain form
15670 -181368 -25383 -115073 -62508 -106550 -116815 -145720 1004 -140523 -288492 310734 -26658
15658 55375 -245116 173879 -11095 -54234 -61821 -82658 75823 -77260 -111529 131329 -78149
15646 -162359 -57560 41001 113324 105443 -133787 -58346 -260935 -15968 41994 10146 -20966
15634 -590295 -292438 -11830 324906 197 -159144 27662 64192 161943 24723 214717 250627
15623 250627 77664 -206264 -229837 -249315 -135639 116779 56538 -45456 22834 -31461 -51298
15612 -51298 -250838 313630 -27160 -660 -166457 -17925 78266 52675 -361947 118264 269680
15601 269680 12637 -91903 77144 323264 13805 81153 141534 70873 -95364 -236955 -141803
15590 -141803 55159 275502 -143250 55445 212903 -107417 -129855 -357216 -9362 -85920 -53764
$$ packed form
15670a81368b5383q9690N2565m4042j0265k8905A004a40523j47969C10734b6658
15658E5375b45116A73879a1095m3139p587k0837G5823g7260l4269A31329g8149
15646a62359e7560D1001P2323p881a33787e8346k02589a5968D1994A0146b0966
15634e90295b92438a1830C24906A97a59144B7662L6530R7751B4723J89994L5910
15623B50627G7664b06264k3573j9478J13676A16779E6538d5456B2834c1461j9837
15612e1298j99540C13630b7160f60j65797a7925G8266k5591c61947A18264J51416
15601B69680A2637i1903G7144K46120A3805O7348O0381p0661i5364j41591R5152
15590a41803E5159K20343a43250E5445J57458a07417k2438k27361i362p6558L2156
$$ plain form
15579 -53764 160035 109284 155208 -214096 -8621 -160548 -4464 -218062 -159490 127120 134866
15568 134866 -204957 11695 -166498 -270733 -14083 137424 129710 8131 -176280 149800 120938
15557 120938 167381 25404 -303669 -147245 -247655 126622 -111841 -356585 -231628 -328495
15547 -328495 266789 -149092 83771 108667 241174 92284 13549 142387 -43203 435776
15536 -24182 -124116 -6053 -6647 88046 -90637 -100521 41835 74050 259693 -50473 -121244 -12089
15523 4671 90712 -230681 -136757 -93225 67149 170470 174381 173558 -105274 400422 -369768
15511 -126700 362753 -203 276672 -101283 150916 261506 102522 -285725 -218061 -266420
15501 -266420 -59640 -225968 56844 -127763 -180080 35102 -142384 -284911 -191991 -5037 -171263
$$ packed form
15579e3764A60035n0751M5924b14096h621j51927d464k13598N8572A27120P746
15568A34866b04957A1695a66498j04235a4083A37424p714H131a76280A49800k8862
15557A20938M6443B5404c03669a47245j00410A26622a11841k44744J24957r6867
15547c28495B66789a49092H3771K4896J32507I2284A3549J28838d3203D35776
15536b4182r9934f053n94H8046i0637r884D1835L2215J85643e0473p0771a2089
15523D671Q6041b30681R3924M3532F7149J03321L911q23a05274D00422c69768
15511a26700C62753b03B76672a01283A50916J10590A02522b85725O7664m8359
15501b66420e9640j66328E6844a27763n2317C5102a42384j42527R2920e037j66226
$$ plain form
15490 -171263 99537 155220 91221 -107956 -32564 162753 -13330 298164 -4897 -280540 -10707
15478 228605 -177978 458939 -53334 60194 99865 -120072 183492 9282 268226 -49798 213303
15466 -278258 10936 -233134 10287 -294951 -96153 -33108 204148 -94438 -95024 6900 -351889
15454 -251091 -74076 133401 -90535 -61519 -34385 -169843 117439 -21208 -184032 -256061 -10096
15442 -124084 -30002 -37103 -109050 150155 34549 -41603 54205 238378 -143980 -233936 -79489
15430 178981 14701 -294138 -187944 144455 -16098 -18140 222076 -51980 -71870 -137308 224260
15418 79792 166570 183541 -150913 -52375 -86602 213635 126785 127915 89187 -114474 -108976
15407 -108976 -168682 82834 61104 290819 -226645 46836 -177024 88582 -85282 -252324 -157704
$$ packed form
15490a71263I9537N5683o3999a07956c2564A62753a3330B98164d897k75643a0707
15478B28605a77978D58939e3334F0194L9671a20072A83492I282K58944d9798B13303
15466b78258A0936b33134A0287b94951i6153c3108B04148i4438n86F900c51889
15454b51091g4076A33401i0535K9016K7134j35458A17439b1208j62824p2029a0096
15442a24084c0002p101p1947A50155C4549d1603E4205J84173a43980q9956g9489
15430A78981A4701b94138J06194A44455a6098k042B22076e1980j9890o5438B24260
15418G9792Q6778J6971a50913e2375l4227B13635q6850J130l8728a14474N498
15407a08976n9706H2834k1730K29715b26645D6836a77024H8582h5282j67042R4620
$$ plain form
15396 -157704 -165036 -48778 259384 251991 -2919 -14538 289330 55940 17287 53465 66072 4052
15383 32670 26079 -24357 -154551 89373 -77541 -151921 50916 -45391 -76245 28898 73003 76721
15371 76721 -13669 -30254 223912 206459 -40038 -2380 -320797 -247147 -305449 23836 -107683
15359 83282 107067 64560 125447 -174725 -63513 3039 145402 48526 -76836 -395507 242943
15347 311482 120085 -214827 352413 99276 -8594 160934 241401 57791 -123021 -214453 -169782
15336 -169782 617422 -13945 24091 -4730 280644 241129 -26210 153260 -5056 25746 -16601
15324 -33516 -67028 236954 -2267 224307 59173 128331 -50863 -116751 169936 -222495 -51001
15312 -56495 -68174 244544 169389 -102166 -217332 61413 89070 211388 154192 7151 -48559
$$ packed form
15396a57704p332d8778B59384p393b919j1619B89330E5940A7287L6178J2607D052
15383C2670o591b4357j30194H9373g7541p4380E0916d5391l0854B8898M4105L718
15371G6721a3669j6585B23912j7453d0038b380l18417P3650n8302B3836a07683
15359H3282K3785m2507O0887a74725f3513C039J42363D8526g6836l18671B42943
15347C11482A20085b14827C52413I9276h594A60934Q0467E7791a23021r1432M4671
15336a69782F17422a3945B4091d730B80644l9515b6210A53260e056B5746a6601
15324c3516l3512B36954b267B24307E9173O9158e0863o5888A69936b22495e1001
15312e6495j1679B44544p5155a02166j15166F1413K7657J22318n7196G151d8559
$$ plain form
15300 -278042 -220160 290963 390772 200661 -234869 -15187 60837 -107422 227182 185587
15290 185587 -28599 -252370 317071 54456 -106532 -70355 81264 84883 332007 -191307 115903
15278 -140499 184484 -66026 3904 513273 243610 144400 -3033 22284 -167859 238240 115494
15266 208500 140446 -66795 133239 119311 65089 168731 124046 -59908 220634 -21660 -169278
15255 -169278 201676 551290 201055 157247 544661 515159 751220 1629979 1298146 1393190
15245 1393190 1639741 515158 372698 4860 244503 302573 349286 -84643 292604 128997
15234 -79007 -189323 300419 -63496 103640 85914 213863 -23905 201843 309788 161218
15224 161218 -378042 -324273 27427 191940 -194722 -93803 156722 -12545 -47906 99411 -174589
$$ packed form
15300b78042N7882B90963R9809j90111b34869a5187F0837a07422B27182m1595
15290A85587b8599k23771C17071E4456a06532L6177H1264L619K47124a91307A15903
15278a40499A84484f6026C904N09369B43610r9210c033B2284a67859B38240A15494
15266B08500o8054f6795A33239j3928n4222J03642m4685e9908B20634b1660j47618
15255a69278B01676L49614B01055m3808L87414k9502K36061Q78759l31833R5044
15245A393190K46551E15158j42460D860K39643N8070M6713h4643B92604A28997
15234g9007j10316C00419f3496A03640j7726J27949b3905B01843J07945j48570
15224A61218c78042N3769B7427J64513a94722i3803A56722a2545l5361I9411a74589
$$ plain form
15212 262698 -207557 121587 -15947 172919 50885 160363 84223 172712 -156277 -177897
15202 -177897 308220 192882 210066 103013 173587 111042 113064 -137815 -85522 179741 32303
15190 239141 22482 150953 61403 111972 140910 10780 -106542 82871 -28998 175614 131684
15179 131684 -48479 -428809 79539 75725 157510 324398 259475 -54129 7847 124529 -115343
15167 48717 264040 254043 61624 100148 192998 140113 76115 -22737 154420 204712 109208
15156 109208 -27045 -357646 -64806 4660 232939 591006 170595 262843 -92265 134486 67553
15145 67553 -36451 -143966 -250088 26942 380743 68898 121490 62682 -154364 41544 310122
15134 310122 112389 197399 329398 241561 -88055 414682 -79923 131363 462628 124679
$$ packed form
15212B62698b07557A21587a5947A72919E0885J09478p6140Q8489a56277k1620
15202a77897C08220j15338J7184A03013P0574o2545K022a37815N2293A79741C2303
15190B39141B2482J28471F1403N0569K8938A0780a06542H2871b8998A75614m3930
15179A31684d8479l80330G9539l814Q1785J66888o4923e4129G847J16682a15343
15167D8717K15323r997F1624L8524R2850n2885o3998b2737A54420N0292r5504
15156A09208b7045l30601f4806D660K28279L58067A70595R2248i2265A34486o6933
15145F7553c6451j07515j06122B6942L53801F8898N2592n8808a54364D1544K68578
15134C10122A12389Q5010J31999q7837h8055D14682g9923A31363L31265A24679
$$ plain form
15123 1461 61949 77073 62246 4982 -25148 550050 93780 147351 153738 -189266 10327 172139
15111 172139 199688 54315 165055 307058 -321901 138953 -180974 45354 -49061 178288
15100 -197931 187871 73348 436413 -169503 364410 -54862 142192 117936 -189549 223350
15089 -97340 321730 11950 82751 295169 385466 353038 289028 424602 507545 -80095 224581
15077 85244 284345 -177184 382834 235683 323538 208813 453958 -16030 378761 145802
15066 138216 109231 140807 172436 28842 217672 297546 197198 221514 116453 -120651 -110644
15055 -110644 446890 197032 224094 484024 126197 -70385 421988 220035 428606 202980
15044 264066 328909 224700 249575 370629 -67792 295994 257468 154589 180600 382586
$$ packed form
15123A461O0488J5124j4827D982b5148E50050I3780N3571O387a89266A0327J61812
15111A72139K7549E4315J10740J42003c21901A38953a80974D5354d9061A78288
15100a97931A87871G3348L63065a69503C64410e4862A42192k4256a89549B23350
15089i7340C21730A1950P0801K12418R0297l2428o4010J35574Q2943h0095B24581
15077H5244J99101a77184C82834j47151Q7855j14725K45145a6030C78761A45802
15066A38216k8985L1576L1629B8842J88830P9874j00348K4316j05061a20651J0007
15055a10644D46890A97032K7062K59930A26197g0385D21988k01953K08571B02980
15044B64066O4843j04209K4875J21054f7792B95994l8526j02879K6011K01986
$$ plain form
15034 382586 53748 -183792 315972 188590 145759 -25505 166644 366242 279299 380233
15024 380233 -27934 -59251 397528 -168021 14502 544042 207658 42156 122782 382545
15014 382545 106216 466350 -42942 371343 304012 173194 31475 -1731 246207 17924 101398
15003 101398 173640 369163 148568 160108 393866 132534 -137384 283537 280726 398536
14993 398536 -88162 -50628 3542 204951 119065 103447 -51641 -7332 299256 -50235 260003
14981 221887 469764 95217 230482 94803 -50102 354621 185323 324732 258880 37603
14970 -242389 360429 144377 231026 374240 503295 416646 218733 161281 624518 248982
14959 236499 80774 531133 591877 41183 95199 178832 421222 213163 47914 265289 381267
$$ packed form
15034C82586E3748a83792C15972j27382m2831b5505A66644J99598q6943J00934
15024C80233b7934l1317C97528a68021A4502N29540B07658D2156Q0626K59763
15014C82545A06216L60134d2942C71343o7331j30818C1475a731B46207A7924Q3474
15003A01398P2242J95523A48568J1540K33758A32534a37384B83537k811J17810
14993C98536h8162L7534C542K01409q5886j5618e1641g332B99256e0235B60003
14981B21887K47877I5217J35265I4803e0102C54621j69298J39409o5852C7603
14970b42389C60429A44377Q6649J43214J29055q6649j97913n7452M63237B48982
14959B36499H0774M50359O0744D1183N4016Q3633K42390k08059D7914K17375J15978
$$ plain form
14948 381267 605696 404890 1373 253286 487812 335326 483292 74995 368194 336316
14938 336316 459636 526922 385282 188375 292407 546037 440826 282899 403492 343360
14928 343360 340368 156143 152403 99736 215212 -141448 267298 448967 253105 207988 182640
14917 182640 458553 183758 260043 68868 384795 544657 457245 334099 633749 132656
14906 -5963 115700 335773 216833 390536 288277 189823 353615 142746 99275 274130
14896 274130 399084 578824 398553 431019 389057 270425 469141 346780 456152 491457
14886 491457 396358 488423 777512 184536 216517 476572 247784 420934 504708 301426
14876 301426 458779 410177 411182 31098 382577 367591 767845 457454 751342 726740 389465
$$ packed form
14948C81267K24429k00806A373K51913K34526j52486J47966G4995K93199l1878
14938C36316J23320O7286j41640A88375J04032K53630j05211j57927J20593o0132
14928C43360k992A56143l740n2667J15476a41448B67298J81669j95862m5117k5348
14917A82640K75913A83758P6285F8868L15927J59862q7412j23146K99650A32656
14906e963A15700K20073j18940J73703j02259r8454J63792A42746m3471J74855
14896B74130J24954J79740j80271L2466m1962j18632J98716j22361J09372L5305
14886D91457r5099R2065K89089A84536L1981K60055k28788J73150Q3774k03282
14876C01426J57353m8602J005C1098L51479j4986M00254l10391K93888k4602l37275
$$ plain form
14865 389465 547340 826576 247677 338313 676529 388765 148810 298499 418090 310426
14855 310426 409187 531089 327355 508927 446510 191918 376880 132189 240634 511133
14845 511133 409381 627129 758793 106115 654979 598187 459236 318859 752657 313191
14834 274418 129967 298551 307476 268061 342101 565739 807462 588699 766367 699373
14824 699373 548722 908097 415193 289003 534694 772652 784349 479903 498351 332884
14814 332884 789256 554870 543668 211552 905077 441644 841494 223278 854884 521364
14804 521364 592696 605035 714024 234071 214457 438214 662692 399882 571866 728763
14794 728763 553328 632488 282557 284160 794184 309575 925721 493605 447557 852977
$$ packed form
14865C89465J57875K79236B47677R0636L38216k87764A48810J49689J19591j07664
14855C10426R8761J21902k03734J81572o2417A91918J84962A32189J08445K70499
14845E11133j01752K17748J31664A06115N48864n6792j38951j40377M33798C13191
14834B74418A29967J68584Q925l9415P4040K23638K41723k18763J77668o6994
14824F99373j50651L59375D15193j26190K45691K37958J1697l04446J8448j65467
14814C32884M56372k34386j1202B11552O93525D41644L99850B23278O31606l33520
14804E21364P1332J2339J08989B34071j9614K23757K24478k62810J71984J56897
14794G28763j75435P9160B82557J603N10024C09575O16146m32116m6048M05420
$$ plain form
14784 852977 385801 682638 476612 657097 699823 405214 742819 783146 739803 421794
14774 421794 645441 291325 704420 575901 901232 479001 451320 231405 679766 758609
14764 758609 923809 707553 665492 738613 679725 355773 583552 613506 617337 514844 890271
14753 890271 744981 671659 680423 641543 862946 584777 724528 564611 476585 721391
14743 721391 571946 755006 783310 815107 306755 311583 905053 836772 981508 819771
14733 819771 809151 656720 855548 906900 785908 748641 686867 782721 860410 723194 681911
14722 681911 1183573 689167 418028 815842 931666 961835 943885 989967 842037 518043
14712 518043 1046989 972388 833644 818367 771707 484381 968753 850146 894414 897458 895762
$$ packed form
14784H52977C85801K96837k06026J80485M2726k94609L37605M0327m3343l18009
14774D21794K23647B91325M13095j28519L25331m22231k7681k19915M48361P8843
14764G58609J65200k16256m2061P3121n8888l23952K27779K9954L831j02493L75427
14753H90271j45290p3322Q764l8880K21403k78169J39751j59917q8026K44806
14743G21391j49445J83060K8304L1797C06755M828N93470o8281J44736j61737
14733H19771j0620j52431J98828N1352j20992l7267o1774R5854P7689j37216m1283
14722F81911N01662m94406k71139L97814J15824L0169j7950M6082j47930l23994
14712E18043N28946p4601j38744j5277m6660k87326M84372j18607M4268L044j696
$$ plain form
14701 895762 788342 1039660 919803 1182558 718970 1086328 1025651 813006 1132776 1020722
14691 1020722 1101896 908059 934456 810774 1172615 1164624 1258595 1122268 1167223 959561
14681 959561 1071400 1190520 867070 1090281 1118956 936902 1029298 934523 1093395 1320504
14671 1320504 1179154 1243566 1199309 920197 976352 1056205 954266 1124992 1075478 702419
14661 702419 1063855 1232109 1126276 1182798 1268847 1014325 913327 954014 1228166 1086505
14651 1086505 1502210 1271358 1213282 1317967 1095472 1237980 1354213 1388861 1734651 1615672
14641 1615672 1362887 1063400 1494316 1218100 1326677 1327448 1531349 1643744 1340578 1664163
14631 1664163 1544625 1291090 1458815 1485876 1470491 1313128 1563814 1512304 1593539 1235330
$$ packed form
14701H95762j07420K51318j19857K62755m63588L67358o0677k12645L19770j12054
14691A020722Q1174j93837K6397j23682L61841p991R3971j36327M4955k07662
14681I59561J11839J19120l23450K23211K8675j82054R2396r4775J58872K27109
14671A320504j41350O4412m4257k79112N6155P9853j01939J70726m9514l73059
14661G02419L61436J68254j05833N6522Q6049k54522j00998M0687K74152j41661
14651A086505M15705k30852n8076J04685k22495J42508J16233L4648L45790j18979
14641A615672k52785k99487M30916k76216J08577P71K03901J12395l03166L23585
14631A664163j19538k53535J67725K7061j5385j57363K50686n1510Q1235l58209
$$ plain form
14621 1235330 1398531 1300502 1582035 1491356 1776114 1931151 1273409 1499349 1579152 1760913
14611 1760913 1299466 1720814 1363958 1825872 1629307 1727260 1739917 1804376 1631259 1349602
14601 1349602 1687733 1972339 1745907 1912500 1836861 1706520 1891495 1540605 1780532 2193515
14591 2193515 1697103 1647024 1933150 1659694 1694828 2056578 1871828 1946089 1788549 2180863
14581 2180863 1960005 2053353 1928018 2350478 2383203 2025323 2549059 2069155 2305626 2477792
14571 2477792 2295419 2330472 2446021 2696530 2336130 2480525 2740705 2326150 2796009 2603365
14561 2603365 2945353 3273242 3318991 3331170 3293090 3534245 3513206 4014817 3894798 4728140
14551 4728140 5187923 6136057 8392114 12573382 21969664 38840067 46821404 23660329
$$ packed form
14621A235330J63201r8029K81533r0679K84758J55037o57742K25940P9803J81761
14611A760913m61447M21348l56856M61914j96565R7953J2657O4459j73117k81657
14601A349602L38131K84606k26432J66593p5639j30341J84975l50890K39927M12983
14591B193515m96412n0079K86126k73456L5134L61750j84750P4261j57540L92314
14581B180863k20858R3348j25335M22460L2725l57880N23736m79904K36471J72166
14571B477792j82373L5053J15549K50509l60400J44395K60180m14555M69859j92644
14561B603365L41988L27889M5749J2179l8080K41155k1039N01611j20019Q33342
14551D728140M59783R48134K256057M181268R396282J6870403P981337k3161075
$$ plain form
14543 23660329 8953098 4929337 3042291 2765991 2712292 2341777 2046300 1887834 1919233
14534 1919233 2348461 2181664 2214850 2283060 2237733 2266905 2733224 2253468 2384936 2471251
14524 2471251 2452069 2334208 2800210 2546057 2804655 2306117 2684194 2416578 2819008 2820034
14514 2820034 2838754 3058630 2921021 2924458 2989691 2793107 3018785 3171357 3109478 3251494
14504 3251494 2998702 3016518 3400110 3361440 3627407 3271988 3418105 3334309 3590270 3736838
14494 3736838 3658760 3463744 3751054 3639134 3837190 4044012 3862036 3509745 3501964 3707655
14484 3707655 4006735 4256503 4080573 3966816 3991842 4471924 4216999 4250188 4474237 4296770
14474 4296770 4075704 4331728 4556691 4617903 4634731 4419345 4881967 4874562 5129960 4794451
$$ packed form
14543B3660329H953098m023761j887046k76300n3699l70515k95477j58466L1399
14534A919233M29228j66797L3186O8210m5327K9172M66319m79756J31468Q6315
14524B471251j9182j17861M66002k54153K58598m98538L78077k67616M02430J026
14514B820034J8720K19876j37609L437O5233j96584K25678J52572o1879J42016
14504C251494k52792J7816L83592l8670K65967l55419J46117q3796K55961J46568
14494C736838p8078j95016K87310j11920J98056K06822j81976l52291p781K05691
14484C707655K99080K49768j75930j13757K5026M80082k54925L3189K24049j77467
14474D296770k21066K56024K24963O1212J6828k15386M62622p405K55398l35509
$$ plain form
14464 4794451 4970703 4980776 5207262 4890238 5017437 5249578 5379686 5324071 5379453 5356321
14454 5356321 5590824 5712887 5963676 5822281 5800854 5984956 6204729 6078081 5913020 6120653
14444 6120653 6184057 6074920 5972749 6528959 6515436 6986516 6827916 7052369 6910189 7294666
14434 7294666 7366396 6980720 7403142 7288778 7637190 7693989 7736166 8088315 7956281 8124437
14424 8124437 8162794 7956432 8349695 8118806 8344582 8878181 8738783 8918339 9110797 9215580
14414 9215580 9189153 9175016 9514887 9629764 9827128 9824734 9910732 10393953 10347168 10039154
14404 10039154 10625992 10968605 10659969 11301252 11166137 11664993 11669927 11808410 12455279 12458367
14394 12458367 12493043 12624265 13133241 13237592 13025074 13532713 13790209 13824447 14263496 14817690
$$ packed form
14464D794451J76252J0073K26486l17024J27199K32141J30108n5615N5382k3132
14454E356321K34503J22063K50789j41395k1427J84102K19773j26648j65061K07633
14444F120653O3404j09137j02171N56210j3523M71080j58600K24453j42180L84477
14434G294666P1730l85676M22422j14364L48412N6799M2177L52149j32034J68156
14424H124437L8357k06362L93263k30889K25776N33599j39398J79556J92458J04783
14414I215580k6427j4137L39871J14877J97364k394Q5998M83221m6785l08014
14404A0039154N86838L42613l08636O41283j35115M98856M934J38483O46869L088
14394A2458367L4676J31222N08976J04351k12518N07639K57496L4238M39049N54194
$$ plain form
14384 14817690 14463838 15149728 15347277 15768011 16011744 15991582 16662332 16936315 17342981
14375 17342981 17884998 17902614 18429387 18794448 19215237 19721728 19754019 20340023 20969039 21076633
14365 21076633 21834580 22306857 22401345 23052388 23658989 23753590 24615803 25122268 25716321 26029124
14355 26029124 27089002 27482927 27833285 29000271 29265131 30240434 30823083 31688346 32573242
14346 32573242 33296494 34020491 35227000 35706733 36867039 38213071 39014365 39930684 41013030
14337 41013030 42410159 43333756 44770385 45998472 47529096 48582107 50852040 51860472
14329 51860472 53815761 55383428 56906972 58969905 60565253 62785445 64874502 67493943
14321 67493943 69374128 72084688 74820832 77403030 80137081 83113435 86468949 89705931
$$ packed form
14384A4817690l53852O85890J97549M20734K43733k0162O70750K73983M06666
14375A7342981N42017J7616N26773L65061M20789N06491L2291N86004O29016J07594
14365B1076633P57947M72277R4488O51043O06601R4601Q62213N06465N94053L12803
14355B6029124J059878L93925L50358J166986K64860R75303N82649Q65263Q84896
14346C2573242P23252P23997J206509M79733J160306J346032Q01294R16319J082346
14337D1013030J397129R23597J436629J228087J530624J053011K269933J008432
14329E1860472J955289J567667J523544K062933J595348K220192K089057K619441
14321F7493943J880185K710560K736144K582198K734051K976354L355514L236982
$$ plain form
14313 89705931 93328091 97141098 100970437 105185768 108997757 114090273 118853284 124136650
14305 124136650 129452795 135061938 141355928 147332231 153980182 161356027 169095507 176610854
14297 176610854 185230096 194154792 203494395 213655828 223856115 234927141 246312203
14290 246312203 258602737 271398941 284232704 297705721 311678886 325990660 340610573
14283 340610573 355707867 370285224 384978719 399785016 413531884 426809321 439142560
14276 439142560 450229914 459371223 467300787 472132754 473217239 470817162 469379771 467521227
14268 467521227 463884998 458089189 448994928 438295069 426736073 413454207 398744706
14261 398744706 383879199 368106287 352219369 336108176 320921294 305579218 291250846
$$ packed form
14313H9705931L622160L813007L829339M215331L811989N092516M763011N283366
14305A24136650N316145N609143O293990N976303O647951P375845P739480P515347
14297A76610854Q619242Q924696R339603J0161433J0200287J1071026J1385062
14290B46312203J2290534J2796204J2833763J3473017J3973165J4311774J4619913
14283C40610573J5097294J4577357J4693495J4806297J3746868J3277437J2333239
14276D39142560J1087354R141309P929564M831967J084485k400077j437391j858544
14268D67521227l636229n795809r094261j0699859j1558996j3281866j4709501
14261C98744706j4865507j5772912j5886918j6111193j5186882j5342076j4328372
$$ plain form
14254 291250846 277563027 263757322 250794951 238506148 226506170 215651925 204793091
14247 204793091 195285024 185505432 176862982 168692406 160735633 153373901 145884908 139479479
14239 139479479 133376205 128197083 122414246 116925970 112083656 107319466 102957684 99116002
14231 99116002 95331708 91540990 88092490 84638995 81536757 78474051 75579605 72732905
14223 72732905 70182331 67504291 65365148 62994058 61169972 59227726 57066836 55383645
14215 55383645 53576754 52387905 50777102 49207931 47478445 46024036 44353850 43877554
14207 43877554 42840117 41386433 40145438 38688359 37969301 36498570 36284032 35406032
14199 35406032 34063710 33224534 32334231 31968450 30855474 30320995 29591012 28887210 28004629
$$ packed form
14254B91250846j3687819j3805705j2962371j2288803j1999978j0854245j0858834
14247B04793091r508067r779592q642450q170576p956773p361732p488993o405429
14239A39479479o103274n179122n782837n488276m842314m764190m361782l841682
14231I9116002l784294l790718l448500l453495l102238l062706k894446k846700
14223G2732905k550574k678040k139143k371090j824086j942246k160890j683191
14215E5383645j806891j188849j610803j569171j729486j454409j670186m76296
14207D3877554j037437j453684j240995j457079p19058j470731k14538q78000
14199C5406032j342322q39176q90303l65781j112976n34479p29983p03802q82581
$$ plain form
14190 28004629 27536802 27184144 25729822 25522325 24624621 24050907 23843702 23050638 22519476
14181 22519476 21818077 21873741 21531637 20854468 20420704 20149690 19757330 19219918 18927021
14172 18927021 18576558 18087031 17878849 17575255 17223819 16855152 16802007 16320903 15828197
14163 15828197 15512878 15409280 15391044 14950094 14779960 14162326 14151772 14391764 13949524 13756619
14153 13756619 13195099 13091010 12800348 12329986 12615905 12444592 12297856 11782684 11808787
14144 11808787 11407864 11388640 11426829 11126128 10811244 10860014 10486598 10351768 10161399 10108168
14134 10108168 10166024 9694469 9173438 9584078 9199676 9281192 8947085 8836948 8806501 8732413
14124 8732413 8531149 8527480 8435809 8464092 8300066 8138017 7678200 7663423 7462700 7468968 7222433
$$ packed form
14190B8004629m67827l52658j454322k07497q97704n73714k07205p93064n31162
14181B2519476p01399N5664l42104o77169m33764k71014l92360n37412k92897
14172A8927021l50463m89527k08182l03594l51436l68667n3145m81104m92706
14163A5828197l15319j03598j8236m40950j70134o17634j0554K39992m42240j92905
14153A3756619n61520j04089k90662m70362K85919j71313j46736n15172K6103
14144A1808787m00923j9224L8189l00701l14884M8770l73416j34830j90369n3231
14134A0108168N7856m71555n21031M10640l84402Q1516l34107j10137l0447p4088
14124H732413k01264l669r1671K8283j64026j62049m59817j4777k00723O268k46535
$$ plain form
14113 7222433 7283476 7171024 7376471 7025068 7139981 7132387 6954616 6745552 6400283 6724482
14103 6724482 6618073 6643437 6337319 6045885 6130831 5866901 6093090 5857502 6068768 5966360
14093 5966360 5753725 5805182 5645836 5708469 5704299 5531542 5363914 5472751 5196745 5120551
14083 5120551 5304891 5061833 5145863 5042122 5319949 4942849 4925972 4597453 4548224 4671057
14073 4671057 4687870 4781522 4638459 4507429 4617451 4766554 4729441 4205960 4176889 4536237
14063 4536237 4383663 4083125 4142216 4343720 4252214 4144913 4296641 4094919 4072595 3613228
14053 3613228 4089076 3976229 3984214 3746457 3642456 3775449 3644580 3555107 3547303 3635403
14043 3635403 3410099 3412556 3312704 3516049 2968262 3103048 3308340 3515919 3180620 2851043
$$ packed form
14113G222433O1043j12452K05447l51403J14913p594j77771k09064l45269L24199
14103F724482j06409K5364l06118k91434Q4946k63930K26189k35588K11266j02408
14093E966360k12635N1457j59346O2633m170j72757j67628J08837k76006p6194
14083E120551J84340k43058Q4030j03741K77827l77100j6877l28519m9229J22833
14073D671057J6813R3652j43063j31030J10022J49103l7113n23481k9071L59348
14063D536237j52574l00538N9091K01504r1506j07301J51728k01722k2324m59367
14053C613228M75848j12847P985k37757j04001J32993j30869q9473p804Q8100
14043C635403k25304K457r9852K03345n47787J34786K05292K07579l35299l29577
$$ plain form
14033 2851043 3365750 3007911 3429859 3372858 3227216 3069927 3181242 2927736 2952500 3049819
14023 3049819 2664809 2977172 2585145 2727134 2667461 2868367 2555127 2495167 2516405 2726191
14013 2726191 2609716 2163575 2631607 2730963 2450338 2559075 2364133 2243811 2319728 2352933
14003 2352933 2383148 2235802 2150914 2381277 2855772 2744346 2248378 2358216 2242071 2321916
13993 2321916 2450700 2378270 2780414 3108247 3989528 6678932 14759171 31111203 46856287
13984 46856287 27290787 13503599 8310953 6261300 5064947 4213311 3837917 3386960
13976 3386960 3295243 3255052 3078628 2817309 2747017 2434908 2818148 2563954 2596511 2521903
13966 2521903 2598408 2325536 2591357 2458115 2218322 1965342 2074212 1970180 2143741 2205038
$$ packed form
14033B851043N14707l57839M21948n7001j45642j57289J11315k53506K4764R7319
14023C049819l85010L12363l92027J41989n9673K00906l13240n9960K1238K09786
14013B726191j16475m46141M68032R9356k80625J08737j94942j20322P5917L3205
14003B352933L0215j47346q4888K30363M74495j11426m95968J09838j16145P9845
13993B321916J28784p2430M02144L27833Q81281K689404Q080239J6352032J5745084
13984D6856287j9565500A3503599n192646k049653j196353q51636l75394m50957
13976C386960r1717m0191j76424k61319p0292l12109L83240k54194L2557p4608
13966B521903P6505k72872K65821j33242k39793k52980J08870j04032J73561O1297
$$ plain form
13956 2205038 1947454 2294145 2134945 1744571 1965726 2018934 2129884 1931626 2174906 2124087
13946 2124087 1575611 1873371 1737748 1855816 1899158 2034953 1608092 2203142 1753428 1622687
13936 1622687 1748725 1928256 1821173 1977403 1490933 1659954 1943339 1844934 1686421 1972981
13926 1972981 1749191 1723003 1809098 1625225 1620488 1579720 1523545 1789115 1926761 1327392
13916 1327392 1942352 1689713 1465420 1505361 1548609 1301320 1337110 1568557 1591481 1400287
13906 1400287 1407861 1458687 1406145 996664 1466552 1224358 1337317 1415316 1361301 1464793
13896 1464793 1308597 1533112 1189623 1168760 1220619 1408284 1567042 1424741 1553179 1383155
13886 1383155 1455241 1467138 1287390 1641281 1067806 1223199 1278231 1439447 1030830 1247791
$$ packed form
13956B205038k57584L46691j59200l90374K21155N3208J10950j98258K43280n0819
13946B124087n48476K97760j35623J18068M3342J35795m26861N95050m49714j30741
13936A622687J26038J79531j07083J56230m86470J69021K83385r8405j58513K86560
13926A972981k23790k6188Q6095j83873m737m0768n6175K65570J37646n99369
13916A327392O14960k52639k24293L9941M3248k47289L5790K31447K2924j91194
13906A400287P574N0826n2542m09481M69888k42194J12959P7999n4015J03492
13896A464793j56196K24515l43489k0863N1859J87665J58758j42301J28438j70024
13886A383155P2086J1897j79748L53891n73475J55393N5032J61216m08617K16961
$$ plain form
13876 1247791 912699 1393209 1249294 1317487 1391895 982255 1467557 1349760 1307993 954313
13866 954313 1253034 1169765 1199409 969640 1159165 901320 1348892 1370587 1068623 1236488
13856 1236488 1281029 1025923 1004049 1038513 904258 778281 677476 959068 966040 1204016
13846 1204016 1089813 1101930 1224836 1136144 1165226 1143227 1215844 919963 993145 992093 1013212
13835 1013212 810272 1002915 1022656 882741 1191014 882058 959740 1317997 830309 840082
13825 840082 709732 1180777 865675 834758 999713 860785 1026295 956105 723769 1202660
13815 1202660 958571 835385 619753 731043 782349 903926 1186220 639285 913820 679958
13805 679958 942583 878442 498866 645357 877031 1055556 820848 839969 999152 767207
$$ packed form
13876A247791l35092M80510j43915O8193P4408m09640M85302j17797m1767l53680
13866I54313K98721q3269K9644k29769J89525k57845M47572K1695l01964J67865
13856A236488M4541k55106k1874L4464j34255j25977j00805K81592O972K37976
13846A204016j14203J2117J22906q8692K9082k1999P2617k95881P3182j052K1119
13835A013212k02940J92643J9741j39915L08273l08956P7682L58257m87688R773
13825H40082j30350M71045l15102l0917J64955j38928J65510p0190k32336M78891
13815A202660k44089j23186k15632J11290N1306J21577K82294n46935K74535k33862
13805F79958K62625o4141l79576J46491K31674J78525k34708J9121J59183k31945
$$ plain form
13795 767207 983405 781765 712710 875751 936981 699641 828152 652212 861166 882850
13785 882850 1057741 533966 631496 649699 858343 782851 536339 886748 876152 470387
13775 470387 933550 628938 535973 878152 686375 614275 662220 877160 751051 726096
13765 726096 474382 683776 533608 569111 735266 1057408 819070 568152 708338 848102
13755 848102 483290 960708 706619 437250 704840 813855 227198 555920 759989 654348
13745 654348 1033677 522922 643117 327594 916750 673269 472155 747082 479442 515863
13735 515863 449584 819206 228587 851028 599961 437795 454430 608240 569032 761461
13725 761461 491145 512239 608774 504239 695716 720006 514674 483504 804694 363156
$$ packed form
13795G67207K16198k01640o9055J63041O1230k37340J28511j75940K08954K1684
13785H82850J74891n23775R7530J8203K08644p5492k46512L50409j0596m05765
13775D70387M63163l04612r2965L42179j91777p2100M7945K14940j26109k4955
13765G26096k51714K09394j50168L5503J66155L22142k38338k50918J40186J39764
13755H48102l64812M77418k54089k69369K67590J09015B27198L28722K04069j05641
13745F54348L79329n10755J20195l15523N89156k43481k01114K74927k67640L6421
13735E15863o6279L69622B28587O22441k51067j62166J6635J53810l9208J92429
13725G61461k70316K1094R6535j04535J91477K4290k05332l1170L21190C63156
$$ plain form
13714 422881 740994 778427 392829 836828 354352 473789 620386 284058 439846 625145
13704 625145 325475 371042 585502 323441 417553 607378 6490 725535 391389 606635
13694 606635 193759 677728 588245 526718 722779 644897 316238 743876 689918 508302
13684 508302 540088 624876 732093 736062 506374 738355 443969 180123 275780 280045 802518
13673 802518 330688 304720 598441 167029 681800 832626 296001 716552 496551 382058
13663 382058 719893 359476 569653 346738 211418 594902 476038 172617 523859 464863
13653 464863 479362 560782 594781 219578 407457 561986 377564 587051 642553 557380
13643 557380 382304 343117 464359 671884 518804 232983 405476 515104 464940 555815
$$ packed form
13714D22881L18113L7433l85598M43999C54352J19437J46597B84058J55788J85299
13704F25145k99670M5567K14460k62061R4112J89825F490P19045l34146K15246
13694F06635A93759M83969q9483o1527J96061p7882C16238M27638n3958j81616
13684E08302L1786Q4788J07217L969k29688K31981k94386A80123R5657M265N22473
13673H02518C30688k5968K93721A67029N14771J50826B96001M20551k20001j14493
13663C82058L37835C59476K10177k22915j35320L83484j18864A72617L51242n8996
13653D64863J4499Q1420L3999B19578J87879J54529j84422K09487N5502q5173
13643E57380j75076l9187J21242K07525j53080B32983J72493J09628n0164R0875
$$ plain form
13633 555815 447448 389515 298515 384474 449771 174927 246146 432561 584270 458150
13623 458150 426510 433698 228408 363526 711637 109773 424071 493708 559020 331180
13613 331180 301633 20050 439770 537915 311169 112470 403068 337551 544717 387326
13603 387326 632062 87445 332071 647701 56648 455613 750256 422760 -38499 332800
13592 540592 369576 511796 338617 412396 404723 311325 425469 -43416 331798 150735
13581 122454 305890 413896 544868 282052 404893 451892 310823 135422 334664 225213
13571 225213 373798 124178 472057 195957 377041 439743 384104 276478 190050 378413
13561 378413 71977 -70736 555063 45501 377509 471254 471129 275403 328945 93910 309467
$$ packed form
13633E55815j08367n7933r1000Q5959O5297A74927P1219J86415J51709j26120
13623D58150l1640P188k05290J35118L48111A09773L14298O9637O5312k27840
13613C31180k9547B0050M19720R8145k26746A12470K90598o5517K07166j57391
13603C87326K44736H7445K44626L15630E6648L98965K94643l27496c8499C32800
13592E40592j71016J42220j73179P3779p673r3398J14144d3416C31798A50735
13581A22454J83436J08006J30972k62816J22841M6999j41069A35422J99242j09451
13571B25213J48585A24178L47879A95957J81084O2702n5639j07626q6428J88363
13561C78413G1977g0736E55063D5501L32008R3745j25j95726N3542I3910K15557
$$ plain form
13550 309467 524824 646072 265198 288963 273956 38850 427923 356912 534962 208201
13539 26305 232468 320039 554788 534075 246120 59330 495008 136427 382125 719004
13529 719004 289880 199636 218442 391294 486304 49271 136598 447592 165403 154115 61146
13517 192885 250350 525694 191526 420964 444330 274510 113046 173596 103715 438483
13507 438483 263193 525352 -8665 366095 295086 234213 481554 106992 74265 670461
13497 670461 236848 309218 -135082 364045 189336 365198 197667 243347 67263 400549
13487 400549 219208 372969 489933 305577 102233 522179 269398 154935 272772 80419
13476 133313 188127 250248 336394 201079 5630 335115 107919 325102 675971 80335 81140
$$ packed form
13550C09467K15357J21248B65198K3765j5007C8850L89073p1011J78050B08201
13539B6305K06163Q7571K34749k0713B46120E9330M35678A36427K45698L36879
13529G19004B89880r0244J8806J72852R5010D9271Q7327L10994A65403j1288F1146
13517A92885N7465K75344A91526K29438K3366j69820A13046O0550o9881L34768
13507D38483j75290K62159h665C66095p1009o0873K47341A06992l2727N96196
13497F70461B36848P2370a35082C64045j74709J75862j67531M5680F7263L33286
13487D00549j81341J53761J16964j84356A02233M19946k52781j14463J17837H0419
13476A33313N4814O2121Q6146j35315E630L29485A07919K17183L50869H0335Q05
$$ plain form
13465 81140 103901 260039 230362 286610 355447 143734 333849 195735 483561 251269
13455 251269 84039 319381 471972 370151 158664 284818 357120 385553 411825 273667
13445 273667 327203 246466 -46855 97651 43080 302510 206338 218467 229229 581712 287324
13433 243313 112108 209458 592648 278943 9638 390132 52705 232421 333050 406451
13423 406451 198347 352331 144490 185682 256296 396352 71464 267584 -387 230557 -92471
13411 183698 113752 319711 13970 101044 197637 539985 44363 274837 214787 346306 352235
13400 352235 321563 49260 -72263 108150 78793 245563 39525 -48291 -17924 121780 163999
13389 163999 354099 264356 491657 44667 342309 639978 -38904 84669 438017 -58583
$$ packed form
13465H1140K2761J56138k9677N6248O8837A43734J90115j38114K87826k32292
13455B51269H4039K35342J52591j01821A58664J26154P2302K8433K6272j38158
13445B73667N3536q0737d6855I7651D3080K59430r6172J2129J0762L52483B87324
13433B43313A12108R7350L83190B78943I638L80494E2705J79716J00629P3401
13423D06451A98347J53984A44490M1192P0614J40056G1464J96120c87B30557i2471
13411A83698o9946K05959A3970Q7074R6593L42348D4363K30474o0050J31519N929
13400C52235l0672D9260g2263A08150k9357J66770C9525d8291a7924A21780M2219
13389A63999J90100q9743K27301D4667K97642K97669c8904H4669L53348e8583
$$ plain form
13378 210387 24193 -25825 119504 -53561 -167872 101266 48841 186952 83404 107433 177720
13367 177720 367822 -126846 225346 53909 -179788 143904 153011 194315 -105827 245176
13356 155953 23449 224219 7742 86161 482937 429239 257421 221332 40000 416394 295863
13345 295863 354962 151731 288410 213107 70358 318027 239133 373137 77073 178462
13335 178462 22211 270212 178507 108289 299502 295727 73004 38171 -93786 303987 -92693
13323 292089 394643 175169 163582 73332 7853 64547 378182 455224 131264 307250 367414
13312 367414 87014 354004 446258 570800 312095 395634 -81326 144841 49268 398726
13302 398726 103627 326892 127437 254023 75903 382227 432452 58621 46227 32361
$$ packed form
13378B10387B4193b5825A19504e3561j14311A01266D8841J38111H3404K4029P0287
13367A77720J90102a26846B25346E3909a79788A43904R107M1304a05827B45176
13356A55953B3449K00770G742P8419L96776n3698j71818l6089D0000L76394j20531
13345B95863N9099A51731J36679p5303G0358K47669p8894J34004G7073J01389
13335A78462B2211K48001r1705p0218J91213l775G3004l4833i3786C03987i2693
13323B92089J02554A75169j1587G3332G853N6694L13635P7042A31264J75986O0164
13312C67414H7014K66990R2254J24542k58705Q3539h1326A44841D9268L49458
13302C98726A03627K23265A27437J26586G5903L06324N0225E8621j2394j3866
$$ plain form
13292 32361 28904 -56003 179148 6520 150269 91724 -235689 -45836 282971 48972 168485
13281 168485 3755 133319 -136192 55515 132216 51667 200057 -43030 540797 -60642 -315206
13270 -315206 297307 109955 329005 213951 133290 -462245 10175 179510 302198 -74579
13259 51151 85451 256910 150892 359874 270890 399896 250501 -22406 90655 197469
13249 197469 55037 -38735 90067 238061 114904 -134198 195993 155379 108782 274151
13239 274151 -48648 322931 -199943 131824 500315 341827 406533 -65643 -200966 16387
13228 436175 97630 -24401 -24060 214907 217425 327853 283061 16766 74301 107266 -191659
13216 -259008 98184 41249 347323 16828 83117 160445 -26031 -50014 444635 147575 72136
$$ packed form
13292C2361l457e6003A79148F520J43749n8545b35689d5836B82971D8972J19513
13281A68485C755J29564a36192E5515P6701E1667J48390d3030E40797f0642k54564
13270c15206B97307A09955K19050j15054q0661d62245A0175J69335J22688g4579
13259E1151L4300J71459j06018K08982q8984J29006j49395b2406I0655J06814
13249A97469E5037c8735I0067J47994A14904a34198A95993m0614m6597J65369
13239B74151d8648C22931a99943A31824L68491j58488O4706f5643j35323A6387
13228D36175I7630b4401L41B14907K518J10428m4792A6766N7535L2965a91659
13216b59008I8184D1249L06074A6828O6289P7328b6031k3983D44635A47575G2136
$$ plain form
13204 335862 30416 238666 299337 43310 27811 102170 86236 335665 162478 197674 -63178
13192 -2328 90017 208514 315926 -31155 333809 155072 269230 379473 135564 191522
13182 191522 16110 28674 -117638 -88369 205248 289707 419855 174706 127829 93627 215681
13171 215681 273553 -44079 214273 -90792 293117 198755 -10557 360590 -14448 210041 -36768
13159 205193 -58259 113781 112668 268738 -66215 -90616 301901 -74880 67034 142728 -134869
13147 250353 89577 182038 -36478 254980 391629 160087 102642 219931 -68311 273061
13136 -276644 -10504 171819 97129 253927 240186 -206904 230485 62612 -9060 -292406 118236
13124 190333 -963 204849 -16231 153192 -89375 -22888 -214534 -34151 248406 478530 233195
$$ packed form
13204C35862C0416K08250O0671D3310j5499P4359j5934K49429A62478L5196f3178
13192b328I0017J18497J07412c1155C33809A55072J14158J10243A35564N5958
13182A91522A6110J2564a17638K9269B05248Q4459J30148A74706m6877l4202J22054
13171B15681N7872d4079B14273i0792B93117r4362a0557C60590a4448B10041c6768
13159B05193e8259A13781j113J56070f6215k4401C01901g4880F7034P5694a34869
13147B50353H9577R2461c6478B54980J36649A60087n7445J17289f8311B73061
13136b76644a0504A71819p4690J56798j3741b06904B30485F2612i060k83346A18236
13124A90333i63B04849a6231A53192h9375b2888j91646c4151B48406K30124B33195
$$ plain form
13112 -221345 43776 138675 -4954 99519 -227622 -96466 144957 247326 139253 329056 9297
13100 427150 127439 13412 120255 348684 228293 109159 81261 248396 262056 -5161
13089 153663 201887 -30865 243814 -212014 -28470 1701 378628 367247 280738 390032 110543
13077 103425 -150226 295783 -27776 247916 -13629 -49042 293928 36453 169786 85267
13067 85267 233484 220084 453795 109183 167769 39527 144363 70913 178230 17847 259754
13056 259754 -43907 -265223 74932 145597 38351 127279 58862 291270 -187524 256820 142412
13045 142412 212048 227330 21511 336165 24130 -79145 67190 -87915 17534 54276 -51882
13033 159699 183123 -176817 -76791 271625 304052 115654 270198 54466 227027 114823
$$ packed form
13112b21345D3776R4899d954I9519b27622i6466A44957J02369j08073J89803I297
13100D27150A27439A3412J06843K28429j20391A09159k7898J67135J3660e161
13089A53663M8224c0865B43814b12014b8470A701L76927j1381q6509J09294A10543
13077A03425a50226B95783b7776B47916a3629l5413B93928C6453J33333q4519
13067H5267J48217j3400K33711A09183N8586C9527J04836G0913J07317A7847K41907
13056B59754d3907k21316G4932P0665C8351Q8928E8862K32408a87524B56820j14408
13045A42412O9636J5282B1511L14654B4130g9145F7190h7915A7534L6742e1882
13033A59699K3424a76817g6791B71625L2427A15654J54544E4466J72561j12204
$$ plain form
13023 114823 51564 88841 188501 257981 139291 211346 497046 263184 205028 191282 156272
13012 156272 235590 363909 151543 -149425 -77469 81570 -355169 238584 295256 300128 -230073
13000 64867 64077 76793 211030 138923 -130244 65195 248104 -48990 -67198 315754 -330205
12988 -86364 -47743 -82710 -142249 410187 67031 -3577 223736 -119818 185671 447070 26637
12976 164538 144593 94727 226975 -162745 152156 -73873 374224 240727 164916 1749 -99529
12964 210366 -73340 9005 36424 -41596 181105 191532 191200 -139386 -146685 -149041 330630 -83886
12951 -165671 34019 -5364 -77294 361754 -337189 201958 64371 -12509 190526 223985 23073
12939 68664 -177251 245970 228378 -14970 -145116 -14389 29469 17292 306133 -76191 100446
$$ packed form
13023A14823E1564L7277R9660O9480j18690P2055K85700k33862n8156j3746l5010
13012A56272P9318J28319A51543a49425P1956H1570c55169B38584N6672M872b30073
13000F4867p90J2716J34237p2107a30244F5195J82909d8990j8208C15754c30205
12988h6364L8621l4967n9539D10187F7031c577B23736a19818A85671K61399B6637
12976A64538j9945m9866J32248a62745A52156g3873C74224j33497p5811A749i9529
12964B10366g3340I005K7419d1596A81105J0427l32a39386p299k356C30630h3886
12951a65671C4019e364p1930C61754c37189B01958F4371a2509A90526L3459B3073
12939F8664a77251B45970j7592a4970j30146a4389B9469j2177K88841g6191A00446
$$ plain form
12927 -129429 -54478 -24789 -109019 32981 165126 -355581 -93801 -3477 -32677 -111330 10543
12915 -299675 264976 -114891 -98698 219286 249497 -159066 10799 -85957 355898 -146871
12904 -120342 105278 164485 -60212 -171032 -173557 -166565 -158765 134185 210198 254787 158323
12893 158323 168047 -225065 -34233 14792 323697 -131092 -30220 -214982 -103741 192249
12882 119900 -288920 51379 -91921 144496 420328 154669 408093 -39310 79355 110966
12872 110966 196591 62037 -65825 -155018 99560 -162272 -24483 102191 68813 153126 -55050
12860 110746 -298747 -82412 78719 -122043 -249927 -24855 -186872 -143483 346332 -90318
12849 153962 38111 -102339 142497 12860 164762 146580 211151 133089 75025 61627 -15678
$$ packed form
12927a29429e4478b4789q4230C2981J32145c55581i3801c477k9200p8653A0543
12915b99675B64976a14891J6193B19286L0211a59066A0799h5957C55898a46871
12904a20342A05278N9207f0212j10820k525O992P800A34185P6013M4589r6464
12893A58323R724b25065c4233A4792L08905a31092c0220j84762a03741A92249
12882A19900b88920E1379i1921A44496K75832A54669K53424c9310G9355L1611
12872A10966Q5625F2037f5825q9193I9560a62272b4483A02191l3378Q4313e5050
12860A10746b98747h2412G8719a22043j27884b4855j62017M3389C46332i0318
12849A53962C8111a02339A42497A2860J51902j8182O4571p8062n8064j3398a5678
$$ plain form
12837 200495 -323417 -197910 -186495 263297 57081 53454 144393 411544 355393 56435 -3031
12825 27422 -92035 -370998 -75105 227877 -86047 -394285 44025 144965 74965 -71470 94106
12813 -149609 -191571 -25704 -66186 263698 25431 8457 140519 173299 69737 -162095 -242047
12802 -242047 194239 289416 -308723 27122 192684 86554 25553 17283 284855 65283 -13313
12790 -249102 124625 22909 74893 197183 93390 186049 6738 -244495 -180674 -267457 -303198
12779 -303198 5179 261588 38583 114253 25315 -87645 189295 -2095 -202678 -19366 -127757
12768 -127757 13421 2844 -179436 -165620 -50390 -13050 -170996 -98638 19148 267897 64269
12756 -69174 327942 -81680 -187107 -204076 -218528 -305255 -155267 -87029 196046 -21108 398536
$$ packed form
12837B00495c23417J25507J1415B63297E7081l627R0939K67151n6151E6435c031
12825B7422i2035k78963g5105B27877h6047l08238D4025J00940p0000g1470I4106
12813a49609m1962b5704m0482B63698B5431H457J32062L2780F9737a62095p9952
12802b42047A94239R5177c08723B7122J65562H6554B5553q270K67572F5283a3313
12790b49102A24625B2909N1984J22290I3390R2659F738b44495O3821q6783l5741
12779c03198E179K56409C8583P5670B5315h7645A89295b095k00583a9366j08391
12768a27757A3421B844a79436J3816e0390a3050j57946P2358A9148K48749F4269
12756f9174C27942h1680j05427j6969j4452q6727J49988O8238A96046b1108C98536
$$ plain form
12744 373956 -875 158693 149662 180560 47695 136401 -17906 302651 -91736 -119283 31846 186895
12732 186895 208318 -161884 -51273 -62090 -123140 33195 -19204 -31885 410022 -249809 -9677
12720 -21261 -202036 322361 -39871 219343 -119866 82394 -30384 -130564 108050 154837
12710 154837 261645 141015 -76069 206856 138697 113805 415435 2524 24499 -8791 110164
12698 60209 -72356 62989 -166574 268981 -69230 -112509 45548 422360 114604 85494 324943
12687 324943 -37461 151568 67154 -111720 -57691 294837 365252 134258 458310 170991
12676 190130 24193 -196646 -276461 471384 49082 195020 -147027 102959 23538 34526
12666 34526 -71161 -23571 196412 -164790 -49100 56607 -127908 183361 335499 352300 32507
$$ packed form
12744C73956h75A58693r031L0898D7695Q8706a7906C02651i1736k7547C1846J55049
12732A86895K1423a61884e1273j0817o1050C3195a9204j2681D10022b49809i677
12720b1261j80775C22361c9871B19343a19866H2394c0384j00180A08050M6787
12710A54837J06808j20630g6069B06856o8159k4892L01630B524K1975h791A10164
12698F0209g2356F2989a66574B68981f9230m3279D5548L76812A14604k9110K39449
12687C24943c7461A51568F7154a11720N4029B94837P0415A34258L24052A70991
12676A90130B4193a96646p9815D71384D9082J45938a47027A02959B3538J0988
12666C4526g1161b3571A96412a64790d9100E6607a27908A83361J52138J6801C2507
$$ plain form
12654 34787 -245804 -43212 -185153 382062 88724 -163585 212516 51467 117977 49710 -164198
12642 162977 198574 -43288 113831 12266 -148966 149098 252053 84807 30678 -29702 245002
12630 -225412 147296 311714 105773 435558 343314 157698 343222 392665 -69749 146138
12619 -25730 -74040 -62043 -55384 -193377 -466681 -38646 284729 149481 -67075 134766 96948
12608 96948 183527 112292 156632 6709 -40283 -73577 -18897 21860 404312 204636 -30122
12596 119501 -20561 -18553 313014 183514 225573 201896 325147 161016 170460 -67365 64884
12584 -212587 15218 105226 -248392 -147890 -127428 124914 244951 -241478 14485 -79081
12573 15280 223221 -62030 -171783 -81020 -71454 114053 -122455 171033 1986 -24319 -73376
$$ packed form
12654C4787b45804d3212j41941C82062H8724a63585B12516E1467O6510D9710a64198
12642A62977L5597d3288A13831A2266a48966A49098J02955H4807C0678b9702B45002
12630b25412A47296J64418A05773L29785r2244A57698J85524M9443f9749A46138
12619b5730m8310J1997O659j37993k73304c8646B84729j35248f7075A34766l7818
12608I6948Q6579p1235M4340F709d0283l3294a8897B1860L82452j99676c0122
12596A19501b0561K008C13014j29500M2059k3677J23251A61016R444f7365F4884
12584b12587A5218R0008b48392J00502K0462A24914J20037b41478A4485g9081
12573A5280K07941f2030j09753h1020R566A14053a22455A71033A986b4319m9057
$$ plain form
12562 -73376 74651 107709 54563 -17967 -259064 193767 121317 173151 252040 -105032 253956
12550 -147552 -49751 155349 -55308 -4771 280910 106949 -141866 -205368 111162 21927 75553
12539 75553 -165279 34238 -256507 -89015 135063 228 317610 209002 -434733 -6201 2844
12527 -266432 79924 286187 -229222 -145868 -6357 -53800 -237358 -145295 -202696 -142468 150841
12515 165348 95145 -228021 184967 36992 82136 122627 -125097 -128931 -36204 -95067 25362
12503 27196 -382694 121558 114454 -535 121162 238459 190572 153516 -212722 99524 -93593
12491 -251644 -161248 59674 -294364 -63913 -226927 215058 -144612 253582 -66044 129379
12480 423352 106247 -38729 191370 -224193 -137477 119891 37754 -136698 -34142 40091
$$ packed form
12562g3376G4651L3058n3146a7967k41097A93767p2450N1834P8889a05032B53956
12550a47552d9751A55349e5308d771B80910A06949a41866o3502A11162B1927N3626
12539G5553a65279C4238b56507h9015A35063B28L17382j08608d34733f201B844
12527b66432G9924K06263b29222Q3354f357m7443j83558R2063n7401O0228A50841
12515A65348p0203b28021A84967C6992M5144M0491a25097l834c6204n8863B5362
12503B7196c82694A21558p104e35A21162J17297m7887l7056b12722I9524i3593
12491b51644R0396E9674b94364f3913j63014B15058a44612B53582f6044A29379
12480D23352A06247c8729A91370b24193Q6716A19891C7754a36698c4142D0091
$$ plain form
12469 -59165 -121855 348683 -189356 484012 -76445 82165 126176 108491 -84833 7920 -19901
12457 85373 227896 -130689 220440 -160016 387285 137182 -95985 -244748 270397 -16432
12446 158332 -152897 -95020 -116806 86163 6305 1094 315810 -42341 -42734 -37704 242371 -19685
12433 8830 -2573 -298081 227726 167631 107953 -5296 128492 53687 -177869 95335 293568
12422 293568 55223 -243605 -114764 -149629 -695160 107382 -13370 175454 119312 300604
12412 300604 161233 33054 -6284 -192233 207702 -66239 85074 -154939 33306 341981 -504553
12400 119216 98630 -187476 -110212 -219715 -195966 -273910 301690 243333 219456 -17147 -459132
12389 -459132 -10945 17738 -75377 19612 -24883 -298623 251284 -327107 212774 -102012
$$ packed form
12469e9165o2690C48683a89356D84012g6445H2165M4011j7685h4833G920a9901
12457H5373J42523a30689B20440a60016C87285A37182i5985j48763B70397a6432
12446A58332a52897N7877k1786H6163F305A094L14716d2341l93N030B42371a9685
12433H830b573k95508B27726o0095n9678e296A28492E3687a77869I5335J98233
12422B93568E5223b43605a14764l4865n45531A07382a3370A75454n6142J81292
12412C00604j39371C3054f284j85949B07702f6239H5074a54939C3306L08675e04553
12400A19216k0586a87476P7264j09503K3749p7944C01690n8357k3877a7147m41985
12389d59132a0945A7738g5377A9612b4883k73740B51284c27107B12774a02012
$$ plain form
12378 -192437 9211 2626 -192404 -138497 -83920 -346617 252004 42818 -31176 -4501 -92810
12367 -92810 -117471 -69057 62073 -90210 -329360 268272 -37424 62389 135876 -82008 24951
12355 150038 -108931 46990 -117655 -251990 8581 -86131 103688 -176944 -258743 -88450 20091
12343 151247 -121370 -48750 -1866 272066 359341 27767 -340704 -370142 -214870 101601 58528
12332 58528 -72324 40146 163751 180782 21237 -96039 -193766 -21367 116320 190210 172453
12321 172453 -166045 5916 -257168 118695 132982 -9613 170477 116257 343786 36756 -140958
12309 -85742 343512 111158 65723 44018 25444 192833 43923 -96410 -92440 -101032 -60999
12298 -60999 -247925 67922 15962 117327 184795 158983 133464 -103064 4791 45230 91637
$$ packed form
12378a92437I211B626a92404N3907N4577k62697B52004D2818c1176d501q8309
12367i2810k4661M8414F2073i0210k39150B68272c7424F2389P3487h2008B4951
12355A50038a08931D6990a17655j34335H581h6131A03688a76944q1799h8450B0091
12343A51247a21370d8750a866B72066Q7275B7767c40704k9438J55272A01601m3073
12332E8528g2324D0146J23605J7031B1237i6039r7727b1367A16320P3890j7757
12321A72453a66045E916b57168A18695J4287i613A70477n4220K27529C6756a40958
12309h5742C43512A11158m5435k1705j8574J67389D3923i6410L970q592M0033
12298f0999j86926F7922A5962J01365O7468k5812k5519a03064D791M0439M6407
$$ plain form
12287 91637 185978 -26239 448189 -157789 316028 93417 773 -33487 -222204 352701 138860
12275 183745 17448 -261213 282670 339334 286283 -36987 294770 -257706 -116870 142190
12264 -147957 38704 -99096 -102278 -216266 256676 259986 -115850 370672 280620 248751 172031
12253 172031 7500 191177 119741 45106 175666 418977 -31557 33282 -164987 303930 349395
12242 349395 61728 397004 -25583 165572 334161 351481 46333 -37176 499119 412055 361305
12231 361305 325 -87155 98465 202845 281493 368315 283832 197828 306212 306625 313341 455086
12219 455086 225477 74402 404323 266601 290406 29592 61006 116083 185251 287246 228382
12208 228382 328584 139023 203264 34915 153786 -166187 338237 140480 268420 -195527
$$ packed form
12287I1637R4341b6239D48189a57789C16028I3417G73c3487j88717C52701A38860
12275A83745A7448b61213B82670N6664n3051c6987B94770b57706a16870A42190
12264a47957C8704i9096l182j13988B56676L310a15850C70672r0052l1869p6720
12253A72031G500J83677p1436D5106J30560K43311c1557C3282a64987C03930M5465
12242C49395F1728L35276b5583A65572J68589J7320D6333c7176D99119q7064n0750
12231C61305C25h7155I8465J04380P8648Q6822q4483q6004J08384M13O716J41745
12219D55086B25477G4402L29921j37722K3805B9592L1414N5077O9168J01995n8864
12208B28382J00202A39023O4241C4915J18871a66187C38237A40480J27940a95527
$$ plain form
12197 165445 229319 165353 239840 469992 105354 30344 264740 47085 31382 3893 40192
12186 40192 176550 316619 10619 75088 186884 -312169 23269 81184 -35056 259454 -214471
12174 248072 183154 338650 223975 -100098 119886 -50796 90693 328320 301340 -306599
12163 -74065 196599 209620 71748 -260740 86855 -462320 -74748 113539 373389 120817
12152 79080 -18254 29238 99377 -158546 -15995 75140 -106596 14494 -138888 45623 30415
12141 30415 -443083 41945 139933 67745 -94086 -22697 287946 -86236 -29622 -189985 23692
12129 131599 -354551 -170607 -345858 100837 -247405 -199755 -124267 194325 -129703 17971
12118 139745 -215862 200286 35773 -195918 -94056 -171362 223324 335747 182390 88593
$$ packed form
12197A65445O3874o3966P4487K30152A05354C0344K34396D7085j5703C893L6299
12186D0192J36358J40069A0619O4469J11796c12169B3269N7915c5056B59454b14471
12174B48072o4918J55496j14675a00098A19886e0796I0693K37627k6980c06599
12163g4065A96599J3021G1748b60740H6855d62320g4748A13539K59850A20817
12152G9080a8254B9238P0139a58546a5995G5140a06596A4494a38888D5623j5208
12141C0415d43083D1945R7988F7745i4086b2697B87946h6236b9622j60363B3692
12129A31599c54551a70607j75251A00837b47405M7650P5488A94325a29703A7971
12118A39745b15862B00286C5773a95918i4056p7306B23324J12423j53357H8593
$$ plain form
12107 157945 -591362 103253 -597573 111588 -116981 -37871 9815 -148155 -329133 231386
12096 345549 41152 -75919 253613 -34518 127046 11173 -154486 -72879 -170549 249906 -285515
12084 -221180 -74835 153586 90945 144194 168586 72720 -57043 87449 38248 259570 1229427
12073 1229427 1955168 375382 98503 110723 269577 -53367 94184 141736 -54560 37995 107958
12062 107958 232456 330198 -239729 -47555 -62836 108231 41396 -196767 8756 76890 -83975
12050 -53792 153927 177429 -111799 -204113 37888 -248750 106968 2683 -349145 -124216 169336
12038 25238 71173 -219270 -211755 -94305 156238 -1156 -20632 -23386 -103584 -218697 -123925 159837
12025 95623 -55963 -225938 -87468 327888 -127577 -250081 -87615 76961 -236472 -197953 -21367
$$ packed form
12107A57945e91362A03253e97573A11588a16981c7871I815a48155j80978B31386
12096C45549D1152g5919B53613c4518A27046A1173a54486g2879r7670B49906b85515
12084b21180g4835A53586o2641N3249K4392G2720e7043H7449C8248K21322R69857
12073A229427P25741C75382I8503J2220J58854e3367I4184M7552e4560C7995O9963
12062A07958J24498R7742b39729d7555j5281A08231D1396a96767H756O8134h3975
12050e3792A53927K3502a11799r2314C7888b48750A06968B683c49145a24216A69336
12038B5238M5935b19270P515i4305A56238a156j9476k754q0198j15113R4772A59837
12025I5623e5963j69975h7468C27888a27577j22504h7615G6961b36472L8519b1367
$$ plain form
12013 99729 374484 -87722 -173912 -257421 243888 267697 -24829 133648 254478 232548 104976
12001 -387325 311734 -254381 113004 -47940 -271439 -24935 -246684 -75181 83499 -91357
11990 -170326 -181413 101860 107107 -153195 -10899 8611 111268 264837 236027 131395 -278538
11978 21000 120393 137752 -138533 -184685 -140361 162722 93030 -253858 -87786 105691 270502
11967 270502 103883 -59119 49005 -213410 132538 -43793 12033 264812 -99058 136494
11956 243046 -256566 -24362 75925 -10113 -102315 43997 -159672 -173684 46455 263633 2932
11944 -114278 279354 183416 358206 -20777 -131785 360579 -203283 148755 -138099 77652
11933 -78834 269586 -101780 332688 74636 130607 18099 -321635 -155549 -87790 106339
$$ packed form
12013I9729K74755h7722q6190q3509B43888K3809b4829A33648J20830k1930A04976
12001c87325C11734b54381A13004d7940k23499b4935k21749g5181H3499i1357
11990a70326j1087A01860N247a53195a0899H611J02657J53569k8810j04632b78538
11978B1000R9393J7359a38533m6152M4324A62722o9692b53858h7786A05691J64811
11967B70502A03883e9119D9005b13410A32538d3793A2033K52779i9058A36494
11956B43046b56566b4362G5925a0113r2202D3997a59672j4012D6455K17178B932
11944a14278B79354r5938J74790b0777j11008C60579b03283A48755a38099G7652
11933g8834B69586a01780C32688G4636N5971A8099c21635a55549O7759A06339
$$ plain form
11922 11657 -46254 -71272 124878 139955 -47488 16184 55821 -118224 246666 221633 13982
11910 214171 -106148 -255106 -323099 4037 75808 -121825 318225 -64185 -261259 -73572 -34641
11898 88218 29074 54645 10882 320269 -221323 161784 -39102 -585147 -177911 -336849
11888 -336849 -153319 -235351 161205 -94415 -313341 -23668 -4283 -15207 142111 -138029 132132
11876 -70225 25471 357609 -199801 75153 -273982 -32084 -74607 -64716 124273 125254 115651 -98313
11863 -236119 342498 -135496 -121124 -114285 -82631 -31532 -114530 206289 47197 150029 216753
11852 216753 -505263 113154 248209 -75910 -47610 -42128 -230572 -179147 98682 -333300 -32331
11840 -122423 -111147 -349957 -16019 -130361 -139158 -80674 -262801 79603 55124 105186 70761
$$ packed form
11922A1657d6254k5018A24878J5077d7488A6184L9637a18224B46666k5033A3982
11910B14171a06148j48958o7993D037P1771a21825C18225f4185j97074g3572c4641
11898H8218B9074K5571A0882L09387b21323A61784c9102n46045a77911j58938
11888c36849a53319q2032A61205i4415k18926b3668d283j0924A42111a38029A32132
11876g0225B5471L32138a99801G5153b73982c2084m2523R891A24273R81r603i8313
11863b36119C42498a35496J4372O839L1654c1532q2998B06289D7197J02832O6724
11852B16753e05263A13154J35055g5910K8300N482j88444N1425I8682c33300c2331
11840a22423J1276k38810a6019j14342q797N8484j82127G9603k4479N0062l4425
$$ plain form
11829 70761 103767 284026 -2258 -210551 373920 -282876 -83079 -237939 -112913 40165 128454
11818 128454 -216856 -5970 -37920 226194 312040 -93462 71297 -428441 -2469 -155644 -51835
11806 29202 -32713 -33688 -101976 -40366 -251739 59033 -56868 174768 -283667 -204719 -157996
11795 -157996 4550 -174203 101329 -81475 -88060 -33249 105105 -120636 447432 -9941 -156221
11784 -156221 -68341 -8532 287344 88251 209662 -80968 280854 174094 -213328 39977 -102341
11772 36803 295014 -54654 49382 -78630 277773 -58235 -152516 116840 -254372 147256 -404694
11760 153357 -72426 27468 -285026 82965 231243 3096 30868 322826 -277019 -80539 16715
11748 17544 -102118 -27003 -166295 -108453 52181 54531 26527 370730 -133855 -153429 -277605
$$ packed form
11829G0761L3006J80259b258k08293C73920b82876h3079j54860a12913D0165Q8289
11818A28454b16856e970l1950B26194Q5846i3462G1297d28441b469j53175e1835
11806B9202c2713r75o8288d0366k11373E9033e6868A74768b83667P8948M6723
11795a57996D550a74203A01329h1475o585c3249A05105a20636D47432i941j46280
11784a56221f8341h532B87344H8251J21411h0968B80854j06760b13328C9977a02341
11772C6803K58211e4654D9382g8630B77773e8235r4281A16840b54372A47256d04694
11760A53357g2426B7468b85026H2965J48278C096K7772K91958b77019h0539A6715
11748A7544a02118b7003j39292N7842E2181K350B6527L44203a33855j9574j24176
$$ plain form
11737 -277605 78591 -167732 205183 113645 -110975 225885 -179703 -82768 -88129 95736 -125682
11725 -424518 64976 -65458 -269652 -58863 -34090 50432 146225 -39234 31253 218067 207707
11714 207707 142227 220331 108134 32031 -7128 80354 16699 -180970 -18275 31394 255695
11703 255695 176974 -80085 234636 22934 36135 -34004 99810 166593 -115727 -38743 138394
11691 -32812 -3944 -61540 44960 -73482 51422 -229900 310599 9705 123617 -18127 -64851
11680 -64851 149730 226410 378897 109033 -128270 58076 18342 7408 -131335 -59948 22644
11668 211725 34930 62535 96575 273202 114333 -215514 -93151 -191880 -67754 12383 148016
11657 148016 -79193 -422326 392469 113168 166765 -113047 22041 425664 -77076 -273077
$$ packed form
11737b77605G8591a67732B05183r1538a10975B25885a79703h2768n361I5736a25682
11725d24518F4976f5458k04194e8863K4773E0432R5793c9234C1253J86814j0360
11714B07707o5480P8104A08134C2031g128H0354A6699a80970a8275C1394K24301
11703B55695p8721h0085B34636B2934J3201c4004I9810O6783a15727c8743A38394
11691c2812c944n7596D4960g3482E1422b29900C10599I705J13912a8127m6724
11680f4851A49730P6680J52487A09033a28270E8076A8342G408a31335e9948B2644
11668B11725C4930K7605L4040J76627A14333b15514i3151r8729f7754A2383J35633
11657A48016g9193l43133C92469A13168N3597a13047B2041M03623g7076j96001
$$ plain form
11647 -273077 132164 -85704 -84403 -309517 23368 -272760 166464 -168069 -235031 -86513 109616
11635 -211300 87945 5063 8778 150728 392085 75857 -238332 -208100 -316885 -126198 141892
11623 159991 78737 -148697 143056 157552 -2892 -148901 -146759 -80556 -135205 240281 -165163
11611 10769 -20495 59526 158930 98209 -236693 -156897 -202309 195064 393497 -128505 111833
11599 -8729 338185 19789 -91238 84223 222045 -74522 470563 -48693 -243842 -241591 101139
11587 96588 265837 303191 -67685 180213 -250469 -5218 -31395 188840 154863 -65382 -28607
11575 246049 466011 -100475 219928 318591 -101081 -166311 263133 -312672 189072 193855
11565 193855 -328996 36037 376176 290493 308511 120646 47341 274577 -93364 120141
$$ packed form
11647b73077A32164h5704J301k25114B3368b72760A66464a68069o6962h6513A09616
11635b11300H7945E063L715J41950K41357G5857b38332L0232j08785a26198A41892
11623A59991G8737a48697A43056J4496b892j46009K142O6203n4649B40281a65163
11611A0769b0495E9526R9404o0721b36693P9796m5412A95064J98433a28505A11833
11599h729C38185A9789i1238H4223J37822g4522D70563d8693j95149K251A01139
11587I6588J69249L7354f7685A80213b50469e218k6177A88840l3977f5382b8607
11575B46049K19962a00475B19928R8663a01081o5230B63133c12672A89072M783
11565A93855c28996C6037L40139q5683J8018A20646D7341K27236i3364A20141
$$ plain form
11554 27598 248389 51856 94266 -192351 3558 5208 306277 -42099 -5815 -215921 58215
11542 -85527 309496 85862 257187 4361 -118791 30270 -211873 74469 242746 244164 531196
11531 531196 8489 403902 56755 91254 113410 121956 -31336 -231845 95545 85754 287673
11520 287673 -33420 373107 99668 -409715 -33731 76391 282691 3077 148596 383707 226098
11509 226098 163907 203591 328840 52720 -17376 120371 -79151 148430 291794 309323 34153
11497 -19580 37380 79511 102580 544220 174263 450298 169606 120176 37752 176825 291710
11486 291710 52096 337956 -95824 406804 356346 246984 -17497 409184 286015 46071
11475 218610 236463 435318 125657 -22359 185347 11382 -4906 168312 213015 -11736 307199
$$ packed form
11554B7598K20791E1856M2410a92351C558J650L01069d2099e815k10106E8215
11542h5527C09496H5862J71325D361a18791C0270b11873G4469J68277J418K87032
11531E31196H489L95413E6755L4499K2156Q546c1336k00509I5545r791K01919
11520B87673c3420C73107I9668d09715c3731G6391K06300C077J45519K35111j57609
11509B26098o2191L9684J25249E2720a7376A20371g9151A48430J43364J7529C4153
11497a9580C7380M2131K3069M41640A74263K76035A69606m9430C7752J39073J14885
11486B91710E2096K85860i5824D06804n0458j09362a7497D09184j23169D6071
11475B18610J7853J98855A25657b2359A85347A1382d906A68312M4703a1736C07199
$$ plain form
11463 338241 -186350 190640 120312 286361 138278 273327 97388 163605 -240559 86577
11452 195511 245431 365618 30581 69016 215575 33936 -89913 170063 119412 -234271 196717
11440 -175496 255750 144740 -86941 -37140 202034 -92177 -150 101731 66902 300421 -119429
11428 48183 98015 77356 -93304 26946 -205699 -49868 65094 6816 -49743 218833 -3062 -267039
11416 -267039 -215598 43505 34874 -28491 103589 89697 524056 -115824 -27552 356787 139329
11404 177864 329893 233627 86972 -54388 -16117 85561 -371278 -171574 58718 -75583 330442
11392 79426 65167 -12218 134832 -139314 -76273 34300 -99632 -25610 58116 364754 55270
11380 40520 -67207 121179 103030 -242603 159829 -256851 54128 -168581 7172 -307557 -458541
$$ packed form
11463C38241a86350A90640p0328J66049A38278J35049I7388O6217b40559H6577
11452A95511M9920J20187C0581L8435J46559C3936h9913A70063n0651b34271A96717
11440a75496B55750j11010h6941c7140B02034i2177a50A01731l4829K33519a19429
11428D8183M9832k0659i3304B6946b05699d9868F5094F816d9743B18833c062k63977
11416b67039N1441D3505q631b8491A03589j3892M34359a15824b7552C56787A39329
11404A77864J52029r6266H6972e4388a6117H5561c71278a71574E8718g5583C30442
11392G9426j4259a2218A34832a39314O3041C4300i9632b5610E8116L06638E5270
11380D0520f7207A21179j8149b42603A59829b56851E4128a68581G172c07557j50984
$$ plain form
11369 -458541 82666 166518 -23008 -94864 157975 -328105 51021 5284 133154 141537 -91999
11357 76101 -181954 -22041 105621 -378016 -175196 299670 122748 -242306 181199 -57750
11346 187667 213515 -27927 -177687 -48856 94413 177896 32944 249618 255772 81846 -237079
11334 118105 -134417 -117886 -107334 -38571 -45205 77208 70056 -3441 53761 34819 29911 218725
11322 218725 -39462 -27924 446483 143783 -97648 110114 99272 118294 -185327 -44795 -100504
11311 -100504 123676 81028 201173 -194575 28427 261504 -32573 -87876 268672 -464214
11300 -368890 -301052 -214016 3593 -281261 -266231 -109199 18675 349 -166402 -435732 -60206
11288 -282579 134584 -87342 -178742 -107074 38727 -156178 -86017 44149 -80028 -15825 -68617
$$ packed form
11369d58541H2666Q3852b3008p1856A57975c28105E1021E284J27870Q383i1999
11357G6101a81954b2041A05621c78016a75196B99670A22748b42306A81199e7750
11346A87667K5848b7927j49760d8856I4413Q3483C2944K16674O154H1846b37079
11334A18105a34417J6531J0552c8571o634G7208p152c441E3761j8942m908J88814
11322B18725c9462J1538D46483A43783i7648A10114j0842J9022a85327d4795n5709
11311a00504A23676m2648J20145a94575B8427K33077c2573n5303B68672d64214
11300c68890O7838Q7036C593b81261J5030a09199A8675C49a66402k69330f0206
11288b82579A34584h7342r1400P1668C8727a56178P0161D4149h0028a5825n2792
$$ plain form
11277 -68617 80277 -257798 -253584 -231772 -335156 84047 -87186 -238581 204581 52219 47389
11266 47389 -9669 -167119 -22316 -271138 59300 -260817 -80965 -71974 -131488 -162069 35204
11254 -183152 163586 -6176 41350 45542 -95602 6696 -195680 -350266 -55076 -69703 -274197
11243 -274197 -26617 372914 -182403 -187624 38375 -26319 -162391 -466529 102205 -83569 -179673
11232 -179673 -195442 60372 235884 277113 -307597 -153020 75576 -179273 -103663 121287
11221 -15904 -210016 -6621 89410 -156167 -157419 378090 -42953 -159861 -119610 66955 260695
11210 260695 344651 -70728 -190821 118841 7474 -5561 78235 -48053 26628 115195 28714
11198 93734 179871 -26407 -37631 -52130 65267 -60260 34208 -53332 262528 -165223 369930
$$ packed form
11277f8617H0277b57798M214K1812j03384H4047h7186j51395B04581E2219m830
11266D7389i669j57450b2316k48822E9300b60817h0965Q991n9514l0581C5204
11254a83152A63586f176D1350M192i5602F696a95680j54586e5076j4627k04494
11243b74197b6617C72914a82403n221C8375b6319j36072l04138A02205h3569r6104
11232a79673j5769F0372J75512M1229c07597a53020G5576a79273P5610A21287
11221a5904j94112f621H9410a56167j252C78090d2953j16908M0251F6955J93740
11210B60695Q3956g0728j20093A18841G474e561G8235d8053B6628Q8567B8714
11198I3734Q6137b6407j1224j4499F5267f0260C4208e3332B62528a65223C69930
$$ plain form
11186 -221189 19759 -314865 -32845 106659 -104995 68628 30254 200026 -24777 -118229 -136100
11175 -136100 91186 -18232 308059 40849 -170984 75318 -52797 -199925 -145639 -233118 301425
11163 397594 42780 -191540 87968 169198 -131573 -126162 29243 -56831 -45778 50815 28022
11152 28022 151061 387687 -28920 133085 -93759 52555 1069 15146 -263028 65173 109112
11141 109112 -58450 -91142 81186 -299001 -231765 15221 87662 3107 124673 -45746 75603
11129 -95037 -202259 -120174 77621 26003 194167 -331517 -49714 238736 188366 70418 16618
11117 69833 132686 -160102 61455 106060 90749 215212 81058 41038 3664 -9541 17347 327206
11105 327206 12937 403845 67595 5000 161157 14360 277485 -6147 316640 -58316 3305
$$ packed form
11186b21189A9759c14865c2845A06659a04995F8628C0254J69772b4777r3452j7871
11175a36100I1186a8232C08059D0849a70984G5318e2797j47128N4286q7479C01425
11163C97594D2780a91540H7968Q1230a31573N411B9243e6831J1053E0815k2793
11152B8022J23039K36626b8920A33085i3759E2555A069J4077b63028F5173M3939
11141A09112e8450l2692H1186b99001O7236A5221P2441C107J21566d5746G5603
11129i5037j07222Q2085G7621B6003J68164c31517d9714B38736n0370G0418A6618
11117F9833O2853a60102F1455M4605j5311J24463H1058m0020C664i541A7347L09859
11105C27206A2937L90908F7595E000J56157A4360K63125f147C16640e8316C305
$$ plain form
11093 80026 94889 -9294 523401 358289 130673 288008 302287 -29072 93667 344792 -19226
11081 216916 253091 291384 85258 537586 158511 175345 453810 339852 -24085 61413 333181
11070 333181 185407 23237 114618 534162 521976 347519 663821 -21767 649131 723484
11060 723484 201155 894387 507792 574918 604765 545818 770697 895702 586504 605264
11050 605264 766505 509358 1000643 858293 770028 855672 408371 774763 533133 779260
11040 779260 918430 617201 311109 1038704 611859 694764 934321 875679 809811 912894
11030 912894 784027 778490 669272 579521 717709 952329 717093 499611 531160 644055
11020 644055 585871 1040330 357258 858915 679397 362295 529343 418281 487796 789461
$$ packed form
11093H0026J4863i294E23401j65112A30673J57335J4279b9072I3667K51125a9226
11081B16916L6175L8293H5258M52328A58511J6834K78465j13958b4085F1413K71768
11070C33181j47774B3237R1381M19544j2186j74457L16302b1767F49131P4353
11060G23484B01155O93232l86595O7126K9847n8947K24879J25005l09198J8760
11050F05264J61241k57147M91285j42350q8265Q5644D08371L66392k41630K46127
11040G79260J39170l01229l06092P27595m26845Q2905K39557n8642o5868J03083
11030I12894j28867n537j09218q9751J38188K34620k35236k17482L1549J12895
11020F44055n8184M54459C57258N01657j79518l17102J67048j11062O9515L01665
$$ plain form
11010 789461 519262 639973 509232 519586 791973 598767 554448 748565 157114 806938
11000 806938 534453 630835 630030 505078 542515 513166 797591 632616 771624 616855 958521
10989 958521 896406 774019 425180 976178 1100794 1149845 960068 1036330 807291 1416702
10979 1416702 1764139 1234107 1680381 2028629 2253887 2498374 2563336 2949144 2730371 2572507
10969 2572507 2423767 2162563 2364878 2149776 1545231 1525521 1432051 1592108 1761428 1461254
10959 1461254 1790032 1690867 1568324 1995506 1905993 1554560 973670 926743 1289453 675058
10949 675058 795609 482418 795362 190986 210490 -68881 336470 313977 80264 -131045
10938 173672 41093 134711 272140 212997 147453 140536 -93846 -270520 -116070 431987 19241
$$ packed form
11010G89461k70199J20711j30741J0354K72387j93206m4319J94117A57114O49824
11000H06938k72485R6382q05j24952L7437k9349K84425j64975J39008j54769L41666
10989I58521o2115j22387l48839N50998J24616M9051j89777P6262k29039O09411
10979A416702L47437n30032M46274L48248K25258K44487O4962L85808k18773j57864
10969B572507j48740k61204K02315k15102o04545j9710r3470J60057J69320l00174
10959A461254L28778r9165j22543M27182q9513l51433n80890m6927L62710o14395
10949F75058J20551l13191L12944A90986J9504f8881C36470k2493H0264a31045
10938A73672D1093R3618J37429n9143o5544o917i3846j76674a16070D31987A9241
$$ plain form
10926 -106652 -65829 253861 398894 54913 265966 118629 68582 194321 218754 134778
10916 134778 167610 35287 -59547 -845 -62209 39625 -148148 -175746 197416 160573 74714
10904 36327 191559 219710 65809 -308721 66986 -239111 -325057 -109519 -99588 350058 69908
10892 -159685 -105453 -191641 138637 -49618 -134215 -18620 -228150 -63060 -367116 -96055 54915
10880 15479 -100588 -57888 -3712 115386 151611 -34966 -217409 -153624 48413 16373 189917
10869 189917 -217015 -323916 478734 81170 -111492 -131637 -20102 -31241 -14896 19371 -170418
10857 -19913 173014 -102702 -148947 366081 132583 -94110 14357 -127593 -120158 91206 86477
10846 86477 -76009 -150612 234353 30309 -192945 -135574 -14762 27922 -117523 204285 87777
$$ packed form
10926a06652M0823B53861J45033E4913K11053A18629n0047J25739K4433q3976
10916A34778L2832C5287e9547h45o1364C9625a48148k7598A97416l6843G4714
10904C6327J55232K8151F5809c08721F6986b39111q5946a09519R931C50058F9908
10892a59685N4232q6188A38637d9618q4597a8620k09530f3060l04056i6055E4915
10880A5479a00588M2700c712A15386L6225c4966j82443O3785D8413A6373J73544
10869A89917b17015j06901D78734H1170a11492k0145b0102j1139a4896A9371a70418
10857a9913A73014a02702m6245C66081A32583i4110A4357a27593P435I1206m729
10846H6477g6009p4603B34353C0309a92945N7371a4762B7922a17523B04285H7777
$$ plain form
10834 177537 -134155 -103100 -187125 -175935 -160918 -206762 129724 -177848 270117 -52785 349726
10822 -67025 -207706 -142059 -161387 -371363 41069 325996 -186621 132316 85433 301260
10812 301260 -107718 -211971 -245205 -396549 -121217 144379 -244484 56875 256367 -103899
10801 -258059 84798 26187 74321 -70503 84809 -185644 80584 177182 -111405 -9717 2360
10789 -47100 -44224 77132 -303549 -78122 -36460 -171307 70997 148037 -57962 -92478 -184537
10778 -184537 33013 -16448 -127242 55137 -146985 328 -241247 -56761 -91082 -190853 112121
10766 -465256 87270 174678 -246088 228851 -303511 110079 -83196 -47312 113026 252187
10756 252187 -29673 6779 42962 -52226 -69552 -370614 -84477 -32962 -824 62735 -81931 -80348
$$ packed form
10834A77537a34155L1055q4025J1190J5017m5844A29724a77848B70117e2785C49726
10822f7025j40681O5647j9328k09976D1069K84927a86621A32316m6883K15827
10812C01260a07718j04253l3234j51344a21217A44379b44484E6875J99492a03899
10801b58059H4798B6187M8134g0503H4809a85644H0584R6598a11405i717B360
10789d7100K876G7132c03549g8122c6460j34847G0997P7040e7962l4516r2059
10778a84537C3013a6448j10794E5137a46985C28b41247e6761l4321r9771A12121
10766d65256H7270Q7408b46088B28851c03511A10079h3196L5884A13026J39161
10756B52187b9673F779L6183e2226j7326l01062h4477c2962h24F2735h1931J583
$$ plain form
10744 -80348 19479 83555 211206 -235768 -88179 19760 -172171 -90512 -21533 -128434 -118467
10733 -118467 -156767 23504 -118451 153172 188173 279438 -194681 88455 -556421 266682
10722 273991 -126888 2043 63253 -156518 27663 -303235 -210160 -157310 -235462 -249426 -360841
10711 -360841 -65238 284012 -173215 -151453 -165218 -106976 -73900 -27851 135569 538903 -236045
10699 73699 29337 -63030 17551 -77980 359807 89903 -77460 173310 -90637 -116435 76991
10687 100095 -74050 -143568 108454 273291 -173447 -273540 -506130 -253980 -66372 -1986
10676 105505 88852 398371 186709 -112628 -36081 -564805 -251620 -69728 -256985 124665
10665 -102529 -80961 -170016 39888 155591 115842 -227510 -142673 -174963 59758 -363285 33376
$$ packed form
10744h0348A9479O4076J27651b35768h8179A9760a72171Q1659b1533j06901R967
10733a18467l8300B3504a18451A53172L5001R1265a94681H8455e56421B66682
10722B73991a26888B043O1210a56518B7663c03235R3075N2850p8152j3964j11415
10711c60841f5238B84012a73215K1762j3765N8242L3076b7851A35569M03334b36045
10699G3699B9337f3030A7551g7980C59807H9903g7460A73310i0637k5798G6991
10687A00095g4050o9518A08454J64837a73447j00093k32590K52150f6372a986
10676A05505j6653L09519A86709a12628c6081n28724b51620f9728j87257A24665
10665a02529K1568q9055C9888J15703l9749b27510Q4837l2290E9758c63285C3376
$$ plain form
10653 -414048 -14896 -209694 19367 64692 -54862 -179766 39990 -22222 -169983 -47232 -161482
10642 -161482 231078 -348697 338165 118226 -60196 -96286 95558 -105536 -464151 -106733
10631 214670 179569 -32512 -100395 -34301 32157 130101 104111 204588 -26756 -252030 -325535
10620 -325535 -153291 -62572 -189402 -81104 -43326 -98087 -397710 135846 377762 -6282 299325
10608 27274 -19978 160956 -577180 86793 40202 264688 -73277 -333256 -12035 -115153 -69882
10597 -69882 17408 -5886 -81091 -73498 -63909 -140306 -714 -241110 17340 320826 -27037 224094
10584 64149 106741 -74016 -71528 99522 121093 120071 30958 -416276 170744 -267303 143572
10572 -119363 -6872 -46436 -478206 -2847 -91938 -77217 -19096 -53352 -37839 321524 201133
$$ packed form
10653d14048a4896j94798A9367M5325e4862j24904C9990b2222j47761d7232j14250
10642a61482B31078c48697C38165A18226f0196l6090I5558a05536l58615a06733
10631B14670l5101c2512o7883c4301C2157R7944k5990J00477b6756k25274p3505
10620c25535a53291f2572j26830h1104L7778n4761k99623A35846K41916f282B99325
10608B7274a9978A60956e77180H6793D0202K24486g3277k59979a2035j03118M5271
10597f9882A7408e886p5205P593R589p6397g14k40396A7340L03486b7037B24094
10584F4149M2592g4016K488I9522K1571j022C0958d16276A70744b67303A43572
10572a19363f872l9564m31770b847q9091J4721a9096l4256J5513C21524j20391
$$ plain form
10561 201133 -105289 22357 -254913 82031 139753 33185 -183796 -90330 -31189 -189602 -156475
10550 -156475 10760 -110115 -57770 -119809 83403 12579 -121424 -43068 -13711 -85934 -196842
10539 -196842 -151510 -76543 7451 16560 139471 -75200 -105014 -96892 148133 -87381 -1871 266385
10526 -12696 -7833 -235498 20940 76723 221592 -281386 -186324 -132067 -398502 232385 103159
10514 -37327 -93310 202264 -245569 -219517 -59347 87453 -46724 222025 237671 -433164 -250042
10503 -250042 -77623 -132833 79358 340942 -308461 71602 -353519 -61803 88495 -32727 -28391
10492 -28391 142459 56580 88819 -25919 -417762 481886 139631 240991 50177 96602 303563
10481 303563 788954 688706 469988 149505 299583 179842 247238 -165584 3910 -226776
$$ packed form
10561B01133a05289B2357b54913H2031N7722C3185a83796i0330c1189j58413L3127
10550a56475A0760a10115N2345o2039H3403A2579a21424d3068a3711p2223j10908
10539a96842M5332P4967G451R109J22911g5200k9814Q122A48133h7381a871B66385
10526a2696M863k27665B0940N5783J44869b81386R5062N4257k66435B32385A03159
10514c7327n5983B02264b45569K6052e9347H7453d6724B22025J5646d33164J83122
10503b50042g7623n5210G9358K61584c08461G1602c53519f1803H8495c2727M336
10492b8391A42459E6580L2239b5919l91843D81886A39631J01360E0177M6425K06961
10481C03563M85391j00248k18718A49505J50078j19741O7396a65584C910b26776
$$ plain form
10470 -487083 -72033 -131560 20970 -78058 163664 -76282 50907 95492 227758 -57972 -117383
10459 -117383 -161827 -127027 40659 -99372 -159202 -65877 -48943 157065 -350589 -39505 19897
10447 -230631 105272 38347 -136169 80612 -97224 -12162 205855 224420 81653 22627 172516
10436 172516 146358 59141 221962 -132601 157760 13702 46016 356938 -219957 104039
10425 113494 106996 17254 -312049 -95697 59370 -100445 -24208 67068 275291 -228255 -208598
10414 -208598 145583 -167866 -271801 -118800 68091 144466 -360360 50256 -246704 74831
10403 -193888 252776 -41997 1970 -131885 330493 -126051 49955 -85941 36338 1477 70323
10392 70323 3838 7097 -70458 -128583 -177410 196886 34437 155603 -49516 -29398 233077
$$ packed form
10470d87083g2033n9527B0970g8058A63664g6282E0907M4585J32266e7972n9411
10459a17383m4444L4800D0659i9372n9830f5877J6934A57065c50589c9505A9897
10447b30631A05272C8347a36169H0612i7224a2162B05855J8565H1653B2627J49889
10436A72516k6158E9141J62821a32601A57760A3702L2314L10922b19957A04039
10425A13494o498A7254c12049i5697E9370a00445b4208F7068K08223b28255J9657
10414b08598A45583a67866j03935a18800F8091P6375c60360E0256b46704G4831
10403a93888B52776d1997A970a31885C30493a26051D9955h5941C6338A477O8846
10392G0323C838L259g0458n8125m8827A96886C4437J21166d9516K0118B33077
$$ plain form
10380 -96780 188460 221812 163415 116182 286840 392074 397861 89769 -205858 18945 232962
10369 232962 443510 -561 598343 544959 647732 313612 129342 -25211 490386 16329 115772
10358 115772 50789 -17416 136150 -77051 73331 489064 519129 343331 485627 444418 180834
10346 318847 699696 416837 408246 547438 266321 248741 277218 52902 59345 15325 281635
10335 281635 -86574 30221 -147880 -74410 169185 34997 70904 -153561 3000 -44226 89871
10323 186322 97926 185041 252843 44547 322801 396132 313505 254297 -220087 32713 383641
10312 383641 122828 -70166 -26347 -197394 -75468 128879 -266534 -120607 217541 257917
10302 257917 327325 -240412 -36412 -29493 78322 14984 -55197 -265624 35829 126665 48495
$$ packed form
10380i6780A88460L3352n8397m7233J70658J05234N787H9769b05858A8945K14017
10369B32962K10548e61E98343n3384J02773C13612A29342b5211D90386A6329R9443
10358A15772E0789a7416A36150g7051G3331M15733L0065j75798J42296m1209A80834
10346C18847L80849k82859q591J39192B66321j7580K8477E2902O443A5325K66310
10335B81635h6574C0221a47880P3470A69185C4997L5907a53561C000d4226H9871
10323A86322q8396Q7115O7802D4547K78254P3331q2627n9208b20087C2713L50928
10312C83641A22828g0166b6347j71047g5468A28879b66534a20607B17541M0376
10302B57917O9408b40412c6412O919G8322A4984e5197k10427C5829R0836D8495
$$ plain form
10290 335460 -232424 -277278 -184401 101337 -138020 75205 -125225 -90887 -388664 73983
10279 -351379 120016 195201 32821 -266688 -297335 -207419 51146 163571 35366 35151 76026
10268 76026 67684 -160172 202201 -71885 50930 327350 34525 176987 449912 572065 181976
10256 347860 -91420 109603 75219 -149021 -92162 -230546 -11738 -295459 -32388 -28252 -161187
10245 -161187 -144726 -108103 -261008 -82447 -99667 -73697 -193964 -187653 74500 -84471 180485
10233 -167929 66493 -35225 99395 -161152 204825 -18689 70212 41336 179168 -136183 -199539
10222 -199539 95194 -68711 189881 168500 -27304 -272947 -43594 -82156 185175 -70334 240734
10210 -90361 51627 -168973 -199235 20905 -39745 -36039 -292199 -87517 31661 -349670 -31016
$$ packed form
10290C35460b32424m4854R2877A01337a38020G5205a25225L4338k97777G3983
10279c51379A20016P5185C2821b66688l0647Q9916E1146J12425C5366k15M0875
10268G6026q342a60172B02201g1885E0930K76420C4525J42462K72925J22153A81976
10256C47860i1420A09603l4384a49021N6859j38384a1738k83721c2388M136j32935
10245a61187J6461L6623j52905h2447j7220K5970j20267O311G4500h4471A80485
10233a67929F6493c5225I9395a61152B04825a8689G0212k8876J37832a36183o3356
10222a99539I5194f8711A89881k1381b7304k45643d3594l8562A85175g0334B40734
10210i0361E1627a68973l0262B0905c9745L706k56160h7517C1661c49670c1016
$$ plain form
10198 48730 240301 -103557 -178046 -331687 -162950 113043 156119 54716 44234 -81701 -63284
10187 -63284 134487 -429973 -329850 -244741 -115581 -86261 71747 -264312 -65857 335622
10176 131987 -5989 44533 -92338 -77077 -15447 -98684 157857 45420 -119969 236386 -271830
10164 -142799 -253090 75068 -80433 -253892 -179534 -41891 -184339 -88781 30695 -246867 139267
10152 -539027 -97210 -315533 -199832 -232891 167075 -32956 27061 -43722 -38712 -47715 -87970
10141 -87970 -156045 -33016 -95851 -75920 -165423 206848 -492461 80017 -59112 -325310 186320
10129 60494 163417 104227 -225887 247659 -273755 -26810 38384 -138581 222771 58419
10118 -297954 -159559 -303161 -252242 -304923 -78976 57011 -54065 -125626 -150265 -120793 -157015
$$ packed form
10198D8730J91571a03557p4489j53641a62950A13043M3076E4716j0482h1701J8417
10187f3284A34487d29973J00123Q5109a15581K9320G1747b64312f5857C35622
10176A31987e989D4533i2338J5261a5447q3237A57857D5420a19969B36386b71830
10164a42799j10291G5068h0433j73459P4358d1891j42448h8781C0695b46867A39267
10152e39027i7210k18323J15701l3059A67075c2956B7061d3722N010r003m0255
10141h7970o8075c3016o2835J9931q9503B06848d92461H0017e9112k66198A86320
10129F0494J02923n9190b25887B47659b73755b6810C8384a38581B22771E8419
10118b97954J38395j43602N0919n2681g8976E7011e4065p1561k4639K9472l6222
$$ plain form
10107 -157015 -86086 -197426 -362705 -191529 -48713 -344764 -95687 -123422 128498 -77725
10096 -213334 -184831 -221270 -25183 -124192 -276530 33760 -199809 231389 19890 -97902 406413
10084 -382503 10352 9197 285145 238633 -97941 -184134 -194286 -289670 90559 141607 -429713
10072 -59128 -208678 -244532 -212556 203070 -6610 174891 -181771 152526 -241873 524163
10061 208923 363376 158542 -210736 -65175 -289190 -58016 -55955 -122040 348194 34728 -304075
10049 -123374 -73230 45157 -91884 69896 127700 -75892 -63129 -330098 -60985 279985 31142
10037 -33496 -37353 9194 -181684 56024 -93346 -258649 -98107 154487 -93437 -76849 207637
10025 57874 -29701 166359 -40255 12977 -126770 63340 91307 -20516 -130621 -135461 -207847
$$ packed form
10107a57015P0929j11340j65279J71176d8713k96051i5687k7735A28498g7725
10096b13334K8503l6439b5183r9009j52338C3760a99809B31389A9890i7902D06413
10084c82503A0352j155K75948m6512i7941q6193j0152r5384I0559N1048d29713
10072e9128j49550l5854L1976B03070f610A74891a81771A52526b41873E24163
10061B08923J54453A58542b10736f5175k24015e8016K061o6085C48194C4728c04075
10049a23374N0144D5157i1884F9896N7804g5892J2763k66969f0985B79985C1142
10037c3496l857I194a81684E6024i3346j65303i8107A54487i3437J6588B07637
10025E7874b9701A66359d0255A2977a26770F3340K7967b0516j10105m840p2386
$$ plain form
10014 -207847 151544 -305255 -90128 -230270 -67263 -309217 -43171 -169451 -176628 -165215 144709
10002 -404260 -127950 82082 73243 -19622 -55400 -217263 303717 29374 -213894 -307883 40699
9990 -113418 -89511 -187629 47132 224360 -80187 -389836 -347580 -124067 68441 -131555 15342
9978 10783 130897 37154 287380 -289566 -238730 -127639 -213525 -46147 146663 -266217 -133704
9967 -133704 112866 -128763 -98319 -85562 -222715 22202 80045 -110445 -32827 61981 -90933
9955 -169515 274470 -210313 -81284 -135598 -196363 138478 78940 -353209 10713 -167933 -99256
9944 -99256 106066 -125347 260159 60751 -224727 155457 -147546 -471285 -178471 136323
9933 158448 21427 -211432 -293248 -386025 -23842 -169089 28992 24782 -226750 -161834 -220721
$$ packed form
10014b07847A51544c05255i0128j40142f7263k41954d3171j26280p177J1413A44709
10002d04260a27950H2082q839a9622l5778j61863C03717B9374b13894r3989D0699
9990a13418K3907r8118D7132J77228h0187l09649M2256a24067F8441a31555A5342
9978A0783J20114C7154K50226b89566N0836J11091q5886d6147A46663b66217J32513
9967a33704A12866a28763L0444J2757j37153B2202N7843a10445c2827F1981i0933
9955a69515B74470b10313h1284n4314o0765A38478n9538c53209A0713a67933O8677
9944i9256A06066a25347B60159F0751b24727A55457a47546l23739a78471A36323
9933A58448B1427b11432q1816r2777b3842j45247B8992m210b26750O4916n8887
$$ plain form
9922 -220721 -65473 188282 372213 -324625 210629 -247599 173951 -169990 336969 137465
9911 -143881 122084 -128499 -90329 -135270 -181350 -340064 -319459 -5494 -94589 -192440 78469
9899 -176297 -60569 137818 -81359 -183156 -146216 99479 -177779 -79285 173641 110301 -264532
9887 -176372 -175340 33470 48073 -52164 -264493 127134 22036 -267391 -192285 -192591 124954
9875 488355 -75559 -151743 -55138 -436390 210205 262126 185815 51067 -236520 -113786 454
9863 -110305 132367 -36622 -29848 164178 -88430 31042 -276916 222497 -34695 340413 -115321
9851 -112628 -339515 -286215 -115808 -245366 -128271 -199794 -148667 -267991 18315 -22973 -93296
9840 -93296 -39302 195824 -349612 145842 -127192 182990 98433 -175231 190471 46578
$$ packed form
9922b20721f5473A88282J83931c24625B10629b47599A73951a69990C36969A37465
9911a43881A22084a28499L8170m4941m6080j58714K0605e494q9095r7851G8469
9899a76297f0569A37818h1359j01797L6940I9479a77779g9285A73641o3340b64532
9887a76372J032C3470J4603e2164k12329A27134B2036b67391P5106l06A24954
9875D88355g5559p6184e5138l81252B10205N1921p6311E1067b36520a13786D54
9863a10305A32367c6622O774A64178h8430C1042b76916B22497c4695C40413a15321
9851a12628k26887N3300a15808j29558J17095p1523N1127j19324A8315b2973p0323
9840i3296c9302A95824c49612A45842a27192A82990q4557a75231A90471D6578
$$ plain form
9829 32835 -82326 275570 82397 24040 -83739 -38359 -174194 200795 134467 -33995 -216137
9818 -216137 196747 -75539 -160557 -7591 235741 -168215 -16857 71542 -135884 -123373 69190
9806 -9918 -43790 35898 -1834 54510 -22183 -106484 250052 -141097 -193963 -26533 -245098 91449
9793 -41551 -53220 162008 -215673 -498505 74354 -228114 -264186 -180564 -192732 81725 -199884
9781 46755 -409828 138949 84732 -127239 71759 -188082 95109 -27823 181093 104384 -179494
9769 -185645 -219860 -13346 311276 -113771 -321242 334990 171556 -200705 180897 -264341
9758 138932 -45699 78350 -290792 -189260 -57567 21621 34351 -387797 -307085 -162445 -183755
9747 -183755 -138780 -117013 -322888 43369 -219223 -245200 -144808 -99885 -164712 -170596 -57680
$$ packed form
9829C2835h2326B75570H2397B4040h3739c8359j35835B00795o6328c3995j82142
9818b16137A96747g5539q5018g591B35741a68215a6857G1542a35884J2511F9190
9806i918l3872C5898a834E4510b2183q4301B50052a41097n2866b6533k18565I1449
9793d1551j1669A62008b15673k82832G4354b28114l6072Q3622j2168H1725a99884
9781D6755d09828A38949n4217a27239G1759a88082I5109b7823A81093p6709a79494
9769a85645l4215a3346C11276a13771k07471C34990j63434b00705A80897b64341
9758A38932d5699G8350b90792J01532e7567B1621J2730c87797Q0712J44640k1310
9747a83755M4975K1767k05875D3369b19223k5977J00392M4923o4827n884e7680
$$ plain form
9735 331257 -147120 -37391 -170688 -58904 -263366 191250 -437935 -121654 -107044 -21779
9724 -108189 179210 -203184 -52554 -47203 -248428 -235541 458232 -336347 49854 -303172 249295
9712 -208342 -486046 97355 -195569 -50028 -139918 -95274 126119 -195538 -119856 20394 -156973
9700 25168 -38551 40176 -193395 223482 19678 -357882 -124907 237166 -366010 -58404 231345
9688 -30629 -91702 -11197 -225141 -109445 58462 109620 206269 -84720 -15499 330138 114532
9676 -62383 37376 -8514 128175 -519519 -350823 54759 -285573 -10782 393015 -130356 5808
9664 -83191 -283791 -73910 -37725 -88474 -130516 76136 -278606 -139096 -233250 64135 -159029
9652 -180270 34144 102391 123637 -31287 117010 -82219 -356318 -42134 -156634 -123696 121394
$$ packed form
9735C31257a47120c7391j33297e8904k04462A91250d37935a21654J4610b1779
9724a08189A79210b03184e2554N351k01225J2887D58232c36347D9854c03172B49295
9712b08342k77704I7355a95569e0028q9890M4644A26119a95538P5682B0394a56973
9700B5168c8551D0176a93395B23482A9678c57882a24907B37166c66010e8404B31345
9688c0629o1073a1197k13944a09445E8462N1158R6649h4720a5499C30138A14532
9676f2383C7376h514A28175e19519J68696E4759b85573a0782C93015a30356E808
9664h3191k00600g3910L6185n0749m2042G6136b78606a39096r4154F4135a59029
9652a80270C4144O8247K1246c1287A17010h2219k74099d2134j14500L2938A21394
$$ plain form
9640 181103 -10898 -62763 -110347 67017 730 212592 -266589 -366423 112921 7586 26221 -216671
9627 235520 -176954 -121528 277096 101043 -269727 213122 -72335 168232 11081 369942
9617 369942 244717 -44295 -79352 114223 -185164 -126968 250213 -48807 -24094 354207 -488392
9605 -138353 -194868 91357 283 -327853 71030 137147 -219432 -188 -148466 -132744 683 -540439
9592 -207459 70960 -230066 51172 20291 142894 -99964 -164838 76858 39875 63713 -345351
9580 90347 -119856 129641 151067 53050 -219296 -17152 -52574 -271439 -159070 -126664 -70969
9569 -70969 -169440 -255857 -116800 -180948 -86055 112811 -153002 -236031 168075 -258078 -178261
9558 -178261 -309793 53047 -142535 43396 193131 64246 84225 -27654 -207228 -55421 -101353
$$ packed form
9640A81103a0898n1865m7584F7017G30K11862b66589r9834A12921G586J8635b16671
9627B35520a76954N5426B77096A01043b69727B13122g2335A68232A1081L58861
9617C69942j25225d4295l5057A14223a85164N8196B50213d8807b4094C54207d88392
9605a38353n6515I1357B83c27853G1030O6117b19432a88j48278J5722F83e40439
9592b07459G0960b30066E1172B0291J22603i9964o4874G6858l6983K3838c45351
9580I0347a19856A29641K1426E3050b19296a7152l5422k18865J12369L2406N5695
9569g0969r8471q6417a16800o4148h6055A12811a53002q3029A68075b58078P9817
9558a78261j31532E3047a42535D3396J49735F4246J9979b7654j79574e5421m5932
$$ plain form
9547 -101353 -153269 9299 -30585 -61752 -13282 -186556 -449440 -109362 -44747 89026 -153509
9535 -432887 -154279 144653 -74659 -82848 398 -20398 -38104 -202969 303324 -341542 10784
9523 25910 -13357 -285173 231681 130967 122982 -201742 151254 -158668 134791 -151523
9512 -98685 -1500 398974 128750 -342336 -181161 -217232 2105 322815 -62722 59674 144084
9501 144084 -237590 -210283 -48782 -94188 -68633 57931 -120533 306911 59137 -311563 32429
9489 370458 -134982 61130 -143659 -3912 -232917 144470 -426892 -14695 -336772 130829
9478 62762 -311219 68425 -213802 104899 -50285 -136214 -162553 -310388 -173367 -295449 -167515
9467 -167515 -402024 25919 -134682 23397 -233543 -45095 99749 -272640 -184626 -143121 322182
$$ packed form
9547a01353n1916I299c0585l1167a3282j73274k62884a09362d4747H9026a53509
9535d32887a54279A44653g4659q189C98b0398j7706j64865C03324c41542A0784
9523B5910a3357k71816B31681j00714p985b01742A51254a58668A34791a51523
9512i8685a500C98974A28750c42336J61175l6071B105L20710f2722E9674Q4410
9501A44084b37590K7307d8782m5406K5555E7931a20533C06911E9137c11563C2429
9489C70458a34982F1130a43659c912k29005A44470d26892a4695l22077A30829
9478F2762c11219F8425b13802A04899e0285q5929k6339j47835J37021j22082J27934
9467a67515k34509B5919a34682B3397b33543d5095I9749b72640Q8014M1505C22182
$$ plain form
9455 -53496 -91871 -280296 -281838 -71461 9442 33359 -106365 118507 -270459 28301 247870
9444 247870 -347261 313624 -200314 -216388 -283623 -173651 -270715 -24724 70214 -168472 -140382
9433 -140382 -165904 -118415 -380459 126946 -226661 -155300 -98155 95563 55339 -33497 -297833
9422 -297833 143674 -163345 -72650 -55644 -101455 -297075 216808 -211278 131282 68103
9412 68103 -163212 36525 -226886 -172110 -6017 -146878 -4491 169884 -50313 -490737 346523
9400 -51221 51958 5919 173064 -21699 -56690 26974 -109806 -307269 52057 34986 80874
9389 80874 -174736 -94704 -176424 -146872 106712 -241156 113005 -208178 -124914 92631 -452989
9377 56427 142819 9342 -168435 -3441 179489 -439092 77539 45354 173746 -288472 203091
$$ packed form
9455e3496l8375j88425j542g1461I442K3917a06365A18507b70459B8301K19569
9444B47870c47261C13624b00314j6074o7235J09972r7064b4724G0214a68472K8090
9433a40382k5522M7489k62044A26946b26661P1361N7145I5563m0224c3497k64336
9422b97833A43674a63345g2650J7006m5811j95620B16808b11278A31282o3179
9412F8103a63212C6525b26886N4776f017j40861d491A69884e0313m40424C46523
9400e1221E1958E919J67145b1699l4991B6974a09806j97463E2057j7071M5888
9389H0874a74736Q0032q1720K9552A06712b41156A13005b08178Q3264I2631d52989
9377E6427Q6392I342a68435c441A79489d39092G7539l2185J28392b88472B03091
$$ plain form
9365 -276308 -253145 87785 8548 71358 -241290 -284320 104272 161366 22867 -229144 -143018
9354 -143018 269534 -21444 -62978 73463 -318973 -264676 88702 -23301 -432337 -228556 10847
9342 52054 24224 -107888 -72264 -65268 -173424 40619 241339 3044 14681 -275776 12281
9330 -114514 -10677 -27491 -36989 -80949 -42378 91074 119263 -51657 -215049 23157 -220949
9318 -231040 -348308 -77558 -119668 -295605 -124583 -235643 -172872 122152 -112187 56813
9307 134835 -308021 -131227 40558 113373 -196870 203987 103546 59075 -201287 -128013
9297 -128013 19548 161467 -235882 -270645 -68205 -81165 -4740 -50501 120590 268119 148370
9286 148370 -197503 1472 64661 47622 37700 -285905 -2823 -195933 -322450 -11061 -212053
$$ packed form
9365b76308K3163H7785H548O2810b41290m3030A04272N7094B2867b29144Q6126
9354a43018B69534b1444m1534G3463c18973N4297H8702b3301m09036K03781A0847
9342E2054B4224a07888L5624O996j08156D0619K00720C044J1637b75776A2281
9330a14514a0677j6814r498m3960L8571I1074K8189e1657j63392B3157b20949
9318b31040j17268g7558m2110j75937a24583j11060O2771A22152a12187E6813
9307A34835c08021a31227D0558P2815a96870B03987j00441m4471b01287P3274
9297a28013A9548J41919b35882l4763f8205j2960d740m5761A20590J47529j19749
9286A48370a97503A472O3189j7039r922b85905b823j93110j26517a1061k00992
$$ plain form
9275 -212053 12302 -26341 18921 -228309 49583 -27225 -10978 -33699 146505 -126555 -175841
9264 -175841 68478 159135 42647 -10335 117352 -98518 82872 -6718 150840 48292 -80325
9252 -351061 33137 -144732 128574 -179687 227013 389470 34570 61160 135778 2339 -23070
9240 213672 -57112 -290308 80403 -150509 -293344 43089 -140164 -301190 95633 139621 1329
9228 54149 170959 -144512 29952 153072 -122842 322174 -3172 -218109 -281085 -73612 -18027
9216 -68673 -104559 -307616 -243135 -418566 -187970 -19675 -148070 -228074 65568 195244 -315889
9204 -27393 -120455 -388532 10423 -135594 193063 96227 -177959 153570 -233670 -305851 -286403
9193 -286403 11081 -320961 126609 78229 13481 21349 -261619 -37227 255015 -187958 18402
$$ packed form
9275b12053A2302b6341A8921b28309D9583b7225a0978k2721A46505a26555m9286
9264a75841F8478R0657D2647a0335A17352i8518H2872f718A50840D8292h0325
9252c51061C3137a44732A28574a79687B27013J62457C4570K6590P4618B339b3070
9240B13672e7112k33196H0403a50509j42835D3089a40164j61026I5633M3988A329
9228E4149J16810a44512B9952J23120a22842C22174c172k14937o2976g3612a8027
9216f8673l5886k03057O4481j75431a87970a9675j28395q0004F5568J29676c15889
9204b7393r3062k68077A0423a35594A93063I6227a77959A53570b33670p2181J9448
9193b86403A1081c20961A26609m8380A3481P868b61619c7227B55015a87958A8402
$$ plain form
9181 -45883 123625 263719 49957 -59777 -1729 117042 -118176 -50754 -362760 -175516 -355373
9170 -355373 -328147 119856 384677 115580 -53588 64294 -168082 55822 85645 -145902 -135491
9159 -135491 -49172 -323191 -140030 65695 182328 97710 128325 -418730 134085 187541 -211192
9147 -153521 -178729 47054 30303 -190975 -54214 -184321 135600 70662 86033 -47593 86819
9135 103 -40503 79199 -145018 -173473 -15863 13296 -160099 -172968 359396 -46159 -21486 -353178
9123 -353178 63875 98790 -175073 -19988 -230695 31068 -116423 -73293 -362339 -215112 -91351
9111 220714 226577 32684 -62849 -169964 -7124 -390116 -80120 -255735 -175799 -337944 -99414
9099 -221339 -198114 -31377 -133843 -226764 -174599 46947 72517 -427245 -88406 -13900 -102359
$$ packed form
9181d5883A23625J40094D9957e9777a729A17042a18176e0754l12006a75516j79857
9170c55373K7226A19856K64821A15580e3588F4294a68082E5822K9823a45902J0411
9159a35491d9172k74019a40030F5695J16633q4618L0615d18730A34085N3456b11192
9147a53521k5208D7054j6751a90975e4214j30107A35600o4938J5371d7593H6819
9135A03d0503G9199a45018k8455a5863A3296a60099j2869C59396d6159b1486l31692
9123c53178F3875L4915a75073a9988k10707C1068a16423M3130k89046J47227i1351
9111B20714N863C2684f2849j07115g124l82992h0120j75615P9936j62145i9414
9099b21339K3225c1377j02466r2921N2165D6947K5570d27245h8406a3900q8459
$$ plain form
9088 -102359 147790 177339 -55662 -322498 35683 24848 176911 -208854 -145501 -303672 -174020
9077 -174020 300165 -186595 -69989 -80012 -37958 -420500 184571 -161655 -140520 -184862 223130
9065 -298322 -112030 211461 16001 -168157 -144503 296182 185808 115848 -153336 236105
9054 -98434 120041 129965 -45714 -179985 5189 -101130 -64654 84303 12248 -55379 -238432
9043 -238432 -205940 -219837 -223965 -126462 -24634 -54894 2203 95526 -265168 14335 -138690 116229
9030 -59392 -209378 12249 -36665 -12098 245014 13038 42638 -276382 -520962 11576 -290108
9018 -212652 -10255 -251744 -84163 -92832 -392859 47732 -39222 -154108 398300 -113903 -55847
9006 -89865 -179652 216905 -70973 -27043 79699 -48300 -56586 88893 -64270 -144985 111896 112966
$$ packed form
9088a02359A47790K9549e5662k66836C5683j0835J52063b08854O3353j58171J29652
9077a74020C00165a86595f9989j0023c7958l82542A84571a61655K1135m4342B23130
9065b98322a12030B11461A6001a68157K3654B96182j10374o9960a53336B36105
9054i8434A20041R924d5714j34271E189a01130L6476H4303A2248e5379j83053
9043b38432L2492j3897m128R7503b4634l0260B203R3323b65168A4335a38690A16229
9030e9392j49986A2249c6665a2098B45014A3038K9600b76382k44580A1576b90108
9018b12652a0255k41489h4163q669l00027D7732c9222j14886C98300a13903e5847
9006h9865q9787B16905g0973b7043G9699d8300q286H8893f4270q0715A11896J070
$$ plain form
8994 112966 44366 88700 -618 -70314 -187692 -208274 -266748 48625 -395627 103561 -674 -92239
8982 -92239 134690 -120639 42021 213940 385 343645 -377072 14551 128410 -251385 -192939
8971 -192939 -184164 -251438 -176375 -63040 -40124 -17267 110191 143044 -105156 11403 71362
8960 71362 -214335 92903 -247142 107591 -77255 -86911 4610 190768 17064 -90565 -126763
8949 -126763 -262212 20749 -982 -272391 -131393 113627 -29322 -10273 -103338 -295988 232331
8937 94766 145718 -52432 253556 4888 340788 -102987 -225305 -151842 -86557 302255 -103049
8925 297400 399806 907667 1945793 6054538 3582905 799121 179523 -102852 154116
8915 83996 15083 118863 551795 -300713 -187676 -199587 141812 54281 192138 175328 -324339
$$ packed form
8994A12966D4366M4334f18o9696j17378k0582n8474D8625c95627A03561f74r1565
8982i2239A34690a20639D2021J71919C85L43260c77072A4551J13859b51385N8446
8971a92939Q775o7274P5063f3040K2916a7267A10191L2853a05156A1403N9959
8960G1362b14335I2903b47142A07591g7255r656D610J86158A7064i0565l6198
8949a26763j35449B0749i82k71409a31393A13627b9322a0273r3065j92650B32331
8937I4766N0952e2432B53556D888L35900a02987j22318P3463O5285C02255a03049
8925B97400J02406N07861J038126M108745k471633G99121A79523a02852A54116
8915H3996A5083J03780M32932c00713J13037j1911A41812E4281J37857j6810c24339
$$ plain form
8903 226947 -118054 -113529 114110 40174 -403955 -113823 83427 -283537 72334 29628 42078
8892 42078 111014 -182567 -204338 -62310 267940 -25641 -175800 99492 62555 -17799 39752
8880 262933 172039 -141511 130349 -267502 -7038 -5247 228054 187698 136527 -325830 -4961
8868 -138564 81979 -305487 59292 -84492 24418 -161755 -110419 -70237 206902 -38876 -301786
8857 -301786 130201 -1689 -30601 -101326 -62808 -311084 37755 -40656 -214912 -275007 -104033
$$ packed form
8903B26947a18054M525A14110D0174d03955a13823H3427b83537G2334B9628J2450
8892D2078O8936a82567k1771f2310B67940b5641j50159I9492l6937a7799C9752
8880B62933r0894a41511A30349b67502g038J791B28054m0356n1171c25830d961
8868a38564H1979c05487E9292h4492B4418a61755N1336M0182B06902c8876k62910
8857c01786A30201a689k8912p0725L8518k48276C7755d0656j74256o0095a04033
$$ [...]
##END NTUPLES=NMR SPECTRUM
##END=
