##TITLE=AC1329_ISIAH12158_6535987_FYheWWhY05
##JCAMPDX= 6.0         $$ Bruker NMR JCAMP-DX V2.0
##DATA TYPE= NMR SPECTRUM
##DATA CLASS= NTUPLES
##ORIGIN= BRUKER
##OWNER= Administrator
$$ 1.72 TOPSPIN		Version 2.1
$$ 2013-07-18 15:18:22.560 -0700  Administrator@X
$$ Compression mode = diff/dup
##.OBSERVE FREQUENCY= 400.02188249412
##.OBSERVE NUCLEUS= ^1H
##.ACQUISITION MODE= SIMULTANEOUS (DQD)
##.ACQUISITION SCHEME= undefined
##.AVERAGES= 64
##.DIGITISER RES= 22
##SPECTROMETER/DATA SYSTEM= spect
##.PULSE SEQUENCE= noesygpps1d.comp
##.SOLVENT NAME= COFFEE_meoh
##.SHIFT REFERENCE= INTERNAL, COFFEE_meoh, 1, 14.96109
##AUDIT TRAIL= $$ (NUMBER, WHEN, WHO, WHERE, PROCESS, VERSION, WHAT)
$$ ##TITLE= Audit trail, TOPSPIN		Version 2.1
$$ ##JCAMPDX= 5.01
$$ ##ORIGIN= Bruker BioSpin GmbH
$$ ##OWNER= Administrator
$$ $$ E:\/data/COFFEE/nmr/AC1329_ISIAH12158_6535987_FYheWWhY05/12/pdata/1/auditp.txt
$$ ##AUDIT TRAIL=  $$ (NUMBER, WHEN, WHO, WHERE, PROCESS, VERSION, WHAT)
(   1,<2013-07-18 15:18:17.888 -0700>,<Administrator>,<X>,<go>,<TOPSPIN 2.1>,
      <created by zg
	started at 2013-07-18 15:06:47.950 -0700,
	POWCHK enabled, PULCHK disabled,
       configuration hash MD5:
       C8 4E 4E 5D D3 5C D8 9E 9F 52 82 E0 59 8A DE 15
       data hash MD5: 64K
       D1 7C 2F 6E 3B BA CE 41 6D 1F DE B1 B5 17 7D BD>)
(   2,<2013-07-18 15:18:20.732 -0700>,<Administrator>,<X>,<proc1d>,<TOPSPIN 2.1>,
      <Start of raw data processing
       efp LB = 0.3 FT_mod = 6 PKNL = 1 PHC0 = 0 PHC1 = 0 SI = 128K 
       data hash MD5: 128K
       86 29 F7 A5 45 E7 69 30 D5 CF 17 62 68 2B 2F 61>)
(   3,<2013-07-18 15:18:21.622 -0700>,<Administrator>,<X>,<proc1d>,<TOPSPIN 2.1>,
      <pk PHC0 = -79.68384 PHC1 = 0 
       data hash MD5: 128K
       82 FF 43 C3 22 23 16 D0 85 A5 FF 36 B1 4F EA 08>)
(   4,<2013-07-18 15:18:22.028 -0700>,<Administrator>,<X>,<proc1d>,<TOPSPIN 2.1>,
      <abs ABSG = 1 
       data hash MD5: 128K
       98 D8 AF A8 D5 05 A9 CB 1D 30 F6 F0 3D 6B 44 39>)
(   5,<2013-07-18 15:18:22.138 -0700>,<Administrator>,<X>,<proc1d>,<TOPSPIN 2.1>,
      <abs ABSG = 2 
       data hash MD5: 128K
       AE 83 EC BB 01 9A D7 E6 32 A8 63 02 BE D3 65 F7>)
(   6,<2013-07-18 15:18:22.216 -0700>,<Administrator>,<X>,<proc1d>,<TOPSPIN 2.1>,
      <abs ABSG = 3 
       data hash MD5: 128K
       30 A3 75 71 DC 78 B3 23 3E 19 D4 5C 9C 2A 47 A0>)
(   7,<2013-07-18 15:18:22.294 -0700>,<Administrator>,<X>,<proc1d>,<TOPSPIN 2.1>,
      <abs ABSG = 4 
       data hash MD5: 128K
       9A 2A E0 84 EB 9C EB 5F D0 62 F8 60 A4 F5 BB CA>)
(   8,<2013-07-18 15:18:22.357 -0700>,<Administrator>,<X>,<proc1d>,<TOPSPIN 2.1>,
      <abs ABSG = 5 
       data hash MD5: 128K
       90 AB 0F 13 EC 2E 5D 35 64 A7 A2 83 12 E7 7A 32>)
$$ ##END=
$$ 
$$ $$ hash MD5
$$ $$ 2B 04 0B F4 0D DE 6F F4 D5 E8 CC 85 0D 99 E1 1B
##$RELAX= 
##$RELAX= 
##$RELAX= 
##$RELAX= 
##$RELAX= 
##$RELAX= 
##$RELAX= 
##$RELAX= 
$$ Bruker specific parameters
$$ --------------------------
##$DU= <E:\>
##$EXPNO= 12
$$ [...]
##$TP07= 0
##$TPNAME0= <>
##$TPNAME1= <>
##$TPNAME2= <>
##$TPNAME3= <>
##$TPNAME4= <>
##$TPNAME5= <>
##$TPNAME6= <>
##$TPNAME7= <>
##$TPOAL= (0..7)
0.5 0.5 0.5 0.5 0.5 0.5 0.5 0.5
##$TPOFFS= (0..7)
0 0 0 0 0 0 0 0
##$TUNHIN= 0
##$TUNHOUT= 0
##$TUNXOUT= 0
##$USERA1= <user>
##$USERA2= <user>
##$USERA3= <user>
##$USERA4= <user>
##$USERA5= <user>
##$V9= 5
##$VALIST= <valist>
##$VCLIST= <CCCCCCCCCCCCCCC>
##$VD= 0
##$VDLIST= <DDDDDDDDDDDDDDD>
##$VPLIST= <PPPPPPPPPPPPPPP>
##$VTLIST= <TTTTTTTTTTTTTTT>
##$WBST= 1024
##$WBSW= 4
##$XGAIN= (0..3)
0 0 0 0
##$XL= 0
##$YL= 0
##$YMAX_a= 6380652
##$YMIN_a= -13174952
##$ZGOPTNS= <>
##$ZL1= 120
##$ZL2= 120
##$ZL3= 120
##$ZL4= 120
##$ABSF1= 14.96109
##$ABSF2= -5.597092
##$ABSG= 5
##$ABSL= 3
##$ALPHA= 0
##$AQORDER= 0
##$ASSFAC= 0
##$ASSFACI= 0
##$ASSFACX= 0
##$ASSWID= 0
##$AUNMP= <proc_prof1d_extract.lims>
##$AXLEFT= 0
##$AXNAME= <>
##$AXNUC= <1H>
##$AXRIGHT= 0
##$AXTYPE= 0
##$AXUNIT= <>
##$AZFE= 0.1
##$AZFW= 0.1
##$BCFW= 0
##$BC_mod= 0
##$BYTORDP= 0
##$COROFFS= 0
##$CY= 15
##$DATMOD= 1
##$DC= 0
##$DFILT= <>
##$DTYPP= 0
##$F1P= 0
##$F2P= 0
##$FCOR= 0.5
##$FTSIZE= 131072
##$FT_mod= 6
##$GAMMA= 0
##$GB= 0
##$INTBC= 1
##$INTSCL= 1
##$ISEN= 128
##$LB= 0.3
##$LEV0= 0
##$LPBIN= 0
##$MAXI= 10000
##$MC2= 0
##$MEAN= 0
##$ME_mod= 0
##$MI= 0
##$NCOEF= 0
##$NC_proc= -2
##$NLEV= 6
##$NOISF1= 0
##$NOISF2= 0
##$NSP= 0
##$NTH_PI= 0
##$NZP= 0
##$OFFSET= 14.96109
##$PC= 1
##$PHC0= -79.68384
##$PHC1= 0
##$PH_mod= 1
##$PKNL= yes
##$PPARMOD= 0
##$PPDIAG= 0
##$PPIPTYP= 0
##$PPMPNUM= 2147483647
##$PPRESOL= 1
##$PSCAL= 4
##$PSIGN= 0
##$PYNMP= <proc.py>
##$REVERSE= no
##$SF= 400.020009600461
##$SI= 131072
##$SIGF1= 0
##$SIGF2= 0
##$SINO= 400
##$SIOLD= 131072
##$SPECTYP= <>
##$SREGLST= <1H.CDCl3>
##$SSB= 0
##$STSI= 131072
##$STSR= 0
##$SW_p= 8223.68421052631
##$SYMM= 0
##$S_DEV= 0
##$TDeff= 65536
##$TDoff= 0
##$TI= <>
##$TILT= no
##$TM1= 0
##$TM2= 0
##$TOPLEV= 0
##$USERP1= <user>
##$USERP2= <user>
##$USERP3= <user>
##$USERP4= <user>
##$USERP5= <user>
##$WDW= 1
##$XDIM= 131072
##$YMAX_p= 379243426
##$YMIN_p= -58533
##$CURPLOT= <Network HP LaserJet P1505>
##$CURPRIN= <$Network HP LaserJet P1505>
##$DFORMAT= <normdp>
##$LAYOUT= <+/1D_H.xwp>
##$LFORMAT= <normlp>
##$PFORMAT= <normpl>
##$SURQMSG= 1
$$ End of Bruker specific parameters
$$ ---------------------------------
##NTUPLES= NMR SPECTRUM
##VAR_NAME=  FREQUENCY,     SPECTRUM/REAL,   SPECTRUM/IMAG
##SYMBOL=    X,             R,               I
##VAR_TYPE=  INDEPENDENT,   DEPENDENT,       DEPENDENT
##VAR_FORM=  AFFN,          ASDF,            ASDF
##VAR_DIM=   131072,        131072,          131072
##UNITS=     HZ,            ARBITRARY UNITS, ARBITRARY UNITS
##FACTOR=    0.0627417313425164, 1,          1
##FIRST=     8223.62146879497, 518,          -68980
##LAST=      0,             3211,            -69150
##MIN=       0,             -58533,          0
##MAX=       8223.62146879497, 379243426,    0
$$ Real data points
##PAGE= N=1
##DATA TABLE= (X++(R..R)), XYDATA
$$ [...]
63954H65159N2455N9769O8807P8701Q8781R9442J11429J24860J39465J55188J71659
$$ 865159 917614 977383 1046190 1124891 1213672 1313114 1424543 1549403 1688868 1844056 2015715
63943B015715J87570K01526K13369K23866K33111K40006K43284K42268K36593
$$ 2015715 2203285 2404811 2618180 2842046 3075157 3315163 3558447 3800715 4037308
63934D037308K25963K10457J90530J66521J38652J07547P4160L9150K934l3544
$$ 4037308 4263271 4473728 4664258 4830779 4969431 5076978 5151138 5190288 5193222 5159678
63924E159678o8809j01880j32665j60963j85677k05487k19982k29680k35175k36671
$$ 5159678 5090869 4988989 4856324 4695361 4509684 4304197 4084215 3854535 3619360 3382689
63914C382689k34236k28175k19106k07796j94907j80914j66294j51589j37117
$$ 3382689 3148453 2920278 2701172 2493376 2298469 2117555 1951261 1799672 1662555
63905A662555j22870j08957r5959q4474p4499o5648n7783n0975m5043l9705l5075
$$ 1662555 1539685 1430728 1334769 1250295 1175796 1110148 1052365 1001390 956347 916642 881567
63894H81567l1470k8803k6719k5189k4252k3363k1830j9870j8386j7577j6648
$$ 881567 850097 821294 794575 769386 745134 721771 699941 680071 661685 644108 627460
63883F27460j5176j3733j2795j1851j0187p870n417l036p80J137K714M354O165
$$ 627460 612284 598551 585756 573905 563718 555848 550431 547395 546615 547752 550466 554820 560985
63870E60985P588Q248Q637R349J0116J0310J0070J0132J0737J1395J1591J1162
$$ 560985 568573 576821 585458 594807 604923 615233 625303 635435 646172 657567 669158 680320
63858F80320J0089Q538O977N736M491K707N11j433k897m321o086q062j0009j1929
$$ 680320 690409 698947 705924 711660 716151 718858 719369 717936 715039 710718 704632 696570 686561 674632
63844F74632j3740j5041j5512j5388j5282j5617j6319j6971j7207j7001j6612
$$ 674632 660892 645851 630339 614951 599669 584052 567733 550762 533555 516554 499942
63833D99942j6301j6137j6055j5983j5809j5425j4794j3904j2606j0815q941p794
$$ 499942 483641 467504 451449 435466 419657 404232 389438 375534 362928 352113 343172 335378
63821C35378p764q253q198p120n466m025l237l026l096l204l234l115k829k510
$$ 335378 327614 319361 311163 304043 298577 294552 291315 288289 285193 281989 278755 275640 272811 270301
63807B70301k316k139j618p49j24k53q34j157j062r85j154j352j498j803k245
$$ 270301 267985 265846 264228 263479 263355 263102 262268 261111 260049 259064 257910 256558 255060 253257 251012
63792B51012k435k201j816j541j409j536j967k239j805j033q98j481j749j179
$$ 251012 248577 246376 244560 243019 241610 240074 238107 235868 234063 233030 232132 230651 228902 227723
63778B27723n86o78q88n25j02m49j151j207p35p03j141r64K17J357J404O39P2
$$ 227723 227137 226459 225571 225046 224944 224495 223344 222137 221402 220699 219558 218594 218811 220168 221572 222211 222283
63761B22283J28M63O61O29N02L94K89J53J42M40Q04P00J08k47J22O82P03L66M35
$$ 222283 222411 222874 223535 224164 224666 225060 225349 225502 225644 226084 226888 227588 227696 227449 227571 228253 228956 229322 229757
63742B29757J066J767K301K819L207L080K557K282K515K820K773K451K073J678
$$ 229757 230823 232590 234891 237710 240917 243997 246554 248836 251351 254171 256944 259395 261468 263146
63728B63146J301J076J038J193J658K396K937K824K242J715J400J188J260J811
$$ 263146 264447 265523 266561 267754 269412 271808 274745 277569 279811 281526 282926 284114 285374 287185
63714B87185K413K410J853J291P82j7q44r37l12L0n22j419j902j863j481p59J12
$$ 287185 289598 292008 293861 295152 295934 295917 295073 294136 293824 293854 293332 291913 290011 288148 286667 285908 286020
63697B86020O43P13P21Q41Q29Q08J345K373K983K824K740L329L758L048J699R97
$$ 286020 286663 287376 288097 288938 289767 290575 291920 294293 297276 300100 302840 306169 309927 312975 314674 315671
63681C15671J176J355J010M06j93p67j075q53m77n18o94j41J095J784J124j65
$$ 315671 316847 318202 319212 319618 319425 318658 317583 316730 316253 315735 315041 314900 315995 317779 318903 318738
63665C18738p95m64J07K52j7l80o83j026j494j932k042j809j673k041k685k940
$$ 318738 317943 317479 317586 317838 317821 317441 316758 315732 314238 312306 310264 308455 306782 304741 302056 299116
63649B99116k568k062k013k453k974l240l154k710j957j023J8J197K397L159L178
$$ 299116 296548 294486 292473 290020 287046 283806 280652 277942 275985 274962 274980 276177 278574 281733 284911
63634B84911K883L143M134M976M893M375M557N588O491O723P010Q130R684J0804
$$ 284911 287794 290937 295071 300047 304940 309315 313872 319460 325951 332674 339684 347814 357498 368302
63620C68302J1425J2051J2631J2784J2856J3684J5323J7016J8505K0286K2362
$$ 368302 379727 391778 404409 417193 430049 443733 459056 476072 494577 514863 537225
63609E37225K3893K4574K5276K6591K7667K7280K5362K2670J9492J5654J1324
$$ 537225 561118 585692 610968 637559 665226 692506 717868 740538 760030 775684 787008
63598G87008O975K859p67l351m798o100q180j0413j1384j1057j1020j2431j4722
$$ 787008 793983 796842 796075 792724 787926 781826 773646 763233 751849 740792 729772 717341 702619
63585G02619j6725j8166j9461k0652k1219k0747j9331j7438j5587j4030j2674
$$ 702619 685894 667728 648267 627615 606396 585649 566318 548880 533293 519263 506589
63574E06589j1360j0109q870p228m831k056J83J392J878K246L000M512O803R154
$$ 506589 495229 485120 476250 469022 464191 462135 462318 463710 465588 467834 470834 475346 482149 491303
63560D91303J0514J0639J0433J0880J1917J2728J2935J3207J4652J7613K1132
$$ 491303 501817 512456 522889 533769 545686 558414 571349 584556 599208 616821 637953
63549F37953K3721K4862K5520K6919K9083L0942L1499L0307K7081K1842J5515
$$ 637953 661674 686536 712056 738975 768058 799000 830499 860806 887887 909729 925244
63538I25244R483M227q64n998j0163j2399j3143j3504j3705j3211j2231j2038
$$ 925244 934727 938954 938090 932092 921929 909530 896387 882883 869178 855967 843736 831698
63526H31698j3560j6286j8990k1065k2763k4379k5691k6289k6162k5689k5150
$$ 831698 818138 801852 782862 761797 739034 714655 688964 662675 636513 610824 585674
63515E85674k4474k3541k2397k1024j9184j6881j4728j3338j2489j1439j0016
$$ 585674 561200 537659 515262 494238 475054 458173 443445 430107 417618 406179 396163
63504C96163q703p615o220m361k854k469k856l109k896k511k124j704j371j208
$$ 396163 387460 379845 373625 369264 366410 363941 361085 357976 355080 352569 350445 348741 347370 346162
63490C46162q92j28P19J052R00P49O36K10l22j84Q65K089K694K651K327J859J302
$$ 346162 345270 345142 345861 346913 347813 348562 349198 349408 349086 348902 349767 351856 354550 357201 359528 361387 362689
63473C62689R02Q19Q48P39N09K29k07q43j486j985k383k647k651k550k707k991
$$ 362689 363591 364410 365258 365997 366506 366735 366528 365685 364199 362214 359831 357184 354533 351983 349276 346285
63457C46285k699j570l28L14P00J563K746L472L691M231N485O766P283P193P259
$$ 346285 343586 342016 341688 342002 342702 344265 347011 350483 354174 358405 363890 370656 377939 385132 392391
63442C92391P945R163J0625J2138J3677J5355J7143J8712J9814K0773K2091K3488
$$ 392391 400336 409499 420124 432262 445939 461294 478437 497149 516963 537736 559827 583315
63430E83315K3905K2728K0528J8275J6276J4324J2530J1383J1196J1970J3648
$$ 583315 607220 629948 650476 668751 685027 699351 711881 723264 734460 746430 760078
63419G60078J6068J8708K0986K2845K4649K6479K7824K8008K6599K3382J8449
$$ 760078 776146 794854 815840 838685 863334 889813 917637 945645 972244 995626 1014075
63408A014075J2517O849K398r49m028p402j0786j3490j5175j6081j6674j7293
$$ 1014075 1026592 1033441 1035839 1034890 1030862 1023460 1012674 999184 984009 967928 951254 933961
63396I33961j8192j9621k1644k3972k6224k8288l0080l1096l0628k8614k5898
$$ 933961 915769 896148 874504 850532 824308 796020 765940 734844 704216 675602 649704
63385F49704k3404k1365j9466j7433j5196j2850j0679q911p270n172k612l36J261
$$ 649704 626300 604935 585469 568036 552840 539990 529311 520400 513130 507958 505346 505010 506271
63372E06271K845N072P456R086J0082J1326J3002J4477J5593J6974J8861K0660
$$ 506271 509116 514188 521644 530730 540812 552138 565140 579617 595210 612184 631045 651705
63360F51705K1952K3120K4571K6212K7973K9933L1480L1374K9355K6765K4688
$$ 651705 673657 696777 721348 747560 775533 805466 836946 868320 897675 924440 949128
63349I49128K2289J8090J2309O658K166j584n074p978r886j1008j1755j2394j3377
$$ 949128 971417 989507 1001816 1008474 1010640 1009056 1003982 996004 986118 975110 963355 950961 937584
63336I37584j5314j8174k1013k2910k3910k4751k5899k7026k7230k5788k2959
$$ 937584 922270 904096 883083 860173 836263 811512 785613 758587 731357 705569 682610
63325F82610k0006j8053j6919j5510j3258j0610q222o409n571o191p923r416r785
$$ 682610 662604 644551 627632 612122 598864 588254 580032 573623 568052 561861 553938 544522 534737
63312E34737r792j0814j2869j4509j4607j3475j2065j0709r161p482o212n613
$$ 534737 524945 514131 501262 486753 472146 458671 446606 435897 426736 419254 413042 407429
63300D07429n195m330l167k474k555k769k464j953k042k819l536l773l895m106
$$ 407429 402234 397904 394737 392263 389708 386939 384475 382522 380480 377661 374125 370352 366457 362351
63286C62351l811k493p71J53p6p43j146j315j513j648j451r63n45n05q86j458
$$ 362351 358540 356047 355276 355429 355353 354610 353464 352149 350636 348988 347537 346574 346029 345524 344638 343180
63270C43180j863j842j405p21Q1R31J683K232K654L108L540L739L689L612L653
$$ 343180 341317 339475 338070 337349 337430 338361 340044 342276 344930 348038 351578 355317 359006 362618 366271
63255C66271L766L946M307M828N282N531N667N813O047O641P968R921J1749J2850
$$ 366271 370037 373983 378290 383118 388400 393931 399598 405411 411458 418099 426067 435988 447737 460587
63241D60587J3494J4393J5781J7407J9200K1346K3663K5612K7074K8597L0471
$$ 460587 474081 488474 504255 521662 540862 562208 585871 611483 638557 667154 697625
63230F97625L2105L2762L2585L2394L2636L2986L2879L2118L1009L0223L0372
$$ 697625 729730 762492 795077 827471 860107 893093 925972 958090 989099 1019322 1049694
63219A049694L1360L2257L2192L1254L0122K8955K7158K4273K0541J6469J2276
$$ 1049694 1081054 1113311 1145503 1176757 1206879 1235834 1262992 1287265 1307806 1324275 1336551
63208A336551P864K928k977r951j7201k3533k8569l2968l7162m0511m2192m2303
$$ 1336551 1344415 1347343 1344366 1334415 1317214 1293681 1265112 1232144 1194982 1154471 1112279 1069976
63196A069976m1541m0227l8329l6066l3741l1186k8094k4732k1578j8428j4709
$$ 1069976 1028435 988208 949879 913813 880072 848886 820792 796060 774482 756054 741345
63185G41345j0700p516n624m224k479n86R09K139L528M917N880O578P419Q097
$$ 741345 730645 723129 717505 713281 710802 710216 711125 713264 716792 721709 727589 734167 741586 749683
63171G49683P878O978O601P238P744O824M855L326K738K029K10k379m902p369
$$ 749683 757561 764539 771140 778378 786122 792946 797801 801127 803865 805894 806104 803725 798823 791454
63157G91454j0320j3496j5795j6611j6561j6588j6881j6973j6554j5753j4787
$$ 791454 781134 767638 751843 735232 718671 702083 685202 668229 651675 635922 621135
63146F21135j3704j2427j0945r511q641q540q542p537n277k858j528j388j629
$$ 621135 607431 595004 584059 574548 565907 557367 548825 541288 536011 533153 531625 530237 528608
63133E28608j676j544j267o82J96J094J814K274K313J855J321J397K346L822N291
$$ 528608 526932 525388 524121 523439 523635 524729 526543 528817 531130 532985 534306 535703 538049 541871 547162
63118E47162O327O598O101N351M852M479L859L197L027L166K796J760R27R02J208
$$ 547162 553489 560087 566188 571539 576391 580870 584729 587926 590953 594119 596915 598675 599602 600504 601712
63103F01712J237J240J656K067J719P10j48m62n12m53l6P55J417J522J188Q14
$$ 601712 602949 604189 605845 607912 609631 610341 610193 609731 609219 608766 608730 609485 610902 612424 613612 614426
63087F14426O28O45P62Q07P14O97J112K104L495M975O213O933P113P106P346P984
$$ 614426 615054 615699 616461 617268 617982 618679 619791 621895 625390 630365 636578 643511 650624 657730 665076 673060
63071F73060Q894R883J0745J1334J1888J3065J5247J7873J9899K0972K1889K3813
$$ 673060 681954 691837 702582 713916 725804 738869 754116 771989 791888 812860 834749 858562
63059H58562K7201L1478L5586L8947M2020M5757N0330N4718N7932O0301O2963
$$ 858562 885763 917241 952827 991774 1033794 1079551 1129881 1184599 1242531 1302832 1365795
63048A365795O6277O9511P2095P4323P6422P7769P7639P6384P5139P4519P4114
$$ 1365795 1432072 1501583 1573678 1648001 1724423 1802192 1879831 1956215 2031354 2105873 2179987
63037B179987P3252P1719O9669O7273O4724O2311O0030N7154N2508M5416L6249
$$ 2179987 2253239 2324958 2394627 2461900 2526624 2588935 2648965 2706119 2758627 2804043 2840292
63026B840292K5889J4705K431j1013k5049l8975n2545o5526p7116q6398r3216
$$ 2840292 2866181 2880886 2883317 2872304 2847255 2808280 2755735 2690209 2613093 2526695 2433479
63015B433479r7973j00639j00743r8468r4879r0673q5410p8544p0678o3064n6264
$$ 2433479 2335506 2234867 2134124 2035656 1940777 1850104 1764694 1686150 1615472 1552408 1496144
63004A496144m9898m3459l6720k9546k2162j5467j0427o981m162j343J269L435
$$ 1496144 1446246 1402787 1366067 1336521 1314359 1298892 1288465 1281484 1277322 1275979 1277248 1280683
62992A280683N399P260Q535Q879Q704Q592Q508Q095P347O407N013K809Q4k542
$$ 1280683 1286082 1293342 1301877 1310756 1319460 1328052 1336560 1344655 1352002 1358409 1363422 1366231 1366315 1363773
62978A363773n108q303j2348j6571k0284k3542k6665k9528l1707l3031l3596l3494
$$ 1363773 1358665 1350362 1338014 1321443 1301159 1277617 1250952 1221424 1189717 1156686 1123090 1089596
62966A089596l2882l2098l1345l0393k8936k7185k5735k4818k3941k2377j9967
$$ 1089596 1056714 1024616 993271 962878 933942 906757 881022 856204 832263 809886 789919
62955G89919j7409j5664j5067j5017j4728j4128j3682j3450j2935j2011j1344
$$ 789919 772510 756846 741779 726762 712034 697906 684224 670774 657839 645828 634484
62944F34484j1446j1832j1707j1057j0356r608q477p233o605o614o415n519m429
$$ 634484 623038 611206 599499 588442 578086 568478 560001 552768 546163 539549 533134 527615 523186
62931E23186l762l453l221l091k950k268j000k04q61k356l009k116p10r5m37j076
$$ 523186 519424 515971 512750 509659 506709 504441 503441 503237 502376 500020 497011 494895 494185 494090 493653 492577
62915D92577j607k054k288j999j319r69j454k330k636k096j467j520k037k231
$$ 492577 490970 488916 486628 484629 483310 482341 480887 478557 475921 473825 472358 470838 468801 466570
62901D66570j874j447j221r31n43o07j358k074j976j350j029j056p09K26J013
$$ 466570 464696 463249 462028 461097 460554 459947 458589 456515 454539 453189 452160 451104 450395 450621 451634
62886D51634J018M61r7m62o29m55N4N29O57N56L63j14r15j454j158l51R1q0l18
$$ 451634 452652 453113 453016 452554 451925 451470 451524 452053 452710 453266 453629 453515 452600 451146 449988 449637 449728 449648 449330
62867D49330l09m42r75j402j167n65l27n52o57k92L13R41J733K646L153K872K183
$$ 449330 449021 448579 447604 446202 445035 444470 444143 443591 442934 442642 442955 443896 445629 448275 451428 454300 456483
62850D56483J783J827J882J581R66K89j68j54K98P64Q13M27j89r75j757j946j167
$$ 456483 458266 460093 461975 463556 464522 464811 464643 464489 464787 465551 466364 466791 466602 465627 463870 461924 460757
62833D60757m8L76R0J59J111K107K172J503R37P31N94N46R67J900K991L932M508
$$ 460757 460709 461085 461175 461334 462445 464552 466724 468227 469164 469895 470489 471035 472002 473902 476893 480825 485333
62816D85333M415L721L267L909N369O502O731O561O584O741O837P127P923R051
$$ 485333 489748 493469 496736 500645 506014 512516 519247 525808 532392 539133 545970 553097 561020 570071
62802E70071J0085J0869J1518J2104J2677J3389J4432J5952J8037K0565K3093
$$ 570071 580156 591025 602543 614647 627324 640713 655145 671097 689134 709699 732792
62791G32792K5194K7093K9550L3043L7349M2025M6923N2030N7289O2844O9133
$$ 732792 757986 785079 814629 847672 885021 927046 973969 1025999 1083288 1146132 1215265
62780A215265P6315Q3838R0953R7414J03427J09015J13807J17320J19158J18958
$$ 1215265 1291580 1375418 1466371 1563785 1667212 1776227 1890034 2007354 2126512 2245470
62770B245470J16450J11538J04143R4141Q1649O7195N1268L3801J4492o189k6703
$$ 2245470 2361920 2473458 2577601 2671742 2753391 2820586 2871854 2905655 2920147 2913958 2887255
62759B887255m5328o1225p4644q6160r6035j04140j10201j13928j15090j13836
$$ 2887255 2841927 2780702 2706058 2619898 2523863 2419723 2309522 2195594 2080504 1966668
62749A966668j10986j07647j04262j00250r4862q8218q1163p4331o7853o1888
$$ 1966668 1855682 1748035 1643773 1543523 1448661 1360443 1279280 1204949 1137096 1075208
62739A075208n6750n2304m7879m3123l8507l4531l0904k7063k3215k0171j8191
$$ 1075208 1018458 966154 918275 875152 836645 802114 771210 744147 720932 700761 682570
62728F82570j6608j4753j2727j1032r819q826p872p029o304n441m210k774j580
$$ 682570 665962 651209 638482 627450 617631 608805 600933 593904 587600 582159 577949 575175 573595
62715E73595p90n9R88K185L097L778M869O772R099J1215J2989J4712J6475J8109
$$ 573595 572805 572746 573734 575919 579016 582794 587663 594435 603534 614749 627738 642450 658925 677034
62701F77034J9651K1430K3576K5699K7345K8628L0253L2728L5557L7488L7786
$$ 677034 696685 718115 741691 767390 794735 823363 853616 886344 921901 959389 997175
62690I97175L7077L6439L5778L3834K9972K5070K0146J4858Q312Q51o169j2167
$$ 997175 1034252 1070691 1106469 1140303 1170275 1195345 1215491 1230349 1238661 1239512 1233343 1221176
62678A221176j7841k3609k8767l2608l5457l7897l9696m0313l9985l9398l8509
$$ 1221176 1203335 1179726 1150959 1118351 1082894 1044997 1005301 964988 925003 885605 847096
62667H47096l6641l3762l0855k8761k7247k5585k3583k1623j9911j8185j6180
$$ 847096 810455 776693 745838 717077 689830 664245 640662 619039 599128 580943 564763
62656E64763j4059j2187j0665r293p989p030o656o556o103n163m344m241m605
$$ 564763 550704 538517 527852 518559 510570 503540 496884 490328 484225 479062 474718 470477 465872
62643D65872m629l864k609j444p35n72q51j238j310r37l81R5N70J217J828J921
$$ 465872 461243 457379 454770 453326 452591 452019 451168 449930 448620 447683 447302 447397 447967 449184 451012 452933
62627D52933J382P01M38N91P53Q14J111J762K270K166J766J841K595L545M390
$$ 452933 454315 455016 455454 456045 456798 457612 458723 460485 462755 464921 466687 468528 471123 474668 479058
62612D79058N361O451P034O835O690P623R415J0993J2076J3473J5693J8161K0318
$$ 479058 484419 490870 497904 504739 511429 519052 528467 539460 551536 565009 580702 598863 619181
62599F19181K2641K5908K9947L3836L7123M0157M3384M6875N0455N3808N6402
$$ 619181 641822 667730 697677 731513 768636 808793 852177 899052 949507 1003315 1059717
62588A059717N7742N7768N6712N4551N0950M5665L8756L0417K0996J1106J323
$$ 1059717 1117459 1175227 1231939 1286490 1337440 1383105 1421861 1452278 1473274 1484380 1485703
62577A485703q201j7494k6201l3701l9750m4571m8263n0730n2166n3040n3333
$$ 1485703 1477502 1460008 1433807 1400106 1360356 1315785 1267522 1216792 1164626 1111586 1058253
62566A058253n2447n0218m7414m4800m2197l9093l5738l2860l0473k7793k4448
$$ 1058253 1005806 955588 908174 863374 821177 782084 746346 713486 683013 655220 630772
62555F30772k1073j8452j6574j4893j3226j1843j0850r843q421o753n413m641
$$ 630772 609699 591247 574673 559780 546554 534711 523861 514018 505597 498844 493431 488790
62543D88790m054l235k378k007k150k201j684q14j16J62O7k90p16r45r13q04n83
$$ 488790 484736 481501 479123 477116 474966 472765 471081 470267 470151 470313 470380 470090 469374 468429 467516 466712 466129
62526D66129J85J719L544N009O018O840P522Q066Q980J0905J3596J5889J6921
$$ 466129 466314 468033 471577 476586 482604 489444 496966 505032 514012 524917 538513 554402 571323
62513E71323J7116J7695J9400K1792K3728K4462K4392K4523K5080K5137K3905
$$ 571323 588439 606134 625534 647326 671054 695516 719908 744431 769511 794648 818553
62502H18553K1873K0014J8240J5654J2219R118P147N673L743J572L27Q49L042
$$ 818553 840426 860440 878680 894334 906553 915671 922818 928491 932234 933806 934133 934982 938024
62489I38024O168R297J1846J4084J6875K0568K4483K7800L0530L3091L5347L6675
$$ 938024 944192 953489 965335 979419 996294 1016862 1041345 1069145 1099675 1132766 1168113 1204788
62477A204788L6735L5570L3072K8987K3482J7127J0261K784n333j3704k1752k9016
$$ 1204788 1241523 1277093 1310165 1339152 1362634 1379761 1390022 1392806 1387473 1373769 1352017 1323001
62465A323001l5224m0345m4570m7940n0046n0435m9357m7617m5610m2960l9338
$$ 1323001 1287777 1247432 1202862 1154922 1104876 1054441 1005084 957467 911857 868897 829559
62454H29559l5210l1387k8100k4924k1499j7972j4680j1787r364p503o117m754
$$ 829559 794349 762962 734862 709938 688439 670467 655787 644000 634636 627133 621016 616262
62442F16262k945q35Q80J733K036K426L027L332K893J789M61p07j546k112k666
$$ 616262 613317 612482 613362 615095 617131 619557 622584 625916 628809 630598 631059 630352 628806 626694 624028
62427F24028l548m854o368p743q765r439r979j0534j0861j0484r470q663q680
$$ 624028 620480 615626 609258 601515 592750 583311 573332 562798 551937 541453 531983 523320 514640
62414E14640q902q205o573n191m838n042n101n040n018m628l611k620k426k720
$$ 514640 505738 497533 490960 485769 480931 475889 470788 465748 460730 456102 452491 449871 447445 444725
62400D44725k552j671n99L70J335K061K042J431J110J546K307K817L087L336L603
$$ 444725 442173 440502 439903 440273 441608 443669 445711 447142 448252 449798 452105 454922 458009 461345 464948
62385D64948L949M579N366N770N528N072M955N257N838O730P819Q523Q374P781
$$ 464948 468897 473476 478842 484612 490140 495212 500167 505424 511262 517992 525811 534334 542708 550489
62371E50489P709Q603R993J1191J2053J2889J3931J5147J6528J8360K0939K4094
$$ 550489 558198 566801 576794 587985 600038 612927 626858 642005 658533 676893 697832 721926
62359G21926K7234L0018L2739L5794L8970M1683M3752M5497M6971M7563M6504
$$ 721926 749160 779178 811917 847711 886681 928364 972116 1017613 1064584 1112147 1158651
62348A158651M3537L8939L3238K7040K0851J4818Q784K690l258q795j3768j8062
$$ 1158651 1202188 1241127 1274365 1301405 1322256 1337074 1345858 1348548 1345290 1336495 1322727 1304665
62336A304665k1626k4588k7057k8820k9629k9751k9730k9555k8680k7066k5522
$$ 1304665 1283039 1258451 1231394 1202574 1172945 1143194 1113464 1083909 1055229 1028163 1002641
62325A002641k4576k3660k2082k0316j9520j9986k0834k1232k1199k1209k1515
$$ 1002641 978065 954405 932323 912007 892487 872501 851667 830435 809236 788027 766512
62314G66512k2053k2472k2155k0701j8600j6899j5999j5211j3806j2042j0685
$$ 766512 744459 721987 699832 679131 660531 643632 627633 612422 598616 586574 575889
62303E75889r908r205q263p302o518n740m803l856l103k519k062j821j625p94
$$ 575889 565981 556776 548513 541211 534693 528953 524150 520294 517191 514672 512610 510789 509164 508370
62289E08370J124L439M697M195K727J638J510K032K736L357L713L783L921M474
$$ 508370 509494 512933 517630 521825 524552 526190 527700 529732 532468 535825 539538 543321 547242 551716
62275E51716N212N595N627N910O677P376P571P834R141J1587J4229J6185J7504
$$ 551716 556928 562523 568150 574060 580737 588113 595684 603518 612659 624246 638475 654660 672164
62262F72164J8879K0830K3395K6353K9488L2717L6058L9561M3113M6271M8361
$$ 672164 691043 711873 735268 761621 791109 823826 859884 899445 942558 988829 1037190
62251A037190M8987M8471M7550M6383M4056L9478L2716K5032J7583J0534L572
$$ 1037190 1086177 1134648 1182198 1228581 1272637 1312115 1344831 1369863 1387446 1397980 1401552
62240A401552l252r719j6031k2605k9255l5118l9506m2561m4835m6459m6931m5757
$$ 1401552 1398300 1388581 1372550 1349945 1320690 1285572 1246066 1203505 1158670 1112211 1065280 1019523
62228A019523m3151l9993l7058l4389l1649k8879k6486k4476k2226j9353j6355
$$ 1019523 976372 936379 899321 864932 833283 804404 777918 753442 731216 711863 695508
62217F95508j3974j2236j0615q890p306o001m899m178m154m572m568l669k351
$$ 695508 681534 669298 658683 649793 642487 636486 631587 627409 623255 618683 614115 610446 608095
62204F08095j318o01K36J324K419L391M313N150N734O072O408O947P675Q455R048
$$ 608095 606777 606176 606412 607736 610155 613546 617859 623009 628743 634815 641223 648170 655845 664300 673348
62189F73348R208R073R339J0609J2468J3630J3286J2004J1021J0844J0949J0684
$$ 673348 682556 691629 700968 711577 724045 737675 750961 762965 773986 784830 795779 806463
62177H06463J0058R552R485R757J0019R993R746R766J0542J2035J3746J5418J7448
$$ 806463 816521 826073 835558 845315 855334 865327 875073 884839 895381 907416 921162 936580 954028
62164I54028K0314K3851K7428L0609L3165L4493L3747L0835K6772K2647J8516
$$ 954028 974342 998193 1025621 1056230 1089395 1123888 1157635 1188470 1215242 1237889 1256405
62153A256405J3807Q501L276j443n937j0559j5112j9188k2700k5764k8286k9992
$$ 1256405 1270212 1278713 1281989 1280546 1274609 1264050 1248938 1229750 1207050 1181286 1153000 1123008
62141A123008l0713l0468k9424k7977k6615k5393k3727k1091j7769j4576j1952
$$ 1123008 1092295 1061827 1032403 1004426 977811 952418 928691 907600 889831 875255 863303
62130H63303r774p996o880o428o104n388m318l226k231j337o70k38L44J440K808
$$ 863303 853529 845533 838653 832225 826121 820733 816415 813189 810958 809621 808951 808713 809057 810497 813305
62115H13305L766L908L333K284R49m57j820l290m957o348o787o330n933o457p846
$$ 813305 817071 820979 824312 826596 827545 827088 825268 821978 817021 810673 803886 797556 791623 785166 777320
62100G77320r411j0519j0788j0069q604p004n693m549l242j750l21P95J394J392
$$ 777320 767909 757390 746602 736533 727929 720925 715232 710683 707441 705691 705370 706165 707559 708951
62086G08951J116J248K122L332M320N023N649O170O572P274Q689J0549J2163J3312
$$ 708951 710067 711315 713437 716769 721089 726112 731761 737931 744503 751777 760466 771015 783178 796490
62072G96490J4246J5014J5388J5518J5979J7035J8326J9479K0542K1682K2866
$$ 796490 810736 825750 841138 856656 872635 889670 907996 927475 948017 969699 992565
62061I92565K3983K4868K5156K4487K2921K0683J7567J3287Q366L851j03m433
$$ 992565 1016548 1041416 1066572 1091059 1113980 1134663 1152230 1165517 1173883 1177734 1177631 1173198
62049A173198r483j4141j7374j9835k2855k6465k9557l1765l3832l6005l7294
$$ 1173198 1163715 1149574 1132200 1112365 1089510 1063045 1033488 1001723 967891 931886 894592
62038H94592l6841l5125l3190l1328k9262k7101k5303k3787k1820j9019j5992
$$ 894592 857751 822626 789436 758108 728846 701745 676442 652655 630835 611816 595824
62027E95824j3720j2557j1972j1176r778q023o600o118o562p199p240o670o194
$$ 595824 582104 569547 557575 546399 536621 528598 521998 515880 509318 502119 494879 488209 482015
62014D82015o229o287n685m572l740l448l039j950n04O84J647K810M062M745M640
$$ 482015 475786 469499 463814 459242 455502 452054 449015 447065 446561 447245 448892 451702 455764 460509 465149
61999D65149M421M835N773O392N996M622K895J500P50M32P7n92j451k198k805
$$ 465149 469570 474405 480178 486570 492566 497188 500083 501583 502333 502765 502842 502250 500799 498601 495796
61984D95796l632m976o550p615p802p602p757q227q152p028n525m825n271o058
$$ 495796 492164 487188 480638 473023 465221 457619 449862 441635 433483 426455 420930 416105 410834 404776
61970D04776o189n465m402l446k577j657q77n97q09j011p70j44N21J019J268J162
$$ 404776 398587 393122 388720 385274 382697 381040 380163 379566 378757 377746 376976 376832 377353 378372 379640 380802
61954C80802P69M70N72Q93J127J493K423L805N089O103P169Q362R374J0226J1291
$$ 380802 381571 382041 382613 383506 384633 386126 388549 392354 397443 403546 410715 419077 428451 438677 449968
61939D49968J2455J3049J3076J3570J5104J6692J7044J6332J5761J5761J5582
$$ 449968 462423 475472 488548 502118 517222 533914 550958 567290 583051 598812 614394
61928F14394J4580J2992J1369R896Q414O631M369J944J30p64j415k517l644l883
$$ 614394 628974 641966 653335 663231 671645 678276 682645 684589 684719 683955 682540 680023 676379 672496
61914F72496l359l038l139k714j124J083L096M853O661Q443R858J0686J0766R939
$$ 672496 669137 666099 662960 660246 659122 660205 663301 668154 674815 683258 693116 703802 714568 724507
61900G24507Q399O645M875K873O62j369l236n542q421j0936j2150j2367j2648
$$ 724507 732906 739551 744426 747299 747961 746592 743356 737814 729393 718457 706307 693940 681292
61887F81292j3391j3976j3701j2632j1473j0884j0840j0648r824q902q822r464
$$ 681292 667901 653925 640224 627592 616119 605235 594395 583747 573923 565021 556199 546735
61875E46735r598q580p288o753o630n945m720l781l231k243m58J372K463K960
$$ 546735 537137 528557 521269 514516 507886 501941 497221 493440 490209 487966 487508 488880 491343 494303
61861D94303L570M715O325Q045R427J0301J1118J2577J4840J7446J9974K2347
$$ 494303 497873 502588 508913 516958 526385 536686 547804 560381 575221 592667 612641 634988
61849F34988K4412K5790K6352K6445K6395K6095K5316K4028K2277K0021J7325
$$ 634988 659400 685190 711542 737987 764382 790477 815793 839821 862098 882119 899444
61838H99444J4380J1218P715M047P55j859l988n768o855o950o253n036l144n19
$$ 899444 913824 925042 932757 936804 937559 935700 931712 925944 919089 912139 905886 900850 897706 897187
61824H97187K139M006N215O543P998Q574P610N604L209J67m016q784j2908j6001
$$ 897187 899326 903332 908547 915090 923088 931662 939272 944876 948085 948252 944236 935452 922544 906543
61810I06543j8825k1814k4136k4749k3878k2783k2241k1875k1014j9646j8255
$$ 906543 887718 865904 841768 817019 793141 770358 748117 726242 705228 685582 667327
61799F67327j7072j5858j4361j2669j1113r909q992q122p189o364n951o030o273
$$ 667327 650255 634397 620036 607367 596254 586345 577353 569231 562042 555678 549727 543697 537424
61786E37424o178n464m326l272k764k849l131l133k735k208j861j747j769j844
$$ 537424 531246 525782 521456 518184 515420 512571 509440 506307 503572 501364 499503 497756 495987 494143
61772D94143j817j388m09P40J335J032K93j09J03N06N71K41j11q8M55J388K392
$$ 494143 492326 490938 490529 491269 492604 493636 493929 493820 493923 494429 495000 495241 495130 495042 495497 496885 499277
61755D99277L100L290K965K257J382O47K95J60k76j203k098k410k400k780l499
$$ 499277 502377 505667 508632 510889 512271 512918 513213 513373 513097 511894 509796 507386 504986 502206 498707
61740D98707l665k881j955j836k340k544k092j385p33p2M77N06%m43l02L59J224
$$ 498707 495042 492161 490206 488370 486030 483486 481394 480009 479276 479204 479681 480187 480187 479744 479442 479801 481025
61723D81025K133K903L219L028K726K639K623K469K342K447K484K042J319R42
$$ 481025 483158 486061 489280 492308 495034 497673 500296 502765 505107 507554 510038 512080 513399 514341
61709E14341J011Q40o7j238j804j680j665k345l341l941m079m248m510m321l493
$$ 514341 515352 516192 516125 514887 513083 511403 509738 507393 504052 500111 496032 491784 487274 482953 479460
61694D79460k726k671k984k936k610k739l448m041m165m300m718m774l833k443
$$ 479460 476734 474063 471079 468143 465533 462794 459346 455305 451140 446840 442122 437348 433515 431072
61680D31072j778k214k950l025k231j161o79j209k212k526j635l84k3o73j323
$$ 431072 429294 427080 424130 421105 418874 417713 417034 415825 413613 411087 409452 409068 409045 408372 407049
61665D07049j290r37q37q09k76P55J644J949J923K054K406K605K428K044J716
$$ 407049 405759 404822 403985 403176 402900 403655 405299 407248 409171 411225 413631 416236 418664 420708 422424
61650D22424J445J166J078J440K043K298J974J450J169J149J286J632K055K038
$$ 422424 423869 425035 426113 427553 429596 431894 433868 435318 436487 437636 438922 440554 442609 444647
61636D44647J328N30M55J008J275P24k70j124j740k271k664k796k765k754k803
$$ 444647 445975 446505 446960 447968 449243 449967 449697 448573 446833 444562 441898 439102 436337 433583 430780
61621D30780k872k993l154l209l040k689k248j792j566j930k871l758l875l267
$$ 430780 427908 424915 421761 418552 415512 412823 410575 408783 407217 405287 402416 398658 394783 391516
61607C91516k702k799l354l715l582l286l270l563l805l708l220k372j227j26
$$ 391516 388814 386015 382661 378946 375364 372078 368808 365245 361440 357732 354512 352140 350913 350787
61593C50787K83l92j746k897l376l426l384l097k288j266p90j185j947k394k437
$$ 350787 351070 350678 348932 346035 342659 339233 335849 332752 330464 329198 328408 327223 325276 322882 320445
61578C20445k342k060j301k76K63qm39l19J05O8m03m30M15J398J575R38J90j88
$$ 320445 318103 316043 314742 314466 314729 314721 314282 313963 314068 314136 313733 313303 313718 315116 316691 317629 317819 317631
61560C17631k20OM68R57J140R34O43O11R15J359J677J729J545J140L87o69j420
$$ 317631 317411 317417 317885 318842 319982 320916 321559 322170 323085 324444 326121 327850 329395 330535 330922 330253 328833
61543C28833j112J65J318J469R48O99R97J335J340J196J159J216J350J637J926
$$ 328833 327721 327886 329204 330673 331621 332320 333317 334652 335992 337188 338347 339563 340913 342550 344476
61528C44476J831J222M39j39m50n23k94J58L99L1q18j583j829j542r26j70M99
$$ 344476 346307 347529 347968 347829 347379 346856 346562 346720 347119 347150 346332 344749 342920 341378 340452 340282 340781
61511C40781P75N17L6j26J60M36L21J24L63Q18O70l26j378j676j329q87m60R9
$$ 340781 341556 342073 342109 341983 342143 342579 342900 343024 343387 344205 344875 344549 343171 341495 340166 339279 338819 338918
61493C38918N29M29Qj40L7l4n63r84p47q0M02M83N16R14J654K230K157J517R21
$$ 338918 339447 339876 339884 339744 339781 339747 339184 338200 337453 337373 337775 338258 338774 339688 341342 343572 345729 347246 348167
61474C48167P76Q79R50J122J521J695J165K77k08k80o11j235j264k38R74J159
$$ 348167 348943 349822 350772 351894 353415 355110 356275 356552 356344 356064 355453 354218 352954 352716 353690 354849
61458C54849K22q54j106l82O80J128M90o38j072l23R43J844K231K415K460K266
$$ 354849 355071 354217 353111 352729 353409 354537 355027 354389 353317 352994 353937 355781 358012 360427 362887 365153
61442C65153J994J933K098K273K307K105J604J037R31J504K281K640K547K414
$$ 365153 367147 369080 371178 373451 375758 377863 379467 380504 381435 382939 385220 387860 390407 392821
61428C92821K515K836L278L666L669L132K339J708J396J390J709K222K517K364
$$ 392821 395336 398172 401450 405116 408785 411917 414256 415964 417360 418750 420459 422681 425198 427562
61414D27562K111K214K546K530J898R32L7n81r46j310j996k911l343k695j333
$$ 427562 429673 431887 434433 436963 438861 439793 439830 439249 438303 436993 434997 432086 428743 426048 424715
61399D24715l20l28j160k263l231l774l621k812j847j338j457j807j843j426j029
$$ 424715 424395 424067 422907 420644 417413 413639 410018 407206 405359 404021 402564 400757 398914 397488 396459
61384C96459j140j571j605r79k82j37l57k93K13P24Q63O28K20r5KN00Q94P50L72
$$ 396459 395319 393748 392143 391164 390882 390745 390388 390095 390308 391032 391895 392523 392743 392648 392650 393150 394044 394794 395166
61365C95166M07R10J348J505J755K330K918L176L165L035K789K622L033M232N701
$$ 395166 395573 396483 397831 399336 401091 403421 406339 409515 412680 415715 418504 421126 424159 428391 434092
61350D34092O753P242P432P401P038O470O072N969N876N509M949M439L999L433
$$ 434092 440845 448087 455519 462920 469958 476428 482500 488469 494345 499854 504803 509242 513241 516674
61336E16674K678J938J396J006O69M89N46N49O3q55j668k079k312k520k451k084
$$ 516674 519352 521290 522686 523692 524361 524850 525396 525945 526008 525153 523485 521406 519094 516574 514123 512039
61320E12039j971k419k717k047p49J03L80J077K641M159M660M517M841O019P481
$$ 512039 510068 507649 504932 502885 502136 502239 502619 503696 506337 510496 515156 519673 524514 530533 538014
61305E38014Q587R116R048Q494P815P343O941O128M672K779P75j109k625l569
$$ 538014 546601 555717 564765 573259 581074 588417 595358 601486 606158 608937 609712 608603 605978 602409
61291F02409m028m417n078n892o380o214n612n198n369n922o358o457o318n905
$$ 602409 598381 593964 588886 582994 576614 570400 564788 559590 554221 548299 541941 535484 529166 523261
61277E23261m994l619k216j157l32N52J499K220K495K403K273K523L263M039M191
$$ 523261 518267 514648 512432 511275 510943 511495 512994 515214 517709 520112 522385 524908 528171 532210 536401
61262E36401L673L271L818N300O881P631P240O213N495N594N978N703M647L627
$$ 536401 540074 543345 547163 552463 559344 566975 574215 580428 585923 591517 597495 603198 607845 611472
61248F11472L152K612J264n09j632j723j451j520k012k661l254l572l387k754
$$ 611472 614624 617236 618500 617991 616359 614636 613185 611665 609653 606992 603738 600166 596779 594025
61234E94025k045j579j419j482j562j289l75J016K413L504M190M391M142L850
$$ 594025 591980 590401 588982 587500 585938 584649 584274 585290 587703 591207 595397 599788 603930 607780
61220F07780L918M191M174L860L785M134M397M180L776L641L682L517L105K737
$$ 607780 611698 615889 620063 623923 627708 631842 636239 640419 644195 647836 651518 655035 658140 660877
61206F60877K561K574K878L520M189M462M355M371M987O252P862R454J0782J1763
$$ 660877 663438 666012 668890 672410 676599 681061 685416 689787 694774 701026 708888 718342 729124 740887
61192G40887J2387J2615J2445J1989J1225R783P372M590K713K321K571K270J273
$$ 740887 753274 765889 778334 790323 801548 811331 818703 823293 826006 828327 830898 833168 834441
61179H34441K71m52j276k377l388m076m710n450n960n911n505n121m837m587m512
$$ 834441 834712 834260 832984 830607 827219 823143 818433 812983 807023 801112 795607 790486 785649 781062 776550
61164G76550m786n339o077p088q275r010q647p294n677m277l012j760o30M15J745
$$ 776550 771764 766425 760348 753260 744985 735975 727328 720034 714357 710080 707068 705308 704678 705093 706838
61149G06838L476N006N589N220M610M186L608K431R86J66M79J626L057M562O087
$$ 706838 710314 715320 720909 726129 730739 734925 738533 740964 741950 742116 742595 744221 747278 751840 757927
61134G57927P377Q221Q879R873J1300J2809J4250J5868J7715J9330K0415K1424
$$ 757927 765304 773525 782404 792277 803577 816386 830636 846504 864219 883549 903964 925388
61122I25388K3034K5227K7391K9175L0778L2339L3580L4185L4269L4233L4345
$$ 925388 948422 973649 1001040 1030215 1060993 1093332 1126912 1161097 1195366 1229599 1263944
61111A263944L4534L4455L3661L1992K9742K7266K4478K1135J7549J4378J1456
$$ 1263944 1298478 1332933 1366594 1398586 1428328 1455594 1480072 1501207 1518756 1533134 1544590
61100A544590P577K031m079q869j1862j4414j7858k1979k5609k8139k9851l1140
$$ 1544590 1552167 1554198 1550119 1541250 1529388 1514974 1497116 1475137 1449528 1421389 1391538 1360398
61088A360398l2039l2485l2559l2361l1921l1390l0963l0544k9675k8050k5985
$$ 1360398 1328359 1295874 1263315 1230954 1199033 1167643 1136680 1106136 1076461 1048411 1022426
61077A022426k4148k2805k1538j9812j7729j6012j5193j4914j4221j2571j0455
$$ 1022426 998278 975473 953935 934123 916394 900382 885189 870275 856054 843483 833028
61066H33028q897q383q398q032o922n503m388l705l074k151r47L63J725L137M386
$$ 833028 824131 815748 807350 799318 792396 786893 782505 778800 775726 773575 772628 772991 774716 777853 782239
61051G82239N178N572O042O914P939Q643R065R819J1378J3526J5680J7528J9117
$$ 782239 787417 792989 799031 805945 813884 822527 831592 841411 852789 866315 881995 899523 918640
61038I18640K0467K1405K1917K2410K3385K4917K6600K8066K9396L0921L2732
$$ 918640 939107 960512 982429 1004839 1028224 1053141 1079741 1107807 1137203 1168124 1200856
61027A200856L4626L6485L8433M0490M2376M3928M5643M8434N2851N8785O5899
$$ 1200856 1235482 1271967 1310400 1350890 1393266 1437194 1482837 1531271 1584122 1642907 1708806
61016A708806P4057Q3341R4150J07415J24284J45344J70557K00350K36390K80701
$$ 1708806 1782863 1866204 1960354 2067769 2192053 2337397 2507954 2708304 2944694 3225395
61006C225395L34203L96630M67649N47391O35978P33418Q40527R59459J092023
$$ 3225395 3559598 3956228 4423877 4971268 5607246 6340664 7181191 8140650 9232673
60997I232673J235079J374482J482061J521416J463371J301847J057987P70639
$$ 9232673 10467752 11842234 13324295 14845711 16309082 17610929 18668916 19439555
60989A9439555M83935K40503P5573L554L127J9065j2196j30377l37058o04757
$$ 19439555 19923490 20163993 20239566 20243120 20246247 20265312 20253116 20122739 19785681 19180924
60979A9180924q93745j161936j369551j487460j507843j446642j333263j196250
$$ 19180924 18287179 17125243 15755692 14268232 12760389 11313747 9980484 8784234
60971H784234j055689r23411q04937p00499o07241n22976m47821l82364l25755
$$ 8784234 7728545 6805134 6000197 5299698 4692457 4169481 3721660 3339296 3013541
60962C013541k76626k34755k00467j72925j50140j30539j13579r8996q6397p5558
$$ 3013541 2736915 2502160 2301693 2128768 1978628 1848089 1734510 1635514 1549117 1473559
60952A473559o6360n8411n1283m4996l9736l5337l1751k9559k9103k9285k8452
$$ 1473559 1407199 1348788 1297505 1252509 1212773 1177436 1145685 1116126 1087023 1057738 1029286
60941A029286k6427k4540k3516k2629k1249j9963j9414j9135j8428j7520j6965
$$ 1029286 1002859 978319 954803 932174 910925 890962 871548 852413 833985 816465 799500
60930G99500j6578j5950j5447j5568j5748j4843j2783j0743r667r366r189q847
$$ 799500 782922 766972 751525 735957 720209 705366 692583 681840 672173 662807 653618 644771
60918F44771q367p767p066o389n854n572n595n707n524n059m855n123n119m080
$$ 644771 636404 628637 621571 615182 609328 603756 598161 592454 586930 581871 577016 571893 566774 562694
60904E62694k543j864k430l129k883k020j632k083k730k952k876k969l253l272
$$ 562694 560151 558287 555857 552728 549845 547825 546193 544110 541380 538428 535552 532583 529330 526058
60890E26058k808k350k568l439m188m158l410k421j605j314j752k550k842k263
$$ 526058 523250 520900 518332 514893 510705 506547 503137 500716 499111 497797 496045 493495 490653 488390
60876D88390j548j598k221k451j901j130o81m24j7N79J237J906K502K856K963
$$ 488390 486842 485244 483023 480572 478671 477541 476860 476436 476419 476998 478235 480141 482643 485499 488462
60861D88462L053L324L731M040L943L264K256J508J250J041M87o9j03J11j71r44
$$ 488462 491515 494839 498570 502610 506553 509817 512073 513581 514831 515872 516359 516290 516187 516298 516127 515183
60845E15183j393j150q16j000j620k459l719n426o879p350p083o971p394p926
$$ 515183 513790 512640 511824 510824 509204 506745 503026 497600 490721 483371 476288 469317 461923 453997
60831D53997q097p904p468o681n468m168l301l031l049l029k928k785k506k129
$$ 453997 445900 437996 430528 423847 418379 414211 410910 407879 404830 401801 398873 396088 393582 391453
60817C91453k051k513k941k470j211k53k13m79l73j75l38l88K75J100J035K11
$$ 391453 389402 386889 383948 381478 380267 380014 379801 379322 378949 378774 378436 378048 378323 379423 380458 380669
60801C80669k69o0J70K54R43K407L563L481K482J254q4j401j982j497p73p52j191
$$ 380669 380400 380340 380510 380764 381707 384114 387677 391158 393640 394894 394810 393409 391427 389930 389157 388405 387214
60784C87214j238q09n33o74r86j337j739j919j637j248j275j553j509j156j065
$$ 387214 385976 385167 384634 383960 382974 381637 379898 377979 376342 375094 373819 372266 370757 369601 368536
60769C68536j387j554j203p78r40j599j854r13Q92K182J907O31j01K88Q27O45
$$ 368536 367149 365595 364392 363614 362674 361075 359221 358308 359200 361382 363289 363920 363819 364107 364934 365579
60753C65579K67N48J080Q13j38m75M72J893K639K455J861J362J123J035R02O92
$$ 365579 365846 366394 367474 368287 368149 367674 368146 370039 372678 375133 376994 378356 379479 380514 381416 382108
60737C82108N49L86j33r58j447j280j060j318j470p92Q0j03j136j433l47R50J331
$$ 382108 382657 383043 382910 381952 380505 379225 378165 376847 375377 374585 374665 374562 373426 371993 371646 372596 373927
60720C73927J141J096J011N23R3J91K07o72j904k123j062P3K14m85j272j754j918
$$ 373927 375068 376164 377175 377698 377791 377982 378189 377517 375613 373490 372428 372501 372715 372230 370958 369204 367286
60703C67286j774j385r80q69j232j988k696k768k103j305r77r66p32l02k58q11
$$ 367286 365512 364127 363147 362278 361046 359058 356362 353594 351491 350186 349209 348243 347511 347209 346951 346140
60687C46140j452j673j515j167m99O02J745K288K063J546J347J672K283K745K786
$$ 346140 344688 343015 341500 340333 339834 340436 342181 344469 346532 348078 349425 351097 353380 356125 358911
60672C58911K529K345K433K523K130J084k17j096j145n82k9O6k32n59p17p31n85
$$ 358911 361440 363785 366218 368741 370871 371955 371738 370642 369497 368915 368886 368952 368720 368161 367444 366713 366128
60655C66128j79L95Q16R80J204J769K431K726K596K355K107J634Q82J74k78o81
$$ 366128 365949 366344 367160 368140 369344 371113 373544 376270 378866 381221 383328 384962 385844 386018 385740 385059
60639C85059j227j742k035k329k876l319l021j988j037q87j384j772j479n39N77
$$ 385059 383832 382090 380055 377726 374850 371531 368510 366522 365485 364598 363214 361442 359963 359424 360001
60624C60001J346J564J372R55L07n21j140j133o12j11J0j83m74n95j91P48J507
$$ 360001 361347 362911 364283 365238 365545 365024 363884 362751 362139 362028 362038 361855 361381 360786 360595 361343 362850
60607C62850J315M37m9K84P34O89M84N52N38M1m56k03O39J325J672K016K264J970
$$ 362850 364165 364602 364553 364837 365571 366260 366744 367296 367834 367875 367419 367216 367855 369180 370852 372868 375132 377102
60589C77102J331J163J717K327K343J821J110M62J71M67J050J301J183J285J839
$$ 377102 378433 379596 381313 383640 385983 387804 388914 389376 389547 390014 391064 392365 393548 394833 396672
60574C96672K431K867L541M508N031M735M507N483P499R372J0370J0667J0545
$$ 396672 399103 401970 405511 410019 415050 419785 424292 429775 437274 446646 457016 467683 478228
60561D78228R988R081Q097O956N186K695J85j481k080k115k309l077m118m431
$$ 478228 488216 497297 505394 512350 517536 520231 520416 518935 516855 514740 512431 509354 505236 500805
60547E00805l074k16K758M438M694M615N334P121R506J1896J3868J5217J6075
$$ 500805 497731 497515 500273 504711 509405 514020 519354 526475 535981 547877 561745 576962 593037
60534E93037J6862J7850J8664J8565J7283J5233J2779R738N913J787j877m879
$$ 593037 609899 627749 646413 664978 682261 697494 710273 720011 725924 727711 725834 720955
60522G20955p433r336j0007r528q876q747q719q091o991o050n315m249k699j133
$$ 720955 713522 704186 694179 684651 675775 667028 658309 650218 643227 637177 631862 627613 624914 623781
60508F23781J77J593L503N791Q277J1191J4711J8362K1445K4048K7076L1034L5307
$$ 623781 623958 625551 629054 634845 643122 654313 669024 687386 708831 732879 759955 790989 826296
60495H26296L8946M1785M4300M6489M7597M7059M5165M2438L8691L3257K5919
$$ 826296 865242 907027 951327 997816 1045413 1092472 1137637 1180075 1218766 1252023 1277942
60484A277942J7156P516k746j3315k3572l2908m0986m7499n1982n4169n4380n3209
$$ 1277942 1295098 1302614 1299868 1286553 1262981 1230073 1189087 1141588 1089606 1035437 981057 927848
60472I27848n1001m7854m4077m0262l6777l3451k9964k6416k3313k0952j9041
$$ 927848 876847 828993 784916 744654 707877 674426 644462 618046 594733 573781 554740
60461E54740j7098j5029j3103j1474j0033q788p979p578p044n962m691m007m094
$$ 554740 537642 522613 509510 498036 488003 479215 471236 463658 456614 450652 445961 441954 437860
60448D37860m312l937k886j713j099j362k141k638k394j799j522j589j405p03
$$ 437860 433548 429611 426725 425012 423913 422551 420410 417772 415378 413579 412057 410468 409063 408360
60434D08360M9K60r0o24j059j341j463j370r51j97N62P45J93m71n50k35k32n35
$$ 408360 408409 408669 408579 407955 406896 405555 404092 402722 401771 401574 402136 402881 403074 402603 402053 401818 401586 401051
60416D01051l31O58J601J710J365J429J948K210J861J324J143J454K034K555K657
$$ 401051 400720 401378 402979 404689 406054 407483 409431 411641 413502 414826 415969 417423 419457 422012 424669
60401D24669K191J428Q63P69J046J408J638J777K105K759L343L293K643K126K257
$$ 424669 426860 428288 429151 429920 430966 432374 434012 435789 437894 440653 443996 447289 449932 452058 454315
60386D54315K740K984K844K529K151J733J412J275J225J242J424J532J096L30
$$ 454315 457055 460039 462883 465412 467563 469296 470708 471983 473208 474450 475874 477406 478502 478832
60372D78832L15J573L002L127K073J302J540K045K039J774J819K122K375K671
$$ 478832 479147 480720 483722 486849 488922 490224 491764 493809 495848 497622 499441 501563 503938 506609
60358E06609L260M016M677N242N808O268O543O810P182P396P157O464N386L848
$$ 506609 509869 513885 518562 523804 529612 535880 542423 549233 556415 563811 570968 577432 582818 586666
60344E86666K038O19jl13j147k531l751m418m879n444n781n410m436l478l049
$$ 586666 588704 589323 589322 589009 587862 585331 581580 577162 572283 566839 561058 555648 551212 547734 544685
60329E44685l212l659l891l578k890k388k319k285j784r29k23K70J048K421M024
$$ 544685 541473 537814 533923 530345 527455 525067 522748 520463 518679 517750 517527 517797 518845 521266 525290
60314E25290N300O117O678P047P153P085P057P135P212P205P045O613N935N389
$$ 525290 530590 536707 543385 550432 557585 564670 571727 578862 586074 593279 600324 606937 612872 618261
60300F18261N321N485N215M157K559P93j034k962n007p232r571j1523j2403j2111
$$ 618261 623582 629067 634282 638439 640998 641791 640757 637795 632788 625556 615985 604462 592059 579948
60286E79948j1237j0233q925p177n533m684m552m465m085l671l501l531l629l737
$$ 579948 568711 558478 549553 542376 536843 532159 527607 523142 519057 515386 511885 508354 504725 500988
60272E00988l763l665l650l893m108l794l010k388k266k210j729j082j000j675
$$ 500988 497225 493560 489910 486017 481909 478115 475105 472717 470451 468241 466512 465430 464430 462755
60258D62755k443k541j865r37k75L2K35N78J036J268Q78q4q41m88R17K146K074
$$ 462755 460312 457771 455906 454969 454694 454726 454961 455539 456575 457843 458721 458637 457796 457308 458225 460371 462445
60241D62445R65M5j02k3k47m48j62K86K32k45l38M92J957L321L968L707K923K350
$$ 462445 463410 463455 463353 463330 463083 462635 462473 462759 462991 462746 462408 462900 464857 468178 472146 475853 478776 481126
60223D81126K368K639K649K418K353K654L223L951M588M695M229M002M799O196
$$ 481126 483494 486133 488782 491200 493553 496207 499430 503381 507969 512664 516893 520895 525694 531890
60209E31890O998O822O467O545O679O387O013O100O407O232N492M814M673M811
$$ 531890 538888 545710 552177 558722 565401 571788 577801 583901 590308 596540 602032 606846 611519 616330
60195F16330M604L674K214Q74K61L59N30J78p10j792k826l699m287m619n007n650
$$ 616330 620934 624608 626822 627696 627957 628316 628846 629024 628314 626522 623696 619997 615710 611091 606084 600434
60179F00434o206o079n183m125l587l689m030m177l984l521k870k075j264p12
$$ 600434 594228 588149 582966 578841 575254 571565 567535 563358 559374 555853 552983 550908 549644 548932
60165E48932o06q43j118j247j219j044p34m79n98j120j600j488p13K51Q87J058
$$ 548932 548326 547483 546365 545118 543899 542855 542121 541642 541044 539924 538324 536836 536123 536374 537261 538319
60149E38319R74P51K69m59r65o95K93J387K230L034L868M182L647L021L395M700
$$ 538319 539293 540044 540313 539854 538889 538194 538487 539874 542104 545138 549006 553188 556835 559856 563251 567951
60133E67951N752N809N311M947M769M582M496M547M359L734L157L094L258L151
$$ 567951 573703 579512 584823 589770 594539 599121 603617 608164 612523 616257 619414 622508 625766 628917
60119F28917K953L098L250K671J558J021J503K101J920J322J170J377J149L03
$$ 628917 631870 634968 638218 640889 642447 643468 644971 647072 648992 650314 651484 652861 654010 654313
60105F54313m79q30j244k104k874k853k281j974k089j953j241n14l54n08m44k45
$$ 654313 653834 653004 651760 649656 646782 643929 641648 639674 637585 635632 634391 633877 633523 633015 632571 632326
60089F32326l60o94p14l81k74o54j106j381j893k877l637l359k381j872k310l033
$$ 632326 631966 631272 630558 630177 629903 629249 628143 626762 624869 621992 618355 614996 612615 610743 608433 605400
60073F05400l421l737m495n529o271o565o657o571o091n305m655m355m246m298
$$ 605400 601979 598242 593747 588218 581947 575382 568725 562154 556063 550758 546103 541748 537502 533204
60059E33204m761n521n801m974l403j993j128m96J08M61M25L31N72J191K011K916
$$ 533204 528443 522922 517121 512147 508744 506751 505623 505127 505235 505696 506121 506452 507024 508215 510226 513142
60043E13142L777M428M809N029N116M998M732M511M312L945L431L038K722K072
$$ 513142 516919 521347 526156 531185 536301 541299 546031 550542 554854 558799 562230 565268 567990 570062
60029E70062R92o1q36j739l135m660n820o792q059r486j0383j0310r367p916o486
$$ 570062 571054 570993 570157 568418 565283 560623 554803 548011 539952 530466 520083 509773 500406 492490 486004
60014D86004n640n342m799l565k443k445l176l220k098q08k89l82o01r71j586
$$ 486004 480364 475022 470223 466658 464215 461770 458594 455374 453276 452468 452179 451797 451196 450225 448639
59999D48639k087k130j905j710j464j011m58J39R72K037K982L676M414N192N382
$$ 448639 446552 444422 442517 440807 439343 438332 437874 438013 438985 441022 444004 447680 452094 457286 462668
59984D62668M598L440K764K601K345J690P99k10j401k641l558l857l495k691j885
$$ 462668 467266 470706 473470 476071 478416 480106 480905 480695 479294 476653 473095 469238 465743 463052 461167
59969D61167j477j382j181q00n80m97L7J154J984J814J237J338K061K342J747
$$ 461167 459690 458308 457127 456327 455747 455250 455287 456441 458425 460239 461476 462814 464875 467217 468964
59954D68964J039R48J232J279R94O65L73j5m88q96j212j426j308n54O91J691J806
$$ 468964 470003 470951 472183 473462 474456 475121 475494 475479 474991 474095 472883 471457 470149 469595 470286 471977 473783
59937D73783J235Q26J049J497J662J803K499L538M020L621L027K847K794K315
$$ 473783 475018 475844 476893 478390 480052 481855 484354 487892 491912 495533 498560 501407 504201 506516
59923E06516J411L68p98j991k724k737k576k879l371l313k577j668q23P4Q77J197
$$ 506516 507927 508295 507497 505506 502782 500045 497469 494590 491219 487906 485329 483661 482838 482912 483789 484986
59907D84986J121J170J491J742J815K013K344K290J511L85m78p93o23j79K28M15
$$ 484986 486107 487277 488768 490510 492325 494338 496682 498972 500483 500868 500390 499597 498974 498795 499023 499438
59891D99438O36J266K127K610K549K498K954L796M670N403N757N319M149L145
$$ 499438 500074 501340 503467 506077 508626 511124 514078 517874 522544 527947 533704 539023 543172 546317
59877E46317L200M117M832M681M019L504L171K463J037p43k195l036l452l480
$$ 546317 549517 553634 558466 563147 567166 570670 573841 576304 577341 576598 574403 571367 567915 564435
59863E64435k797j438l37n16j684k361j623k75K34k87o08K64J861L023L418L844
$$ 564435 561638 560200 559863 559347 557663 555302 553679 553404 553638 553351 552743 553007 554868 557891 561309 565153
59847E65153N088O928Q460R065Q728P703O286M879L859L282K984L043L611M285
$$ 565153 570241 577169 585629 594694 603422 611125 617411 622290 626149 629431 632415 635458 639069 643354
59833F43354M220L198K082J668J566P85q08k314l019l155l369l931m668n316n709
$$ 643354 647574 650772 652854 654522 656088 656873 656065 653751 650732 647577 644208 640277 635609 630293 624584
59818F24584n808n662n275m652m063m020m604n145m970m313l949m042l975l327
$$ 624584 618776 613114 607839 603187 599124 595104 590500 585355 580385 576072 572123 568081 564106 560779
59804E60779k439j860j680j687j753j820j775j533j129o44k29j05l22n74n28l34
$$ 560779 558340 556480 554800 553113 551360 549540 547765 546232 545103 544459 544230 544125 543803 543229 542701 542367
59788E42367m13q27j179j152p84k20L71O68M60P8R5N36Q71Q59R02J313J745J665
$$ 542367 541954 541127 539948 538796 538012 537792 538163 538831 539291 539369 539464 540000 540871 541730 542632 543945 545690 547355
59770E47355J094N42M27P94J402J888K015J875J725J619J440J256J317J638J910
$$ 547355 548449 548991 549418 550212 551614 553502 555517 557392 559117 560736 562176 563432 564749 566387 568297
59755E68297J891J649J468J725K705M158N226N304M887M928N536O034O198O461
$$ 568297 570188 571837 573305 575030 577735 581893 587119 592423 597310 602238 607774 613808 620006 626467
59741F26467O767O267M716L163K666K938L051K763K381J780O56n24p69J38J244
$$ 626467 633234 639501 644217 647380 650046 652984 656035 658798 661179 662959 663615 663091 662322 662460 663704
59726F63704J529R15Q9k91r3L25N11L70J09j90o56j173j360j251j480k357l199
$$ 663704 665233 666148 666237 665946 665853 666178 666689 667059 667168 666978 666322 665149 663789 662538 661058 658701 655502
59709F55502l153k291j330n59K34R97J334J207J072J259J703K259K761K826K177
$$ 655502 652349 650058 648728 648169 648403 649400 650734 651941 653013 654272 655975 658234 660995 663821 665998
59694F65998J274R44J321J754J862K017K463K741K474K148K389K808K331P05j007
$$ 665998 667272 668216 669537 671291 673153 675170 677633 680374 682848 684996 687385 690193 692524 693229 692222
59679F92222j614j082l76l36r87j835k491k928l301l696m015m123m065m132m543
$$ 692222 690608 689526 689150 688814 687827 685992 683501 680573 677272 673576 669561 665438 661373 657241 652698
59664F52698n055n097m451l631l296l424l341k616j528o07n9J83J73k5k34l28
$$ 652698 647643 642546 638095 634464 631168 627744 624403 621787 620259 619652 619593 619776 619949 619924 619690 619362
59648F19362l80m90o43q04j012j254j527k076l196m609n510n480m980m575m127
$$ 619362 618982 618492 617849 617045 616033 614779 613252 611176 607980 603371 597861 592381 587401 582826 578699
59633E78699l275k326k003k481l278l998m540m629l913k675j865k103l003l779
$$ 578699 575424 573098 571095 568614 565336 561338 556798 552169 548256 545581 543716 541613 538610 534831
59619E34831m083m061l893l613l195k666k191k042k257k400j958j012r9N96J383
$$ 534831 530748 526687 522794 519181 515986 513320 511129 509087 506830 504430 502472 501460 501361 501957 503340
59604E03340K260K591J976J011O69J149J803K045J846J426R60O90R18J604K246
$$ 503340 505600 508191 510167 511178 511847 512996 514799 516844 518690 520116 521076 521766 522684 524288 526534
59589E26534K321J808J217J101J576K185K271J565M80l21o14p87j245j821j978
$$ 526534 528855 530663 531880 532981 534557 536742 539013 540578 541058 540737 540123 539336 538091 536270 534292
59574E34292j531j007j088j829k594k778k410j946j693j652j760j948j975j610
$$ 534292 532761 531754 530666 528837 526243 523465 521055 519109 517416 515764 514004 512056 510081 508471
59560E08471j055q55j154j377j019m50m34r52j108l60O84J147J076J310K288L564
$$ 508471 507416 506561 505407 504030 503011 502561 502127 501175 500067 499707 500391 501538 502614 503924 506212 509776
59544E09776M537N168N758O428P062P610Q174Q990J0330J2205J3927J4307J2658
$$ 509776 514313 519481 525239 531667 538729 546339 554513 563503 573833 586038 599965 614272 626930
59531F26930R511O027K902K05j945l171l394l089k732k318j697j045p15p70r28
$$ 626930 636441 642468 645370 645575 643630 640459 637065 633976 631244 628926 627229 626184 625469 624699 623771
59516F23771r34q04p76j146k034l259m555n846p139q142q417p981p330o738n931
$$ 623771 622837 622033 621257 620111 618077 614818 610263 604417 597278 589136 580719 572738 565408 558670 552739
59501E52739m810l943l844m090l847l048k374k125j856j249o15k37J64Q09J295
$$ 552739 547929 543986 540142 536052 532205 529157 526783 524658 522802 521553 520938 520701 520865 521674 522969
59486E22969J213J011J426K291K639K110J484J507J837J740J357J503K384L258
$$ 522969 524182 525193 526619 528910 531549 533659 535143 536650 538487 540227 541584 543087 545471 548729
59472E48729L547L528L594L374K299P03l21k10M90R43R50R13J216J911K729L195
$$ 548729 552276 555804 559398 562772 565071 565774 565453 565243 565733 566676 567626 568539 569755 571666 574395 577590
59456E77590L002K491K506L416M529M850M327L870M092M514M284L298K225J515
$$ 577590 580592 583083 585589 589005 593534 598384 602711 606581 610673 615187 619471 622769 624994 626509
59442F26509Q65k08j554k505k676k415k376k782l235l129k255j047j93J04L54
$$ 626509 627374 627166 625612 623107 620431 618016 615640 612858 609623 606494 604239 603192 602999 603103 603457
59427F03457J101K109K705K852L342M749O717Q660J0547J2543J4332J5456J6035
$$ 603457 604558 606667 609372 612224 615566 620315 627032 635692 646239 658782 673114 688570 704605
59414G04605J6518J6992J7475J8490K0327K1860K1183J7733J2853Q019L515p51
$$ 704605 721123 738115 755590 774080 794407 816267 837450 855183 868036 876055 879570 878819
59402H78819m097n584n080l113j93L006N286N590L875Q61k821o751j0323j3018
$$ 878819 874722 869138 864058 860945 860752 863758 869044 874634 878509 879370 876549 869798 859475 846457
59388H46457j4833j5974j6297j5562j4037j2258j0410q510o930o062n587m850
$$ 846457 831624 815650 799353 783791 769754 757496 747086 738576 731646 725584 719997 715147
59376G15147l936l623m174m776m459l103j369n8L46l1m33j03R02J745J809J366
$$ 715147 711211 707588 703414 698638 694179 691076 689707 689649 689995 689964 689531 689428 690330 692075 693884 695250
59360F95250J145J544K411L368M158M810N548O548P745Q949J0025J0895J1565
$$ 695250 696395 697939 700350 703718 707876 712686 718234 724782 732527 741476 751501 762396 773961
59347G73961J2189J2916J3536J3628J3238J2951J2994J2710J1429R419P308N043
$$ 773961 786150 799066 812602 826230 839468 852419 865413 878123 889552 898971 906279 911322
59335I11322K225p77l050m525o187q611j1081j2580j3026j3117j3393j3900j4432
$$ 911322 913547 912770 909720 905195 899008 890397 879316 866736 853710 840593 827200 813300 798868
59322G98868j4755j4704j4319j3717j2818j1547j0267r536r297q814p652o256
$$ 798868 784113 769409 755090 741373 728555 717008 706741 697205 687908 679094 671442 665186
59310F65186n271m731m267l731l156k395j224K59J736L014M126N155O159P092
$$ 665186 659915 655184 650917 647186 644030 641635 640411 640670 642406 645420 649546 654701 660860 667952
59296F67952P628P219N519K669q90m657p963j0031j0527r915q969p942o527m572
$$ 667952 675580 682799 688318 690987 690097 685440 677477 667446 656919 647004 638035 630093 623566 618994
59282F18994k553j194o93m76L06J951L914N377O085O540P386Q693R933J0559J0549
$$ 618994 616441 615247 614554 614078 614384 616335 620249 625626 631711 638251 645637 654330 664263 674822 685371
59267F85371J0352J0325J0301R878R003Q014P093O023M686L368K292J152l76j908
$$ 685371 695723 706048 716349 726227 735230 743244 750337 756360 761046 764414 766706 767858 767482 765574
59253G65574k654k399j750j349j312j369j222p23k7M04L12M0R2L44K16m59j203
$$ 765574 762920 760521 758771 757422 756110 754741 753519 752796 752769 753173 753485 753525 753617 753961 754177 753718 752515
59236G52515j534j398r44m34m25j421l123m540n067n116n407o126o987p741q261
$$ 752515 750981 749583 748639 748205 747780 746359 743236 738696 733629 728513 723106 716980 709993 702252 693991
59221F93991q466q426q311q076p482o583n803n364n011m543m144l872l277k068
$$ 693991 685525 677099 668788 660712 653230 646647 640844 635480 630469 625926 621782 617910 614633 612565
59207F12565p98l11n79o86j9J022J698J926K233K873L414L356K841K412K230J952
$$ 612565 611767 611456 610877 610191 610172 611194 612892 614818 617051 619924 623338 626694 629535 631947 634177 636129
59191F36129J485J266J592K085K246K167K170K118J656R40M85M14M12L51L03N4
$$ 636129 637614 638880 640472 642557 644803 646970 649140 651258 652914 653854 654339 654753 655165 655516 655819 655873
59175F55873o69j523j818j524j284j344j202n90J7J36q0k74m06n37o28q02j282
$$ 655873 655204 653681 651863 650339 649055 647711 646509 645919 645936 646072 645992 645718 645312 644775 644147 643345 642063
59158F42063j800j762j262j245k306l846m901n226n167n036n130n780o837p510
$$ 642063 640263 638501 637239 635994 633688 629842 624941 619715 614548 609512 604382 598602 591765 584255
59144E84255p224o292n365m627m017l711l858m141m128l811l415k955k392j866
$$ 584255 577031 570739 565374 560747 556730 553019 549161 545020 540892 537081 533666 530711 528319 526453
59130E26453j473j099p26n03k63M60J693K839L616M440N520O306O440O524P237
$$ 526453 524980 523881 523155 522652 522389 522849 524542 527381 530997 535437 540957 547263 553703 560227 567464
59115E67464Q320R143R683J0126J0113R338Q407Q101Q160P755O846O064N510M717
$$ 567464 575784 584927 594610 604736 614849 624187 632594 640695 648855 656610 663456 669520 675030 679747
59101F79747L708L013K643K023J010J22l96q51j399j868k368l230m149m233l239
$$ 679747 683455 686468 689111 691134 692144 692266 691870 691019 689620 687752 685384 682154 678005 673772 670533
59086F70533j984j282j084r41p75p93j177k063l390m601n022m733m558m971n518
$$ 670533 668549 667267 666183 665242 664467 663674 662497 660434 657044 652443 647421 642688 638130 633159 627641
59071F27641n503m842l980l439l526m129m626m419l701l290l532l939m017l834
$$ 627641 622138 617296 613316 609877 606351 602222 597596 593177 589476 586186 582654 578715 574698 570864
59057E70864l587l169k586k251k364k420j891j121r45j500j946j502m06M08M13
$$ 570864 567277 564108 561522 559271 556907 554487 552596 551475 550530 549030 547084 545582 545176 545584 545997
59042E45997k5k78k84m23o87m44O79K107K881K738K225J939K071K593L403M287
$$ 545997 545972 545694 545410 544987 544300 543856 544535 546642 549523 552261 554486 556425 558496 561089 564492 568779
59026E68779N079N850O687P390P770Q111Q892J0064J0998J1119J0278Q651O638
$$ 568779 573858 579708 586395 593785 601555 609666 618558 628622 639620 650739 661017 669668 676306
59013F76306M799L434K252Q32o80j704k007j964k045k344k477j796lK099L034
$$ 676306 681105 684539 686791 687623 686943 685239 683232 681268 679223 676879 674402 672606 672603 674702 677736
58998F77736K371J470J726K650K702J632O44L54K8q79j765j979j775j557j153
$$ 677736 680107 681577 683303 685953 688655 690287 690931 691285 691313 690434 688669 686690 684915 683358 682205
58983F82205n23k57o30r44m87M98J559K946M875O585P137O805O682P160P745Q175
$$ 682205 681682 681425 680795 679851 679364 679862 681421 684367 689242 695827 702964 709769 716451 723611 731356 739531
58967G39531Q729R450R942R994R746R150Q023O721N968N750N114L413J170p07
$$ 739531 748260 757710 767652 777646 787392 796542 804565 811286 817254 823004 828118 831531 832701 831994
58953H31994k099l569n466p643r788j1529j2349j2084j1483j1671j2728j3363
$$ 831994 829895 826326 820860 813217 803429 791900 779551 767467 755984 744313 731585 718222
58941G18222j2388j0175q122o907o033n030m211l873l471k356r35k97p72j540
$$ 718222 705834 695659 687537 680630 674597 669567 665356 661483 658012 655656 654721 654424 653652 652112
58927F52112j699j133k45N79R91P03j58j010j397j434j501j747k045k196k018
$$ 652112 650413 649280 649035 649614 650605 651308 651150 650140 648743 647309 645808 644061 642016 639820 637802
58912F37802j415n14L98J162J874K661L510M326N009N566O216P244Q591R768J0457
$$ 637802 636387 635873 636271 637433 639307 641968 645478 649804 654813 660379 666595 673839 682430 692198 702655
58897G02655J0882J1303J1492J1248J1087J1643J2646J3289J3534J4076J4931
$$ 702655 713537 724840 736332 747580 758667 770310 782956 796245 809779 823855 838786
58886H38786J5133J4203J2950J2242J1736J0599Q856P190N746M039J896k05j830
$$ 838786 853919 868122 881072 893314 905050 915649 924505 931695 937441 941480 943376 943171 941341
58873I41341l141m554o155p537q193q069p707p592p493o846n735m967m999n420
$$ 941341 938200 933646 927491 919954 911761 903692 895985 888393 880900 874054 868319 863352 858353 852933
58859H52933n777o264p128p938q051p538p072p112p596q247q709q635q053p485
$$ 852933 847156 840892 833764 825826 817775 810237 803165 796053 788457 780210 771501 762866 754813 747328
58845G47328p301p277p107p084p692q738r437r285q403p151n939n297n497o050
$$ 747328 740027 732750 725643 718559 710867 702129 692692 683407 675004 667853 661914 656617 651120 645070
58831F45070o083n331m363l705l228k526j610q18l12J17P16J446K045K409K736
$$ 645070 638987 633656 629293 625588 622360 619834 618224 617406 617094 617211 617927 619373 621418 623827 626563
58816F26563L199L552L395K819K418K416K288J637J017J234K011K120R72n83j418
$$ 626563 629762 633314 636709 639528 641946 644362 646650 648287 649304 650538 652549 654669 655641 655058 653640
58801F53640j505j659k276k959l374l781m465n069m958m092l164k779k828k777
$$ 653640 652135 650476 648200 645241 641867 638086 633621 628552 623594 619502 616338 613559 610731 607954
58787F07954k339j711j272j179j156o40O35K153K959K694J988J625J675J674J366
$$ 607954 605615 603904 602632 601453 600297 599657 600292 602445 605404 608098 610086 611711 613386 615060 616426
58772F16426Q06oj076k171l051l850m788n599n801n405m838m238l419k452j706
$$ 616426 617232 617226 616150 613979 610928 607078 602290 596691 590890 585485 580647 576409 572990 570538 568832
58757E68832j231o73P6P28J121J397J555J430J209J303J620J609J229J169J816
$$ 568832 567601 566928 567004 567732 568853 570250 571805 573235 574444 575747 577367 578976 580205 581374 583190
58742E83190K672L195L569M173M869N268N307N110M728M383M498N078N525N472
$$ 583190 585862 589057 592626 596799 601668 606936 612243 617353 622081 626464 630962 636040 641565 647037
58728F47037N321N537N877N829N386M886M414L989L913M353M812M693M220M202
$$ 647037 652358 657895 663772 669601 674987 679873 684287 688276 692189 696542 701354 706047 710267 714469
58714G14469M937N866O316O128N507M616L476K053L80j403l119m711o187p529
$$ 714469 719406 725272 731588 737716 743223 747839 751315 753368 753748 752345 749226 744515 738328 730799
58700G30799q830j0384j2287j4052j5083j5423j5500j5205j3993j1937r901q507
$$ 730799 721969 711585 699298 685246 670163 654740 639240 624035 610042 598105 588204 579697
58688E79697p640p189p357p866p809o812n574m657l666k257j092q47j029p34k9
$$ 579697 572057 564868 557511 549645 541836 535024 529450 524793 521127 518870 517778 516931 515902 515168 515139
58673E15139M15O25J160J967K487K708L207M206N432O844Q558J0093J0563R757
$$ 515139 515554 516179 517339 519306 521793 524501 527708 531914 537346 544190 552748 562841 573404 583161
58659E83161Q338O860N237L331J381l42j826l074l999m662n234n652n697n437
$$ 583161 591499 598359 603596 606927 608308 607966 606140 603066 599067 594405 589171 583519 577822 572385
58645E72385n228n203n083m616l921l292k862k502k009j392r20p49n96j15N21
$$ 572385 567157 561954 556871 552255 548334 545042 542180 539678 537669 536277 535357 534608 534012 533897 534418
58630E34418Q18P18N84L89l34j500k215j853q45N9O33R64J074J210J807K712L159
$$ 534418 535236 535954 536538 536927 536593 535093 532878 531025 530180 530239 530872 531836 532910 534120 535927 538639 541798
58613E41798K980K993L672M337M304L965L841L613K983K593K949L236K539J477
$$ 541798 544778 547771 551443 555780 560084 564049 567890 571503 574486 577079 580028 583264 585803 587280
58599E87280J215J511J200K42l30k93m80j163j535j021O7J285K450L305L815M695
$$ 587280 588495 590006 591206 591448 591118 590825 590345 589182 587647 586626 586693 587978 590428 593733 597548 602243
58583F02243O493Q405R128Q816Q759R220R109Q028P100P249P936Q205Q001P840
$$ 602243 608736 617141 626269 635085 643844 653064 662173 670201 677301 684550 692486 700691 708692 716532
58569G16532Q119R141J1008J3113J4617J5677J7290J9701K1942K3288K4081K4654
$$ 716532 724651 733792 744800 757913 772530 788207 805497 825198 847140 870428 894509 919163
58557I19163K4521K3199K0958J8184J4835J1063P586M841K428j10k629m873o923
$$ 919163 943684 966883 987841 1006025 1020860 1031923 1039509 1044350 1046778 1046668 1044039 1039166 1032243
58544A032243q669r546r353q813q910j0105j2399j5439j8332k0140k0858k1258
$$ 1032243 1023574 1014028 1004675 995862 986952 976847 964448 949009 930677 910537 889679 868421
58532H68421k1481k0708j8641j6331j4892j4082j2898j0967q719o699n315m800
$$ 868421 846940 826232 807591 791260 776368 762286 749388 738421 729702 723003 717688 712888
58520G12888m815m548l670k862k864l438l717l267k422j813j811k213k282j483
$$ 712888 708073 703525 699855 696993 694129 690691 686974 683707 681285 679472 677661 675448 673166 671683
58506F71683l54o6r53k044k300j755j089o33l24j59j83j72K50J220K465L499M004
$$ 671683 671329 671263 670310 668266 665966 664211 663122 662489 662165 662006 661823 661651 661901 663121 665586 669085 673089
58489F73089M202M684N652O619P137P478Q081Q846R602J0731J2404J3746J3914
$$ 673089 677291 681975 687627 694246 701383 708861 716942 725788 735390 746121 758525 772271 786185
58476G86185J3612J4104J4930J4191J1329Q006N739M124K085l98k775m961o953
$$ 786185 799797 813901 828831 843022 854351 862357 868096 872220 874305 873907 871132 866171 859218
58463H59218q124p967p001o127n415m164j946Q50L337M793N343N985P449R076
$$ 859218 851094 843127 836126 829999 824584 820420 818474 819324 822661 827454 832797 838782 846231 855307
58449H55307R413P934N409K711J05k259m180n853p610r047r348q574p610o764
$$ 855307 864720 872654 878063 880774 880879 878620 874440 868587 860977 851930 842582 834008 826398 819634
58435H19634n557m022k912k353j536k07Q20J121J432K459L913N341O687P663P615
$$ 819634 814077 810055 807143 804790 803254 803047 803867 804988 806420 808879 812792 818133 824820 832483 840098
58420H40098O595N451M461K960P85j230k663m074n630o547o605o718p206p054
$$ 840098 846693 852144 856605 859565 860350 859120 856457 852383 846753 840206 833601 826883 819677 812623
58406H12623n786m614m526m637l766k410j755j733j507r65l66P39K751M804N554
$$ 812623 806837 802223 797697 793060 789294 786884 785129 783396 781889 780924 780558 781297 784048 788852 794406
58391G94406M888L805L110L027L520M150M134L357K716K831L157L091K969L244
$$ 794406 799294 803099 806209 809236 812756 816906 821040 824397 827113 829944 833101 836192 839161 842405
58377H42405L570L636L945M831N592N637N586O267P364Q083Q423Q846R332R661
$$ 842405 845975 849611 853556 858387 863979 869616 875202 881469 888833 896916 905339 914185 923517 933178
58363I33178R965J0347J0541J0584J0928J1461J1403J0671J0100R768Q596O408
$$ 933178 943143 953490 964031 974615 985543 997004 1008407 1019078 1029178 1038946 1047542 1053950
58351A053950M758M664N003M389L206K507K271K135K607M072N728O797P740R028
$$ 1053950 1058708 1063372 1068375 1072764 1075970 1078477 1080748 1082883 1085490 1089562 1095290 1102087 1109827 1118855
58337A118855R972J0078J0276J1417J2850J3788J4741J6075J6611J5345J3284
$$ 1118855 1128827 1138905 1149181 1160598 1173448 1187236 1201977 1218052 1234663 1250008 1263292
58326A263292J1907J0967R500P827O777O063N094M388M540M956N047N422O413
$$ 1263292 1275199 1286166 1295666 1303493 1310270 1316333 1321427 1325815 1330355 1335311 1340358 1345780 1352193
58313A352193O961O632P030R336J2045J3207J3300J3746J4256J4062J4127J5565
$$ 1352193 1359154 1365786 1372816 1382152 1394197 1407404 1420704 1434450 1448706 1462768 1476895 1492460
58301A492460J7269J7682J7558J8320J9141J8542J7579J8284K0044K0675K0210
$$ 1492460 1509729 1527411 1544969 1563289 1582430 1600972 1618551 1636835 1656879 1677554 1697764
58290A697764K0440K1458K1776K1414K1814K3043K3941K4675K6383K8697L0233
$$ 1697764 1718204 1739662 1761438 1782852 1804666 1827709 1851650 1876325 1902708 1931405 1961638
58279A961638L1036L2049L2942L3108L3837L6554L9832M1189M0943M1233M2204
$$ 1961638 1992674 2024723 2057665 2090773 2124610 2161164 2200996 2242185 2283128 2324361 2366565
58268B366565M2594M3129M5565M9016N1029N1928N4314N8471O2111O4580O7500
$$ 2366565 2409159 2452288 2497853 2546869 2597898 2649826 2704140 2762611 2824722 2889302 2956802
58257B956802P1131P3752P5019P6509P8712Q0651Q2430Q5060Q7879Q9478R0865
$$ 2956802 3027933 3101685 3176704 3253213 3331925 3412576 3495006 3580066 3667945 3757423 3848288
58246C848288R4322R9515J04221J08398J13945J20933J27876J35105J43990J53571
$$ 3848288 3942610 4042125 4146346 4254744 4368689 4489622 4617498 4752603 4896593 5050164
58236E050164J62002J70479J81484J94076K05518K16531K30018K45581K60672
$$ 5050164 5212166 5382645 5564129 5758205 5963723 6180254 6410272 6655853 6916525
58227F916525K76180K95278L17531L40068L63814L92336M25209M59188M95354
$$ 6916525 7192705 7487983 7805514 8145582 8509396 8901732 9326941 9786129 10281483
58218A0281483N38167N87937O41539P00287P69358Q49674R38591J038784J158049
$$ 10281483 10819650 11407587 12049126 12749413 13518771 14368445 15307036 16345820 17503869
58209A7503869J300330J466189J662620J903098K197642K552936K982626L506559
$$ 17503869 18804199 20270388 21933008 23836106 26033748 28586684 31569310 35075869
58201C5075869M139630M893424N788981O853339Q101010R532452J1150884J2961266
$$ 35075869 39215499 44108923 49897904 56751243 64852253 74384705 85535589 98496855
58193I8496855J4947973J7074885J9320613K1697697K4210919K6762429K9033945
$$ 98496855 113444828 130519713 149840326 171538023 195748942 222511371 251545316
58186B51545316L0405034L0032552K7175994K1612544J3803162M668824m767691
$$ 251545316 281950350 311982902 339158896 360771440 374574602 379243426 374475735
58179C74475735j3554198k0824884k5916685k8610685k9219816k8364049k6639374
$$ 374475735 360921537 340096653 314179968 285569283 256349467 227985418 201346044
58172B01346044k4463347k2109785j9761650j7515002j5398928j3429085j1632076
$$ 201346044 176882697 154772912 135011262 117496260 102097332 88668247 77036171
58165G7036171j0023973q597979p343239o255945n326425m533675l859500l294435
$$ 77036171 67012198 58414219 51070980 44815035 39488610 34954935 31095435 27801000
58157B7801000k825915k434055k103495j828111j600779j409210j244924j106495
$$ 27801000 24975085 22541030 20437535 18609424 17008645 15599435 14354511 13248016
58149A3248016r90719q89551p98283p18376o49694n87696n30393m80435m38068
$$ 13248016 12257297 11367746 10569463 9851087 9201393 8613697 8083304 7602869 7164801
58140G164801l99053l61786l29649l04204k82321k61992k44920k31407k18400
$$ 7164801 6765748 6403962 6074313 5770109 5487788 5225796 4980876 4749469 4531069
58131D531069k04562j91942j81053j69533j57085j46480j38224j29504j19780
$$ 4531069 4326507 4134565 3953512 3783979 3626894 3480414 3342190 3212686 3092906
58122C092906j12163j07583j02811r6080q9642q4858p9680p3119o7553o4268o1016
$$ 3092906 2980743 2873160 2770349 2674269 2584627 2499769 2420089 2346970 2279417 2215149 2154133
58111B154133n6298n2017m9583m7270m3902m1479m1631m2698m2653m2047m1961
$$ 2154133 2097835 2045818 1996235 1948965 1905063 1863584 1821953 1779255 1736602 1694555 1652594
58100A652594m1817m1246m1353m2340m2443m0833l8927l7415l4957l1298k8623
$$ 1652594 1610777 1569531 1528178 1485838 1443395 1402562 1363635 1326220 1291263 1259965 1231342
58089A231342k7914k6956k3977k0585j8936j8501j7725j6657j5885j4963j3919
$$ 1231342 1203428 1176472 1152495 1131910 1112974 1094473 1076748 1060091 1044206 1029243 1015324
58078A015324j4243j6390j8224j7794j5989j4676j4030j3442j3274j3805j3980
$$ 1015324 1001081 984691 966467 948673 932684 918008 903978 890536 877262 863457 849477
58067H49477j2970j1644j1008j0561r651q905q879q783q002p436p858q382q129
$$ 849477 836507 824863 813855 803294 793643 784738 775859 767076 759074 751638 743780 735398 727269
58054G27269p926q828j0122j0509j0085r707r349q573p693p143o508n407m497
$$ 727269 719343 710515 700393 689884 679799 670092 660743 652170 644477 637334 630826 625419 620922
58041F20922m479m940n199n428n986o463o391n992n483m578l472l250m376n800
$$ 620922 616443 611503 606304 600876 594890 588427 582036 576044 570561 565983 562511 559261 554885 549085
58027E49085o428o524o792p168p272p111o610n456m101l740m554n206m785l985
$$ 549085 542657 536133 529341 522173 514901 507790 501180 495724 491623 487883 483329 478123 473338 469353
58013D69353l539k964j886j191j644k520k777k511k190j531l27O65Q55Q45J235
$$ 469353 465814 462850 460964 459773 458129 455609 452832 450321 448131 446600 446273 446938 447793 448638 449873
57998D49873J442R07M10Q56J630J534O36j14n13j046j783k379k756k850k224q93
$$ 449873 451315 452222 452632 453488 455118 456652 457288 457174 456661 455615 453832 451453 448697 445847 443623 442730
57982D42730J27m0r55j707k118k330k042j261j014k062l488l737k689j587j239
$$ 442730 442857 442817 441862 440155 438037 435707 433665 432404 431390 429328 425840 422103 419414 417827 416588
57967D16588j259r73k62M34N05j65p78m28N06O74k19r39p29m77j048j787j792
$$ 416588 415329 414356 414094 414528 415033 414868 414090 413662 414168 414842 414623 413684 412955 412478 411430 409643 407851
57950D07851j553j965k673k730k206j853j667j074n4R66J934K997L992M849N845
$$ 407851 406298 404333 401660 398930 396724 394871 393204 392130 392076 393042 394976 397973 401965 406814 412659
57935D12659O766O696N614N058O006P099O464M372K510J293k59k385m143n093
$$ 412659 419425 426121 431735 436793 442799 449898 456362 460734 463244 464537 464278 461893 457750 452657
57921D52657n796o526o868o768o769p023p117p002p044p140o670n505m200l152
$$ 452657 446861 440335 433467 426699 419930 412907 405790 398788 391744 384604 377934 372429 368229 365077
57907C65077k335j792j628j590j346j073j053j031p23o10j278k283k611k080j318
$$ 365077 362742 360950 359322 357732 356386 355313 354260 353229 352506 351896 350618 348335 345724 343644 342326
57892C42326o28J26P67R23Q34J001J234R89M16J18P9q0q7N20J072L98j272k369
$$ 342326 341698 341824 342591 343514 344348 345349 346583 347572 347988 348106 348185 348105 348018 348538 349610 350008 348736 346367
57874C46367k184j596j316q30K86J311J481J210J344J890K268K311K257K212K230
$$ 346367 344183 342587 341271 340441 340727 342038 343519 344729 346073 347963 350231 352542 354799 357011 359241
57859C59241K666L849N501O888P513P455P159O999O956O679N946M936L921K914
$$ 359241 361907 365756 371257 378145 385658 393113 400272 407271 414227 420906 426852 431788 435709 438623
57845D38623J846Q39o0j125k470l630m074l944l720l476l058k707k819l235l421
$$ 438623 440469 441308 441248 440123 437653 434023 429949 426005 422285 418809 415751 413044 410225 406990 403569
57830D03569l220k793k076j003q2M3m44p34n24j91J07O73J532K209K373K136J672
$$ 403569 400349 397556 395480 394477 394395 394438 393994 393260 392736 392545 392652 393325 394857 397066 399439 401575 403247
57813D03247J097P28P54P45P8j089j974k302k571l148l789m160m188l813l027
$$ 403247 404344 405072 405826 406571 406649 405560 403586 401284 398713 395565 391776 387616 383428 379615 376588
57798C76588k236j980k225k397k147j597j002p02j161k262k844j935l21K26o74
$$ 376588 374352 372372 370147 367750 365603 364006 363004 362302 361141 358879 356035 354100 353779 354005 353331
57783C53331j513j047K25J100J235J091J084J401K086K800L006K663K236J820
$$ 353331 351818 350771 350996 352096 353331 354422 355506 356907 358993 361793 364799 367462 369698 371518
57769C71518R66l46j361j636j747k339l146l567l660l864m130m069l702l434l384
$$ 371518 372484 372138 370777 369141 367394 365055 361909 358342 354682 350818 346688 342619 338917 335483 332099
57754C32099l272k967k602k162j319Q0J559K293J931J017L93K97M34P95J700K796
$$ 332099 328827 325860 323258 321096 319777 319857 321416 323709 325640 326657 327050 327347 327781 328576 330276 333072
57738C33072K974J855O79P74J764K350K315K465K875K700J859J367J701K059J836
$$ 333072 336046 337901 338580 339354 341118 343468 345783 348248 351123 353823 355682 357049 358750 360809 362645
57723C62645J556J745J962J709J384J484J666J380Q38M60P4o31j326j545j546
$$ 362645 364201 365946 367908 369617 371001 372485 374151 375531 376369 376829 376903 376272 374946 373401 371855
57708C71855j966k868l754m274m376m073l513k999k550j840r30n21r72j576j448
$$ 371855 369889 367021 363267 358993 354617 350544 347031 344032 341482 339642 338712 338191 337219 335643 334195
57693C34195p11j55q3j30K4M13J061J955K816L404L901M665N659O523P095P551
$$ 334195 333484 333329 333246 333116 333140 333553 334614 336569 339385 342789 346690 351355 357014 363537 370632 378183
57677C78183Q250R535J1545J3963J6329J8695K1546K4895K8045L0548L2795L5173
$$ 378183 386433 395968 407513 421476 437805 456500 478046 502941 530986 561534 594329 629502
57665F29502L7122L7443L5113K9469K0295Q393m409j6413k6808l4905l9546m0230
$$ 629502 666624 704067 739180 768649 788944 797337 792928 776515 749707 714802 675256 635026
57653F35026l8264l5666l3141l0092k6329k2674j9787j7470j5390j3644j2263
$$ 635026 596762 561096 527955 497863 471534 448860 429073 411603 396213 382569 370306
57642C70306j0823q978o924n088l677k741k294k196k158k042j934j892j885j947
$$ 370306 359483 350505 343581 338493 334816 332075 329781 327585 325427 323385 321451 319559 317674 315727
57628C15727k091k070j594q07k23j12k82n15q33j293j712j898j928k032k241k276
$$ 315727 313636 311566 309972 309165 308942 308830 308548 308033 307200 305907 304195 302297 300369 298337 296096 293820
57612B93820j871j175o54m55r2Q68J881J822M16j249j973j756j361j100o52Q6
$$ 293820 291949 290774 290120 289665 289573 290441 292322 294144 294560 293311 291338 289582 288221 287121 286469 286555
57596B86555O48N49j34q29r45m44j3l63j229j514p25K26K23o02j300j553j828
$$ 286555 287203 287752 287618 286789 285844 285400 285387 285024 283795 282281 281556 281782 282005 281403 280103 278550 276722
57579B76722k212k114j312m99m51j112j824k090j798j097l04K69N21N25K95j93
$$ 276722 274510 272396 271084 270585 270134 269022 267198 265108 263310 262213 261909 262178 262699 263224 263519 263326
57563B63326p35r80p81k75L16O96M67m50j367j402n07M92J009J297J738K088J944
$$ 263326 262591 261611 260830 260555 260871 261567 262034 261584 260217 258815 258308 258800 259809 261106 262844 264932 266876
57546B66876J545J480J724J586P56o8N0J166K443L070K865K031Q55k15o40l47
$$ 266876 268421 269901 271625 273211 273967 273899 273949 275115 277558 280628 283493 285524 286379 286164 285524 285177
57530B85177K7r3m35l45J67M40K41J25N15J047J175R30O82N60N29P05J093J301
$$ 285177 285204 285111 284676 284331 284498 284938 285179 285304 285819 286866 288041 288971 289653 290213 290742 291447 292540 293841
57512B93841R66L15n7R0M44O04N20N47J079J990K490J943Q13K28N46R71P94K69
$$ 293841 294807 295122 295065 295155 295599 296203 296723 297270 298349 300339 302829 304772 305585 305813 306359 307330 308124 308393
57494C08393j52o44j439k111k148j787j528j249n79J78L58m3l91l24M7N80J087
$$ 308393 308241 307597 306158 304047 301899 300112 298584 297335 296756 296934 297292 297249 296858 296534 296581 297161 298248
57477B98248J108M78m6L94J460J902J152j19j007j182o30M79J499J604P16l25
$$ 298248 299356 299834 299788 300182 301642 303544 304696 304577 303570 302388 301758 302237 303736 305340 306056 305731
57461C05731o63j25Q94J751J823J044K02R9N56P73N23K57K03K31N06J305K125
$$ 305731 305068 304943 305837 307588 309411 310455 310657 310756 311312 312085 312608 312865 313068 313299 313805 315110 317235
57444C17235K016J015K73M51R51J112J171J511J821J656J193P76L41j49k74K15
$$ 317235 319251 320266 320539 320990 321941 323053 324224 325735 327556 329212 330405 331181 331522 331373 331099 331314
57428C31314Q48J094J111J286J511J454J194J013J005J345K409L938M650L568
$$ 331314 332162 333256 334367 335653 337164 338618 339812 340825 341830 343175 345584 349522 354172 357740
57414C57740J528M13R54K071K464K079J724J808K025K040J980K143K429K386J864
$$ 357740 359268 359681 360635 362706 365170 367249 368973 370781 372806 374846 376826 378969 381398 383784 385648
57399C85648J320J211J329J181Q96J114J941K606K464J787J243J148J526K383
$$ 385648 386968 388179 389508 390689 391585 392699 394640 397246 399710 401497 402740 403888 405414 407797
57385D07797L418L912L478K660K296K480K691K668K676K919L207L281L141K993
$$ 407797 411215 415127 418605 421265 423561 426041 428732 431400 434076 436995 440202 443483 446624 449617
57371D49617K983L046K960K653K386K416K542K409K204K565L557M423M585M375
$$ 449617 452600 455646 458606 461259 463645 466061 468603 471012 473216 475781 479338 483761 488346 492721
57357D92721M395M669M858M831M558L917L140K954L647M406M274L457K985L268
$$ 492721 497116 501785 506643 511474 516032 519949 523089 526043 529690 534096 538370 541827 544812 548080
57343E48080L794M119M349M532M325L545K611K193K566L414M032L883L193K836
$$ 548080 551874 555993 560342 564874 569199 572744 575355 577548 580114 583528 587560 591443 594636 597472
57329E97472L276L930M037L907M455N706O507O083N050M557M949N744O461O877
$$ 597472 600748 604678 608715 612622 617077 622783 629290 635373 640423 644980 649929 655673 662134 669011
57315F69011O775O020N008M536N002N945O543O506O238O232O513O765O833O829
$$ 669011 675786 681806 686814 691350 696352 702297 708840 715346 721584 727816 734329 741094 747927 754756
57301G54756O903P149P672Q415Q943Q827Q312Q173Q794R729J0422J0838J1127
$$ 754756 761659 768808 776480 784895 793838 802665 810977 819150 827944 837673 848095 858933 870060
57288H70060J1102J0658J0296J0671J1662J2489J2733J2788J3219J4056J4903
$$ 870060 881162 891820 902116 912787 924449 936938 949671 962459 975678 989734 1004637
57277A004637J5472J5800J6063J6280J6347J6337J6645J7517J8456J8488J7240
$$ 1004637 1020109 1035909 1051972 1068252 1084599 1100936 1117581 1135098 1153554 1172042 1189282
57266A189282J5452J4246J4115J4813J5878J6981J7983J8967K0054K1152K2057
$$ 1189282 1204734 1218980 1233095 1247908 1263786 1280767 1298750 1317717 1337771 1358923 1380980
57255A380980K2863K3803K4698K5137K5320K6029K7420K8605K8945K9067K9764
$$ 1380980 1403843 1427646 1452344 1477481 1502801 1528830 1556250 1584855 1613800 1642867 1672631
57244A672631L0588L0438K9228K8041K7842K8759L0462L2409L3795L4092L3714
$$ 1672631 1703219 1733657 1762885 1790926 1818768 1847527 1877989 1910398 1944193 1978285 2011999
57233B011999L3570L4013L4792L5859L7463L9436M1130M2098M2377M2157M1752
$$ 2011999 2045569 2079582 2114374 2150233 2187696 2227132 2268262 2310360 2352737 2394894 2436646
57222B436646M1671M2087M2343M1745M0670M0071M0057L9905L9425L9261L9654
$$ 2436646 2478317 2520404 2562747 2604492 2645162 2685233 2725290 2765195 2804620 2843881 2883535
57211B883535L9947L9751L9693M0569M2472M5135M8441N2108N5500N8243O0610
$$ 2883535 2923482 2963233 3002926 3043495 3085967 3131102 3179543 3231651 3287151 3345394 3406004
57200C406004O2884O4776O5797O5767O4703O2630N9761N6550N3382N0572M8552
$$ 3406004 3468888 3533664 3599461 3665228 3729931 3792561 3852322 3908872 3962254 4012826 4061378
57189D061378M7492M6758M5493M3826M2803M3022M4100M5591M7513M9768N2017
$$ 4061378 4108870 4155628 4201121 4244947 4287750 4330772 4374872 4420463 4467976 4517744 4569761
57178D569761N4475N7859O2139O6192O9178P1384P3241P4557P5362P6416P7932
$$ 4569761 4624236 4682095 4744234 4810426 4879604 4950988 5024229 5098786 5174148 5250564 5328496
57167E328496P8714P7544P4772P1619O8494O5076O1507N8400N5852N3385N0692
$$ 5328496 5407210 5484754 5559526 5631145 5699639 5764715 5826222 5884622 5940474 5993859 6044551
57156F044551M7845M4963M2226L9887L7758L5215L2174K9426K7428K5500K2940
$$ 6044551 6092396 6137359 6179585 6219472 6257230 6292445 6324619 6354045 6381473 6406973 6429913
57145F429913K0076J7426J4695J1690R325Q438Q228P266N525M074L236K477J729
$$ 6429913 6449989 6467415 6482110 6493800 6503125 6511563 6519791 6527057 6532582 6536656 6539892 6542369 6544098
57132F544098J372J141O00M66J961M929Q169J1463J5608K0352K4084K5965K6834
$$ 6544098 6545470 6546611 6547211 6547677 6549638 6554567 6562736 6574199 6589807 6610159 6634243 6660208 6687042
57119F687042K7635K8537L0113L3864M0781N0498O2338P6095R1516J08227J26537
$$ 6687042 6714677 6743214 6773327 6807191 6847972 6898470 6960808 7036903 7128419 7236646 7363183
57108G363183J47277J70917J98241K31938K75865L32588M03213M89322N92874
$$ 7363183 7510460 7681377 7879618 8111556 8387421 8720009 9123222 9612544 10205418
57099A0205418P14057Q51437J004370J172792J354891J548231J753339J972532
$$ 10205418 10919475 11770912 12775282 13948074 15302965 16851196 18604535 20577067
57091B0577067K204811K446081K694565K950479L209465L462551L700857L904438
$$ 20577067 22781878 25227959 27922524 30873003 34082468 37545019 41245876 45150314
57083D5150314M017680L953265L647453L116008K440001J691834Q89844L0997
$$ 45150314 49167994 53121259 56768712 59884720 62324721 64016555 64906399 64937396
57075F4937396q51644j683482k393223k946126l336471l568939l657754l632980
$$ 64937396 64085752 62402270 60009047 57062921 53726450 50157511 46499757 42866777
57067D2866777l533949l394251l234243l063095k882942k692929k494318k292710
$$ 42866777 39332828 35938577 32704334 29641239 26758297 24065368 21571050 19278340
57059A9278340k094592j903211j719263j543862j378863j225425j084123r55733
$$ 19278340 17183748 15280537 13561274 12017412 10638549 9413124 8329001 7373268
57051G373268q40590p37996o47249n68383n00835m42521l91315l46530l07846
$$ 7373268 6532678 5794682 5147433 4579050 4078215 3635694 3244379 2897849 2590003
57042B590003k73838k42764k14071j87967j64247j42593j23308j06670r2119p8905
$$ 2590003 2316165 2073401 1859330 1671363 1507116 1364523 1241215 1134545 1042426 963521
57032I63521o6921n6113m5906l6039k7149j9499j2295n462j121j542o139j2194
$$ 963521 896600 840487 794581 758542 731393 711894 699599 694137 693016 691474 685335 673141
57020F73141j8184k4797l2586m0393m6436m9759n0168m7926m4048m0017l6560
$$ 673141 654957 630160 597574 557181 510745 460986 410818 362892 318844 278827 242267
57009B42267l3260k9560k5605k1789j8157j4598j1227q254n861m275l578l317
$$ 242267 209007 179447 153842 132053 113896 99298 88071 79817 73956 69681 66103 62786
56997F2786k775j773p91k02K20Q73J728K396K574K362K341L206N081P182Q414
$$ 62786 60011 58238 57447 57245 57465 58338 60066 62462 65036 67398 69739 72945 78026 85208 93622
56982I3622Q246O818M407J225k420o089r394j2005j3649j4322j4269j3541j1978
$$ 93622 101868 108686 113093 114318 111898 105809 96415 84410 70761 56439 42170 28629 16651
56969A6651F806a130o556m855j977J605M657a478G091J0454J2222J3782J5288
$$ 16651 6806 -1130 -7686 -12541 -14518 -12913 -8256 -1478 7091 17545 29767 43549 58837
56956E8837J6396J6180J4084J0416N785P23m107q033j0969j3304j4953j5180j3600
$$ 58837 75233 91413 105497 115913 121698 122421 118314 110281 99312 86008 71055 55875 42275
56943D2275j0803p767n059k728m65K226N496Q705J1150J3207J5962J9506K2507
$$ 42275 31472 23705 18646 15918 15453 17679 23175 31880 43030 56237 72199 91705 114212
56930A14212K3767K3283K1268J7168J0568K421n610j2676j8703k3117k4852k3787
$$ 114212 137979 161262 182530 199698 210266 212687 207077 194401 175698 152581 127729 103942
56918A03942k1351j9150j7508j5792j3722D651e679r246q199p240o493n720m689
$$ 103942 82591 63441 45933 30141 16419 4651 -5679 -14925 -23124 -30364 -36857 -42577 -47266
56905d7266l727l238k794j508N09K085K662L114M269N555O158O654Q202h705C938
$$ -47266 -50993 -54231 -57025 -58533 -58024 -55939 -53277 -50163 -45894 -40339 -34181 -27527 -19325 -8705 3938
56889A7836J5125J6593J7642J8106J8729J9628J9563J7367J3206P941K223l204
$$ 17836 32961 49554 67196 85302 104031 123659 143222 160589 173795 181736 183959 180755
56877A80755p262r357r846r205p523n141k820o17K456O875J1630J5614J9208K3459
$$ 180755 173493 164136 154290 145085 137562 132421 129601 128984 131440 138315 149945 165559 184767 208226
56863B08226K8365L3049L7148M0876M3838M4782M2552L6745K7613J6021L418q674
$$ 208226 236591 269640 306788 347664 391502 436284 478836 515581 543194 559215 562633 553959
56851E53959j9115k6911l1013l0998k7641k2415j6544j0682m926J302Q778J7399
$$ 553959 534844 507933 476920 445922 418281 395866 379322 368640 363714 365016 373794 391193
56839C91193K6076L4099M1857M9744N7272O3846O9275P2356P0072N9915M2750
$$ 391193 417269 451368 493225 542969 600241 664087 733362 805718 875790 935705 978455
56828I78455K2018N10k0592l9837n4656o3148o5537o3340n7999n0768m2845l4847
$$ 978455 1000473 1000983 980391 940554 885898 822750 757213 693873 635874 585106 542261 507414
56816E07414k6629j8071r571j416O729J5247K3840L1795L8595M3908M7020M6653
$$ 507414 480785 462714 453143 451727 458456 473703 497543 529338 567933 611841 658861 705514
56804G05514M1517L1246J6944O55j5712l0730m2837n0365n2806n1509m8383m4266
$$ 705514 747031 778277 795221 795876 780164 749434 706597 656232 603426 551917 503534 459268
56792D59268l9185l3582k8144k2770j6837j0427m270J489P383J3314J8238K1384
$$ 459268 420083 386501 358357 335587 318750 308323 304053 305542 312925 326239 344477 365861
56780C65861K2895K2877K0785J6118R069K10r716j9382k7138l2186l4935l5853
$$ 365861 388756 411633 432418 448536 457605 457815 448099 428717 401579 369393 334458 298605
56768B98605l4762l1784k8130k5114k2789k0316j7443j4849j3125j1976j0627
$$ 298605 263843 232059 203929 178815 156026 135710 118267 103418 90293 78317 67690
56757F7690q724o704n392n171n601n888n677n186m665m124l555l092A121a429
$$ 67690 58966 52262 46870 41699 36098 30210 24533 19347 14682 10558 7003 3911 1121 -1429
56742c756k158k037j785j229l55N14P50l3j259j721r97MK92P7J53O09R04Q77P70
$$ -3756 -5914 -7951 -9736 -10965 -11320 -10806 -10056 -10089 -11348 -13069 -14066 -14062 -13770 -13693 -13540 -12931 -12027 -11150 -10380
56723a0380N57J38o1L82J047J228J098J271J606a536A4K265L123K699J095J46
$$ -10380 -9823 -9685 -9746 -9364 -8317 -7089 -5991 -4720 -3114 -1536 14 2279 5402 8101 9196 9342
56707I342Q34K006K349K136K125K080J544J015J170J671J751J410J044N35l34
$$ 9342 10176 12182 14531 16667 18792 20872 22416 23431 24601 26272 28023 29433 30477 31012 30678
56692C0678j048q51K09J402K118K127J511Q74J017J912K536K197J314M45n00j452
$$ 30678 29630 28779 28988 30390 32508 34635 36146 37020 38037 39949 42485 44682 45996 46441 45941 44489
56676D4489j646q07O6J09o5M56J186J034J63l83m36o70j088r96l82k1j67k22J33
$$ 44489 42843 42036 42102 42211 42146 42602 43788 44822 44985 44602 44166 43496 42408 41412 41030 41009 40842 40620 40753
56657D0753N84R49J282J251M52o15r40m24J65O23J445K498K864K367J987K189
$$ 40753 41337 42286 43568 44819 45271 44656 43716 43292 43457 44080 45525 48023 50887 53254 55241 57430
56641E7430K107J052j91m40L46J360K062K257J705N18n65j016j211j640j939j531
$$ 57430 59537 60589 60398 59958 60304 61664 63726 65983 67688 68206 67641 66625 65414 63774 61835 60304
56625F0304p65n47r71j229q63l42k61n93q78p70k51L32M01k93j253j713j551j311
$$ 60304 59539 58992 58021 56792 55929 55587 55326 54733 53855 53085 52834 53166 53567 53274 52021 50308 48757 47446
56607D7446j317j243p23N1O46R46J054R08M03j69k85J79P19Q41O69P47J328K063
$$ 47446 46129 44886 44163 44214 44860 45806 46860 47768 48171 48002 47717 47896 48615 49456 50125 50872 52200 54263
56589E4263K415K235J842J620J658J804J921J945J653P76n08j398j195j65P27
$$ 54263 56678 58913 60755 62375 64033 65837 67758 69703 71356 72132 71624 70226 69031 68866 69593
56574F9593R74J021J427K057K386K309K191K392L079M291N757O826P061O787O727
$$ 69593 70567 71588 73015 75072 77458 79767 81958 84350 87429 91720 97477 104303 111364 118151 124878
56559A24878P215Q049Q918R465R248Q209O970O156N576M650L388K294J495Q54
$$ 124878 132093 140142 149060 158525 167773 175982 182952 189108 194684 199334 202722 205016 206511 207365
56545B07365O27J048J394O37q85j751j600j684k770l870l944l571l866m691n177
$$ 207365 207992 209040 210434 211071 210186 208435 206835 205151 202381 198511 194567 190996 187130 182439 177262
56530A77262n259n387n243m144k579k018l046m585n195m429k867j465r49j314
$$ 177262 172003 166616 161373 157229 154650 152632 149586 145001 139806 135377 132510 131045 130096 128782
56516A28782j810j812j525j527j862k109k097j995j940k029k355k629k175r76
$$ 128782 126972 125160 123635 122108 120246 118137 116040 114045 112105 110076 107721 105092 102917 101941
56502A01941j51n78j478j372j71Q22Q84O48P43P89K51n70r44o64j15K22J41j53
$$ 101941 101790 101212 99734 98362 98191 99013 99897 100545 101288 102077 102328 101758 100814 100150 100035 100257 100398 100245
56484A00245j80K85P93P74L73K31N21P43N11jm41n21j6R63J652J351M63J02N78
$$ 100245 100065 100350 101143 101917 102290 102521 103042 103785 104296 104295 103854 103333 103317 104280 105932 107283 107746 107848 108426
56465A08426J027P40P4l13l71l15k4O18J171J137P19N80Q99J184J005N41K30J74
$$ 108426 109453 110193 110267 109954 109583 109268 109244 109862 111033 112170 112889 113469 114368 115552 116557 117098 117328 117502
56447A17502J54J07L13Q46J153O58k84o19mO46M23l23n68K1R30J634J823J172
$$ 117502 117656 117763 118076 118922 120075 120733 120449 119830 119826 120472 120895 120572 120004 120025 120955 122589 124412 125584
56429A25584k27j323r61N77J709J404J74q80j283j181p88k60K87Q75J483J781
$$ 125584 125357 124034 123073 123650 125359 126763 126937 126057 124774 123593 122805 122545 122832 123707 125190 126971
56413A26971J459Q44O16Q64J044Q79P24Q25Q96O66K92l2l34n00k45K97N17K63
$$ 126971 128430 129274 129890 130754 131798 132677 133401 134226 135122 135788 136080 136048 135714 135214 134969 135266 135783 136046
56395A36046J99P98J510J589J244J232J518J239J36p49l19J030J774J101j73p36
$$ 136046 136245 137043 138553 140142 141386 142618 144136 145375 145511 144762 144443 145473 147247 148348 148175 147439
56379A47439l45K44N53Q43J311J642J642J649J896J985J552R31O55O65N34J90
$$ 147439 147094 147338 147891 148734 150045 151687 153329 154978 156874 158859 160411 161342 161997 162662 163196 163386
56363A63386q8p8L77J349K380K579J772R50R82J448J494J226J242J382J063N46
$$ 163386 163298 163220 163597 164946 167326 169905 171677 172627 173609 175057 176551 177777 179019 180401 181464 182010
56347A82010O29J263J582J245P62N41N53Q34J296J271L71l91L47K194L312K915
$$ 182010 182639 183902 185484 186729 187491 188032 188585 189419 190715 191986 192357 191966 192313 194507 197819 200734
56331B00734K019J581J359J087J227J857K167J777J465J740J881J296P72J294
$$ 200734 202753 204334 205693 206780 208007 209864 212031 213808 215273 217013 218894 220190 220962 222256
56317B22256K402K866K442J897J710J705J773K028K313K272J924J728J951K326
$$ 222256 224658 227524 229966 231863 233573 235278 237051 239079 241392 243664 245588 247316 249267 251593
56303B51593K371J983J705K275L685M932N078M378L874M075M650N205N534N300
$$ 251593 253964 255947 257652 259927 263612 268544 273622 278000 281874 285949 290599 295804 301338 306638
56289C06638M407L633L910M958N559N319N067N432O133O902P913Q932R200Q692
$$ 306638 311045 314678 318588 323546 329105 334424 339491 344923 351056 357958 365871 374803 384003 392695
56275C92695Q484R232J0272J0802J1061J1696J2783J4046J5434J6884J8170J9334
$$ 392695 401179 410411 420683 431485 442546 454242 467025 481071 496505 513389 531559 550893
56263E50893K0634K1938K2994K4484K7679L2722L8245M3099M7444N1777N6190
$$ 550893 571527 593465 616459 640943 668622 701344 739589 782688 830132 881909 938099
56252I38099O1085O7337P4977Q2803Q9988R6918J03785J09646J13799J16838J19333
$$ 938099 999184 1066521 1141498 1224301 1314289 1411207 1514992 1624638 1738437 1855275 1974608
56241A974608J20482J19142J15248J09144J00552Q9275P6062O1618M5596K7690
$$ 1974608 2095090 2214232 2329480 2438624 2539176 2628451 2704513 2766131 2811727 2839417
56231B839417Q916r324k6717m3385n8565p1241q1531r0222r7353j02391j05360
$$ 2839417 2848333 2839009 2812292 2768907 2710342 2639101 2557570 2467348 2369995 2267604 2162244
56220B162244j06714j06458j04470j01312r7722r3697q8893q3610p8419p3296
$$ 2162244 2055530 1949072 1844602 1743290 1645568 1551871 1462978 1379368 1300949 1227653
56210A227653o7922o2499n7453n2772m8376m4624m1623l8660l5183l1795k9376
$$ 1227653 1159731 1097232 1039779 987007 938631 894007 852384 813724 778541 746746 717370
56199G17370k7736k6036k4027k1957j9688j6852j3634j0646q374p150p103p623
$$ 717370 689634 663598 639571 617614 597926 581074 567440 556794 548420 541270 534167 526544
56187E26544p559o617n716n422n002l768k334j557j248q80n88m93J5J140J863
$$ 526544 518985 512368 506652 501230 496228 492460 490126 488569 487321 486441 485853 485360 485375 486515 488378
56172D88378J423O67P14J278J572J908K848L756L777L537M243N758P106Q169R327
$$ 488378 489801 490468 491182 492460 494032 495940 498788 502544 506321 509858 514101 519859 526965 535134 544461
56157E44461J0078R824R493J0595J2939J5007J6345J7965K0422K3190K5895K8855
$$ 544461 554539 564363 573856 584451 597390 612397 628742 646707 667129 690319 716214 745069
56145G45069L2293L6252M1195M7498N4467O0984O6863P2545P7719Q1322Q2680
$$ 745069 777362 813614 854809 902307 956774 1017758 1084621 1157166 1234885 1316207 1398887
56134A398887Q1642P8083P2327O5597N8987N2447M5731L9501L4265K9090K2761
$$ 1398887 1480529 1558612 1630939 1696536 1755523 1807970 1853701 1893202 1927467 1956557 1979318
56123A979318J5552Q494J648n415j2212j8060k3535k9674l6306m2725m9342n6936
$$ 1979318 1994870 2003364 2005012 1999597 1987385 1969325 1945790 1916116 1879810 1837085 1787743 1730807
56111A730807o4870p1540p6094p8190p7033p2427o6114o0178n4680m8526m1806
$$ 1730807 1665937 1594397 1518303 1440113 1363080 1290653 1224539 1164361 1109681 1061155 1019349
56100A019349l5455k9446k3433j8339j5174j2981j0158p067n093l893k131k26
$$ 1019349 983894 954448 931015 912676 897502 884521 874363 867296 862203 858310 856179 855953
56088H55953M06L71J661M166N663N446N168N829O472O421O435P132Q167R379J0877
$$ 855953 856359 856730 858391 862557 868220 873666 878834 884663 891135 897556 903991 911123 919290 928669 939546
56073I39546J1973J1863J1265J1494J2289J2584J2879J4423J6522J7243J6607
$$ 939546 951519 963382 974647 986141 998430 1011014 1023893 1038316 1054838 1072081 1088688
56062A088688J6416J7236J8112J8976K0477K1658K0834J8707J7624J7766J7227
$$ 1088688 1105104 1122340 1140452 1159428 1179905 1201563 1222397 1241104 1258728 1276494 1293721
56051A293721J5800J5411J6495J7319J7293J7730J8797J8968J8214J8505K0458
$$ 1293721 1309521 1324932 1341427 1358746 1376039 1393769 1412566 1431534 1449748 1468253 1488711
56040A488711K2414K3513K4634K5857K6166K6162K7798L0800L2696L2945L3620
$$ 1488711 1511125 1534638 1559272 1585129 1611295 1637457 1665255 1696055 1728751 1761696 1795316
56029A795316L5356L6378L6316L7275L9999M2598M4233M6505N0026N3190N5558
$$ 1795316 1830672 1867050 1903366 1940641 1980640 2023238 2067471 2113976 2164002 2217192 2272750
56018B272750N8915O3648O7590O9779P1870P4775P7440P9918Q3855Q8819R2102
$$ 2272750 2331665 2395313 2462903 2532682 2604552 2679327 2756767 2836685 2920540 3009359 3101461
56007C101461R3429R5789J00421J05044J08419J12336J17697J22977J28072J35195
$$ 3101461 3194890 3290679 3391100 3496144 3604563 3716899 3834596 3957573 4085645 4220840
55997D220840J44482J53156J60536J69235J80036J90581K00558K12855K27905
$$ 4220840 4365322 4518478 4679014 4848249 5028285 5218866 5419424 5632279 5860184
55988E860184K42558K56394K73270K94521L16707L38444L63270L93152M25499
$$ 5860184 6102742 6359136 6632406 6926927 7243634 7582078 7945348 8338500 8763999
55979H763999M59360M98095N43161N91989O44805P06519P79109Q59862R50163
$$ 8763999 9223359 9721454 10264615 10856604 11501409 12207928 12987037 13846899 14797062
55970A4797062J057840J187686J338926J516051J732693K000754K326138K719817
$$ 14797062 15854902 17042588 18381514 19897565 21630258 23631012 25957150 28676967
55962B8676967L201878L789478M493286N331463O332539P515796Q882547J0433626
$$ 28676967 31878845 35668323 40161609 45493072 51825611 59341407 68223954 78657580
55954G8657580J2175635J4095756J6150308J8302101K0560884K2960676K5468908
$$ 78657580 90833215 104928971 121079279 139381380 159942264 182902940 208371848
55947B08371848K7859823K9596318K9831112K7666856K2620736J4959214N610140
$$ 208371848 236231671 265827989 295659101 323325957 345946693 360905907 366516047
55940C66516047m233454j3440909k1051083k6350771k9061252k9456428k8203474
$$ 366516047 362282593 348841684 327790601 301439830 272378578 242922150 214718676
55933B14718676k6027623k3480864k0910860j8505894j6323702j4337245j2511257
$$ 214718676 188691053 165210189 144299329 125793435 109469733 95132488 82621231
55926H2621231j0843759r344449q009008o829770n808122m940412m206903l586066
$$ 82621231 71777472 62433023 54424015 47594245 41786123 36845711 32638808 29052742
55918B9052742l066725k637623k278847j973298j715775j502709j323083j166917
$$ 29052742 25986017 23348394 21069547 19096249 17380474 15877765 14554682 13387765
55910A3387765j033078r21353q25126p38502o62792n99574n44483m93576m48993
$$ 13387765 12354687 11433334 10608208 9869706 9206914 8607340 8062857 7569281 7120288
55901G120288m12613l80515l48992l20131k96285k74645k52316k31487k14757
$$ 7120288 6707675 6327160 5978168 5658037 5361752 5087107 4834791 4603304 4388547
55892D388547k00037j84711j70342j58978j48928j38205j28159j20023j11850
$$ 4388547 4188510 4003799 3833457 3674479 3525551 3387346 3259187 3139164 3027314
55883C027314j02453r4489r0098q7161q3270p9684p8080p6934p4501p2001p0607
$$ 3027314 2924861 2830372 2740274 2653113 2569843 2490159 2412079 2335145 2260644 2188643 2118036
55872B118036o8522o4315o0025n7772n6245n3547n0713m9381m8619m6969m5224
$$ 2118036 2049514 1985199 1925174 1867402 1811157 1757610 1706897 1657516 1608897 1561928 1516704
55861A516704m4411m3539m1767m0394m0279l9746l7427l4623l2658l0519k7474
$$ 1516704 1472293 1428754 1386987 1346593 1306314 1266568 1229141 1194518 1161860 1131341 1103867
55850A103867k5210k4925k4873k3433k2039k2381k3191k2551k1231k0864k0858
$$ 1103867 1078657 1053732 1028859 1005426 983387 961006 937815 915264 894033 873169 852311
55839H52311j9799j8204j7310j6787j5935j5399j5530j4914j2730j0678j0314
$$ 852311 832512 814308 796998 780211 764276 748877 733347 718433 705703 695025 684711
55828F84711j0373r054p077o071n746n145m984o207p730q129q168r267j0783j1137
$$ 684711 674338 665284 658207 652136 646390 641245 636261 630054 622324 614195 606027 596760 585977 574840
55814E74840j0397r573q535o872n526n445n750n157m031l151j952KJ363J092P14
$$ 574840 564443 554870 546335 539463 533937 528492 522742 517585 513554 510403 508451 508453 509816 510908 511622
55799E11622K059M130M710L859L256L057K091L78j093k414m224n727n702m919
$$ 511622 513681 517811 522521 526380 529636 532693 534784 535162 534069 531655 527431 521704 516002 511083
55785E11083n202o435o897o284o110p091q280q921r286r420q739p105n062k969
$$ 511083 505881 499446 492549 486265 480155 473064 464784 455863 446577 437157 428418 421313 416251 413282
55771D13282q69J019K655M470O264O552M362Q51k186m616p243r715j0862j0617
$$ 413282 412413 413432 416087 420557 426821 433373 437735 438586 436400 431784 424541 414826 403964 393347
55757C93347r860q877p522o354o075o234o014n735o145o816o848o546o721p028
$$ 393347 383487 374610 367088 360734 354659 348425 342411 336676 330531 323715 316867 310321 303600 296572
55743B96572o668o107o255o522n652m042l178l121k586j388p10q93r97p30r37
$$ 296572 289904 283797 277542 271020 265368 261326 258148 255027 252441 251053 250343 249450 248453 247723 246786
55728B46786j880k752l198l723m315m276l685l531l992m111l396k382j335N8J377
$$ 246786 244906 242154 238956 235233 230918 226642 222957 219426 215434 211323 207927 205545 204210 204268 205645
55713B05645J484M63N4J378L378M379M134L554L247L044K537J484Q2j059j651
$$ 205645 207129 207592 207646 209024 212402 216781 220915 224469 227716 230760 233297 234781 234863 233804 232153
55698B32153k316l729n363o044n660n242n231m867l636k237j575j586j610j313
$$ 232153 229837 226108 220745 214701 209041 203799 198568 193701 190065 187828 186253 184667 183057 181744
55684A81744p60p2O18J154J539J835K009K101K330K644K453J391rj008j686k530
$$ 181744 180984 180912 181530 182684 184223 186058 188067 190168 192498 195142 197595 198986 198977 197969 196283 193753
55668A93753l385l672l379l011k740k432k156j877j036N69J846J539J48n32L20
$$ 193753 190368 186696 183317 180306 177566 175134 172978 171101 170065 170634 172480 174019 174167 173635 173955
55653A73955J814K860L234L015K205J255Q77J047R39J81o94j244j759k599l625
$$ 173955 175769 178629 181863 184878 187083 188338 189215 190262 191201 191382 190688 189444 187685 185086 181461
55638A81461m555n320n773n588m690l460k449k168k829l878m176l253k022j583
$$ 181461 176906 171586 165813 160225 155535 152075 149626 147458 144629 140751 136575 133322 131300 129717
55624A29717j752j602r65m28k13j35l84j186j984k062j819k203l062l306k628
$$ 129717 127965 126363 125398 124970 124757 124622 124238 123052 121068 119006 117187 114984 111922 108616 105988
55609A05988j829j397j032o28n24o41n16k75m19p09m86o8l85j191j297p17p93
$$ 105988 104159 102762 101730 101102 100578 99937 99421 99146 98727 98018 97532 97464 97079 95888 94591 93874 93081
55592I3081j827k332j398p1N39Q89J548J681M25j337k095j770j318r46k36M82
$$ 93081 91254 88922 87524 87453 87992 88881 90429 92110 92535 91198 89103 87333 86015 85069 84833 85315
55576H5315L97l34o57j67M28N15K93J67K16M11Q34J393J708J479P35k36j079j525
$$ 85315 85712 85378 84721 84554 84982 85497 85790 85957 86173 86584 87418 88811 90519 91998 92733 92497 91418 89893
55558H9893j538j290r21m80j37r9k76l43k07o5K8K12L75J68l62o11j93N95J222
$$ 89893 88355 87065 86144 85664 85527 85428 85152 84809 84602 84537 84565 84777 85152 85320 84958 84347 84154 84749 85971
55539H5971J453J259O48r1m28j64L49P50J064J319J207M64o25j392j422r32n74
$$ 85971 87424 88683 89331 89240 88812 88648 88997 89747 90811 92130 93337 93801 93176 91784 90362 89430 88856
55522H8856q12j359j450q96m38p06j336j698j916k326k353j250L14P44k25j082
$$ 88856 88044 86685 85235 84339 83901 83195 81859 80161 78245 75919 73566 72316 72630 73374 73149 72067
55506G2067p70o6j18p40r66n36O0L95L23j71p49p86k05K78J71p8L8J50l45j139
$$ 72067 71297 71231 71113 70373 69407 68871 68931 69326 69649 69478 68729 67943 67738 68016 68187 68109 68147 68297 67952 66813
55486F6813j302n61L81P45M95K08M00R74J321J042M71J71J29Ko3L98J158J323
$$ 66813 65511 64950 65331 66076 66571 66779 67179 68153 69474 70516 70987 71158 71287 71289 71226 71624 72782 74105
55468G4105N63m62j111j409j438r84k18J17k83q09q90p61p68o81k79P1J1j79r4
$$ 74105 74668 74206 73095 71686 70248 69264 69046 69163 68880 68071 67181 66420 65652 64971 64692 64763 64774 64595 64501
55449F4501J50L09M56N68K96m02r36r02o13l32K22J089J560J163N12L60M84K54
$$ 64501 64651 64960 65416 65984 66280 65878 64942 64040 63427 63095 63317 64406 65966 67129 67641 68001 68485 68739
55431F8739l12p92j127j335j091l46J50r5m08MO70O22%k76j31l28r87j292p67
$$ 68739 68427 67635 66508 65173 64082 63736 63886 63791 63383 63387 64057 64679 64679 64403 64272 63944 62957 61665 60898
55412F0898K46J361K417K890K120M23q99j042m75n9p6m17r40j302r70R1J143J416
$$ 60898 61144 62505 64922 67812 69932 70355 69456 68414 67939 67880 67804 67387 66447 65145 64175 64266 65409 66825
55394F6825R06J99k09k79k56l14k99J6M67N86L51L85R81J470J098J72m59o83j032
$$ 66825 67731 67930 67721 67442 67186 66872 66573 66589 67056 67642 67993 68378 69359 70829 71927 72099 71640 70957 69925
55375F9925j463j266l41L93K04m76p46l77J53M54O19Q97J194J041R6j178j752
$$ 69925 68462 67196 66855 67248 67452 66976 66230 65853 66006 66460 67079 67976 69170 70211 70307 69129 67377
55358F7377j220m26l69q33p62J06Q35O66O5k3N30R70O41k76j031j093o41k56j92
$$ 67377 66157 65731 65362 64529 63767 63873 64708 65374 65439 65416 65946 66916 67557 67281 66250 65157 64516 64260 64068
55339F4068j38J62M87N31L84K68J15j67l37k23j38l58n16k00J92Nm65l15M38P12
$$ 64068 63930 64092 64579 65110 65494 65762 65877 65710 65373 65150 65012 64654 64138 63938 64130 64135 63670 63355 63793 64505
55319F4505o0j132j597j487j232q28j44M87P02P05Q39Q89M39l35q37q68p54o05
$$ 64505 64445 63313 61716 60229 58997 58169 58025 58512 59214 59919 60758 61647 62086 61751 60914 60046 59292 58687
55301E8687p7R51J863J876R73Nk41O9J18m35r43o49K47P99N29m9k05J57O13Q57
$$ 58687 58610 59561 61424 63300 64273 64278 64037 64106 64224 63789 62846 62197 62444 63243 63772 63723 63518 63675 64288 65145
55281F5145R21R02P56L71k39q19j002o60q6L35N08N45M33J30j07R5O13Q51M95
$$ 65145 66066 66968 67724 68095 67856 67037 66035 65375 65289 65624 66132 66677 67110 67240 67133 67228 67841 68692 69187
55262F9187r6m08l46k3O20J533K139J690K45j162j561j051n46o29r71r34m13J65
$$ 69187 69091 68683 68337 68314 68934 70467 72606 74296 74541 73379 71818 70767 70221 69592 68621 67687 67274 67439
55244F7439M39L80O3l85n90j95N85J004O41j23p15j049j263j186o12J27M36K37
$$ 67439 67878 68258 68321 67936 67346 67151 67736 68740 69381 69258 68543 67494 66231 65045 64433 64560 64996 65233
55226F5233j2j02l71j008j520j178R4J509K166J885J247P99M75K9k55J03P72P29
$$ 65233 65221 65119 64748 63740 62220 61042 61136 62645 64811 66696 67943 68742 69217 69246 68991 69094 69866 70595
55208G0595k91j201r66MN46L33n2k27k74q6N28J094Q18j87q84p61m22m04l18K54
$$ 70595 70304 69103 68137 68141 68687 69020 68968 68741 68467 68381 68909 70003 70821 70634 69750 68989 68567 68163 67845 68099
55188F8099Q15O48k3l94k59p8q5j9K52N02O82J111J866K424K210J269J08r08j656
$$ 68099 68914 69562 69539 69145 68886 68808 68723 68704 68956 69458 70140 71251 73117 75541 77751 79020 79128 78220 76564
55169G6564j865j207P5R92P36l43j070p37L25J381K022K149J705Q21j24q72j439
$$ 76564 74699 73492 73567 74559 75295 74952 73882 73145 73470 74851 76873 79022 80727 81548 81424 80552 79113
55152G9113j675j144J50J282J260J72r43j262p75N8O93P12J97j55J92Q31R13L43
$$ 79113 77438 76294 76444 77726 78986 79158 78215 76953 76178 76236 76929 77641 77838 77683 77875 78706 79619 79962
55134G9962j08P2M97N25Np60j351j433r40k41J42K0m32r72j307j054j99N96O55
$$ 79962 79854 79926 80423 80948 80953 80193 78842 77409 76469 76228 76370 76390 75958 74986 73679 72625 72426 73022 73677
55115G3677J53k30l31n41r01r38l89N21J487K174K041R50j56k04L98K57q14j421
$$ 73677 73830 73600 73269 72728 71827 70889 70500 71021 72508 74682 76723 77673 77517 77313 77711 77968 77154 75733
55097G5733q41j34k75n41M1Q68P87J83L57J287J626R66M85R67J594J333M88J3
$$ 75733 74892 74758 74483 73942 73983 74851 75638 75821 76178 77465 79091 80057 80542 81509 83103 84436 84924 84937
55079H4937J9j25n38n96Q7J038J507J332R62P73N94Q6n90p78j59O70P59r7j102
$$ 84937 84956 84831 84293 83697 83784 84822 86329 87661 88623 89396 89990 90076 89486 88708 88549 89219 89978 89881 88779
55060H8779j326o50K43O30M20R6P4K84M03L88M66O38N17j05q13r70m92J4l1n13
$$ 88779 87453 86803 87046 87676 88096 88192 88266 88550 88953 89341 89807 90445 90962 90857 90044 89074 88582 88596 88565 88052
55040H8052q13n82j69j25m37n64k96j01l75p31n73j7L63N06Q31J277J194M44k33
$$ 88052 87239 86657 86488 86363 85926 85362 85066 84965 84590 83859 83286 83269 83632 84138 84969 86246 87440 87884 87651
55021H7651k90j33l59p80p96l53L7O5m8O0M46P69O06ll92p5M96N18Q6O7O31R08
$$ 87651 87361 87228 86869 86089 85293 84940 84977 85042 84994 85054 85500 86269 86875 86872 86480 86405 86901 87419 87505 87572 88203 89111
54999H9111M20j11L0M71N84M97M99K88k49l01O63J577J055m75j290q43k59l78
$$ 89111 89531 89420 89450 89921 90505 91002 91501 91789 91540 91239 91902 93479 94534 94059 92769 91926 91667 91289
54981I1289p13o46l37NO22J465J883J608J218J178J220J084J059J212R67R0o88
$$ 91289 90576 89930 89593 89598 90220 91685 93568 95176 96394 97572 98792 99876 100935 102147 103114 103204 102516
54964A02516o79k16O5K03M07K94m66j254j251p12m63n16k07L98M76j32n93m09
$$ 102516 101837 101621 101686 101889 102296 102590 102124 100870 99619 98907 98444 97928 97721 98119 98595 98463 97870 97461
54946I7461j56l63o41m35M0K96M35P79J052P35N3j97K14O48N45J44j5J95N65J007
$$ 97461 97305 96942 96301 95866 95906 96202 96637 97416 98468 99203 99256 99059 99273 99921 100466 100610 100595 100790 101355 102362
54926A02362J550K081K456K694K896K983K839K623K663L096L734M295M534M190
$$ 102362 103912 105993 108449 111143 114039 117022 119861 122484 125147 128243 131977 136272 140806 144996
54912A44996L182J898R51M94K8r70k372l604m295m523m515m329l813k811j584
$$ 144996 148178 150076 151027 151521 151549 150579 148207 144603 140308 135785 131270 126941 123128 120317 118733
54897A18733q89j328k418k832j870l63L66J36j51J01N99R72J346J802J986J704
$$ 118733 117844 116516 114098 111266 109396 109033 109399 109535 109384 109485 110084 111056 112402 114204 116190 117894
54881A17894J418J639K171K501K659L142M033M722M558L551K358J702J751J918
$$ 117894 119312 120951 123122 125623 128282 131424 135457 140179 144737 148288 150646 152348 154099 156017
54867A56017J406J15j257k161k859l795m697m898m390l834l571l263k701k219
$$ 156017 157423 157538 156281 154120 151261 147466 142769 137871 133481 129647 126076 122813 120112 117893
54853A17893k072k014j865j937k383k647k187j337q39p22m10K11N61K61l97j054
$$ 117893 115821 113807 111942 110005 107622 104975 102788 101451 100612 99890 99480 99691 100252 100513 100116 99062
54837I9062j652k017j674n59N47Q02K45m08o20l56K34R42J398J291O94j7n53p79
$$ 99062 97410 95393 93719 93160 93707 94509 94754 94346 93726 93370 93604 94546 95944 97235 97929 97912 97359 96580
54819I6580n82K2O68Q66N21N4n1K77O57O02L4n41n74k04m8j65J76J309K335K134
$$ 96580 95998 96020 96688 97554 98075 98129 98078 98355 99012 99614 99648 99107 98533 98329 98281 98116 98292 99601 101936 104070
54799A04070Q93k06n97p38r57q79k79L11L82J57J23K97M71P28J155J364R02k6
$$ 104070 104963 104757 104160 103422 102465 101586 101307 101618 102000 102157 102280 102577 103048 103776 104931 106295 107197 107171
54781A07171o84o41j10M42P64R29J259J990K915L493L402K853K296K093K523L612
$$ 107171 106487 105846 105736 106178 106942 107871 109130 111120 114035 117528 120930 123783 126079 128172 130695 134307
54765A34307M766N036M167K981K384K409K559K632K600K134R93m21j559k564l810
$$ 134307 139073 144109 148276 151257 153641 156050 158609 161241 163841 165975 166968 166547 164988 162424 158614
54750A58614m884m939m098l448l439l300k473j690j776k173j726n39J00l59r17
$$ 158614 153730 148791 144693 141245 137806 134506 132033 130343 128567 126394 124668 124129 124229 123870 122953
54735A22953n26M41Q73N09P2M4R3j26k71J54J018J814K422L135L947M411M300
$$ 122953 122427 122868 123741 124250 124322 124366 124459 124333 124062 124216 125234 127048 129470 132605 136552 140963 145263
54718A45263L956L742L521K947K041J103K38p02j802k918l835m369m459m247l989
$$ 145263 149219 152961 156482 159429 161470 162573 162811 162109 160307 157389 153554 149185 144726 140479 136490
54703A36490l748l298k503j619j027q30r15j166j433j457j157q89j025j428j585
$$ 136490 132742 129444 126941 125322 124295 123465 122550 121384 119951 118494 117337 116448 115423 113995 112410
54688A12410j208m60L35Q72Q43O8j198k340k779k319j230j31L98L14J11J65L16
$$ 112410 111202 110742 111077 111949 112792 112860 111662 109322 106543 104224 102994 102863 103261 103575 103686 103851 104167
54671A04167L60N44J121J650J411M32m30n83l10j85l24m60m07k32j47l76q74j157
$$ 104167 104527 105071 106192 107842 109253 109685 109255 108672 108362 108177 107853 107393 106986 106754 106607 106231 105357 104200
54653A04200p89k0M26L21K86Q63J676J857J137J03m84m31j41j33n21r61j096j016
$$ 104200 103411 103391 103817 104138 104424 105287 106963 108820 109957 110060 109576 109145 109004 108871 108350 107389 106293 105277
54635A05277j031j117q37j7Q92J269R97M78J23K5M0m3l00n24l66K45Q59Q99K79
$$ 105277 104246 103129 102292 102275 103167 104436 105433 105911 106034 106059 106099 106056 105756 105232 104866 105111 105970 106869 107148
54616A07148m51o18o9P08J064P93K32j68k50q4K35N83P42N45Q1m20q29j092j094
$$ 107148 106697 106079 106010 106718 107782 108575 108807 108639 108389 108305 108540 109123 109865 110410 110491 110071 109242 108150 107056
54597A07056p95l68j1L26P36R98P83J65l74m96l20j57j37j94j69P4M52P20Q09
$$ 107056 106261 105893 105882 106208 106944 107942 108725 108890 108516 108020 107700 107543 107406 107212 107043 107117 107569 108289 109098
54578A09098R75J279J247M86n65j101j086j204j667j831j259m26L9K27N57R99
$$ 109098 110073 111352 112599 113085 112520 111419 110333 109129 107462 105631 104372 103946 103985 104212 104769 105768
54562A05768J216J150R13M25l21q87q26l39O1L64R67J843K399K311J926J619J263
$$ 105768 106984 108134 109047 109472 109151 108264 107438 107099 107160 107524 108491 110334 112733 115044 116970 118589 119852
54545A19852O09j17m33k51L7J40K09M87Q28P46P7o83p86n7Q98J340J105N99K12
$$ 119852 120461 120344 119911 119660 119697 119837 120046 120533 121361 122107 122184 121501 120715 120658 121556 122896 124001 124600 124812
54526A24812Lj21j62j11j00l06o72q57n97qN47Q43Q51M82l66j365j773j172p0
$$ 124812 124815 124694 124532 124421 124321 124015 123343 122486 121889 121881 122428 123271 124122 124604 124238 122873 121100 119928 119858
54507A19858O38O50M21L78M46L10j70q43j342j285p32l38n68r14m77O09J129M33
$$ 119858 120496 121146 121567 121945 122391 122701 122531 121688 120346 119061 118329 117991 117423 116509 116032 116641 117770 118203
54489A18203o04p85j72L11L69N71J172J556J142K05m91n20M1R07J680J845J185
$$ 118203 117599 116814 116642 116953 117322 117893 119065 120621 121763 121968 121477 120957 120998 121905 123585 125430 126615
54472A26615J83k71K56J272J920J851J436J104Q36M73K16M84J198J658J303L70
$$ 126615 126798 126527 126783 128055 129975 131826 133262 134366 135202 135675 135891 136375 137573 139231 140534 140904
54456A40904m18o81o92q78j266j468j157m83L4j1n33j148j556j656j464j117r28
$$ 140904 140486 139805 139113 138235 136969 135501 134344 133861 133895 133884 133351 132203 130647 128991 127527 126410 125482
54439A25482j101j402j334o77K88J061J243P01k44q77p13j35M1l37n32mQ67J399
$$ 125482 124381 122979 121645 120968 121256 122317 123560 124261 124017 123140 122427 122292 122333 121996 121464 121460 122327 123726
54421A23726J589J900K343K355J611N76l3p5p1m67j058j263r52o06n56m76M3P49
$$ 123726 125315 127215 129558 131913 133524 134100 134067 133992 133921 133454 132396 131133 130181 129575 129019 128543 128586 129335
54403A29335J088J084J218J525J552J263J212J556J655J079L00p8j92m86q33p96
$$ 129335 130423 131507 132725 134250 135802 137065 138277 139833 141488 142567 142867 142789 142597 142111 141278 140482
54387A40482l64J09M12M42j4q23j211n72N85J174R17N39O66J193J755K193K418
$$ 140482 140118 140227 140639 141081 141067 140244 139033 138461 139046 140220 141137 141676 142342 143535 145290 147483 149901
54370A49901K313J965J654J518J507J620J872J992J629Q14p8q13j321j356o68
$$ 149901 152214 154179 155833 157351 158858 160478 162350 164342 165971 166785 166707 165894 164573 163217 162549
54355A62549M22J073P84j52j086j571j475r63n23o73j451k384k949k907k241j176
$$ 162549 162971 164044 164828 164676 163590 162019 160544 159581 159058 158385 156934 154550 151601 148694 146453 145277
54339A45277k30J45K4k25n11r20j179q69k16L7k77m33K6N45M25r9k78J1K78K91
$$ 145277 145047 145192 145216 144991 144480 143560 142381 141512 141296 141333 141056 140623 140649 141194 141619 141520 141242 141253 141531 141822
54319A41822K79L02P5m61q79q03l67K5J28r1n55j060j313j139o42r5K38K33mj36
$$ 141822 142101 142403 142478 142017 141138 140335 139968 139993 140121 140030 139475 138415 137102 135963 135321 135226 135464 135697 135693 135557
54299A35557Q6M62M60j50r64j378j199o45P0Q17J335J332R64Q47J294J829J750
$$ 135557 135643 136105 136565 136415 135451 134073 132874 132229 132299 133116 134451 135783 136747 137594 138888 140717 142467
54282A42467R72Q5l74l04J00M99M81l2m11R0J269J937J254k98j565j925j535p43
$$ 142467 143439 143524 143150 142846 142946 143445 143926 143894 143483 143573 144842 146779 148033 147735 146170 144245 142710 141967
54264A41967J87R40J283J322J331J382J339J182J045R75R03P45M54L6k80j66L05
$$ 141967 142154 143094 144377 145699 147030 148412 149751 150933 151978 152953 153856 154601 155055 155091 154811 154645 154950
54247A54950N13pq97j391j215p33l28m9J79L82O43R82J197J070P46N65N64L88
$$ 154950 155463 155456 154559 153168 151953 151220 150892 150843 151022 151404 152047 153029 154226 155296 156042 156607 157171 157559
54229A57559j96r75j499j500j123q24r01j086q37j35M51O21P86J200J287M55q26
$$ 157559 157363 156388 154889 153389 152266 151442 150541 149455 148618 148483 148934 149555 150341 151541 152828 153283 152457
54212A52457j576j649j665j822j707j260r32p95m03J74J78n68j115p04J00L27
$$ 152457 150881 149232 147567 145745 144038 142778 141846 141051 140648 140822 141000 140432 139317 138613 138713 139040
54196A39040O7J83R09J518J328M14o58j346j334o69K40R35J268J338J229R99P55
$$ 139040 139107 139290 140199 141717 143045 143459 142801 141455 140121 139452 139692 140627 141895 143233 144462 145461 146216
54179A46216N56L65K67N41J244J877J781Q28m43j331j496j091n39j92j31k49m21
$$ 146216 146772 147137 147404 147945 149189 151066 152847 153675 153232 151901 150405 149314 148775 148583 148452 148203 147782
54162A47782n46n40n18q01j432j805j238J12J289J598J183N27n8l59j74K80L27
$$ 147782 147236 146696 146178 145377 143945 142140 140902 141014 142303 143901 145084 145611 145553 145194 145020 145300 145627
54145A45627l78j312j660j211m10L00Q18J278J855K523K842K196N92r84j345k40
$$ 145627 145249 143937 142277 141066 140656 140956 141774 143052 144907 147430 150272 152468 153060 152076 150731 150491
54129A50491J356K185J819J043J035K093L205L230K282J500J539J983K323K710
$$ 150491 151847 154032 155851 156894 157929 160022 163227 166457 168739 170239 171778 173761 176084 178794
54115A78794L331L686L158J965R34N37N18L14n00j887l186l598l134k706k924
$$ 178794 182125 185811 188969 190934 191868 192405 192923 193237 192737 190850 187664 184066 180932 178226 175302
54100A75302l263k963k262k011k297k291j504m67L3q5k59o5L21L55j97q67r96
$$ 175302 172039 169076 166814 164803 162506 160215 158711 158244 158277 158192 157933 157868 158189 158544 158347 157480 156484
54083A56484n63j52JK68P63R33N42L14P69J131M13p85q67M85J848K035J417R05
$$ 156484 155921 155769 155770 156038 156801 157734 158276 158590 159359 160490 160903 160118 159251 159736 161584 163619 165036 165941
54065A65941O82N08M30M95L81j09o35r31j251j688j643o68N97J092P01K77M72
$$ 165941 166623 167131 167561 168056 168437 168328 167693 166762 165511 163823 162180 161512 162109 163201 163902 164179 164651
54048A64651J190K066K815L134K953K739K988L387L109K081J287J520K423L145
$$ 164651 165841 167907 170722 173856 176809 179548 182536 185923 189032 191113 192400 193920 196343 199488
54034A99488L461L761M220M562M539M161L574L000K776L027L276K849J741P49
$$ 199488 202949 206710 210930 215492 220031 224192 227766 230766 233542 236569 239845 242694 244435 245184
54020B45184N66R81J212Q19N9n69q72j099j601k405l148l492l559l706l965l978
$$ 245184 245750 246731 247943 248762 248821 248252 247380 246281 244680 242275 239127 235635 232076 228370 224405 220427
54004B20427l532k842k141j444q75q16j359j908j872j420j146j121r41n28k19
$$ 220427 216895 214053 211912 210468 209593 208777 207418 205510 203638 202218 201072 199951 199010 198482 198263
53989A98263o9L14J036J638J790J718J745J865K044K524L416M316M664M253L255
$$ 198263 198194 198508 199544 201182 202972 204690 206435 208300 210344 212868 216284 220600 225264 229517 232772
53974B32772J940N41q95k566m483n953o116n162m272m077l928l141k203j927k044
$$ 232772 234712 235253 234358 231792 227309 221356 215240 210078 205806 201729 197801 194660 192457 190530 188486
53959A88486j623n75K33L39K08L37O02P46Q47J002J060R67R95J400K071K681K981
$$ 188486 186863 186288 186521 186860 187068 187405 188007 188753 189600 190602 191662 192629 193624 195024 197095 199776 202757
53942B02757K957K899L226L895M172L492K424K190L104M105M127L340K696K642
$$ 202757 205714 208613 211839 215734 219906 223398 225822 228012 231116 235221 239348 242688 245384 248026
53928B48026K843K914K891K893K782K380J843J548J621J791J867K184L153M398
$$ 248026 250869 253783 256674 259567 262349 264729 266572 268120 269741 271532 273399 275583 278736 283134
53914B83134M867M104L017K923L986N081N115M036K590J529J104J090J034O98
$$ 283134 288001 292105 295122 298045 302031 307112 312227 316263 318853 320382 321486 322576 323610 324308
53900C24308J55n67j647k969l847l747l148l035l654m287m360m088l938l998m122
$$ 324308 324463 323896 322249 319280 315433 311686 308538 305503 301849 297562 293202 289114 285176 281178 277056
53885B77056m268m417m492m508m509m315l725l009k685k737k631k262k236k894
$$ 277056 272788 268371 263879 259371 254862 250547 246822 243813 241128 238391 235760 233498 231262 228368
53871B28368l688l994l959l969l832l163k257j769j720j537j056p93j032j316
$$ 228368 224680 220686 216727 212758 208926 205763 203506 201737 200017 198480 197424 196631 195599 194283
53857A94283j117o16m18q21j543k028j829q72L69J166J171P10L03L5l04o57o46
$$ 194283 193166 192550 192132 191311 189768 187740 185911 185039 185408 186574 187745 188455 188758 188793 188489 187832 187186
53840A87186k02J92Q0l27m27m2L92M32R4l67p80r82p16K8P68J007R04J041J573
$$ 187186 186984 187176 187256 186929 186502 186460 186852 187284 187378 187011 186231 185249 184533 184561 185329 186336 187240 188281 189854
53821A89854K002J881J406J030Q24N58K50K82Q71J721K359K568K368J725O89j91
$$ 189854 191856 193737 195143 196173 196997 197555 197805 198087 198958 200679 203038 205606 207974 209699 210388 210197
53805B10197q1J251K981L996L994L519L164L097L237L401L293K847K540K856L430
$$ 210197 210116 211367 214348 218344 222338 225857 229021 232118 235355 238756 242049 244896 247436 250292 253722
53790B53722L445K869K483K475K000O35o26o67J24M53j65j192k137k885l175k801
$$ 253722 257167 260036 262519 264994 266994 267629 267003 266336 266460 266913 266748 265556 263419 260534 257359 254558
53774B54558k250k293k874l233l072k823k772k741k723k935l132k768j968j537
$$ 254558 252308 250015 247141 243908 240836 238013 235241 232500 229777 226842 223710 220942 218974 217437
53760B17437j753j979j748j420j388j424j257j100j099r39m51k7N3J13L99M93
$$ 217437 215684 213705 211957 210537 209149 207725 206468 205368 204269 203330 202879 202852 202905 203018 203417 203910
53744B03910N2m09j74N28Q26M29k9J09P40J194R27J04m54q0R01J430R36l3n36
$$ 203910 203962 203553 203379 203907 204733 205162 205133 205242 205982 207176 208103 208207 207753 207673 208574 210004 210940 210907 210371
53725B10371k00O91J647K264K397K265K141J886J246N37M51J047J639J877K172
$$ 210371 210171 210862 212509 214773 217170 219435 221576 223462 224708 225245 225696 226743 228382 230259 232431
53710B32431K698K871K363J887K268L276M071M293M024L177J782N87N04J518K695
$$ 232431 235129 238000 240363 242250 244518 247794 251865 256158 260182 263359 265141 265728 266232 267750 270445
53695B70445L272L234K991K899L037L113K743K040J547J433J174L84n82j215j483
$$ 270445 273717 276951 279942 282841 285878 288991 291734 293774 295321 296754 297928 298312 297730 296515 295032
53680B95032j453r21K2O67N60J46o5l15q39j084o22j58m94j075q42r9p1q18j100
$$ 295032 293579 292658 292680 293347 293907 294053 293988 293673 292834 291750 291128 290970 290476 289401 288559 288460 288389 287571 286471
53661B86471m03L43L69O8n8k56p15r40o29k55j85L2Q00J595J705J358J311J669
$$ 286471 286068 286411 286780 286848 286790 286534 285819 284879 284250 283995 283810 283842 284642 286237 287942 289300 290611 292280
53643B92280J852J599J398J847K987M219M775M275L034J747Q84M63L35L70M08
$$ 292280 294132 295731 297129 298976 301963 306182 310957 315232 318266 320013 320897 321360 321695 322065 322473
53628C22473L77M49P58R97P66K37P4O34J662K752L573L750L102K161J789K126
$$ 322473 322850 323299 324057 325054 325820 326057 326131 326765 328427 331179 334752 338502 341604 343765 345554 347680
53612C47680K438K209J866K115L017L957M271L737K804K341K718L224K867J747
$$ 347680 350118 352327 354193 356308 359325 363282 367553 371290 374094 376435 379153 382377 385244 386991
53598C86991R39R53J146R27O40P63R32M62n38j328j537j462j449j425j095m52
$$ 386991 387930 388883 390029 390956 391596 392359 393291 393753 393215 391887 390350 388888 387439 386014 384919 384467
53582C84467K9k16j048j553j134m49o02j538k116j837j456j613j844j565j126
$$ 384467 384496 384280 383232 381679 380545 380096 379494 377956 375840 374003 372547 370934 369090 367525 366399
53567C66399j077j162q64m47n38j025j250j059q38o64k25M33Q02P04N78P90J140
$$ 366399 365322 364160 363296 362849 362311 361286 360036 358977 358139 357475 357250 357683 358485 359189 359767 360557 361697
53550C61697J182P86K54M0L71J070J782K436L125L635L510K852K475K871L545
$$ 361697 362879 363665 363919 363959 364330 365400 367182 369618 372743 376378 379888 382740 385215 388086 391631
53535C91631L830L853M111M590N063N861P446R349J0411J0187R388Q858Q782R034
$$ 391631 395461 399314 403425 408015 413078 418939 426385 435734 446145 456332 465720 474578 483360 492394
53521D92394R611J0456J1336J2195J3159J4090J4587J4648J4847J5609J6686J7695
$$ 492394 502005 512461 523797 535992 549151 563241 577828 592476 607323 622932 639618 657313
53509F57313J8763K0207K1784K2738K2682K2098K1820K2122K2465K2183K1267
$$ 657313 676076 696283 718067 740805 763487 785585 807405 829527 851992 874175 895442
53498H95442K0337J9844J9564J8976J7879J6544J5424J4952J5268J5919J6118
$$ 895442 915779 935623 955187 974163 992042 1008586 1024010 1038962 1054230 1070149 1086267
53487A086267J5654J5283J5726J6536J6528J5335J3918J3357J3698J4183J4207
$$ 1086267 1101921 1117204 1132930 1149466 1165994 1181329 1195247 1208604 1222302 1236485 1250692
53476A250692J3677J2726J1492J0053Q379O393M231K309R63J3j070k640m603o681
$$ 1250692 1264369 1277095 1288587 1298640 1307019 1313412 1317643 1319952 1320915 1320928 1319858 1317218 1312615 1305934
53462A305934q712j0596j2001j2519j2176j1641j1632j2256j3113j3958j4859
$$ 1305934 1297222 1286626 1274625 1262106 1249930 1238289 1226657 1214401 1201288 1187330 1172471
53451A172471j5739j6266j6324j6202j6118j5892j5372j4712j3988j2964j1604
$$ 1172471 1156732 1140466 1124142 1107940 1091822 1075930 1060558 1045846 1031858 1018894 1007290
53440A007290j0397r634q786p198n190l691k923k194r92M32J721K962M209N075
$$ 1007290 996893 987259 978473 971275 966085 962394 959471 957277 956285 956717 958438 961400 965609 970684
53426I70684N259N113N283N979O999Q234R742J1354J2673J3579J4477J5865J7715
$$ 970684 975943 981056 986339 992318 999317 1007551 1017293 1028647 1041320 1054899 1069376 1085241 1102956
53413A102956J9457K0552K1031K1378K2026K3037K4240K5483K6744K8127K9763
$$ 1102956 1122413 1142965 1163996 1185374 1207400 1230437 1254677 1280160 1306904 1335031 1364794
53402A364794L1543L3075L4186L5353L7185L9463M1255M2168M2902M4192M5743
$$ 1364794 1396337 1429412 1463598 1498951 1536136 1575599 1616854 1659022 1701924 1746116 1791859
53391A791859M6740M6915M6610M6156M5804M5864M6173M5769M3937M1383L9423
$$ 1791859 1838599 1885514 1932124 1978280 2024084 2069948 2116121 2161890 2205827 2247210 2286633
53380B286633L8173L6473L3668L0409K7425K4509K1233J7745J4257J0409N906
$$ 2286633 2324806 2361279 2394947 2425356 2452781 2477290 2498523 2516268 2530525 2540934 2546840
53369B546840J276k811o602j0972j6228k1827k7137l1901l5989l9253m1669m3313
$$ 2546840 2548116 2545305 2538703 2527731 2511503 2489676 2462539 2430638 2394649 2355396 2313727 2270414
53357B270414m4160m4298m4203m4431m4885m4850m3839m2115m0266l8545l6869
$$ 2270414 2226254 2181956 2137753 2093322 2048437 2003587 1959748 1917633 1877367 1838822 1801953
53346A801953l5320l4236l3698l3235l2302l0958k9711k8651k7184k4949k2598
$$ 1801953 1766633 1732397 1698699 1665464 1633162 1602204 1572493 1543842 1516658 1491709 1469111
53335A469111k1054k0211j8987j6757j4111j2038j0894j0452j0384j0335r998
$$ 1469111 1448057 1427846 1408859 1392102 1377991 1365953 1355059 1344607 1334223 1323888 1313890
53324A313890r531r585j0503j1789j2681j2958j2760j2054j0856r699r184r075
$$ 1313890 1304359 1294774 1284271 1272482 1259801 1246843 1234083 1222029 1211173 1201474 1192290 1183215
53312A183215q506p123n519m410l842l444k954k320j513o03K50J059K173L895
$$ 1183215 1174709 1167586 1162067 1157657 1153815 1150371 1147417 1145097 1143584 1142981 1143231 1144290 1146463 1150358
53298A150358O082Q231R946J1217J2312J3548J5090J6820J8324J9216J9495J9564
$$ 1150358 1156440 1164671 1174617 1185834 1198146 1211694 1226784 1243604 1261928 1281144 1300639 1320203
53286A320203J9757J9907J9523J8422J6962J5499J3907J1939R899Q337P082N194
$$ 1320203 1339960 1359867 1379390 1397812 1414774 1430273 1444180 1456119 1466018 1474355 1481437 1486631
53274A486631K236r69l361n037o950r421j1763j3448j4904j6728j8717k0203k1121
$$ 1486631 1488867 1487898 1484537 1479500 1472550 1463129 1451366 1437918 1423014 1406286 1387569 1367366 1346245
53261A346245k2041k3256k4344k4845k4970k5281k5836k6049k5442k4294k3340
$$ 1346245 1324204 1300948 1276604 1251759 1226789 1201508 1175672 1149623 1124181 1099887 1076547
53250A076547k2956k2857k2529k1808k0941k0255j9867j9642j9277j8508j7296
$$ 1076547 1053591 1030734 1008205 986397 965456 945201 925334 905692 886415 867907 850611
53239H50611j5896j4704j4048j3978j4132j3830j2594j0653q789p544o787o156
$$ 850611 834715 820011 805963 791985 777853 764023 751429 740776 731987 724443 717656 711500
53227G11500n653n549n832o155o324o511o933p553q244r090j0223j1502j2530
$$ 711500 705847 700298 694466 688311 681987 675476 668543 660990 652746 643656 633433 621931 609401
53214F09401j3050j3144j2982j2512j1606j0478r681r538r760r793r490r166r063
$$ 609401 596351 583207 570225 557713 546107 535629 525948 516410 506650 496857 487367 478201 469138
53201D69138r117r242r507r882j0131j0133j0047r943r565q789q021p731p750
$$ 469138 460021 450779 441272 431390 421259 411126 401079 391136 381571 372782 364761 357030 349280
53188C49280p483o778o083n752n604n399n251n307n326m920m076l171k529k154
$$ 349280 341797 335019 328936 323184 317580 312181 306930 301623 296297 291377 287301 284130 281601 279447
53174B79447j877j564j221j052j295j926k513k569j976r94M8R07J299R92P7r69
$$ 279447 277570 276006 274785 273733 272438 270512 267999 265430 263454 262460 262508 263415 264714 265706 265783 264814
53158B64814j678j911j751j224l74M63Q06N36O1k46n47j214k044k272j504m08
$$ 264814 263136 261225 259474 258250 257876 258339 259145 259681 259742 259496 258949 257735 255691 253419 251915 251507
53142B51507o8p22j450j240j32Q56Q55%p74o74K46J181J318N39m73p89l6J296
$$ 251507 251439 250717 249267 248027 247895 248751 249606 249606 248832 248158 248404 249585 250903 251442 250969 250180 250144 251440
53124B51440K286K348J686J004Q50J196J619J803J802J809J768J366M69n65j198
$$ 251440 253726 256074 257760 258764 259614 260810 262429 264232 266034 267843 269611 270977 271446 270881 269683
53109B69683j252j028q30o55m27k68l50n84p58r09j249j723j967j788j489j490
$$ 269683 268431 267403 266573 265918 265491 265223 264873 264289 263531 262622 261373 259650 257683 255895 254406 252916
53093B52916j803k043j941j592j207q08k54M02Q13O64J28k75k66j58m35j074j525
$$ 252916 251113 249070 247129 245537 244330 243522 243268 243670 244483 245147 245275 245000 244734 244576 244141 243067 241542
53076B41542j355p17j44n5m34r01j035p67m54l93l83q5K88L5j035k065j972o50
$$ 241542 240187 239470 239326 239271 238837 237936 236901 236134 235680 235287 234904 234819 235107 235142 234107 232042 230070 229420
53058B29420Q92J547J062Q4n09l43K38O12N09J57j98n79j002j187p98N1Q62J213
$$ 229420 230312 231859 232921 233005 232496 232153 232391 233003 233512 233669 233471 232892 231890 230703 229905 229956 230818 232031
53040B32031J033N20J1j44J30N07N70K95K1l0l2k02m01k57K93Q07Q30N06L86N52
$$ 232031 233064 233584 233595 233451 233581 234088 234658 234953 234974 234944 234912 234710 234309 234052 234345 235152 235982 236488 236874 237426
53020B37426L46o54j719j756q71l72q96j482j006J55Q42Q84J077J553J471N84
$$ 237426 237772 237118 235399 233643 232772 232400 231504 230022 229016 229171 230013 230897 231974 233527 234998 235582
53004B35582k2N62J655J907J135L42J87K87J00k90n82p84r41p38P9J119J651J495
$$ 235582 235560 236122 237777 239684 240819 241161 241348 241635 241735 241445 240863 240079 239138 238400 238479 239598 241249 242744
52986B42744J144R68P08O5o25p26j49N52Q83Q25N21P7k12Q0Q80J407J026J45k51
$$ 242744 243888 244856 245564 245629 245004 244278 244129 244681 245564 246389 246910 246987 246775 246855 247735 249142 250168 250313 250062
52967B50062K06R29J189R62Q40J303K112K337J244o57j798j188L41J066L26j026
$$ 250062 250268 251197 252386 253348 254188 255491 257603 259940 261184 260527 258729 257541 257882 258948 259274 258248
52951B58248j962k230k004j404p65o49j115j439j051l15P8jl16q64j582j848j109
$$ 258248 256286 254056 252052 250648 249883 249234 248119 246680 245629 245314 245392 245391 245075 244211 242629 240781 239672
52934B39672J21P12L86k1Q6K41k12j009j338q57P7R86J556J567R86J80l23l62
$$ 239672 239793 240505 240891 240870 240956 241197 240985 239976 238638 237781 237858 238844 240400 241967 242953 243133 242810 242448
52916B42448k12j06L4L61Q08J103J004M59k96q20q35n23l39m51o09n65m43m86
$$ 242448 242236 242130 242164 242525 243333 244436 245440 245899 245603 244783 243948 243425 243086 242635 242026 241461 241018 240532
52898B40532p05r06r42p14j54N54R39Q12O31R29J454J498J050R05J447J987J805
$$ 240532 239827 238921 237979 237265 237111 237665 238604 239416 240047 240976 242430 243928 244978 245883 247330 249317 251122
52881B51122J236J054J210R95K46m03n52n36p02q16m81K74J140J880K327K293
$$ 251122 252358 253412 254622 255617 255863 255460 254908 254372 253670 252854 252373 252647 253787 255667 257994 260287
52865B60287J753R45J76k48k6P45J231N55j032k273k454k176k221k381k054j409
$$ 260287 262040 262985 263161 262913 262887 263632 264863 265418 264386 262113 259659 257483 255262 252881 250827 249418
52849B49418j163j484j849j842j520j138j063j681k753l211k310p57J02Rj88j31
$$ 249418 248255 246771 244922 243080 241560 240422 239359 237678 234925 231714 229404 228647 228749 228758 228570 228439
52833B28439l62r91j185n25J58K8n04n97l11j91j27L27Q31N95k44o51k39K03M0
$$ 228439 228077 227086 225901 225376 225534 225562 225058 224461 224150 223959 223832 224159 224990 225585 225341 224690 224451 224654 224694
52814B24694k41N1O29P50M37M22R43J377J220P92O17M91j91j351k074j833j241
$$ 224694 224453 224504 225133 225883 226320 226742 227685 229062 230282 231074 231691 232182 231991 230640 228566 226733 225492
52797B25492j184j539j542j100r31j170r71O9R62O73k70n57r2L8n19q07k12N66
$$ 225492 224308 222769 221227 220127 219196 218026 217055 217124 218086 218759 218489 217932 217840 217878 217359 216552 216340 216906
52779B16906O84M03L68M67K41j17p7K49K46k39p92j083j022m95L38P20J22p65
$$ 216906 217590 217993 218361 218828 219069 218952 218875 219124 219370 219131 218339 217256 216234 215739 216077 216797 216919 216154
52761B16154p25K95J131J075O53M42K40j38j90M05J005R43O20P62J127R46L72
$$ 216154 215429 215724 216855 217930 218583 219025 219265 219127 218937 219342 220347 221290 221910 222672 223799 224745 225117
52744B25117L52J094J724J703J583J926K306J962J001K60K35O35Q70O81K57OJ41
$$ 225117 225469 226563 228287 229990 231573 233499 235805 237767 238768 239028 239263 239898 240768 241449 241706 241712 241853
52727B41853M00L15j33l90m5O05R14O71J84k60p01j220j593j359k87J167J957
$$ 241853 242253 242568 242435 242045 242000 242605 243519 244190 244374 244114 243413 242193 240600 239241 238954 240121 242078
52710B42078J338k65j485j409n22k3l98j078j372j213q62l24M93J251J275L46
$$ 242078 243416 243151 241666 240257 239735 239712 239314 238236 236864 235651 234789 234465 234958 236209 237484 237830
52694B37830q97j493j070q5O64P09J28n98r14n56J99P54P51L75P0N3K48M88O54
$$ 237830 236933 235440 234370 234285 234949 235658 235786 235188 234274 233718 233917 234671 235422 235797 235867 235920 236168 236656 237310
52675B37310P05O97O71M32k69j166j409n41P11J129M50m35o68k33M30J023J325
$$ 237310 238015 238712 239383 239815 239546 238380 236971 236430 237141 238270 238720 238285 237617 237384 237814 238837 240162
52658B40162J171Q62J044J776K197J702R14Q48J410J519O40n29j025p04j24J46
$$ 240162 241333 242195 243239 245015 247212 248914 249828 250676 252086 253605 254245 253716 252691 251987 251863 252009
52642B52009j01p03j250j397j164p93l62J88O92Q66Q34J110J830K399K194J376
$$ 252009 251908 251205 249955 248558 247394 246601 246239 246427 247119 247985 248819 249929 251759 254158 256352 257728
52626B57728P17P38J241J585J273L04p85j307r77j62M61M59j11q20j172r52m50
$$ 257728 258445 259183 260424 262009 263282 263586 262801 261494 260517 260355 260816 261275 261164 260344 259172 258220 257770
52609B57770k52n94r86p13L01J298J582J301J049Q99L57n62r16rJ407J879J069
$$ 257770 257518 256924 255938 255225 255526 256824 258406 259707 260756 261655 262012 261450 260534 260525 261932 263811 264880
52592B64880Om81p25j246j688j377m48L24N58N48O86J117J729K038J431L4j036
$$ 264880 264886 264405 263680 262434 260746 259369 258921 259245 259803 260351 261037 262154 263883 265921 267352 267386 266350
52575B66350q95r8J34m85j225j570j578j187k96M67J91q78j415q30k2J33j6K23
$$ 266350 265455 265357 265491 265006 263781 262211 260633 259446 259150 259617 259808 258930 257515 256685 256663 256796 256780 257003
52557B57003P40R98Q14J09j222k630k927j817n78l43n37r8O01M05n83j156r28
$$ 257003 257743 258741 259555 259664 258442 255812 252885 251068 250490 250147 249610 249512 250113 250518 249935 248779 247851
52540B47851o39n37L8J193J913J497N15j92n09n66j15R02J850K071J650J041M79
$$ 247851 247212 246675 246713 247906 249819 251316 251831 251639 251130 250564 250449 251351 253201 255272 256922 257963 258442
52523B58442J36L18R33J253Q19J83J72P70J288J391J337J360J375J298J209J160
$$ 258442 258578 258896 259829 261082 261901 262084 262256 263026 264314 265705 267042 268402 269777 271075 272284 273444
52507B73444J109J082J143J229J199R81N79M2m89r16j404k171k938l010k192j222
$$ 273444 274553 275635 276778 278007 279206 280187 280766 280808 280319 279403 277999 275828 272890 269880 267688 266466
52491B66466r16j133j079m41L19P01O92M78R3m05p30o53l39j97l54m74j63N47
$$ 266466 265550 264417 263338 262897 263216 263917 264609 265087 265180 264775 264045 263392 263053 262856 262502 262028 261865 262412
52473B62412J233J538J468J219R46Q43J172J940K662K785K274J583J110R63J082
$$ 262412 263645 265183 266651 267870 268816 269659 270831 272771 275433 278218 280492 282075 283185 284148 285230
52458B85230J245J164Q28O30O39J91j154k568k826k107j750k169k309j588r64
$$ 285230 286475 287639 288467 289097 289736 289927 288773 286205 283379 281272 279522 277353 275044 273456 272492
52443B72492j259j670j160k59j46o28o07p9r9p97j103o11l09q74j508j164j1J009
$$ 272492 271233 269563 268403 268144 267998 267370 266763 266684 266585 265788 264685 264074 263765 262891 261383 260219 260208 261217
52425B61217J444J390J012N47L68M87M61K12L81J320K320K503K082J969K476L134
$$ 261217 262661 264051 265063 265610 265978 266465 266926 267138 267519 268839 271159 273662 275744 277713 280189 283323
52409B83323L678M412N458O329O524O171N832N823N855N294L812J848K45o65j417
$$ 283323 287001 291413 296871 303200 309724 315895 321727 327550 333405 338699 342511 344359 344604 343939 342522
52394C42522k618m079n053n177m785m357m006l581k988k287j603r77k87N94J530
$$ 342522 339904 335825 330772 325595 320810 316453 312447 308866 305878 303591 301988 301011 300724 301318 302848
52379C02848K144K250K082J981K017K132K408K875L261L319L262L487L824L632
$$ 302848 304992 307242 309324 311305 313322 315454 317862 320737 323998 327317 330579 334066 337890 341522
52365C41522K686J595J065J031R03M14r4k84k46k12j08K99R13J307J295J235J524
$$ 341522 344208 345803 346868 347899 348802 349216 349122 348838 348592 348380 348272 348571 349484 350791 352086 353321 354845
52348C54845K009K186J930J680J914K645L516M118M236L996L950M661O057P360
$$ 354845 356854 359040 360970 362650 364564 367209 370725 374843 379079 383075 387025 391686 397743 405103
52334D05103P858P588P190P291Q213R930J1998J3670J4488J4773J5271J6307J7484
$$ 405103 412961 420549 427739 435030 443243 453173 465171 478841 493329 508102 523373 539680 557164
52321E57164J8273J8662J9105J9920K0911K1622K1919K2119K2487K2803K2681
$$ 557164 575437 594099 613204 633124 654035 675657 697576 719695 742182 764985 787666
52310G87666K2175K1755K1677K1710K1575K1225K0679J9885J8977J8236J7616
$$ 787666 809841 831596 853273 874983 896558 917783 938462 958347 977324 995560 1013176
52299A013176J6698J5315J3835J2492J0886Q581N830L205Q07j638m083o182p832
$$ 1013176 1029874 1045189 1059024 1071516 1082402 1090983 1096813 1100018 1100825 1099187 1095104 1088922 1081090
52286A081090r124r881r799r107q481q192p861p135o190n322m560l773k811j399
$$ 1081090 1071966 1062085 1052286 1043179 1034698 1026506 1018645 1011510 1005320 999998 995438 991665 988854 987455
52272I87455P46L497O256Q503J0122J1197J1882J2474J3267J4099J4564J4722
$$ 987455 988201 991698 997954 1006457 1016579 1027776 1039658 1052132 1065399 1079498 1094062 1108784
52260A108784J5105J5791J6039J5328J4230J3679J3685J3389J2248J0558Q825
$$ 1108784 1123889 1139680 1155719 1171047 1185277 1198956 1212641 1226030 1238278 1248836 1257661
52249A257661P170N486L684J626q80l754o553q950j1096j3338j5661j7663j9056
$$ 1257661 1264831 1270317 1274001 1275627 1274747 1270993 1264440 1255490 1244394 1231056 1215395 1197732 1178676
52236A178676j9980k0776k1581k2232k2522k2448k2159k1788k1347k0725j9770
$$ 1178676 1158696 1137920 1116339 1094107 1071585 1049137 1026978 1005190 983843 963118 943348
52225I43348j8495j7215j6307j5752j5055j3827j2284j0967j0061r250q138o559
$$ 943348 924853 907638 891331 875579 860524 846697 834413 823446 813385 804135 795997 789438
52213G89438m570k465p73J03L22L45L09N3k48l2Q46J779K204K282K382K296J642
$$ 789438 784868 782403 781630 781733 782055 782400 782709 782762 782514 782482 783328 785107 787311 789593 791975 794271 795913
52196G95913P62N33J229K205K833L193L558L696L204K239J439J086P90P0j028
$$ 795913 796675 797208 798437 800642 803475 806668 810226 813922 817126 819365 820804 821890 822680 822750 821722
52181H21722k090k873l476m041m646n351o112o547o153m947l632k911k742k604
$$ 821722 819632 816759 813283 809242 804596 799245 793133 786586 780433 775486 771854 768943 766201 763597
52167G63597k219j673r69K1J123J869K151K440L104L846M133L939L705L700L750
$$ 763597 761378 759705 758736 758757 759880 761749 763900 766340 769444 773290 777423 781362 785067 788767 792517
52152G92517L591L204K816K667K793K980L041L084L376L837M055L946M049M834
$$ 792517 796108 799312 802128 804795 807588 810568 813609 816693 820069 823906 827961 831907 835956 840790
52138H40790N919O440O112N619N825O961Q561J0060J1277J2409J3745J5398J7392
$$ 840790 846709 853149 859261 864880 870705 877666 886227 896287 907564 919973 933718 949116 966508
52125I66508J9815K2644K5431K7549K8924L0205L1892L3578L4416L4140L3237
$$ 966508 986323 1008967 1034398 1061947 1090871 1121076 1152968 1186546 1220962 1255102 1288339
52114A288339L2186L1003K9446K7365K4751K1859J9278J7475J6182J4551J2179
$$ 1288339 1320525 1351528 1380974 1408339 1433090 1454949 1474227 1491702 1507884 1522435 1534614
52103A534614R585P414N485L082R5k653m364n245o286q166j0675j3197j5456j7567
$$ 1534614 1544199 1551613 1557098 1560180 1560275 1557622 1553258 1548013 1541727 1533561 1522886 1509689 1494233 1476666
52089A476666j9568k1294k2651k3707k4352k4208k3020k1043j8833j6810j5083
$$ 1476666 1457098 1435804 1413153 1389446 1365094 1340886 1317866 1296823 1277990 1261180 1246097
52078A246097j3500j1688r308o480l822j797j70J687M087O845R570J1839J3290
$$ 1246097 1232597 1220909 1211601 1205121 1201299 1199502 1199332 1201019 1205106 1211951 1221521 1233360 1246650
52065A246650J3995J4660J5969J7749J9140J9670J9641J9389J8709J7355J5711
$$ 1246650 1260645 1275305 1291274 1309023 1328163 1347833 1367474 1386863 1405572 1422927 1438638
52054A438638J4412J3441J2110J0052P798O076M708K655p35m860q553j1387j3866
$$ 1438638 1453050 1466491 1478601 1488653 1496451 1502527 1507235 1509890 1509155 1504295 1495742 1484355 1470489
52041A470489j6364j8542k0029k1140k2336k3325k3408k2618k1876k1875k2369
$$ 1470489 1454125 1435583 1415554 1394414 1372078 1348753 1325345 1302727 1280851 1258976 1236607
52030A236607k2742k2880k3044k3257k3203k2728k2079k1531k0938j9857j8150
$$ 1236607 1213865 1190985 1167941 1144684 1121481 1098753 1076674 1055143 1034205 1014348 996198
52019I96198j6366j5343j5350j5746j5569j4386j2571j0980j0339j0636j0979
$$ 996198 979832 964489 949139 933393 917824 903438 890867 879887 869548 858912 847933
$$ [...]
##END NTUPLES=NMR SPECTRUM
##END=
