
##TITLE=AC1332_INDRS10071_6524609_CTcGbNYVTk
##JCAMPDX= 6.0         $$ Bruker NMR JCAMP-DX V2.0
##DATA TYPE= NMR SPECTRUM
##DATA CLASS= NTUPLES
##ORIGIN= BRUKER
##OWNER= Administrator
$$ 1.72 TOPSPIN		Version 2.1
$$ 2012-07-14 21:38:11.656 -0500  Administrator@TOPSPIN
$$ Compression mode = diff/dup
##.OBSERVE FREQUENCY= 400.02188249412
##.OBSERVE NUCLEUS= ^1H
##.ACQUISITION MODE= SIMULTANEOUS (DQD)
##.ACQUISITION SCHEME= undefined
##.AVERAGES= 8
##.DIGITISER RES= 22
##SPECTROMETER/DATA SYSTEM= spect
##.PULSE SEQUENCE= zg30
##.SOLVENT NAME= COFFEE_meoh
##.SHIFT REFERENCE= INTERNAL, COFFEE_meoh, 1, 14.98509
##AUDIT TRAIL= $$ (NUMBER, WHEN, WHO, WHERE, PROCESS, VERSION, WHAT)
$$ ##TITLE= Audit trail, TOPSPIN		Version 2.1
$$ ##JCAMPDX= 5.01
$$ ##ORIGIN= Bruker BioSpin GmbH
$$ ##OWNER= Administrator
$$ $$ C:\Bruker\TOPSPIN/data/COFFEE/nmr/AC1332_INDRS10071_6524609_CTcGbNYVTk/10/pdata/1/auditp.txt
$$ ##AUDIT TRAIL=  $$ (NUMBER, WHEN, WHO, WHERE, PROCESS, VERSION, WHAT)
(   1,<2012-07-14 21:38:04.953 -0500>,<Administrator>,<TOPSPIN>,<go>,<TOPSPIN 2.1>,
      <created by zg
	started at 2012-07-14 21:36:58.000 -0500,
	POWCHK enabled, PULCHK disabled,
       configuration hash MD5:
       6B 1B 68 BB D9 2E 58 E2 7F 35 AD 54 07 DF 0E 41
       data hash MD5: 64K
       84 67 12 35 F4 E4 A9 64 5C 2B 3E 0A B4 62 79 D6>)
(   2,<2012-07-14 21:38:07.562 -0500>,<Administrator>,<TOPSPIN>,<proc1d>,<TOPSPIN 2.1>,
      <Start of raw data processing
       efp LB = 0 FT_mod = 6 PKNL = 1 PHC0 = 0 PHC1 = 0 SI = 32K 
       data hash MD5: 32K
       2C BE B8 FF 75 91 94 B6 77 35 B4 07 7B 1B D0 99>)
(   3,<2012-07-14 21:38:07.953 -0500>,<Administrator>,<TOPSPIN>,<proc1d>,<TOPSPIN 2.1>,
      <pk PHC0 = 176.9293 PHC1 = 0 
       data hash MD5: 32K
       13 64 3F 07 BA FA 3E CE AD E6 5D 48 31 A1 E2 5F>)
(   4,<2012-07-14 21:38:08.062 -0500>,<Administrator>,<TOPSPIN>,<proc1d>,<TOPSPIN 2.1>,
      <abs ABSG = 1 
       data hash MD5: 32K
       02 20 55 E3 11 7F C3 9A F8 4B 7E A0 B0 48 9F A9>)
(   5,<2012-07-14 21:38:08.109 -0500>,<Administrator>,<TOPSPIN>,<proc1d>,<TOPSPIN 2.1>,
      <abs ABSG = 2 
       data hash MD5: 32K
       74 04 60 D0 E8 83 2B E3 FF 76 CD 49 2A 5F 20 FE>)
(   6,<2012-07-14 21:38:08.140 -0500>,<Administrator>,<TOPSPIN>,<proc1d>,<TOPSPIN 2.1>,
      <abs ABSG = 3 
       data hash MD5: 32K
       5A FE 48 E9 C3 74 8B 8D 94 86 5B FF EF C3 00 BC>)
(   7,<2012-07-14 21:38:08.171 -0500>,<Administrator>,<TOPSPIN>,<proc1d>,<TOPSPIN 2.1>,
      <abs ABSG = 4 
       data hash MD5: 32K
       5F E1 21 F5 E4 0B BF C2 A3 76 A4 4D 26 1A BC 49>)
(   8,<2012-07-14 21:38:08.203 -0500>,<Administrator>,<TOPSPIN>,<proc1d>,<TOPSPIN 2.1>,
      <abs ABSG = 5 
       data hash MD5: 32K
       EA FE 23 64 32 BC FA D3 9E 2E 9C E4 9F 48 0B C1>)
$$ ##END=
$$ 
$$ $$ hash MD5
$$ $$ E5 0F 6E 87 61 11 DA 32 85 79 20 9A DB 43 13 4C
##$RELAX= 
##$RELAX= 
##$RELAX= 
##$RELAX= 
##$RELAX= 
##$RELAX= 
##$RELAX= 
$$ Bruker specific parameters
$$ --------------------------
$$ [...]
150 150 150 150 150 150 150 150
##$TP07= 0
##$TPNAME0= <>
##$TPNAME1= <>
##$TPNAME2= <>
##$TPNAME3= <>
##$TPNAME4= <>
##$TPNAME5= <>
##$TPNAME6= <>
##$TPNAME7= <>
##$TPOAL= (0..7)
0.5 0.5 0.5 0.5 0.5 0.5 0.5 0.5
##$TPOFFS= (0..7)
0 0 0 0 0 0 0 0
##$TUNHIN= 0
##$TUNHOUT= 0
##$TUNXOUT= 0
##$USERA1= <user>
##$USERA2= <user>
##$USERA3= <user>
##$USERA4= <user>
##$USERA5= <user>
##$V9= 5
##$VALIST= <valist>
##$VCLIST= <CCCCCCCCCCCCCCC>
##$VD= 0
##$VDLIST= <DDDDDDDDDDDDDDD>
##$VPLIST= <PPPPPPPPPPPPPPP>
##$VTLIST= <TTTTTTTTTTTTTTT>
##$WBST= 2048
##$WBSW= 25
##$XGAIN= (0..3)
0 0 0 0
##$XL= 0
##$YL= 0
##$YMAX_a= 482236
##$YMIN_a= -608065
##$ZGOPTNS= <>
##$ZL1= 120
##$ZL2= 120
##$ZL3= 120
##$ZL4= 120
##$ABSF1= 14.98509
##$ABSF2= -5.573092
##$ABSG= 5
##$ABSL= 3
##$ALPHA= 0
##$AQORDER= 0
##$ASSFAC= 0
##$ASSFACI= 0
##$ASSFACX= 0
##$ASSWID= 0
##$AUNMP= <proc_prof1d_extract_pilot.lims>
##$AXLEFT= 0
##$AXNAME= <>
##$AXNUC= <1H>
##$AXRIGHT= 0
##$AXTYPE= 0
##$AXUNIT= <>
##$AZFE= 0.1
##$AZFW= 0.1
##$BCFW= 0
##$BC_mod= 0
##$BYTORDP= 0
##$COROFFS= 0
##$CY= 15
##$DATMOD= 1
##$DC= 0
##$DFILT= <>
##$DTYPP= 0
##$F1P= 0
##$F2P= 0
##$FCOR= 0.5
##$FTSIZE= 32768
##$FT_mod= 6
##$GAMMA= 0
##$GB= 0
##$INTBC= 1
##$INTSCL= 1
##$ISEN= 128
##$LB= 0
##$LEV0= 0
##$LPBIN= 0
##$MAXI= 10000
##$MC2= 0
##$MEAN= 0
##$ME_mod= 0
##$MI= 0
##$NCOEF= 0
##$NC_proc= -8
##$NLEV= 6
##$NOISF1= 0
##$NOISF2= 0
##$NSP= 0
##$NTH_PI= 0
##$NZP= 0
##$OFFSET= 14.98509
##$PC= 1
##$PHC0= 176.9293
##$PHC1= 0
##$PH_mod= 1
##$PKNL= yes
##$PPARMOD= 0
##$PPDIAG= 0
##$PPIPTYP= 0
##$PPMPNUM= 2147483647
##$PPRESOL= 1
##$PSCAL= 4
##$PSIGN= 0
##$PYNMP= <proc.py>
##$REVERSE= no
##$SF= 400.02
##$SI= 32768
##$SIGF1= 0
##$SIGF2= 0
##$SINO= 400
##$SIOLD= 32768
##$SPECTYP= <>
##$SREGLST= <1H.CDCl3>
##$SSB= 0
##$STSI= 32768
##$STSR= 0
##$SW_p= 8223.68421052631
##$SYMM= 0
##$S_DEV= 0
##$TDeff= 65536
##$TDoff= 0
##$TI= <>
##$TILT= no
##$TM1= 0
##$TM2= 0
##$TOPLEV= 0
##$USERP1= <user>
##$USERP2= <user>
##$USERP3= <user>
##$USERP4= <user>
##$USERP5= <user>
##$WDW= 1
##$XDIM= 32768
##$YMAX_p= 473365196
##$YMIN_p= -687920
##$CURPLOT= <Network HP LaserJet P1505>
##$CURPRIN= <$Network HP LaserJet P1505>
##$DFORMAT= <normdp>
##$LAYOUT= <+/1D_H.xwp>
##$LFORMAT= <normlp>
##$PFORMAT= <normpl>
##$SURQMSG= 1
$$ End of Bruker specific parameters
$$ ---------------------------------
##NTUPLES= NMR SPECTRUM
##VAR_NAME=  FREQUENCY,     SPECTRUM/REAL,   SPECTRUM/IMAG
##SYMBOL=    X,             R,               I
##VAR_TYPE=  INDEPENDENT,   DEPENDENT,       DEPENDENT
##VAR_FORM=  AFFN,          ASDF,            ASDF
##VAR_DIM=   32768,         32768,           32768
##UNITS=     HZ,            ARBITRARY UNITS, ARBITRARY UNITS
##FACTOR=    0.250966925370066, 1,           1
##FIRST=     8223.43324360094, -61676,       28331
##LAST=      0,             129691,          -115867
##MIN=       0,             -687920,         0
##MAX=       8223.43324360094, 473365196,    0
$$ Real data points
##PAGE= N=1
##DATA TABLE= (X++(R..R)), XYDATA
$$ [...]
19567A37762h2171j35967e3601D64901a3627A85440G5011b05094B8839M68185
19557D97024b23248m1573H8674a31762O1473k46787A26716l6236Q1657L9493a40979
19545b26836C11112b85245n4272C2731J44995E1472a49260A18919M5937a5754
19534C85136g9667H2299J8203J24034c54937J67488j89566C2429J75528a71538
19523i1913j02112g8511A19603g2763l864A30120b45520h5301L1954j96099H4325
19511c17774a30741A08212d5467B7258J29530d63098J64729R3768b1663h857q7163
19500i6020B86433f1134K2108m7076D8662a30984o1475I0969J31051c70107g0978
19488I2139b04646H2550J9856b8090D4924b14944e9026C15207D7015e3054B6439
$$ y = [137762, -82171, -218138, -53601, 464901, -13627, 185440, 75011, -205094, 28839, 497024, -223248, -264821, 88674, -131762, -70289, -317076, 126716, 90480, 172137, 211630, -140979, -226836, 311112, -285245, -339517, 32731, 177726, 51472, -149260, 118919, 164856, -15754, 385136, -79667, 82299, 100502, 224536, -354937, -187449, -377015, 32429, 207957, -171538, -91913, -194025, -78511, 119603, -72763, -76627, 130120, -245520, -85301, -53347, -249446, 84325, -317774, -130741, 108212, -45467, 27258, 156788, -463098, -298369, -204601, -21663, -8857, -96020, 286433, -61134, -39026, -86102, 48662, -130984, -192459, 90969, 222020, -370107, -70978, 92139, -204646, 82550, 102406, -28090, 44924, -214944, -59026, 315207, 47015, -53054, 26439]
19476c37304O2536Q3473d4984B15231A0676J55719A7163K4553d1569a7429q4707
19465a02136I6535a32066C15369a09396k57894a04540C3197M4740P3740g5155
19454h0933a2561k06225b3977A37420m2170F549d37210f1407A82746B7795b33737
19442G7341b73495Q3732Q3732A56914a18621D6469b10039P6968A09077B2695g5150
19430A02876c24497B0733K2928q7N3719a01022l3470K5478C0726O7507c9742E6705
19417A94666c25516d1523A31831A9499a37546d9799l9718D1080c33188a48580
19406C9725J1575Q3328D8268d9673A7394i5910r7108A05366c25383C283b01595
19394B4941O3728h5900d559H7393R5837b84975e8292o6306e9009j50704B21131
$$ y = [-337304, -274768, -191295, -44984, 215231, 10676, 166395, 17163, 41716, -41569, -17429, -102136, 96535, -132066, 315369, -109396, -367290, -104540, 33197, 77937, 151677, -75155, -80933, -12561, -218786, -23977, 137420, 95250, 6549, -437210, -61407, 182746, 27795, -233737, 77341, -273495, -189763, -106031, 156914, -118621, 46469, -210039, -133071, 109077, 22695, -75150, 102876, -324497, 20733, 43661, 43574, 97293, -101022, -134492, -109014, 30726, 98233, -39742, 56705, 194666, -325516, -41523, 131831, 19499, -137546, -49799, -89517, 41080, -333188, -148580, 39725, 51300, 134628, 48268, -49673, 17394, -95910, -193018, 105366, -325383, 3283, -201595, 24941, 88669, -85900, -4559, 87393, 183230, -284975, -58292, -124598, -59009, -209713, 221131]
19382a04759E6457a90179A64647b55788J25671A64440G7751J5973O7704i3298
19371b27213a1241k64753B13190d0048A43264c33946R5937c5224H5065B9385b3142
19359H0479k5819J0374A5799O4329c62694H8308a80509A53795a27200K2467l9121
19348a43854j2452d0486B43301a97461F0129d3663k58943a40751L8708A27465
19337E5606k2045J75165D4593b21418k38340A61106a5654j51726M0725n1361E9256
19325H5082R0903E5431L542f5765k41467L2059a29408c5463p3367p0811c6783
19313b01852A03166A7286a73971j56270e5250b1914p7283I2968a47838D3716a63279
19301d88827B96558B8933g9814n6158j01409B706a62142j7309c4597A17530b93113
$$ y = [-104759, 56457, -190179, 164647, -255788, -130117, 164440, 77751, 93724, 161428, -93298, -227213, -11241, -275994, 213190, -40048, 143264, -333946, -238009, -35224, 85065, 29385, -23142, 80479, 54660, 65034, 15799, 80128, -362694, 88308, -180509, 153795, -127200, -104733, -143854, -156306, -40486, 243301, -197461, 60129, -43663, -302606, -140751, -102043, 127465, 55606, 33561, 208726, 44593, -221418, -459758, 161106, -15654, -167380, -126655, -178016, 59256, 85082, 175985, 55431, 58973, -65765, -307232, -275173, -129408, -35463, -108830, -179641, -36783, -201852, 103166, 17286, -173971, -330241, -55250, -21914, -99197, 92968, -147838, 43716, -163279, -488827, 296558, 28933, -79814, -135972, -237381, 2706, -162142, -179451, -34597, 117530, -293113]
19289c9892A61757G1197a1235r5217A11057a42518h218B23622J40596A6945b79223
19277b96075O274B2409P7537L13446j90805e5290G8476b86978A85433C308f5199
19265b67443j23513C5890c6555A78903q4989c73361B45074i1625B94147b44525
19254B68470b55262B02159a39718I7683m2303J51275b11886j05070k4400A25210
19243D41316a92156m0157J3450J0162e189A15504b05487D3244R9830a64466J6668
19232a47798A33591a15922A67697e6740A7905a13559j421A43832a39728B01972
19221A78986a72028j0670h3278o2331j71865c3088r9096k07402a4695l18273E5311
19209B06051B6566O0736c4007D5641d8268A1719N9966B7639P8640g1323I8328
$$ y = [-39892, 161757, 71197, -11235, -106452, 111057, -142518, -8218, 223622, 364218, 16945, -279223, -296075, -289801, 22409, 99946, 413392, 222587, -55290, 78476, -286978, 185433, 3308, -65199, -267443, -390956, 35890, -36555, 178903, 93914, -373361, 245074, -91625, 294147, -244525, 268470, -255262, 202159, -139718, 97683, 55380, 206655, -211886, -316956, -341356, 125210, 441316, -192156, -232313, -218863, -208701, -5189, 115504, -205487, 43244, 143074, -164466, -147798, 133591, -115922, 167697, -56740, 17905, -113559, -114980, 143832, -139728, 201972, 178986, -172028, -182698, -83278, -145609, -317474, -33088, -132184, -339586, -14695, -332968, 55311, 206051, 26566, 87302, -34007, 45641, -48268, 11719, 71685, 27639, 106279, -71323, 98328]
19197e1827D393b53191d0119k36824a24769E562a364A65000b95307A1412J14043
19186A25455a16755j42726c2541A03065N4187b21040Q4329h333C3994h8683j7033
19175a05716n04026b58363A14961b84374A24935a1671j5277j47399j58915H4099
19164d41700E8155a86712B1462J12580i1367j72308J22219f5209C6600c76118
19153g1872G8528c42571p3389c3689n9937F0342e7370K725B7935g2218o4857A49648
19140F6109b8603A70454c6459C39867A05013J88609b49800B05755a68988A88704
19129A13982d4341E3703c4784j00752B3842P7328b34936d4418j9846A94125D7138
19117A49109F3632a4086B20975b28317b3908k31354P1306h1237j55193a8477j10032
$$ y = [-51827, 4393, -253191, -40119, -276943, -124769, 5562, -1364, 165000, -295307, 11412, 125455, -116755, -259481, -32541, 103065, 157252, -221040, -136711, -8333, 33994, -88683, -105716, -609742, -258363, 114961, -284374, 124935, -11671, -26948, -174347, -333262, 84099, -441700, 58155, -186712, 21462, 134042, -91367, -263675, -141456, -65209, 36600, -376118, -71872, 78528, -342571, -415960, -33689, -93626, 60342, -57370, -54645, 27935, -72218, -137075, 149648, 66109, -28603, 170454, -36459, 339867, 105013, 293622, -249800, 205755, -168988, 188704, 113982, -44341, 53703, -34784, -135536, 23842, 101170, -234936, -44418, -64264, 194125, 47138, 149109, 63632, -14086, 220975, -228317, -23908, -255262, -183956, -81237, -236430, -18477, -128509]
19106a28509j7176a8312o4592C72277c82163A9353g0505B3894K3794K89652I7810
19094A71356A236J18338a01688A7514i7038A9303a19209C82374c03821B27698
19083c28952J53768A36217i0674f086l788p7939C03588a85733h2660L9274A61636
19071c3489C402K28171a22522C7307L5910d6335a6957k07808j02549m5386a14345
19059A15773E0811b16462A75416e9527D6492R1585K24022c54633l468B09035i5755
19047a62064e0265l5552l01565a62195k6001D6499c27450A613b01077C22833j31245
19036A91588F9779a64638j12750b3145j38130A38673a39828k256o1140A73176
19025e6121D6690d256A31853a30271E3868c07261a20805r959J181A12730e9994
$$ y = [-128509, -145685, -18312, -82904, 372277, -382163, 19353, -70505, 23894, 47688, 337340, 97810, 171356, 1236, 119574, -101688, 17514, -97038, 19303, -119209, 382374, -303821, 227698, -328952, -175184, 136217, -90674, -6086, -9874, -87813, 303588, -185733, -82660, -43386, 161636, -33489, 3402, 231573, -122522, 37307, 73217, -46335, -16957, -224765, -327314, -372700, -114345, 115773, 50811, -216462, 175416, -59527, 46492, 138077, 362099, -354633, -358101, 209035, -95755, -162064, -50265, -85817, -387382, -162195, -188196, 46499, -327450, 1613, -201077, 322833, 191588, 69779, -164638, -277388, -23145, -161275, 138673, -139828, -142084, -203224, 173176, -56121, 46690, -4256, 131853, -130271, 53868, -307261, -120805, -130764, -129583, 112730, -59994]
19013b94563B78792q2425a49303B45460c15478M5808b7599F1179M00520F7634
19002C71930b24895O9838A01111b24509B79123b60657A00253b96957G8293J22008
18992B00301J36665B5031R46K51220a82566e1667k24273A20370J7278H398a80965
18980b32873o1093e8567o2477J6140B47766b89270A43510b05525R5614a5374o25873
18969f41247a25850k41414a73697H7122a37880O5925n9545F0813d5313A4570K86234
18958C00804a33661H0218j3065l3555O5037A1049J27102a77163l2700j82325h8915
18946a36116J6871A2209a6950j41786q7624C13438a87107f0458l0137A52240a01172
18934G3821c3758o0124A93555K42204e7663I0872J73800g1649B64275k2534a65818
$$ y = [-294563, 278792, 196367, -149303, 245460, -315478, -269670, -27599, 61179, 461699, 67634, 371930, -224895, -155057, 101111, -224509, 279123, -260657, 100253, -296957, 78293, 200301, 336966, 25031, 25977, 277197, -182566, -51667, -275940, 120370, 137648, 8398, -180965, -232873, -293966, -58567, -121044, -104904, 247766, -289270, 143510, -205525, -109911, -15374, -641247, -125850, -367264, -173697, 87122, -137880, -71955, -131500, 60813, -45313, 14570, 300804, -133661, 80218, 67153, 33598, 98635, 11049, 138151, -177163, -209863, -392188, -88915, -136116, -119245, 12209, -16950, -158736, -246360, 313438, -187107, -60458, -90595, 152240, -101172, 73821, -33758, -93882, 193555, 435759, -57663, 90872, 264672, -71649, 264275, 241741, -165818]
18922a20937m1595f2854r2796p0320B60b56431A82495a31969L6075l3738k80412
18911d10044a57702A37425f8812B60194h6609M609C0123P1091A113N2094b38382
18899e2170C6619c0469C5001K49111a18588j36589J07921f3806k08261a1981m3616
18888e5597k6746A61877b02712j03193h7107F1990c21354P0484A28909a28794
18877b08979A91826b4562j77355A0983a83483A13569b8145k93019J47619f3246
18866b02714a00397K4130j06811q0794F6936L9781h3102F6378J84245A23555e8095
18854A08496c5340m9141j50498h8256l5587e1856k00365P3096d4317o0441A35477
18842a85876A37295n2953a8168q8852G6905k3379d25020f1412r7850N7868b5156
$$ y = [-120937, -162532, -62854, -155650, -225970, 260, -256431, 182495, -131969, -95894, -129632, -410044, -157702, 137425, -68812, 260194, -86609, -82000, 30123, 101214, 1113, 53207, -238382, -52170, 36619, -30469, 35001, 284112, -118588, -255177, -147256, -63806, -272067, -11981, -55597, -82343, 161877, -202712, -305905, -87107, 61990, -321354, -250870, 128909, -128794, -208979, 191826, -24562, -201917, 10983, -183483, 113569, -28145, -321164, -173545, -63246, -202714, -100397, -76267, -183078, -263872, 66936, 106717, -83102, 66378, 250623, 123555, -58095, 108496, -35340, -84481, -234979, -88256, -123843, -51856, -252221, -179125, -44317, -104758, 135477, -185876, 137295, 84342, -18168, -107020, 76905, 53526, -425020, -61412, -159262, -101394, -25156]
18830D8323a36508c2552E7578L2249l9643K2222L4308c2095k15368j53389g2595
18818i4729B33545D3537J12283K8461a55056o1904k9277C64595j65201c64093
18807a08971G7207C8043Q8049J03335g5500c4316j51907B61422a18357L6017B33206
18795a63593e9293j69898f2301A12312D4516a25683A4477f0934A65138c47821
18784A04189a4698B90848m9968a4132B3020a52679A78370L528b06661G7707a49265
18772a79318D3047J88123e084o3613b5031C65Q862b13458B64c13547I3109O3415
18760A56524G4091J15595C9241K4950J74971a1782k57897A48863D8831K3235d81659
18748b0078l98212a508G2424A9847c9978o0014B64833J32681d6085A18924j4411
$$ y = [48323, -136508, -32552, 57578, 89827, 50184, 72406, 106714, -32095, -247463, -400852, -72595, -94729, 233545, 43537, 155820, 184281, -155056, -216960, -246237, 364595, 199394, -364093, -108971, 77207, 38043, 126092, 229427, -75500, -34316, -186223, 261422, -118357, -82340, 233206, -163593, -59293, -229191, -62301, 112312, 44516, -125683, 14477, -60934, 165138, -347821, 104189, -14698, 290848, 240880, -14132, 23020, -152679, 178370, 181898, -206661, 77707, -149265, -179318, 43047, 231170, -5084, -68697, -25031, 365, 9227, -213458, 264, -313547, 93109, 156524, 74091, 189686, 39241, 64191, 239162, -11782, -269679, 148863, 48831, 72066, -481659, -20078, -418290, -1508, 72424, 19847, -39978, -99992, 264833, 397514, -46085, 118924, 104513]
18737A04513q179r576k3854b06526g1309n3919J7487I4741b79353e4596F7408
18725a41460e7110j45876h7659j59777g9387b9932l61416F9547k7581c00010A44009
18713B99609a23722F8483a46876d057p7880A30899b66993B95106c26078i2922
18702G8210j4365a88064O5379C5559a58212j20879D84696a03819k30254a34284
18691a82807a2018k60417a23868A9865K75696C6102q730a47831g879D5655A4937
18679d5490k39560J37299n2996d0824K387K066k82161a40201E6063R4356c073
18667d69658I2839a20916i477A57564L6831c20452i7125m8807E1398i2994A09764
18655h4358m9710E2677b19744j51959a62151j46232f2216B6944b04611A9877b01941
$$ y = [104513, 96334, 86758, 62904, -206526, -71309, -125228, -107741, 94741, -279353, -54596, 67408, -141460, -57110, -202986, -87659, -247436, -79387, -29932, -391348, 69547, 41966, -300010, 144009, 299609, -123722, 68483, -146876, -4057, -81937, 130899, -266993, 295106, -326078, -92922, 78210, 63845, -188064, -122685, 35559, -158212, -279091, 484696, -103819, -334073, -134284, -182807, -12018, -272435, -123868, 19865, 295561, 36102, 27372, -147831, -7879, 45655, 14937, -45490, -285050, -147751, -200747, -40824, -38437, -36371, -318532, -140201, 56063, 150419, -3073, -469658, 92839, -120916, -9477, 157564, 194395, -320452, -97125, -145932, 51398, -92994, 109764, -84358, -134068, 52677, -219744, -371703, -162151, -308383, -62216, 26944, -204611, 19877, -201941]
18643b00560I6967a79956p8937a04820A12551J72597D3323b5635j7520j98613
18633b41768k4544q9882I1356a12811K3185B2018J05396b50412J13768K9466r6510
18622b03688c3078p9389q1233B83430h8658C6038K21792j593I0316H70N0259e1592
18609d91236J81126J49682g6815L1695A59732a37099c1797j55966e3505A47064
18598B51835p8796f8032I198a22357j55348D0020J06874D890a26236b6228G2460
18586a07649j72139O8658q3120J41578b8227l3200R766D3701b627m3601o7306
18575a13534B703a43102O5254c3136j20419A892e1831j64726L0925O4743f0063
18563F3026b16595A30023a60859o4971E4371a07169A35455a95761K1354Q7038
$$ y = [-200560, 96967, -179956, -258893, -104820, 112551, 285148, 43323, -25635, -43155, -241768, -266312, -356194, 91356, -112811, -89626, 22018, 127414, -250412, -136644, -107178, -203688, -33078, -112467, -193700, 283430, -88658, 36038, 257830, 256237, 90316, 870, 51129, -51592, -491236, -310110, -160428, -76815, -45120, 159732, -137099, -31797, -187763, -53505, 147064, 251835, 173039, -68032, 9198, -122357, -277705, 40020, 146894, 4890, -126236, -26228, 72460, -107649, -279788, -211130, -294250, -152672, -28227, -61427, -51661, 43701, -2627, -46228, -113534, 2703, -143102, -77848, -33136, -153555, 1892, -51831, -216557, -185632, -120889, -60063, 63026, -216595, 130023, -160859, -225830, 54371, -107169, 135455, -195761, -174407, -87369]
18553h7369M0416B66178a43685P0920K2997C02454a21461a0162B58004b67072
18542b5437C63161A30985m8486P6786c03268n5413A03452D7232a55711n0009b1639
18530f4218A8960e6168j00365F6972a2875A09883h2474L4053j81228K9510E0430
18518a63165B44974b43036a6308A59516a2198j38677L1610q383K3608m7289n2812
18507b04141j64659A33759L3858h7781o3282A18989m05c68932K4966E2741N0669
18496A03410b70739I881a28694l09499g2359j51553e940B90534b96693J37603
18486a59090B51052c03818B53883a14926j36970m0064H546K81968A44362C5468
18475B81666B0823J37459L516h444l61922a14363B57326b70068k7794I3849B2247
$$ y = [-87369, -46953, 266178, -143685, -72765, -49768, 302454, -121461, -10162, 258004, -267072, -25437, 363161, 130985, 82499, 159285, -303268, -358681, 103452, 47232, -155711, -205720, -21639, -64218, 18960, -56168, -156533, 66972, -12875, 109883, -82474, -48421, -229649, -200139, 50430, -163165, 244974, -243036, -16308, 159516, -12198, -150875, -119265, -127648, -104040, -151329, -204141, -368800, 133759, 167617, -87781, -151063, 118989, 118584, -368932, -343966, 52741, 103410, -270739, 9881, -128694, -438193, -72359, -223912, -5940, 290534, -296693, -159090, 251052, -303818, 253883, -114926, -251896, -291960, 8546, 290514, 144362, 35468, 281666, 20823, 158282, 161798, -8444, -370366, -114363, 257326, -270068, -297862, 93849, 22247]
18463h7225B42157a06128q3737M0507B93466A35953B0734b44785a1049j84371
18453a95420f8863G4622A8121b18324B5157J62964a34243j3698j36415F1330C0479
18441F6728J2554j6246j5872R4721a80032D0620h8183A45716e07088A78983b72021
18429e645B2330L21026a59733j01561c6839A44293c44565e4109j51286I1264i2801
18417E1613Q1701f6274F6295C2655h2221k34950c4670l3704b0407I1409m1276
18406E0133d6361k60791a0905k53322h4908B11433a86764A62947e3650A51177
18395b57265J02267L8079j31043Q328a14852D3843c85843a40742j09276c5011
18384A68162a92105q1493F7230q534a19426F3468j7779c26818g4218B3916P0223
$$ y = [-87225, 242157, -106128, -189865, -149358, 293466, 135953, 20734, -244785, -11049, -195420, -68863, 74622, 18121, -218324, 25157, 188121, -134243, -147941, -284356, 61330, 30479, 66728, 79282, 63036, 47164, 141885, -180032, 40620, -88183, 145716, -507088, 178983, -272021, -5645, 22330, 343356, -159733, -261294, -36839, 144293, -344565, -54109, -205395, 91264, -92801, 51613, 133314, -66274, 66295, 32655, -82221, -317171, -34670, -68374, -20407, 91409, 50133, -46361, -307152, -10905, -264227, -84908, 211433, -186764, 162947, -53650, 151177, -257265, -154998, -116919, -247962, -239634, -114852, 43843, -385843, -140742, -250018, -35011, 168162, -192105, -273598, 67230, 58696, -119426, 63468, 45689, -326818, -74218, 23916, 94139]
18373I4139a20828N657m75433K38222A33203c23105H8254B4023b36694P8750E1239
18361E5820M377B6727a03128o8935r4489A15587k4440a86598A61900d28690H844
18349c8247P373A63995G6087M79i1391k04756C7946a9063k9652m4789C1122J0312
18337D1434K05111j02124a61735B71979m3484b4496j68564d908k6417j3110j72337
18326b16772h1244j11872B47067A10212c4187A18440D7417r110D842P5341a01625
18314e1675E9206P0194c43906J42820d7522a3238k51970P8265Q8569j78994D5672
18302c59436A65481a04337m1839A00232J45106F2272c0667k23325b7500p9213
18292a06713j57090j12554J83178B78562b38567L8039j11764i5838p1131D64398
$$ y = [94139, -120828, -115171, -590604, -352382, 133203, -323105, 88254, 24023, -236694, -157944, 51239, 55820, 60197, 26727, -103128, -172063, -266552, 115587, 91147, -186598, 161900, -428690, 8844, -38247, -30874, 163995, 76087, 76566, -91391, -296147, 37946, -19063, -48715, -93504, 31122, 41434, 246545, 144421, -161735, 271979, 228495, -24496, -193060, -4908, -31325, -44435, -216772, -81244, -193116, 247067, 110212, -34187, 118440, 47417, 38307, 4842, 80183, -101625, -51675, 59206, 129400, -343906, -201086, -47522, -13238, -265208, -186943, -98374, -277368, 45672, -359436, 165481, -104337, -146176, 100232, 245338, 62272, -30667, -253992, -27500, -106713, -263803, -376357, -193179, 278562, -238567, -200528, -312292, -95838, -166969, 464398]
18281a75530H7086c25234A87387O7640o6930a99238B49323A19732c17123A14326
18270C9372a22914A73065O9083A10443b18606C20251C938d74805D782f0420A30921
18258a05468f871D245L3489b6582k67912L541D8686h191F2373a82049A887d80992
18245F7727b70924A84658a87110b289E2132k2336a57788k9298d4390n772E884
18233i1726k83608d8915j2038A82860f6333D8966M6979d1258H0420Q0428l4960
18222A25888e1694a9737j57698C91303D3241c06776M9567a18250l55808b24804
18211B7649b13219E1041j9056b9567l1074A98679C642a59718j68159I8481b9439
18199a86484A36139b41214B5511J8106L8863d2201C0597a98054A2374b55381B12060
$$ y = [-175530, 87086, -325234, 187387, 255027, 188097, -199238, 249323, 119732, -317123, 114326, 39372, -122914, 173065, 242148, 110443, -218606, 320251, 3938, -474805, 4782, -60420, 130921, -105468, -6871, 4245, 37734, -26582, -294494, -290953, 48686, -8191, 62373, -182049, 1887, -480992, 67727, -270924, 184658, -187110, -2289, 52132, 29796, -157788, -187086, -44390, -50162, 5884, -91726, -375334, -48915, -60953, 182860, -66333, 48966, 95945, -41258, 80420, 160848, 125888, -51694, -19737, -177435, 391303, 43241, -306776, -257209, -118250, -474058, -224804, 27649, -213219, 51041, 31985, -29567, -60641, 198679, 3642, -159718, -327877, 98481, -29439, -186484, 136139, -241214, 25511, 43617, 82480, -42201, 30597, -198054, 12374, -255381, 212060]
18187b01683O9316D5883j3168J86761K2240A06673f8024q6228A30108b27252J4666
18176b12586G5925J20277i6019c7480g653A88241c5629k24735C61222C5417e7044
18164G4465b21040Q0989e4619A19088l9049f4611j14276k794p1487B7843N5735
18153H3578a60983C9873L7623b8182j05121d8058k91144J30581B2895c1383m219
18142c5602k65398f1970B20594b57534C3884J99910b4968J1401k4738k08332A83450
18130H6279l6039J38122K4731q9777a97335M2483g2452F740a29669A87755b18429
18118a96952R6368C35161b8812l05225D3287J22043b84719a4863k3902F3911J70776
18107B34687d0457n0801K2630H4170c4524r5690D02942a91460a1190A47033a99848
$$ y = [-201683, -132367, 45883, 32715, 219476, 241716, 106673, -68024, -154252, 130108, -227252, -212586, 75925, 196202, -96019, -37480, -7653, 188241, -35629, -260364, 361222, 35417, -57044, 74465, -221040, -140051, -54619, 119088, 80039, -64611, -178887, -181681, -253168, 27843, 83578, -160983, 39873, 77496, -28182, -133303, -48058, -339202, -208621, 22895, -31383, -35602, -301000, -61970, 220594, -257534, 33884, 233794, -24968, -13567, -38305, -246637, 183450, 86279, 50240, 188362, 213093, 123316, -197335, -154852, -72452, 6740, -129669, 187755, -218429, -196952, -100584, 335161, -28812, -334037, 43287, 165330, -284719, -14863, -38765, 63911, 234687, -40457, -91258, -68628, 84170, -34524, -130214, 402942, -191460, -11190, 147033, -199848]
18095H2548d8630l75214a89838B2131O4805d5675L46j40007j28849h112k35633
18084b43745j34000h407p413l66023B67724F325f3343j20099d4063m6523E929
18072c40612h3329A60613a89819A87570q8683a50132N7202j18390N4151c4660
18061B32636c75193B87157j02242M5587m238J13074a68276A39261c75089J6609
18051c58480f5653A65237k5753a60354k7803A6971N9700a55228N1832M4916o3809
18040a22289O0841A37871c4766k12226N9824A34542n6493K3204L3067b58789a25601
18028A11103N5085b13917m1758i5208j1391J0643B02768c95893C6281g4128j72058
18017b46186A94982a76167a8186k67227i5626H5640h3748A56967A0779K31899
$$ y = [82548, -48630, -423844, -189838, 22131, 86936, -45675, -45329, -185336, -314185, -8112, -243745, -377745, -8407, -15820, -381843, 267724, 6325, -63343, -183442, -44063, -90586, 5929, -340612, -83329, 160613, -189819, 187570, 98887, -150132, -92930, -211320, -157169, -34660, 232636, -375193, 287157, 184915, 230502, 226264, 339338, -168276, 139261, -375089, -358480, -65653, 165237, 139484, -160354, -188157, 16971, 76671, -155228, -103396, -58480, -122289, -61448, 137871, -34766, -246992, -187168, 134542, 78049, 101253, 134320, -258789, -125601, 111103, 166188, -213917, -255675, -95208, -106599, -95956, 202768, -395893, 36281, -74128, -246186, 194982, -176167, -18186, -285413, -95626, 85640, -83748, 156967, 10779, 242678]
18007B42678l0211b70466D0029a58074k79808C8244J72332b93971A5687c92284
17996B0247e7070A00538O1520J23898G7751a50834B03094H1342a15992N6062k77774
17985c37704K9905B91613d38066A39819a32164C4137F527Q7082J45190E5277A3072
17973b0674c736j69294F6121P0471J1682a51435I1188j6762a66040D5810a24044
17961i0509l51216F0358a45418I2457a20789k3968q3557g5257B0543F719g6628
17949C9019Q9507g5494C5661c1694j71877h827p9290B43677e3372A74836a75067
17937h3051p9091D2844I675h4634j54974F9537a5794A45312a7139A10205J01852
17926B12057G3215c06533g9020p4992C0064N4183b3855k8774A77305g8377a2067
$$ y = [242678, 212467, -270466, 40029, -158074, -437882, 38244, 210576, -293971, 15687, -392284, 20247, -57070, 100538, 162058, 285956, 77751, -150834, 203094, 81342, -115992, -59930, -337704, -307799, 291613, -438066, 139819, -132164, 34137, 6527, 93609, 238799, 55277, 13072, -20674, -3736, -173030, 66121, 136592, 148274, -151435, 91188, 74426, -166040, 45810, -124044, -90509, -441725, 60358, -145418, 92457, -120789, -144757, -228314, -75257, 20543, 6719, -76628, 39019, 128526, -75494, 35661, -31694, -203571, -8827, -88117, 243677, -53372, 174836, -175067, -83051, -162142, 42844, 9675, -84634, -239608, 69537, -15794, 145312, -17139, 110205, 212057, 73215, -306533, -79020, -154012, 30064, 84247, -23855, -52629, 177305, -78377, -12067]
17914D13154a77039G7696L4369b79264A70236A36i8468j06940B85286d8393J2617
17903c5776k8341j25008j69483H3196c31869a54279B07842N9826I885N5453g2999
17891a74633l7721H9643c4019p128l1837j03581k1809j72604h1946E9353a87446
17879G4976f4084B98888a94393B3095d9653E2943h4856l7459q8706H768f5181
17867E8219R6485b41359A60122F3676e47530C4130J06393J35449g0953p1156j8087
17856a60196P3361c2691n5896E8215d8046k42718b4020A25230b30113B87275c8701
17844A9194i6603j26875B40632j9836e4742o705B25138a89282K6433I2423a23221
17832a73886I2759b14102J00792K154A07913L0078d42942g9343k45831H4465n44
$$ y = [413154, -177039, 77696, 112065, -279264, 170236, 136, -98468, -205408, 285286, -48393, -35776, -64117, -189125, -358608, 83196, -331869, -154279, 207842, 267668, 9885, 65338, -72999, -174633, -212354, 89643, -34019, -41147, -72984, -176565, -198374, -370978, -81946, 59353, -187446, 74976, -64084, 298888, -194393, 23095, -49653, 52943, -84856, -122315, -211021, 8768, -65181, 58219, 154704, -241359, 160122, 63676, -547530, 34130, 140523, 275972, -70953, -142109, -160196, -86835, -32691, -88587, 58215, -48046, -290764, -24020, 125230, -230113, 287275, -38701, 19194, -96603, -223478, 240632, 220796, -54742, -61447, 225138, -189282, -162849, 92423, -123221, -173886, 92759, -214102, -113310, -111156, 107913, 137991, -442942, -79343, -325174, 84465, 83921]
17821H3921b66577A37671Q9450J20675A8117N0294f6711b520r2982C23224h0250
17809b45580D7493Q8578N4948n3507A9905l815K5302O2558g6878K9935b2962k19950
17797b42912a8167F0135J8267d5750B8677a39899A66606c26496C83780h8447A1746
17785B9311J01172D6947d43514c8296n1314l14106F7716J35855D8547b46774B3919
17773b527j68963B69652F2803f809C5645h3601A94412J76890A77646p1849c74857
17761h6025C46713A40125d8445p819G6614r268J74398a40561m6168C9003j994
17750C7009K94796j63347o3040a46253A19477K2195a20181j26289k7725A84826
17739C0242a78513E2255a88087Q7522c1491n7571I7818a4751B61746m0402I437
$$ y = [83921, -266577, 137671, 227121, 347796, 18117, 68411, -66711, -2520, -95502, 323224, -80250, -245580, 47493, 136071, 191019, 137512, 19905, 16090, 41392, 103950, -76878, -46943, -22962, -242912, -18167, 60135, 78402, -45750, 28677, -139899, 166606, -326496, 383780, -88447, 11746, 29311, 130483, 46947, -443514, -38296, -89610, -403716, 67716, 203571, 48547, -246774, 23919, -2527, -171490, 269652, 62803, -6809, 35645, -83601, 194412, 371302, 177646, 105797, -374857, -86025, 346713, 140125, -48445, -56264, 76614, 67346, 241744, -140561, -186729, 39003, 37009, 331805, 168458, 105418, -146253, 119477, 141672, -120181, -246470, -274195, 184826, 30242, -178513, 52255, -188087, -100565, -31491, -89062, 97818, -14751, 261746, 221344, 9437]
17727a67810f9717B08418I2874j2859c56053A36513a7473C036i8439A10035a9394
17715A67761b30548a1774k0886k22641j04268a40314m82A69318a83047D3726a69201
17703A41629c33117g4757c1319D8575d4652j42094A67364G0794b56367f5899A31532
17691A62555a96196A79926F8700b88795F105a87554A64220D582a71544c4047p0814
17680a04861E109J63255B6991J75778a15899d3575j33729q1047g7276c5927j12994
17669a48921F0674K39987c78636A74224c7645k45436d2776k4587k4983o6384K2871
17658a35859M557i904C0471a02776B28812d3162D3876J89718F4207c5950F4833
17646a65947B9884a83015A71419M1481a38596M9638B05389G3340j4373j0802J31006
$$ y = [-167810, -69717, 208418, 92874, 80015, -356053, 136513, -17473, 3036, -98439, 110035, -19394, 167761, -230548, -11774, -32660, -255301, -359569, -140314, -140796, 169318, -183047, 43726, -169201, 141629, -333117, -74757, -31319, 48575, -44652, -186746, 167364, 70794, -256367, -65899, 131532, 162555, -196196, 179926, 68700, -288795, 6105, -187554, 164220, 4582, -171544, -34047, -104861, 5109, 168364, 26991, 202769, -115899, -43575, -177304, -258351, -77276, -35927, -148921, 60674, 300661, -378636, 174224, -37645, -283081, -42776, -67363, -92346, -158730, -135859, -131302, -9904, 30471, -102776, 228812, -43162, 43876, 233594, 64207, -35950, 64833, -165947, 29884, -183015, 171419, 212900, -138596, -88958, 205389, 73340, 58967, 48165, 179171]
17635A79171H5156j6412a62427A6294c2619H9622M08662a49898A18746R7248b6315
17623b90661C48783A18139d8145f106I6303b90388b8461E0869J85362O6827A46872
17611D01261a12801p9429G7993R6407j0841A9415f362I7256a04940B17574a60344
17599E3484e08700B03416q8737d2764I7241C7367b06048l2319B63599a67563r3270
17588b60833B03080a65617N6309L7689l05408A34031a56273j79757a03805c2713
17577a64805j85145b5790F7589K9089m6212E755K21073c12234B30555q4804J02413
17566B48164b3954j56571e6915I6651J25318N1149k4835a74910n2256B4803Q7957
17555A12760b3386D3634I485e9669C68142A13359n5075d1926C72149A19700E4477
$$ y = [179171, 85156, 68744, -162427, 16294, -32619, 89622, 498284, -149898, 118746, 215994, -26315, -290661, 348783, 118139, -48145, -6106, 96303, -290388, -28461, 50869, 236231, 303058, 146872, 401261, -112801, -192230, 77993, 174400, 163559, 19415, -6362, 97256, -104940, 217574, -160344, 53484, -508700, 203416, 114679, -42764, 97241, 37367, -206048, -238367, 263599, -167563, -260833, 203080, -165617, -109308, -71619, -377027, 134031, -156273, -336030, -103805, -32713, -164805, -349950, -25790, 67589, 96678, 50466, 5755, 226828, -312234, 230555, 145751, 248164, -23954, -180525, -56915, 96651, 221969, 273118, 248283, -174910, -227166, 24803, 112760, -23386, 43634, 9485, -59669, 368142, 113359, 58284, -41926, 372149, 119700, 54477]
17543C10147J23605A47581M2138H8029J41156h8964J5743A09833b70025A89880
17532A76317n3346B4393R9662g064A1005b26684g4658B95898c4619C43654i1546
17520a55865H055a95096A1228d3290k752A08492p29J2422P2473a02347A52730
17508B75417o5526a46485e0530A31753o0042g5824B82271A15719e7593A41756
17497c20448a38217A87517l5825b17634R6406B76194n2393b28018n5762B05240
17486B3593a9519C77577g096B40397c3448o6935A82975J23963a32055C00863K8447
17475C29310j24053J21129b3232B12538c69195D8680c25080C31994A52926m1867
17465A11059a77789A8608J04062B4301B461O3829a9332C28747j54892P8092a56657
$$ y = [310147, 433752, 147581, 189719, 88029, 229185, -88964, -73221, 109833, -270025, 189880, 176317, 122971, 24393, 124055, -7064, 11005, -226684, -74658, 295898, -34619, 343654, -91546, -155865, 8055, -195096, 11228, -43290, -46042, 108492, 107763, 120185, 192658, -102347, 152730, 275417, 209891, -146485, -50530, 131753, 71711, -75824, 282271, 115719, -57593, 141756, -320448, -138217, 187517, 151692, -217634, -121228, 276194, 223801, -228018, -283780, 205240, 23593, -19519, 377577, -7096, 240397, -33448, -100383, 182975, 306938, -132055, 300863, 329310, 205257, 326386, -23232, 212538, -369195, 48680, -325080, 331994, 152926, 111059, -177789, 18608, 122670, 24301, 2461, 66290, -19332, 328747, 173855, 251947, -156657]
17453b18093E31624k40662j39637M9262g5882C6873K29411k6854F3269K6565L84904
17442D74738C8837Q3171J59982a14705B14478j8896d531I5466K68174J81672B11085
17430A66165o6904a30748A89028a72450A56006P8446n6410K23307L6756j79426
17420B58679f2272B9582M40008B23856f2561E5512O5837E2732a50817A31602a5583
17408c0680m7817A50121B703b5720k79606A19453J62779D7048J19534N6114Q0355
17397C03051a883A97743q9448N14762A10268J38061J6491C4327R0865M625l6323
17386I3494j0222A2243Q2527b0797C16545I2601j0250L010h8190C47739d0965
17374A59101E7690Q470a99434b1617A99691a50472B39830g3708o651B56201K4781
$$ y = [-218093, 531624, 290962, 151325, 200587, -75882, 36873, 266284, 239430, 63269, 89834, 474738, 38837, 122008, 281990, -114705, 214478, 195582, -4531, 95466, 363640, 545312, 211085, 166165, 99261, -130748, 189028, -172450, 156006, 234452, 178042, 401349, 438105, 258679, -62272, 29582, 469590, 223856, -62561, 55512, 121349, 52732, -150817, 131602, -15583, -30680, -78497, 150121, 2703, -25720, -305326, 119453, 282232, 47048, 166582, 222696, 303051, -1883, 197743, 108295, 623057, 110268, 248329, 264820, 34327, 125192, 129817, 93494, 83272, 12243, 94770, -20797, 316545, 92601, 82351, 85361, -88190, 347739, -40965, 159101, 57690, 66160, -199434, -21617, 199691, -150472, 239830, -73708, -80359, 256201, 280982]
17363B80982a57414A4858K51883e9234A0333a20050j37805D43015A56625a0437
17352a74889B54936I1118K75678C5966K19642a1649D19035b5512A16093M871r679
17341A11285l4128K98404A19391N1158i38j45837A0153c8629C36281d9072d831
17329E9273b9242L761I9480l0908J57855i2521A94394f250E51357A93095B4070
17317D3393K57028o5648J35352b67529D66061j64523p5886I4495l7999c1459p892
17306c9351P072C72627A59920J41214l6170j22938N2880E7084J24327o0152d12
17294H7078D918J67014J54732p7746J1251k9139a59872B22964N7989e0547r261
17283e9808C49672a30169B23084b35808A05978e3619A09402J83635m4408F376
$$ y = [280982, -157414, 14858, 266741, -59234, 10333, -120050, -257855, 443015, 156625, -10437, -174889, 254936, 91118, 366796, 35966, 255608, -11649, 419035, -25512, 116093, 120964, 111285, 77157, 375561, 119391, 170549, -938, -146775, 10153, -38629, 336281, -49072, -4831, 59273, -29242, -25481, 99480, 68572, 226427, -92521, 194394, -6250, 551357, 193095, 24070, 43393, 300421, 234773, 370125, -267529, 466061, 301538, 225652, 94495, 56496, -31459, -39351, -32279, 372627, 159920, 301134, 264964, 142026, 194906, 57084, 181411, 121259, -412, 87078, 4918, 171932, 326664, 248918, 260169, 231030, -159872, 222964, 280953, -50547, -59808, 349672, -130169, 223084, -235808, 105978, -53619, 109402, 293037, 248629, 6376]
17272C2515P4481l0937d1938B70097o3785B8690i9183A78176B6394K68244a43314
17260a78369a425A51283E933K3108K65011A11433K9374l1924J72839A29938L51435
17249D81373a46035C31463q1408o6259L3245i1206l4790B97192b36979B94346
17238B29981Q9635A53206K29557J04273a41577B67592m528A29806N3405H2702
17227d6212B37728j4393J82926j99195H5402g610C05794K0554G8201e3830G7027
17215A12468K05462K02642k13921o9398R6863r9845a44876a8482R182C40076L8775
17204C78851j75192c3398A10794c9435D98983G3729M9334B81J5125N8280h4642
17192B83295A22080L9056M06606H021L10737j24445I7129Q2845n6774L0243J77684
$$ y = [32515, 106996, 76059, -41938, 270097, 206312, 28690, -99183, 178176, 26394, 294638, -143314, -178369, -1425, 151283, 5933, 29041, 294052, 111433, 140807, 108883, 281722, 129938, 481373, -146035, 331463, 250055, 183796, 217041, -91206, -125996, 297192, -236979, 294346, 229981, 319616, 153206, 382763, 487036, -141577, 267592, 263064, 129806, 183211, 82702, -46212, 237728, 223335, 406261, 207066, 85402, -7610, 305794, 326348, 78201, -53830, 77027, 112468, 317930, 520572, 306651, 237253, 334116, 234271, -144876, -18482, -9300, 340076, 378851, 203659, -33398, 110794, -39435, 498983, 73729, 123063, 281, 15406, 73686, -84642, 283295, 122080, 161136, 567742, 8021, 318758, 194313, 97129, 179974, 123200, 153443, 331127]
17181C31127j17320J47737A51999J53398A2368L08398A03925J1469J97083K22880
17171E35357k06887A13213L9135K41709A77244O7902A20214C2076L47029A40373
17160C46223j02225A09158R7297m8011a3389A95088H4235L59160k12985o3988
17150A66422o137B0935K92898A25242C523O9948K6845K32601K58453A47224P9377
17139B26601m4467M4991F08M26764m0308j91416K71074j11235q36I3452K00320
17128B93772G8813L84431H4554L19176A84441B7600K42792K2135m3172Q0598A25356
17116B29220m0595o0436L49543l5766A48473Q1366C14N16924A66986J73737A29472
17104C96672j59506B3276K52828L38321j42965R9470J07370k22200L6956A75574
$$ y = [331127, 213807, 361544, 151999, 305397, 12368, 320766, 103925, 115394, 312477, 535357, 328470, 113213, 152348, 394057, 177244, 245146, 120214, 32076, 379105, 140373, 346223, 243998, 109158, 206455, 158444, -13389, 195088, 84235, 443395, 230410, 166422, 160285, 20935, 313833, 125242, 3523, 73471, 100316, 332917, 591370, 147224, 226601, 182134, 227125, 608, 427372, 387064, 195648, 466722, 355487, 354651, 93452, 293772, 78813, 463244, 84554, 403730, 184441, 27600, 270392, 292527, 249355, 329953, 125356, 229220, 188625, 128189, 477732, 441966, 148473, 229839, 314, 517238, 166986, 340723, 129472, 396672, 237166, 23276, 276104, 614425, 471460, 570930, 678300, 456100, 493056, 175574]
17093A24952D8496M33398j35968K95780k37899N9967A66252K3584F6961L03701
17083C70662A28452K37143J5689j70384n9536K18634j37138M77446B35378O3175
17073B98553j02107L14595b26139E42564p0766k13086F8824M06864j04932j39894
17063B30862p053O9351K39290K06324B80038K42185B16642J23365j59984K60579
17053D40602A97689K50019j82031K60490j95748G5875M15495J76641C03597l9595
17043B64002J95746A70830L19018B01135l6512K24937A32631F4193N37660q944
17033E92909J27618j13502j53866J09648A67962K03054J05596Q6656o9245P9419
17023E73442k70985J24701J91990k17458J05651j1992j6984J44616k57252J56412
$$ y = [124952, 48496, 481894, 345926, 641706, 403807, 463774, 166252, 189836, 66961, 370662, 128452, 365595, 381284, 210900, 151364, 369998, 232860, 710306, 235378, 298553, 196446, 511041, -226139, 542564, 471798, 258712, 68824, 475688, 370756, 230862, 223809, 293160, 532450, 738774, 280038, 522223, 216642, 340007, 180023, 440602, 197689, 447708, 265677, 526167, 330419, 75875, 491370, 668011, 303597, 264002, 459748, 170830, 489848, 201135, 164623, 389560, 132631, 64193, 601853, 592909, 720527, 607025, 453159, 562807, 167962, 371016, 476612, 563268, 494023, 573442, 302457, 427158, 619148, 401690, 507341, 495349, 478365, 622981, 365729, 522141]
17013E22141m9341l5989L24980j26721k18806M4808K38038B29356P48498n1020
17003I26834k68040B58099N23830k02248j20541L50760j24501j59808K66025C02807
16992H32270C69979N40781N9636j08081k58743K68513l51364K50245k72507K44920
16982G43379k17234j36995J94643J22687j64767J51397k56561K86603K27958j33023
16972H18087P5340j10895j76454J91968K49596D72944L45812l27506O1273L23314
16962H75837l6982j26677J91755k81506Q9306K68145j74510J64902o1363K1964
16952I30871j53206L72022l54819J17930j3261k11796K25861K86440l84121P4832
16942H90753j75570O6896J24229L40997m44146J73942J02866K41423k00482L2274
$$ y = [522141, 472800, 436811, 761791, 635070, 416264, 461072, 699110, 229356, 977854, 926834, 658794, 258099, 781929, 579681, 459140, 809900, 685399, 525591, 791616, 302807, 832270, 369979, 910760, 970396, 862315, 603572, 872085, 520721, 770966, 498459, 743379, 526145, 389150, 583793, 706480, 541713, 693110, 436549, 723152, 951110, 818087, 893427, 782532, 606078, 798046, 1047642, 472944, 818756, 491250, 552523, 875837, 838855, 712178, 903933, 622427, 711733, 979878, 805368, 970270, 908907, 930871, 777665, 1149687, 794868, 912798, 899537, 687741, 913602, 1200042, 815921, 890753, 715183, 782079, 906308, 1247305, 803159, 977101, 1079967, 1321390, 1120908, 1153182]
16932A153182Q904j65171K53201J9569j52677J41912k72907l5092m0761j9934
16922H90226J75848K0898Q0220l22897M38247j60384k9968L96940j70824o5845
16912A252461j91541K90492j74633N4501r089l42392P14890j49546K17562k92589
16902A370116o7071L27326p0782l48223K9233L49545R9640j35474j61749N2593
16892A445154K27945j47176j62264J33580J22197j07519J31452O3844N7078L05189
16882B069480L5145k35070j05979K64952m96679K90763p373j20127p5999O63252
16872B282365l79037K32105l09565J18144J35166l7663J27654J7138j55372L71305
16862B402240j9332K1199l6905j25916L29942N4309o6530k09204j82949P16692
$$ y = [1153182, 1162086, 996915, 1250116, 1269685, 1117008, 1258920, 986013, 950921, 910160, 890226, 1066074, 1086972, 1167192, 844295, 1282542, 1122158, 1092190, 1489130, 1318306, 1252461, 1060920, 1351412, 1176779, 1231280, 1222191, 879799, 1594689, 1445143, 1662705, 1370116, 1303045, 1630371, 1559589, 1211366, 1240599, 1590144, 1689784, 1554310, 1392561, 1445154, 1673099, 1525923, 1363659, 1497239, 1619436, 1511917, 1643369, 1707213, 1764291, 2069480, 2104625, 1869555, 1763576, 2028528, 1531849, 1822612, 1815239, 1695112, 1619113, 2282365, 1903328, 2135433, 1825868, 1944012, 2079178, 2041515, 2169169, 2186307, 2030935, 2402240, 2382908, 2404107, 2367202, 2241286, 2571228, 2625537, 2559007, 2349803, 2166854, 2883546]
16852B883546p8666L0846k1083j25501j17998N58005m29214L64619o9657J78361
16842C173258o1468j44558K35541J10285k95978K88714j30844K0740N03087l03716
16832C395061K95201j12900J56263q9131p4342O35859k95591L48318j6537j17114
16822D125087J24357R1737J71509L5767J27780j7510j46255M89981l38213K56574
16812D920814K68616p563p6345N27074n6387J96401m698j82921J86793M01423
16802F173207J77889K69504k8574K36114k12239M80429j17911L03534K58805L88732
16792G929490q6894K94463L69927M1681L72525L04619N8942R0775P0765M96987
16782I943280K54836K69918L72179L09612N86020N06599L9642M12975P55622J25270
$$ y = [2883546, 2804880, 2835726, 2814643, 2689142, 2571144, 3129149, 2699935, 3064554, 2994897, 3173258, 3111790, 2967232, 3202773, 3313058, 3017080, 3305794, 3174950, 3195690, 3698777, 3395061, 3690262, 3577362, 3733625, 3644494, 3570152, 4206011, 3910420, 4258738, 4242201, 4125087, 4249444, 4341181, 4512690, 4548457, 4676237, 4658727, 4512472, 5002453, 4664240, 4920814, 5189430, 5181867, 5105522, 5632596, 5576209, 5772610, 5767912, 5584991, 5771784, 6173207, 6351096, 6620600, 6592026, 6828140, 6615901, 7096330, 6978419, 7281953, 7540758, 7929490, 7842596, 8137059, 8506986, 8548667, 8921192, 9225811, 9284753, 9375528, 9446293, 9943280, 10198116, 10468034, 10840213, 11149825, 11735845, 12242444, 12282086, 12695061, 13450683, 13575953]
16772A3575953K16045N60116P68347N03023L75962O34147N64284O23206Q31852
16763A8652935N16012J57661J072879O53486J108527Q01180J322569P88713J204171
16754B6278133J147832J083040J626893J142123J422760J961592J641976J723358
16746C8027707K131358K238090K411747K327571K445512K883807L189400L482328
16738E9137520L375188M265445L840846M849350M414268N513716N394001O543600
16730I7333934O143123O642931P849958P709036Q331138Q083256R145871Q779648
16722A60018895Q675220Q304583P828475O728966O538588M581755L285154J864394
16714B07826030j04113j540661k947334m447562n940906p067913p824298q454694
$$ y = [13575953, 13791998, 14352114, 15120461, 15623484, 15999446, 16633593, 17197877, 17821083, 18652935, 19168947, 19326608, 20399487, 21052973, 22161500, 22962680, 24285249, 25073962, 26278133, 27425965, 28509005, 30135898, 31278021, 32700781, 34662373, 36304349, 38027707, 40159065, 42397155, 44808902, 47136473, 49581985, 52465792, 55655192, 59137520, 62512708, 66778153, 70618999, 75468349, 79882617, 85396333, 90790334, 97333934, 103477057, 110119988, 117969946, 125678982, 134010120, 142093376, 151239247, 160018895, 168694115, 176998698, 184827173, 191556139, 198094727, 202676482, 205961636, 207826030, 207721917, 206181256, 203233922, 198786360, 192845454, 185777541, 177953243, 169498549]
16706A69498549q679005q829095r006630q495277q599266p486184q096495o772514
16698A03534083p014143n933659o199222n079864m885941m662725m355682l908539
16690F1494308l833455l119023l364573k827828k468763k497084k181785k053129
16682C9148668k318160j404516j945617j880270j112288j678572j329287j277050
16674B6202908r23995j112881j176126r74673j019383p93221o70884p54319j040908
16665A7736518k88957p17773o92110j27861n65669m10618j464234J46370k64219
16656A3351447p11705l80548m34952l01162m11091m86903l17014j31948j84315
16647I991809l02362k63162j29261l1214m54550n39082O7887n60720J19669l76661
$$ y = [169498549, 160819544, 151990449, 142983819, 134488542, 125889276, 118403092, 110306597, 103534083, 96519940, 90586281, 84387059, 79307195, 74421254, 69758529, 65402847, 61494308, 57660853, 54541830, 51177257, 48349429, 45880666, 43383582, 41201797, 39148668, 36830508, 35425992, 33480375, 31600105, 30487817, 28809245, 27479958, 26202908, 25278913, 24166032, 22989906, 22015233, 20995850, 20202629, 19531745, 18777426, 17736518, 17447561, 16729788, 16037678, 15909817, 15344148, 14933530, 13469296, 13615666, 13351447, 12639742, 12259194, 11824242, 11523080, 11111989, 10625086, 10308072, 10176124, 9991809, 9689447, 9426285, 9297024, 9265810, 8811260, 8272178, 8340065, 7779345, 7899014, 7522353]
16637G522353k78224j46350l40719K3822o4201m24220K9279K9161m30386K49229
16627F169744o93207o3228k5480p7544l16573l666j10796J99732l18233j13340
16617D647409k1166m81068K81420k50078r0253j68541M1669J78538k87927j50595
16607C699408n6420k84992L11200j76304o7546J3188j76683p6031K12709j34101
16597C264428j48484l39684J47799M2312k52988R035J86018l07144M76799n92693
16587B485398k05310J38096J10202r8852J9537k2576J02619J42574j24182k04832
16577B342674k90415L34986j63304l0228j75555O86l131K7286j42176K97042m95349
16566A702516K54582k49574M11691m29094j52528J53830r0677N036Q7737O7895
$$ y = [7522353, 7244129, 7097779, 6757060, 6780882, 6716681, 6292461, 6321740, 6350901, 5920515, 6169744, 5476537, 5413309, 5387829, 5310285, 4993712, 4990046, 4879250, 5078982, 4760749, 4647409, 4626243, 4145175, 4426595, 4176517, 4086264, 3917723, 3959392, 4137930, 3850003, 3699408, 3642988, 3357996, 3669196, 3492892, 3425346, 3438534, 3261851, 3185820, 3398529, 3264428, 3115944, 2776260, 2924059, 2966371, 2713383, 2722418, 2908436, 2601292, 3078091, 2485398, 2280088, 2418184, 2528386, 2429534, 2449071, 2426495, 2529114, 2671688, 2547506, 2342674, 2052259, 2387245, 2223941, 2193713, 2018158, 2018844, 2015713, 2042999, 1900823, 2197865, 1702516, 1957098, 1707524, 2119215, 1690121, 1537593, 1691423, 1600746, 1605782, 1693519, 1761414]
16556A761414j61034J71967k50492r0612K71622j63159j18775J57312O178O625
16546A591046l74297J80720J30319J4955l81179l8543K11342J7558p0119j31827
16536A149975L71435K3548l32315J19118J77308n01911M03428l52546K07386k4966
16526A240460k04620J20840m2055J99868l76509J43711j15409J45296J82518k20617
16516A073483o1880l64160M88891m68501K95698K16738k54282j00856j13693K04173
16506I15611L40313j89934j10459m6504R9098j04196n7075j34141j20402J69772
16496G62083j4669L60447l91867o4379j4190K01508q5784J22373l82368M20645
16486I13799j7491k23303J94559j78609K94165l92251J49016j03515J45497r8301
$$ y = [1761414, 1600380, 1772347, 1521855, 1431243, 1702865, 1539706, 1420931, 1578243, 1584421, 1591046, 1216749, 1397469, 1527788, 1542743, 1161564, 1123021, 1334363, 1351921, 1281802, 1149975, 1521410, 1544958, 1212643, 1331761, 1509069, 1007158, 1410586, 1058040, 1265426, 1240460, 1035840, 1156680, 1114625, 1314493, 937984, 1081695, 966286, 1111582, 1294100, 1073483, 1011603, 647443, 1136334, 667833, 963531, 1180269, 925987, 825131, 711438, 915611, 1255924, 1065990, 955531, 909027, 1008125, 903929, 846854, 712713, 592311, 762083, 747414, 1107861, 715994, 651615, 637425, 838933, 753149, 875522, 493154, 913799, 896308, 673005, 867564, 688955, 983120, 590869, 739885, 636370, 781867, 683566]
16476F83566J45983j09440j01518j55964J40102N9943k75799J63297k12207J37963
16466D75926K179Q8091k43608K48036J0127L55319m30957K67786q8364k71380
16456D13155K84597k77653l5557J33601j54267L23369l01281M27114l01855k51872
16446B59351L15350q6139K81444l43799l20Q3258N0708j80852q0467Q3502O8422
16435D50458o6191M5398L6455j18900K98942C01480K18927j27875N9328K0468
16425D72328k02116J06756L57313R587M0277k20964r6546l8939l2000k1821L17443
16414F91318o8230H4066M57657j49228o3109M18712C70982A09187L41101D8037
16403B73561q9218Q0057l464K34102j36863J24694k20820K68834j24627L9446
$$ y = [683566, 829549, 720109, 618591, 462627, 602729, 662672, 386873, 550170, 337963, 475926, 478105, 566196, 322588, 570624, 580751, 936070, 505113, 772899, 684535, 413155, 697752, 420099, 384542, 518143, 363876, 687245, 385964, 813078, 511223, 259351, 574701, 488562, 770006, 426207, 425887, 509145, 559853, 379001, 298534, 382036, 450458, 384267, 429665, 466120, 347220, 646162, 301480, 520407, 392532, 451860, 472328, 270212, 376968, 734281, 743868, 784145, 563181, 466635, 427696, 395696, 373875, 691318, 623088, 84066, 541723, 392495, 329386, 748098, 370982, 109187, 450288, 48037, 273561, 184343, 264400, 260936, 495038, 358175, 482869, 262049, 530883, 406256, 445702]
16393D45702j67666K20295q6241A77590J00631R4781j77372O0591J79210j32389
16383C03042J08585A42603J73352K63558A59954l4149j363J97630J31510j10653
16373C42929M9271Q1540f450B8491j3532L93094L0039A45083K8243J54446m9359
16362B78413J31202A58210n4535M0069J09136J61045A80367J00730k4974j2302
16352B43821K78705j43057j89338J07392I2270J0687b9904B21834A680K5407L36550
16341C63637f6166C20716k2660a20796A29248K83687j69491M4220J50850j56616
16331B81898A21795K54341J48238j23959A88487J55715j33159J95585A50631a35055
16320C96448D4633g545C93480A51862Q3856n4217j301p2995J90439k8439a5064
$$ y = [445702, 278036, 498331, 412090, 177590, 278221, 373002, 195630, 256221, 435431, 303042, 411627, 142603, 315955, 579513, 159954, 125805, 124442, 322072, 453582, 342929, 392200, 473740, -6450, 28491, 14959, 408053, 438092, 145083, 173326, 327772, 278413, 409615, 158210, 103675, 143744, 252880, 413925, 180367, 281097, 256123, 243821, 522526, 379469, 190131, 297523, 92270, 102957, -29904, 221834, 1680, 27087, 363637, -66166, 320716, 298056, -120796, 129248, 412935, 243444, 287664, 438514, 281898, 121795, 376136, 524374, 400415, 188487, 344202, 211043, 406628, 150631, -135055, 396448, 44633, -7545, 393480, 151862, 235718, 181501, 180200, 107205, 297644, 269205, -15064]
16308A95939M404m0342P7097N5663j40885L39760G4989M34206A8368J87117J98730
16297D04215d0779A12614J16200F5745J29818b6109A84385d6747B46543j03216
16287A43327n3437J6281l4133B5826j1842K85895L0756A1327L1304M96146H0686
16275A44228P4762M0153K99177g1214j3933a6459A08513M2894J19865o9895J0490
16264B11867A9792J35119c920G0349d01363E2277L30413l9019A34236J22493A24335
16252B16965N540r2488l5986L80545b09590d2464G8737c43880g0988B75265j02663
16241A72602q0878R4598a40089F9868J68105H1367A586J67265Q4203N7542A52106
16229a10149A02081N8996a87813B27508b760j21228c2976C07491a7081q1284j628
$$ y = [195939, 200343, 160001, 237098, 292761, 151876, 491636, 74989, 509195, 18368, 205485, 404215, -40779, 112614, 228814, 65745, 195563, -26109, 184385, -46747, 246543, 143327, 89890, 106171, 72038, 25826, 13984, 299879, 330635, 11327, 42631, 538777, 80686, 144228, 218990, 259143, 558320, -71214, -85147, -16459, 108513, 151407, 271272, 201377, 211867, 19792, 154911, -3920, 70349, -401363, 52277, 382690, 343671, 134236, 256729, 124335, 216965, 222505, 130017, 94031, 474576, -209590, -42464, 78737, -343880, -70988, 275265, 172602, 91724, 186322, -140089, 69868, 237973, 81367, 1586, 168851, 253054, 310596, 152106, -110149, 102081, 161077, -187813, 227508, -2760, -123988, -32976, 307491, -17081, -98365, -99993]
16218i9993B15942H6632b22308B49492m6320F0117b51065E537i5057A58627P4971
16207B33598b22232B94946A34698g17p9790A53194d5154C13575A53552K26443
16197C79995j44552J594p6142C5505J9919J6190K3045c8185L431B37630r5094
16186A42536K3164a87339c78p4605C82483c8762A48852o5397K10448G1870a90857
16174C43177K11321D0675N5538e9023a5327F7763f5701A15185P502k3070J39880
16163B39497m6219d6346Q091A62126M01148b13446n9255a03210o3132E5357Q2584
16152A37941j1786d7747a4568D7045b07949c7980a7900l0878n8985A23266d5904
16140A45008i9740D1114K28328a99905C1721K38930B8751a69970e8348r90h956
$$ y = [-99993, 215942, 86632, -222308, 249492, 203172, 60117, -251065, 5537, -95057, 158627, 233598, -222232, 294946, 134698, -717, -80507, 153194, -45154, 313575, 153552, 379995, 235443, 237037, 160895, 35505, 55424, 71614, 94659, -38185, -34754, 237630, 142536, 165700, -187339, -378, -74983, 382483, -38762, 148852, 83455, 293903, 71870, -190857, 343177, 554498, 40675, 96213, -59023, -15327, 67763, -65701, 115185, 122687, 99617, 239497, 193278, -46346, -38255, 162126, 563274, -213446, -272701, -103210, -166342, 55357, 137941, 126155, -47747, -14568, 47045, -207949, -37980, -17900, -48778, -107763, 123266, -45904, 145008, -99740, 41114, 269442, -199905, 31721, 270651, 28751, -169970, -58348, -59338, -8956]
16128a52802A74576a51038K1846K355A13909L01016D0462J56456g4616C7898g5426
16116b84752A62171k8322O7390g6200q7136E5234P1809a54596A55255D4535h9901
16104A62549e0826r3010J6233B25853Q7726q3371H6137L17739C0499h1811a2262
16092B56229b60616i3830A57012f0305A04244k0084J23959j9776b32434C1771
16081A92587a43455C2603a17453B63565A2455J38681b686A80529D2055R2821f9871
16069a17823b0852o2945D13112a93380B39a5143A4352c86852A49253A0539h778
16057A40166M9473H9376c3288P083j63363J2081A63687A7501b05076l12289B64695
16045C38691a76302F5422b6914B492c1574j77303K3050A74770c7020k11709B24555
$$ y = [-152802, 174576, -151038, -129192, -126837, 113909, 414925, 40462, 196918, -74616, 37898, -75426, -284752, 162171, 133849, 201239, -76200, -163336, 55234, 127043, -154596, 155255, 44535, -89901, 162549, -50826, -143836, -127603, 225853, 313579, 230208, 86137, 403876, 30499, -81811, -12262, 256229, -260616, -93830, 157012, -60305, 104244, 84160, 208119, 188343, -232434, 31771, 192587, -143455, 32603, -117453, 263565, 12455, 151136, -2686, 180529, 42055, 134876, -69871, -117823, -20852, -83797, 413112, -193380, 239, -15143, 14352, -386852, 149253, 10539, -8778, 140166, 189639, 89376, -33288, -26205, -189568, -177487, 163687, 17501, -205076, -517365, 264695, 338691, -176302, 65422, -26914, 2492, -31574, -208877, -185827, 174770, -37020, -248729, 224555]
16033a54104E4824h4812j76489G5211a73471l6779A14892b02184D09161H9816
16022A93120b60163J17188D040a39200A49281a5999A04785J96924b42567d0629
16011D6125b20371B44530g6224A6942M11721A29488f0568A56207b5253k4650C79277
15999a09263C3596P4382c18966A76205c3011j05721R611A86570e013l0661B76350
15987i229a213n4369a8728B563g4481A19947L58135B25906j11955m8130C27a84058
15974g9566q8002P4502L57C29110p2012L6683a12642B08910b91467J08370e5134
15962c21593c5563A30378c9j27477j02630A78826E7207M7491h8067E7634J39175
15951A96809b14657k47521a22016B83583c13195g9938H377J14880m3682a11672
$$ y = [-154104, 54824, -84812, -261301, 75211, -173471, -210250, 114892, -202184, 409161, 89816, 193120, -260163, -142975, 4040, -139200, 149281, -15999, 104785, 301709, -242567, -40629, 46125, -220371, 244530, -76224, 16942, 428663, 129488, -60568, 156207, -25253, -49903, 379277, -109263, 33596, 107978, -318966, 176205, -33011, -138732, -129121, 186570, -5013, -35674, 276350, -9229, -1213, -55582, -18728, 2563, -74481, 119947, 478082, 225906, 113951, 65821, 327, -184058, -79566, -167568, -93066, -92709, 329110, 257098, 293781, -112642, 208910, -291467, -183097, -55134, -321593, -35563, 130378, -39, -127516, -230146, 178826, 57207, 104698, -88067, 57634, 196809, -214657, -462178, -122016, 283583, -313195, -79938, 8377, 123257, 79575, -111672]
15940B81291a0912j95144A2488h3163C264a05881K6355A56961f400A45985B6966
15928A05695d5898A52589b4170j24123F1340c35081a27516d4040B08451i4958
15917a13566N6375k04215B46804b01387C55833C0567f2206G9097h1277A62645
15906b97044a4448k210B12685H8109a61119B11180d33721A2963J50955c3503p2404
15895a05907j8923Q479n5240A56521a25235b9162B43065a48821n7237R2151A9961
15883A00335i3540G9391C8946b71309I4912g0757m4836r714C8415c38202A0290
15871a66521C2060d8550J5825F3022a03259j10824A4658a16838B0977K3852c05033
15859E10233k12020D1778R0701f013A17930a34599d7648G3269J4457J58743b7994
$$ y = [281291, -10912, -206056, 12488, -83163, 3264, -105881, -79526, 156961, -6400, 145985, 26966, 105695, -45898, 152589, -24170, -148293, 61340, -335081, -127516, -44040, 208451, -94958, -113566, -57191, -261406, 246804, -201387, 355833, 30567, -62206, 79097, -81277, 162645, -297044, -14448, -16658, 212685, 88109, -161119, 211180, -433721, 12963, 163918, -33503, -105907, -124830, -116351, -171591, 156521, -125235, -29162, 243065, -148821, -206058, -113907, 19961, 100335, -93540, 79391, 38946, -271309, 94912, -70757, -115593, -125307, 38415, -338202, 10290, -166521, 32060, -48550, -32725, 63022, -103259, -214083, 14658, -116838, 20977, 44829, -305033, 510233, 298213, 41778, 132479, -6013, 117930, -134599, -47648, 73269, 87726, 246469, -27994]
15847a07382A34813f7757F5583J25827a82137M9308d7604A09631n499J6235M512
15836A24879M1948a25920E9970M1905i4241a7247j17716N4123F4352M7721b63656
15824a19075L651d4293p400j15657a9817N309m44831A32626L15534b8229j02937
15813a31166b8846A64071H353N5899a09305k22312b3270j10004E2849d07428A17443
15801a2815A64483e9728j12967G3247a39980o9057j49089J19844A68189d8616
15790a77571j26616J40659Q635j76962I1054K04793g5409A49353L8744a8220k21364
15779b39584j3423e3668n2528J9901p1082F3682B4703a5730k48375k5839a22633
15767b04640g3975D54053A70713b10329F8457a44759F6025a03838F8991d14977
$$ y = [-107382, 134813, -67757, 65583, 191410, -182137, -132829, -47604, 109631, 104132, 120367, 124879, 166827, -125920, 59970, 101875, -94241, -17247, -134963, -80840, 64352, 112073, -263656, -119075, -115424, -44293, -51693, -167350, -19817, -14508, -459339, 132626, 448160, -28229, -131166, -28846, 164071, 8353, 64252, -109305, -331617, -23270, -133274, 52849, -407428, 117443, -12815, 164483, -59728, -172695, 73247, -139980, -209037, -358126, -238282, 168189, -48616, -177571, -304187, -163528, -154893, -331855, 91054, 295847, -75409, 149353, 188097, -18220, -239584, -253007, -53668, -106196, -86295, -157377, 63682, 24703, -15730, -264105, -289944, -122633, -204640, -73975, 454053, 170713, -210329, 68457, -144759, 66025, -103838, 68991, -414977]
15756B38061o9673d39866Q5704i0639D2458j339a74695N7416k6094A3029B930
15744g048E2a63150j63601c0935j60796P1941N7996j47145I2825k1554c72084
15732d7939k17604A55931A8628J55466h5046p5346r5490C75229a18560j6238q8831
15721b23629N5833p907p6504e2422E733c2195B0908a28202B6820J05K17920b1498
15708a26346M3477J7035A9965M0864a52031j75428F469a15742B08534i8724o4683
15697a63407C5089j7236J39380a96299P3578j19430Q5999K3486c8262q1873c56
15685A75544o7128c59486R8926B2321b52218f4472q7155j53251R7883M7364k73877
15674d33508a63256H0477b20308A55874C3468B550d17123f7261k69313J30948
$$ y = [238061, 168388, -439866, -354162, -90639, 42458, 41119, -174695, -117279, -143373, 13029, 2930, -7048, 52, -163150, -326751, -30935, -191731, -119790, -61794, -208939, 92825, 71271, -372084, -47939, -265543, 155931, 18628, 174094, -85046, -160392, -255882, 375229, -118560, -134798, -223629, -167796, -175703, -252207, -52422, 5733, -32195, 20908, -128202, 26820, 26925, 244845, -21498, -126346, -82869, -65834, 19965, 60829, -152031, -327459, 6469, -115742, 208534, -98724, -163407, 35089, 17853, 157233, -196299, -122721, -242151, -156152, -132666, -38262, -120135, -356, 175544, 108416, -359486, -260560, 22321, -252218, -64472, -151627, -304878, -206995, -159631, -433508, -163256, 80477, -220308, 155874, 33468, 2550, -417123, -67261, -336574, -205626]
15664b05626Q1117J1125l7601M8451b5720j96144J04258A05025c26991h4469A11418
15652a4288A91112A3408L0377J49942b3211A18928C490i8058R020j91855J07761
15641a73132j86012A55581f831B24060g254A18678b73952N2979h2541F7278R8407
15630A65685n4155k4805h819j79686I2892J48320A4412K7855b48077A59902a32223
15618E6041M7475b60864A1939a58723j43218b4989C2921a93226H7030L68471h4491
15606A10363b53901b1129m09943a82543O6552c5075l65331h5727o0037b7716A22504
15594a65517A13001a46131O1446l08842G9354c83626B09687k3198i0852A06908
15583f4428B13774c09690B12546A00179K07504b01549C2968L02775a20561E2994
$$ y = [-205626, -124509, -113384, -150985, -102534, -25720, -221864, -117606, 105025, -326991, -84469, 111418, -14288, 191112, 13408, 43785, 193727, -23211, 118928, 3490, -98058, -89038, -280893, -173132, -359144, 155581, -6831, 224060, -7254, 118678, -273952, -220973, -82541, 67278, 165685, 111530, 86725, -8819, -188505, 92892, 241212, 14412, 42267, -248077, 159902, -132223, 56041, 103516, -260864, 11939, -158723, -301941, -24989, 32921, -193226, 87030, 455501, -84491, 110363, -253901, -21129, -431072, -182543, -115991, -35075, -400406, -85727, -145764, -27716, 122504, -165517, 113001, -146131, -84685, -393527, 79354, -383626, 209687, 186489, -90852, 106908, -64428, 213774, -309690, 212546, 100179, 307683, -201549, 32968, 335743, -120561, 52994]
15572A52593b24037N3787P6166j06055B21951j10752c2727R715P254j23004O4802
15561g3960K0747D31914E6930K2355p234P9816F9048a10629B60592h9333q3345
15550a72678k5135e6510C1327i2805N564j71500L2327a08332K4867A75924b02572
15538A24527F2102J29010e9109D14820a6871A00831j2292b56748L0002A69256
15527A92527e09928A32585a49437i686B95360c52275D717K26373q5448k4923L4393
15516A55112c4960A94763G6931a84850D3745b48911G0996a00807J9676j07443
15506a88574e6950m4864A07350O0825a25305A32374k910h3830k85228B06675c28244
15494a53102k03509e5514D6840L63499a90130O4463n6779M5093m4469A2999a76568
$$ y = [152593, -224037, -170250, -94084, -200139, 221951, 111199, -32727, -23012, -15758, -138762, -73960, -53213, 431914, 56930, 79285, 72051, 151867, 69048, -110629, 260592, -89333, -172678, -197813, -56510, 31327, -92805, -87241, -258741, -226414, -108332, -83465, 175924, -202572, 124527, 62102, 191112, -59109, 414820, -16871, 100831, 88539, -256748, -226746, 169256, 192527, -509928, 132585, -149437, -9686, 295360, -352275, 4717, 231090, 145642, 120719, 155112, -34960, 194763, 76931, -184850, 43745, -248911, 70996, -100807, -81131, -188574, -56950, -101814, 107350, 168175, -125305, 132374, 129464, -83830, -369058, 206675, -328244, -153102, -356611, -55514, 46840, 410339, -190130, -125667, -182446, -137353, -181822, 12999, -176568]
15482a81592I0404a81565B50377i1830j70014L2680A81952b0240m31510B3249
15471A95115a7645r4047A09929i0645j08375A01267b12475J00491E8675d496p2990
15460g7486A50995J37805a66277A78634k6199l8203N7255L22669a0633j70571
15450a81204p6685I1771b90717g4765c6901E7407K5521C004M05434b01458M7944
15439a53514B90756r6606b17389B4164e09850c105G5567N1714A1156l843J75264
15428A82577c5201B15500J40986l7385i7620A02689a77860C03603a51808A35565
15417D0300a03896j17172O7544j15922J22816c9579k40244c452l0602A68602k7017
15406A41585c00200A718a52449l1966A69045b51258B91128A20170c65392h4962
$$ y = [-181592, 90404, -181565, 250377, -91830, -261844, -229164, 181952, -20240, -451750, 23249, 195115, -17645, -111692, 109929, -90645, -199020, 101267, -212475, -111984, 58675, -4496, -77486, 150995, 288800, -166277, 178634, 152435, 114232, 171487, 494156, -10633, -181204, -257889, 91771, -290717, -74765, -36901, 57407, 82928, 3004, 408438, -201458, -153514, 290756, 194150, -217389, 24164, -509850, -3105, 75567, 127281, 11156, 7313, 182577, -35201, 215500, 356486, 319101, -97620, 102689, -177860, 303603, -151808, 135565, 40300, -103896, -221068, -153524, -269446, -146630, -39579, -279823, -3452, -34054, 168602, 141585, -300200, 1718, -152449, -184415, 169045, -251258, 291128, 120170, -365392, -84962]
15395d1140j5663A97675n6735j9496b06917b8706j44913J9024A5078g5479I9535
15383G6214A2438J80280m8106b8575o0940B02690b08838A52753b3829q4980B80030
15371g5392j26958h889B08085J4629d68097E0524J49255R7694j48488b05573A45935
15359b76248a7174j38489J6775A58852J36341G4741a42755f4384C1046R9253g6958
15347a68178B09231J24998h2036H7637K36042j17784R4032b55032J11541a3436
15336d5694B51727c5559A84368d1566F942J6910a52903N8078l09113i1132A11449
15324a74053j3655B54819b50968D3735a52574c2638A83380L2072K01482A48761
15313a46062N9529k82717a61303A43622M1786b43711A51335b28684f3865b7264
$$ y = [-41140, -56803, 197675, 140940, 121444, -206917, -28706, -173619, -154595, 15078, -75479, 99535, 76214, 12438, 192718, 144612, -28575, -89515, 202690, -208838, 152753, -23829, -108809, 280030, -75392, -202350, -8889, 208085, 222714, -468097, 50524, 199779, 297473, 148985, -205573, 145935, -276248, -17174, -155663, -138888, 158852, 295193, 74741, -142755, -64384, 31046, 130299, -76958, -168178, 209231, 334229, -82036, 87637, 323679, 205895, 299927, -255032, -143491, -13436, -45694, 251727, -35559, 184368, -41566, 6942, 23852, -152903, -94825, -403938, -91132, 111449, -174053, -187708, 254819, -250968, 43735, -152574, -32638, 183380, 215452, 416934, 148761, -146062, -86533, -369250, -161303, 143622, 185408, -243711, 151335, -228684, -63865, -27264]
15302d8178m7955D5863J17857a50882E0065J69765k8624d2166k91461f5524H8160
15290B87568a26464C0208c02173B12574h7815D0754L0080b7325A22794k1324J42972
15279B44442H5983J48344c7461B01894H5690a06195B51045c75813a42934o0361
15269b03295C29901r9080J13385J09844A0670c3883j60378j7236D6543b51781
15258B01964l8707p6743K24746F7270J29642p5440n845a02927d6450C99130R73
15247D00103Q20415N82156R20391r24429L76820m22051C49011A58666M10601e1140
15236H3874O0086a13842H6817J87710M1013a644k55673A7782K34760e1719A13100
15224I7011e3052C34241A18344j0872K14759A23363K45940r2554p9543a66054
$$ y = [-48178, -96133, 45863, 163720, -150882, 50065, 219830, 191206, -42166, -333627, -65524, 88160, 287568, -126464, 30208, -302173, 212574, -87815, 40754, 70834, -27325, 122794, 101470, 244442, 85983, 234327, -37461, 201894, 85690, -106195, 251045, -375813, -142934, -203295, 329901, 230821, 344206, 454050, 10670, -33883, -194261, -211497, 46543, -251781, 201964, 163257, 86514, 311260, 67270, 196912, 121472, 115627, -102927, -46450, 399130, 400103, 1220518, 1802674, 2723065, 1798636, 2175456, 1753405, 349011, 158666, 569267, -51140, 83874, 143960, -113842, 86817, 274527, 315540, -1644, -257317, 17782, 252542, -51719, 113100, 97011, -53052, 334241, 118344, 107472, 322231, 123363, 369303, 276749, 197206, -166054]
15213a44462j43481A66967Q0603a20973a2761A31670a80640A48765b11149F0586
15202B23563a29729B8868K51217E2289A8129J77426J4846r1975a537A27615b33732
15190B31191j3526b56283d9663B94839G6242j0744a71152C54007d0623A02715
15179A5141a88226D19630E5477a0387B89219J7541f4388k4183a6948q0920E6459
15167b10821e1567C74483j76029g5265I2381j1610c534D25309b0225A14247K57547
15156C71794A08365B1298J1587J93039q1003K14682A56343a49291b5796l58444
15146c84240A02012n0584J14911L0251g9425j17884A83765i941k06560e0007E2026
15134B86020j13932B8649a90418C7955J38804j1655P9749A10907k3386f3969C6848
$$ y = [-144462, -287943, 166967, 247570, -120973, -12761, 131670, -180640, 148765, -211149, 60586, 223563, -129729, 28868, 280085, 52289, 18129, 195555, 210401, 118426, -1537, 127615, -233732, 231191, 217665, -256283, -49663, 294839, 76242, 65498, -171152, 354007, -40623, 102715, 15141, -188226, 419630, 55477, -10387, 289219, 306760, -64388, -88571, -16948, -97868, 56459, -210821, -51567, 374483, 198454, -75265, 92381, 80771, -3534, 425309, -20225, 114247, 371794, 108365, 21298, 32885, 225924, 144921, 359603, 156343, -149291, -25796, -384240, 102012, 51428, 166339, 196590, -79425, -197309, 183765, -9941, -216501, -50007, 52026, 286020, 172088, 28649, -190418, 37955, 176759, 165104, 244853, 110907, 87521, -63969, 36848]
15122A61701b20785f3711A75072J46229b15855A01863J32525I7565L0430K17561
15112C45556l7698J50228B13078o9898O1184N9627g3327A73474M67622B10406
15101f9059C2456J48548N3866g8081c0903l07914A77939J35960F4292a99721A99554
15089A14831c42594A85418a91905A68388c1281I1150J63795e7685E26928G875
15078B4950L2252a71671A31761J64414r2268r9923J90108J40354j00976N4190
15068C87660j91766p4342J56866j29683M4830F7163P044J01037o666J93775m6724
15057C15629P4795j50193b43711J01511A47499J32258a02977A72422O3751h9417
15046G5155B2104Q2609K38913A09938r452L44245B3691b03669B98937I5556M60563
$$ y = [161701, -220785, -63711, 175072, 321301, -215855, 101863, 234388, 97565, 127995, 345556, 307858, 458086, 213078, 143180, 204364, 263991, -73327, 173474, 641096, 210406, -69059, 32456, 181004, 234870, -78081, -30903, -338817, 177939, 313899, 64292, -199721, 199554, 114831, -342594, 185418, -191905, 168388, -31281, 91150, 254945, -57685, 526928, 7875, 24950, 57202, -171671, 131761, 296175, 203907, 103984, 294092, 434446, 333470, 387660, 195894, 121552, 278418, 148735, 193565, 67163, 74207, 175244, 168578, 362353, 315629, 390424, 240231, -243711, -142200, 147499, 279757, -102977, 172422, 236173, -89417, 75155, 22104, 104713, 343626, 109938, 100486, 444731, 23691, -203669, 298937, 95556, 556119]
15035E56119A74636h1396j75699e0044B92350j03168d4340B18839q6643J98174
15025C30370F7978R6292J26406Q7453A84832H8922O8548p1410K03767r1345n6042
15014A42440n457M23041A41026k1345k9339L9321c23522C55052R0116H8114J17920
15003B06034K59484A36749h7295B06766K2667A07980N1090f7131A09761L4257
14993A44018g5348A97146J12196L315d8894E15807A41939B9162q661R3110L05106
14982D18717j10792j02405r3145b13550B27662J45233j64979I4184M54443B5864
14971A69726p5545K96125p3650g5769G1141A5644a43250D57910O7154A88298e7350
14959I5892J42870q5169K68333j04443A43952M21752k81503o7321K5375J62897
$$ y = [556119, 174636, -81396, -257095, -50044, 292350, 189182, -44340, 218839, 132196, 330370, 67978, 164270, 290676, 378129, 184832, 88922, 157470, 86060, 289827, 198482, 142440, 136983, 560024, 141026, 119681, 90342, 129663, -323522, 355052, 445168, 88114, 206034, 465518, 136749, -87295, 206766, 229433, 107980, 159070, -67131, 109761, 144018, -75348, 197146, 309342, 312657, -48894, 515807, 141939, 29162, 20501, 113611, 418717, 307925, 205520, 112375, -213550, 227662, 372895, 207916, 94184, 548627, 25864, 169726, 94181, 390306, 316656, -75769, 71141, 15644, -143250, 457910, 525064, 188298, -57350, 95892, 238762, 153593, 421926, 317483, 143952, 565704, 284201, 216880, 242255, 405152]
14949D05152J13308G5468L72723C2094J58148O9494H5996K76715p6627d2695F0264
14937A80009J00665o867R9364o3466E5029M72969B38013J21985B7660K71561A23203
14925B28799I8729K72943j68712J90694J9335f2872C15270K8302A1105M01528
14915D12633q3798j11243Q7219G6427R1094L47142M174D4073M3962J60621M9744
14904B98400j2036j36794K09421J28312A95672F0384L53774j04989O3892L14937
14894F87998k72641B2020K48164m5695L40848j18697j83839A17031K82952j5690
14884C84293j82032r0640K45896J18138A43726L4070K71362A99091J17782J70923
14874D87796O309k0435k18397o5319N51501j41161k85658L54752B77267K54210
$$ y = [405152, 518460, 75468, 448191, 32094, 190242, 259736, 85996, 362711, 286084, -42695, 60264, 180009, 280674, 273807, 373171, 309705, 55029, 527998, 238013, 359998, 27660, 299221, 123203, 228799, 98729, 371672, 202960, 393654, 412989, -62872, 315270, 343572, 11105, 412633, 328835, 217592, 304811, 76427, 167521, 514663, 518837, 44073, 88035, 248656, 298400, 286364, 149570, 358991, 487303, 195672, 60384, 414158, 309169, 373061, 687998, 415357, 22020, 270184, 224489, 565337, 446640, 262801, 117031, 399983, 384293, 202261, 111621, 357517, 475655, 143726, 177796, 449158, 199091, 316873, 487796, 494105, 473670, 255273, 189954, 741455, 600294, 314636, 669388, 277267, 531477]
14864E31477l5321j40356j73225N05586k13926B23769J02213K8272E6777M53243
14854E10020A03328B303N50591A06469j2106J66232j05408O9548q9621L50220
14844D85334k15713M11532k77993j57092A3272N22278p6311j07355l9041M09217
14834G22060C29513K51214B54000A0684J50819J51845J98619j51634L5322A46260
14823C86766M50866C19017L32898J7034k73944l8326m2592L17950B07731M08429
14813F16160k70932K23028B80253J98227a14336F64147k22034j85449K60892k19816
14803B97740K63225P81B44930L22926o6698K15962l43254J71545m3075r2106j67011
14792B43219L61110B68996K80950K45655l73765J46264j26631k17541N2843K63114
$$ y = [531477, 496156, 355800, 182575, 688161, 474235, 223769, 325982, 354254, 56777, 510020, 103328, 2303, 552894, 106469, 94363, 260595, 155187, 224735, 135114, 485334, 269621, 681153, 403160, 246068, 13272, 535550, 459239, 351884, 312843, 722060, 329513, 580727, 254000, 10684, 161503, 313348, 511967, 360333, 395655, 146260, 386766, 837632, 319017, 651915, 668949, 395005, 356679, 314087, 632037, 207731, 616160, 345228, 568256, 280253, 478480, -114336, 664147, 442113, 256664, 517556, 297740, 560965, 561746, 244930, 567856, 501158, 717120, 373866, 545411, 502336, 410230, 243219, 604329, 268996, 549946, 795601, 421836, 568100, 441469, 223928, 276771, 539885]
14782E39885M0451n5238J53035j59680k30063J77766k632J01890o6148J44953
14772F44219o7222k38808L78169l08114l0293J81768Q469J43587j65844q9638
14762D56293K2249p6437L38277j43937k73576L80019j3551j27031K05856C72684
14751E46116j54339L5561K63970p2230j72538N7122J86318M3462l50250K94687
14741F77879R0336p2856K41054j57047k66834j75170N37634r6701k7672J86273
14731I36896j47896p2087K8978M8318k9527m3115K62792j75288J79935j64033
14721H24973n8651J23064q8807k02542P6759J43623N4479j92408M8805M4658k20895
14710E53058K01602J30207l56895K2547J30230J1923j32754K60793j40478k49036
$$ y = [539885, 580336, 525098, 678133, 518453, 288390, 466156, 463524, 565414, 499266, 644219, 576997, 338189, 716358, 408244, 377951, 559719, 568188, 711775, 545931, 456293, 478542, 402105, 740382, 596445, 322869, 702888, 689337, 562306, 768162, 372684, 546116, 391777, 427338, 691308, 619078, 446540, 503662, 689980, 733442, 383192, 677879, 768215, 695359, 936413, 779366, 512532, 337362, 874996, 778295, 750623, 936896, 789000, 716913, 745891, 794209, 764682, 721567, 984359, 809071, 989006, 824973, 766322, 889386, 800579, 598037, 674796, 818419, 872898, 680490, 729295, 773953, 553058, 754660, 884867, 527972, 550519, 680749, 692672, 559918, 820711, 680233, 431197]
14700D31197L24298Q8610j26313K58886D87405J59542j31655L29055m8042L18411
14690A114716n44502L95533q8636j72203Q2490K4238j49771J96561K35763n02653
14680E91536N02464l84735L75649J03787k29275J27172M240l11350L28187k69264
14670H38411M05351F10261L24449j2102K47273j87284k17760L48542O1838J82000
14660A357217n22522J75374J88802j32521k25613L98061l08859J31529n1456K76019
14650A286031j2926k69814j10328L1304J81410J25241l24396Q2017J34423J3253
14640A136215R041L16857M5999l94842J35153p7499J03114j51051L19659r4802
14630A347844n02386O23604j12808j38301j22385L86019K0070m56828M00235R8675
$$ y = [431197, 755495, 844105, 717792, 976678, 487405, 646947, 515292, 844347, 796305, 1114716, 570214, 965747, 877111, 704908, 787398, 811636, 661865, 858426, 1094189, 591536, 1094000, 709265, 1084914, 1188701, 959426, 1086598, 1090838, 779488, 1107675, 838411, 1243762, 610261, 934710, 922608, 1169881, 982597, 764837, 1113379, 1175217, 1357217, 834695, 1010069, 1198871, 1066350, 840737, 1238798, 929939, 1061468, 1010012, 1286031, 1273105, 1003291, 892963, 924267, 1105677, 1230918, 906522, 988539, 1122962, 1136215, 1145256, 1462113, 1508112, 1113270, 1248423, 1170924, 1274038, 1122987, 1442646, 1347844, 845458, 1469062, 1356254, 1217953, 1095568, 1481587, 1501657, 1044829, 1445064, 1543739]
14620A543739k54964K51480k96339K75926l36491o4098l400L19176K14871m49895
14610A200005M40088j56844j91984j84331L30133o4900j12473J75155J65450j62063
14600A438236j5849N2403J34890m6048L6200k21708J79010O9776j73628K25610
14590A678892l5796K1071O4383K4794k66139M46110k25773K73479r7116j88117
14580A695788K19727J86108K23938k07578o5708j99668R9183K94870j58672j26363
14570A961625M75948m02157K82118j79342J02357l86856O27307l56165J35787
14561B260622j12608O16999k77065K24211l51793N02216n164L25190M29925N11961
14551D124494N29671J398267L077546O337811Q834053J0309373N809188A8024132
$$ y = [1543739, 1288775, 1540255, 1243916, 1519842, 1183351, 1119253, 1115853, 1435029, 1649900, 1200005, 1640093, 1483249, 1291265, 1106934, 1437067, 1372167, 1259694, 1434849, 1600299, 1438236, 1422387, 1474790, 1609680, 1563632, 1599832, 1378124, 1557134, 1626910, 1453282, 1678892, 1643096, 1664167, 1728550, 1753344, 1487205, 1933315, 1707542, 1981021, 1883905, 1695788, 1915515, 2101623, 2325561, 2117983, 2052275, 1852607, 1951790, 2246660, 2087988, 1961625, 2437573, 2035416, 2317534, 2138192, 2240549, 1853693, 2481000, 2124835, 2260622, 2148014, 2765013, 2487948, 2712159, 2360366, 2862582, 2857418, 3182608, 3612533, 4124494, 4654165, 6052432, 9129978, 15467789, 24301842, 34611215, 40420403, 18024132]
14542G934825j645068O68328k046593B339563n6194m49250j82437J67809R0300
14533A909791j71980k3641K43680K20345j54524K43943p4139m4949o5856k35937
14523A846733M14786j30836R2403j10920J21164J1818k84672L88250J32688l6357
14513B445057J7448J96140l85100J51309L68376k33694j93521K90105L02113m57135
14503B501098K32047O9736J90879P296j55255j06769M45860k2362m06488K39008
14493B995050J07111J11746P0954k86688N21192m73692P0408M99296k61829j60352
14483C193196K24240j96530L12327K1870j07544K67518l43726M49470l386L37861
14473D155296k64911J3408j5869k33112J36143J49040Q3831k0626M39687l58362
$$ y = [7934825, 6289757, 6958085, 4911492, 2339563, 2283369, 1834119, 1651682, 1819491, 1909791, 1737811, 1714170, 1957850, 2178195, 2023671, 2267614, 2193475, 2148526, 2082670, 1846733, 2261519, 2130683, 2223086, 2112166, 2233330, 2245148, 1960476, 2348726, 2481414, 2445057, 2462505, 2658645, 2273545, 2424854, 2793230, 2559536, 2366015, 2656120, 2958233, 2501098, 2733145, 2802881, 2993760, 3001056, 2845801, 2739032, 3184892, 3162530, 2756042, 2995050, 3102161, 3213907, 3284861, 2998173, 3519365, 3045673, 3116081, 3615377, 3353548, 3193196, 3417436, 3220906, 3533233, 3555103, 3447559, 3715077, 3371351, 3820821, 3817435, 4155296, 3890385, 3903793, 3887924, 3654812, 3790955, 3939995, 4023826, 4003200, 4442887, 4084525]
14463D084525O51735k58951K01767J2691K3143j35577q8069L85548J99004l72701
14453D703115j87624K13214J07070J3221L53065j18657P6840Q30126p69427M3077
14443E264020L22942k83209J99195K85689Q2687p1711L1466J8699J86375j84446
14433E851707J86842K76040K186K38691n2753K55867j33338k3407K11015N6171
14423F869021K71099j70993R1869M36156k00955K18563L38920o9307L24449l2187
14413H076635p355j68375L93915J16950N6623P4799L76241j61467O48030j64546
14403I241450J33726L63505k5830L58395J23803M5689K32378k4376M52130j40129
14393A0760741M20092L9688K90850O74049k45998J63105L64664j7975K12313K07280
$$ y = [4084525, 4736260, 4477309, 4679076, 4691767, 4714910, 4579333, 4491264, 4876812, 5075816, 4703115, 4515491, 4728705, 4835775, 4848996, 5202061, 5083404, 5160244, 5990370, 5220943, 5264020, 5586962, 5303753, 5502948, 5788637, 5871324, 5799613, 5831079, 5849778, 6036153, 5851707, 6038549, 6314589, 6316775, 6555466, 6502713, 6758580, 6625242, 6601835, 6812850, 6869021, 7140120, 6969127, 7060996, 7497152, 7296197, 7514760, 7853680, 7784373, 8108822, 8076635, 8069280, 7900905, 8294820, 8411770, 8468393, 8543192, 8919433, 8757966, 9405996, 9241450, 9375176, 9738681, 9712851, 10071246, 10195049, 10240738, 10473116, 10448740, 10900870, 10760741, 11180833, 11220521, 11511371, 12185420, 11939422, 12102527, 12467191, 12449216, 12661529, 12868809]
14383A2868809K94979J24851K63387J61927K80524N92986M57452K11340J03218
14374A5359473J95704K59924M19128L72413L05317M09395K21126L66269l0993
14365A7877756O95284O19775M54807K88137L27074N96887J99711O63937Q11439
14356B2534807K83229N96717N34591P21682N05016M36274N76022P02392O66813
14347B7557543Q39976N25965P84198Q01681M60407J157381R04035J195676N81236
14338C4808098J058006P54783J519123J208225R76028J093326J486314J240687
14330D4144590J427684J309324J667482J382356J802229J511366K133282J811485
14322E7189798K093270K073595K597824J851599K471754K854449K796891K614824
$$ y = [12868809, 13163788, 13288639, 13552026, 13713953, 13994477, 14587463, 15044915, 15256255, 15359473, 15555177, 15815101, 16234229, 16606642, 16911959, 17321354, 17542480, 17908749, 17877756, 18573040, 19192815, 19647622, 19935759, 20262833, 20859720, 21059431, 21723368, 22534807, 22818036, 23414753, 23949344, 24671026, 25176042, 25612316, 26188338, 26890730, 27557543, 28397519, 28923484, 29707682, 30509363, 30969770, 32127151, 33031186, 34226862, 34808098, 35866104, 36620887, 38140010, 39348235, 40324263, 41417589, 42903903, 44144590, 45572274, 46881598, 48549080, 49931436, 51733665, 53245031, 55378313, 57189798, 59283068, 61356663, 63954487, 65806086, 68277840, 71132289, 73929180, 76544004]
14314G6544004K998199L348424L505651L634976L853872M172789M100851M731571
14306A06890337M866492M921569N453426N788789O218849O667882O615245P749892
14298A55172481P756671Q531881R111136R259124J0255350J0751300J1544090
14291B22382033J1781460J2998722J3151100J4218928J4786576J5378257J5822732
14284C20519808J6348787J6449658J6824055J6291216J5544571J5152595J4567680
14277D31698370J2921604J1632804R508249O747942Q56227l231656m573217J70862
14269D65731185K998106j803714p755000j0728853j1823657j2880234j4349617
14262D09388216j5157574j6158261j6811521j6753725j6492512j6412287j6028555
$$ y = [76544004, 79542203, 82890627, 86396278, 90031254, 93885126, 98057915, 102158766, 106890337, 111756829, 116678398, 122131824, 127920613, 134139462, 140807344, 147422589, 155172481, 162929152, 171461033, 180572169, 189831293, 200086643, 210837943, 222382033, 234163493, 247162215, 260313315, 274532243, 289318819, 304697076, 320519808, 336868595, 353318253, 370142308, 386433524, 401978095, 417130690, 431698370, 444619974, 456252778, 465761027, 472508969, 473365196, 470133540, 465560323, 465731185, 468729291, 466925577, 459170577, 448441724, 436618067, 423737833, 409388216, 394230642, 378072381, 361260860, 344507135, 328014623, 311602336, 295573781]
14255B95573781j5069444j4456113j3949390j2318932j1287666j1918553j1242084
14248B05331599j0804536r797063r484410q458636p744292p935178p572637o463913
14240A37070934o504122o085782n269020m976136n376786m676513m424365l964310
14232I5793900l946685l356085l790920l337996l173179k987253k708820k900355
14224F9592607k454357k409678k697733j673054j810326j922158k221806j675468
14216E2728027j660556j797304j444865j079235j539981j423882j253837j283526
14208D1244841j054764j156884o78210j424965j030603j021329o91603p18829
14200C3467654j151140n44268j335277o37410l43906p75936q36223q52815o44403
$$ y = [295573781, 280504337, 266048224, 252098834, 239779902, 228492236, 216573683, 205331599, 194527063, 184730000, 175245590, 166786954, 159042662, 151107484, 143534847, 137070934, 130566812, 124481030, 119212010, 114235874, 108859088, 104182575, 99758210, 95793900, 91847215, 88491130, 84700210, 81362214, 78189035, 75201782, 72492962, 69592607, 67138250, 64728572, 62030839, 60357785, 58547459, 56625301, 54403495, 52728027, 51067471, 49270167, 47825302, 46746067, 45206086, 43782204, 42528367, 41244841, 40190077, 39033193, 38354983, 36930018, 35899415, 34878086, 34186483, 33467654, 32316514, 31772246, 30436969, 29799559, 29455653, 28679717, 27843494, 26990679, 26346276]
14191B6346276o61487o36092p36764p60182j06162n13469q37600l8482r46651
14182B1109387l79690l54867q51023J64560m69399m44980m45259l51887p93118
14173A7183724o334L7o29614j62100j72565l67604j43437n02195m38788j70370
14163A4590754l62820l25735N8462l06804J07046o17732m6044m36475j74982M0483
14153A2526153m29002L4673q40417L48619k78579k4569j88746m27950m35138J17872
14143A0402916k61150l2204k98193k86058J72595k22268l00292L7586J02406p4596
14133I240742l99387j42160J73070m4099m07281l82308J65888k73176M38966n98255
14123G772000j00802R2808k86830O9202k47393Q9736k97513k6001J37977m99892
$$ y = [26346276, 25684789, 25048697, 24311933, 23551751, 23445589, 22932120, 22094520, 22056038, 21109387, 20729697, 20374830, 19523807, 19688367, 19218968, 18773988, 18328729, 17976842, 17183724, 17177390, 17177427, 16547813, 16385713, 16213148, 15845544, 15702107, 15199912, 14761124, 14590754, 14227934, 13902199, 13960661, 13653857, 13760903, 13143171, 13097127, 12660652, 12485670, 12526153, 12097151, 12131824, 11291407, 11640026, 11361447, 11336878, 11148132, 10720182, 10285044, 10402916, 10141766, 10109562, 9811369, 9525311, 9697906, 9475638, 9175346, 9212932, 9315338, 9240742, 8841355, 8699195, 8872265, 8828166, 8420885, 8038577, 8204465, 7931289, 8370255, 7772000, 7671198, 7764006, 7477176, 7546378, 7298985, 7388721, 7091208, 7065207, 7203184, 6703292]
14113F703292K40475j38816k65120J79148k77390K23821m76780J21114j64150
14104F145594k73994M51052n49034Q208K90260j59850l43887O8777j29787m01910
14094E105429L11360j28045l58749K38112J33320k82878j10909M06693j65015
14085E149318j02434l65538J35022k74309P2120J3204l7674j08704k29576L64016
14075D615445j15949l63194J73813j03349L3781k68778K9810J15132N14614q35556
14065C795769J04005J08208j55268o6432J5196j6427j43519Q294P6169k38943
14055C487052K49871q5458k60585K63116j21991n2016m3497l31952J75036J17199
14045C396775m43622L40122R2662j64214l22610K57247m6661K8029l07436Q6269
$$ y = [6703292, 6943767, 6804951, 6539831, 6718979, 6441589, 6665410, 6188630, 6309744, 6145594, 5871600, 6322652, 5773618, 5781826, 6072086, 5912236, 5568349, 5637126, 5507339, 5105429, 5416789, 5288744, 4929995, 5168107, 5301427, 5018549, 4907640, 5314333, 5149318, 5046884, 4681346, 4816368, 4542059, 4614179, 4627383, 4589709, 4481005, 4251429, 4615445, 4499496, 4136302, 4310115, 4206766, 4240547, 3971769, 4001579, 4116711, 4631325, 3795769, 3899774, 4007982, 3852714, 3786282, 3801478, 3785051, 3641532, 3649826, 3725995, 3487052, 3736923, 3651465, 3390880, 3653996, 3532005, 3479989, 3436492, 3104540, 3279576, 3396775, 2953153, 3293275, 3385937, 3221723, 2899113, 3156360, 3109699, 3137728, 2830292, 2916561]
14035B916561k85311N44723k54045o5178J5184K97419l26357j56771M73309l11906
14025B847628k0324j05719j5634k56945N1470M5737J24775m04500N55532l65786
14015B456234J76713l79714L58194k27907k09181K57457K71967l29759m22618
14006A951386K36766K9463O1455K0440j6440l99685N6102K60103j87530m0328
13996A971732J66982m37832L76436p2084L4258N62306L79825J873979N648989
13987A0504591Q504320J1379195J0939635j7650961A1174090m224031j667350
13980E282709p61603n17116p54151K37105l10760l13663n7272k77531o6514M7458
13970B508662l11988N26621k68039J28057k82731k64661K06125K82977m89425
$$ y = [2916561, 2631250, 3175973, 2921928, 2856750, 2871934, 3169353, 2842996, 2686225, 3159534, 2847628, 2827304, 2721585, 2705951, 2449006, 2500476, 2546213, 2670988, 2266488, 2822020, 2456234, 2632947, 2253233, 2611427, 2383520, 2174339, 2431796, 2703763, 2374004, 1951386, 2188152, 2217615, 2279070, 2299510, 2283070, 1883385, 1939487, 2199590, 2012060, 1971732, 2138714, 1700882, 2077318, 2005234, 2039492, 2601798, 2981623, 4855602, 10504591, 19008911, 30388106, 41327741, 23676780, 11174090, 6950059, 5282709, 4521106, 4003990, 3249839, 3486944, 3176184, 2862521, 2805249, 2527718, 2461204, 2508662, 2196674, 2723295, 2455256, 2583313, 2300582, 2035921, 2242046, 2525023, 2035598]
13961B035598O2543L15352p58577P15222k61632L65144n94689O3169R0563j23600
13951A909093n0400K51785l65591Q8390j32869p8603K71045J52907p8095l59030
13941A608632J47337j91968L51125K10381j83326l05377L2170j64400K29530j87146
13931A546958j45731P5127J51936j5928j76208O1940M3761L1368l61612K08186
13921A419797P1981k803J2404K01295j12632j22131j7407P846R4080j24100j18425
13910A309905R1563J01555j68314m1535L8616R5815p6600R6828k12010M2518o182
13899A272159j82661J56301L85519l07542p3514J97802j20674l8895j7970K686
13889A273211j23020J28444J59300P1850j49509l15198J54259q7710N7970J05686
$$ y = [2035598, 2098141, 2413493, 1654916, 2370138, 2108506, 2473650, 1878961, 1942130, 2032693, 1909093, 1858693, 2110478, 1744887, 1833277, 1700408, 1621805, 1892850, 2045757, 1967662, 1608632, 1755969, 1564001, 1915126, 2125507, 1942181, 1636804, 1668974, 1504574, 1734104, 1546958, 1401227, 1476354, 1628290, 1612362, 1436154, 1498094, 1541855, 1573223, 1211611, 1419797, 1491778, 1488975, 1501379, 1702674, 1590042, 1467911, 1450504, 1458350, 1552430, 1428330, 1309905, 1401468, 1503023, 1334709, 1293174, 1331790, 1427605, 1351005, 1447833, 1235823, 1278341, 1272159, 1089498, 1245799, 1631318, 1323776, 1250262, 1448064, 1327390, 1288495, 1270525, 1273211, 1150191, 1278635, 1437935, 1509785, 1360276, 1045078, 1199337, 1111627, 1169597, 1275283]
13879A275283k7289K5814j31089J30038R4871l09796N3834J37731l83438K87053
13869A153012k80606Q2907L34207l94555J112N7446Q4379P2762K37779j92713
13859A155730k53113K26163J75937j28498j43405P420p1378j7070L83113l01927
13849A032972l72034K86153j02468O2707l33437M98962o9301o4685r6356K33174
13839A075687M0502k31667m6872K39700r286N6085E52619O74372j18256m24043
13829F84692j0611L66402J61854n1574k62876J84925m86222M87118m80112L55765
13819I49361P7610j73359j6196N78926n94298J00106q9r2773j75624J4068K55808
13808I23540j19291p9305R183l6028J03131J02933k70126r2761L51717k6931L4466
$$ y = [1275283, 1247994, 1273808, 1142719, 1272757, 1367628, 1057832, 1111666, 1249397, 865959, 1153012, 872406, 955313, 1289520, 894965, 896077, 953523, 1037902, 1110664, 1348443, 1155730, 902617, 1128780, 1304717, 1176219, 1032814, 1040234, 968856, 951786, 1334899, 1032972, 660938, 947091, 844623, 907330, 573893, 1072855, 1003554, 938869, 842513, 1075687, 1116189, 884522, 837650, 1077350, 1068064, 1124149, 552619, 1226991, 1108735, 684692, 674081, 1040483, 1202337, 1150763, 887887, 1072812, 586590, 1073708, 593596, 949361, 1026971, 853612, 837416, 1416342, 822044, 922150, 922061, 829288, 653664, 667732, 923540, 804249, 724944, 734127, 698099, 801230, 904163, 634037, 541276, 892993, 866062, 900528]
13797I00528k16618r9077K15205j59271k3789K09483C46901M92237Q7691j98168
13787G28661K60916m9447l75264J6437M5663M1762n8183J25987K14665n0314k81520
13776F19363K14449L5743k94445r0819N5375K89975j24030Q8438q1793J99408
13766I11664j82072K1880K48617B70809L65730J72696j81874j1022j351m389j42068
13755D68531M24490j16829k69233L19028j96199J01020Q7749k35638O9612k15471
13745D37060l0996M41852k23755p6080q8925j48264K92382j10904L67496l56331
13735E03535j92102N94046l26098p3096J85293k13919J45213j45042K96589j3969
13725G60450p9502A33188O75511C30900R9379J85365k20853J05264P9948J4355
$$ y = [900528, 683910, 584833, 800038, 640767, 616978, 826461, 346901, 839138, 926829, 728661, 989577, 940130, 564866, 581303, 626966, 668728, 610545, 736532, 951197, 900883, 619363, 833812, 869555, 575110, 484291, 539666, 829641, 705611, 794049, 712256, 911664, 729592, 751472, 1000089, 270809, 636539, 809235, 627361, 616339, 614988, 610599, 468531, 893021, 776192, 506959, 825987, 629788, 730808, 818557, 582919, 652531, 437060, 406064, 847916, 624161, 548081, 459156, 310892, 603274, 492370, 859866, 503535, 311433, 905479, 579381, 506285, 691578, 477659, 622872, 477830, 774419, 760450, 680948, 133188, 808699, 330900, 430279, 615644, 394791, 500055, 580003, 594358]
13715E94358L9438p5991M9856l7496j02442j80012N49353k67643j21632L46642
13705G94431l46097j06424j25771J03112j29287Q111K05840J22375k935j72345
13695C51010J81581B11183L64422J08814l8241P179n7664k31353J86088j80049
13685C70379o2194L92908A22929M00355j37637K66513k70756k5817J94081j27353
13675D22315j69980L17965p2744M2933l3469B48530J29464J53773A68364L78933
13665E47297B26488k9014K86295j46399j24786M8720L10130J3131K6436r3660
13655E17341j56256J74460j49947j51539M9833J01330j51654K14917A56900K07814
13645C64714L60415B34685r8248O45427B64104Q343P6043n6441L5489k3937R2422
$$ y = [594358, 633796, 557805, 607661, 570165, 467723, 287711, 837064, 569421, 447789, 794431, 448334, 341910, 216139, 319251, 189964, 198075, 403915, 526290, 523355, 351010, 532591, 211183, 575605, 684419, 646178, 653357, 595693, 364340, 550428, 370379, 308185, 701093, 122929, 523284, 385647, 652160, 381404, 355587, 549668, 422315, 252335, 570300, 497556, 540489, 507020, 248530, 377994, 531767, 168364, 547297, 226488, 197474, 483769, 337370, 212584, 261304, 571434, 584565, 611001, 517341, 361085, 535545, 385598, 234059, 283892, 385222, 233568, 448485, 156900, 364714, 725129, 234685, 136437, 781864, 264104, 272447, 348490, 292049, 327538, 303601, 396023]
13634C96023K58974l23592J7382K11968k64470K99675K42139C60018j77219L22770
13624E05569j61201N2782J50330B39963l0082Q3082J8527L84540C39457l4189
13614C05268p8598K86482A85920K77241A52168K96041o259j12649J23342P2382
13604E25025N2702k83523K29370j41746H0393L24929K86281k08647B31390J59570
13594C90960A72866J40287R6853P6504o9014B7131M38392A87313K05524K5814
13584D18651H3110K31050p457N6040j26744K05986J5096R1931L57693b6565B51856
13572D66938j8303n6227N9212k04266M21264A70432N03940j14196B18912R3971
13562C12883J16353J44493P0745C09570K3980l5215J42316A74398M23510B68749
$$ y = [396023, 654997, 331405, 348787, 560755, 296285, 595960, 838099, 360018, 182799, 505569, 344368, 397150, 547480, 239963, 209881, 292963, 311490, 696030, 339457, 305268, 226670, 513152, 185920, 463161, 152168, 448209, 441950, 329301, 452643, 525025, 577727, 294204, 523574, 381828, 80393, 405322, 691603, 482956, 231390, 390960, 172866, 313153, 410006, 486510, 417496, 27131, 465523, 187313, 392837, 418651, 83110, 314160, 306703, 362743, 235999, 441985, 457081, 549012, 906705, -26565, 251856, 466938, 448635, 392408, 451620, 247354, 668618, 170432, 674372, 560176, 218912, 312883, 429236, 573729, 644474, 309570, 333550, 298335, 440651, 174398, 597908, 268749]
13551F36273k65290F6222J70021n8902J87912K9519o5435K3440l9621m7769Q0239
13540C45626J676D2431L10674J95154A26639O4278l0408J20374A26665c3801C87607
13528A89078Q4583K23574j26868B4506b530D9745N41265A92392J57501J03307
13518D53200A72383H264g5449A73803O0470j15357K60274k5415A66293a29356
13507B12352J58541j21695K84378j97016J15184k06146J00323J8735E0747K10514
13497B61261j7336K03372L1065j42081L740A42180L13026A39590J45202K23243
13487E08035k4842k2919p3925A01080J07911J24019A52382F8292J88004P5803
13477C32099j23387J77754M3462m762q2145A56140L35814l1766A72596F0596B400
$$ y = [636273, 370983, 66222, 236243, 177341, 365253, 394772, 329337, 352777, 313156, 265387, 345626, 347302, 42431, 353105, 548259, 126639, 190917, 160509, 280883, 126665, -33801, 387607, 189078, 273661, 497235, 370367, 24506, -2530, 49745, 591010, 192392, 349893, 453200, 172383, 8264, -75449, 173803, 234273, 118916, 379190, 353775, 166293, -129356, 212352, 370893, 249198, 533576, 336560, 451744, 245598, 345921, 364656, 50747, 261261, 243925, 447297, 478362, 336281, 340021, 142180, 455206, 139590, 284792, 508035, 483193, 460274, 386349, 101080, 208991, 333010, 152382, 68292, 256296, 332099, 208712, 386466, 429928, 425166, 343021, 156140, 491954, 460188, 172596, 60596, 2400]
13465B10916P573L13254B37916G703J65631D8855R4240J40573M3612J94122i6735
13453A90353O2741J87785A01165J13964L27218A65518j7509a33030D99373j53579
13443C45794j16986f9562D25343h4258D26972o9554J21191J87237g4962C14252
13432A84218C7879J38918j2993J42298c95857B75324c11619F4516L26962j29103
13422B62375H5587j6262K36567h9886B34847K64202k39925D3932L7255L38412
13412D19599i1072B16720K05809A51071A7037K26962F1090K06268d6275H8239
13401C17929a44954B80443A31365J72394O4966o1270r4216J98766d5959A52716
13390a8706C60941l3872P7135A80503J49476d5088F0518e8203a4017C21950j36358
$$ y = [210916, 218489, 531743, 237916, 7703, 173334, 48855, 143095, 283668, 327280, 521402, -96735, 190353, 253094, 440879, 101165, 215129, 542347, 165518, 148009, -133030, 499373, 345794, 228808, -69562, 425343, -84258, 426972, 357418, 478609, 665846, -74962, 314252, 184218, 37879, 176797, 163804, 306102, -395857, 275324, -311619, 64516, 391478, 262375, 85587, 69325, 305892, -89886, 234847, 499049, 259124, 43932, 81187, 419599, -91072, 216720, 422529, 151071, 17037, 243999, 61090, 267358, -46275, 88239, 317929, -144954, 280443, 131365, 303759, 368725, 307455, 213239, 412005, -45959, 152716, -18706, 360941, 327069, 404204, 180503, 329979, -45088, 60518, -58203, -14017, 321950, 185592]
13379A85592b92622F4073K30076R783M6563r8286B8633K17398O3184K96749d3124
13367E9155L06545F9546K20191q9651o4334M1644P9876J4709n3382J75730D2748
13355A53694G3218K46911j54893J21125L584j13317N4204j1923N365A09009K48913
13344C57922J40468B0692M57465j50944J27396R5583k53599A46061J18418Q1514
13334C45993F9075a06049C94453j00719q0262J3746n9007J97238A52077J3291
13324A65368J43674r3765m8817M2906Q7251j44933n4862L06528A81374a05826
13313A38643K31868j4600A0171K13917j3405a16067B72582p0398C05L44366n022
13302C39649A37426j3015a05556A38352J43786I8911N773M03524H6440L20036
$$ y = [185592, -292622, 64073, 294149, 303932, 350495, 252209, 28633, 246031, 309215, 605964, -43124, 59155, 365700, 69546, 289737, 200086, 135752, 177396, 257272, 271981, 218599, 394329, 42748, 153694, 73218, 320129, 165236, 286361, 289945, 176628, 230832, 218909, 224274, 109009, 357922, 498390, 20692, 478157, 327213, 454609, 550192, 296593, 146061, 264479, 345993, 69075, -106049, 394453, 293734, 213472, 227218, 168211, 365449, 152077, 165368, 309042, 215277, 166460, 209366, 296617, 151684, 96822, 403350, 181374, -105826, 138643, 370511, 355911, 10171, 224088, 210683, -116067, 272582, 202184, 305, 344671, 339649, 137426, 124411, -105556, 138352, 282138, 98911, 104684, 508208, 86440, 406476]
13292D06476H2923P5333E8730M97170A39397O0674I4930K07638Q2919n1404a98789
13280A16167b4552A39146a13460A57119b96872B07218o426K7025F9229f9117c2294
13268D2070P1450K15314A27987n9157a26401F5480J83146q1321n5681b2364A2119
13256C84658A35774J4658h8615I7948l4075K85244k3B1501h640C98091H6193l9973
13244D6220N126O5518l1092a4587J561p0735C9537K54954A07127b6741B55419
13232a29763G4628K87964O4867B2816K64362N4634A41618M6226I2286J1871e033
13220B61914i611k69432b4021A95055o3650i5365M872A40155J69336l9103J14702
13209C85090b73768C30106j60872o1546l0306M4759N3345J65704A53361M101o559
$$ y = [406476, 82923, 158256, 58730, 555900, 139397, 200071, 94930, 302568, 385487, 334083, -198789, 116167, -24552, 139146, -113460, 157119, -296872, 207218, 200792, 227817, 69229, -69117, -32294, 42070, 113520, 328834, 127987, 68830, -126401, 65480, 248626, 167305, 111624, -22364, 12119, 384658, 135774, 150432, -88615, 97948, 63873, 349117, 349094, 21501, -8640, 398091, 86193, 46220, 51346, 116864, 85772, -14587, -13026, -83761, 39537, 294491, 107127, -26741, 255419, -129763, 74628, 362592, 427459, 22816, 287178, 341812, 141618, 187844, 92286, 104157, -5033, 261914, -9611, -279043, -24021, 195055, 131405, -95365, -90493, 140155, 309491, 270388, 385090, -273768, 330106, 169234, 107688, 77382, 122141, 175486, 341190, 153361, 157462, 150903]
13198A50903F249L28026j07807m5389f8023A87642a34862G3403e4129A39033F1336
13186B17106L4701r1475I26a75158I9442b4647B04536c2277A40971a43558e5055
13174B22129k2837h9816D08889c02330A53045D8078J43271f9173k18400A04911
13163D13709j72276n3658H6638a46044j01999E1146g660j21024B35862i4564G7479
13151F29309c00575b6841l6960B99720b08507c774C17628a81877H3912l0915O274
13140E9271J6158J30149D8222a05556j52585A71760g6327B9855N29506F8693a91890
13128A36367o073J3185K54654C5327J74490p1806Q5710c8968k2790B72006i0442
13116a50519a2508A10837l8469J80983A23030Q199h5263B20184j4784F3161a89481
$$ y = [150903, 6249, 334275, 226468, 181079, -68023, 187642, -134862, 73403, -54129, 139033, 61336, 217106, 251807, 160332, 926, -175158, 99442, -24647, 204536, -32277, 140971, -143558, -55055, 222129, 199292, -89816, 408889, -302330, 153045, 48078, 191349, -69173, -287573, 104911, 413709, 241433, 187775, 86638, -146044, -248043, 51146, -7660, -128684, 235862, -94564, 77479, 629309, -300575, -26841, -63801, 299720, -208507, -3774, 317628, -181877, 83912, 52997, 59271, 75429, 205578, 48222, -105556, -258141, 171760, -76327, 29855, 559361, 68693, -191890, 136367, 130294, 143479, 398133, 35327, 209817, 138011, 223721, -38968, -61758, 272006, -90442, -150519, -12508, 110837, 72368, 253351, 123030, 131229, -85263, 220184, 205400, 63161, -189481]
13104h7971C56616A19380a63323H5421a64934F6895j6888h9578q7560c9521A04070
13092A25643c07597B09502h1301F3253e4187B90386A10955N1698p8062L22262
13082D06853E5603M6280K33899F6118L87051q7135H4901J85541j5407A16326b27341
13070A48216f2464n3502D8365a15202H1959C865L13226a41480B50654R8983A43652
13058C34576A3408L21342n618A0527P7613K4341D2932D27b82275D49300G0566
13046e3507j14290A21529a99232B26148F1938M0681O3832P5279H6512c7974C39043
13034E5240b03034A56411J75179A5160a13624k177A53327L32890f2574g472B25219
13022C17136j51602K84174b48519A80101D6951J6828J53120b19917A09003K31437
$$ y = [-87971, 356616, 119380, -163323, 85421, -164934, 66895, 50007, -89578, -177138, -39521, 104070, 125643, -307597, 209502, -81301, 63253, -54187, 290386, 110955, 162653, 84591, 406853, 55603, 101883, 335782, 66118, 453169, 366034, 84901, 270442, 255035, 116326, -227341, 148216, -62464, -115966, 48365, -115202, 81959, 3865, 317091, -141480, 250654, 349637, 143652, 334576, 13408, 334750, 329132, 10527, 88140, 112481, 42932, 427, -282275, 449300, 70566, -53507, -167797, 121529, -199232, 226148, 61938, 102619, 166451, 241730, 86512, -37974, 339043, 55240, -203034, 156411, 331590, 15160, -113624, -115801, 153327, 486217, -62574, -7472, 225219, 317136, 165534, 449708, -248519, 180101, 46951, 63779, 216899, -219917, 109003, 340440]
13012C40440d3054j4685A04552i1184L8474n4711D8380N64979B73510O2605J28117
13001D64232d3844E4840l922J06124f5121A18586N36811B05897j2804n7034a89099
12989A18198M57829A25693a34457A2026a11078A30549b15011c2290A09254J15449
12979B24703R6735j50257f1248j49988A20386b3646n1498m3097B15289B0354F982
12967B34241a33238A30732L8849J28486a48929O8903A56833D8391K59055b19080
12956b41424D0887d15017d0314B4838K35419p542a4205B35315A02604M2866Q0881
12945B26351N4504m7972A07798a89415A11419f8310E4742d409p9109A80765f9939
12933A77800Q6380f7222j10842j7253C97260N8621b30871A4190f3562F5820B6178
$$ y = [340440, -43054, -57739, 104552, -91184, -52710, -107421, 48380, 613359, 273510, 336115, 464232, -43844, 54840, 50918, 157042, -65121, 118586, 655397, 205897, 193093, 136059, -189099, 118198, 576027, 125693, -134457, 12026, -111078, 130549, -215011, -32290, 109254, 224703, 321438, 171181, -61248, -211236, 120386, -23646, -75144, -118241, 215289, 20354, 6982, 234241, -133238, 130732, 169581, 298067, -148929, -80026, 156833, 48391, 307446, -219080, -241424, 40887, -415017, -40314, 24838, 260257, 252715, -14205, 235315, 102604, 145470, 226351, 280855, 232883, 107798, -189415, 111419, -68310, 54742, -4409, -83518, 180765, -69939, 177800, 264180, -67222, -178064, -195317, 397260, 455881, -230871, 14190, -63562, 65820, 26178]
12921d07038a82461D08612A95026j9531a39586B95355E4222d03286G8314J54328
12911B32642b36852i6183j95138B26193p6111l6265K46158A60693J44270a70221
12900b864j34086b274l20507A5341J09452J81996j50071f8429A85082c162n2229
12889e5391A14303c2324A12417L28370F6511R0738J7365l6267m4860K05J91998
12878B85690a40741K8850i811r1621M9171A41406b97573B40781a59091L2434M1996
12867h4661A1328k068M3334K97371j24537a18081j67214A79551a34376O6715B04839
12855B30543a52272g1222j00149B88822M0771a09257a7681m9865k20544J02552
12845a85538j0550C91114A13865a19604C98077A1239J9148B75a1424j3483B88686
$$ y = [-407038, -182461, 408612, 195026, 175495, -139586, 295355, 54222, -403286, 78314, 232642, -236852, -96183, -291321, 226193, 150082, 113817, 359975, 160693, 304963, -170221, -2864, -136950, -2274, -322781, 15341, 124793, 306789, 156718, -68429, 185082, -3162, -55391, 114303, -32324, 112417, 440787, 66511, 157249, 174614, 138347, 93487, 93692, 285690, -140741, -111891, -9811, -101432, -52261, 141406, -297573, 240781, -159091, -126657, -84661, 11328, 9260, 52594, 349965, 225428, -118081, -285295, 179551, -134376, -67661, 204839, 230543, -152272, -71222, -171371, 288822, 329593, -109257, -17681, -67546, -288090, -185538, -196088, 391114, 113865, -119604, 398077, 11239, 30387, 275, -11424, -24907, 288686]
12833b18020h5374F9924j0169O3719a48811k6097A51389K96028A4489L61191H8178
12821b12837i3352l3269G9977K0933E0349i0632F57a21765B58431p8429B4852
12809A12352J64379H3283h7962A39353c15962C1435R5219D0870J35880o5330J36739
12798B48159J8251o9509a30471C01412a25902o8264A94415d655j5082A52251d3879
12786A78501a70820P3288H2115A6833a27816A5600L9834K03194a72942a5602k27553
12775b43155M6326g5016A3606O5947K75376H5772j7782i2678A66615K29688C8718
12763G5923a47869L8134A2018e50j2251B14160G3813b7020A66858c46799D4398
12751D8437K60910a22038j23997F912J86722L33652B6892j2827K90685a78113
$$ y = [-218020, -85374, 69924, 59755, 123474, -148811, -174908, 151389, 447417, 14489, 375680, 88178, -212837, -93352, -126621, 79977, 100910, 50349, -90632, 657, -121765, 258431, 180002, 24852, 112352, 276731, 83283, -87962, 139353, -315962, 31435, 126654, 40870, 176750, 111420, 248159, 266410, 196901, -130471, 301412, -125902, -194166, 194415, -4655, -19737, 152251, -43879, 178501, -170820, -97532, 82115, 16833, -127816, 15600, 55434, 258628, -172942, -15602, -243155, -196829, -75016, 13606, 79553, 354929, 85772, 67990, -92678, 166615, 396303, 38718, 75923, -147869, -109735, 12018, -550, -12801, 214160, 73813, -27020, 166858, -346799, 44398, 48437, 309347, -122038, -246035, 6912, 193634, 527286, 26892, 14065, 304750, -178113]
12740H3834J39999r3117a14164C14099a07882c1199D0056L22541A46401c9864
12729b48229a19714A87411p6502r202M06222D2406j3711b5191k8370m1528C32599
12717G5582a27099O2468j23625C49460a15158A45607a20704D41295c20372A83112
12706A11226a40972B80898g4112A31969L5101G0407J70786b70855B96283c18540
12695f737E5515J18618l8134C887a10575A48548e9820G7989a18551p3764G4678
12683A98023J49440a53415q9906k4470e5396J246A81364A9570K93844F4526a07807
12671e6558A33094f1791G7890R2237J98591d4869C30935I7255J11454R2228K1987
12660C22924A05521A8814K35392D4473K2771a20760e9369j24155A58711J60635
$$ y = [83834, 223833, 130716, -114164, 314099, -107882, -31199, 40056, 362597, 146401, -39864, -248229, -119714, 187411, 110909, 101707, 507929, 42406, 28695, -25191, -53561, -95089, 332599, 75582, -127099, -64631, -188256, 349460, -115158, 145607, -120704, 441295, -320372, 183112, 111226, -140972, 280898, -74112, 131969, 167070, 70407, 241193, -270855, 296283, -318540, -6737, 55515, 174133, 135999, 3887, -110575, 148548, -59820, 77989, -118551, -192315, 74678, 198023, 347463, -153415, -243321, -267791, -55396, -54150, 181364, 19570, 313414, 64526, -107807, -56558, 133094, -61791, 77890, 170127, 368718, -44869, 330935, 97255, 208709, 300937, 322924, 105521, 18814, 254206, 44473, 67244, -120760, -59369, -183524, 158711, 319346]
12650C19346j33060a93256b8866C597J0554J76033K52176C1049L90563F7382j5207
12639E2175K38111E6371K01490a68202F8907K35317J15130o3863F0966J23734
12629A84700K49362J0547A78675K49272A56431M1865g1282B59828l6166a86046
12618B65297M67m4975c3205A36612a38140a0364n2492A11305b9077E7979O3277
12607A21256d3968A75072H4235B8975J74435L384l4514j5562g0235F6702a40884
12595A61007K1023E7974k1766J93014B3331P2657J7334a56722C31099I8295K29275
12584C27570q3949G4029b6244I5457h5385B26308M7572b2305o3346M2679k17902
12573b60874A30942m5632a92974k4421c8143j01059j95463B54093b4516j161A37414
$$ y = [319346, 186286, -193256, -28866, 3597, 14151, 190184, 442360, 31049, 421612, 67382, 52175, 290286, 56371, 257861, -168202, 68907, 304224, 419354, 355491, 60966, 184700, 434062, 444609, 178675, 427947, 156431, 198296, -71282, 259828, 223662, -186046, 265297, 265764, 220789, -33205, 136612, -138140, -10364, -62856, 111305, -29077, 57979, 121256, -43968, 175072, 84235, 28975, 203410, 206794, 172280, 156718, -70235, 66702, -140884, 161007, 182030, 57974, 36208, 229222, 23331, 95988, 113322, -156722, 331099, 98295, 327570, 243621, 74029, -26244, 95457, -85385, 226308, 273880, -22305, -85651, -42972, -260874, 130942, 85310, -192974, -217395, -38143, -139202, -334665, 254093, -24516, -25677, 137414]
12561f3061o4375q548A56679l0405b14484B98313G2672J09373f2191k51688P8108
12550b35771B91869q8645m3340l6990B7040L51895i3672q3826B6738K50391e4325
12538h3738J9464E5083k2277K80195H3887J6219Q3594b08791e6201A40374d3937
12526c8414n8318A34898d5912B43044n1464d0433B04785I4643a18322D7921M54262
12515E02183F7239b89626F1342J14025k1464I799P8286a33158q3129A73159J90231
12504C63390D2154a13663A50649b38601a9249E817P7746b30403a1864j1723C8523
12492g9147j69853C8457b28061A03217J99443d1404p24j51444D32275B03479j912
12481B01567a7769r949A05952b54996C44614c1566m9962j8370B16233p2279i5158
$$ y = [-63061, -127436, -135984, 156679, 126274, -214484, 298313, 72672, 182045, -62191, -313879, -235771, 291869, 203224, 159884, 122894, 27040, 378935, -93672, -177498, 26738, 277129, -54325, -83738, -64274, 55083, 32806, 313001, 83887, 100106, 183700, -208791, -56201, 140374, -43937, -38414, -96732, 134898, -45912, 243044, 191580, -40433, 204785, 94643, -118322, 47921, 502183, 67239, -289626, 61342, 175367, 153903, 9799, 88085, -133158, -216287, 173159, 363390, 42154, -113663, 150649, -238601, -19249, 5817, 83563, -230403, -11864, -23587, 38523, -79147, -249000, 38457, -228061, 103217, 302660, -41404, -42128, -193572, 432275, 203479, 201567, -17769, -27718, 105952, -254996, 344614, -31566, -81528, -99898, 216233, 143954, -95158]
12469i5185d2472j32621j46960g6546j5419K5948l1785J06A13897K80505j80590
12458B13812b12860B74707a3137A35479g7610B15685b77136J6077a4049B68182
12447d05994a48981C92580j87066a47914o0762a5402p8463A33151G192K53413
12437B60605m5963F371d0319A24562d42998A33790a2740l44380a15402H3249K21529
12426C04778B7116J83338o9115n4740a34891A386h5143N364F4739M194b2891k7686
12414e0577K3834D9017a09174M8367j0215j44203A203a69144D2593i6467B4678
12402b41486F9841K51261h4366k69520f0021A6643J4679J5562a31913B84441A41819
12390F1033P7094I479a74278l06261B31442G5092J19041H5924j1246c0876l0653
$$ y = [-95185, -42472, -175093, -322053, -76546, -91965, -66017, -97802, -97696, 113897, 394402, 213812, -212860, 274707, -13137, 135479, -77610, 215685, -277136, -261059, -14049, 268182, -405994, -148981, 392580, 205514, -147914, -208676, -15402, -93865, 133151, 7192, 260605, 214642, 6371, -40319, 124562, -442998, 133790, -12740, -357120, -115402, 83249, 304778, 27116, 210454, 141339, 86599, -134891, 1386, -85143, -79779, 64739, 68933, -22891, -50577, -26743, 49017, -109174, -60807, -71022, -215225, 1203, -169144, 42593, -96467, 24678, -241486, 69841, 321102, -84366, -353886, -60021, 16643, 31322, 46884, -131913, 284441, 141819, 61033, 138127, 9479, -174278, -480539, 231442, 75092, 194133, 85924, 74678, -30876, -61529]
12379f1529A65336a22912A93703f4236F6180b95449a20985B8024K33369A00578
12368h0636J2872C8852b08408G0257J66628r0712J61609e3005j7262l44567C65723
12356c53552c1620C6305g4890A28265g9076A65928O2595j00388c6447A86608o7807
12345A18801K42683p0977F7641J49513k7165o9169J2145a18837G3603a68719B16285
12333C0275b3958B6936Q2851J2432D3536J4959F055c2306E9898Q3001a41446F8162
12320a83579A54698J93577e4988K7434D36416A95399H0312a38905A41888g7063
12309a37012F2996a59839B18851a30265I8297e2599j02513J8311M6985A93936
12298c70230B06478B4154d828B8086b68111F9057L5831f335A08395P1240g4013
$$ y = [-61529, 165336, -122912, 193703, -64236, 66180, -295449, -120985, 28024, 261393, 100578, -80636, -67764, 38852, -208408, 70257, 236885, 146173, 307782, -53005, -70267, -414834, 365723, -353552, -31620, 36305, -74890, 128265, -79076, 165928, 228523, 128135, -36447, 186608, 118801, 361484, 290507, 67641, 217154, 189989, 120820, 132965, -118837, 73603, -168719, 216285, 30275, -23958, 26936, 109787, 122219, 43536, 58495, 6055, -32306, 59898, 142899, -141446, 68162, -183579, 154698, 348275, -54988, -27554, 436416, 195399, 80312, -138905, 141888, -77063, -137012, 62996, -159839, 218851, -130265, 98297, -52599, -155112, -136801, -89816, 193936, -370230, 206478, 24154, -4828, 28086, -268111, 69057, 104888, -6335, 108395, 179635, -74013]
12286a38430A49688L53195A21610k2260M297D7289N9966J04184n8729r370J04978
12275B48318b44050C04357j14152P8450j4448c30271A38720K3809a44550i797
12264e9398B16705a54435B04065E6879i3877p3980a2791j04499N6868B59694o6784
12253A92910b0786j03718b2620A36723C9685K323J47644n8817E6480R8161J8533
12242A73174D9921Q5336a336A83772a65596L0290C1937L88740a56355L9831D64114
12230G4183K11275A05604J29718p5926K66792L2143q5935b98875C70940a79364
12219b7787G6908J90593G6443J26624l9600A5256b621n1115j38890D4387R0433
12208A34820J46892A08808M38292A71100J6358K59136a4094j10270A91432m037
$$ y = [-138430, 149688, 502883, 121610, 99350, 103647, 47289, 107255, 211439, 152710, 143340, 248318, -244050, 304357, 190205, 268655, 254207, -330271, 138720, 162529, -144550, -9797, -59398, 216705, -154435, 204065, 56879, -93877, -167857, -12791, -117290, -60422, 259694, 192910, -20786, -124504, -22620, 136723, 39685, 42008, 189652, 130835, 56480, 154641, 173174, 49921, 135257, -1336, 183772, -165596, -135306, 31937, 420677, -156355, -116524, 464114, 74183, 285458, 105604, 235322, 159396, 426188, 458331, 372396, -298875, 370940, -179364, -27787, 76908, 267501, 76443, 203067, 163467, 15256, -2621, -53736, -192626, 44387, 134820, 281712, 108808, 547100, 171100, 187458, 446594, -14094, -124364, 191432, 187395]
12198A87395a40440B34482q4381J48214A084b87898I5914J20596h7304C03898
12187a66802D14323G5354L28373A76986k133c70888J19331L4071c4761q862B62552
12175G973N2733a08091G2131L8897J62416i6206C08588H8891g1299A39763l3201
12164A06562c14963C86337b0894q5128A62855M0259c5614D4031K93221c643l16040
12153c19683N7517C31974E0729J8343B9818b57376a04929r9009A05643a59051
12142A97303J65843j73707h7773B59649r5245K0997j5581Q9931g7793R044k01812
12131b70561E7675c33557J65574P5351C53287e38277B24617G2710i5425b3026
12120B19542o7078a08951K8773B05481l406p382a08888I5972J51077b5768A90076
$$ y = [187395, -140440, 234482, 150101, 298315, 1084, -287898, 95914, 216510, -87304, 303898, -166802, 414323, 75354, 403727, 176986, 174853, -370888, -251557, -217486, -34761, -43623, 262552, 7973, 60706, -108091, 72131, 111028, 273444, -96206, 308588, 88891, -71299, 139763, 106562, -314963, 386337, -20894, -106022, 162855, 203114, -35614, 44031, 337252, -3643, -319683, -262166, 331974, 50729, 69072, 29818, -257376, -104929, -203938, 105643, -159051, 197303, 363146, 189439, -87773, 259649, 164404, 185401, 169820, 259751, -77793, -68749, -270561, 57675, -333557, -167983, -92632, 353287, -538277, 224617, 72710, -95425, -23026, 219542, 152464, -108951, -80178, 205481, 202075, 194693, -108888, 95972, 247049, -25768, 190076]
12108G9060J36952a03830B9294j0969K24613d3064m1764K845A2312O8086H852
12096a26062a2020d279j79841B24630o2953a13840k53846a7657C03871A1079J34297
12085A45376a93781q1541A54029c33043L1803B52385r139a54369j49026h1747
12074A05698O1951A2490a85337k6113r1512A53325m0856M5954a20651q6867A4158
12062e4590j68604a1463E6239b63448F2099c50693G10889j70369M77732k8778
12052I89474B27995q4105m5798C1524J50347e6700k22928A09463b35320D8699
12041B06437h1703J5440A55513a32902B53370p4172K33686f9522j2699J6512H2081
12029B12914A01810b42857a3466l69166a26369B23024J02439a43278J9778I0235
$$ y = [79060, 216012, -103830, 29294, 18325, 242938, -43064, -84828, -81983, 12312, 80398, 8852, -126062, -12020, -4279, -184120, 224630, 161677, -113840, -367686, -17657, 303871, 11079, 145376, -193781, -275322, 154029, -333043, -301240, 252385, 243246, -154369, -303395, -81747, 105698, 167649, 12490, -185337, -211450, -302962, 153325, 112469, 158423, -120651, -207518, 14158, -54590, -223194, -11463, 56239, -263448, 62099, -350693, 710889, 540520, 1018252, 989474, 227995, 143890, 98092, 31524, 181871, -56700, -279628, 109463, -235320, 48699, 206437, -81703, -66263, 155513, -132902, 253370, 179198, 412884, -69522, -82221, -65709, 82081, 212914, 101810, -242857, -13466, -382632, -126369, 223024, 325463, -143278, -123500, 90235]
12018b3081j30133A22188o0661Q8232B9450b7538j76415f1454A35472F5641c9842
12006A16421Q2164E0460P4626B4560J67072c43829a44691C22981a2955k36456
11996b49411c2135j53281j0807j9239B71765o2632m246i3208M5249i578k6620
11985c6198m0866c7592P927j98338c6736G5377a01654r2773N9380A12070b83750
11973b17478b4553C5317a39884c7162I4699m1878K8348a02520f084A27821a1669
11961i7625D27085a54626F9378F695J44867a6064n6041A18317b92752C3017J41796
11950A74813n0113J67777K6283a58045a6337B17842C693b09984B2782J78847A1163
11938c5156k27330I9648a37040q2164G6981a0716m6067E7314b14676f2414j94508
$$ y = [-23081, -153214, 122188, 61527, 149759, 29450, -27538, -203953, -61454, 135472, 65641, -39842, 116421, 198585, 50460, 125086, 24560, 191632, -343829, -144691, 322981, -12955, -249411, -32135, -185416, -196223, -215462, 271765, 209133, 204887, -93208, -47959, -9578, -36198, -77064, -37592, -29665, -228003, -36736, 75377, -101654, -194427, -135047, 112070, -283750, -217478, -24553, 35317, -139884, -37162, 94699, 52821, 81169, -102520, -6084, 127821, -11669, -97625, 427085, -154626, 69378, 6695, 151562, -16064, -72105, 118317, -292752, 33017, 174813, 124700, 292477, 318760, -158045, -16337, 217842, 3693, -209984, 22782, 201629, 11163, -35156, -262486, 99648, -137040, -219204, 76981, -10716, -56783, 57314, -214676, -62414, -256922]
11927b56922e2034E5274c26405a22733q7622A68433d396D43212B5479b3579j17879
11916a41458k51177b9993k99093a49981C8945J8669J18246a25636G2715f59l8183
11905c8842E9394b27134A1873O7234e3110B4227b47903f5028a8991n8554k0951
11894i8496j2392J5072A73141i1117A24563e775j40252d2787A8000a24185F3227
11882a22545k54251d9239A98699p9666j4502a08493A84907a05841j55044a14766
11871a35842A2298b17563j75209J40072A05646a85736G8242A3960L4131b0339
11860A94182b15280j8312P8818A96173Q252b50455b9571k798p3821l34538J75434
11849b65294P5657A01164N9659K1860n7259i1656F9147c64317a16092p7938A31810
$$ y = [-256922, -52034, 55274, -326405, -122733, -210355, 168433, -4396, 443212, 25479, -23579, -141458, -392635, -29993, -329086, -149981, 38945, 57614, 175860, -125636, 72715, -659, -38842, 59394, -227134, 11873, 79107, -53110, 24227, -247903, -65028, -18991, -77545, -98496, -110888, -95816, 173141, -91117, 124563, -5775, -146027, -42787, 18000, -124185, 63227, -122545, -376796, -49239, 198699, 119033, 104531, -108493, 184907, -105841, -260885, -114766, -135842, 12298, -217563, -392772, -252700, 105646, -185736, 78242, 13960, 48091, -20339, 194182, -215280, -233592, -154774, 196173, 204425, -250455, -29571, -32369, -106190, -440728, -265294, -189637, 101164, 160823, 182683, 125424, -91656, 69147, -364317, -116092, -194030, 131810]
11837G2013J20029r2341m3172i8913j29378a09942k67967A67341m7267c19334
11826d8795B39688A3561Q6072h8279a5977C27365h6886A92343h4595A8046J80836
11815A98882c7852C08946b4798p825r6772h751k0598n4768A41849b92495M0173
11804b52322A16526e231A30338g5721A24773L7076c27495a6570l05308A19283
11793A50388c8105B08778a43559n0792A0429b98142J38171j30943J00883N755
11783a84276g5275D6771j5758M3804a25076O0191B23395b30829A3431P364a25765
11771a83304C16470a64838A34446a27812k8848A87838p5443d2462p8235C31517
11760B87967g0570B03980a46535l3431N7115K7362J2496J6902j27023D7095O847
$$ y = [72013, 192042, 99701, 56529, -98913, -228291, -109942, -377909, 167341, 120074, -319334, -48795, 239688, 13561, 99633, -88279, -15977, 327365, -86886, 192343, -84595, 18046, 198882, -37852, 308946, -24798, -32623, -129395, -8751, -29349, -84117, 141849, -292495, -252322, 116526, -5231, 130338, -75721, 124773, 161849, -327495, -16570, -321878, 119283, 150388, -38105, 208778, -143559, -194351, 10429, -298142, -159971, -290914, -190031, -184276, -75275, 46771, 31013, 74817, -125076, -64885, 223395, -230829, 13431, 20795, -125765, -183304, 316470, -164838, 134446, -127812, -156660, 187838, 112395, -42462, -120697, 331517, 287967, -70570, 203980, -146535, -179966, -122851, -95489, -82993, -66091, -193114, 47095, 53942]
11749E3942d7002C40646j33251c23935M1603Q4102q5605h0618Q240B43889i60
11737B81635C9864a48460I5829f1270k18087M5262J04284J7852L5411J1349j03261
11726a68460M5570j45500A3259J03089J79219B7998a09888f813A31586O0674B1110
11714e5495k7894B47286a77428j3038D3024m798K47605a24249G5399a7043B4574
11702a27369c6407E425J38122E5828c97588e3630C3058J87060c452m1224B5538
11690b25869j1014B99828c4990B5686J8936b46147j7200C96113a0047C5422c93752
11678A09885J24883i5245E3009Q6217b1123A52196a08441j3955b4580A02060a07777
11666C42702a26622p0097P5831d5800k02463G2765k4279J24695n1484G047a35881
$$ y = [53942, -47002, 340646, 207395, -323935, -282332, -198230, -283835, -80618, -72378, 243889, -960, 281635, 39864, -148460, 95829, -61270, -279357, -234095, -129811, -111959, -76548, -65199, -168460, -122890, -268390, 13259, 116348, 295567, 27998, -109888, -6813, 131586, 192260, 21110, -55495, -83389, 247286, -177428, -190466, 43024, 38226, 285831, -124249, 75399, -17043, 24574, -127369, -36407, 5425, 143547, 55828, -397588, -53630, 33058, 220118, -3452, -44676, 25538, -225869, -236883, 299828, -34990, 25686, 44622, -246147, -263347, 396113, -10047, 35422, -393752, 109885, 234768, -95245, 53009, 139226, -21123, 152196, -108441, -122396, -24580, 102060, -107777, 342702, -126622, -196719, -120888, -45800, -248263, 72765, 48486, 173181, 121697, 7047, -135881]
11654B15335D0270b4246j71276j71819E819Q4186J92644b7477j30902B4246J12699
11643A36945a96902J5239h8879j54544O5385K5448B46932i1743F3665O9909G139
11631e5536D4938O6563A6463b74416J00726G8267O4935J95982j61329B08a0185
11619B12574a85973c2344B82911a68402j37789A37090P3601g7610j45191a2416
11608B32794a5680j2554C13888c2044l58691f0590j08093G2559M2503b2492r0787
11597a13279o1307g228k96628n4326a35748r0101A84770q9487O3107c6681j52340
11586a89021G7505a2079k1564j3553A51421a24771B4138j0925c41246g7605B20865
11574b75276A55271b26548B58534E0936M00300A8748a56968I1901a49392A86643
$$ y = [215335, 40270, -24246, -195522, -367341, 5819, 90005, 282649, -27477, -158379, 24246, 136945, -196902, -181663, -88879, -243423, -178038, -152590, 246932, -91743, 63665, 133574, 7139, -55536, 44938, 111501, 16463, -274416, -173690, 78267, 143202, 339184, 177855, 208, -10185, 212574, -185973, -32344, 282911, -168402, -306191, 137090, 210691, -77610, -222801, -12416, 232794, -15680, -28234, 313888, -32044, -390735, -60590, -168683, 72559, 115062, -22492, -113279, -174586, -7228, -303856, -358182, -135748, -225849, 184770, 95283, 158390, -36681, -189021, 77505, -12079, -33643, -47196, 151421, -124771, 24138, 13213, -341246, -77605, 220865, -275276, 155271, -226548, 258534, 50936, 451236, 18748, -156968, 91901, -149392, 186643]
11563f6995j39463H4687J07280b37055A70920a6236r2790f602G767K65713b18890
11551f2953A15329a6960n8178A89685P8692f0721A30579a46049k4561B09398h1315
11539c80941I4633a59569F0585O9536K01949c9491j35467C9421g0746D6207i8940
11527D34137A484f3813E2508J61837L8434a17812C82687a48515C5378f3221B49485
11515D8344M6923k7116i4127B37981a07057k40253D2491B844L39331E9965J06234
11504A66199C1913M62227F1669J76225D7905j4083b26770H0127M46737A34148
11493A84228J45971B7658P7984j8438R5922R5925a74236B88456n6175O5017E6976
11481D07250A31380P0785B9584d6487j5011r5113m106m6363B08608r3828D3405
$$ y = [-66995, -206458, 84687, 191967, -237055, 170920, -16236, -109026, -6602, 7767, 273480, -218890, -62953, 115329, -16960, -75138, 189685, 268377, -60721, 130579, -146049, -170610, 209398, -81315, -380941, 94633, -159569, 60585, 130121, 332070, -39491, -174958, 39421, -70746, 46207, -98940, 434137, 1484, -63813, 52508, 214345, 252779, -117812, 382687, -148515, 35378, -63221, 249485, 48344, 95267, 68151, -94127, 237981, -107057, -347310, 42491, 2844, 342175, 59965, 166199, 31913, 494140, 61669, 237894, 47905, 33822, -226770, 80127, 526864, 134148, 184228, 330199, 27658, 105642, 87204, 183126, 279051, -174236, 288456, 232281, 297298, 56976, 407250, 131380, 202165, 29584, -46487, -61498, -156611, -160717, -207080, 208608, 114780, 43405]
11469C18694m5037l9060A01755a81625G4361J67477h5690A41507a9975E18936
11458a3617B08153j6905a35047k03779A21032E2637L59317E8150g767G4885d7371
11446a56345b7528A11531a21427A06429b33355O0711f000A64029a70565A36691
11435d6663k9929k5644A41753a52856A12946J49912M5309p4681c4387J6266A98553
11423b42450I1242h3729J2401q9217g2219A58910D8366g1175E1731J15215b0170
11411b2123p1763B4054c370B7860b91307N0678a18895A43493a23608j26433l6539
11400b86580a30291C4567b25971A96684a70260A50746o4732b09938B0027a17923
11389a20937C9644a15318I6005a06973B45959b5445j62084E61240c42703C97604
$$ y = [318694, 273657, 234597, 101755, -181625, 74361, 241838, -85690, 141507, -19975, 518936, -13617, 208153, 191248, -135047, -338826, 121032, 52637, 411954, 58150, -7767, 74885, -47371, -156345, -27528, 111531, -121427, 106429, -233355, -172644, -6000, 164029, -170565, 136691, -46663, -76592, -102236, 141753, -152856, 112946, 262858, 308167, 233486, -34387, -18121, 198553, -242450, 91242, -83729, -71328, -160545, -72219, 158910, 48366, -71175, 51731, 166946, -20170, -22123, -93886, 24054, -3370, 27860, -291307, -240629, -118895, 143493, -123608, -250041, -286580, -130291, 34567, -225971, 196684, -170260, 150746, 86014, -209938, 20027, -117923, -120937, 39644, -115318, 96005, -106973, 245959, -25445, -187529, 561240, -342703, 397604]
11378c4771k24576A16943a50250A36890a48046F5194a81550A2863J22515g0921
11367c7923k3332J87j63284A57917e0978r7978k77273h5768A48889b12452A43069
11355b5546o0889B19411B6841a28027j59663D9917h2956k13784r1067C41274c17148
11343b61566C4825J49383a1030A72680b13498I3762J79016A12557a17624A05599
11332a22502k9091M6083C5943a43306E4788f8240m6543C18246A0301b79051H8733
11320e5459k8068D9835C40a37537j14567e5713j80512A0380L4043J53977J7683
11309B16083b9217k43603D6018a61470P4997E9289K8071b03455n6779h8554j7512
11298a06066C5028b1942H2331a15939C19802I431J24428L1188g1915c5658l2796
$$ y = [-34771, -259347, 116943, -150250, 136890, -148046, 65194, -181550, 12863, 135378, -70921, -37923, -61255, -61068, -224352, 157917, -50978, -148956, -426229, -85768, 148889, -212452, 143069, -25546, -86435, 219411, 26841, -128027, -287690, 49917, -82956, -296740, -387807, 341274, -317148, -261566, 34825, 184208, -11030, 172680, -213498, 93762, 272778, 112557, -117624, 105599, -122502, -151593, -105510, 35943, -143306, 54788, -68240, -114783, 318246, 10301, -279051, 88733, -55459, -83527, 49835, 340, -137537, -252104, -55713, -236225, 10380, 44423, 198400, 216083, -29217, -272820, 46018, -161470, -86473, 59289, 87360, -203455, -260234, -88554, -106066, 35028, -21942, 82331, -115939, 319802, 9431, 133859, 165047, -71915, -35658, -68454]
11287f8454B4482d7276B03040a97978A12863J2648b06960j38238A2870O9303a62856
11275a02027A65868b3448A13296i1487C08684A05992h8441J1291B286b59118a16477
11263d3957r2773N2875A42644J07172E213f247o0529n0248B3098O3810j8059c57376
11250B2192f5705A12026d2833G7937a00993F587a6995k00283j31778A16663b7061
11238a64593p9588g1090G3006b44346J15922M3701j71300O7242A42168h5802p2206
11227a58008d226A11627f7694a0694k05252B65409A17298e1261B63361E8554a14985
11215a21521A17855b8670q7255A77314J25697c9734A03616a35256j55280A99250
11204a82866B01744b24357A99765h1494a0686A82920a20326l35588K00345Q4902
$$ y = [-68454, 24482, -47276, 203040, -197978, 112863, 125511, -206960, -345198, 12870, 82173, -162856, -102027, 165868, -23448, 113296, -91487, 308684, 105992, -88441, -77150, 2286, -259118, -116477, -43957, -136730, -83855, 142644, 249816, 5213, -6247, -66776, -117024, 23098, 86908, 68849, -357376, 22192, -65705, 112026, -42833, 77937, -100993, 6587, -16995, -217278, -349056, 116663, -27061, -164593, -244181, -71090, 73006, -244346, -128424, -84723, -256023, -188781, 142168, -85802, -158008, -4226, 111627, -67694, -10694, -215946, 265409, 117298, -51261, 263361, 58554, -114985, -121521, 117855, -28670, -115925, 177314, 303011, -39734, 103616, -135256, -290536, 199250, -182866, 201744, -224357, 199765, -81494, -10686, 182920, -120326, -455914, -255569, -170667]
11194a70667k5126A54797g8057c0470j47268B36203f7405A75522K4659j870c1497
11182b16453a9377A03604a974k0940B23291E5587a3676A30054O7792p4200g9033
11170I9726c93632A87263d37605B1653a39029j5689n7302F8806P8568a12818d1591
11158A45789b03n711A4713J06724J25092b14710B13247b11257C57641a46853A30874
11146C5934b28471m2875I2666J2087M3736e199E2518J13122a1897k60324E0476
11134a41921D12131a06784B05220a50275B19291a79231I9476K02142A04893A1093
11123A54667e0043p085i922C3124J68568l5651J072a34922B64623b74588E23578
11111c5058I4808m6660R6613K83005j35757G8253M3618n0964Q3246J88668O9824
$$ y = [-170667, -195793, 154797, -78057, -30470, -177738, 236203, -67405, 175522, 200181, 198311, -31497, -216453, -19377, 103604, -1974, -22914, 223291, 55587, -13676, 130054, 197846, 123646, -79033, 99726, -393632, 187263, -437605, 21653, -139029, -154718, -212020, 68806, 147374, -112818, -41591, 145789, -203, -5914, 14713, 121437, 246529, -214710, 213247, -211257, 357641, -146853, 130874, 35934, -228471, -271346, 92666, 104753, 148489, -5199, 52518, 165640, -11897, -272221, 50476, -141921, 412131, -106784, 205220, -150275, 219291, -179231, 99476, 301618, 104893, 11093, 154667, -50043, -57128, -9922, 33124, 201692, 166041, 167113, -134922, 264623, -274588, 523578, -35058, 94808, 48148, 144761, 427766, 292009, 78253, 121871, 70907, 154153, 342821, 412645]
11100D12645b19911A25338e3600A54292K43329c5403F17723B12783a68349F2225
11089B05414B9650K32154p7548i8631E9398K99128b0605A60066G5352L931L35920
11078D15203c7983B13455K73890j29152A31484K85802A20353K0223M9211J95193
11068C84980A04573a5784F14364A33961O7018J99946J567K36029B76110K58036
11058E34146j29922J74820j78388H0916M72782j42897j79371R8220K94051K15083
11048H38784J16161J6174j95050r1042J30731j34995l5608j55441L19469j4743
11038G94440l7400C12906O00730D46016K3279L01640l40949K18887j3597l8326
11028E96950k70656K96915k22374L35780l43542J37774Q8312M9110q7717p942
$$ y = [412645, -219911, 125338, -53600, 154292, 397621, -35403, 617723, 212783, -168349, 62225, 205414, 29650, 261804, 184256, -98631, 59398, 358526, -20605, 160066, 75352, 79283, 415203, -37983, 213455, 487345, 358193, 131484, 417286, 120353, 140576, 189787, 384980, 104573, -15784, 614364, 133961, 200979, 400925, 402492, 638521, 276110, 534146, 404224, 579044, 400656, 80916, 553698, 410801, 231430, 329650, 623701, 838784, 954945, 971119, 776069, 685027, 815758, 680763, 645155, 489714, 809183, 794440, 757040, 312906, 913636, 446016, 469295, 770935, 429986, 648873, 635276, 596950, 326294, 623209, 400835, 736615, 393073, 530847, 619159, 668269, 580552, 572610]
11018E72610A22389P16206A41618J91003L34104k36399O2518J46955j91614J6105
11008D64290n6872J45194A68317O16947l25477K04942Q1202C33364L4390J5779
10998C83533K14212N3435j82048l8685J75783l703k12575L70171j70394J35985
10988G25714j04561J8599l2973M07578j12379K68012N5924l47943K91620L15612
10978A485203r8755N75007j17562J91949P1788N50487k30497J97941m81622J64903
10968B308842j67628m35752k05276j95461k40790n5171k85599J72663Q4368P5540
10958A055736j14366j21399C79246M80707j70904n2764j41977j79887G8610K42778
10948C21388Q5452m8169E6946J57318a71356E00154H4722R6074c9626B17956p2398
$$ y = [572610, 122389, 838595, 141618, 332621, 666725, 430326, 492844, 639799, 448185, 464290, 407418, 552612, 168317, 785264, 459787, 664729, 745931, 333364, 367754, 383533, 597745, 651180, 469132, 430447, 606230, 602527, 389952, 760123, 589729, 725714, 621153, 639752, 606779, 1014357, 901978, 1169990, 1225914, 877971, 1169591, 1485203, 1386448, 1961455, 1843893, 2035842, 2107630, 2658117, 2427620, 2625561, 2143939, 2308842, 2141214, 1705462, 1500186, 1304725, 1063935, 1008764, 723165, 895828, 980196, 1055736, 941370, 819971, 379246, 859953, 689049, 636285, 494308, 314421, 78610, 321388, 406840, 358671, 56946, 214264, -171356, 500154, 84722, 180796, -39626, 217956, 145558]
10937A45558F7588K59455j01913C5572b4116C37220d6069I1930l5802J83618E4975
10925C40880b4446B40407e2742j60665i6813j44410o9601A0149J54892p4781a43631
10913b14054B84585d8351o322J5755B32051a467G7332d9322B26587H6994J75178
10902B62172O7089i3125c3377J5411n0612K9171B64893e03815a28068n6908B91550
10890A79298c57215B21610M6595A2136Q1761a9836j39854n4744b1574j48973C95803
10878E8386b41022e8939j70033A93289F3839b498A18848n281l4405P7842c0286
10866d4412A14361c6075E5286L89552b98427A44581c22857A65686a07452D8203
10855b8270G3587K08877a59313o9829b8474k24670i8114j13486P4432H698L5333
$$ y = [145558, 67588, 327043, 225130, 35572, -24116, 337220, -46069, 91930, 56128, 239746, 54975, 340880, -24446, 240407, -52742, -213407, -96813, -241223, -310824, 10149, 165041, 90260, -143631, -214054, 284585, -48351, -54673, -38918, 232051, -1467, 77332, -49322, 226587, 86994, 262172, 329261, -93125, -33377, -17966, -68578, -39407, 264893, -503815, -128068, -184976, 291550, 179298, -357215, 221610, 268205, 12136, 93897, -19836, -159690, -214434, -21574, -170547, 395803, 58386, -241022, -58939, -228972, 193289, 63839, -2498, 118848, 113567, 79162, 157004, -30286, -44412, 114361, -36075, 55286, 444838, -298427, 144581, -322857, 165686, -107452, 48203, -28270, 73587, 282464, -159313, -229142, -28474, -253144, -98114, -211600, -137168, 8698, 44031]
10844D4031c78482a41395B0544K4456a64342k2879D1072O1858b6457j03475B25213
10832b89548B04467a66689e9383m48421c497A06201C874b6117A63578J04224a27526
10820A69041M3185A1178R0091m5045b9912k02193H7830h5484I315J89059j8089
10809A80285a90953H0310b01460H6161N1243k3952d83k2921j36654F1545b0755
10797A27842c60460c4870C2301a47493J8803l3562C4287j3186a32532q7865j20568
10786c40965g4930B7939f8798b3539A25126g0007q9838M8932E7679a50302j21783
10775b72085a11799A02843D9570c34575B25982b64502A87315D3272b88495J13810
10765a74685r7965a3201j15063B70732j21997b3953j72022A96452i4136B0722
$$ y = [44031, -378482, -141395, 20544, 45000, -164342, -187221, 41072, 102930, -26457, -129932, 225213, -289548, 204467, -166689, -59383, -507804, -3497, 106201, 3874, -26117, 163578, 267802, -127526, 169041, 212226, 11178, 101269, 56224, -29912, -232105, 87830, -85484, 9315, 198374, 180285, -190953, 80310, -201460, 86161, 137404, 113452, -483, -23404, -160058, 61545, -20755, 127842, -360460, -34870, 32301, -147493, -128690, -162252, 34287, 21101, -132532, -220397, -340965, -74930, 27939, -68798, -23539, 125126, -70007, -159845, -110913, 57679, -150302, -272085, -111799, 102843, 49570, -334575, 225982, -264502, 187315, 43272, -288495, -174685, -272650, -13201, -128264, 270732, 148735, -23953, -195975, 196452, -94136, 20722]
10754f9191c4594K352n9919B5234K30591A9160P8876b09752K501B24193D7506
10742b1921j0434A6057e8175j44430B43433a74076P1217a7644O02A10188J83293
10731B93481a13870l2468A70935l065h879C4072b11368e6052C79047h858A39181
10719C507K47920a50174k68412b08988F0702G966a39389D8460a01170h978A94019
10707h6671B18297E9722e9593r480j63888a8942A53489a99154A97703O8275I9587
10695B18731a63073K1801j822A51555D3389b89792g4736A00244J0621d46768C58972
10683C77481B784J526J81369D9203a36507e9754A17181B0332j776b9660j34633
10672a64293k27634a02816G0899h683j68524d8365q9591A35667d8026k37134J5271
$$ y = [-69191, -34594, -32242, -92161, 25234, 255825, 19160, 98036, -209752, -207251, 224193, 47506, -21921, -32355, 16057, -58175, -202605, 243433, -174076, -102859, -17644, -17042, 110188, 293481, -113870, -146338, 170935, 167870, -8879, 34072, -211368, -56052, 379047, -8858, 139181, 3507, 251427, -150174, -418586, -208988, 60702, 7966, -139389, 48460, -101170, -8978, 194019, -86671, 218297, 59722, -59593, -69073, -232961, -18942, 153489, -199154, 197703, 265978, 99587, 218731, -163073, -141272, -143094, 151555, 43389, -289792, -74736, 100244, 110865, -446768, 358972, 377481, 2784, 4310, 185679, 49203, -136507, -59754, 117181, 20332, 18556, -29660, -164293, -391927, -102816, 70899, -8683, -177207, -48365, -137956, 135667, -48026, -285160, -269889]
10661b69889e7053A71J42200N2928a23363B58333a97185A24165a17424C2216f6070
10649b25659g9747k8667A18074a95375o095A8945c4143B49501a24197A30745f186
10637D01741a25682C4275M5944c83955E378h2619j35937B42497n1262a58276l9265
10626a97541o402A54633a20752M8144A4297b3842r5919J5343d6057F6059b12443
10614b67635O0816B08055a4285B14847c97133A59540D8625a00984A18882g2892
10603B5430d9509o8730B0959b68862E1580c38505J20907A36542K309C6253c39602
10591B09254j00127J49536a17129A82454a64825H6610d18366I8734l7714a14300
10580A01750c74926D4744Q4060c71183J09215G2553e23442A7369J49861i8521
$$ y = [-269889, -57053, 171, 142371, 195299, -123363, 258333, -197185, 124165, -117424, 32216, -66070, -225659, -79747, -108414, 118074, -195375, -201470, 18945, -34143, 249501, -124197, 130745, -6186, 401741, -125682, 34275, 80219, -383955, 5378, -82619, -218556, 242497, 191235, -158276, -197541, -203943, 154633, -120752, -72608, 14297, -23842, -119761, -104418, -46057, 66059, -212443, -267635, -206819, 208055, -14285, 214847, -397133, 159540, 48625, -100984, 118882, -72892, 25430, -49509, -118239, 20959, -268862, 51580, -338505, -217598, 136542, 138851, 36253, -339602, 209254, 109127, 258663, -117129, 182454, -164825, 86610, -418366, 98734, 61020, -114300, 101750, -374926, 44744, 128804, -371183, -261968, 72553, -523442, 17369, 167230, -98521]
10569B90485j42063c36175J41817D2358J46536b49713q237E6394a06267j6019
10559a22286B63407j22044J22908a57889p324f516F3033j2569E567b45872b1291
10547f5481A30384a04549C5343b5658A80237Q3153C119d0881q0178D3208b05844
10535B75512J584a63931D9221a17348c6588j767B2606J31737A8224K37917I2718
10523D7945J73962a3555l40298B08018a05497k6417k1412D6379b15146E3476k6461
10512B7015a48513A75181J19426M6742A37721n7436R3630m9212C8973b48334f441
10500g2593a2076G3409a49279p3934A58828k8717N7480J835d02230a69256A60841
10488a90136D4730A5365N9692R146b52548N4020A00292g0783o8272j61979a5272
$$ y = [290485, 148422, -336175, -194358, 42358, 188894, -249713, -257950, 56394, -106267, -122286, 263407, 141363, 264271, -157889, -165213, -6516, 63033, 50464, 5567, -245872, -21291, -65481, 130384, -104549, 35343, -25658, 180237, 263390, 3119, -40881, -121059, 43208, -205844, 275512, 277096, -163931, 49221, -117348, -36588, -38355, 22606, 154343, 18224, 256141, 92718, 47945, 221907, -13555, -353853, 208018, -105497, -131914, -153326, 46379, -215146, 53476, 27015, -148513, 175181, 294607, 341349, 137721, 80285, 173915, 124703, 38973, -248334, -6441, -72593, -12076, 73409, -149279, -223213, 158828, 130111, 187591, 189426, -402230, -169256, 160841, -190136, 44730, 15365, 75057, 84203, -252548, -198528, 100292, -70783, -139055, -301034, -15272]
10476b80469C29896h152l9313n6381o7459E1259a4454j34224P1813B250a82797
10464a13031I0233R5331g3763E2665K86426i9832j61862d0197j74197A60635f8253
10452h1308k05244Q7569O5608k33575C91035a16841G4386M6267R1864l9731a83506
10440a97559J6868n1340J14352M3812B46735A07418b30688O3936e0629A85578
10429f0072B31414e8967F3057c2306F6422a84366A81257a84227A89940M753Q0500
10418B75193C540J14862K142O6675n9935c06912B9002N1801M9383a2680A67678
10406a61456j49344L5286J27227f8734j46406n965i0935n75j03278d7451k4389
10395g1840r7256B02244m0293K40728A05785K6745J78968c3004j42094b4775B32474
$$ y = [-280469, 329896, -8152, -47465, -103846, -171305, 51259, -14454, -148678, -76865, 2250, -182797, -113031, 90233, 185564, -73763, 52665, 339091, -99832, -261694, -40197, -214394, 160635, -68253, -81308, -286552, -198983, -133375, -366950, 391035, -116841, 74386, 120653, 212517, 172786, -183506, -197559, -180691, -232031, -117679, -73867, 246735, 107418, -230688, -166752, -50629, 185578, -60072, 231414, -58967, 63057, -32306, 66422, -184366, 181257, -184227, 189940, 194693, 275193, 3540, 118402, 120544, 187219, 127284, -306912, 29002, 80803, 130186, -12680, 167678, -161456, -310800, -275514, -148287, -68734, -215140, -221105, -90935, -91510, -194788, -47451, -71840, -169096, 202244, 161951, 402679, 105785, 132530, 311498, -33004, -175098, -24775, 232474]
10383D66063a63841A47774J30625H225K24878K9644J16115A76423o5162P1285
10373A82546j754L27403f8463B76198e8454C59900j05229Q7219J47575j12529
10363C76936A07680J33713F2978Q3049K41438J8535p5392B5487J38614J02585
10353B66686j9322R708L15357d445E89826B87945B6854d7196A75867K38658j14532
10342B99993j37236A6554b82682A68018G1775K03794J24045l4386G7588M5570
10332A23158a87495E8999L7912J81537a1442A04300E0200a77018C63998J44583
10322E08581E8924j3449J54757h316A97998j4740F9383b43124i3022c2381j33335
10311a65716H3733a39086A97789a1554n7755B90211E9376P8887h5408l5015B49178
$$ y = [466063, -163841, 147774, 278399, 8225, 233103, 262747, 378862, 176423, 111261, 182546, 180792, 508195, -68463, 276198, -58454, 359900, 254671, 341890, 489465, 376936, 107680, 241393, 62978, 146027, 387465, 406000, 330608, 25487, 164101, 266686, 247364, 257072, 572429, -4445, 589826, 287945, 26854, -47196, 175867, 414525, 299993, 162757, 16554, -282682, 168018, 71775, 275569, 399614, 365228, 77588, 123158, -187495, 58999, 96911, 278448, -11442, 104300, 50200, -177018, 363998, 508581, 58924, 45475, 200232, -8316, 197998, 183258, 69383, -243124, -93022, -32381, -165716, 83733, -139086, 197789, -11554, -69309, 290211, 59376, 138263, -85408, -120423, 249178]
10299b18508j5131B53685a71094j07270A803K79796d01952F5198K60631c0003
10288I7166k9067K5303a26693J2778r2977A62766e7147B20084I5020k1744b17957
10276D2034J36821b05867H7987a23648A85649d7914m9422j813j15954P9881C60333
10264e8739k1984A46409F4532d1898j10859C76885I2851b07507A46091k2499b65123
10252d0931A95115a07705G5293a14046d2719E7888J3054a57145B97921a00314
10241H0655J23014a5619A38301g9910p1059M1540q2575J5683G3797a73394C72648
10229a39967A33428A2091J24480N0119e3886F7498J43385c90527C9077b73238
10218A48685c43820C00479d0963j06654B46090A09796A0201J00827c30697b2760
$$ y = [-218508, -233639, 253685, -171094, -278364, 1803, 281599, -401952, 65198, 325829, -30003, 97166, 68099, 93402, -126693, -113915, -206892, 162766, -57147, 220084, 95020, 73276, -217957, 42034, 178855, -205867, 87987, -123648, 185649, -47914, -97336, -99149, -215103, -135222, 360333, -58739, -80723, 146409, 64532, -41898, -152757, 376885, 92851, -207507, 146091, 123592, -265123, -40931, 195115, -107705, 75293, -114046, -42719, 57888, 70942, -157145, 297921, -100314, 80655, 203669, -15619, 138301, -79910, -150969, -109429, -192004, -176321, 73797, -173394, 372648, -139967, 133428, 12091, 136571, 186690, -53886, 67498, 210883, -390527, 39077, -273238, 148685, -343820, 300479, -40963, -147617, 246090, 109796, 10201, 111028, -330697, -22760]
10207a14956D033a3627l55885J12246A16090J39084h3100B11613c49460i9660
10196D9231a46445C54104h1830k82721M7842E0032I781i2791a7606j00817l00225
10185d18648B87920g9061A08314b01681B47311a37650F1363q542Q8121b98252
10174a63625B52896a04024A17085a98330R5039H9145D31b77115a10228j02640
10164b12868b6541i442k00082H9357e29623C23288B1638L7866i6799k2148A63239
10152a42858C22279r874f6092I7270e3980j64586o176h5618G3987a72346H1886
10140C5910a16097C1736a77045d0020F9650A3767c5431B16108l8241p3543b73716
10128f5667j71057a01408j02849A34186b07568B5267a02912r2879p1275A51714
$$ y = [-114956, 4033, -13627, -369512, -257266, 116090, 255174, -83100, 211613, -349460, -99660, 49231, -146445, 354104, -81830, -364551, -316709, 50032, 9781, -92791, -17606, -118423, -418648, 287920, -79061, 108314, -201681, 247311, -137650, 61363, 52821, 140942, -298252, -163625, 252896, -104024, 117085, -198330, -103291, 89145, 431, -277115, -110228, -212868, -26541, -9442, -209524, 89357, -529623, 323288, 21638, 59504, -96799, -118947, 163239, -142858, 322279, 312405, -66092, 97270, -53980, -218566, -224742, -85618, 73987, -172346, 81886, 35910, -116097, 31736, -177045, -40020, 69650, 13767, -35431, 216108, 177867, 104324, -273716, -65667, -236724, -101408, -204257, 134186, -207568, 25267, -102912, -195791, -267066, 151714]
10117h4569j42253R1762L3324n0780G4664b94305P5680A17439h3705G5672g9706
10105a64237G7945h01k55472h1795J482H0484O7845b8301A15398c50678a05832
10093B35832b33255q128R2274j08877I4743b910A9301b85953N9938J8920p7654
10082b84749b6197j6649A0475K24482l3499a50841e9661l14303e14k29430h1257
10070a07037B0183b22647A29587J20224d5123j06565A02215L1845a16808A90843
10059c29416a63739i066k61824a07953A01667d76477A59683a48603G2243N2507
10049A24750a67449A43217a38589H3846b88297J15342A4957a33272j92649E188
10038B18507f6138n8516M7463A16251C710M8112a41854E5346a5204l77387g0636
$$ y = [-84569, -226822, -135060, -101736, -152516, 74664, -294305, -218625, 117439, -83705, 75672, -79706, -164237, 77945, -801, -256273, -81795, -80313, 80484, 148329, -28301, 115398, -350678, -105832, 235832, -233255, -241383, -149109, -257986, 94743, -2910, 19301, -285953, -226015, -207095, -284749, -26197, -42846, 10475, 234957, 201458, -150841, -59661, -373964, -514, -229944, -81257, -107037, 20183, -222647, 129587, 249811, -45123, -151688, 102215, 134060, -116808, 190843, -329416, -163739, -9066, -270890, -107953, 101667, -476477, 159683, -148603, 72243, 124750, -167449, 143217, -138589, 83846, -288297, -172955, 14957, -133272, -325921, 5188, 218507, -66138, -124654, -77191, 116251, 3710, 51822, -141854, 55346, -15204, -392591, -70636]
10026b07187b4783j12361G0086f281j3729r6703A5179b54169A7593a26572k03176
10015c29748A07536b22543C35161C2222a1340B31064c7350A92547c60311a09960
10004a58469L4657B73813b64373H0332d5257B12951c12766L8897Q6216F9490C3095
9992g9089k13743B0931a30982N2230b3598j16865a0158A99793h5573o4298B46827
9980a84010j10222J29638o0943h9472D12968c56944J49471l4264a8600j09567
9970a28167D90318A26383h4733H447K66762B6474K48569c8343b218j32576b1263
9958C3026J13786d68247a8545B27682E8919B0189d316E1870O8930B3986i1862
9946A30483c7875C1167K76908b29604O0257k13221a39334B31085H2392j9642A4688
$$ y = [-207187, -24783, -137144, 70086, -6281, -20010, -116713, 15179, -254169, 17593, -126572, -329748, 107536, -222543, 335161, 32222, -11340, 231064, -37350, 192547, -360311, -109960, -158469, -123812, 273813, -264373, 80332, -45257, 212951, -312766, -273869, -187653, 69490, 33095, -79089, -292832, 20931, -130982, -78752, -23598, -140463, -10158, 199793, -85573, -149871, 246827, -184010, -294232, -164594, -225537, -89472, 412968, -356944, -207473, -241737, -18600, -128167, 490318, 126383, -84733, 8447, 275209, 26474, 275043, -38343, -2218, -134794, -21263, 33026, 146812, -468247, -18545, 227682, 58919, 20189, -4316, 51870, 120800, 23986, -91862, 130483, -37875, 31167, 308075, -229604, -169347, -382568, -139334, 231085, 82392, 62750, 14688]
9934a40896A36441d30543I1294a26736N9241L351l65542D0805P5713c86483G2361
9922d77092B32130d3296j54229E8369A32b1955A24032C7255f2188j29429e4777
9910e0136j32471J3632P8543j51884k1780c6057G5046P2223c617A34010g5550
9898e9118p5223B41632a98418A39340b06287P1894e5694A4949b48246l2517f9249
9886c55724B64058f3333c418m0425j44599B37937n9848b31407h0367B48965F6575
9874f1238p2794j68747a0220A97161k6125G2252b28920j84095b6803C14498b85233
9862C49955I2433a31945C41367d8158A81030b80591m7118a11892j04205d4971
9851c5955j02974A4322d1812j51309E7174d01406f0789H6220e5511j53351F8887
$$ y = [-140896, 136441, -430543, 91294, -126736, -67495, -64144, -429686, 40805, 116518, -386483, 72361, -477092, 232130, -43296, -197525, 58369, 132, -21955, 124032, 37255, -62188, -191617, -54777, -50136, -182607, -168975, -90432, -242316, -264096, -36057, 75046, 147269, -3617, 134010, -75550, -59118, -134341, 241632, -198418, 139340, -206287, -134393, -55694, 14949, -248246, -280763, -69249, -355724, 264058, -63333, -3418, -43843, -188442, 237937, 178089, -231407, -80367, 248965, 66575, -61238, -134032, -302779, -10220, 197161, 171036, 72252, -228920, -413015, -26803, 314498, -285233, 349955, 92433, -131945, 341367, -48158, 181030, -280591, -327709, -111892, -216097, -44971, -35955, -138929, 14322, -41812, -193121, 57174, -401406, -60789, 86220, -55511, -208862, 68887]
9839a60233j80368G4501d9583j28875j98859J53893H5238A291M06586e149G1761
9827A49737E9899a9252j25626A06846J28027p3736F7550c92552I470a00189A17
9815A13406b50712G9510N306P1667b47414L4032i7619o1392c0226J0876k19976
9804b39326J06949P937C1978K0706b6357D2848N9210c42659A88552b27458i3738
9792A4834e6429j51159d4607k03425J22161j12674B66035a68574j36131L2803
9782b71902a25948q5918a2574j26151A57184C5091a28713M0466H0162l7945Q2233
9771A24450D7175c46284i1050C10130R6851H9880R0475g4656C0870a02590n7416
9760a60006P0261B2606J3691b9666B35359d66413C5398j6092C121a40612L0182
$$ y = [-160233, -340601, 74501, -49583, -178458, -377317, -223424, 85238, 1291, 407877, -5149, 71761, 149737, 59899, -19252, -144878, 106846, 234873, 161137, 67550, -392552, 9470, -100189, 117, 113406, -250712, 79510, 84816, 156483, -247414, -213382, -97619, -159011, -30226, -19350, -239326, -132377, -124440, 31978, 52684, -26357, 42848, 102058, -342659, 188552, -227458, -93738, 14834, -56429, -207588, -44607, -248032, -125871, -238545, 266035, -168574, -304705, -271902, -125948, -211866, -12574, -138725, 157184, 35091, -128713, -88247, 80162, 42217, 124450, 47175, -346284, -91050, 310130, 406981, 89880, 180355, -74656, 30870, -102590, -160006, -89745, 22606, 36297, -29666, 235359, -466413, 35398, 19306, 3121, -140612, -110430]
9749a10430H9957A1529c3429j08255A16031h4432n3841d2947A72586a45407a3504
9737a79655A29601b4875C2714K583J83206b05494A06167c5270D1793b20158A79914
9725c59979a08682o4726B00909i2033E5270a77194A7833K88742A16946N024a12389
9713d8450I4627L25223F8906O6522J9097L0268b76201R4287J3882h0137k18901
9702b99038a29652b9599A84633e721A17327c23773j6942D7237b9909r4529k22484
9691c46922A41112b09323J04440G0434f9851j00918J7830M775K1433O0260m07827
9680d74298D990j172L02871i6578J9769b2032r9029K1808C54535e5312p4036r1885
9668b21233E5976g7499B6811a95700C7208R3340c92838a75585n5113F5036a15562
$$ y = [-110430, 89957, 11529, -33429, -141684, 116031, -84432, -138273, -42947, 172586, -145407, -13504, -179655, 129601, -24875, 32714, 35297, 218503, -205494, 106167, -35270, 41793, -220158, 179914, -359979, -108682, -173408, 200909, -92033, 55270, -177194, 17833, 306575, 116946, 121970, -112389, -48450, 94627, 419850, 68906, 135428, 154525, 184793, -276201, -181914, -168032, -80137, -299038, -129652, -29599, 184633, -5721, 117327, -323773, -340715, 47237, -29909, -124438, -346922, 141112, -209323, -104883, 70434, -69851, -170769, -152939, -148164, -126731, -66471, -474298, 4990, 3818, 306689, -96578, -76809, -22032, -121061, -99253, 354535, -55312, -129348, -221233, 55976, -77499, 26811, -195700, 37208, 130548, -392838, -175585, -230698, 65036, -115562]
9656b58282d1427c935G0658r306b49522J14428g033l4939k36986P4165M7908k54067
9644d10952a12043I3504a05309c3458k45697I8650L77349j80728n1596p6185b8583
9632c6702l44748a45233p6909B267J84109H3616b37749E6521d70442e2233K1680
9621c0553j67141J9277A45162a44651B3632c20272A10437f123j85803k71708h3727
9609d31182B1286c42346f5896H6218f6631E7574a6895k16488J0695q3579a02452
9597A60899p3346d33437a24314l7416M108O7236j32395B37247c7808n7542A12404
9585d1638r8249o8248N9826n9025g746l9624k98197h7189A96298H1789b57655
9573I1419b16005A88168G9976a19395F8647M7636i5974k00663A79495a3784p2924
$$ y = [-258282, -41427, -3935, 70658, 61352, -249522, -135094, -7033, -41972, -278958, -204793, -156885, -410952, -112043, 93504, -105309, -33458, -279155, 98650, 475999, 295271, 243675, 167490, -28583, -36702, -381450, -145233, -222142, 2267, 186376, 83616, -237749, 56521, -470442, -52233, -30553, -197694, -178417, 145162, -144651, 23632, -320272, 110437, -6123, -191926, -463634, -83727, -431182, 21286, -342346, -65896, 86218, -66631, 57574, -16895, -233383, -222688, -306267, -102452, 160899, 87553, -433437, -124314, -161730, -157622, -90386, -222781, 237247, -37808, -95350, 112404, -41638, -139887, -208135, -148309, -207334, -7746, -47370, -345567, -87189, 196298, 81789, -257655, 91419, -216005, 188168, 79976, -119395, 68647, 116283, -95974, -296637, 179495, -13784, -86708]
9562h6708a8619j07292B57414j17730b42932N9291j934I9386a34012j61071a14041
9550g2119B08071a55955r7135B19900b75641Q3623G0318c16892q0608A92497B481
9538C5367h2877k18996c0840j10278C6851K09560g4706q4772j7531h6014E0034
9526a9963i959l1932p1857r0451Q3578A50718i8424f969l36836M9784a23538j45063
9514b68601A9402c80102a81600B28960B8323N7761K0917a96674P5809M8059a0649
9502e9423B81101c5324j31982B3395P9625J77877j30115c2784r133B70814H9509
9490A70724c45617E2011q523m585a51323F0469b8095m20364J98405j67812H2579
9478B19451b58304P1609d923j42727j47645A39498l9011a07466a8334G7121b51135
$$ y = [-86708, -18619, -125911, 257414, 139684, -242932, -183641, -185575, 99386, -134012, -295083, -114041, -72119, 208071, -155955, -253090, 219900, -275641, -192018, 70318, -316892, -397500, 192497, 2481, 35367, -82877, -301873, -30840, -141118, 36851, 246411, -74706, -159478, -177009, -86014, 50034, -19963, -9959, -41891, -113748, -204199, -120621, 150718, -98424, -6969, -343805, -294021, -123538, -268601, 19402, -380102, -181600, 228960, 28323, 86084, 107001, -196674, -120865, -72806, -10649, -59423, 281101, -35324, -167306, 23395, 103020, 280897, 150782, -32784, -41917, 270814, 89509, 170724, -345617, 52011, 43488, 38903, -151323, 60469, -28095, -448459, -250054, -417866, 82579, 219451, -258304, -186695, -4923, -147650, -295295, 139498, 100487, -107466, -18334, 77121, -251135]
9466D9899b40590B77b30617g3369j22548J3881g7856A89105A6603k440a34049
9454a16543D2812a58902d8600A9832b22759B22684b68840g521A81289a93319O2834
9443a30485F8417a20277A22320h5393A35750N8158e8785m033B9947O3594a21548
9431d84603C9701J80876c3109j92709a2358K342j41945A37664f9786q7024c8709
9419E7752j2410m65a8529E8410g4215A60390m6803d0702B23716k4666c22216E68369
9406a3412j75117H7928m3962L49277c18574E015b4729k60937e8606m1709I618
9394f9440l6843n6873K3536I6707a51664B41323C5001g3157j81213D7206c44241
9382A8563e8583J953m1664r692B40548a97113j27928A40240E5383b38575g6811
$$ y = [49899, -240590, 277, -230617, -73369, -195917, -182036, -77856, 189105, 16603, 14163, -134049, -116543, 42812, -158902, -48600, 19832, -222759, 222684, -268840, -7521, 181289, -193319, -130485, 68417, -120277, 122320, -85393, 135750, 193908, -58785, -62818, 29947, 93541, -121548, -484603, 39701, 220577, -33109, -225818, -12358, -10016, -151961, 137664, -69786, -156810, -38709, 57752, 45342, 44877, -18529, 58410, -74215, 160390, 113587, -40702, 223716, 199050, -322216, 568369, -13412, -188529, 87928, 43966, 393243, -318574, 5015, -24729, -285666, -58606, -100315, 9618, -69440, -106283, -163156, -139620, 96707, -151664, 241323, 35001, -73157, -254370, 47206, -344241, 18563, -58583, -56630, -98294, -107986, 240548, -197113, -325041, 140240, 55383, -238575, -76811]
9370c37223a04k06663A27277b19917N4897k95181R0001D2614a13585c1610A1706
9358c3644o5156A20108K3103f4822A82809l0338G1260Q8250b80997c7568C8945
9346C0802K8215b67202D3908c42965P3766I5877l835b79194D3445M7075a36213
9334i6971n5903H4728a27185l1548a5520j03388m9528Q435q5917H3256b52839
9322f4547A37733c79047J89478f3260j99317A13878B7090b9527j19410F2738b28593
9310G6722a13654B21613n7218b63737J3420m120C500J54841E993N0581d14518
9298a34128e7500j47189A27084j6657c40619i9829B7750i0950j73613B58146d11950
9286a34321E5395a94411C14391q7990e21722a97404O1945N7000A05438b28525
$$ y = [-337223, -104, -206767, 127277, -219917, -165020, -460201, -370200, 42614, -113585, -31610, 11706, -33644, -98800, 120108, 143211, -64822, 182809, 152471, 71260, 159510, -280997, -37568, 38945, 30802, 59017, -267202, 43908, -342965, -269199, 95877, 92042, -279194, 43445, 90520, -136213, -96971, -152874, 84728, -127185, -158733, -15520, -118908, -168436, -160001, -245918, 83256, -252839, -64547, 137733, -379047, -189569, -63260, -262577, 113878, 27090, -29527, -148937, 62738, -228593, 76722, -113654, 221613, 164395, -263737, -250317, -254437, 3500, 158341, 5993, 56574, -414518, -134128, -57500, -204689, 127084, 110427, -340619, -99829, 27750, -90950, -264563, 258146, -411950, -134321, 55395, -194411, 314391, 226401, -521722, -197404, -135459, -78459, 105438, -228525]
9275A72358g138k71406A3776c05454a31620A46986b26183i9617d3033A44691a38149
9263I2205i0162j80063A07715D3122i5133n3850C8257a66182j537A43655b96307
9251A51283k5158a22438E292a17661j31880b8628r8048K4670F2974J66172c19237
9239c66126N5578c6863j07622j46245i4070k34600K0763h3191l584j47571J4251
9228b20095r9569a14448B24215A7307J74357G7017b5687F7400j6866a86028h3172
9216a72960b7200k5285j02759A33423i814o56357A04664f5556a8693j42416g0636
9204e0329A55e7661C6253N6937b10900B7339n122b43600i1403I0818f0418A5402
9191c40060J08482i9700A6095K22591i4170P298l90061K34574p9876a45930B0967
$$ y = [172358, -7138, -278544, 13776, -305454, -131620, 146986, -226183, -99617, -43033, 144691, -138149, 92205, -90162, -270225, 107715, 43122, -95133, -148983, 38257, -166182, -167719, 143655, -296307, 151283, 126125, -122438, 5292, -117661, -249541, -28628, -126676, -102006, 62974, 229146, -319237, -366126, -310548, -36863, -144485, -290730, -94070, -328670, -307907, -83191, -86775, -234346, -220095, -319664, -114448, 224215, 17307, 191664, 77017, -25687, 67400, 50534, -186028, -83172, -172960, -27200, -52485, -155244, 133423, -9814, -666171, 104664, -65556, -18693, -161109, -70636, -50329, 155, -57661, 36253, 93190, -210900, 27339, 22217, -243600, -91403, 90818, -60418, 15402, -340060, -231578, -99700, 16095, 238686, -94170, -86872, -476933, -242359, -322235, -145930, 20967]
9179b28098H2296C1053b24510M7211O6157A56999K6832j1726h5066c6813a3414
9167A17576a51568K9875J6016k2354A84057A1889f9361l45761a81111A15468b96264
9155a95792N1834B6601J71997J56472b10146H459a79422F3210J24682d9072b0862
9143a69254l139Q1240r1671G0114i6787I040L8576b60370A52844b36361M5336
9132a91025R2207B4116j0912a37111D8783J39362a25384A20924A1363d5101k02813
9121b47914Q9050J5944K9377j12719B78392e7402B65217a35994O4682k8719A33855
9109A6149d15261a9395A98484F196b17061A92457K05477A58807a83602h3929m6319
9098a30248B3008K27606m0352b17784n0571A05262a17651D08491A4966J81266
$$ y = [-228098, 82296, 31053, -224510, -177299, -111142, 156999, 183831, 172105, -85066, -36813, -13414, 117576, -151568, -121693, -105677, -128031, 184057, 11889, -69361, -415122, -181111, 115468, -296264, -195792, -143958, 26601, 198598, 355070, -210146, 8459, -179422, 63210, 187892, -49072, -20862, -169254, -172393, -91153, -182824, 70114, -96787, 9040, 47616, -260370, 152844, -236361, -191025, -98818, 24116, 13204, -137111, 48783, 188145, -125384, 120924, 11363, -45101, -247914, -158864, -142920, -113543, -226262, 278392, -57402, 265217, -135994, -71312, -100031, 133855, 16149, -415261, -19395, 198484, 6196, -217061, 192457, 397934, 158807, -183602, -83929, -130248, 23008, 250614, 210262, -217784, -268355, 105262, -117651, 408491, 14966, 196232]
9088A96232G1340c14593a3222D8962J629j7070l690L47924A88775B5195L6897
9077F2092d9839A59835p9635a28090p0810A13468f9654b8302j43949e5577C8420
9065b4855j09472J641M907A61466b09449C2668b51237j55567a04681C84359a53832
9053A9632b98392A32103c12122f5550b439j22955e0819J3113B35993c82355R8504
9042b83851k1640m0305a14064b3882m9488H3881R570b22633G3850l4563b25993
9030G3679d87783a24719F0955K3406J25518i8457k8170c5818j01721a1138l20227
9019c31365h9832k09186i4086l2246k6771E4267g1050A3739b89387a9172j76722
9008a95894j9938L5091P6226B0346c2129l1614L1630D8588a67001l5069I4980
$$ y = [196232, 71340, -314593, -13222, 48962, 50591, 33521, 29831, 377755, 188775, 25195, 62092, -49839, 159835, 80200, -128090, -198900, 113468, -69654, -28302, -172251, -55577, 38420, -24855, -134327, -132686, -127779, 161466, -209449, 32668, -251237, -406804, -104681, 384359, -153832, 19632, -298392, 132103, -312122, -65550, -2439, -125394, -50819, -37706, 235993, -382355, -283851, -305491, -345796, -114064, -23882, -73370, 83881, 93451, -222633, 73850, 39287, -225993, 73679, -487783, -124719, 60955, 84361, 209879, -98457, -126627, -35818, -137539, -11138, -331365, -89832, -299018, -94086, -126332, -153103, 54267, -71050, 13739, -289387, -19172, -195894, -215832, -180741, -104515, 20346, -32129, -63743, -32113, 48588, -167001, -202070, 94980]
8996c88859G7611a58925e4422A9709P3161C0053K8350c50590g3952k2089A01674
8984b43759F9297O0319A9670N2524a71645j22829B25138a14142j9622p0516C9172
8972B87456a57313E0642c5602l6635k861c4519A2296a09723j52512M4942A4945
8960B70193a94673K1019p5455g737D1445i9914K3044r2620c3126k723j90123B80536
8947f767B4331P458a32076j29619B926e1452k46078D938b30122A40447M4051H2689
8934a06109A29357f1116m8437D4856J23393F717b37693A05738J38714O59638R28446
8923A832536K057963L824074J915052A353948E42416j90598E5941C158a30351
8913g6917c7975C53122A66028h5943B77792J9919b8048l47186R2851R9639G7419
$$ y = [-388859, 77611, -158925, -54422, 19709, 92870, 30053, 58403, -350590, -73952, -96041, 101674, -243759, 69297, 129616, 19670, 72194, -171645, -294474, 225138, -114142, -133764, -204280, 39172, 287456, -157313, 50642, -35602, -72237, -75098, -34519, 12296, -109723, -262235, -217293, 14945, 270193, -194673, -173654, -249109, -7737, 41445, -99914, -76870, -169490, -33126, -35849, -225972, 280536, -6767, 24331, 31789, -132076, -261695, 2926, -51452, -297530, 4938, -230122, 140447, 184498, 82689, -106109, 129357, -61116, -109553, 44856, 168249, 6717, -237693, 105738, 244452, 904090, 1832536, 3890499, 7714573, 9629625, 1353948, 542416, 351818, 55941, 3158, -130351, -76917, -37975, 353122, 166028, -85943, 277792, 297711, -28048, -375234, -282383, -182744, 77419]
8901h8543A37932J6667h0043K2547F960e14334g288k23859A63412b28130C218
8889c99308H9955L52995b04526g8094b1640R051B76603a45978A87509D0790l969
8878C6821c52295e4345k60692g8242j7193A5872a35403E1718N2347K07740G8998
8866b9109F4096Q8651f236k42316j94011J77953j0213i5634k20496F202O2438
8855F8640J41388g3865A75141E5299a82071j51823a51876J7890C08783A30899
$$ y = [-88543, 137932, 154599, -80043, -57496, 6960, -514334, -7288, -231147, 163412, -228130, 3218, -399308, 89955, 442950, -204526, -78094, -21640, -12589, 276603, -145978, 187509, 40790, 36821, -352295, -54345, -315037, -78242, -95435, 15872, -135403, 51718, 104065, 311805, 78998, -29109, 64096, 152747, -6236, -248552, -442563, -264610, -274823, -95634, -316130, 6202, 68640, 210028, -73865, 175141, 55299, -182071, -333894, -151876, -133986, 308783, 130899]
$$ [...]
##END NTUPLES=NMR SPECTRUM
##END=
