
##TITLE=AC1334_VIERS11074_6666252_IYIlxgpck1
##JCAMPDX= 6.0         $$ Bruker NMR JCAMP-DX V2.0
##DATA TYPE= NMR SPECTRUM
##DATA CLASS= NTUPLES
##ORIGIN= BRUKER
##OWNER= Administrator
$$ 1.72 TOPSPIN		Version 2.1
$$ 2012-08-13 17:39:29.968 -0500  Administrator@TOPSPIN
$$ Compression mode = diff/dup
##.OBSERVE FREQUENCY= 400.02188249412
##.OBSERVE NUCLEUS= ^1H
##.ACQUISITION MODE= SIMULTANEOUS (DQD)
##.ACQUISITION SCHEME= undefined
##.AVERAGES= 64
##.DIGITISER RES= 22
##SPECTROMETER/DATA SYSTEM= spect
##.PULSE SEQUENCE= noesygpps1d.comp
##.SOLVENT NAME= COFFEE_meoh
##.SHIFT REFERENCE= INTERNAL, COFFEE_meoh, 1, 14.9623
##AUDIT TRAIL= $$ (NUMBER, WHEN, WHO, WHERE, PROCESS, VERSION, WHAT)
$$ ##TITLE= Audit trail, TOPSPIN		Version 2.1
$$ ##JCAMPDX= 5.01
$$ ##ORIGIN= Bruker BioSpin GmbH
$$ ##OWNER= Administrator
$$ $$ C:\Bruker\TOPSPIN/data/COFFEE/nmr/AC1334_VIERS11074_6666252_IYIlxgpck1/12/pdata/1/auditp.txt
$$ ##AUDIT TRAIL=  $$ (NUMBER, WHEN, WHO, WHERE, PROCESS, VERSION, WHAT)
(   1,<2012-08-13 17:39:24.765 -0500>,<Administrator>,<TOPSPIN>,<go>,<TOPSPIN 2.1>,
      <created by zg
	started at 2012-08-13 17:27:54.531 -0500,
	POWCHK enabled, PULCHK disabled,
       configuration hash MD5:
       6B 1B 68 BB D9 2E 58 E2 7F 35 AD 54 07 DF 0E 41
       data hash MD5: 64K
       11 4B B9 1F 77 B6 F9 AB 12 88 10 AD 1A 46 22 11>)
(   2,<2012-08-13 17:39:27.890 -0500>,<Administrator>,<TOPSPIN>,<proc1d>,<TOPSPIN 2.1>,
      <Start of raw data processing
       efp LB = 0.3 FT_mod = 6 PKNL = 1 PHC0 = 0 PHC1 = 0 SI = 128K 
       data hash MD5: 128K
       4D C2 1F 19 E1 83 D8 29 C3 FA 38 98 FF 00 37 21>)
(   3,<2012-08-13 17:39:29.015 -0500>,<Administrator>,<TOPSPIN>,<proc1d>,<TOPSPIN 2.1>,
      <pk PHC0 = 4.883423 PHC1 = 0 
       data hash MD5: 128K
       28 AF 70 47 FF BE D7 94 C5 B6 54 15 C7 19 51 A2>)
(   4,<2012-08-13 17:39:29.640 -0500>,<Administrator>,<TOPSPIN>,<proc1d>,<TOPSPIN 2.1>,
      <abs ABSG = 1 
       data hash MD5: 128K
       B1 11 9C E3 59 77 9F 19 2D C2 71 DA 16 71 A4 8F>)
(   5,<2012-08-13 17:39:29.718 -0500>,<Administrator>,<TOPSPIN>,<proc1d>,<TOPSPIN 2.1>,
      <abs ABSG = 2 
       data hash MD5: 128K
       2B 27 0F 04 80 89 F4 12 0C 71 70 39 4C 0F 77 56>)
(   6,<2012-08-13 17:39:29.781 -0500>,<Administrator>,<TOPSPIN>,<proc1d>,<TOPSPIN 2.1>,
      <abs ABSG = 3 
       data hash MD5: 128K
       07 23 AF A0 2E 11 45 3B 1D 05 EC 1A A7 32 13 06>)
(   7,<2012-08-13 17:39:29.843 -0500>,<Administrator>,<TOPSPIN>,<proc1d>,<TOPSPIN 2.1>,
      <abs ABSG = 4 
       data hash MD5: 128K
       C3 E5 90 2C 4D FE 4A A1 0A 8A AD 6F 80 97 FC 56>)
(   8,<2012-08-13 17:39:29.890 -0500>,<Administrator>,<TOPSPIN>,<proc1d>,<TOPSPIN 2.1>,
      <abs ABSG = 5 
       data hash MD5: 128K
       F7 9F 2F 35 BE 77 24 86 5B 2E 53 78 54 3C 55 7F>)
$$ ##END=
$$ 
$$ $$ hash MD5
$$ $$ 86 83 59 B7 1B 55 83 86 91 77 0A 18 66 33 65 7B
##$RELAX= 
##$RELAX= 
##$RELAX= 
##$RELAX= 
##$RELAX= 
##$RELAX= 
##$RELAX= 
##$RELAX= 
$$ Bruker specific parameters
$$ [...]
150 150 150 150 150 150 150 150
##$TP07= 0
##$TPNAME0= <>
##$TPNAME1= <>
##$TPNAME2= <>
##$TPNAME3= <>
##$TPNAME4= <>
##$TPNAME5= <>
##$TPNAME6= <>
##$TPNAME7= <>
##$TPOAL= (0..7)
0.5 0.5 0.5 0.5 0.5 0.5 0.5 0.5
##$TPOFFS= (0..7)
0 0 0 0 0 0 0 0
##$TUNHIN= 0
##$TUNHOUT= 0
##$TUNXOUT= 0
##$USERA1= <user>
##$USERA2= <user>
##$USERA3= <user>
##$USERA4= <user>
##$USERA5= <user>
##$V9= 5
##$VALIST= <valist>
##$VCLIST= <CCCCCCCCCCCCCCC>
##$VD= 0
##$VDLIST= <DDDDDDDDDDDDDDD>
##$VPLIST= <PPPPPPPPPPPPPPP>
##$VTLIST= <TTTTTTTTTTTTTTT>
##$WBST= 1024
##$WBSW= 4
##$XGAIN= (0..3)
0 0 0 0
##$XL= 0
##$YL= 0
##$YMAX_a= 14118349
##$YMIN_a= -8199543
##$ZGOPTNS= <>
##$ZL1= 120
##$ZL2= 120
##$ZL3= 120
##$ZL4= 120
##$ABSF1= 14.9623
##$ABSF2= -5.595881
##$ABSG= 5
##$ABSL= 3
##$ALPHA= 0
##$AQORDER= 0
##$ASSFAC= 0
##$ASSFACI= 0
##$ASSFACX= 0
##$ASSWID= 0
##$AUNMP= <proc_prof1d_extract.lims>
##$AXLEFT= 0
##$AXNAME= <>
##$AXNUC= <1H>
##$AXRIGHT= 0
##$AXTYPE= 0
##$AXUNIT= <>
##$AZFE= 0.1
##$AZFW= 0.1
##$BCFW= 0
##$BC_mod= 0
##$BYTORDP= 0
##$COROFFS= 0
##$CY= 15
##$DATMOD= 1
##$DC= 0
##$DFILT= <>
##$DTYPP= 0
##$F1P= 0
##$F2P= 0
##$FCOR= 0.5
##$FTSIZE= 131072
##$FT_mod= 6
##$GAMMA= 0
##$GB= 0
##$INTBC= 1
##$INTSCL= 1
##$ISEN= 128
##$LB= 0.3
##$LEV0= 0
##$LPBIN= 0
##$MAXI= 10000
##$MC2= 0
##$MEAN= 0
##$ME_mod= 0
##$MI= 0
##$NCOEF= 0
##$NC_proc= -2
##$NLEV= 6
##$NOISF1= 0
##$NOISF2= 0
##$NSP= 0
##$NTH_PI= 0
##$NZP= 0
##$OFFSET= 14.9623
##$PC= 1
##$PHC0= 4.883423
##$PHC1= 0
##$PH_mod= 1
##$PKNL= yes
##$PPARMOD= 0
##$PPDIAG= 0
##$PPIPTYP= 0
##$PPMPNUM= 2147483647
##$PPRESOL= 1
##$PSCAL= 4
##$PSIGN= 0
##$PYNMP= <proc.py>
##$REVERSE= no
##$SF= 400.020009117644
##$SI= 131072
##$SIGF1= 0
##$SIGF2= 0
##$SINO= 400
##$SIOLD= 131072
##$SPECTYP= <>
##$SREGLST= <1H.CDCl3>
##$SSB= 0
##$STSI= 131072
##$STSR= 0
##$SW_p= 8223.68421052631
##$SYMM= 0
##$S_DEV= 0
##$TDeff= 65536
##$TDoff= 0
##$TI= <>
##$TILT= no
##$TM1= 0
##$TM2= 0
##$TOPLEV= 0
##$USERP1= <user>
##$USERP2= <user>
##$USERP3= <user>
##$USERP4= <user>
##$USERP5= <user>
##$WDW= 1
##$XDIM= 131072
##$YMAX_p= 431748536
##$YMIN_p= -13754
##$CURPLOT= <Network HP LaserJet P1505>
##$CURPRIN= <$Network HP LaserJet P1505>
##$DFORMAT= <normdp>
##$LAYOUT= <+/1D_H.xwp>
##$LFORMAT= <normlp>
##$PFORMAT= <normpl>
##$SURQMSG= 1
$$ End of Bruker specific parameters
$$ ---------------------------------
##NTUPLES= NMR SPECTRUM
##VAR_NAME=  FREQUENCY,     SPECTRUM/REAL,   SPECTRUM/IMAG
##SYMBOL=    X,             R,               I
##VAR_TYPE=  INDEPENDENT,   DEPENDENT,       DEPENDENT
##VAR_FORM=  AFFN,          ASDF,            ASDF
##VAR_DIM=   131072,        131072,          131072
##UNITS=     HZ,            ARBITRARY UNITS, ARBITRARY UNITS
##FACTOR=    0.0627417313425164, 1,          1
##FIRST=     8223.62146879497, -4204,        -52090
##LAST=      0,             -2533,           -53123
##MIN=       0,             -13754,          0
##MAX=       8223.62146879497, 431748536,    0
$$ Real data points
##PAGE= N=1
##DATA TABLE= (X++(R..R)), XYDATA
$$ [...]
61107E31746m312l800l272k713k111j045N18J843K606L524M985O121O291O356
61093E46737P100P413N632K020j633m346o390p847q362q180p950p608o606n136
61079E04844l935l062k004q69k22J06Q20J899K635K888L188L649L904M090M781
61064E22712N886O594O589O354O235N984N332M311L003J639P89Q29J310J542J521
61049E80630J685J958J799J038L3q38j302j126m08L90J049J758K413K537K283
61034E93899K521L402L965L891M343O047P801Q222P889Q292R527J0512J0819J0830
61020F91960J0693J0405J0429J0958J1248J0727J0079J0126J0527J0626J0605
61009H08383J0613R907Q240O928P079P921Q336Q755R916J1199J1965J3151J5530
$$ y = [531746, 527434, 523634, 520362, 517649, 515538, 514493, 515011, 516854, 519460, 522984, 527969, 534090, 540381, 546737, 553837, 561250, 566882, 568902, 567269, 562923, 556533, 548686, 540324, 532144, 524194, 516586, 509980, 504844, 500909, 497847, 495843, 494974, 494752, 494858, 495678, 497577, 500212, 503100, 506288, 509937, 513841, 517931, 522712, 528598, 535192, 541781, 548135, 554370, 560354, 565686, 569997, 573000, 574639, 575428, 576257, 577567, 579109, 580630, 582315, 584273, 586072, 587110, 587143, 586305, 585003, 583877, 583469, 583859, 584908, 586666, 589079, 591616, 593899, 596420, 599822, 603787, 607678, 612021, 618068, 625869, 634091, 641980, 650272, 659799, 670311, 681130, 691960, 702653, 713058, 723487, 734445, 745693, 756420, 766499, 776625, 787152, 797778, 808383, 818996, 828903, 837143, 844071, 851150, 859071, 867407, 876162, 886078, 897277, 909242, 922393, 937923]
60996I37923J7807J8667J9296K1455K4408K6286K7375K9396L2528L5780L9383
60985A230304M4157M9478N4388N9634O6022P2239P7218Q3141R2547J03776J12892
60974B045796J18929J23601J27376J30275J35322J46501J63989J85903K13536
60965C391228K49310K90339L30011L66165M02383M42011M87626N46184O27063
60956G132320P34008Q66088J026683J223044J456967J727331K044572K432547
60948A8643560K916762L523862M276844N127183N843269O011555N269622L630047
60940E5242704J573086k29173j312108j579777j167760k79987P86918J562114
60932E4596017J530553M69697j334369l248479m696831n442643n562825n255664
$$ y = [937923, 955730, 974397, 993693, 1015148, 1039556, 1065842, 1093217, 1122613, 1155141, 1190921, 1230304, 1274461, 1323939, 1378327, 1437961, 1503983, 1576222, 1653440, 1736581, 1829128, 1932904, 2045796, 2164725, 2288326, 2415702, 2545977, 2681299, 2827800, 2991789, 3177692, 3391228, 3640538, 3930877, 4260888, 4627053, 5029436, 5471447, 5959073, 6505257, 7132320, 7866328, 8732416, 9759099, 10982143, 12439110, 14166441, 16211013, 18643560, 21560322, 25084184, 29361028, 34488211, 40331480, 46343035, 51612657, 55242704, 56815790, 56586617, 55274509, 53694732, 52526972, 52246985, 53033903, 54596017, 56126570, 56596267, 55261898, 52013419, 47316588, 41873945, 36311120, 31055456]
60924C1055456m704192m050654l401772k818557k317341j895124j548430j269704
60916I049682j043581q57160p07171n92394n06089m40097l89847l51172l17805
60907C844366k86149k57829k34114k12054j89049j66660j46680j27785j09523
60898B114523r5705q9799q9745r0680r0249q8396q4619p8734p2336o6684o0786
60887A206790n3798m7237m2560l8692l4240l0151k7790k6321k4331k2364k1471
60876H37835k0895j9476j7874j7221j7022j6381j5854j6042j5896j4481j2915
60865F53778j2458j2147j0655q953q694r262q997q238q484r342r052p596o684
60852E33216o740o376m916l302k215j288m11j18k89L2J174K398L137L506L476
$$ y = [31055456, 26351264, 22300610, 18898838, 16080281, 13762940, 11867816, 10319386, 9049682, 8006101, 7148941, 6441770, 5849376, 5343287, 4903190, 4513343, 4162171, 3844366, 3558217, 3300388, 3066274, 2854220, 2665171, 2498511, 2351831, 2224046, 2114523, 2018818, 1929019, 1839274, 1748594, 1658345, 1569949, 1485330, 1406596, 1334260, 1267576, 1206790, 1152992, 1105755, 1063195, 1024503, 990263, 960112, 932322, 906001, 881670, 859306, 837835, 816940, 797464, 779590, 762369, 745347, 728966, 713112, 697070, 681174, 666693, 653778, 641320, 629173, 618518, 609565, 600871, 591609, 582612, 574374, 565890, 556548, 547496, 539900, 533216, 526476, 520100, 515184, 511882, 509667, 508379, 507968, 507850, 507561, 507593, 508767, 511165, 514302, 517808, 521284]
60837E21284K660J131m91j799k675k784j956q88m17k78M22J711K807L586M829
60822E27142O845Q962J0502J1378J1565J0883R626Q583Q107P688O791N684N080
60809F38836N230N490M725K212j649n600q538j0169j0742j0698j0653j1109j1786
60796E75549j1704j0393q585p356o986o998o897o500n962n793o382p214p196o048
60782D71535m733m144m099m067m014l949l393k197j144q73p47K47J927L205L562
60767D47116L383L048K654K555L169M256N020N093M853M752M874N097N200M824
60753E05894L798K480J385N23l93j204j340p47k37o32j776k768l113l362m464
60738D94044o511q556r696j0052j0305j0686j0870j0574r731q274o461n156n043
$$ y = [521284, 523944, 525075, 524584, 522785, 520110, 517326, 515370, 514482, 514065, 513787, 514209, 515920, 518727, 522313, 527142, 533987, 542949, 553451, 564829, 576394, 587277, 596903, 605486, 613593, 621281, 628072, 633756, 638836, 644066, 649556, 654281, 656493, 654844, 649244, 640706, 630537, 619795, 609097, 598444, 587335, 575549, 563845, 553452, 544867, 537511, 530525, 523527, 516630, 510130, 504168, 498375, 491993, 484779, 477583, 471535, 466802, 462658, 458559, 454492, 450478, 446529, 443136, 440939, 439795, 438922, 438175, 438422, 440349, 443554, 447116, 450499, 453547, 456201, 458756, 461925, 466181, 471201, 476294, 481147, 485899, 490773, 495870, 501070, 505894, 509692, 512172, 513557, 514080, 513687, 512483, 511143, 510396, 510159, 509527, 507751, 504983, 501870, 498508, 494044, 487533, 478977, 469281, 459229, 448924, 438238, 427368, 416794, 407063, 398789, 392328, 387172, 382129]
60725C82129n688o101o067n996n654m296k169o50m40p72q04o98q04q55p21r27
60709C39487j622j872q66Q39K010K093J257j52j474j809j029r9K50M78J183J966
60693C40640K197K111K152J987J225N86J084K443L430L504L175K916K746K778
60679C72974L234L950M536M876M965M606L907L648M357N424N952O038O300O601
60665D41368O327N687N569O149O660O547N884M727L054J404O06P16R80R92J040
60650D97710J272J343J098P87M02m29j617k433k522k450k952m080n354o281o514
60635D67980n954m983m205l779l358k793k418k462k642k557k160j585q65p2N51
60620D28698Q46J008J390K110K898L323L176K771K776L582M861N835O008N541
$$ y = [382129, 376441, 370340, 364273, 358277, 352623, 348327, 346158, 345508, 345068, 344296, 343492, 342794, 341990, 341135, 340414, 339487, 337865, 335993, 335127, 335966, 337976, 340069, 341326, 341174, 339700, 337891, 336862, 336763, 337013, 337491, 338674, 340640, 342837, 344948, 347100, 349087, 350312, 350898, 351982, 354425, 357855, 361359, 364534, 367450, 370196, 372974, 376208, 380158, 384694, 389570, 394535, 399141, 403048, 406696, 411053, 416477, 422429, 428467, 434767, 441368, 447695, 453382, 458951, 465100, 471760, 478307, 484191, 488918, 491972, 493376, 493982, 494698, 495678, 496670, 497710, 498982, 500325, 501423, 502210, 502612, 502183, 500566, 498133, 495611, 493161, 490209, 486129, 480775, 474494, 467980, 462026, 457043, 452838, 449059, 445701, 442908, 440490, 438028, 435386, 432829, 430669, 429084, 428219, 428147, 428698, 429544, 430552, 431942, 434052, 436950, 440273, 443449, 446220, 448996, 452578, 457439, 463274, 469282, 474823]
60606D74823N077N188N842O392O280N758N574N944O360O455O528O925P537Q217
60592E62900R145J0271J0986J0894J0413R988R174P239M172M37l916q892j3548
60579F19263j6392j6969j6356j5874j5819j5619j4724j3164j1499j0300r513q540
60567D54494p142n882n264m848l868k442j414j105r41m22K34N70N87O83J169K016
60551D26425K845L228L122K904K814K689K367K063J960J864J657J685K197K778
60537D60598K923K883L283M112M801N120N430O095P182Q558R856J0585J0786J1348
60523E53560J3047J5558J8075K0530K3399K6595K9600L2611L6615M2116M8643
60512H60349N5723O3585P2649Q2988R4465J06755J18885J29235J36219J38583
$$ y = [474823, 479900, 485088, 490930, 497322, 503602, 509360, 514934, 520878, 527238, 533693, 540221, 547146, 554683, 562900, 572045, 582316, 593302, 604196, 614609, 624597, 633771, 641010, 645182, 645619, 641703, 632811, 619263, 602871, 585902, 569546, 553672, 537853, 522234, 507510, 494346, 482847, 472547, 463034, 454494, 447352, 441470, 436206, 431358, 427490, 425048, 423634, 422529, 421588, 421166, 421400, 421970, 422557, 423240, 424409, 426425, 429270, 432498, 435620, 438524, 441338, 444027, 446394, 448457, 450417, 452281, 453938, 455623, 457820, 460598, 463521, 466404, 469687, 473799, 478600, 483720, 489150, 495245, 502427, 510985, 520841, 531426, 542212, 553560, 566607, 582165, 600240, 620770, 644169, 670764, 700364, 732975, 769590, 811706, 860349, 916072, 979657, 1052306, 1135294, 1229759, 1336514, 1455399, 1584634, 1720853, 1859436]
60502A859436J35012J24159J05390P9324M7633J2846k1807n3159p9117r8590j10685
60491B000442j14829j11946j04595r5202q4578p2508n9263m5876l3096k0765q330
60480A249454M341J6882K8911M0390N1246O0678O7122O9106O6013N7966M5371
60469A757480K9049J0537q074k4701l7644m6003n0164n1469n0776m7634m1506
60458A439095l3284k4702j6376p496K461J2706K2211L0986L9762M8921N8221O7264
60446A639769P5893Q4370R3468J04147J17037J32310J50135J70940J95226K23410
60436B986705K55919K93058L34627L79760M26955M73714N15838N47163N60049
60427F773788N46473M99817M17220L01187J59273K531j55815l01637m22310n09809
$$ y = [1859436, 1994448, 2118607, 2223997, 2303321, 2350954, 2363800, 2341993, 2288834, 2209717, 2111127, 2000442, 1885613, 1773667, 1669072, 1573870, 1489292, 1416784, 1357521, 1311645, 1278549, 1257784, 1249454, 1253795, 1270677, 1299588, 1339978, 1391224, 1451902, 1519024, 1588130, 1654143, 1712109, 1757480, 1786529, 1797066, 1788992, 1764291, 1726647, 1680644, 1630480, 1579011, 1528235, 1480601, 1439095, 1405811, 1381109, 1364733, 1357237, 1359698, 1372404, 1394615, 1425601, 1465363, 1514284, 1572505, 1639769, 1715662, 1800032, 1893500, 1997647, 2114684, 2246994, 2397129, 2568069, 2763295, 2986705, 3242624, 3535682, 3870309, 4250069, 4677024, 5150738, 5666576, 6213739, 6773788, 7320261, 7820078, 8237298, 8538485, 8697758, 8700289, 8544474, 8242837, 7820527, 7310718]
60417G310718n62080n81898n74704n47190n06441m58937m09611l61620l16718
60408B991519k75798k39330k07584j80610j58055j39108j22677j07853r4463q3010
60398A383031p3671o5536n7480m9715m3520l9247l5705l2002k8842k7063k5920
60387I04330k4148k1966k0559j9969j9078j7587j6484j6311j6271j5469j4031
60376G02457j2524j1159j0001r268r039r071r076q769p816o384n364n231n039
60363E93716l710j993j642k682l191k176r35p64r45k17R84J239L14p18j137j146
60347E74997j016p24m32n12j023j629j957j674m92J418L284M536N562P159R514
60332E97011J2156J4743J7344K0011K2537K4700K6328K7091K6364K3539J8535
$$ y = [7310718, 6748638, 6166740, 5592036, 5044846, 4538405, 4079468, 3669857, 3308237, 2991519, 2715721, 2476391, 2268807, 2088197, 1930142, 1791034, 1668357, 1560504, 1466041, 1383031, 1309360, 1243824, 1186344, 1136629, 1093109, 1053862, 1018157, 986155, 957313, 930250, 904330, 880182, 858216, 837657, 817688, 798610, 781023, 764539, 748228, 731957, 716488, 702457, 689933, 678774, 668773, 659505, 650466, 641395, 632319, 623550, 615734, 609350, 603986, 598755, 593716, 590006, 588013, 586371, 583689, 580498, 578322, 577387, 576623, 575678, 575461, 576445, 577684, 577998, 577280, 576143, 574997, 573981, 573257, 572825, 572313, 571290, 569661, 567704, 566030, 565538, 566956, 570240, 574776, 580338, 587497, 597011, 609167, 623910, 641254, 661265, 683802, 708502, 734830, 761921, 788285, 811824, 830359]
60321H30359J2112N535l28n475j0141j3877j5791j5563j3714j0986q126o161n934
60308G41910p138q577r691j1009j2880j4585j5292j5128j4581j3487j1364q431
60296E99747n536l247j517k12N08K97r63k834m411n151n578o626q272r459r524
60281E37222q927q268p428o169m850l843k840j443MR06J448K345L806N336O499
60266E13798P360Q221R243J0284J0845J0381Q883O965N182L594K154J052M07N2
60252E98421L8Q81K897N615Q281J0609J2708J4716J6873J9549K2694K5621K7768
60239G66671K9404L1176L3313L5689L8281M1009M3409M4988M5739M5918M5514
60228A201111M4380M2591M0230L7052L2876K8128K3511J9155J4619R636M510l31
$$ y = [830359, 842471, 848006, 847678, 842203, 832062, 818185, 802394, 786831, 773117, 762131, 754005, 747844, 741910, 734772, 726195, 716504, 705495, 692615, 678030, 662738, 647610, 633029, 619542, 608178, 599747, 594211, 590964, 589447, 589235, 589743, 590040, 589077, 586243, 581832, 576681, 571103, 564477, 556205, 546746, 537222, 528295, 520027, 512599, 506430, 501580, 497737, 494897, 493454, 493458, 494364, 495812, 498157, 501963, 507299, 513798, 521158, 529379, 538622, 548906, 559751, 570132, 579015, 585980, 591162, 594756, 596910, 597962, 598369, 598421, 598459, 599340, 602237, 607852, 616133, 626742, 639450, 654166, 671039, 690588, 713282, 738903, 766671, 796075, 827251, 860564, 896253, 934534, 975543, 1018952, 1063940, 1109679, 1155597, 1201111, 1245491, 1288082, 1328312, 1365364, 1398240, 1426368, 1449879, 1469034, 1483653, 1493289, 1497799, 1497468]
60216A497468m779q898j2443j4827j5662j5237j4203j2637r896n680p84L738P726
60203A393886J1530J4957J7672K0312K3940K8312L2100L4959L8007M1789M5227
60192A702691M7279M8150M8046M6104M1840L6444L1184K5430J7880Q996N61o801
60180B047804j4008k1566k8635l4189l7908l9778l9901l8762l6798l3668k8820
60169A693771k2660j6246r975l560K836Q749J4571K1243K8539L5076M0389M5611
60157A838344N1361N6243N8511N8312N7234N6237N5169N3818N2233M9988M6127
60146B433577M0257L2999K5153J6884Q222k7o376r748j0213q629n852k480R51
60133B514718M064O961J0151J3993J8652K4551L2420M2446N3829O5584P7511Q9826
$$ y = [1497468, 1492689, 1483791, 1471348, 1456521, 1440859, 1425622, 1411419, 1398782, 1388886, 1383206, 1382422, 1386160, 1393886, 1405416, 1420373, 1438045, 1458357, 1482297, 1510609, 1542709, 1577668, 1615675, 1657464, 1702691, 1749970, 1798120, 1846166, 1892270, 1934110, 1970554, 2001738, 2027168, 2045048, 2054044, 2054605, 2047804, 2033796, 2012230, 1983595, 1949406, 1911498, 1871720, 1831819, 1793057, 1756259, 1722591, 1693771, 1671111, 1654865, 1644890, 1641330, 1644166, 1652915, 1667486, 1688729, 1717268, 1752344, 1792733, 1838344, 1889705, 1945948, 2004459, 2062771, 2120005, 2176242, 2231411, 2285229, 2337462, 2387450, 2433577, 2473834, 2506833, 2531986, 2548870, 2557092, 2557065, 2550689, 2540941, 2530728, 2522099, 2516247, 2513767, 2514718, 2518782, 2525743, 2535894, 2549887, 2568539, 2593090, 2625510, 2667956, 2721785, 2787369, 2864880, 2954706]
60121B954706J01984J12530J20232J24976J27330J27512J25041J19398J10743
60112D024452R9783Q6892P1768N4226L5055J5494l980k3655m3395o2196p9098
60101D175346r3791j05983j14981j20476j23074j23577j22101j18412j12535j04578
60091C035838r4548q2867p0509n8091m5360l2202j9401p681L325J4157K4135L1913
60079B698709L7050L9972M0630L8381L3281K6441J8919J0949K409o599j5675k4134
60067B900333l1073l6035l9561m2654m5850m9133n2323n4839n5528n3716n0204
60056B389417m6461m2853l8490l2639k5507j7738r957k656M275J1848K0970L1164
60044B241373M1129N0443N9835O9835Q0089R0008R9120J06599J11381J12815J10436
$$ y = [2954706, 3056690, 3169220, 3289452, 3414428, 3541758, 3669270, 3794311, 3913709, 4024452, 4124235, 4211127, 4282895, 4337121, 4372176, 4387670, 4383690, 4360035, 4316640, 4254444, 4175346, 4081555, 3975572, 3860591, 3740115, 3617041, 3493464, 3371363, 3252951, 3140416, 3035838, 2941290, 2858423, 2787914, 2729823, 2684463, 2652261, 2632860, 2625179, 2628504, 2642661, 2666796, 2698709, 2735759, 2775731, 2816361, 2854742, 2888023, 2914464, 2933383, 2944332, 2946741, 2940142, 2924467, 2900333, 2869260, 2833225, 2793664, 2751010, 2705160, 2656027, 2603704, 2548865, 2493337, 2439621, 2389417, 2342956, 2300103, 2261613, 2228974, 2203467, 2185729, 2175772, 2173116, 2177391, 2189239, 2210209, 2241373, 2282502, 2332945, 2392780, 2462615, 2542704, 2632712, 2731832, 2838431, 2949812, 3062627, 3173063]
60033C173063J03200R0078P1704N0409K8251N868j6540l8127n7759p4675q8306
60022C247166r8219j04678j08570j10292j09393j05646r9752r2582q4364p5173
60012B258497o5539n5967m6407l6713k7268j8612j0804l559L352J0196J7377K5068
60000B049621L2967M0697M8162N5238O1476O6333O9458P0535O9125O4871N7718
59989B686201M8003L6611K4903J3911L503p217j8689l0473m1916n2517o1546o7986
59977B532788p1148p1043o8162o3226n7075n0186m2356l3360k3681j4011m325
59966B034215N668J5463K4179L1953L9668M7378N4201N9935O5366P0638P4654
59955B523318P6587P6749P5311P1428O4398N4674M3023K9808J5868K907q072j7630
$$ y = [3173063, 3276263, 3366341, 3438045, 3488454, 3516705, 3522573, 3506033, 3467906, 3410147, 3335472, 3247166, 3148947, 3044269, 2935699, 2825407, 2716014, 2610368, 2510616, 2418034, 2333670, 2258497, 2192958, 2136991, 2090584, 2053871, 2026603, 2007991, 1997187, 1993628, 1996980, 2007176, 2024553, 2049621, 2082588, 2123285, 2171447, 2226685, 2288161, 2354494, 2423952, 2494487, 2563612, 2628483, 2686201, 2734204, 2770815, 2795718, 2809629, 2813132, 2805915, 2787226, 2756753, 2714837, 2662320, 2600774, 2532788, 2461640, 2390597, 2322435, 2259209, 2202134, 2151948, 2109592, 2076232, 2052551, 2038540, 2034215, 2039883, 2055346, 2079525, 2111478, 2151146, 2198524, 2252725, 2312660, 2378026, 2448664, 2523318, 2599905, 2676654, 2751965, 2823393, 2887791, 2942465, 2985488, 3015296, 3031164, 3034071, 3025999, 3008369]
59943C008369k6165l2300l4367l2641k8718k3218j5507n352O562J9580L3462M7936
59931B917641O2842P8553R5179J11587J26213J38718J49697J58741J63935J63350
59921D166456J56058J41618J19711R0845N6663J9228j9439n6988r0823j19090
59911D464239j41107j56657j65531j68133j65776j59740j50386j37779j22866
59902C096264j07397r2659p8712o4958n1156l7675k4927j2830r87J0773K2237
59891B657973L3210M3736N3760O2680O9516P3522P4567P2927O8661O1151M9525
59880C321228L3804J5447l751k3070m2499o1135p7000q8869r7287j03224j06567
59869B767077j06880j04999j02699j00928r9244r6949r3870q9975q5007p8863
$$ y = [3008369, 2982204, 2949904, 2915537, 2882896, 2854178, 2830960, 2815453, 2810101, 2816663, 2836243, 2869705, 2917641, 2980483, 3059036, 3154215, 3265802, 3392015, 3530733, 3680430, 3839171, 4003106, 4166456, 4322514, 4464132, 4583843, 4674688, 4731351, 4750579, 4731140, 4674152, 4583329, 4464239, 4323132, 4166475, 4000944, 3832811, 3667035, 3507295, 3356909, 3219130, 3096264, 2988867, 2896208, 2817496, 2752538, 2701382, 2663707, 2638780, 2625950, 2624963, 2635736, 2657973, 2691183, 2734919, 2788679, 2851359, 2920875, 2994397, 3068964, 3141891, 3210552, 3271703, 3321228, 3355032, 3370479, 3366728, 3343658, 3301159, 3240024, 3163024, 3074155, 2976868, 2873644, 2767077, 2660197, 2555198, 2452499, 2351571, 2252327, 2155378, 2061508, 1971533, 1886526, 1807663]
59859A807663p1811o4138n5923m7336l8779l0657k3236j6688j1009o004j673J514
59847A441923L140L566L777M508N825P474R217J0965J2957J5710J9356K3107K5851
59834A587376K7150K7176K5749K2156J6164Q565M18p827j5981k3275k8505l1101
59822A608065l1772l1777l1757l1489l0802l0274l0486l0861k9975k7308k3958
59811A277606k1117j8370j4337q651k494K918P481J1707J5733J9393K2813K6433
59799A319115L0416L4335L7500L9496M0282L9586L6310K9085J8079N957l600q524
59787A618037r140o587j458N460J2007J5483J4942J2123R917J0271J3627J9674
59775A714356K8028L8263M9926O2687P6320R0500J04872J19288J33567J46680
$$ y = [1807663, 1735852, 1671714, 1615791, 1568455, 1529676, 1499019, 1475783, 1459095, 1448086, 1442082, 1440409, 1441923, 1445063, 1448629, 1452406, 1456914, 1462739, 1470213, 1479430, 1490395, 1503352, 1519062, 1538418, 1561525, 1587376, 1614526, 1641702, 1667451, 1689607, 1705771, 1714336, 1714754, 1706927, 1690946, 1667671, 1639166, 1608065, 1576293, 1544516, 1512759, 1481270, 1450468, 1420194, 1389708, 1358847, 1328872, 1301564, 1277606, 1256489, 1238119, 1223782, 1215131, 1212637, 1215555, 1223036, 1234743, 1250476, 1269869, 1292682, 1319115, 1349531, 1383866, 1421366, 1460862, 1501144, 1540730, 1577040, 1606125, 1624204, 1630161, 1626561, 1618037, 1608897, 1602310, 1600852, 1606312, 1618319, 1633802, 1648744, 1660867, 1670784, 1681055, 1694682, 1714356, 1742384, 1780647, 1830573, 1893260, 1969580, 2060080, 2164952, 2284240, 2417807, 2564487]
59765B564487J56275J59013J51204J29637R3253M5188p300n6080r5801j24472
59755C015404j41622j47480j43948j34571j22446j08713r3679p8514o4903n3516
59745A926012m3753l4856k6501j8448j0432k585M607J0853J6392K1761K7515L4000
59733A904565M1102M8316N5335O2454P0139P8408Q6988R5858J05325J15649J26944
59722B791083J39329J52887J67551J83171J99596K16447K33073K48774K62835
59713D594746K74101K80991K82304K77833K67969K53270K34909K15162J96819
59704F878104J82060J72071J67233J67235J71164J77820J85622J92113J94357
59695H487779J90567J80796J65458J43907J15537Q1829M5987J0551k3478n5074
$$ y = [2564487, 2720762, 2879775, 3030979, 3160616, 3253869, 3299057, 3291757, 3235677, 3139876, 3015404, 2873782, 2726302, 2582354, 2447783, 2325337, 2216624, 2122945, 2044431, 1979528, 1926012, 1882259, 1847403, 1820902, 1802454, 1792022, 1789437, 1794044, 1804897, 1821289, 1843050, 1870565, 1904565, 1945667, 1993983, 2049318, 2111772, 2181911, 2260319, 2347307, 2443165, 2548490, 2664139, 2791083, 2930412, 3083299, 3250850, 3434021, 3633617, 3850064, 4083137, 4331911, 4594746, 4868847, 5149838, 5432142, 5709975, 5977944, 6231214, 6466123, 6681285, 6878104, 7060164, 7232235, 7399468, 7566703, 7737867, 7915687, 8101309, 8293422, 8487779, 8678346, 8859142, 9024600, 9168507, 9284044, 9365873, 9411860, 9422411, 9398933, 9343859]
59685I343859q2052j02061j14059j18305j15519j06425r1658p1703m7187j9312
59675H475578J0477M1459P3861J07997J43626J80265K17478K54539K90138L22669
59665A0118087L50270L70400L79809L75433L55083L17264K61003J86605R6615
59656A2810569m137j09224k11399l03532l79820m36716m72960m89144m87361m70802
59646I445474m42982m07134l66288l23696k82882k47365k20618k06068k06348
59637F742093k21576k47874k77983l04174l21398l28123l24835l12627k93349
59628D110154k69964k45466k21378j97905j75365j54680j36458j20458j06238
59619B482242r3668q2492p2082o2196n3413m6271m0309l4575k8949k4290k1234
$$ y = [9343859, 9261807, 9159746, 9045687, 8927382, 8811863, 8705438, 8613780, 8542077, 8494890, 8475578, 8486055, 8527514, 8601375, 8709372, 8852998, 9033263, 9250741, 9505280, 9795418, 10118087, 10468357, 10838757, 11218566, 11593999, 11949082, 12266346, 12527349, 12713954, 12810569, 12806432, 12697208, 12485809, 12182277, 11802457, 11365741, 10892781, 10403637, 9916276, 9445474, 9002492, 8595358, 8229070, 7905374, 7622492, 7375127, 7154509, 6948441, 6742093, 6520517, 6272643, 5994660, 5690486, 5369088, 5040965, 4716130, 4403503, 4110154, 3840190, 3594724, 3373346, 3175441, 3000076, 2845396, 2708938, 2588480, 2482242, 2388574, 2306082, 2234000, 2171804, 2118391, 2072120, 2031811, 1997236, 1968287, 1943997, 1922763]
59608A922763j9334j7570j5490j3649j3055j4256j6886k0041k2979k5493k7684
59597A716326k9604l1251l2658l3781l4321l3897l2450l0403k8323k6394k4379
59586A378865k2091j9841j8106j6785j5092j2421r141o183l952j929N32L300N606
59573A262762O976P816Q900J0405J1681J2190J2316J2893J4044J5075J5494J5629
59561A406181J6003J6789J8135K0417K3588K6831K9486L2002L5243L9200M3196
59550A707071M7177N1872N7600O3817O9981P6082Q2040Q7406R2155R7023J02404
59539B534628J07331J10247J10608J08982J05769J00631R3578Q5921P9308P3499
59529C510502O5631N2358L3084J0957r461k5331l6478m3983m8716n1176n1783
$$ y = [1922763, 1903429, 1885859, 1870369, 1856720, 1843665, 1829409, 1812523, 1792482, 1769503, 1744010, 1716326, 1686722, 1655471, 1622813, 1589032, 1554711, 1520814, 1488364, 1457961, 1429638, 1403244, 1378865, 1356774, 1336933, 1318827, 1302042, 1286950, 1274529, 1265388, 1259205, 1255253, 1253324, 1253856, 1257156, 1262762, 1269738, 1277554, 1286454, 1296859, 1308540, 1320730, 1333046, 1345939, 1359983, 1375058, 1390552, 1406181, 1422184, 1438973, 1457108, 1477525, 1501113, 1527944, 1557430, 1589432, 1624675, 1663875, 1707071, 1754248, 1806120, 1863720, 1927537, 1997518, 2073600, 2155640, 2243046, 2335201, 2432224, 2534628, 2641959, 2752206, 2862814, 2971796, 3077565, 3178196, 3271774, 3357695, 3437003, 3510502, 3576133, 3628491, 3661575, 3672532, 3663071, 3637740, 3601262, 3557279, 3508563, 3457387, 3405604]
59518C405604n0637m7237m0971l1867k0624p909O187K1873L8984N6642P3568Q8614
59506C492227J00896J09513J13286J10998J01828Q5678O3285L6000N308k7542
59496D191477o1229r3758j22677j46098j63253j73924j77941j75692j68616j58530
59486B749759j46557j33177j19050j05007r1319p7729o4418n2261m1818l2564
59476A885859k3556j4492n750K407J0160J7713K5083L2412M0169M8643N7356O5388
59464B141392P2400P8925Q5413R1257R5255R6751R5744R1986Q4780P3820N9631
59453C067354M2839K3659K513j9362m0369n9319p5452q8199r7468j03746j07535
59442B544915j08939j08108j05561j01620r6044q8799q0759p3035o5923n9073
$$ y = [3405604, 3354967, 3307730, 3266759, 3234892, 3214268, 3206359, 3212546, 3234419, 3273403, 3330045, 3403613, 3492227, 3593123, 3702636, 3815922, 3926920, 4028748, 4114426, 4177711, 4213711, 4219019, 4191477, 4130248, 4036490, 3913813, 3767715, 3604462, 3430538, 3252597, 3076905, 2908289, 2749759, 2603202, 2470025, 2350975, 2245968, 2154649, 2076920, 2012502, 1960241, 1918423, 1885859, 1862303, 1847811, 1842061, 1844468, 1854628, 1872341, 1897424, 1929836, 1970005, 2018648, 2076004, 2141392, 2213792, 2292717, 2378130, 2469387, 2564642, 2661393, 2757137, 2849123, 2933903, 3007723, 3067354, 3110193, 3133852, 3136365, 3117003, 3076634, 3017315, 2941863, 2853664, 2756196, 2652450, 2544915, 2435976, 2327868, 2222307, 2120687, 2024643, 1935844, 1855085, 1782050, 1716127, 1657054]
59432A657054n2356m6002m0219l5112l0707k6532k1775j6407j1561q099n393k324
59420A360567J121M200O830R533J2348J5016J7933K1774K6224L0133L3070L5863
59408A574612L9652M4944N1017N5308N4244M6436L5041K5397K0403J9379K0997
59397A987430K5171L1837M0084M9187N8647O6263O8294O3201N4133M6274M2549
59386B533070M2874M6311N2092N9112O6129P2695P9102Q5544R1999R8523J04897
59375C332348J10412J14758J18756J23468J28990J34912J41582J50078J61052
59366D516356J74167J88399K02338K14473K23752K29576K30940K26318K15181
59357F421500J99149J80778J61612J42176J23402J06765R3050Q1802P2118O3271
$$ y = [1657054, 1604698, 1558696, 1518477, 1483365, 1452658, 1426126, 1404351, 1387944, 1376383, 1368284, 1362891, 1360567, 1361688, 1365888, 1372718, 1382251, 1394599, 1409615, 1427548, 1449322, 1475546, 1505679, 1538749, 1574612, 1614264, 1659208, 1710225, 1765533, 1819777, 1866213, 1901254, 1926651, 1947054, 1966433, 1987430, 2012601, 2044438, 2084522, 2133709, 2192356, 2258619, 2326913, 2390114, 2444247, 2490521, 2533070, 2575944, 2622255, 2674347, 2733459, 2799588, 2872283, 2951385, 3036929, 3128928, 3227451, 3332348, 3442760, 3557518, 3676274, 3799742, 3928732, 4063644, 4205226, 4355304, 4516356, 4690523, 4878922, 5081260, 5295733, 5519485, 5749061, 5980001, 6206319, 6421500, 6620649, 6801427, 6963039, 7105215, 7228617, 7335382, 7428432, 7510234, 7582352, 7645623]
59347G645623N4444M4461L2046J6045m442k9687n9006r1079j24461j57548j88332
59336G138064k14764k35362k49373k56635k57673k53590k45500k34214k20667
59327D970286k06129j91575j77298j63598j51434j41702j34235j28034j22368
59318C553913j17090j12217j07791j03986j00791r7699r4216r0500q7040q3878
59308B558705q0622p7039p3167o8952o4344n9619n5267n1558m8500m5954m3555
59297A890128m0748l7342l3822l0808k8428k6406k4382k1968j8878j5395j2149
59286A599802r140n557r60L991Q568J2960J7566K2006K5790K9413L3770L8856
59274A777065M4019M9181N4632N9763O3211O4461O4327O3599O1997N8761N3528
$$ y = [7645623, 7700067, 7744528, 7776574, 7792619, 7788177, 7758490, 7699484, 7608405, 7483944, 7326396, 7138064, 6923300, 6687938, 6438565, 6181930, 5924257, 5670667, 5425167, 5190953, 4970286, 4764157, 4572582, 4395284, 4231686, 4080252, 3938550, 3804315, 3676281, 3553913, 3436823, 3324606, 3216815, 3112829, 3012038, 2914339, 2820123, 2729623, 2642583, 2558705, 2478083, 2401044, 2327877, 2258925, 2194581, 2134962, 2079695, 2028137, 1979637, 1933683, 1890128, 1849380, 1812038, 1778216, 1747408, 1718980, 1692574, 1668192, 1646224, 1627346, 1611951, 1599802, 1590662, 1585105, 1584145, 1588136, 1596704, 1609664, 1627230, 1649236, 1675026, 1704439, 1738209, 1777065, 1821084, 1870265, 1924897, 1984660, 2047871, 2112332, 2176659, 2240258, 2302255, 2361016, 2414544]
59263B414544M6338L7370K6984J5696L968p652j8291k7080l3763l8472m1038m1091
59251B337513l8796l4889k9898k3857j6807r068r55P399J6070K5637L6902M9203
59239B318454N8910O0907N2575L6277J7803K716n974p829l997L657J3160K2875
59227B569534L1726L9321M5913N2074N8346O5003P1925P8545Q4302Q9381R4738
59216C280808J01064J08110J15371J23029J31604J40928J50058J58065J64277
59207D473314J67728J66985J60657J47802J28028J01648O9802L4017m280m3611
59197E402090q2063j17554j48336j72964j90167j99420k01334j97050j87421j73507
59187C732274j57374j41317j26166j11177r5853q1095o8312n7941m9328m1737
$$ y = [2414544, 2460882, 2498252, 2525236, 2540932, 2544900, 2537248, 2518957, 2491877, 2458114, 2419642, 2378604, 2337513, 2298717, 2263828, 2233930, 2210073, 2193266, 2184198, 2183243, 2190642, 2206712, 2232349, 2269251, 2318454, 2377364, 2438271, 2490846, 2527123, 2544926, 2547642, 2541668, 2533839, 2529842, 2533499, 2546659, 2569534, 2601260, 2640581, 2686494, 2738568, 2796914, 2861917, 2933842, 3012387, 3096689, 3186070, 3280808, 3381872, 3489982, 3605353, 3728382, 3859986, 4000914, 4150972, 4309037, 4473314, 4641042, 4808027, 4968684, 5116486, 5244514, 5346162, 5415964, 5449981, 5445701, 5402090, 5320027, 5202473, 5054137, 4881173, 4691006, 4491586, 4290252, 4093202, 3905781, 3732274, 3574900, 3433583, 3307417, 3196240, 3100387, 3019292, 2950980, 2893039, 2843711, 2801974]
59177B801974l5250l0671k8621k8553k8995k8949k8744k9156l0144l1117l2035
59166B469739l3446l5567l8069m0685m3365m5921m8150n0233n2326n3959n4518
59155A973500n4240n3961n3991n3945n3531n2719n1262m8918m6074m3285m0357
59144A421217l6802l3068l0162k8071k5776k2897k0121j7758j5173j2097r255
59133A170037p146n287l296j643n93N47K385M542O579Q896J1905J5093J7847K0460
59119A240326K3371K6077K7881K9103L0557L2214L3419L4131L4932L6054L7268
59108A585333L8571M0038M1100M0843L9114L6573L3731L0579K7321K4734K3739
59097A961676K4949K8551L4091M0426M6412N1573N5638N7655N6338N1158M2522
$$ y = [2801974, 2766724, 2736053, 2707432, 2678879, 2649884, 2620935, 2592191, 2563035, 2532891, 2501774, 2469739, 2436293, 2400726, 2362657, 2321972, 2278607, 2232686, 2184536, 2134303, 2081977, 2028018, 1973500, 1919260, 1865299, 1811308, 1757363, 1703832, 1651113, 1599851, 1550933, 1504859, 1461574, 1421217, 1384415, 1351347, 1321185, 1293114, 1267338, 1244441, 1224320, 1206562, 1191389, 1179292, 1170037, 1162891, 1157604, 1154308, 1152665, 1152072, 1152619, 1155004, 1159546, 1166125, 1175021, 1186926, 1202019, 1219866, 1240326, 1263697, 1289774, 1317655, 1346758, 1377315, 1409529, 1442948, 1477079, 1512011, 1548065, 1585333, 1623904, 1663942, 1705042, 1745885, 1784999, 1821572, 1855303, 1885882, 1913203, 1937937, 1961676, 1986625, 2015176, 2049267, 2089693, 2136105, 2187678, 2243316, 2300971, 2357309, 2408467, 2450989]
59086B450989L0794J5923j725k0778l9425n6317p0792q2607r1666r7746j00459
59075A936191r9719r6326r1646q6629q1281p5202o8394o1468n5206m9907m5103
59064A125310m0008l4489k9465k6025k4293k3339k2062j9881j6825j3474j0756
59053H64693r218q365p157n295l632l080l434l574k723j258j73J15K95J332L306
59038H21832N495P648J0468J4399J8615K2000K4662K7396K9806L0281K8193K4905
59026A065700K2005J9511J6750J4062J2387J1528J0198P785N005K612N50j211
59014A186882j999j189R49L686O677R886J3147J6295J9385K2263K4357K5244K5004
59001A350587K3462J9595J2557K971p472j7484k6568l4295m0185m4240m6749m7543
$$ y = [2450989, 2481783, 2497706, 2495981, 2475203, 2435778, 2379461, 2308669, 2226062, 2134396, 2036650, 1936191, 1836472, 1740146, 1648500, 1561871, 1480590, 1405388, 1336994, 1275526, 1220320, 1170413, 1125310, 1085302, 1050813, 1021348, 995323, 971030, 947691, 925629, 905748, 888923, 875449, 864693, 855475, 847110, 839953, 834658, 831026, 827946, 824512, 820938, 818215, 816957, 816784, 816899, 817194, 818526, 821832, 827327, 834975, 845443, 859842, 878457, 900457, 925119, 952515, 982321, 1012602, 1040795, 1065700, 1087705, 1107216, 1123966, 1138028, 1150415, 1161943, 1172141, 1179926, 1184931, 1187543, 1188093, 1186882, 1184883, 1183694, 1184643, 1188329, 1195006, 1204892, 1218039, 1234334, 1253719, 1275982, 1300339, 1325583, 1350587, 1374049, 1393644, 1406201, 1409172, 1401700, 1384216, 1357648, 1323353, 1283168, 1238928, 1192179, 1144636]
58989A144636m6252m3241l9347l4813k9478k4125k0262j8182j6377j3531j0093
58978H48935p249n321l990l128k480j286P60K856M319N768Q073J0768J2714J3822
58964H84561J4809J5584J5284J3788J1837R661O782L424Q15l63p22r38o60O86
58950I74548K893N359P933J0711J3368J5346J6466J7044J7407J7599J7476J7029
58938A133179J6659J6968J8085J9448K0502K1399K2571K3993K5364K6795K8664
58927A373627L0961L3407L6037L9105M2597M6485N1124N6623O2021O6016O8451
58916A906454P0296P2355P4937P8667Q4407R2228J01363J11451J22920J35979
58906B851057J50156J65012J80398J95767K10183K23347K35824K47907K58918
$$ y = [1144636, 1098384, 1055143, 1015796, 980983, 951505, 927380, 907118, 888936, 872559, 859028, 848935, 841686, 836365, 832375, 829247, 826767, 825481, 826241, 829097, 833416, 839184, 847257, 858025, 870739, 884561, 899370, 914954, 930238, 944026, 955863, 965524, 972306, 975730, 976545, 976182, 975460, 974522, 973862, 974548, 977441, 982800, 990733, 1001444, 1014812, 1030158, 1046624, 1063668, 1081075, 1098674, 1116150, 1133179, 1149838, 1166806, 1184891, 1204339, 1224841, 1246240, 1268811, 1292804, 1318168, 1344963, 1373627, 1404588, 1437995, 1474032, 1513137, 1555734, 1602219, 1653343, 1709966, 1771987, 1838003, 1906454, 1976750, 2049105, 2124042, 2202709, 2287116, 2379344, 2480707, 2592158, 2715078, 2851057, 3001213, 3166225, 3346623, 3542390, 3752573, 3975920, 4211744, 4459651, 4718569]
58897D718569K67726K73028K73050K66046K51481K29819K01005J64302J19997
58888F765023P0109J7017l7391r0675j39435j80968k14545k40271k57799k67090
58878E423975k69464k66648k59459k48495k35357k21942k08925j95987j83224
58869C334474j71205j59942j48822j37584j26561j15989j05856r6323q7761q0416
58859B104015p4470p0142o7238o4909o2385n9583n6556n2863m8220m3334l9195
58848A465120l5776l2218k8083k3688j9341j5066j1095p925n727m173k803j185
58836A278040J101M117P217R562J1059J2403J4294J6917K0072K3402K6557K9457
58824A454198L2351L5411L8460M1409M4642M8594N3046N7265O0828O4087O7813
$$ y = [4718569, 4986295, 5259323, 5532373, 5798419, 6049900, 6279719, 6480724, 6645026, 6765023, 6835132, 6852149, 6814758, 6724083, 6584648, 6403680, 6189135, 5948864, 5691065, 5423975, 5154511, 4887863, 4628404, 4379909, 4144552, 3922610, 3713685, 3517698, 3334474, 3163269, 3003327, 2854505, 2716921, 2590360, 2474371, 2368515, 2272192, 2184431, 2104015, 2029545, 1959403, 1892165, 1827256, 1764871, 1705288, 1648732, 1595869, 1547649, 1504315, 1465120, 1429344, 1397126, 1369043, 1345355, 1326014, 1310948, 1299853, 1291928, 1286201, 1282028, 1279225, 1278040, 1279141, 1283258, 1290475, 1300037, 1311096, 1323499, 1337793, 1354710, 1374782, 1398184, 1424741, 1454198, 1486549, 1521960, 1560420, 1601829, 1646471, 1695065, 1748111, 1805376, 1866204, 1930291, 1998104]
58813A998104P2557P8246Q4339R0529R7255J05284J14858J25563J37014J49117
58803C052866J61692J74487J87678K01602K15796K28945K40050K48868K54860
58794D966844K56571K52536K42103K24774J99503J65592J23869P6311K4911k8388
58784F504626q0987j29782j72255k07103k33985k52979k64287k68317k66046k59149
58774D369736k49199k36989k23113k09029j96412j85325j74115j61600j48425
58765B585529j35806j24041j12966j02847r3879q5470p7064o9205o2968n8524
58755A662759n4860n0627m5085l8608l2555k8008k4483k0559j5849j1296p367
58744A333462l355J132N403R112J3025J7461K1288K3360K3669K2036J7255Q992
$$ y = [1998104, 2070661, 2148907, 2233246, 2323775, 2421030, 2526314, 2641172, 2766735, 2903749, 3052866, 3214558, 3389045, 3576723, 3778325, 3994121, 4223066, 4463116, 4711984, 4966844, 5223415, 5475951, 5718054, 5942828, 6142331, 6307923, 6431792, 6508103, 6533014, 6504626, 6423639, 6293857, 6121602, 5914499, 5680514, 5427535, 5163248, 4894931, 4628885, 4369736, 4120537, 3883548, 3660435, 3451406, 3254994, 3069669, 2895554, 2733954, 2585529, 2449723, 2325682, 2212716, 2109869, 2015990, 1930520, 1853456, 1784251, 1721283, 1662759, 1607899, 1557272, 1512187, 1473579, 1441024, 1413016, 1388533, 1367974, 1352125, 1340829, 1333462, 1330107, 1331239, 1336642, 1345754, 1358779, 1376240, 1397528, 1420888, 1444557, 1466593, 1483848, 1492840]
58732A492840q42j0013j8093k5134k9694l0285k7895k4978k2540k0119j8016j7439
58720A247792j8723k1229k4787k9423l3985l6959l8502l9885m1095m0877l9061
58709H83266l6772l4304l0851k6657k3333k1406j9448j6428j3260j1113r578p578
58697F32538m955k291k2J594K379K636K821K500N46l156p091r660j0632j0769
58683E96438j0741j0767j0581r546p336m585k193j58K150M752P042Q796J0111
58670E73382J0644J0105R404R843J1176J1785J0893R257P598N761L639J489r26
58657F74050m116p507r680j0355j0791j1857j3065j3851j4398j4650j4010j2587
58645E37183j1363j0538r076o556m037k325p65J322L303M323M643M898M957M491
$$ y = [1492840, 1491998, 1481985, 1463892, 1438758, 1409064, 1378779, 1350884, 1325906, 1303366, 1283247, 1265231, 1247792, 1229069, 1207840, 1183053, 1153630, 1119645, 1082686, 1044184, 1004299, 963204, 922327, 883266, 846494, 812190, 781339, 754682, 731349, 709943, 690495, 674067, 660807, 649694, 640116, 632538, 627583, 625292, 625270, 626864, 629243, 631879, 634700, 637200, 637746, 634590, 627499, 617839, 607207, 596438, 585697, 574930, 564349, 554803, 547467, 542882, 540689, 540531, 542681, 547433, 554475, 563271, 573382, 584026, 594131, 603535, 613378, 624554, 636339, 647232, 656489, 664087, 669848, 673487, 674976, 674050, 669934, 662427, 652747, 642392, 631601, 619744, 606679, 592828, 578430, 563780, 549770, 537183, 525820, 515282, 506206, 499650, 495613, 493288, 492523, 493845, 497148, 501471, 506114, 511012, 515969, 520460]
58631E20460L837L437L195L124L778N370P268R002J0830J2731J3872J3831J3495
58618F24230J3955J5348J7350J9888K2699K5165K7340L0179L4046L7914M0830
58607I08944M3206M5951M9251N3085N7840O3518O9190P4103P8452Q2179Q3946
58596A609665Q2400P7586P0139N9774M5843K8757R918r348k7912m4454n7871o7754
58584A776743p3927p6231p5318p2750o9411o4610n7531m8786l9559l0214k0879
58573A147527j2675o886l280m43K451N267P979J0990J4410J7921K1473K5400K9731
58560A259865L3682L5656L3588K5952J3066k907j9592l5541m9573o0054o5751
58549A168391o6939o4890o0720n5311m9668m4479l9572l4541k9625k5448k2211
$$ y = [520460, 524297, 527734, 530929, 534053, 537831, 543201, 550469, 559471, 570301, 583032, 596904, 610735, 624230, 638185, 653533, 670883, 690771, 713470, 738635, 765975, 796154, 830200, 868114, 908944, 952150, 998101, 1047352, 1100437, 1158277, 1221795, 1290985, 1365088, 1443540, 1525719, 1609665, 1692065, 1769651, 1839790, 1899564, 1945407, 1974164, 1984082, 1974734, 1946822, 1902368, 1844497, 1776743, 1702816, 1626585, 1551267, 1478517, 1409106, 1344496, 1286965, 1238179, 1198620, 1168406, 1147527, 1134852, 1127966, 1124686, 1124243, 1126694, 1131961, 1139940, 1150930, 1165340, 1183261, 1204734, 1230134, 1259865, 1293547, 1329203, 1362791, 1388743, 1401809, 1398902, 1379310, 1343769, 1294196, 1234142, 1168391, 1101452, 1036562, 975842, 920531, 870863, 826384, 786812, 752271, 722646, 697198, 674987]
58538F74987j9625j7379j5259j3198j1435j0250r390q388p449p203p467p259o239
58525E34446n062m067k923j952k255l830m998m646l691l231k697j154P89J942
58511D96671K502L433M565M917M561M714N989P686Q790Q842Q033P041O603O733
58497E81080O838O852P484Q963J0582J2092J4309J7545K0728K3094K5403K8149
58485G63119K9790K8414K4351J9524J4918J0237N517J257k757p402j2879j8562
58473H55527k3822k8107l0566l0743k9349k7450k5292k2754k0268j8248j6232
58462E82696j3745j1356r799q652p100n418m431l958l119j835p81j46M76J217
58448E14049J973K895M026M817M876M729M999N485N843O431P549Q688R464J0396
$$ y = [674987, 655362, 637983, 622724, 609526, 598091, 587841, 578451, 570063, 562614, 555411, 547944, 540685, 534446, 529384, 525317, 522394, 520442, 518187, 514357, 509359, 504713, 501022, 497791, 495094, 493940, 494729, 496671, 499173, 502606, 507171, 512088, 516649, 521363, 527352, 535038, 543828, 552670, 560703, 567744, 574347, 581080, 587918, 594770, 602254, 611217, 621799, 633891, 648200, 665745, 686473, 709567, 734970, 763119, 792909, 821323, 845674, 865198, 880116, 890353, 895870, 897127, 894370, 886968, 874089, 855527, 831705, 803598, 773032, 742289, 712940, 685490, 660198, 637444, 617176, 598928, 582696, 568951, 557595, 547796, 539144, 532044, 526626, 522195, 518237, 515118, 513283, 512502, 512356, 512832, 514049, 516022, 518917, 522943, 527760, 532636, 537365, 542364, 547849, 553692, 560123, 567672, 576360, 585824, 596220]
58434E96220J1809J3004J3620J4651J6659J8093J6919J3165Q306L158k052o379
58422G17173q883j0118j1226j2069j1697j0153q247o228m077k432j638o20J736
58409F31521M739P030Q623J0266J1677J2358J3223J5327J7614J7995J6169J3393
58397G79935J0138O005J442k573o103r474j1553j1020q846p181o159m194j167
58384G29250J220K349L570N951R139J2586J6115J9169K1201K2475K2786K0049
58372H85860J2464J760p955j4307j7559j8094j5887j2337r750q496o877m122j283
58359G83417R25K989N033O607Q081J0241J2484J3498J3637J4420J5859J6704J7008
58346I20903J7870J8791J7993J5416J2771J0524P540L841R21r39k978n218o074
$$ y = [596220, 608029, 621033, 634653, 649304, 665963, 684056, 700975, 714140, 722446, 725604, 723552, 717173, 708290, 698172, 686946, 674877, 663180, 653027, 644780, 638552, 634475, 632043, 630405, 629785, 631521, 636260, 643290, 651913, 662179, 673856, 686214, 699437, 714764, 732378, 750373, 766542, 779935, 790073, 796078, 797520, 794947, 788844, 779370, 767817, 756797, 747951, 740770, 734611, 730417, 729250, 730470, 732819, 736389, 742340, 751479, 764065, 780180, 799349, 820550, 843025, 865811, 885860, 898324, 900084, 892129, 877822, 860263, 842169, 826282, 813945, 804195, 795699, 788822, 784700, 783417, 784342, 787331, 792364, 798971, 807052, 817293, 829777, 843275, 856912, 871332, 887191, 903895, 920903, 938773, 957564, 975557, 990973, 1003744, 1014268, 1021808, 1025649, 1026570, 1025631, 1022653, 1017435, 1011361]
58333A011361n087l514k012j53J649K468L106N218Q212R971J0596J2264J5236
58320A069315J7404J8160J9262K1286K2605K2666K3008K4189K4887K4731K5046
58309A312559K5956K5832K4208K2231J9839J5733J0647P202O004N184M162M239
58297A483796N230N466N542P917J2230J5305J6443J8172K1038K2541K2344K3495
58285A659519K6918K9654L0376L1830L5671L9563M1631M3413M6209M8753N0596
58274B084133N3636N8364O2742O6312P0822P5421P6244P2477O7420O1890N2399
58263B801860L8199K4320J4887Q985N508O106J0535J5114J8834K5081L4559M2872
58251C046860M8124N4154O3004P1030P6135Q1682Q9348R5420R8314J02398J09881
$$ y = [1011361, 1006274, 1002760, 1000748, 1000595, 1002244, 1004712, 1007818, 1013036, 1021248, 1031219, 1041815, 1054079, 1069315, 1086719, 1104879, 1124141, 1145427, 1168032, 1190698, 1213706, 1237895, 1262782, 1287513, 1312559, 1338515, 1364347, 1388555, 1410786, 1430625, 1446358, 1457005, 1464207, 1470211, 1475395, 1479557, 1483796, 1489026, 1494492, 1500034, 1507951, 1520181, 1535486, 1551929, 1570101, 1591139, 1613680, 1636024, 1659519, 1686437, 1716091, 1746467, 1778297, 1813968, 1853531, 1895162, 1938575, 1984784, 2033537, 2084133, 2137769, 2196133, 2258875, 2325187, 2396009, 2471430, 2547674, 2620151, 2687571, 2749461, 2801860, 2840059, 2864379, 2879266, 2888251, 2893759, 2899865, 2910400, 2925514, 2944348, 2969429, 3003988, 3046860, 3094984, 3149138, 3212142, 3283172, 3359307, 3440989, 3530337, 3625757, 3724071, 3826469, 3936350]
58240C936350J16560J20178J25189J34312J43372J49634J57014J67793J77821
58231E228223J85557J96764K14266K32370K47694K65669K89665L14076L35430
58222G509714L59635L90689M23467M55587M94293N43153N94808O46159P07053
58213A2124558P84296Q72025R68573J086941J237439J417881J633089J902961
58205B2027763K235138K610843L015358L460712L961259M515421N136260N872626
58197E2835380O773230P859571R164308J0762744J2731268J5111519J7958743
58190A33196763K1394744K5575999L0610309L6372275M2034938M5535796M3860054
58183C78580878L4697689J8469969j242950j9577835l2990008m0442763m2758033
$$ y = [3936350, 4052910, 4173088, 4298277, 4432589, 4575961, 4725595, 4882609, 5050402, 5228223, 5413780, 5610544, 5824810, 6057180, 6304874, 6570543, 6860208, 7174284, 7509714, 7869349, 8260038, 8683505, 9139092, 9633385, 10176538, 10771346, 11417505, 12124558, 12908854, 13780879, 14749452, 15836393, 17073832, 18491713, 20124802, 22027763, 24262901, 26873744, 29889102, 33349814, 37311073, 41826494, 46962754, 52835380, 59608610, 67468181, 76632489, 87395233, 100126501, 115238020, 133196763, 154591507, 180167506, 210777815, 247150090, 289185028, 334720824, 378580878, 413278567, 431748536, 430505586, 410927751, 377937743, 337494980, 294736947]
58176B94736947m1393750l7761401l3056254k8158609k3564521j9487907j6021714
58169I5292791j3178493j0875875q999923p481463o275014n308519m509948l852825
58161C4810731l327885k897692k521303k195258j928321j700870j487439j293922
58153A7458041j134287r93936q52454p19041o09168n09033l99395k92388k08491
58144A1739848j38693o5274L019N4260J09059J93571K98715M06161N31898P01548
58134A3834112R06603J131508J400203J746139K161633K632260L197635L925900
58126C0935993M866616O077406P575665R058750R694254Q493923N158612N35126
58118H2396345l896828p015191q558612q861665q366649p419198o294402n198546
$$ y = [294736947, 253343197, 215581796, 182525542, 154366933, 130802412, 111314505, 95292791, 82114298, 71238423, 62238500, 54757037, 48482023, 43173504, 38663556, 34810731, 31482846, 28585154, 26063851, 23868593, 21940272, 20239402, 18751963, 17458041, 16323754, 15329818, 14477364, 13758323, 13149155, 12640122, 12240727, 11948339, 11739848, 11601155, 11535881, 11538900, 11593160, 11702219, 11895790, 12194505, 12600666, 13132564, 13834112, 14740715, 15872223, 17272426, 19018565, 21180198, 23812458, 27010093, 30935993, 35802609, 41880015, 49455680, 58514430, 68208684, 76702607, 81861219, 82396345, 78499517, 71484326, 62925714, 54064049, 45697400, 38278202, 31983800, 26785254]
58110B6785254m228815l401013k718214k183190j771937j444197j178038r68377
58102H891473q01922o60240n41020m53113l93883l49576l14234k91578k80417
58093D805490k72225k61916k49519k33029k09891j84055j62289j44544j25851
58084B962171j06345r2049q6788q9608r8647j11274j21577j23896j18731j10772
58074A902484j02145r2014q1344p2846o6680o0594n4120m8826m4737m0256l5414
58063A203508l1852k9653k7159k4069k1880k1208k0953k0296j9447j8600j7893
58052I50498j8025j9155j9741j8337j5995j4879j5044j4683j3202j1794j1138
58041G78505j0651j0191j0453j1307j1592j1017j0644j0941j0897r776q450q141
$$ y = [26785254, 22556439, 19155426, 16437212, 14254022, 12482085, 11037888, 9859850, 8891473, 8089551, 7429311, 6888291, 6435178, 6041295, 5691719, 5377485, 5085907, 4805490, 4533265, 4271349, 4021830, 3788801, 3578910, 3394855, 3232566, 3088022, 2962171, 2855826, 2763777, 2676989, 2587381, 2488734, 2377460, 2255883, 2131987, 2013256, 1902484, 1800339, 1708325, 1626981, 1554135, 1487455, 1426861, 1372741, 1323915, 1279178, 1238922, 1203508, 1171656, 1142003, 1114844, 1090775, 1068895, 1047687, 1026734, 1006438, 986991, 968391, 950498, 932473, 913318, 893577, 875240, 859245, 844366, 829322, 814639, 801437, 789643, 778505, 767854, 757663, 747210, 735903, 724311, 713294, 702650, 691709, 680812, 671036, 662586, 654445]
58029F54445q853r744j0216r927q536o289m367l869m670n781o625p361q104q439
58015E51664p874o486m830l337j962m71J110K515L551M228M702N316O611Q832
58001E63569J1453J3642J5216J6638J7953J8397J7467J5734J4005J2149R457N982
57989G31662K743N91n95j544k929n187q379j1937j4844j6401j6785j6804j7147
57976F22444j7817j7993j6604j3467r812p196n835m468k052J079M072O803R565
57963E48719J2007J3255J3003J1651R331N655O87m585r159j2862j5964j8395j9753
57950E33590j9742j8355j5940j3363j1533j0435r063o779m173k141o83Q13K499
57937D24695M116N718P613R720J1677J3394J4941J6098J6689J7132J7920J8726
$$ y = [654445, 645592, 635848, 625632, 615705, 607169, 600880, 596513, 592644, 587974, 582193, 575568, 568207, 560103, 551664, 543790, 537304, 532474, 529137, 527175, 526704, 527814, 530329, 533880, 538108, 542810, 548126, 554737, 563569, 575022, 588664, 603880, 620518, 638471, 656868, 674335, 690069, 704074, 716223, 725680, 731662, 734405, 734996, 734401, 732857, 729928, 724741, 716362, 704425, 689581, 673180, 656395, 639591, 622444, 604627, 586634, 570030, 556563, 546751, 539555, 533720, 529252, 527200, 528279, 532351, 539154, 548719, 560726, 573981, 586984, 598635, 607966, 613621, 614308, 609723, 600564, 587702, 571738, 553343, 533590, 513848, 495493, 479553, 466190, 454657, 444222, 435159, 428380, 424207, 422066, 421383, 422196, 424695, 428811, 434529, 442142, 451862, 463539, 476933, 491874, 507972, 524661, 541793, 559713, 578439]
57925E78439J8713J7469J4924J0803N139q49n678r325j2947j6833j9901k1555
57913E58399k2596k3731k4341k3547k1570j9273j7053j5011j3450j2477j1610
57902C53740j0548r799r844j0124r699q510p279o392n592m600l509k599k129k042
57888B61074j688l22J813L481L950M004M776O255P553Q259Q627Q740Q324P320
57874C32166N928M233K341P00l30j135k413m099n317n416m565l331k214j553j458
57859C13537j686j838j722j272k48J507L619N317O131O279O353O796P518P964
57845C58255P689O974O566O701O701N760L848J575n01k195l688n297p015q202
57831C77171q268p633p242p021n842l515j664j648k613k698j603m63L05J502L348
$$ y = [578439, 597152, 614621, 629545, 640348, 645487, 644638, 638960, 629635, 616688, 599855, 579954, 558399, 535803, 512072, 487731, 464184, 442614, 423341, 406288, 391277, 377827, 365350, 353740, 343192, 333393, 323549, 313425, 303726, 295216, 287937, 281545, 275953, 271353, 267844, 265245, 263116, 261074, 259386, 259064, 260877, 264358, 268308, 272312, 277088, 283343, 290896, 299155, 307782, 316522, 324846, 332166, 338094, 342327, 344668, 345368, 345038, 343903, 341490, 337391, 332074, 326658, 322093, 318762, 316548, 314995, 313537, 311851, 310013, 308291, 307019, 306771, 308278, 311897, 317214, 323345, 329624, 335977, 342773, 350291, 358255, 365944, 372918, 379484, 386185, 392886, 398646, 402494, 404069, 403568, 401373, 397685, 392388, 385373, 377171, 368903, 361270, 354028, 347007, 341165, 337650, 335986, 334338, 331725, 329027, 327424, 326961, 327266, 328768, 332116]
57816C32116M652M397L143K205K011J909J173l04k162l986n523o595p020o797
57802C19219o394o399o677o300m672k322j20J837L983O327Q416J0043J1316J2160
57788C40417J2463J2470J2482J2184J1007R017O769M403J569j628m356n850n980
57775D04967m874k577P37M509P909R995J0049Q159N327K584J36k178m088n218
57761D35437n946p044q562r867j0690j1335j1806j1697j1100j0788j1133j1588
57749C13881j1531j1005j0246r069p130m487j614Q65K398K858K737K563K205J228
57735B73653j28j026j142r09o60k67J10j45j116j887j680r29o49j141j793j875
57719B58416j127K43J746K868L430L590L524L325L272L666M328M650M367L940
$$ y = [332116, 336768, 341165, 344308, 346513, 348524, 350433, 351606, 351302, 349140, 345154, 339631, 333036, 326016, 319219, 312825, 306426, 299749, 293449, 288777, 286455, 286335, 288172, 292155, 298482, 306898, 316941, 328257, 340417, 352880, 365350, 377832, 390016, 401023, 410040, 416809, 421212, 422781, 421153, 416797, 410947, 404967, 400093, 397516, 398253, 402762, 410671, 420666, 430715, 438874, 444201, 446785, 446921, 444743, 440655, 435437, 429491, 422447, 413885, 404018, 393328, 381993, 370187, 358490, 347390, 336602, 325469, 313881, 302350, 291345, 281099, 272030, 264900, 260413, 258799, 259664, 262062, 264920, 267657, 270220, 272425, 273653, 273525, 272499, 271357, 270448, 269788, 269521, 269631, 269486, 268370, 266483, 264803, 263874, 263225, 262084, 260291, 258416, 257289, 257532, 259278, 262146, 265576, 269166, 272690, 276015, 279287, 282953, 287281, 291931, 296298, 300238]
57705C00238L928M367M994N739O732P998R392J0735J2022J3537J5687J8372K0740
57692D34481K1855K1464J9759J6787J2717Q506N370L619K811K992M842Q370J2492
57679E76065J6371K0427K5524L1826L8968M6711N4878O3188P1753Q1271R2282
57668A119264J04597J17980J32782J49346J66993J83774J96176J98104J81347
57659B550363J39849P5588J29p0782j25390j60097j77423j81556j76114j64527
57649A710040j50202j35313j20171j04709r0042p7773o8199o0213n2924m6345
57639H04149m0535l5100k9873k5209k1274j7734j4400j1506r031o489l775j479
57627E87744O3J410L251N528P689R377J0546J1481J2944J5676J9371K2791K5251
$$ y = [300238, 304166, 308533, 313527, 319266, 325998, 333996, 343388, 354123, 366145, 379682, 395369, 413741, 434481, 456336, 477800, 497559, 514346, 527063, 535569, 540939, 544558, 547369, 550361, 555203, 563573, 576065, 592436, 612863, 638387, 670213, 709181, 755892, 810770, 873958, 945711, 1026982, 1119264, 1223861, 1341841, 1474623, 1623969, 1790962, 1974736, 2170912, 2369016, 2550363, 2690212, 2765800, 2765929, 2695147, 2569757, 2409660, 2232237, 2050681, 1874567, 1710040, 1559838, 1424525, 1304354, 1199645, 1109603, 1031830, 963631, 903418, 850494, 804149, 763614, 728514, 698641, 673432, 652158, 634424, 620024, 608518, 599487, 592998, 589223, 587744, 587807, 589217, 592468, 597996, 605685, 615062, 625608, 637089, 650033, 665709, 685080, 707871, 733122]
57614G33122K7437L0401L4406L9146M4316M9459N3918N7554O0958O4398O7062
57603A262177O7831O6113O1478N3282M1443K7006J1220n376k2256l7964n0891
57592A474063o0631o7716p2397p4520p4329p2469o9272o4901n9988n5396n1293
57581G51151m7169m2722l8154l3723k9643k6343k4178k2796k1405j9651j7798
57570D27569j6036j4167j2047r953q349p434o973o419n392m113l226l039l282
57557C27139l606l884l906l436k766k530k681k400j408n16l35l64n7J22k90n25
57541B98557L55J855K694K768L077L984M833N264N699O377P009P559Q448R726
57527C68205J0912J1857J2968J4474J6210J8218K0771K3701K6494K9128L2093
$$ y = [733122, 760559, 790960, 825366, 864512, 908828, 958287, 1012205, 1069759, 1130717, 1195115, 1262177, 1330008, 1396121, 1457599, 1510881, 1552324, 1579330, 1590550, 1585174, 1562918, 1524954, 1474063, 1413432, 1345716, 1273319, 1198799, 1124470, 1052001, 982729, 917828, 857840, 802444, 751151, 703982, 661260, 623106, 589383, 559740, 533397, 509219, 486423, 465018, 445367, 427569, 411533, 397366, 385319, 375366, 367017, 359583, 352610, 346191, 340799, 336686, 333460, 330421, 327139, 323533, 319649, 315743, 312307, 309541, 307011, 304330, 301930, 300522, 300006, 299671, 299307, 299250, 299372, 299082, 298557, 298912, 300767, 303461, 306229, 309306, 313290, 318123, 323387, 329086, 335463, 342472, 350031, 358479, 368205, 379117, 390974, 403942, 418416, 434626, 452844, 473615, 497316, 523810, 552938, 585031]
57516E85031L5481L8925M2432M6374N0526N3978N6256N7515N7412N4839M9210
57505A127979M1110L1089J8850M370j0903k4893l6498m5668n2379n6407n7931
57494I38719n7580n5873n3078m9516m5532m1237l6699l2339k8693k5717k2768
57483D89687j9406j5985j3221j1281r563p487n293l796l276l066k408j389o03
57470C92913q9Q03K527M802P093R194J1125J2834J4305J5863J8020K0922K4038
57457E34350K6662K8823L1464L5358M0009M4155M7274M9867N2140N3245N2305
57446I95652M9307M4373L6912K6457J3836N20j2759k5804l7756m7298n3983n8287
57434I31170o0353n9825n7028n3221m9341m5377m1331l7792l5081l2548k9383
$$ y = [585031, 620512, 659437, 701869, 748243, 798769, 852747, 909003, 966518, 1023930, 1078769, 1127979, 1169089, 1200178, 1219028, 1223398, 1212495, 1187602, 1151104, 1105436, 1053057, 996650, 938719, 881139, 825266, 772188, 722672, 677140, 635903, 599204, 566865, 538172, 512455, 489687, 470281, 454296, 441075, 429794, 420231, 412744, 407451, 403655, 400379, 397313, 394905, 393516, 392913, 392824, 393627, 396154, 400956, 408049, 417243, 428368, 441202, 455507, 471370, 489390, 510312, 534350, 561012, 589835, 621299, 656657, 696666, 740821, 788095, 837962, 890102, 943347, 995652, 1044959, 1089332, 1126244, 1152701, 1166537, 1167057, 1154298, 1128494, 1090738, 1043440, 989457, 931170, 870817, 810992, 753964, 700743, 651402, 606025, 564694, 526902, 491821, 459273, 429890]
57423D29890k5639k1948j8790j6389j4872j4082j3446j2448j1071r629q400p497
57411B55679o789n906m706l712l623m329m934m760l888k699j482n71k42l68n59
57396B07111p30r88j031m06N73J030P56N24P75R42M82j02K7Q41J584J784J608
57379B14780J341J109R90J072J310J439J097J97p43r66l98R0j58o54n81j91l67
57362B19367j130j585j429j352j689j820j329p72p19q51p01n87j100k194l292
57347A98817l938l874l002j686o74l13k19K3L34N22O01M65j48j022j439j089m46
57330A82912O7N30R22Q81N28O15J317J768J422J024J455K377K975L255L644L903
57314B09595L517K783K433K436K162J527J073J014J080J242J747K477K971L087
$$ y = [429890, 404251, 382303, 363513, 347124, 332252, 318170, 304724, 292276, 281205, 271576, 263176, 255679, 248890, 242984, 238278, 234566, 230943, 226614, 221680, 216920, 213032, 210333, 208851, 208280, 208038, 207670, 207111, 206381, 205393, 204362, 203956, 204529, 205559, 206315, 206839, 207614, 208556, 209038, 208936, 208963, 209804, 211388, 213172, 214780, 216121, 217230, 218220, 219292, 220602, 222041, 223138, 223335, 222592, 221626, 221228, 221318, 221160, 220506, 219925, 219734, 219367, 218237, 216652, 215223, 213871, 212182, 210362, 209033, 208261, 207542, 206691, 205990, 205403, 204303, 202109, 198817, 194879, 191005, 188003, 186317, 185643, 185330, 185111, 185134, 185468, 185990, 186591, 187056, 186908, 185886, 184447, 183358, 182912, 182979, 183509, 184431, 185312, 185840, 186455, 187772, 189540, 190962, 191986, 193441, 195818, 198793, 202048, 205692, 209595, 213112, 215895, 218328, 220764, 222926, 224453, 225526, 226540, 227620, 228862, 230609, 233086, 236057, 239144]
57300B39144L055K908K532K197K401L122L787M008L899L686L492L505L907M659
57286B86302N635O804P954Q518Q228P706P851Q707R527R770R498Q851P787O452
57272C99590N222M188K944J057j504m421p243r529j1038j1855j2272j2618j3171
57259C29350j3987j4676j4670j3866j2657j1239r403p275n635m969m717m041k948
57246B09267k032j491j034n65k19J11O69J307J601J479J318J412J756K192K434
57231B18205K152J438R67J274K057K634K802K769K615K286J960J795J588J188
57217B45730J106J965L530M770M913M005K704J924K420L953N212N138M163L481
57203B95014L414L369L137L166L549L805L832M184N042N808O147O602P599Q540
$$ y = [239144, 242199, 245107, 247639, 249836, 252237, 255359, 259146, 263154, 267053, 270739, 274231, 277736, 281643, 286302, 291937, 298741, 306695, 315213, 323441, 331147, 338998, 347705, 357232, 367002, 376500, 385351, 393138, 399590, 404812, 409000, 411944, 413001, 411497, 407076, 399833, 390304, 379266, 367411, 355139, 342521, 329350, 315363, 300687, 286017, 272151, 259494, 248255, 238852, 231577, 225942, 220973, 216256, 212215, 209267, 207235, 205744, 204710, 204145, 203926, 204037, 204706, 206013, 207614, 209093, 210411, 211823, 213579, 215771, 218205, 220357, 221795, 222762, 224036, 226093, 228727, 231529, 234298, 236913, 239199, 241159, 242954, 244542, 245730, 246836, 248801, 252331, 257101, 262014, 266019, 268723, 270647, 273067, 277020, 282232, 287370, 291533, 295014, 298428, 301797, 304934, 308100, 311649, 315454, 319286, 323470, 328512, 334320, 340467, 347069, 354668, 363208]
57189C63208Q602Q035P980R105J0946J2555J3435J3745J3825J3657J2933J1706
57177D99732J0714J0695J1500J2228J2288J1914J1666J1782J2202J2758J3204
57166F30683J3292J3099J3087J3710J5041J6743J8300J9280J9701K0076K0927
57155H13939K2144K3085K3346K3229K3456K4442K5910K7198K7943K8439K9130
57144A092261K9942L0609L1487L3333L6011L8262L9251L9593M0156M0670M0437
57133A492012L9820L9749M0085L9778L8653L7849L8162L9123M0010M0687M1051
57122A926979M0711L9872L9655M0776M2631M4441M6644N0238N5224O0618O5909
57111B453698P1688P8887Q7948R8760J11156J25750J44688J71220K07840K54685
$$ y = [363208, 371810, 379845, 387825, 396930, 407876, 420431, 433866, 447611, 461436, 475093, 488026, 499732, 510446, 521141, 532641, 544869, 557157, 569071, 580737, 592519, 604721, 617479, 630683, 643975, 657074, 670161, 683871, 698912, 715655, 733955, 753235, 772936, 793012, 813939, 836083, 859168, 882514, 905743, 929199, 953641, 979551, 1006749, 1034692, 1063131, 1092261, 1122203, 1152812, 1184299, 1217632, 1253643, 1291905, 1331156, 1370749, 1410905, 1451575, 1492012, 1531832, 1571581, 1611666, 1651444, 1690097, 1727946, 1766108, 1805231, 1845241, 1885928, 1926979, 1967690, 2007562, 2047217, 2087993, 2130624, 2175065, 2221709, 2271947, 2327171, 2387789, 2453698, 2525386, 2604273, 2692221, 2790981, 2902137, 3027887, 3172575, 3343795, 3551635, 3806320]
57101C806320L09756L70023M32049M92889N52473O15555O90221P83537Q98328
57092H951151J033403J185228J348425J514764J672214J805994J903131J958415
57084B1372725J975387J958300J901869J791045J612081J361629J043812O63256
57076C3680104K27592k42840p13711j149033j523851j824908k044045k176096
57068B4233212k222448k192566k100772j962830j794883j612304j427596j249565
57060I670248j084316r35841q05651o93356n98150n19152m54735m02886l62095
57051C814066l30572l04881k81169k58008k36497k17208j98780j79943j61147
57042A645861j43327j26577j10984r7433q6407p7047o8369o0515n3831m7793m1880
$$ y = [3806320, 4116076, 4486099, 4918148, 5411037, 5963510, 6579065, 7269286, 8052823, 8951151, 9984554, 11169782, 12518207, 14032971, 15705185, 17511179, 19414310, 21372725, 23348112, 25306412, 27208281, 28999326, 30611407, 31973036, 33016848, 33680104, 33907696, 33664856, 32951145, 31802112, 30278261, 28453353, 26409308, 24233212, 22010764, 19818198, 17717426, 15754596, 13959713, 12347409, 10919813, 9670248, 8585932, 7650091, 6844440, 6151084, 5552934, 5033782, 4579047, 4176161, 3814066, 3483494, 3178613, 2897444, 2639436, 2402939, 2185731, 1986951, 1807008, 1645861, 1502534, 1375957, 1264973, 1167540, 1081133, 1004086, 935717, 875202, 821371, 773578, 731698]
57031G31698l6630l2707k9667k6734k4101k2424k1470k0360j8802j7224j6005
57020D65574j5241j4931j4783j4250j3275j2525j2399j2363j1735j0615r542q776
57008C15139q362q264q083p302o150n351m828l620j509L94J304J882L109N081
56994B73440P626J0962J4995J8875K2074K5026K8209L1508L4990L9361M5201N2643
56982F04910O1721P1849Q1373Q9590R9104J13917J35316J62290J95903K40357
56972A856330L00176L79009M76366N73874O23096N63616L71679R2517j84692l87215
56962D664756m94258n23665n01420m48210l80971l12804k50533j97142j55558
56953A400195j27235j09434r7532q8783q1698p4082o4685n5214m8040m3078l8980
$$ y = [731698, 695068, 662361, 632694, 605960, 581859, 559435, 537965, 517605, 498803, 481579, 465574, 450333, 435402, 420619, 406369, 393094, 380569, 368170, 355807, 344072, 333457, 323915, 315139, 306777, 298513, 290430, 283128, 276978, 271627, 266799, 263179, 261670, 262064, 263368, 265250, 268359, 273440, 281066, 292028, 307023, 325898, 347972, 372998, 401207, 432715, 467705, 507066, 552267, 604910, 666631, 738480, 819853, 909443, 1008547, 1122464, 1257780, 1420070, 1615973, 1856330, 2156506, 2535515, 3011881, 3585755, 4208851, 4772467, 5144146, 5236663, 5051971, 4664756, 4170498, 3646833, 3145413, 2697203, 2316232, 2003428, 1752895, 1555753, 1400195, 1272960, 1163526, 1065994, 977211, 895513, 821431, 756746, 701532, 653492, 610414, 571434]
56942E71434l5754l3838l2007k8631k4030j9474j4838r210k886L200R290J6092
56930C99348K2801K7189K7275K1898J0897l828j8339k9246l5734l8327l7242l3271
56918C13421k8716k5373k2605j9061j5247j2541j0631q171n360l786l853m229
56906A53848l853k910j826p22R5L53N09J214K227K805L011L558M658N946P274
56891A76187Q689R885J0667J1679J3830J7121K0664K3299K3534J9714J1560J206
56879C48035q246j5080j9196k0774j9900j7197j3651r791n719j728J880N312Q954
56866B32899J2793J6807K1498K7357L4260M2001N0765O0037O7219O8247N9884
56855F93767M1735J6920q825k9767m3059m9130m9505m5335l8148l0185k2744j5291
$$ y = [571434, 535680, 501842, 469835, 441204, 417174, 397700, 382862, 373652, 370766, 373966, 383256, 399348, 422149, 449338, 476613, 498511, 509408, 505580, 487241, 457995, 422261, 383934, 346692, 313421, 284705, 259332, 236727, 217666, 202419, 189878, 179247, 171076, 165716, 161930, 158077, 153848, 149995, 147085, 145259, 144537, 144632, 144985, 145494, 146708, 148935, 151740, 154751, 158309, 162967, 168913, 176187, 184876, 194761, 205428, 217107, 230937, 248058, 268722, 292021, 315555, 335269, 346829, 348035, 339789, 324709, 305513, 284739, 264839, 247642, 233991, 224200, 218481, 216753, 218633, 223945, 232899, 245692, 262499, 283997, 311354, 345614, 387615, 438380, 498417, 565636, 633883, 693767, 735502, 752422, 743597, 713830, 670771, 621641, 572136, 526801, 488653, 458468, 435724, 420433]
56843D20433p235O17P532J4538K3047L2723M2325N2073O3551P7538R2749J05791
56831I25682J11008J01764P4768L3891j1282n1037p9460r4711r8089r3151q3872
56820G35511p2676o0503m8310l7164k7126j7449q058M29Q206J6587K6562L8011
56808E54020N0458O3313P4671Q0578P6337N9105L0083m960l7890o2241p5981q0578
56796G26915p8367p1384o1765n1520m1749l2845k5178j8798j2822o270O07O823
56784C33647J2314J8085K4821L2150L9011M3530M2730L3966J7502k821k1884l6077
56772E36974m4327m7486m7158m4644m0570l5448l0149k5478k1577j8189j5188
56761A66760j2507j0020p887o552n976n458m614l883l575l312k949l078l786l964
$$ y = [420433, 413198, 413815, 421347, 435885, 458932, 491655, 533980, 586053, 649604, 727142, 819891, 925682, 1036690, 1138454, 1213222, 1247113, 1235831, 1184794, 1105334, 1010623, 912534, 819383, 735511, 662835, 602332, 554022, 516858, 489732, 472283, 464225, 464654, 472860, 489447, 516009, 554020, 604478, 667791, 742462, 823040, 899377, 958482, 988565, 983605, 945715, 883474, 807493, 726915, 648548, 577164, 515399, 463879, 422130, 389285, 364107, 345309, 332487, 326217, 326824, 333647, 345961, 364046, 388867, 421017, 460028, 503558, 546288, 580254, 597756, 594935, 573051, 536974, 492647, 445161, 398003, 353359, 312789, 277341, 247192, 221714, 200137, 181948, 166760, 154253, 144233, 136346, 129794, 123818, 118360, 113746, 109863, 106288, 102976, 100027, 96949, 93163, 89199]
56747H9199k850j386q98j190j291j162j394j745j493q45n96p30o29l55m84q80
56731G1271r45p77r34j255j097n21j58j04KJ70L06Q33J917K589J953P62M58J001
56713G5471J129M96K4J95N17O58Q45J083J141J233J573J511L94r92j209k89M23
56696H4203L87L30N58L86l91q95m39N73J399J715J585J403J788K755L323K836
56680A01516K103K102K222J318k7r7J253K291J917R12M67Q20J605K303K275J472
56664A24452R89J718K832K904K121J701J617R02l1L63J969K754J803N90M69Q54
56648A48007P56M91P42J248J376J069M78m16j399k079k608l429m260m465m351
56633A31160m732n300n040m206m158n146o029o436p229q396q573p341o072n635
$$ y = [89199, 86349, 84963, 84065, 82875, 81584, 80422, 79028, 77283, 75790, 74945, 74349, 73619, 72990, 72635, 72151, 71271, 70326, 69549, 68615, 67360, 66263, 65742, 65584, 65480, 65482, 65652, 65958, 66791, 68708, 71297, 73250, 74012, 74470, 75471, 76600, 77096, 77120, 77315, 77832, 78490, 79335, 80418, 81559, 82792, 84365, 85876, 86270, 85278, 84069, 83780, 84203, 84590, 84920, 85478, 85864, 85473, 84578, 84139, 84712, 86111, 87826, 89411, 90814, 92602, 95357, 98680, 101516, 103619, 105721, 107943, 109261, 109234, 109137, 110390, 112681, 114598, 115510, 115977, 116797, 118402, 120705, 122980, 124452, 125441, 127159, 129991, 132895, 135016, 136717, 138334, 139236, 139205, 139568, 141537, 144291, 146094, 146684, 147153, 148007, 148763, 149254, 149996, 151244, 152620, 153689, 154167, 153751, 152352, 150273, 147665, 144236, 139976, 135511, 131160, 126428, 121128, 116088, 111882, 107724, 102578, 96549, 90113, 82884, 74488, 65915, 58574, 52502, 46867]
56619D6867n046l402j446j64O94J590K095J888J647J986K562K999L556M181M191
56604F4198L616L517M205M553L888L126L098L163K645K274K883L819L958L467
56590A12410L263L480L603L542L530L460L084K427J527L27q04j168p37k22J11
56575A37833P54J748K376K395K403K593K424J961K135L045L477K939K696L840
56561A72619N536O358O278O264O754P561Q574R668J0446J0701J0642J0335R669
56548B81405R084R287J0037J0241R521Q524P484N846L547J358l82j994l210l308
56534C47440k803l243m912o452p205q022r188r660r167q950r452r339p946o644
56520B44457o562o840o510o101o041n398l793k681l030l622l365l339m607n760
$$ y = [46867, 41821, 38419, 36973, 36809, 37503, 39093, 41188, 43076, 44723, 46709, 49271, 52270, 55826, 60007, 64198, 67814, 71331, 75536, 80089, 83977, 87103, 90201, 93364, 96009, 98283, 101166, 104985, 108943, 112410, 115673, 119153, 122756, 126298, 129828, 133288, 136372, 138799, 140326, 140653, 139849, 138681, 137944, 137722, 137833, 138587, 140335, 142711, 145106, 147509, 150102, 152526, 154487, 156622, 159667, 163144, 166083, 168779, 172619, 178155, 184513, 190791, 197055, 203809, 211370, 219944, 229612, 240058, 250759, 261401, 271736, 281405, 290489, 299776, 309813, 320054, 329575, 338099, 345583, 351429, 354976, 356334, 355952, 353958, 350748, 347440, 344637, 341394, 336482, 330030, 322825, 314803, 305615, 295955, 286788, 277838, 268386, 259047, 251101, 244457, 237895, 231055, 224545, 218444, 212403, 207005, 203212, 200531, 197501, 193879, 190514, 187175, 182568, 176808]
56506A76808n026l266k543k940l070k705k576k370j312j04j66j329k164k186j972
56491A43079j572o08L85L26q40k210l156l386k463n58J021J371J302J875K549
56476A37115K278J502J424J999K315K349K692L057K728K070K067K713L251L570
56462A71130M000M160L461K409K072K576L209L629L911L884L451L030K792K224
56448B15938J316J118K046K796K309J560J939K910L044K446K275K616K611K216
56434B47140K113K292K179J783J381O50n74j400j093m45n30r97j022j046j934
56419B48497l161l669l701m110m538m090l145k761k822k475j814j403q64L12J152
56404B11408L84j340k233j951j526j277o38J96M04M8j75m48j420k640l069k812
$$ y = [176808, 171782, 168516, 165973, 163033, 159963, 157258, 154682, 152312, 151000, 150896, 150730, 149401, 147237, 145051, 143079, 141507, 140899, 141284, 141610, 140770, 138560, 135404, 132018, 129555, 128997, 130018, 131389, 132691, 134566, 137115, 139393, 140895, 142319, 144318, 146633, 148982, 151674, 154731, 157459, 159529, 161596, 164309, 167560, 171130, 175130, 179290, 182751, 185160, 187232, 189808, 193017, 196646, 200557, 204441, 207892, 210922, 213714, 215938, 217254, 218372, 220418, 223214, 225523, 227083, 229022, 231932, 234976, 237422, 239697, 242313, 244924, 247140, 249253, 251545, 253724, 255507, 256888, 257538, 256964, 255564, 254471, 254026, 253496, 252499, 251477, 250431, 248497, 245336, 241667, 237966, 233856, 229318, 225228, 222083, 219322, 216500, 214025, 212211, 210808, 209944, 210256, 211408, 211792, 210452, 208219, 206268, 204742, 203465, 202827, 203023, 203427, 203475, 203300, 202852, 201432, 198792, 195723, 192911]
56388A92911k701k614j848p50k93m34n44r12k128l457l728l279l252l421k667
56373A60883j170j35K36O49R22L49m90l15O33R31L42k9K51O38J050J723J945R16
56355A69329m02l58O77Q47j21o75k19R2l29o17l20k43q80j647k039k164j859p61
56337A58311P59K070L577O010Q633R824R329Q358P631O938O310N985N401M033
56323B43169K768K771L347K999K047K097L180L737L402L407M094M340L821L690
56309B88869M514N365N450N064M610M135L939M210M268L520K789L035L349K209
56295C45326J73q46n72m31q94j118j082j714k879l412l119k757k198p96O65P64
56279C25110j09l03K63L36L0O27J923K482K485L493N322O007N163M586N183O041
$$ y = [192911, 190210, 187596, 185748, 184998, 184705, 184271, 183727, 182815, 180687, 177230, 173502, 170223, 166971, 163550, 160883, 159713, 159578, 159814, 160463, 161385, 161734, 161244, 160929, 161562, 162493, 162835, 162806, 163057, 163695, 164745, 166468, 168413, 169329, 168927, 168569, 169246, 170093, 169972, 169297, 169078, 169170, 168841, 168224, 167904, 167661, 166781, 165134, 163095, 160931, 159072, 158311, 159070, 161140, 164717, 170727, 179360, 189184, 198513, 206871, 214502, 221440, 227750, 233735, 239136, 243169, 245937, 248708, 252055, 255054, 257101, 259198, 262378, 266115, 269517, 272924, 277018, 281358, 285179, 288869, 293383, 298748, 304198, 309262, 313872, 318007, 321946, 326156, 330424, 333944, 336733, 339768, 343117, 345326, 345499, 344653, 344081, 343650, 342756, 341638, 340556, 338842, 335963, 332551, 329432, 326675, 324477, 323681, 324346, 325110, 325001, 324698, 324961, 325297, 325327, 325954, 327877, 330359, 332844, 336337, 341659, 347666, 352829, 357415, 362598, 368639]
56263C68639O855Q416J0330J1047J0729J1384J3581J5728J7038J8485K0240K1035
56251E33507K0813K1198K2535K3136K2282K1277K0727J9487J7193J5165J3819
56240G51139J1768Q509N542L733K099P6j342j808k448l617m080l447l007l296
56226G59821l209k414k263l337m387m593m762n508o418p603r722j2121j3270j3403
56212F66811j4043j4856j4000j1890j1194j2446j3158j2091j0858j0285q869o265
56200E26856m665n034n331m197l104l117k787j268l12j013j553m70O95K43p89
56185D94154q57n92j072j629j408j055j039m77Q24J373O07J44R36J724J734K238
56169D95605L776M628L813K936L281L736L426L667N306O750O654O069O123O025
$$ y = [368639, 375494, 383910, 394240, 405287, 416016, 427400, 440981, 456709, 473747, 492232, 512472, 533507, 554320, 575518, 598053, 621189, 643471, 664748, 685475, 704962, 722155, 737320, 751139, 762907, 771416, 776958, 780691, 782790, 782866, 781524, 779716, 777268, 773651, 769571, 766124, 763117, 759821, 756612, 754198, 751935, 748598, 744211, 739618, 734856, 729348, 722930, 715327, 705605, 693484, 680214, 666811, 652768, 637912, 623912, 612022, 600828, 588382, 575224, 563133, 552275, 541990, 533121, 526856, 522191, 517157, 511826, 507629, 504525, 501408, 498621, 497353, 497041, 496028, 494475, 494005, 494700, 494943, 494154, 493297, 492705, 491633, 490004, 488596, 487541, 486502, 486025, 486849, 488222, 488829, 488973, 489909, 491633, 493367, 495605, 499381, 504009, 507822, 510758, 514039, 517775, 521201, 524868, 530174, 536924, 543578, 549647, 555770, 561795]
56155E61795N248N111O393P726Q083Q399R172R267Q571Q927J0784J1995J1646
56142F73117J1904J4195J6829J8412K0282K3395K6119K7482K9382L3191L7409
56131I31717M1172M6716N5734O6534P7599R0844J08367J28857J49948J71158J91551
56120B060197K07234K14103K10717J96593J71340J38536J07090Q4975P3298O8330
56110C532413O5997O1888N0984L1628P801j5115l4360m8019n3743n3070n3589
56099C492815o2839q2043j08014j37435j66004j87297j96952j95928j86916j70649
56089A998738j48646j25702j05683q7851p0689n5987m5602l7695l0129k4316k1844
56078A244594k0597j8166j5856j5414j5017j2530r530q112o865m016j217k74N76
$$ y = [561795, 567043, 572154, 578547, 586273, 594356, 602755, 611927, 621194, 629765, 638692, 649476, 661471, 673117, 685021, 699216, 716045, 734457, 754739, 778134, 804253, 831735, 861117, 894308, 931717, 972889, 1019605, 1075339, 1141873, 1219472, 1310316, 1418683, 1547540, 1697488, 1868646, 2060197, 2267431, 2481534, 2692251, 2888844, 3060184, 3198720, 3305810, 3390785, 3464083, 3532413, 3598410, 3660298, 3711282, 3742910, 3750711, 3735596, 3701236, 3653217, 3599474, 3546404, 3492815, 3429976, 3347933, 3239919, 3102484, 2936480, 2749183, 2552231, 2356303, 2169387, 1998738, 1850092, 1724390, 1618707, 1530856, 1460167, 1404180, 1358578, 1320883, 1290754, 1266438, 1244594, 1223997, 1205831, 1189975, 1174561, 1159544, 1147014, 1137484, 1129372, 1122507, 1118491, 1117274, 1117000, 1117576]
56065A117576L092N241N102N006P461J0447J1032J0318J0559J0940J0452J1251
56053A218477J4700J7822J8104J7979K0133K2457K2240K1263K1907K2446K1078
56042A438606K0298K2260K4273K3896K3773K6170K7847K5894K3608K4573K6147
56031A707345K5157K4620K8047L2210L2690L1716L3366L5937L6352L7056M1086
56020B065582M5298M6188M7282N2871N9560O2212O3027O6385P0055P0307P0368
56009B719135P4717Q0232Q2154Q3438Q8863R5427R8270J00474J06920J14352J17827
55998C761809J20948J28995J38207J43020J47449J57609J69649J77378J84944
55989E130008J99165K16382K30188K44888K67226K92459L13313L34953L65553
$$ y = [1117576, 1120668, 1125909, 1131011, 1136017, 1143478, 1153925, 1164957, 1175275, 1185834, 1196774, 1207226, 1218477, 1233177, 1250999, 1269103, 1287082, 1307215, 1329672, 1351912, 1373175, 1395082, 1417528, 1438606, 1458904, 1481164, 1505437, 1529333, 1553106, 1579276, 1607123, 1633017, 1656625, 1681198, 1707345, 1732502, 1757122, 1785169, 1817379, 1850069, 1881785, 1915151, 1951088, 1987440, 2024496, 2065582, 2110880, 2157068, 2204350, 2257221, 2316781, 2378993, 2442020, 2508405, 2578460, 2648767, 2719135, 2793852, 2874084, 2956238, 3039676, 3128539, 3223966, 3322236, 3422710, 3529630, 3643982, 3761809, 3882757, 4011752, 4149959, 4292979, 4440428, 4598037, 4767686, 4945064, 5130008, 5329173, 5545555, 5775743, 6020631, 6287857, 6580316, 6893629, 7228582, 7594135]
55980G594135M00305M31045M63132N05507N53188N98281O48826P16944P98125
55971A2709488Q83521R82681J111864J271081J456976J685710J974845K313882
55963B4390048K682360L085733L543176M055643M623657N283980O089277P065110
55955F0818984Q229683R640587J1374561J3479098J5999277J9039141K2747888
55948A61329219K7254661L2564250L8212276M2671274M3223540L7145721K3771385
55941D06172326N601593j2839418k7516850l6612497m0414469m0198306l7363493
55934B16828886l3138338k8477066k3974312j9911742j6408859j3502414j1141370
55927G0274785r221715p661157o410505n410805m593281l918695l374216k934443
$$ y = [7594135, 7994440, 8425485, 8888617, 9394124, 9947312, 10545593, 11194419, 11911363, 12709488, 13593009, 14575690, 15687554, 16958635, 18415611, 20101321, 22076166, 24390048, 27072408, 30158141, 33701317, 37756960, 42380617, 47664597, 53753874, 60818984, 69048667, 78689254, 90063815, 103542913, 119542190, 138581331, 161329219, 188583880, 221148130, 259360406, 302031680, 345255220, 382400941, 406172326, 411773919, 398934501, 371417651, 334805154, 294390685, 254192379, 216828886, 183690548, 155213482, 131239170, 111327428, 94918569, 81416155, 70274785, 61053070, 53391913, 46981408, 41570603, 36977322, 33058627, 29684411, 26749968]
55919B6749968k561635k239436j971494j749451j552421j374428j223577j096521
55911A2981005r79257q70285p78918p03291o32228n65903n13317m72061m30802
55902G034943l89338l56874l32810l07667k81020k60853k46897k31337k14293
55893D413854k02520j94359j81607j64926j52545j44899j34969j22573j14214
55884C001242j09686j02360r2166q5262q1548p5014o5794n9637n5980m8541l7366
55873B187888k8682k3064j5017m016N126J2702K4023L8681N0088N5558N6842N1197
55861B411326L2941M449k4516m9216p2209r3127j06571j11484j12932j12805j07631
55850A658225r7224q6814p8783p0303o0841n4116n0780m6688m0317l4950l1895
$$ y = [26749968, 24188333, 21948897, 19977403, 18227952, 16675531, 15301103, 14077526, 12981005, 12001748, 11131463, 10352545, 9649254, 9017026, 8451123, 7937806, 7465745, 7034943, 6645605, 6288731, 5955921, 5648254, 5367234, 5106381, 4859484, 4628147, 4413854, 4211334, 4016975, 3835368, 3670442, 3517897, 3372998, 3238029, 3115456, 3001242, 2891556, 2789196, 2697030, 2611768, 2530220, 2455206, 2389412, 2329775, 2273795, 2225254, 2187888, 2159206, 2136142, 2121125, 2117109, 2122235, 2134937, 2158960, 2197641, 2247729, 2303287, 2360129, 2411326, 2444267, 2448716, 2424200, 2374984, 2302775, 2209648, 2103077, 1991593, 1878661, 1765856, 1658225, 1561001, 1474187, 1395404, 1325101, 1264260, 1210144, 1159364, 1112676, 1072359, 1037409, 1005514]
55839A005514k8354k3417j9536j6740j1854m821O22L699P858J4239K0296K5904
55827I73410L4056M3726M8154M2489K8263R317j1342k9702m1564m7082m9957n1417
55815I48351m9645m5255m1742l9793l6720l2278k9471k8664k6506k1915j7790
55804E78572j5531j3099r756p616p019n394k190j57l90n94M02R11L74N55J565
55789E20633J128j032k350k044k255l624m172l517l721m892m560k478j443k025
55775D83648j286J679L495J645k282o142r906j3171j4125j2918j2266j3078j3117
55762C92176j1442j0192j0389j0016q205p420r272j1714j2547j2415j2280j1156
55750B65128q495n941m678l574j660N5P51J156J490O38j464l229m148n308o476
$$ y = [1005514, 977160, 953743, 934207, 917467, 905613, 900792, 901414, 905113, 912971, 927210, 947506, 973410, 1007466, 1051192, 1099346, 1141835, 1170098, 1179415, 1168073, 1138371, 1096807, 1049725, 999768, 948351, 898706, 853451, 811709, 771916, 735196, 702918, 673447, 644783, 618277, 596362, 578572, 563041, 549942, 540186, 532570, 525551, 520157, 517967, 517810, 517420, 516826, 517228, 518139, 518513, 519068, 520633, 521761, 520729, 518379, 516335, 514080, 510456, 506284, 502767, 499046, 494154, 489594, 487116, 485673, 483648, 482362, 484041, 487536, 489181, 486899, 480757, 470851, 457680, 443555, 430637, 418371, 405293, 392176, 380734, 370542, 360153, 350137, 341932, 334512, 325240, 313526, 300979, 288564, 276284, 265128, 256633, 250692, 246014, 242440, 240780, 240835, 241586, 242742, 244232, 244870, 243406, 240177, 236029, 230721, 224245]
55735B24245n859l626k326k668k350l37J224Q34pq1o55k589m265m461m424n155
55719A87500n393m224l054l075l171k303j585k156l074l061k415j741p26N70J228
55704A53320J288K035L537M171L353K358J704L32j755k958l023l632n042n258
55690A50430l721k588k915k768q90R59J243J226K294L426L557L850N405P058P485
55675A74051P263O892N194J644j906l901n237o904p821p117o227o531o963o221
55661A36216n282n522o157n828m898m136k861n36J553K290K773M267N772N742
55647A23393M660L823L123K063J484K095K677J832K65o62j285k519l731l832l373
55632A30013l525l937l587k825k664k857k456j531q15l46J53M30M46R23J866J796
$$ y = [224245, 218386, 214760, 212434, 209766, 207416, 207079, 208303, 209137, 209130, 209049, 208394, 205805, 201540, 197079, 192655, 187500, 182107, 177883, 174829, 171754, 168583, 166280, 164695, 162539, 159465, 156404, 153989, 152248, 151522, 152092, 153320, 154608, 156643, 160180, 164351, 167704, 170062, 171766, 172098, 170343, 167385, 164362, 160730, 155688, 150430, 146709, 144121, 141206, 138438, 137548, 138507, 139750, 140976, 143270, 146696, 150253, 154103, 159508, 166566, 174051, 181314, 188206, 193400, 195044, 193138, 189237, 184000, 177096, 169275, 162158, 155931, 149400, 142437, 136216, 130934, 125412, 119255, 113427, 108529, 104393, 101532, 100996, 102549, 104839, 107612, 111879, 117651, 123393, 128053, 131876, 134999, 137062, 138546, 140641, 143318, 145150, 145415, 144753, 143468, 140949, 137218, 133386, 130013, 126488, 122551, 118964, 116139, 113475, 110618, 108162, 106631, 105816, 105470, 105623, 106053, 106499, 107422, 109288, 111084]
55616A11084j38k527l585l524l575l785l403k462j520o65Jj03r24j273n58J69
55600H3212o6p12j045j441k157k392j842j592k114k076o87N44J22r86j084m14
55584F5270j27L2R42K102K481K453L021L959M432M577M859M860M360M577O571
55569A14369R356J1294J2455J3926J5761J7335J8852K0689K1958K1424J9113J5597
55557C12129J0581L896l015q307j1829j4496j6461j7411j7807j8188j8015j6722
55545A84355j5106j4115j3203j1477r516q384p718o577n338m932m956m371l452
55532G5210l168l276k797j871j331j073n70m40j556l047l155j836p33p07j039
55517D8611j013o89j27P46J529J725J582J480R73l18j362o89J538L664M491M092
$$ y = [111084, 110946, 108419, 104834, 101310, 97735, 93950, 90547, 88085, 86565, 85900, 85901, 85798, 84874, 83601, 83043, 83212, 83146, 82434, 81389, 79948, 77791, 75399, 73557, 71965, 69851, 67775, 67088, 67632, 67754, 66768, 65684, 65270, 65143, 65175, 66117, 68219, 70700, 73153, 76174, 80133, 84565, 89142, 94001, 98861, 103221, 107798, 114369, 123725, 135019, 147474, 161400, 177161, 194496, 213348, 234037, 255995, 277419, 296532, 312129, 322710, 326606, 323591, 315284, 303455, 288959, 272498, 255087, 237280, 219092, 201077, 184355, 169249, 155134, 141931, 130454, 120938, 112554, 104836, 98259, 92921, 87989, 83033, 78662, 75210, 72042, 68766, 65969, 64098, 62767, 61694, 61124, 60684, 59128, 56081, 52926, 51090, 50357, 49650, 48611, 47598, 46909, 46782, 47528, 49057, 50782, 52364, 53844, 54817, 54499, 53137, 52448, 53986, 57650, 62141, 66233]
55501F6233L101K239K135K586K451J150m52j420k049k752k917k137j415j620j905
55486F3228j164m8K24p7j24m46j825l270l253k333k254l028l169k491k270k838
55470C4862l162k905k801k928k549j814j658j875j208L72J282O64m80r15n32K05
55454A4558Q77R44J48p88r39n77n65p37k71N38N27l26p74k32O32J277J810J977
55436A8079J275J59k47P6qq77j501j042J21J173J616J137j26j179j128m68l50
55419A6710p41o34R6N59N26P41J427J870J724J464J374J281J340J961K898L565
55403C6161M136N089N869N386L779K231J093k70j831k676k586k309k110j573r50
55388D9439j190k259k991k839k423k128j604q98o03n92j45N00K77p05r90m7R45
$$ y = [66233, 69334, 71573, 73708, 76294, 78745, 79895, 79443, 78023, 75974, 73222, 70305, 68168, 66753, 65133, 63228, 62064, 62016, 62240, 62163, 62039, 61593, 59768, 56498, 53245, 50912, 48658, 45630, 42461, 39970, 37700, 34862, 31700, 28795, 25994, 23066, 20517, 18703, 17045, 15170, 13962, 14334, 15616, 16280, 15800, 14885, 14353, 14558, 15435, 16379, 16527, 15739, 14800, 14223, 13658, 12921, 12650, 13188, 13715, 13389, 12615, 12383, 13015, 14292, 16102, 18079, 19354, 19513, 19266, 19342, 19334, 18457, 16956, 15914, 16035, 17208, 18824, 19961, 19835, 18656, 17528, 17060, 16710, 15969, 15335, 15431, 15990, 16516, 17257, 18684, 20554, 22278, 23742, 25116, 26397, 27737, 29698, 32596, 36161, 40297, 45386, 51255, 56641, 60420, 62651, 63744, 63474, 61643, 58967, 56381, 54072, 51962, 50389, 49439, 48249, 45990, 42999, 40160, 37737, 35609, 34005, 33107, 32504, 31912, 31767, 32267, 32544, 31839, 30849, 30802, 31747]
55371C1747J111J059J300J221M18m12q23j455k615l302k739j733j429j632j420
55356A9296o46J11M73L70j65o58l28Q54J860J842J049J49o52j311j595j526j505
55339A7618j601j398q42n11o16n48J36R94J394J256Q29L50J64N01R05N91m01j237
55321A7584j511j635j824j688j073m52j36J39N85J091J628K139K081J038k38n54
55305A7174jK77K6J73R14J199N93J37N73J097P36k00r16j324j557j312m90K66
55287A7365M91N58P95Q71O63P31J200J169K01p28o35p5j11n55n07o0j73j077j929
55268A8194k023j430m95N35J298J405R52M93M44P29R75R23N82J24l74r59j479
55251A9894j513r93n45p12j145j201r75r60r91m98L78R18R85R81P69j73j466j947
$$ y = [31747, 32858, 33917, 35217, 36438, 36856, 36444, 35621, 34166, 31551, 28249, 25510, 23777, 22348, 20716, 19296, 18650, 18761, 19234, 19604, 19439, 18781, 18453, 19307, 21167, 23009, 24058, 24207, 23555, 22244, 20649, 19123, 17618, 16017, 14619, 13777, 13266, 12650, 12102, 12238, 13232, 14626, 15882, 16711, 17061, 17225, 17726, 18631, 19222, 18821, 17584, 16073, 14438, 12614, 10926, 9853, 9401, 9265, 9404, 9989, 11080, 12708, 14847, 16928, 17966, 17728, 17174, 17173, 17450, 17476, 17649, 18563, 19762, 20355, 20492, 21065, 22162, 22898, 22698, 21782, 20458, 18901, 17589, 17099, 17365, 17856, 18414, 19209, 20080, 20743, 21474, 22674, 23843, 24044, 23316, 22681, 22606, 22495, 21940, 21433, 21373, 21200, 20123, 18194, 16171, 14741, 14246, 14781, 16079, 17484, 18436, 18929, 19373, 20102, 21077, 22000, 22582, 22706, 22332, 21373, 19894, 18381, 17388, 16843, 16131, 14986, 13785, 12810, 11850, 10859, 10361, 10739, 11657, 12642, 13623, 14392, 14219, 12753, 10806]
55233A0806j299m55q5J05L69L65N2K5N07R41R43P18L13l82p76MJ489K040J148
55214A6828J34N6L54L11L31Q29J198R35N97O36L74p36j872k028j464r43m85M7
55196A5102R4o00j000j52J174J553J010P13J018J191Q13J76n39j361j886j549
55180A5757o12j8k44q82j291j124l97M62Q38O42M54O34P99N57K03J20J56J95N91
55161A6840J414J916J533Q29O51Q76Q36M18m4m77q31o53K05R45O92k11p02l98
55143B3839K07O20O31J04p69j247q05J23P77J008R86N11n59j599j757j060k70
55126B0740M8j82q10j358j140r1Q51R47O87R73J716K110J895J531J397J514J812
55109C2640K088J940J296N73n5q85j725j613l03R43J005N29O46R98M72o94j188
$$ y = [10806, 9507, 9052, 8967, 9072, 9441, 9806, 9858, 9883, 10390, 11331, 12274, 12992, 13305, 12923, 12147, 12151, 13640, 15680, 16828, 16962, 17018, 17372, 17683, 18014, 18843, 20041, 20976, 21573, 22209, 22583, 21847, 19975, 17947, 16483, 15540, 15055, 15102, 15196, 14596, 13596, 13444, 14618, 16171, 17181, 17894, 18912, 20103, 20916, 21092, 20553, 19192, 17306, 15757, 15145, 15127, 14883, 14001, 12710, 11586, 11189, 11651, 12489, 13131, 13585, 14219, 15018, 15575, 15778, 15898, 16054, 16249, 16840, 18254, 20170, 21703, 22532, 23183, 24059, 24895, 25313, 25269, 24792, 23961, 23308, 23513, 24458, 25150, 24939, 24237, 23839, 24046, 24666, 25297, 25401, 24632, 23385, 22580, 22703, 23480, 24488, 25474, 25985, 25426, 23827, 22070, 21010, 20740, 20788, 20606, 19796, 18438, 17298, 17207, 18058, 19005, 19692, 20665, 22381, 24491, 26386, 27917, 29314, 30828, 32640, 34728, 36668, 37964, 38537, 38482, 37597, 35872, 34259, 33956, 34899, 35904, 36433, 37079, 38077, 38549, 37855, 36667]
55092C6667p70m68p42q89n15j56j31JM64P69N95K72O4k42p25j057j048q21l12
55073C0956O31J452J126m94k217k818k265j346p05n38p85j145j222q87l87qJ37
55056A9485Q0K0K71Q35J158P64m4n07l25K70J069J928K341J762M52n51n57R1N89
55037B9131N34Q8l63n02j75N81J563K367K501J829R31N72P21O32K3n30o38p65
55019C8500j304j751j488q10l26J08R60J911K129J466N77k0k04J80J152K064K068
55002D5212J219M99N50J004J094N32l11q16p14m16n37j043j304j069p78o46k84
54985D2192K85K21p49j536j175l55k60o33l00P95J574J601J519J711J769J434
54969D8093J037Q10N97L58K59K52J81K05M14M13j1k09M06J272J498J271J274J205
$$ y = [36667, 35897, 35429, 34687, 33798, 33283, 33127, 32996, 32997, 33461, 34230, 34825, 35097, 35161, 34919, 34194, 33137, 32089, 31268, 30956, 31587, 33039, 34165, 33671, 31454, 28636, 26371, 25025, 24320, 23782, 22997, 21852, 20630, 19743, 19356, 19348, 19485, 19565, 19585, 19856, 20691, 21849, 22613, 22569, 22062, 21737, 22007, 23076, 25004, 27345, 29107, 29559, 29008, 28451, 28542, 29131, 29665, 29753, 29390, 28888, 28713, 29294, 30857, 33224, 35725, 37554, 38485, 39057, 39778, 40410, 40433, 39903, 39265, 38500, 37196, 35445, 33957, 33147, 32821, 32929, 33889, 35800, 37929, 39395, 39972, 39952, 39748, 39928, 41080, 43144, 45212, 46431, 46930, 47480, 48484, 49578, 50110, 49799, 48983, 48269, 47853, 47316, 46273, 44969, 43900, 43122, 42476, 42192, 42477, 42698, 41949, 40413, 39238, 38883, 38623, 37990, 37690, 38485, 40059, 41660, 43179, 44890, 46659, 48093, 49130, 49940, 50537, 50895, 51154, 51406, 51587, 51792, 52206, 52619, 52608, 52399, 52805, 54077, 55575, 56846, 58120, 59325]
54951E9325M13m29M0J642K830L109L493M306M425L448K789L578M896N298M987
54936A04150N283O666Q462R887J0545J0321R482Q508P329N198J753k317o029q890
54922A70348j0715j1428j1475j1622j1804j1057r073o967n824n304m520l506k894
54909F4159k686k335j720j152o82j12M88Q68J076J299J511J716K230L182M102
54894G1944M610N178O524Q388R680R874R579R549R507Q397N605J756j800m253
54880A54538n913p504r148j0401j0971j0846r872p943n668m068l405k927k090
54867F3782j272r69r82r12q22q57p68m03k08n37q95n27M66J365J855K123K102
54850F2541J426K16q22j327j665k111k253j668q18o47j362k203k567k778l322
$$ y = [59325, 59738, 59309, 59349, 60991, 63821, 66930, 70423, 74729, 79154, 82602, 85391, 88969, 93865, 99163, 104150, 109433, 116099, 124561, 134448, 144993, 155314, 164796, 173304, 180633, 185831, 187584, 185267, 179238, 170348, 159633, 148205, 136730, 125108, 113304, 102247, 93174, 86207, 80383, 75079, 70559, 67053, 64159, 61473, 59138, 57418, 56266, 55584, 55472, 55960, 56828, 57904, 59203, 60714, 62430, 64660, 67842, 71944, 76554, 81732, 88256, 96644, 106324, 116198, 125777, 135326, 144833, 153230, 158835, 160591, 158791, 154538, 148625, 141121, 131973, 121572, 110601, 99755, 89883, 81940, 76272, 72204, 68799, 65872, 63782, 62510, 61541, 60559, 59647, 58825, 57968, 57200, 56797, 56589, 56052, 55157, 54630, 55096, 56461, 58316, 60439, 62541, 63967, 64183, 63361, 62034, 60369, 58258, 56005, 54337, 53519, 52872, 51510, 49307, 46740, 43962, 40640]
54835D0640l766l166j552j54P5m01n20k2N76R26J000O55j49p72m40O04J225Q62
54817C5621J31j97j10J5J14L26N95P57P78P27O98Q22J052J024N01j30l25j95k52
54798D1952m31j51O49J331J652K145L079L852L887L504L353L541L850M305N064
54783H1582O031P099Q364R768J0865J1360J1516J1678J1604J0698Q700N919L008
54770A98192O10j072k464l972n185n285m274l138k497j839n21J155K447L195L612
54755A78964L534K535O72j436l204m401n082n496n859n930n191l701k349j828
54741A41228j697j025L65J876L159M497O121P683Q624Q733Q045O426L616j49l914
54726A93588o708q443r738j0773j1010j0229r178q570q032o943n720n207n086
$$ y = [40640, 36874, 33708, 32156, 32002, 32077, 31676, 31156, 31134, 31710, 32636, 33636, 34291, 34142, 33370, 32930, 33534, 34759, 35621, 35752, 35555, 35445, 35460, 35574, 35900, 36495, 37252, 38030, 38757, 39455, 40277, 41329, 42353, 42854, 42724, 42399, 42204, 41952, 41521, 41370, 42019, 43350, 45002, 47147, 50226, 54078, 57965, 61469, 64822, 68363, 72213, 76518, 81582, 87613, 94712, 103076, 112844, 123709, 135069, 146585, 158263, 169867, 180565, 189265, 195184, 198192, 198802, 197730, 195266, 191294, 186109, 180824, 176550, 173412, 170915, 169076, 168555, 169710, 172157, 175352, 178964, 182498, 185033, 185705, 184269, 181065, 176664, 171582, 166086, 160227, 154297, 149106, 145405, 143056, 141228, 139531, 138506, 138871, 140747, 143906, 148403, 154524, 162207, 170831, 179564, 187609, 194035, 197651, 197502, 193588, 186880, 178437, 168699, 157926, 146916, 136687, 127509, 118939, 110907, 103964, 98244, 93037, 87951]
54713H7951m274k854k207k896l735l500k478j591j043n62k06n5K02O75Q36L22
54697F4585l86o86o33m21J45J017J489J165O47N14L87j09k61P00K074K486J807
54680G4520J118R83J033J046J224J405J173Q72J332K401K883K290J547J528J843
54665I7198J783J558J787K299K365J881J566K012L130M565O173P857R305J0159
54651A53638J0460J0663J1260J2415J3905J5243J5762J4862J2407Q804M524j93
54639B83750m930q806j1176j2497j3728j4913j5105j3856j1917j0176q737p402
54627A50507o281n343m103k465j195q41q42m28J35J54j96k46j43o79j853k743
54611A23438k861k692k677k552k033j428j188j353j738k191k423k127j479j122
$$ y = [87951, 83677, 80823, 78616, 75720, 71985, 68485, 66007, 64416, 63373, 62811, 62605, 62550, 62752, 63427, 64263, 64585, 64199, 63513, 62880, 62459, 62604, 63621, 65110, 66275, 66922, 67436, 67823, 67714, 67453, 68153, 70227, 72713, 74520, 75638, 76621, 77654, 78700, 79924, 81329, 82502, 83374, 84706, 87107, 89990, 92280, 93827, 95355, 97198, 98981, 100539, 102326, 104625, 106990, 108871, 110437, 112449, 115579, 120144, 126317, 134174, 143479, 153638, 164098, 174761, 186021, 198436, 212341, 227584, 243346, 258208, 270615, 279419, 283943, 283750, 278820, 270014, 258838, 246341, 232613, 217700, 202595, 188739, 176822, 166646, 157909, 150507, 144226, 138883, 134780, 132315, 131120, 130279, 129437, 129009, 129144, 129298, 129102, 128856, 128713, 128034, 126181, 123438, 120577, 117885, 115208, 112656, 110623, 109195, 108007, 106654, 104916, 102725, 100302, 98175, 96696, 95574]
54597I5574j370j747j622j023n40n74q56p32J41J357K070J855J108N06K61J40
54581I4548RRL03Q61J428J604J226P29P91J400J756J395Q67Q86J286J440J275
54564A11813J168J136R33P39R83J529J824J808J910K195K247K060K237K951L476
54549A39009L146K309J902K336L208L916M271M577N208O086O645O548O241O461
54535B01863P221P704P176N601L385R17j492l594n333o705p462p294o412n612
54521A89963n527o015o455o409n841m878l636k291j149m40r1J77M36L64k31r03
54505A47074r91n40k25k87r1Q45J993K445K080J561J376J427J397J118P07O00
54489A60489J255K486L364L176K261J515J355J558J864K234K682L195L728M028
$$ y = [95574, 94204, 92457, 90835, 89812, 89272, 88698, 87842, 87110, 87251, 88608, 90678, 92533, 93641, 94147, 94408, 94548, 94557, 94566, 94869, 95730, 97158, 98762, 99988, 100717, 101508, 102908, 104664, 106059, 106926, 107812, 109098, 110538, 111813, 112981, 114117, 115050, 115789, 116772, 118301, 120125, 121933, 123843, 126038, 128285, 130345, 132582, 135533, 139009, 142155, 144464, 146366, 148702, 151910, 155826, 160097, 164674, 169882, 175968, 182613, 189161, 195402, 201863, 209084, 216788, 223964, 229565, 232950, 233867, 232375, 228781, 223448, 216743, 209281, 201987, 195575, 189963, 184436, 178421, 171966, 165557, 159716, 154838, 151202, 148911, 147762, 147322, 147231, 147408, 147844, 148208, 147977, 147074, 146083, 145543, 145318, 145031, 144940, 145785, 147778, 150223, 152303, 153864, 155240, 156667, 158064, 159182, 159889, 160489, 161744, 164230, 167594, 170770, 173031, 174546, 175901, 177459, 179323, 181557, 184239, 187434, 191162, 195190]
54475A95190L760L064K572K584K682K471K106J683Q70k79r17o45l83j011j816
54460B11931j548m87K1k13o6P73J161M12n42n82R9O33O80L23m80j597k422k562
54442B05534k438k681l342m066m618m837m502l650k674j846j110n93p37j547k261
54427A64632k208j594r81m43K43R40J250J138R62R38Q95O09R9l43l57J57Q28J114
54409A67879Q92N50M80P34J177J645J884J692J284J210J704K316K301J348j39
54394A86957j332j652j356j259j707k071j689r12o23r77j332j352j350j441j243
54379A66661o80l80q28j618j973j613q76l06l39r88j693j831j447j087q68l41
54363A49793N97J322J307Q44N56O39Q64R73P34N4o95q66l10L47N06K40q6m37r99
$$ y = [195190, 198950, 202014, 204586, 207170, 209852, 212323, 214429, 216112, 216982, 216703, 215786, 215141, 214758, 213747, 211931, 210383, 209896, 209917, 209704, 209638, 210411, 211572, 211984, 211442, 210860, 210959, 211592, 212272, 212595, 212115, 210518, 208096, 205534, 203096, 200415, 197073, 193007, 188389, 183552, 179050, 175400, 172726, 170880, 169770, 169177, 168440, 166893, 164632, 162424, 160830, 159849, 159406, 159649, 160589, 161839, 162977, 163939, 164877, 165772, 166381, 166480, 166137, 165780, 165937, 166765, 167879, 168771, 169321, 169801, 170535, 171712, 173357, 175241, 176933, 178217, 179427, 181131, 183447, 185748, 187096, 186957, 185625, 183973, 182617, 181358, 179651, 177580, 175891, 174979, 174356, 173379, 172047, 170695, 169345, 167904, 166661, 165981, 165601, 164773, 163155, 161182, 159569, 158693, 158387, 158048, 157060, 155367, 153536, 152089, 151002, 150134, 149793, 150390, 151712, 153019, 153863, 154419, 155058, 155922, 156895, 157629, 157683, 156988, 156122, 155812, 156159, 156665, 156905, 156819, 156382, 155383]
54344A55383j734k348k603k477k166j992k062k119j987j997k513l206l416l178
54330A21585l118l327l120k136r18j44R0o9n56j087j189q68n97m80j04M62M42
54313A04866m32j322j475j280j371j540j285r23j144j809k080j622r64p06r66
54298H5947j451j725j478q72m63n44q66j181j589k043k124j721j448j839k528
54283F4075k752k263j355l99K03O8o79j377j683j932k263k155j357n65l59k32
54267D4975M94J403J618J159O71K86j45k22M40J108P34k73n01L20J027J016J080
54250E5190J682J885Q61n60r65l10K37K4m40n18k99k35m19m77r0N57R31P68M21
54231E8243L84O53Q07N70j5q49j731k176j786q21O3N94R59J063N01o50j576j666
$$ y = [155383, 153649, 151301, 148698, 146221, 144055, 142063, 140001, 137882, 135895, 133898, 131385, 128179, 124763, 121585, 118467, 115140, 112020, 109884, 108966, 108822, 108912, 108843, 108287, 107200, 106011, 105143, 104546, 104066, 103962, 104424, 104866, 104434, 103112, 101637, 100357, 98986, 97446, 96161, 95238, 94094, 92285, 90205, 88583, 87619, 86913, 85947, 84496, 82771, 81293, 80421, 79958, 79414, 78548, 77367, 75778, 73735, 71611, 69890, 68442, 66603, 64075, 61323, 59060, 57705, 57306, 57509, 57577, 56898, 55521, 53838, 51906, 49643, 47488, 46131, 45566, 45207, 44975, 45469, 46872, 48490, 49649, 50320, 50606, 50461, 50239, 50679, 51787, 52521, 52248, 51747, 52067, 53094, 54110, 55190, 56872, 58757, 59618, 59058, 58093, 57783, 58020, 58044, 57604, 57086, 56787, 56552, 56133, 55656, 55566, 56123, 57054, 57822, 58243, 58627, 59280, 60087, 60657, 60642, 59793, 58062, 55886, 54100, 53279, 53342, 53936, 54895, 55958, 56459, 55809, 54233, 52567]
54213E2567j213q74q72j056j397j907k266j999j062l6L77Mo07p20k47J10k46r11
54195C7645r74k33N50P00M26K98M46N59L80j51r50j701j942j538r25n75l74Q2
54177C1723P28J027O96Q4l38n49p69r16o34J40R12J106O76P7k15k5N16J045J062
54158C6346L54o06r99n36J97M64K25lJ10M13O39P60R15J118J154P26j51r96j238
54139C8892p90m9O36J218J616J607J175P00M47K55n5k60p6L72P34Q80Q25N38J38
54120D8803K1L42O56M85K3k11k00l25o23p15m93k91l52n57p43q36o79j84K88J98
54100D4607m24r31r13p21q85j397j740j474n82N34J289J351R79P49Q77J020P75
54083D3114J92l43n01k95QJ59K43N52J027J008k5j498k015q59J010J790P06j151
$$ y = [52567, 51354, 50480, 49608, 48552, 47155, 45248, 42982, 40983, 39921, 39885, 40262, 40266, 39659, 38939, 38692, 38802, 38556, 37645, 36671, 36438, 36988, 37688, 38114, 38412, 38858, 39417, 39797, 39646, 38696, 36995, 35053, 33515, 32590, 32015, 31641, 31723, 32451, 33478, 34174, 34258, 33920, 33371, 32602, 31686, 31052, 31192, 32104, 33210, 33886, 33963, 33748, 33723, 34239, 35284, 36346, 36700, 36094, 35095, 34559, 34756, 35220, 35445, 35442, 35552, 35965, 36604, 37364, 38279, 39397, 40551, 41277, 41126, 40130, 38892, 38102, 38053, 38689, 39907, 41523, 43130, 44305, 45005, 45452, 45707, 45652, 45392, 45316, 45688, 46422, 47302, 48127, 48665, 48803, 48824, 49166, 49822, 50307, 50330, 50119, 49919, 49594, 48971, 48256, 47763, 47472, 47120, 46563, 45820, 44984, 44305, 44121, 44409, 44607, 44183, 43252, 42339, 41618, 40733, 39336, 37596, 36122, 35540, 36074, 37363, 38714, 39693, 40442, 41319, 42339, 43114, 43306, 42963, 42462, 42167, 42175, 42334, 42577, 43129, 44156, 45164, 45139, 43641, 41626, 40767, 41777, 43567, 44273, 43122]
54065D3122j936r41P65J621J200K97l57q39j390j669j149P1J302J938J817J121
54049D4973K94j58j08Q3J35K33N88J012J337J838K657L171K647J400N77P86J523
54032F2988J946J760J292J128J648K563L057K769K396K817L859M628M760M619
54018A02230M392L936L454L439L771L733L096K382J913J455R88Q51Q09L0j425
54003A35054k197j453k72k02j124j669j316r20j257k107k870l279l307l045k857
53988A07179l079l425l185k206j163p02p64r44j048j018p68m82p24j709k683k603
53972H0676j437l31k52r46j507j551j315q77l1R79J347P66L0L9N06M05m75j178
53954G4848q78J42J099J633J822J671J261J059J596K723L681L910L534K947K294
$$ y = [43122, 41186, 40245, 41010, 42631, 43831, 44128, 43771, 42932, 41542, 39873, 38724, 38795, 40097, 42035, 43852, 44973, 45267, 45109, 45001, 45084, 45219, 45452, 46040, 47052, 48389, 50227, 52884, 56055, 58702, 60102, 60679, 61465, 62988, 64934, 66694, 67986, 69114, 70762, 73325, 76382, 79151, 81547, 84364, 88223, 92851, 97611, 102230, 106622, 110558, 114012, 117451, 121222, 124955, 128051, 130433, 132346, 133801, 134789, 135640, 136449, 136479, 135054, 132857, 131404, 131132, 130930, 129806, 128137, 126821, 125901, 124644, 122537, 119667, 116388, 113081, 110036, 107179, 104100, 100675, 97490, 95284, 94121, 93419, 92655, 91711, 90663, 89645, 88877, 88395, 87671, 85962, 83279, 80676, 79239, 78908, 78656, 77710, 76203, 74652, 73337, 72460, 72429, 73408, 74755, 75521, 75551, 75590, 76096, 76501, 76026, 74848, 73970, 74112, 75211, 76844, 78666, 80337, 81598, 82657, 84253, 86976, 90657, 94567, 98101, 101048, 103342]
53939A03342J568J007J027J700K576L140L324L429L671M025M443M851M905M173
53925A47181K692J093m7p38j292j805k154k241j949j132P3J143J711K009K433
53910A46977K933L209L202L066K891K905L592N000O224O204N087M122M277N356
53896B05045O427O592N448L336J209j82r22j441j715j555j338j613k180k388k248
53881B12475k352k747k891k808l210m227m985m902m453m184l875l292k954l376
53867A62219m155m434l942l014k023j317j264j791k274k299k166k304k649k978
53853A25609l282l460l190k632k558l190l566k808j422n43l62k47l3j68p22j161
53837I6265j167r42o87m03k37l70n92m38J16O13P27M91l7p98j467j654j360q32
$$ y = [103342, 104910, 105917, 106944, 108644, 111220, 114360, 117684, 121113, 124784, 128809, 133252, 138103, 143008, 147181, 149873, 150966, 150919, 150181, 148889, 147084, 144930, 142689, 140740, 139608, 139681, 140824, 142535, 144544, 146977, 149910, 153119, 156321, 159387, 162278, 165183, 168775, 173775, 179999, 186203, 191290, 195412, 199689, 205045, 211472, 218064, 223512, 226848, 228057, 227875, 226953, 225512, 223797, 222242, 220904, 219291, 217111, 214723, 212475, 210123, 207376, 204485, 201677, 198467, 194240, 189255, 184353, 179900, 175716, 171841, 168549, 165595, 162219, 158064, 153630, 149688, 146674, 144651, 143334, 142070, 140279, 138005, 135706, 133540, 131236, 128587, 125609, 122327, 118867, 115677, 113045, 110487, 107297, 103731, 100923, 99501, 98958, 98596, 98349, 98316, 98148, 97426, 96265, 95098, 94156, 93469, 93066, 92829, 92459, 91867, 91429, 91545, 92158, 92885, 93376, 93339, 92541, 91074, 89420, 88060, 87228]
53819H7228r4Q95J628J306j16j623k157j636p87k17M1K03K49k2m87n41K39J382
53801H5491J950J685J289J368J755K102K526L173L630L483L045L013L537M158
53787A22205M436M256L747L288L253L430L140K303J796K211K924L114K977K996
53773A66076K729J531M5m93k55o54k056l197l261l048l390l717l145k063j475
53758A43627j481j454j293j397j614j222m3J200J769J631J082K67p38j656k205
53743A36473k416k557k768k946k973k913k835k605k066j504j511k211k876k666
53729A01626j596m51J01L2l02m97l06J87O01P50Q73J102J027L49l91m20P3J61
53711A02919l85p87m71K19P96J282J701J676J019J91k98m38l21K24J108J694J572
$$ y = [87228, 87134, 88029, 89657, 90963, 90847, 89224, 87067, 85431, 84644, 84427, 84468, 84671, 84920, 84898, 84411, 83870, 84109, 85491, 87441, 89126, 90415, 91783, 93538, 95640, 98166, 101339, 104969, 108452, 111497, 114510, 118047, 122205, 126641, 130897, 134644, 137932, 141185, 144615, 147755, 150058, 151854, 154065, 156989, 160103, 163080, 166076, 168805, 170336, 170381, 169888, 169633, 168979, 166923, 163726, 160465, 157417, 154027, 150310, 147165, 145102, 143627, 142146, 140692, 139399, 138002, 136388, 135166, 135123, 136323, 138092, 139723, 140805, 141072, 140334, 138678, 136473, 134057, 131500, 128732, 125786, 122813, 119900, 117065, 114460, 112394, 110890, 109379, 107168, 104292, 101626, 100030, 99579, 99680, 99712, 99410, 98913, 98607, 98794, 99395, 100145, 101018, 102120, 103147, 103496, 103105, 102685, 102758, 102919, 102534, 101747, 101276, 101495, 102291, 103573, 105274, 106950, 107969, 108160, 107862, 107424, 107103, 107327, 108435, 110129, 111701]
53694A11701J223J337J883K460L058L726L902K966J342K53K67P89J053J010J018
53679A37988J247J652K176K667K876K697K289J827J430J271J491J842J846J437
53665A64736J159J389J701J358L62m30l30M21J125J509J747J761J133j04j121
53650A76416j189o00j79j29O1N66Q83O63K44ol17r65j584j614j191r85j222j495
53632A67357j438j170r36p61n71l64j57J7M5q3j28L6M2n13j223j108Q1J334J580
53613A62040R59M91P07J256J693K109K816L803M729N199M936L998K924K423K681
53598B02764L200L415L292L084K829K387J855J541J562J827K298K984L591L656
53584B40285L134K563K449K681K780K486J908J308R26R16J171J284Q76Kq26r96
$$ y = [111701, 112924, 114261, 116144, 118604, 121662, 125388, 129290, 132256, 133598, 133851, 134118, 134907, 135960, 136970, 137988, 139235, 140887, 143063, 145730, 148606, 151303, 153592, 155419, 156849, 158120, 159611, 161453, 163299, 164736, 165895, 167284, 168985, 170343, 170705, 170275, 169945, 170366, 171491, 173000, 174747, 176508, 177641, 177537, 176416, 175227, 174627, 174448, 174319, 174380, 174946, 175829, 176492, 176736, 176730, 176413, 175448, 173864, 172250, 171059, 170074, 168852, 167357, 165919, 164749, 163813, 163052, 162481, 162117, 161960, 161977, 162022, 161939, 161811, 161847, 161889, 161376, 160153, 159045, 159126, 160460, 162040, 162999, 163490, 164197, 165453, 167146, 169255, 172071, 175874, 180603, 185802, 190738, 194736, 197660, 200083, 202764, 205964, 209379, 212671, 215755, 218584, 220971, 222826, 224367, 225929, 227756, 230054, 233038, 236629, 240285, 243419, 245982, 248431, 251112, 253892, 256378, 258286, 259594, 260520, 261436, 262607, 263891, 264767, 264769, 263943, 262947]
53568B62947l16O58Q96j08j624k372j941j097n52j59L71O92M06j07k48k30o87
53551B56529j476j763j322q38q07r07p33m02j08L49J122J880K180J987J561J156
53535B58408J016J281J736K026K271K935L910M410M125L865M554N986P179P547
53521C11249P210O547O077O461P908R657J0679J0881J1077J1842J2932J3895J4649
53508D41064J5289J5802J6172J6594J7360J8609K0251K1991K3484K4565K5322
53497F56503K5844K6163K6505K7225K8236K8916K8874K8506K8364K8346K8081
53486I61563K7778K7972K8624K9280L0041L1519L3638L5400L6116L6170L6111
53475A314212L5607L3952L1168K8013K5118K2591K0273J8040J5910J4158J3156
$$ y = [262947, 262631, 263289, 264185, 264077, 262453, 260081, 258140, 257043, 256491, 256332, 256703, 257395, 257801, 257694, 257446, 257216, 256529, 255053, 253290, 251968, 251130, 250323, 249416, 248683, 248281, 248173, 248522, 249644, 251524, 253704, 255691, 257252, 258408, 259424, 260705, 262441, 264467, 266738, 269673, 273583, 277993, 282118, 285983, 290537, 296523, 303702, 311249, 318459, 325006, 331083, 337544, 345452, 355109, 365788, 376669, 387746, 399588, 412520, 426415, 441064, 456353, 472155, 488327, 504921, 522281, 540890, 561141, 583132, 606616, 631181, 656503, 682347, 708510, 735015, 762240, 790476, 819392, 848266, 876772, 905136, 933482, 961563, 989341, 1017313, 1045937, 1075217, 1105258, 1136777, 1170415, 1205815, 1241931, 1278101, 1314212, 1349819, 1383771, 1414939, 1442952, 1468070, 1490661, 1510934, 1528974, 1544884, 1559042, 1572198]
53464A572198J2866J2751J2466J2345J2880J3851J4385J3736J1762Q809N464K270
53452A705783p06l896p558j1218j4184j6376j8273k0209k2209k4314k6512k8372
53440A511956k9443l0074l1168l2879l4266l4557l4136l3770l3445l2642l1393
53429A154183l0277k9524k8832k8108k7638k7384k6655k4865k2188j9203j6211
53418H73298j3214j0280p532m859k044Q85L631O058Q434J1156J4267J7350J9914
53405I17064K1888K3673K5641K7715K9553L1057L2457L3910L5340L6715L8236
53394A253249M0047M1994M3916M5957M8350N0967N3446N5706N8129O1104O4529
53383A817394O7845P0527P2445P3783P4691P5149P5258P5457P6173P7218P7805
$$ y = [1572198, 1585064, 1597815, 1610281, 1622626, 1635506, 1649357, 1663742, 1677478, 1689240, 1698049, 1703513, 1705783, 1705077, 1701181, 1693623, 1682405, 1668221, 1651845, 1633572, 1613363, 1591154, 1566840, 1540328, 1511956, 1482513, 1452439, 1421271, 1388392, 1354126, 1319569, 1285433, 1251663, 1218218, 1185576, 1154183, 1123906, 1094382, 1065550, 1037442, 1009804, 982420, 955765, 930900, 908712, 889509, 873298, 860084, 849804, 842272, 837413, 835369, 836254, 839885, 845943, 854377, 865533, 879800, 897150, 917064, 938952, 962625, 988266, 1015981, 1045534, 1076591, 1109048, 1142958, 1178298, 1215013, 1253249, 1293296, 1335290, 1379206, 1425163, 1473513, 1524480, 1577926, 1633632, 1691761, 1752865, 1817394, 1885239, 1955766, 2028211, 2101994, 2176685, 2251834, 2327092, 2402549, 2478722, 2555940, 2633745]
53372B633745P7216P5284P2232O8321O3865N9219N4573M9932M5410M1360L7933
53361C279090L4930L2217K9962K8103K6004K3138J9782J6436J2692P391j09r433
53349C500203k0095l2158m5584n9320p1515q0568q6002q8550q9612r0316r0904
53338B745579r1044r0631q9892q8761q6825q4198q1890q0756q0354p9421p7344
53327A814463p4733p2524p1075p0096o9033o7214o4066n9587n4557m9912m5829
53316A115837m1688l7056l2325k8147k4445k0566j6414j2774j0106p707m700j485
53304H78424O69J456K038L441N217O336O776P498R042J0894J2343J3402J4564
53291I72100J5982J7295J8248J9230K0951K3599K6579K9120L0975L2329L3337
$$ y = [2633745, 2710961, 2786245, 2858477, 2926798, 2990663, 3049882, 3104455, 3154387, 3199797, 3241157, 3279090, 3314020, 3346237, 3376199, 3404302, 3430306, 3453444, 3473226, 3489662, 3502354, 3509745, 3509636, 3500203, 3480108, 3447950, 3402366, 3343046, 3271531, 3190963, 3104961, 3016411, 2926799, 2836483, 2745579, 2654535, 2563904, 2474012, 2385251, 2298426, 2214228, 2132338, 2051582, 1971228, 1891807, 1814463, 1739730, 1667206, 1596131, 1526035, 1457002, 1389788, 1325722, 1266135, 1211578, 1161666, 1115837, 1074149, 1037093, 1004768, 976621, 952176, 931610, 915196, 902422, 892316, 884609, 879909, 878424, 879093, 880549, 882587, 886028, 891245, 897581, 904357, 911855, 920897, 931791, 944134, 957536, 972100, 988082, 1005377, 1023625, 1042855, 1063806, 1087405, 1113984, 1143104, 1174079, 1206408, 1239745]
53280A239745L4100L4900L5957L6962L7291L6811L6008L5281L4548L3613L2400
53269A627616L0738K8474K6103K4555K4006K3474K2132K0490J9513J9059J8037
53258A884197J5901J3085R933O172J715k860p106j1456j6574k2277k7709l2502
53246A810519l7110m1907m6395m9742n1801n3164n4230n4711n4231n2982n1281
53235A262965m8914m5607m1967l9266l8045l7640l7351l7367l8116l9307m0247
53224H19138m0766m1120m1260m0775l9429l7292l4447l1081k7685k4679k1964
53213D38640j9244j6554j4087j1816r844q766q944r669r808r131q220p366o464
53200B98727n872o140o775o499n137m065m245m882m865m461m518m791m402l533
$$ y = [1239745, 1273845, 1308745, 1344702, 1381664, 1418955, 1455766, 1491774, 1527055, 1561603, 1595216, 1627616, 1658354, 1686828, 1712931, 1737486, 1761492, 1784966, 1807098, 1827588, 1847101, 1866160, 1884197, 1900098, 1913183, 1923116, 1929288, 1931003, 1928143, 1921037, 1909581, 1893007, 1870730, 1843021, 1810519, 1773409, 1731502, 1685107, 1635365, 1583564, 1530400, 1476170, 1421459, 1367228, 1314246, 1262965, 1214051, 1168444, 1126477, 1087211, 1049166, 1011526, 974175, 936808, 898692, 859385, 819138, 778372, 737252, 695992, 655217, 615788, 578496, 544049, 512968, 485283, 460604, 438640, 419396, 402842, 388755, 376939, 367095, 358329, 349385, 339716, 329908, 320777, 312557, 305191, 298727, 292855, 286715, 279940, 273441, 268304, 264239, 259994, 255112, 250247, 245786, 241268, 236477, 232075, 228542]
53186B28542l352m266n355n675n291m742m303m003l891l926l971m020m132m114
53172A67501l691k989k429k119j846j635j777k149k131j446o16k26k27k82l60
53157A43578o37j030j359j632j843j677j009m12o18j408j743j109k40r4o06r15
53141A27246o53l64n86j069j223r98p97p00l41L47Q11O30K00J19K06k61j271j852
53123A19444j317k26L97L68K73M04M39K05P1L26O32N00K2k63p7L08N08M41K70
53104A22725J35K8k00p18j534k351k757k600k105j587j115o59m07o81j430k059
53088A02685k055j564j094p04m0Q06J040J97r99j391q16j18J74M82J245K099K393
53071A02340K117J782J697J811K095K566K948K778J933P97j56p11r06r16r47j038
$$ y = [228542, 225190, 220924, 215569, 209894, 204603, 199861, 195558, 191555, 187664, 183738, 179767, 175747, 171615, 167501, 163810, 160821, 158392, 156273, 154427, 152792, 151015, 148866, 146735, 145289, 144673, 144447, 144220, 143938, 143578, 142941, 141911, 140552, 138920, 137077, 135400, 134391, 133979, 133361, 131953, 130210, 129101, 128861, 128767, 128161, 127246, 126593, 126229, 125643, 124574, 123351, 122353, 121556, 120856, 120515, 120862, 121673, 122303, 122503, 122622, 122828, 122567, 121296, 119444, 118127, 117901, 118298, 118666, 118939, 119343, 119782, 119987, 120058, 120384, 121016, 121516, 121538, 121275, 121198, 121506, 122014, 122455, 122725, 122860, 122888, 122688, 121970, 120436, 118085, 115328, 112728, 110623, 109036, 107921, 107262, 106855, 106174, 104744, 102685, 100630, 99066, 97972, 97268, 97228, 98034, 99074, 99271, 98272, 96881, 96065, 95947, 96121, 96603, 97848, 99947, 102340, 104457, 106239, 107936, 109747, 111842, 114408, 117356, 120134, 122067, 122864, 122708, 121997, 121091, 120175, 119228, 118190]
53055A18190j024q67q66j264j795k001j907k012k546l141l276k792j925j140r20
53040I0714j341j825j684j039p59j387k404k853k370j424p58p48j137j250p42
53025F8993n6L5o05j376j750j729j473j019n56m51p21r55r87j126j453j488r82
53008E2301l98j34J29O63R46M14m48p03k92J10K88N06N40j52j209j443m55P77
52990E1440J333J399J435J201M00m67o81l26j4O8J39J22l16j106j681j567p51
52973E0628L93J247J297O78R5j45n50j381j752o74J238K168J345l6m64J14O67
52956E4868O08K48N7J29L35N51O58N57J88m36j089j312q18k0L27J23J35Q53J630
52937E7592J524O18j25j88R0L52P60J367J644J081n6r76j187p83o5P58J617K481
$$ y = [118190, 117166, 116299, 115433, 114169, 112374, 110373, 108466, 106454, 103908, 100767, 97491, 94699, 92774, 91634, 90714, 89373, 87548, 85864, 84825, 84066, 82679, 80275, 77422, 75052, 73628, 72870, 72122, 70985, 69735, 68993, 68937, 68972, 68367, 66991, 65241, 63512, 62039, 61020, 60464, 60013, 59292, 58337, 57350, 56224, 54771, 53283, 52301, 51903, 51769, 51898, 52561, 53507, 53921, 53473, 52770, 52478, 52588, 52876, 53382, 53922, 53770, 52561, 51118, 50663, 51440, 52773, 54172, 55607, 56808, 57208, 56741, 56060, 55734, 55720, 55788, 55927, 56049, 55733, 54627, 52946, 51379, 50628, 51021, 52268, 53565, 54243, 54338, 54193, 53643, 52262, 50510, 49836, 51074, 53242, 54587, 54551, 54087, 54201, 54868, 55476, 55724, 55781, 55910, 56245, 56796, 57454, 58011, 58199, 57763, 56674, 55362, 54544, 54524, 54851, 54974, 55109, 55962, 57592, 59116, 59734, 59609, 59421, 59511, 59863, 60623, 61990, 63634, 64715, 64659, 63683, 62496, 61713, 61648, 62406, 64023, 66504]
52919F6504L158L250K520J422Q26J014J322J054L49k30n59q51j014q33o12q59
52903G6461j356j300n96k01q00j827k297k099j859j887j870j556j142r72j189
52888E5510j635j867j450m89K73K73j60k79Q6M61N74O58Q61R40P46N76O61P29
52870E6468M25n6j97P4K27j50q23j210j013m30R3K29p4n37p35m90r1N4k4O0M06
52849E2206O23N18N65J268K323K982L120L226L370K937J643J75p06j137j682k316
52833F9115k526k150j494p22K06J006J051J34j144j901j757j021l33j19k38k03
52817E7904K19P06Q23N20L6l92n47k42L37O45M80L18N37P70O04M74J018J849J931
52798F7990J116L50K06J91k02o30n88k11Q6K35K84P8l50n71m18m01r23j489j343
$$ y = [66504, 69662, 72912, 75432, 76854, 77680, 78694, 80016, 81070, 81419, 81189, 80630, 79779, 78765, 77932, 77320, 76461, 75105, 73805, 73209, 73008, 72208, 70381, 68084, 65985, 64126, 62239, 60369, 58813, 57671, 56699, 55510, 53875, 52008, 50558, 50069, 50342, 50615, 50455, 50176, 50262, 50723, 51297, 51955, 52816, 53756, 54502, 55078, 55739, 56468, 56893, 56837, 56640, 56714, 56941, 56791, 55968, 54758, 53745, 53315, 53408, 53637, 53563, 53026, 52291, 51801, 51710, 51764, 51740, 51800, 52206, 52829, 53347, 53912, 55180, 57503, 60485, 63605, 66831, 70201, 73138, 74781, 74956, 74250, 73113, 71431, 69115, 66589, 64439, 62945, 62223, 62429, 63435, 64486, 64620, 63476, 61575, 59818, 58797, 58464, 58345, 58107, 57904, 58123, 58829, 59652, 60172, 60208, 59816, 59269, 59027, 59364, 60009, 60489, 60807, 61344, 62114, 62718, 63192, 64210, 66059, 67990, 69106, 69456, 69662, 69853, 69651, 69021, 68433, 68222, 68308, 68543, 68827, 68905, 68555, 67984, 67566, 67165, 66242, 64753, 63410]
52779F3410n71K5l6m85q36q72o29l16k12m22q05j273j836k216j880q98k53o65
52761D9230j487j529p08o2j38l43j18J63k5l58j80M39Q06O81N03N75N78J52n09
52742D7670r14q87o14l11j13j73m57n88k22M18P74P26P11R16R11L96j45j01L31
52723D8328M85L03L31O48O73J81j81J92R31J254J015P31P70J039J280J306R48
52706F0234K46l85m85j84j64q45j761k022j374n69n30j228j727j356m72J91M74
52689D8043O35O53L19r6n9L43M57Q3k65k99l47m91k16O48J353J306R75J065J325
52670E5432J057M38K55O49R78R19P88P59N92L03L27P50J060R79R83J524K169K030
52652G1992R19l73q91m46L76R48J255J635K051K014J429R38J001J059L28q43j299
$$ y = [63410, 62839, 62864, 62828, 62343, 61507, 60635, 60006, 59690, 59478, 59056, 58251, 56978, 55142, 52926, 51046, 50148, 49895, 49230, 47743, 46214, 45506, 45444, 45306, 44963, 44845, 45008, 44983, 44625, 44445, 44884, 45690, 46371, 46874, 47449, 48027, 48179, 47670, 46756, 45869, 45255, 44944, 44831, 44658, 44201, 43613, 43391, 43809, 44583, 45309, 46020, 46936, 47847, 48243, 48098, 47997, 48328, 48813, 49116, 49447, 50095, 50768, 50949, 50768, 50960, 51891, 53145, 54160, 54891, 55661, 56700, 57980, 59286, 60234, 60480, 60095, 59610, 59426, 59262, 58417, 56656, 54634, 53260, 52691, 52161, 50933, 49206, 47850, 47378, 47569, 48043, 48678, 49331, 49650, 49554, 49495, 49838, 50295, 50378, 50113, 49814, 49467, 48976, 48760, 49408, 50761, 52067, 53042, 54107, 55432, 56489, 56927, 57182, 57831, 58809, 59728, 60516, 61275, 61867, 62170, 62497, 63247, 64307, 65286, 66269, 67793, 69962, 71992, 72911, 72538, 71647, 71201, 71577, 72525, 73780, 75415, 77466, 79480, 80909, 81847, 82848, 83907, 84235, 83392, 82093]
52635H2093p05r2m36j439k096j963j352o00K33J040J494J390J012R35J387J836
52619H2737J433p2j967l372m028m096l567k451j305q45j000r89n07j06k35n69
52603E9061o67p08j032j392j242n23L03Q35R40O17J22M6P38J665J912J325O88
52586F2688O30P65L46n61j047m78O90J403J123K35n83j034j181j047o08o0K76
52569F1557L68M77O91P29M26J09K48Q03J225J101O23L14L97N53L63r0k94j6K88
52550F9872N5n72q19k00R21J722J671Q21l03j059j149r13r06j113q69K13J556
52533F8928K162J707Q15K58K40M23M49K79R2N0J42K99N33Q94J227J147L99p68
52515G9276j677j771j146m83l62o20n53J15P43N41l02p35j55Q39J249Q79L50P5
$$ y = [82093, 81388, 81296, 80860, 79421, 77325, 75362, 74010, 73410, 73643, 74683, 76177, 77567, 78579, 79514, 80901, 82737, 84170, 84098, 82131, 78759, 74731, 70635, 67068, 64617, 63312, 62467, 61467, 60478, 59971, 59865, 59630, 59061, 58394, 57686, 56654, 55262, 54020, 53497, 53800, 54635, 55575, 56192, 56314, 56360, 57098, 58763, 60675, 62000, 62688, 63318, 64083, 64429, 63868, 62821, 62343, 63033, 64436, 65559, 65794, 65211, 64177, 62996, 61949, 61341, 61281, 61557, 61925, 62402, 63093, 63822, 64248, 64357, 64605, 65408, 66633, 67734, 68357, 68671, 69068, 69621, 69984, 69894, 69600, 69584, 69872, 69927, 69355, 68536, 68336, 69257, 70979, 72650, 73471, 73168, 72109, 70960, 70047, 69141, 68028, 67159, 67372, 68928, 71090, 72797, 73612, 73870, 74110, 74533, 74982, 75261, 75353, 75403, 75545, 75844, 76377, 77271, 78498, 79645, 80044, 79276, 77599, 75828, 74682, 74199, 73837, 73217, 72664, 72779, 73522, 74063, 73761, 73026, 72871, 73710, 74959, 75838, 76188, 76263]
52497G6263j94p51j323j409j101j035j505k011j935j399r52o67j28N88P29k8q50
52480F2292p67L0O29P83J001J362J210K97o42q61n53l54l85k25M15J399K271K458
52462G0360J692M72l04l92m19q05j063o82p2R3n2P6L93L48K2N6M75O19L43L49
52442G1509Q79J103L96n51o55N8O43O17K78j26o87j230j174k70R20J605J523J033
52424G5871O37N06L74j69j035j490r85K0N76N54P66J620K358K069R43p0n14o75
52406H1356q18q12n10L2P01J274J296N42m05o68k01J88O5o7K42O00M96K41M50
52387H4002J033J376J325J301J448J397Q52l3r37j541j515q28l8K87L39P03J247
52370I0418J181L38m31n36m76q41j191p31L28J035J068J016J255J381R98M19J99
$$ y = [76263, 76069, 75318, 73995, 72586, 71485, 70450, 68945, 66934, 64999, 63600, 62648, 61981, 61853, 62441, 63170, 63142, 62292, 61525, 61555, 62184, 62967, 63968, 65330, 66540, 66837, 66195, 65334, 64781, 64427, 64042, 63817, 64232, 65631, 67902, 70360, 72052, 72524, 72220, 71828, 71409, 70604, 69541, 68859, 68787, 68880, 68828, 68904, 69297, 69645, 69667, 69723, 70198, 70817, 71160, 71509, 72388, 73491, 73887, 73336, 72681, 72739, 73382, 73999, 74277, 74151, 73464, 72234, 71060, 70790, 71710, 73315, 74838, 75871, 76508, 77014, 77388, 77219, 76184, 74694, 73709, 73729, 74305, 74859, 75625, 77245, 79603, 81672, 82615, 82545, 82031, 81356, 80538, 79726, 79216, 79248, 79949, 81223, 82519, 83061, 82656, 81988, 81787, 81975, 82040, 81973, 82215, 82815, 83311, 83552, 84002, 85035, 86411, 87736, 89037, 90485, 91882, 92734, 92701, 91764, 90223, 88708, 87880, 87842, 88129, 88468, 89171, 90418, 91599, 91937, 91506, 90970, 90494, 89653, 88462, 87731, 88059, 89094, 90162, 91178, 92433, 93814, 94812, 95231, 95430]
52353I5430L45M20J97j58m30n60n75m82l10r0J83N08Q33J104J356J670J992K122
52335A03555J928J517J109O94O0q09j533j729j458j066o35j8O20P91L94P9M41
52318A03940J127J223N17j30J60J198J957J782J028M98M74N47L49J78O25J717
52302A17190K816L368L472L451L284K809K318K374L017L580L493K973K669K875
52288A59689L341L703L768L529L165L033L310L629L333K265R80R2k92k77K87J455
52272A95010K623K946K416J887J790J472K58j212j573m81R52J564J379J115J097
52257B11243J146J195J380J635J669J442J253J260J313J342J583K080K416K251
52243B33208J940K146K855L339L137K554K016J501J003R96J805K811L057K501
$$ y = [95430, 95775, 96195, 96392, 96234, 95804, 95244, 94669, 94187, 93877, 93787, 93970, 94478, 95311, 96415, 97771, 99441, 101433, 103555, 105483, 107000, 108109, 108803, 108863, 108054, 106521, 104792, 103334, 102268, 101633, 101615, 102235, 103026, 103420, 103499, 103940, 105067, 106290, 106807, 106677, 106837, 108035, 109992, 111774, 112802, 113300, 113774, 114321, 114670, 114848, 115473, 117190, 120006, 123374, 126846, 130297, 133581, 136390, 138708, 141082, 144099, 147679, 151172, 154145, 156814, 159689, 163030, 166733, 170501, 174030, 177195, 180228, 183538, 187167, 190500, 192765, 193745, 193837, 193545, 193268, 193555, 195010, 197633, 200579, 202995, 204882, 206672, 208144, 208402, 207190, 205617, 205136, 206088, 207652, 209031, 210146, 211243, 212389, 213584, 214964, 216599, 218268, 219710, 220963, 222223, 223536, 224878, 226461, 228541, 230957, 233208, 235148, 237294, 240149, 243488, 246625, 249179, 251195, 252696, 253699, 254695, 256500, 259311, 262368, 264869]
52229B64869J951J838J825J743J993K658L085K930K814L270L695L235K232J719
52215B99857J907K142K258K789L768M412M279L881L731L658L430L358L698M094
52201C47262M206M264M470M425L797L130L167L679L795L344L041L320L732L779
52187C99411L658L769L877L385K329J578J820K662L087K716K175K046K023J476
52173D36012N81J63N20J105J383J434J443J274Q66N22M55M56L47K91L22P7o03
52156D46648j287j630j904k315k379j663p54o07j210j778k082k608l377l603k805
52141D16646j514n25j03j89q31j877k749k936k493j772j017n44p77j722k631k866
52125C92100k796l232m046m104k842j269q73j883l143l599l254k593j823j081
$$ y = [264869, 266820, 268658, 270483, 272226, 274219, 276877, 279962, 282892, 285706, 288976, 292671, 295906, 298138, 299857, 301764, 303906, 306164, 308953, 312721, 317133, 321412, 325293, 329024, 332682, 336112, 339470, 343168, 347262, 351468, 355732, 360202, 364627, 368424, 371554, 374721, 378400, 382195, 385539, 388580, 391900, 395632, 399411, 403069, 406838, 410715, 414100, 416429, 418007, 419827, 422489, 425576, 428292, 430467, 432513, 434536, 436012, 436593, 436756, 437276, 438381, 439764, 441198, 442641, 443915, 444781, 445303, 445758, 446214, 446561, 446852, 447174, 447251, 446648, 445361, 443731, 441827, 439512, 437133, 435470, 434716, 434109, 432899, 431121, 429039, 426431, 423054, 419451, 416646, 415132, 414607, 414504, 414315, 413484, 411607, 408858, 405922, 403429, 401657, 400640, 400096, 399319, 397597, 394966, 392100, 389304, 386072, 382026, 377922, 375080, 373811, 372938, 371055, 367912, 364313, 361059, 358466, 356643, 355562]
52111C55562q71j529k479k744k169j463j029n02K76O52J22p09q34j22P17J164
52095C44042J231J011N89L59P06J351J592J310J110J420J975K405K752L176L585
52080C68614L843M026M161M062L636L132K828K633K293J853J656J934K482K794
52066D09947K562K029J726J816J887J667J547J954K483K352J729J662K506L192
52052D39059K737J795J773K710L094K036O51O03J841K628J840L68j52O07J490
52037D63080J443O05k65p77j048j294j639k107k495k509k212k081k350k655k595
52022D41101k341k331k617k942l176l270k991k249j449j049r38p59o01q01j228
52007D12359j405j271j170j112p34M3Q76J594K169K158R87r38k262k217j504j236
$$ y = [355562, 354691, 353162, 350683, 347939, 345770, 344307, 343278, 342776, 343052, 343704, 343826, 343117, 342283, 342161, 342878, 344042, 345273, 346284, 346873, 347232, 347938, 349289, 350881, 352191, 353301, 354721, 356696, 359101, 361853, 365029, 368614, 372457, 376483, 380644, 384706, 388342, 391474, 394302, 396935, 399228, 401081, 402737, 404671, 407153, 409947, 412509, 414538, 416264, 418080, 419967, 421634, 423181, 425135, 427618, 429970, 431699, 433361, 435867, 439059, 441796, 443591, 445364, 448074, 451168, 453204, 453855, 454458, 456299, 458927, 460767, 461135, 460983, 461590, 463080, 464523, 465128, 464863, 464086, 463038, 461744, 460105, 457998, 455503, 452994, 450782, 448701, 446351, 443696, 441101, 438760, 436429, 433812, 430870, 427694, 424424, 421433, 419184, 417735, 416686, 415748, 414989, 414388, 413587, 412359, 410954, 409683, 408513, 407401, 406667, 406710, 407586, 409180, 411349, 413507, 414494, 413556, 411294, 409077, 407573, 406337]
51991D06337j659k329k963l574m143m702n427o322p064p439p558p444o940o353
51977C32420o529p773r207r851r890j0119j0528j0363r517q915r250r994j0094
51964B10390r190p802o623n977n824n872n685m964l965l442l853m666m880m273
51950A33374l632l513l357k520j583j654k552k841j871o49k75n23o19n32o57q91
51934A05705r22q83r52p23J23Q76N38o87j574j480q79l66M3M17N89N68O30P71
51916A01794O24J75k5L44Q30Q00K55k56k41M05J390K120K031J044l51j501j973
51899A07465j734j195r70j264j592j438j034j019j441j635j125j36Q17J344J229
51884I6272N43j70l72k15k81n97n99k17j67q04j421j216m35P3L4j15J8M39R96
$$ y = [406337, 404678, 402349, 399386, 395812, 391669, 386967, 381540, 375218, 368154, 360715, 353157, 345713, 338773, 332420, 325891, 318118, 308911, 299060, 289170, 279051, 268523, 258160, 248643, 239728, 230478, 220484, 210390, 201200, 193398, 186775, 180798, 174974, 169102, 163417, 158453, 154488, 151046, 147193, 142527, 137647, 133374, 129742, 126229, 122872, 120352, 118769, 117115, 114563, 111722, 109851, 109202, 108927, 108404, 107785, 107253, 106596, 105705, 104783, 103900, 102948, 102225, 102348, 103224, 103762, 103075, 101501, 100021, 99142, 98776, 98819, 99236, 99825, 100393, 101023, 101794, 102418, 102593, 102568, 102912, 103742, 104542, 104797, 104541, 104300, 104705, 106095, 108215, 110246, 111290, 110939, 109438, 107465, 105731, 104536, 103566, 102302, 100710, 99272, 98238, 97219, 95778, 94143, 93018, 92882, 93699, 95043, 96272, 96815, 96645, 96273, 96058, 95777, 95180, 94581, 94364, 94197, 93393, 91972, 90756, 90321, 90394, 90428, 90313, 90331, 90770, 91766]
51865I1766J447J403O46n00j406j666j263m16M77R80R88Q04O60M56J50M3L58Q96
51847I5823J408J913K275J965R04Q7N98K148L350L350K490J460O54L94Q99J739
51831A21457K029J604J313J801K625L080L350M149N572O949P699P775P337O486
51817A83226N328L933K207J00k082l814m791n074m893m473m021l626l307l138
51803A55575l142k990k285j289r08j438j935j402k33L91J89m2O2m5o70j203j155
51786A37480r64j151j405j187p11m76k82M05J347J660J021kq35j409j685j418
51770A30388o88p7m3l73n59m10r2J23O3k29m59l90k51n60j390k111k010j029K03
51751A20106Q89O49j38n96k09N48P01j45j488k553k836k180r10J03J76k72j53
$$ y = [91766, 93213, 94616, 95262, 94762, 93356, 91690, 90427, 90011, 90488, 91468, 92456, 93260, 93920, 94376, 94526, 94569, 94927, 95823, 97231, 99144, 101419, 103384, 104288, 104375, 104973, 107121, 110471, 113821, 116311, 117771, 118425, 118819, 119718, 121457, 123486, 125090, 126403, 128204, 130829, 133909, 137259, 141408, 146980, 153929, 161628, 169403, 176740, 183226, 188554, 192487, 194694, 194794, 192712, 188898, 184107, 179033, 174140, 169667, 165646, 162020, 158713, 155575, 152433, 149443, 147158, 145869, 144961, 143523, 141588, 140186, 139953, 140344, 140533, 140491, 140553, 140508, 139838, 138635, 137480, 136516, 135365, 133960, 132773, 132062, 131586, 131304, 131709, 133056, 134716, 135737, 135735, 134900, 133491, 131806, 130388, 129700, 129623, 129580, 129207, 128648, 128238, 128146, 128269, 128332, 128103, 127644, 127254, 127003, 126443, 125053, 122942, 120932, 119903, 120106, 120995, 121644, 121506, 120910, 120701, 121249, 121950, 121805, 120317, 117764, 114928, 112748, 111838, 111941, 112117, 111845, 111692]
51734A11692P23J335R83L45L47P57P46L35K58O36P86M21N5Lj26n33n87K56J393
51715A19825J691R27n7o05r75j534j834j121M28J647J686R04J16m91j177j758
51699A17672j739j247j018j201j028j23O14J73j086j914j787j246p89m05j66m37
51683A04273j105j337n54P89J790K131K217K424K619K304J180m36j713k095j879
51668A10608j809k085k165j606o66Q8L94L71K86M36R94J744K225K323K364K556
51652A16058K744K913L465M543N443N243L843J988M07o43j159j211j057r71r61
51637A40645q38o30n77p12p57n08q4K57L26Q3k23j23N02R53L58j047j875j202
51619A34548K10Q16J62p46q93m11q8k46n61p38r16j281j603j468r42o96j275k334
$$ y = [111692, 112415, 113750, 114733, 115078, 115425, 116182, 116928, 117263, 117521, 118157, 118943, 119364, 119419, 119422, 119296, 118763, 118176, 118432, 119825, 121516, 122443, 122386, 121781, 120806, 119272, 117438, 116317, 116745, 118392, 120078, 120982, 121098, 120607, 119430, 117672, 115933, 114686, 113668, 112467, 111439, 111316, 111930, 112103, 111017, 109103, 107316, 106070, 105281, 104876, 104710, 104273, 103168, 101831, 101277, 102066, 103856, 105987, 108204, 110628, 113247, 115551, 116731, 116295, 114582, 112487, 110608, 108799, 106714, 104549, 102943, 102277, 102365, 102759, 103130, 103416, 103852, 104846, 106590, 108815, 111138, 113502, 116058, 118802, 121715, 125180, 129723, 135166, 140409, 144252, 146240, 146647, 146004, 144845, 143634, 142577, 141606, 140645, 139807, 139177, 138600, 137888, 137131, 136623, 136539, 136796, 137122, 137205, 136982, 136859, 137361, 138314, 138672, 137625, 135750, 134548, 134758, 135574, 135736, 134990, 134097, 133686, 133598, 133352, 132791, 132053, 131137, 129856, 128253, 126785, 125843, 125147, 123872, 121538]
51601A21538k963k755k268k190k412k336j784j124n60R0Q47J308J275J108J088
51586A08862R20K97l53l45K78Q46J089J414K003K310J784O41m36j115j503j616
51570A15076j246l74N23P92K04p67j322j033j58P72J435J687J348N23q1K56J287
51553A18922J968J751J118O56K99r7j27N08J164J002K94J08P21J250J042O07P17
51536A31903J295J775K094K636L352L613L028J970J169J007J376J910K236K174
51522A61538J897J779J968K163K008J587J268J151R29L98k71r45j815k913l684
51507A67058l557k802k225k050j718r27k20j79o48j134j516j841j855j358p09
51492A44319m50n64o98q97j444k071k105j467r23j108j837k606l205l574l473
$$ y = [121538, 118575, 115820, 113552, 111362, 108950, 106614, 104830, 103706, 103146, 103236, 104083, 105391, 106666, 107774, 108862, 109782, 110079, 109726, 109381, 109659, 110505, 111594, 113008, 115011, 117321, 119105, 119746, 119310, 118195, 116692, 115076, 113830, 113456, 113979, 114771, 114975, 114208, 112886, 111853, 111695, 112467, 113902, 115589, 116937, 117460, 117379, 117635, 118922, 120890, 122641, 123759, 124415, 124714, 124617, 124490, 124998, 126162, 127164, 127458, 127566, 128287, 129537, 130579, 131186, 131903, 133198, 134973, 137067, 139703, 143055, 146668, 149696, 151666, 152835, 153842, 155218, 157128, 159364, 161538, 163435, 165214, 167182, 169345, 171353, 172940, 174208, 175359, 176288, 176686, 176415, 175470, 173655, 170742, 167058, 163501, 160699, 158474, 156424, 154706, 153779, 153559, 153380, 152732, 151598, 150082, 148241, 146386, 145028, 144319, 143869, 143305, 142607, 141710, 140266, 138195, 136090, 134623, 133700, 132592, 130755, 128149, 124944, 121370, 117897]
51477A17897k753j709q56m56m50o52q31r09j127j775k602k876k344j641j387j195
51461I4334k73J137J730Q66l76m78N33J143M27p93j212p96m97n97l73M90J143
51444I6408Q00jj28N25R69N31l90j047j184r77o57l48q9J86M24L35k01o65l41
51425I4150P02J559J544Q54Q9m10n28j83M90R94R38M52m5k89k16K36J068K085
51407A03490K934L220K667J460M21L85J191J689J031l32j240j131m49qk90j216
51391A13822k203k564k162j629j682k217k415j735n79J03k15j093j553j103k30
51376I2545J69j31n30n51m63o99j040q98l03j8n24j290j375n53M48P60J91p93
51358H4945j619j929j594p43J67O91Q71J069J244Q09m19j583j649p18J42K89J16
$$ y = [117897, 115144, 113435, 112579, 112123, 111673, 111021, 110190, 109281, 108154, 106379, 103777, 100901, 98557, 96916, 95529, 94334, 94061, 95198, 96928, 97794, 97418, 96940, 97473, 98616, 99043, 98250, 97038, 96242, 95745, 95148, 94775, 95265, 96408, 97208, 97207, 97079, 97604, 98573, 99104, 98714, 97667, 96483, 95506, 94849, 94501, 94412, 94598, 95022, 95357, 95156, 94491, 94150, 94852, 96411, 97955, 98809, 98898, 98488, 97960, 97777, 98267, 99261, 100199, 100651, 100606, 100317, 100101, 100337, 101405, 103490, 106424, 109644, 112311, 113771, 114192, 114577, 115768, 117457, 118488, 118156, 116916, 115785, 115336, 115328, 115038, 113822, 111619, 109055, 106893, 105264, 103582, 101365, 98950, 97215, 96636, 96739, 96524, 95431, 93878, 92775, 92545, 92714, 92583, 92053, 91502, 91039, 90340, 89300, 88402, 88099, 88081, 87557, 86267, 84892, 84339, 84787, 85547, 85738, 84945, 83326, 81397, 79803, 79060, 79227, 79918, 80789, 81858, 83102, 83911, 83492, 81909, 80260, 79542, 79684, 79973, 80089]
51341H0089K35O82J106J230Q60n4j082j500j090m27j56l36p01j078j242q34Q1
51324G5783P79O41j06q09j207j382j150k62R06J517J233N96K73L00K32j97p23
51307G6424q29k62O62J347J484J220P72J75m40o90l75J58M14L74L55M76N28L29
51289H2122j04o15q98o34O8N69M06o1j32K65N50L80J7j78j85q8J30L98N01M04
51269H2915L43M59N85N32L31mo20j542k354k539k014j151l45K61O16O05J86l64
51251G5900n61j43O35J271J546J618J618J373P53R9J1O96J656K155J914J276P12
51234I2529K99j91p41r26m67K27M72J06n18j219k087k768k400p21J219K059J604
51217H6477Q27N19M90K02l74p45n82j56mk22k72K78J013J106M57j15j9L71M62
$$ y = [80089, 80324, 81006, 82112, 83342, 84202, 84148, 83066, 81566, 80476, 80049, 79893, 79557, 78856, 77778, 76536, 75702, 75783, 76562, 77203, 77097, 76288, 75081, 73699, 72549, 72287, 73193, 74710, 75943, 76539, 76812, 77112, 77344, 77147, 76424, 75595, 75333, 75995, 77342, 78826, 80046, 80818, 80993, 80553, 79863, 79488, 79646, 80060, 80434, 80789, 81265, 81793, 82122, 82018, 81403, 80505, 79871, 79939, 80508, 80914, 80853, 80721, 80986, 81536, 81916, 81933, 81755, 81570, 81482, 81612, 82010, 82511, 82915, 83258, 83717, 84302, 84834, 85165, 85161, 84541, 82999, 80645, 78106, 76092, 74941, 74596, 74857, 75473, 76078, 76264, 75900, 75339, 75196, 75831, 77102, 78648, 80266, 81884, 83257, 84010, 84109, 84120, 84816, 86472, 88627, 90541, 91817, 92529, 92828, 92637, 91896, 90970, 90503, 90730, 91202, 91308, 90790, 89571, 87484, 84716, 82316, 81595, 82814, 84873, 86477, 87304, 87823, 88313, 88515, 88141, 87396, 86814, 86658, 86654, 86432, 86160, 86438, 87451, 88557, 89014, 88899, 88880, 89251, 89713]
51198H9713K82J41rk52j92M55J078Q74J26q3N54J155R86L34k35o91j156j314p86
51179I0980J90R65J163Q51K50l74p23o88m85m25o20r07r71n17L97J141J085M38
51161I1750J50O75J336J300Q13Q57J709K493K310J337M89L18O00Q78R83R30P33
51144A09661M87M26O09P19N07K93N55J057R43j18j397k002j832j330p90l71l38
51127A07079p09j008r39r66j574k226k005j029l46l60m15m4K55l5n98q17n56O9
51109I3776J033J993K134J154k9k25O21J504J640J072K86k08j9Q15J580J487N25
51092A09139n68j134j082o36j14M6m70j373j914j643q26PO20J023J153Q46J32
51075A03206o67j079p78J51J189J781J824J721J806J904J602R40N60R56J762K096
$$ y = [89713, 89995, 90136, 90127, 89875, 89683, 90138, 91216, 92090, 92216, 92133, 92687, 93842, 94828, 95162, 94927, 94236, 93080, 91766, 90980, 91170, 92135, 93298, 94149, 94399, 94025, 93302, 92614, 92129, 91704, 91084, 90177, 89206, 88689, 89086, 90227, 91312, 91750, 91900, 92575, 93911, 95211, 96024, 96881, 98590, 101083, 103393, 104730, 105219, 105537, 106137, 107015, 107998, 108928, 109661, 110148, 110574, 111183, 111902, 112409, 112702, 113257, 114314, 115257, 115139, 113742, 111740, 109908, 108578, 107788, 107417, 107079, 106370, 105362, 104423, 103457, 101883, 99657, 97652, 96623, 96277, 95917, 95502, 95458, 95713, 95678, 95080, 94263, 93707, 93776, 94809, 96802, 98936, 100090, 100061, 99836, 100457, 101961, 103601, 104673, 104959, 104751, 104732, 105547, 107127, 108614, 109139, 108571, 107437, 106355, 105719, 105605, 105651, 105181, 103808, 101894, 100251, 99425, 99432, 100052, 101075, 102228, 103074, 103206, 102539, 101460, 100682, 100833, 102022, 103803, 105627, 107348, 109154, 111058, 112660, 113600, 114160, 115116, 116878, 118974]
51059A18974J556O35J1j80j67M2N97J302J672J530J174Q20L37l23p65n60K13J053
51041A27921J512J477J175J052J435K105K442K113J471J022Q10O05M54O68J276
51026A47538J847J938J511Q98M23J12l00r28j391j128k52K53m29j887k860k707
51010A42638k058j886k266k381j640m11M32M52l3m56n91n16k86J42O57Q93N26
50993A33216l62j170j160p7J387K056J438L72J14Q78J726J887J659J745K204K545
50977A48458K570K577K797L028K945K527K050J834K006K330K379J974J491J534
50963A80500K286L345M194M693N043N424N840O294O841P420P741P593P201P089
50949B61504P542Q344R209J0177J1407J2739J3782J4442J5038J5926J7157J8538
$$ y = [118974, 120530, 121165, 121176, 120996, 120829, 120871, 121468, 122770, 124442, 125972, 127146, 127966, 128303, 127980, 127215, 126655, 126868, 127921, 129433, 130910, 132085, 133137, 134572, 136677, 139119, 141232, 142703, 143725, 144535, 145140, 145594, 146262, 147538, 149385, 151323, 152834, 153732, 154155, 154267, 153967, 153039, 151648, 150520, 150268, 150521, 150092, 148205, 145345, 142638, 140580, 138694, 136428, 134047, 132407, 131996, 132428, 132880, 132847, 132391, 131800, 131284, 130998, 131140, 131797, 132690, 133216, 132854, 131684, 130524, 130447, 131834, 133890, 135328, 135700, 135814, 136692, 138418, 140305, 141964, 143709, 145913, 148458, 151028, 153605, 156402, 159430, 162375, 164902, 166952, 168786, 170792, 173122, 175501, 177475, 178966, 180500, 182786, 186131, 190325, 195018, 200061, 205485, 211325, 217619, 224460, 231880, 239621, 247214, 254415, 261504, 269046, 277390, 286599, 296776, 308183, 320922, 334704, 349146, 364184, 380110, 397267, 415805]
50937D15805J9768K0542K0668K0233J9532J8824J8102J7052J5177J2216Q573N084
50925F11576K133p02l919p295j0245j2631j4721j6528j7865j8848j9743k0330
50913D70882k0142j9330j8503j7659j6104j3724j1473j0173r508q720p625o392
50901C11529m977l464k480k422k655k196j086k86l05o14m89J24P54J014R04O91
50885B94042O10N48J84n26j214j563j592j254l44Q51J292K93j379k220j763r15
50869B85050o04p25o66k72K0k27r40j566j482n47P99K061L122M065M769N047M940
50852C02844M722M704N290O766Q727J0092J0257R918J0246J1532J3204J4901J6665
50839D29868J8267J9252J9677K0068K0515K0560K0166K0032K0566K1300K1685
$$ y = [415805, 435573, 456115, 476783, 497016, 516548, 535372, 553474, 570526, 585703, 597919, 606492, 611576, 613709, 613007, 609088, 601793, 591548, 578917, 564196, 547668, 529803, 510955, 491212, 470882, 450740, 431410, 412907, 395248, 379144, 365420, 353947, 343774, 334266, 325546, 317921, 311529, 306552, 303088, 300608, 298186, 295531, 293335, 292249, 291963, 291658, 291044, 290555, 290679, 291433, 292447, 293351, 294042, 294652, 295200, 295384, 294858, 293644, 292081, 290489, 289235, 288891, 289742, 291034, 291327, 289948, 287728, 285965, 285050, 284446, 283721, 283055, 282783, 282803, 282576, 281636, 280070, 278588, 278041, 278840, 280901, 284023, 288088, 292857, 297904, 302844, 307566, 312270, 317560, 324326, 333053, 343145, 353402, 363320, 373566, 385098, 398302, 413203, 429868, 448135, 467387, 487064, 507132, 527647, 548207, 568373, 588405, 608971, 630271, 651956]
50828F51956K1881K2370K3282K4568K6447K9139L2448L5968L9405M2444M4653
50817I94561M5946M6753M7306M6956M4675M0071L3654K6211J8317J0249K033o391
50805A350341j4723k2133k7916l2123l5262l7380l7929l6576l3792l0397k6823
50794A015287k3048j9042j4962j0958p011l054R07N010R640J5112K1227K7403
50782A016511L3293L8887M3874M7304M8330M7133M4615M1308L7027L1605K5456
50771A455343J9239J3425Q345M154M63l673q926j5005k1027k6494l1638l6967
50759A357239m2599m7965n2026n4042n4187n3288n1759m9187m5177m0250l5409
50748H31350l1069k6905k2746j8992j5983j3330j0244o407k271J482M656P643
$$ y = [651956, 673837, 696207, 719489, 744057, 770504, 799643, 832091, 868059, 907464, 949908, 994561, 1040507, 1087260, 1134566, 1181522, 1226197, 1266268, 1299922, 1326133, 1344450, 1354699, 1356732, 1350341, 1335618, 1313485, 1285569, 1253446, 1218184, 1180804, 1142875, 1106299, 1072507, 1042110, 1015287, 992239, 973197, 958235, 947277, 940266, 937212, 938119, 943129, 952769, 967881, 989108, 1016511, 1049804, 1088691, 1132565, 1179869, 1228199, 1275332, 1319947, 1361255, 1398282, 1429887, 1455343, 1474582, 1488007, 1496352, 1500506, 1500969, 1497296, 1488370, 1473365, 1452338, 1425844, 1394206, 1357239, 1314640, 1266675, 1214649, 1160607, 1106420, 1053132, 1001373, 952186, 907009, 866759, 831350, 800281, 773376, 750630, 731638, 715655, 702325, 692081, 685674, 683403, 684885, 689541, 697184]
50736F97184J0850J4124J6907J9035K1015K3322K5674K7438K8531K9305K9499
50725I42884K8102K4718K0442J6722J3620J0005N368O24l068n571p421q846r729
50712A027850j0131j0150r404p391m354j207J514M123P036J0145J3131J5985J8807
50699A055954K1406K3406K4645K5141K4886K3763K1602J8195J3616Q549L981L54
50687A265498k568m855n957n430l625j188J725N184Q802J1943J4435J6439J7898
50674A318301J8756J9658K1687K5374L0522L7014M5091N4606O4696P4471Q3600
50663A793776R1863R8597J02893J04133J02178R7342R0338Q2033P3106O4180N6115
50652B756554M9501M3734L7274K9179J9961J0620J399p999j7454k6373l4327m1060
$$ y = [697184, 708034, 722158, 739065, 758100, 779115, 802437, 828111, 855549, 884080, 913385, 942884, 970986, 995704, 1016146, 1032868, 1046488, 1056493, 1061861, 1062485, 1059417, 1053846, 1046425, 1037579, 1027850, 1017719, 1007569, 998165, 990774, 986420, 985213, 986727, 990850, 997886, 1008031, 1021162, 1037147, 1055954, 1077360, 1100766, 1125411, 1150552, 1175438, 1199201, 1220803, 1238998, 1252614, 1261163, 1265144, 1265498, 1262930, 1258075, 1252118, 1246688, 1243063, 1241875, 1243600, 1248784, 1257586, 1269529, 1283964, 1300403, 1318301, 1337057, 1356715, 1378402, 1403776, 1434298, 1471312, 1516403, 1571009, 1635705, 1710176, 1793776, 1885639, 1984236, 2087129, 2191262, 2293440, 2390782, 2481120, 2563153, 2636259, 2700439, 2756554, 2806055, 2849789, 2887063, 2916242, 2936203, 2946823, 2948222, 2940223, 2922769, 2896396, 2862069, 2821009]
50640B821009m6018m8483m8286m5918m1826l6135k9124k1610j4487q149k626J843
50628B480190M745N800N350M081K410K19k830o786j1277j5838k0063k3495k5564
50615B396942k5900k4669k2296j8847j3957p612p83N066R131J1566J2583J1780
50603B333004Q762M055j330p168j4176k2738l2150m1463n0451n9204o7147p3223
50591A976771p6919p8617p8851p7758p5253p1483o6927o2185n7601n3023m8099
50580A230055m2910l7975l3540k9272k4945k0890j7350j3967j0463p234m534j615
50568I85360K271O385R185J0362J1064J2019J2755J2936J3213J4130J5192J5782
50556A120654J6237J7338J9322K2019K5492K9850L4953M0825M7862N6067O4530
$$ y = [2821009, 2774991, 2726508, 2678222, 2632304, 2590478, 2554343, 2525219, 2503609, 2489122, 2480973, 2478347, 2480190, 2484935, 2490735, 2496085, 2500166, 2502576, 2502795, 2499965, 2493179, 2481902, 2466064, 2446001, 2422506, 2396942, 2371042, 2346373, 2324077, 2305230, 2291273, 2283661, 2282878, 2287944, 2297075, 2308641, 2321224, 2333004, 2341766, 2345821, 2344491, 2337323, 2323147, 2300409, 2268259, 2226796, 2176345, 2117141, 2049994, 1976771, 1899852, 1821235, 1742384, 1664626, 1589373, 1517890, 1450963, 1388778, 1331177, 1278154, 1230055, 1187145, 1149170, 1115630, 1086358, 1061413, 1040523, 1023173, 1009206, 998743, 991509, 986975, 985360, 987631, 994016, 1003201, 1013563, 1024627, 1036646, 1049401, 1062337, 1075550, 1089680, 1104872, 1120654, 1136891, 1154229, 1173551, 1195570, 1221062, 1250912, 1285865, 1326690, 1374552, 1430619, 1495149]
50545A495149P2186P8743Q4308Q8498R0619R0401Q8124Q4269P9637P5354P2247
50534B399535P0372O9542O9843P1170P2619P3132P2476P1044O9048O6580O4189
50523C169550O2603O1966O2069O3129O5641O9346P3119P5914P7340P7280P5461
50512C933418P1510O4926N5102M1872K6065Q856r378k8939m9442o9243q6585j00752
50500C857410j11779j19498j23361j22918j18123j09241r6775q1443o4131m5898
50490B864243k7952j1404L040J4921K3540K8012K7878K3363J4771J936j5171l5316
50478B911861n5927p4474q9887j02342j11850j17674j19361j17828j14681j10657
50468A897180j05442r8989r2099q5444p8784p1818o5104n9427n4666m9984m4990
$$ y = [1495149, 1567335, 1646078, 1730386, 1818884, 1909503, 1999904, 2088028, 2172297, 2251934, 2327288, 2399535, 2469907, 2539449, 2609292, 2680462, 2753081, 2826213, 2898689, 2969733, 3038781, 3105361, 3169550, 3232153, 3294119, 3356188, 3419317, 3484958, 3554304, 3627423, 3703337, 3780677, 3857957, 3933418, 4004928, 4069854, 4124956, 4166828, 4192893, 4201749, 4192371, 4163432, 4113990, 4044747, 3958162, 3857410, 3745631, 3626133, 3502772, 3379854, 3261731, 3152490, 3055715, 2974272, 2910141, 2864243, 2836291, 2824887, 2827927, 2842848, 2866388, 2894400, 2922278, 2945641, 2960412, 2962348, 2947177, 2911861, 2855934, 2781460, 2691573, 2589231, 2477381, 2359707, 2240346, 2122518, 2007837, 1897180, 1791738, 1692749, 1600650, 1515206, 1436422, 1364604, 1299500, 1240073, 1185407, 1135423, 1090433]
50457A090433l9996l5354l1117k7346k4023k0790j7326j3992j1523j0048q958
50446H49960p751o484n237l816k186p38K02P78J389K290L588N334P409R519J1384
50431H65641J2932J4337J6017J8480K1838K5594K9127L2301L5390L8605M1986
50420A152248M5506M8998N2180N5098N8095O1016O2996O3721O4330O6112O8701
50409A799001P0704P1837P3067P4573P5027P3440P0472O7194O3525N8769N2888
50398B550497M6382L9508L2376K5350J8515J1277L045o182j6501k8544m2251n5862
50386B577610o7415p6793q5055r1954r5676r5155r1308q5529p8217o9427n9804
50375A681277m9929l9601k8738j8407r887l149K634P276R416Q293M637n24o969
$$ y = [1090433, 1050437, 1015083, 983966, 956620, 932597, 911807, 894481, 880489, 868966, 858918, 849960, 842209, 835725, 830488, 826672, 824486, 823748, 823950, 824728, 826117, 828407, 831995, 837329, 844738, 854257, 865641, 878573, 892910, 908927, 927407, 949245, 974839, 1003966, 1036267, 1071657, 1110262, 1152248, 1197754, 1246752, 1298932, 1354030, 1412125, 1473141, 1536137, 1599858, 1664188, 1730300, 1799001, 1869705, 1941542, 2014609, 2089182, 2164209, 2237649, 2308121, 2375315, 2438840, 2497609, 2550497, 2596879, 2636387, 2668763, 2694113, 2712628, 2723905, 2726950, 2720768, 2704267, 2675723, 2633472, 2577610, 2510195, 2433402, 2348347, 2256393, 2160717, 2065562, 1974254, 1888725, 1810508, 1741081, 1681277, 1631348, 1591747, 1563009, 1544602, 1534715, 1531566, 1534200, 1541476, 1550892, 1559185, 1563822, 1563298, 1556329]
50362A556329j4711k3042l0874l7572m2840m6298m7806m7961m7504m6359m4062
50351A127300m1038l8557l7138l5878l3738l0849k7991k5448k3086k1094j9798
50340G92685j8856j7471j5448j3457j2189j1651j1385j0910r864q235o639n952
50328F50628o368p102p207o485n453m634m098l554k782j983j627j849k093j578
50314E93815n3K053M120N704O611P127Q037R927J2453J4676J6271J7842J9912
50301G18495K2058K3391K3495K2652K1315J9691J7781J5687J3757J2362J1330
50290I22014R973P960N931M672L780J834j980p019j2095j6591k0366k3170k4707
50277H50236k5060k4636k3791k2625k0967j8568j5538j2630j0593r275p874o109
$$ y = [1556329, 1541618, 1518576, 1487702, 1450130, 1407290, 1360992, 1313186, 1265225, 1217721, 1171362, 1127300, 1086262, 1047705, 1010567, 974689, 940951, 910102, 882111, 856663, 833577, 812483, 792685, 773829, 756358, 740910, 727453, 715264, 703613, 692228, 681318, 671454, 663219, 656580, 650628, 644260, 637158, 629951, 623466, 618013, 613379, 609281, 605727, 602945, 600962, 599335, 597486, 595393, 593815, 593762, 595815, 599935, 605639, 612250, 619377, 627414, 637341, 649794, 664470, 680741, 698583, 718495, 740553, 763944, 787439, 810091, 831406, 851097, 868878, 884565, 898322, 910684, 922014, 931987, 939947, 945878, 950550, 954330, 956164, 954184, 947165, 935070, 918479, 898113, 874943, 850236, 825176, 800540, 776749, 754124, 733157, 714589, 699051, 686421, 675828, 666553, 658679, 652570]
50265F52570m566l679l146k669k536k985l593l812l675l395k841j964j297j359
50251F11053j816j894j334m50M72J219J419R69M89O38J218J534J536J828K604
50236F19485L334L532L267K803K373K306K815L502L634L087K503K384K500K384
50222F59909J948J369P78L16K08M81Q15Q40M84j0l07k08J42L73L73M92J008J638
50204F70649J936J998K274K849L418L899M487N185N791O393P267Q341R237R919
50190G43643J0627J1205J1174J0626J0297J0589J1189J1857J2775J3785J4152
50179H71919J3665J3269J3855J4995J5633J5685J6174J7992K1144K5078K9128
50168A068537L2781L6088L9848M4972N1732N9824O8856P8466Q8363R8722J10107
$$ y = [652570, 648004, 644325, 641179, 638510, 635974, 632989, 629396, 625584, 621909, 618514, 615673, 613709, 612412, 611053, 609237, 607343, 606009, 605559, 606031, 607250, 608669, 609638, 610127, 610765, 611983, 613517, 615053, 616881, 619485, 622819, 626351, 629618, 632421, 634794, 637100, 639915, 643417, 647051, 650138, 652641, 655025, 657525, 659909, 661857, 663226, 664004, 664320, 664528, 665009, 665824, 666664, 667148, 667138, 666831, 666623, 666765, 667138, 667511, 668003, 669011, 670649, 672585, 674583, 676857, 679706, 683124, 687023, 691510, 696695, 702486, 708879, 716146, 724487, 733724, 743643, 754270, 765475, 776649, 787275, 797572, 808161, 819350, 831207, 843982, 857767, 871919, 885584, 898853, 912708, 927703, 943336, 959021, 975195, 993187, 1014331, 1039409, 1068537, 1101318, 1137406, 1177254, 1222226, 1273958, 1333782, 1402638, 1481104, 1569467, 1668189, 1778296]
50157A778296J22304J33545J41620J45516J45279J40608J30800J16317R9401Q2675
50147C036361O7757N5464M6441M0713L6929L2638K5360J3410l743k5490n0528
50136C275312p7447j04523j29087j47976j59343j63626j62406j56814j47588j35978
50126A890524j23561j11127r8627q6293p5042o5512n7359m9874m2936l6931l2010
50115A111252k7811k3904k0238j7106j4726j2889j1158r464q295p969p984p502
50103I42206o451n580n305n025l972k313r65m70m33r1Q30J872K353K061J496J394
50087I21607K036L156M409N667O875P995R149J0443J1614J2277J2642J3431J4839
50074A036140J6127J6713J7025J7796J8938J9922K0799K1931K2913K2926K2250
$$ y = [1778296, 1900600, 2034145, 2175765, 2321281, 2466560, 2607168, 2737968, 2854285, 2953686, 3036361, 3104118, 3159582, 3206023, 3246736, 3283665, 3316303, 3341663, 3355073, 3351330, 3325840, 3275312, 3197865, 3093342, 2964255, 2816279, 2656936, 2493310, 2330904, 2174090, 2026502, 1890524, 1766963, 1655836, 1557209, 1470916, 1395874, 1330362, 1273003, 1223129, 1180193, 1143262, 1111252, 1083441, 1059537, 1039299, 1022193, 1007467, 994578, 983420, 973956, 965661, 957692, 949708, 942206, 935755, 930175, 924870, 919845, 915873, 913560, 912595, 912125, 911692, 911601, 912431, 914303, 916656, 918717, 920213, 921607, 923643, 926799, 931208, 936875, 943750, 951745, 960894, 971337, 982951, 995228, 1007870, 1021301, 1036140, 1052267, 1068980, 1086005, 1103801, 1122739, 1142661, 1163460, 1185391, 1208304, 1231230, 1253480]
50063A253480K2428K4338K6967K8711K9344L0017L1649L4129L7030M0464M4858
50052A603415N0292N6303O2480O9133P7236Q7541R9849J13455J28207J44708J63357
50041B655976J83529K03816K22577K37882K47384K49064K42411K28840K11029
50032D682508J91848J73629J57922J45489J36230J28886J20982J09485R1903O6717
50022F005599L3298p838n4252j01733j45894j83822k14258k36849k51774k59843
50012D582634k62227k60011k54077k45191k33769k19902k04008j87285j70911
50003B545253j55009j38978j22913j07980r5139q4089p3931o4493n6489n0408
49993A595824m5753m1565l7508l4071l1616k9677k7573k5493k4263k3907k3316
$$ y = [1253480, 1275908, 1300246, 1327213, 1355924, 1385268, 1415285, 1446934, 1481063, 1518093, 1558557, 1603415, 1653707, 1710010, 1772490, 1841623, 1918859, 2006400, 2106249, 2219704, 2347911, 2492619, 2655976, 2839505, 3043321, 3265898, 3503780, 3751164, 4000228, 4242639, 4471479, 4682508, 4874356, 5047985, 5205907, 5351396, 5487626, 5616512, 5737494, 5846979, 5938882, 6005599, 6038897, 6031059, 5976807, 5875074, 5729180, 5545358, 5331100, 5094251, 4842477, 4582634, 4320407, 4060396, 3806319, 3561128, 3327359, 3107457, 2903449, 2716164, 2545253, 2390244, 2251266, 2128353, 2020373, 1925234, 1841145, 1767214, 1702721, 1646232, 1595824, 1550071, 1508506, 1470998, 1436927, 1405311, 1375634, 1348061, 1322568, 1298305, 1274398, 1251082]
49982A251082k1798k0275k0162k1387k2479k2478k1792k1101k0337j9185j7825
49971A022263j6617j5491j4089j2381j0659r148p921p033o433n930n407m929m507
49958I01718l936l096k133j170q1J175K268K784K724K487K415K637L129L803M517
49943I19241N229O017O903P796Q718R880J1425J3291J5487J8234K1612K5265K8855
49930A097953L2607L7118M2630M8872N5665O3320P2356Q2975R4945J07840J21190
49919A857471J34378J46484J56222J62088J62680J57119J45448J28844J09482
49910C160216R0026P2923N9905N1613M7308M4905M1527L4360K1152N61k7325o0517
49898C536654r5587j28900j57489j79060j92006j95985j92274j83031j70199j55195
$$ y = [1251082, 1229284, 1209009, 1188847, 1167460, 1144981, 1122503, 1100711, 1079610, 1059273, 1040088, 1022263, 1005646, 990155, 976066, 963685, 953026, 943878, 935957, 928924, 922491, 916561, 911154, 906225, 901718, 897782, 894686, 892553, 891383, 891302, 892477, 894745, 897529, 900253, 902740, 905155, 907792, 910921, 914724, 919241, 924470, 930487, 937390, 945186, 953904, 963784, 975209, 988500, 1003987, 1022221, 1043833, 1069098, 1097953, 1130560, 1167678, 1210308, 1259180, 1314845, 1378165, 1450521, 1533496, 1628441, 1736281, 1857471, 1991849, 2138333, 2294555, 2456643, 2619323, 2776442, 2921890, 3050734, 3160216, 3250242, 3323165, 3383070, 3434683, 3481991, 3526896, 3568423, 3602783, 3623935, 3624496, 3597171, 3536654, 3441067, 3312167, 3154678, 2975618, 2783612, 2587627, 2395353, 2212322, 2042123, 1886928]
49888A886928j39309j23754j09266r6009q3912p3025o3426n5101m7919m1675l6179
49877A017353l1486k7868k5336k3285k0945j8172j5517j3468j1977j0769r852
49866H08678r395r331r319r119q825q628q455q000p130o176n563n249m769l936
49852G04783l187k992l201l344l323l389l517l311k644j961j708j876k167k413
49838F65750k605k791l055l401l520k975j865r16o95r76j180j148j084r54n14
49823F38071J60O72Q74J023J269J414J298J133J153J336J597K029K580K759K075
49808F59443P57k90l37N65J788K719K990K537J617P53L75M96P99J025J137J108
49792F77482Q07K57j96l16m93j387k855l809l506k675k694l785m746m655m034
$$ y = [1886928, 1747619, 1623865, 1514599, 1418590, 1334678, 1261653, 1198227, 1143126, 1095207, 1053532, 1017353, 985867, 957999, 932663, 909378, 888433, 870261, 854744, 841276, 829299, 818530, 808678, 799283, 789952, 780633, 771514, 762689, 754061, 745606, 737606, 730476, 724300, 718737, 713488, 708719, 704783, 701596, 698604, 695403, 692059, 688736, 685347, 681830, 678519, 675875, 673914, 672206, 670330, 668163, 665750, 663145, 660354, 657299, 653898, 650378, 647403, 645538, 644622, 643927, 642951, 641771, 640623, 639539, 638585, 638071, 638231, 638903, 639777, 640800, 642069, 643483, 644781, 645914, 647067, 648403, 650000, 652029, 654609, 657368, 659443, 660200, 659910, 659573, 660138, 661926, 664645, 667635, 670172, 671789, 672542, 672917, 673413, 674212, 675237, 676374, 677482, 678289, 678546, 678350, 678034, 677541, 676154, 673299, 669490, 665984, 663309, 660615, 656830, 652084, 647429, 643395]
49777F43395l917m347m541m213l909m015m151l811l114k503k105j687j148o81
49763E99253m90n87r13j459k213l004l496l336k440j133k0M24J89k41k76K57R09
49746E81424J066O78L04L67O28O19L71L71Q76J633K204K320K004J606J644K241
49730F00356K829K781K254J988K345L037L733M353M750M742M560M626M694L989
49716F51037K510J358J305J766J867J808K316L289L958M114M167M232M076L918
49702F91721M300N064N383M979M510M515M736M807M851M994N028M974N354O377
49688G61593P436P920Q042Q219Q131P179N618M488M383M919N457N846O299O941
49674H52471P677Q214Q245P765P218P045P080O728N814M978M983N830O716O855
$$ y = [643395, 639478, 635131, 630590, 626377, 622468, 618453, 614302, 610491, 607377, 604874, 602769, 601082, 599934, 599253, 598763, 598176, 597263, 595804, 593591, 590587, 587091, 583755, 581315, 580182, 580162, 580586, 580775, 580534, 580258, 580515, 581424, 582490, 583168, 583472, 583839, 584467, 585086, 585457, 585828, 586704, 588337, 590541, 592861, 594865, 596471, 598115, 600356, 603185, 605966, 608220, 610208, 612553, 615590, 619323, 623676, 628426, 633168, 637728, 642354, 647048, 651037, 653547, 654905, 656210, 657976, 659843, 661651, 663967, 667256, 671214, 675328, 679495, 683727, 687803, 691721, 696021, 701085, 706468, 711447, 715957, 720472, 725208, 730015, 734866, 739860, 744888, 749862, 755216, 761593, 769029, 776949, 784991, 793210, 801341, 808520, 814138, 818626, 823009, 827928, 833385, 839231, 845530, 852471, 860148, 868362, 876607, 884372, 891590, 898635, 905715, 912443, 918257, 923235, 928218, 934048, 940764, 947619]
49660I47619O181N262M637M343M067L735L622L901M234M166L798L739M283M900
49646A008487M873M259L901M382N291N777N611N343N502N974O341O404O231N938
49632A084314N741N931O586P336P748P754P539P191O748O412O352O459O590O853
49618A179554P353P855Q165Q588R397J0057R706Q467P539P743Q619R225R251Q958
49604A300477Q524P980P521P464P877Q493Q936R011Q955R208R750R862R015P783
49590A420856P188P360P656Q015R070J0753J1899J1797J1098J0608J0218R727
49578A536245R681J0466J1390J1802J2235J3280J4099J3529J2151J1652J2356
49567A668886J3048J3129J3278J3749J3755J3103J2957J4040J5371J5703J5205
$$ y = [947619, 953800, 959062, 963699, 968042, 972109, 975844, 979466, 983367, 987601, 991767, 995565, 999304, 1003587, 1008487, 1013360, 1017619, 1021520, 1025902, 1031193, 1036970, 1042581, 1047924, 1053426, 1059400, 1065741, 1072145, 1078376, 1084314, 1090055, 1095986, 1102572, 1109908, 1117656, 1125410, 1132949, 1140140, 1146888, 1153300, 1159652, 1166111, 1172701, 1179554, 1186907, 1194762, 1202927, 1211515, 1220912, 1230969, 1240675, 1249142, 1256681, 1264424, 1273043, 1282268, 1291519, 1300477, 1309001, 1316981, 1324502, 1331966, 1339843, 1348336, 1357272, 1366283, 1375238, 1384446, 1394196, 1404058, 1413073, 1420856, 1428044, 1435404, 1443060, 1451075, 1460145, 1470898, 1482797, 1494594, 1505692, 1516300, 1526518, 1536245, 1545926, 1556392, 1567782, 1579584, 1591819, 1605099, 1619198, 1632727, 1644878, 1656530, 1668886, 1681934, 1695063, 1708341, 1722090, 1735845, 1748948, 1761905, 1775945, 1791316, 1807019, 1822224]
49556A822224J4737J4322J3529J2678J2509J2978J3390J3486J3446J3112J2098
49545A968509J0722R857R727R551Q642P315O328N877N439M551L450K886L278M120
49531B060252M458L890K848J846R42J42j80K84J207J960K337K546K736K927L276
49516B091471L975M944N959O851P361P102O111N099M649M378L589K428J648J352
$$ y = [1822224, 1836961, 1851283, 1864812, 1877490, 1889999, 1902977, 1916367, 1929853, 1943299, 1956411, 1968509, 1979231, 1989088, 1998815, 2008366, 2017008, 2024323, 2030651, 2036528, 2041967, 2046518, 2049968, 2052854, 2056132, 2060252, 2064710, 2068600, 2071448, 2073294, 2074236, 2074378, 2074198, 2074482, 2075689, 2077649, 2079986, 2082532, 2085268, 2088195, 2091471, 2095446, 2100390, 2106349, 2113200, 2120561, 2127663, 2133774, 2138873, 2143522, 2147900, 2151489, 2153917, 2155565, 2156917]
$$ [...]
##END NTUPLES=NMR SPECTRUM
##END=
