
##TITLE=AC1335_MEXAH11120_6616011_TtothWJspJ
##JCAMPDX= 6.0         $$ Bruker NMR JCAMP-DX V2.0
##DATA TYPE= NMR SPECTRUM
##DATA CLASS= NTUPLES
##ORIGIN= BRUKER
##OWNER= Administrator
$$ 1.72 TOPSPIN		Version 2.1
$$ 2012-08-03 01:15:22.218 -0500  Administrator@TOPSPIN
$$ Compression mode = diff/dup
##.OBSERVE FREQUENCY= 400.02188249412
##.OBSERVE NUCLEUS= ^1H
##.ACQUISITION MODE= SIMULTANEOUS (DQD)
##.ACQUISITION SCHEME= undefined
##.AVERAGES= 8
##.DIGITISER RES= 22
##SPECTROMETER/DATA SYSTEM= spect
##.PULSE SEQUENCE= zg30
##.SOLVENT NAME= COFFEE_meoh
##.SHIFT REFERENCE= INTERNAL, COFFEE_meoh, 1, 14.98509
##AUDIT TRAIL= $$ (NUMBER, WHEN, WHO, WHERE, PROCESS, VERSION, WHAT)
$$ ##TITLE= Audit trail, TOPSPIN		Version 2.1
$$ ##JCAMPDX= 5.01
$$ ##ORIGIN= Bruker BioSpin GmbH
$$ ##OWNER= Administrator
$$ $$ C:\Bruker\TOPSPIN/data/COFFEE/nmr/AC1335_MEXAH11120_6616011_TtothWJspJ/10/pdata/1/auditp.txt
$$ ##AUDIT TRAIL=  $$ (NUMBER, WHEN, WHO, WHERE, PROCESS, VERSION, WHAT)
(   1,<2012-08-03 01:15:15.296 -0500>,<Administrator>,<TOPSPIN>,<go>,<TOPSPIN 2.1>,
      <created by zg
	started at 2012-08-03 01:14:08.812 -0500,
	POWCHK enabled, PULCHK disabled,
       configuration hash MD5:
       6B 1B 68 BB D9 2E 58 E2 7F 35 AD 54 07 DF 0E 41
       data hash MD5: 64K
       B2 52 16 47 E5 FD 99 05 8F 99 8F B1 6D 7C 82 82>)
(   2,<2012-08-03 01:15:17.921 -0500>,<Administrator>,<TOPSPIN>,<proc1d>,<TOPSPIN 2.1>,
      <Start of raw data processing
       efp LB = 0 FT_mod = 6 PKNL = 1 PHC0 = 0 PHC1 = 0 SI = 32K 
       data hash MD5: 32K
       05 72 75 43 64 10 99 9E B3 4F 01 86 E2 47 BC 55>)
(   3,<2012-08-03 01:15:18.281 -0500>,<Administrator>,<TOPSPIN>,<proc1d>,<TOPSPIN 2.1>,
      <pk PHC0 = 177.9236 PHC1 = 0 
       data hash MD5: 32K
       FB B2 87 B4 6A 56 56 19 A1 F8 A0 5E E7 E2 F5 5F>)
(   4,<2012-08-03 01:15:18.359 -0500>,<Administrator>,<TOPSPIN>,<proc1d>,<TOPSPIN 2.1>,
      <abs ABSG = 1 
       data hash MD5: 32K
       8B A2 6F D6 12 22 14 F4 27 95 42 A8 7A 55 EF 37>)
(   5,<2012-08-03 01:15:18.390 -0500>,<Administrator>,<TOPSPIN>,<proc1d>,<TOPSPIN 2.1>,
      <abs ABSG = 2 
       data hash MD5: 32K
       62 7D 2F BA 51 F3 29 B5 17 0D 17 7E FA 57 6F 0F>)
(   6,<2012-08-03 01:15:18.421 -0500>,<Administrator>,<TOPSPIN>,<proc1d>,<TOPSPIN 2.1>,
      <abs ABSG = 3 
       data hash MD5: 32K
       42 25 EB D4 9A FA 66 28 31 B9 D5 D6 5A 3E 7F 6C>)
(   7,<2012-08-03 01:15:18.437 -0500>,<Administrator>,<TOPSPIN>,<proc1d>,<TOPSPIN 2.1>,
      <abs ABSG = 4 
       data hash MD5: 32K
       54 A9 36 3F 65 B7 B4 B1 97 3B 68 45 D7 72 61 CC>)
(   8,<2012-08-03 01:15:18.468 -0500>,<Administrator>,<TOPSPIN>,<proc1d>,<TOPSPIN 2.1>,
      <abs ABSG = 5 
       data hash MD5: 32K
       34 08 BD FD 10 4F 6B F1 CB A8 C0 F4 42 0B 7C 2F>)
$$ ##END=
$$ 
$$ $$ hash MD5
$$ $$ F7 E3 DE AD 4C A5 41 B0 3A CE C0 91 EB 5E AF BD
##$RELAX= 
##$RELAX= 
##$RELAX= 
##$RELAX= 
##$RELAX= 
##$RELAX= 
##$RELAX= 
$$ Bruker specific parameters
$$ --------------------------
$$ [...]
150 150 150 150 150 150 150 150
##$TP07= 0
##$TPNAME0= <>
##$TPNAME1= <>
##$TPNAME2= <>
##$TPNAME3= <>
##$TPNAME4= <>
##$TPNAME5= <>
##$TPNAME6= <>
##$TPNAME7= <>
##$TPOAL= (0..7)
0.5 0.5 0.5 0.5 0.5 0.5 0.5 0.5
##$TPOFFS= (0..7)
0 0 0 0 0 0 0 0
##$TUNHIN= 0
##$TUNHOUT= 0
##$TUNXOUT= 0
##$USERA1= <user>
##$USERA2= <user>
##$USERA3= <user>
##$USERA4= <user>
##$USERA5= <user>
##$V9= 5
##$VALIST= <valist>
##$VCLIST= <CCCCCCCCCCCCCCC>
##$VD= 0
##$VDLIST= <DDDDDDDDDDDDDDD>
##$VPLIST= <PPPPPPPPPPPPPPP>
##$VTLIST= <TTTTTTTTTTTTTTT>
##$WBST= 1024
##$WBSW= 4
##$XGAIN= (0..3)
0 0 0 0
##$XL= 0
##$YL= 0
##$YMAX_a= 482538
##$YMIN_a= -630697
##$ZGOPTNS= <>
##$ZL1= 120
##$ZL2= 120
##$ZL3= 120
##$ZL4= 120
##$ABSF1= 14.98509
##$ABSF2= -5.573092
##$ABSG= 5
##$ABSL= 3
##$ALPHA= 0
##$AQORDER= 0
##$ASSFAC= 0
##$ASSFACI= 0
##$ASSFACX= 0
##$ASSWID= 0
##$AUNMP= <proc_prof1d_extract_pilot.lims>
##$AXLEFT= 0
##$AXNAME= <>
##$AXNUC= <1H>
##$AXRIGHT= 0
##$AXTYPE= 0
##$AXUNIT= <>
##$AZFE= 0.1
##$AZFW= 0.1
##$BCFW= 0
##$BC_mod= 0
##$BYTORDP= 0
##$COROFFS= 0
##$CY= 15
##$DATMOD= 1
##$DC= 0
##$DFILT= <>
##$DTYPP= 0
##$F1P= 0
##$F2P= 0
##$FCOR= 0.5
##$FTSIZE= 32768
##$FT_mod= 6
##$GAMMA= 0
##$GB= 0
##$INTBC= 1
##$INTSCL= 1
##$ISEN= 128
##$LB= 0
##$LEV0= 0
##$LPBIN= 0
##$MAXI= 10000
##$MC2= 0
##$MEAN= 0
##$ME_mod= 0
##$MI= 0
##$NCOEF= 0
##$NC_proc= -8
##$NLEV= 6
##$NOISF1= 0
##$NOISF2= 0
##$NSP= 0
##$NTH_PI= 0
##$NZP= 0
##$OFFSET= 14.98509
##$PC= 1
##$PHC0= 177.9236
##$PHC1= 0
##$PH_mod= 1
##$PKNL= yes
##$PPARMOD= 0
##$PPDIAG= 0
##$PPIPTYP= 0
##$PPMPNUM= 2147483647
##$PPRESOL= 1
##$PSCAL= 4
##$PSIGN= 0
##$PYNMP= <proc.py>
##$REVERSE= no
##$SF= 400.02
##$SI= 32768
##$SIGF1= 0
##$SIGF2= 0
##$SINO= 400
##$SIOLD= 32768
##$SPECTYP= <>
##$SREGLST= <1H.CDCl3>
##$SSB= 0
##$STSI= 32768
##$STSR= 0
##$SW_p= 8223.68421052631
##$SYMM= 0
##$S_DEV= 0
##$TDeff= 65536
##$TDoff= 0
##$TI= <>
##$TILT= no
##$TM1= 0
##$TM2= 0
##$TOPLEV= 0
##$USERP1= <user>
##$USERP2= <user>
##$USERP3= <user>
##$USERP4= <user>
##$USERP5= <user>
##$WDW= 1
##$XDIM= 32768
##$YMAX_p= 462945520
##$YMIN_p= -766076
##$CURPLOT= <Network HP LaserJet P1505>
##$CURPRIN= <$Network HP LaserJet P1505>
##$DFORMAT= <normdp>
##$LAYOUT= <+/1D_H.xwp>
##$LFORMAT= <normlp>
##$PFORMAT= <normpl>
##$SURQMSG= 1
$$ End of Bruker specific parameters
$$ ---------------------------------
##NTUPLES= NMR SPECTRUM
##VAR_NAME=  FREQUENCY,     SPECTRUM/REAL,   SPECTRUM/IMAG
##SYMBOL=    X,             R,               I
##VAR_TYPE=  INDEPENDENT,   DEPENDENT,       DEPENDENT
##VAR_FORM=  AFFN,          ASDF,            ASDF
##VAR_DIM=   32768,         32768,           32768
##UNITS=     HZ,            ARBITRARY UNITS, ARBITRARY UNITS
##FACTOR=    0.250966925370066, 1,           1
##FIRST=     8223.43324360094, -206581,      -31738
##LAST=      0,             51525,           -212188
##MIN=       0,             -766076,         0
##MAX=       8223.43324360094, 462945520,    0
$$ Real data points
##PAGE= N=1
##DATA TABLE= (X++(R..R)), XYDATA
$$ [...]
$$ plain form
19502 -132125 45550 -94128 473240 -140799 -47709 -21584 -234960 -75932 45441 -310367 -240390
19491 -240390 112664 80664 256242 277396 -196758 -83928 -556963 -282760 -89989 68904
19480 -185427 -359799 -176118 45195 -337759 125154 -225663 -295569 233460 175771 -410479
19469 -196720 -291199 160580 -336862 -301502 216536 85018 -34782 -54138 -59090 -229490 -34273
19457 -174300 -481748 -175024 -266015 27655 -50012 -483940 -336729 -187345 34123 -248721
19446 -219188 -159453 -202870 -332544 151156 -181238 -33097 -94180 -29319 -427583 -29030 -89282
19435 -89282 211635 -478535 -127099 -148365 -146512 -188002 -53928 49098 -27030 -39528 43382
19423 44786 129352 -63410 -81358 -551954 38139 -444405 -70588 -208153 -27102 -345445 142935
$$ packed form
19502a32125D5550i4128D73240a40799d7709b1584k13376g5932D5441c10367O9977
19491b40390A12664l2000J75578K1154a96758h3928m73035K74203h9989F8904
19480a85427j74372a76118D5195c37759A25154b25663o9906B33460n7689d10479
19469a96720r4479A60580c36862L5360B16536H5018c4782j9356m952j70400c4273
19457a74300l07448a75024r0991B7655e0012m33928J47211J49384C4123b48721
19446b19188N9735m3417j29674A51156a81238c3097o1083b9319l98264b9030o0252
19435h9282B11635d78535a27099k1266J853m1490e3928D9098b7030j2498D3382
19423D4786Q4566f3410j7948m70596C8139d44405g0588j37565b7102l18343A42935
$$ plain form
19411 14157 -62026 202079 -503671 -226794 -10938 -94382 146694 -291652 -226183 -286490 325391
19399 51945 -209193 131157 -124805 -102242 -28125 62629 -244673 -115837 -90461 -170266 184945
19387 -174794 411267 -139711 -180262 -226395 -41205 147482 158729 -77428 -86426 -150884 -310610
19376 -310610 -211872 -185497 -99685 -146810 -142088 -31325 104071 -90670 -392934 25498 -234669
19364 271686 -163597 -198974 4620 302624 -58407 -255515 -126230 251778 -224458 -273252
19354 -273252 163829 106552 -93206 111207 -150968 -26023 111222 5146 -292259 86080 -307310
19342 -149950 -349222 -243695 -63151 336723 -158147 -58948 -21226 -80586 -113883 145760
19331 102816 -119988 94908 257342 -292199 -151118 152296 17201 -886 -445809 130762
$$ packed form
19411A4157f2026B02079e03671b26794a0938q3444A46694b91652O5469o0307C25391
19399E1945b09193A31157a24805K2563b8125F2629b44673a15837K5376p9805A84945
19387a74794D11267a39711m0551m6133d1205A47482J1247g7428q998o4458j59726
19376c10610R8738K6375Q5812m7125M722c1325A04071i0670l02264B5498b34669
19364B71686a63597l5377D620K98004e8407j97108a26230B51778b24458m8794
19354b73252A63829n7277i3206A11207a50968b6023A11222E146b92259H6080c07310
19342a49950j99272J05527f3151C36723a58147e8948b1226n9360l3297A45760
19331A02816a19988I4908J62434b92199J41081A52296A7201h86m44923A30762
$$ plain form
19320 -131023 -167986 -40984 10645 100094 49788 -51249 -46885 100158 -22998 128099 -27628
19308 73275 97364 -7150 -166289 -520122 -136516 128054 -169373 -32216 94775 156682 -54556
19296 -101362 116359 -258659 137626 -190256 -140247 -253579 -300961 -126249 -583190 70090
19285 -200176 -239249 -59857 155006 -178619 -38245 -20406 -34842 -141037 -8496 4046 -254923
19273 -143746 248070 68774 -158993 24247 -40588 255779 -37901 -201837 -290240 -23409 19854
19261 -203562 29562 302025 99610 -243612 -181518 -286561 101693 -366483 -129438 -57473
19250 -158122 -88354 -54519 138712 -107782 128338 4139 -114263 134740 -172557 -151056
19240 -151056 -102935 -44356 -187621 -165416 -180800 -32283 343825 -133679 -230141 -22496 166560
$$ packed form
19320a31023l6963d0984A0645Q9449D9788e1249M364A00158b2998A28099b7628
19308G3275K4089g150j59139l53833a36516A28054a69373c2216I4775O1907e4556
19296a01362A16359b58659A37626a90256N0009j13332m7382a26249m56941G0090
19285b00176l9073e9857A55006a78619c8245J7839j4436j06195h496D046b54923
19273a43746B48070F8774a58993B4247d0588B55779c7901j63936q8403b3409A9854
19261b03562B9562K72463I9610b43612O2094j05043A01693c66483a29438e7473
19250a58122O9768L3835A38712a07782A28338D139a14263A34740a72557K1501
19240a51056M8121d4356j43265K2205j5384c2283C43825a33679r6462b2496A66560
$$ plain form
19228 -38535 -151761 -110758 -139986 -236531 -53468 108756 143387 -263990 101583 -100020 -16148
19216 -12689 -167049 106168 -189059 -174745 -243487 188165 -112437 -114586 111313 -67840 7473
19204 164764 56317 188741 -29658 -258818 1342 -164502 127996 -19181 -42792 37071 182043
19193 182043 33931 171947 -162361 -161389 8982 -160054 -252031 -108549 -18482 -9832 -76164
19182 -76164 -73031 27407 266281 -67139 -133580 28764 -101318 -65727 -174851 -126845 239148
19170 -110388 -24348 -65207 -69535 72122 56506 40744 -316980 -69913 160106 -56961 -125118
19159 -125118 13674 -7651 79084 -183335 244535 246593 -78640 -173262 245382 46857 18438
19147 -41230 91221 -394184 -137524 -99364 -275906 34486 -216967 100009 393893 -318464
$$ packed form
19228c8535j13226M1003k9228r6545e3468A08756L4631b63990A01583a00020a6148
19216a2689j54360A06168a89059J4314o8742A88165a12437k149A11313f7840G473
19204A64764E6317J32424b9658k29160A342a64502A27996a9181k3611C7071J44972
19193A82043C3931J38016a62361R72H982a60054r1977a08549a8482Q650o6332
19182g6164L133B7407K38874f7139o6441B8764a01318L5591j09124M8006B39148
19170a10388b4348m0859m328G2122j5616j5762c16980f9913A60106e6961o8157
19159a25118A3674g651G9084a83335B44535K058g8640r4622B45382D6857A8438
19147d1230I1221c94184a37524L8160j76542C4486b16967A00009K93884c18464
$$ plain form
19136 -35377 -133933 -29185 83744 -183011 112038 27716 -221135 267107 -64651 -266464 -299065
19125 -299065 -102447 100952 -182800 -256973 40916 135141 53055 -254562 -203474 -74766 -288567
19114 -288567 -42979 -273653 158656 -162612 -290762 -88284 49705 -188642 -324481 -73393
19103 -16330 -98482 -51164 23800 -179402 -116885 41949 47982 -17630 -528353 -288341 -83020
19091 82184 95681 -122016 -93133 -375414 -109614 23421 100524 33621 49400 29281 -89455
19079 -223450 110722 141018 -35448 -200407 -118911 -322894 53051 -37753 -238915 374010
19068 244609 474758 495961 235377 102182 -143385 40726 -329561 22764 184669 -9802
19057 -146539 -177922 -26296 -50003 31026 -333718 -52304 -293626 88709 260619 287249 -226794
$$ packed form
19136c5377r8556b9185H3744a83011A12038B7716b21135B67107f4651k01813l2601
19125b99065a02447A00952a82800p4173D0916R4225E3055b54562N1088g4766k13801
19114b88567d2979k30674A58656a62612j28150h8284D9705a88642j35839g3393
19103a6330q2152M7318B3800a79402O2517D1949O033a7630n10723K40012h3020
19091H2184J3497a22016K8883k82281a09614B3421P7103C3621J5779k0119h9455
19079b23450A10722L0296c5448j64959Q1496k03983E3051c7753k01162C74010
19068B44609K30149K1203B35377A02182a43385D0726c29561B2764J61905i802
19057a46539l1383b6296k3707C1026c33718e2304k41322H8709J71910K6630b26794
$$ plain form
19045 -78611 -50049 -38984 53862 -359447 -143172 180080 -267548 -96758 -199414 -168654 -49008
19033 -240662 -476866 -121968 78131 -107276 -69277 -81010 -99527 60930 -93367 16737 -45084
19021 -18841 26427 65765 -142750 346738 -133389 126509 191498 -139866 182444 -174237
19010 331927 -229366 113738 -42684 127161 447286 255900 7815 50694 84390 114553 -147233
18998 368686 230711 -3397 -116440 138446 2368 -201344 -208639 -325677 -73058 236534 95328
18986 -60979 149741 2444 -58953 -143052 -50429 38015 77202 63637 102221 -73496 -208030
18975 -208030 98617 141892 36763 -72830 753659 727924 178873 -49433 412634 -174030 104779
18963 -115575 -10918 -114318 -216587 -60936 119163 -376556 182778 -54546 100840 72412
$$ packed form
19045g8611K8562J1065E3862c59447a43172A80080b67548i6758j02656L0760d9008
19033b40662k36204a21968G8131a07276L7999j1733j8517F0930i3367A6737d5084
19021a8841B6427L9338a42750C46738a33389A26509O4989a39866A82444a74237
19010C31927b29366A13738d2684A27161L20125j91386G815M2879L3696L0163a47233
18998C68686j37975c397j13043A38446B368b01344p295j17038g3058B36534I5328
18986f0979A49741B444e8953q4099e0429C8015L9187j3565L8584g3496j34534
18975b08030I8617M3275C6763g2830G53659k5735A78873d9433D12634a74030A04779
18963a15575a0918j03400j02269f0936A19163c76556A82778e4546A00840k8428
$$ plain form
18953 72412 -212003 -233428 35234 -43408 106725 -262155 -141287 -194589 -353015 -229371
18943 -229371 42596 78655 7270 85656 -50372 -3209 72276 27520 -118557 125753 -94862
18931 -44371 -200636 130935 -21313 -118934 -389612 -213404 -30991 137348 -119267 375319
18920 15017 114534 -25496 -267765 -110918 26991 -145481 -160718 -904 57567 -113961 -400485
18909 -400485 130571 554523 563487 463656 200718 66712 146451 16191 -218295 44348 -279216
18897 112444 -151993 97443 22221 -155482 -398706 43198 52058 101379 163065 -239542 -183018
18886 -183018 -44248 121330 -209244 135553 48894 -294632 -237820 311190 116074 38903
18875 228567 111935 48575 104909 -108205 76107 -58674 28342 -74146 18836 -76580 -270404
$$ packed form
18953G2412b12003k1425C5234d3408A06725b62155J20868n3302j58426J23644
18943b29371D2596L6059G270P8386e0372c209G2276B7520a18557A25753i4862
18931d4371j56265A30935b1313r7621k70678J76208c0991A37348a19267C75319
18920A5017R9517b5496k42269a10918B6991a45481j5237i04E7567a13961k86524
18909d00485A30571M23952Q964r9831B00718F6712P9739A6191b18295D4348b79216
18897A12444a51993I7443B2221a55482k43224D3198Q860M9321O1686b39542N6524
18886a83018d4248A21330b09244A35553D8894b94632N6812C11190A16074C8903
18875B28567A11935D8575N6334a08205G6107e8674B8342g4146A8836g6580j93824
$$ plain form
18864 -270404 -153602 -345266 -87392 -222163 181688 -45255 -103389 -226782 -43066 -562903
18854 -562903 -248268 -116961 311666 -237572 -209237 -103417 117855 -79982 95946 -139720
18843 -69129 520224 152022 -124285 131381 143974 39132 78747 -176424 -1104 -227343 216413
18831 -119868 204388 111131 -238661 147224 -57600 -159 -167761 -205535 149218 -542914 171525
18819 -173221 -5291 -56774 1403 -263917 -5475 256577 -67010 177962 79662 69855 80872 410137
18807 410137 40409 148953 159730 -8308 -115095 -62793 -67365 37341 172511 -194300 -25081
18795 -157703 7193 -32747 71639 229649 -152025 -87831 -131071 188472 -156233 208205 314342
18784 314342 -293009 90292 -134251 -85727 -67698 33931 160382 -39559 -119537 -181968 9040
$$ packed form
18864b70404J16802j91664h7392j34771A81688d5255n8134j23393d3066n19837
18854e62903b48268a16961C11666b37572K8335a03417A17855g9982I5946a39720
18843f9129E20224A52022a24285A31381J2593C9132L9615a76424a104k26239B16413
18831a19868B04388r3257b38661A47224e7600a59j67602l7774A49218e42914A71525
18819a73221e291n1483A403b63917e475B56577f7010A77962G9662r807J1017L29265
18807D10137D0409J08544J0777h308j06787N2302m572C7341J35170a94300b5081
18795a57703G193c2747G1639J58010a52025O4194m3240A88472a56233B08205J06137
18784C14342b93009I0292a34251M8524J8029C3931J26451c9559p9978o2431I040
$$ plain form
18772 -157331 -233789 194267 47166 -87478 -1070 81433 83823 -410302 -451744 -144456 -280434
18761 -280434 139813 162653 -77729 -456527 -358094 -28674 312569 -16438 -215341 -127208 -21910
18749 -87557 -27980 341256 95251 22994 -165850 -67640 -84874 -152130 -68223 -216647 -187467
18738 -187467 204719 62025 -587869 83225 -144007 57613 -20523 171568 247395 317883 -28490
18726 246005 10573 -53518 107504 -41134 -58665 178023 -23022 111842 45451 -184618 -122601
18715 -122601 -259067 -201400 -59483 99739 -115792 -50676 -84004 -247339 -73319 -98023 -108840
18704 -108840 -56763 -102821 -55841 -56219 -71495 -437795 46946 -231121 104295 -335401 -175692
18693 -175692 -294841 -2800 71091 -187338 53655 27128 126137 52649 9446 -192866 -167 102027
$$ packed form
18772a57331p6458A94267D7166h7478a070H1433K390d10302m1442a44456j35978
18761b80434A39813K2840g7729l78798R8433b8674C12569a6438j98903Q8133b1910
18749h7557b7980C41256I5251B2994a65850f7640j7234o7256f8223j48424K9180
18738a87467B04719F2025e87869H3225a44007E7613b0523A71568P5827P0488b8490
18726B46005A0573e3518A07504d1134j7531A78023b3022A11842D5451a84618O2017
18715a22601j36466N7667e9483I9739a15792e0676l3328j63335g3319k4704j0817
18704a08840N2077m6058M6980l78j5276l66300D6946b31121A04295c35401J59709
18693a75692j19149b800G1091a87338E3655k6527R9009E2649I446a92866a67A02027
$$ plain form
18680 -395198 93531 -174117 -72375 -157321 -252739 -56324 193187 -222664 238617 106861
18669 49843 2289 16688 -24032 -164649 104786 -224803 -235540 41048 100372 -202913 40217
18657 -31167 -105643 -153295 -275565 51429 171545 4850 126881 -294615 228073 -132557 154342
18645 -140387 -198488 -406789 -122180 -107693 -141009 -10520 -440629 79912 -43791 18709 18953
18634 18953 56790 -63175 198779 333696 -42419 -59912 -160095 -136003 249203 238781 -85059
18622 -5244 33331 -125038 -318107 -321726 356730 -141151 235263 -102857 120478 -252305
18611 110244 14428 35464 -20831 -157691 -134192 -140008 5203 -91720 -79962 180891 -14666
18599 -100743 -61183 114271 -308535 -115589 20199 -270221 5951 -361776 -159195 1595 -50543
$$ packed form
18680c95198I3531a74117g2375q4946r5418e6324A93187b22664B38617A06861
18669D9843B289J4399b4032j40617A04786b24803j0737D1048N9324b02913D0217
18657c1167p4476m7652j22270E1429J20116D850J22031b94615B28073a32557A54342
18645a40387n8101k08301a22180J4487l3316a0520m30109G9912d3791A8709K44
18634A8953L7837f3175A98779J34917d2419j7493j00183K4092B49203j0422h5059
18622e244C3331a25038j93069l619C56730a41151B35263a02857A20478b52305
18611A10244A4428K1036b0831j36860K3499n816E203i1720J1758A80891a4666
18599a00743L9560A14271c08535a15589B0199b70221E951c61776a59195A595e0543
$$ plain form
18587 201632 80832 -216283 220577 -195416 208691 41914 -52619 64743 -410066 -55208
18576 -13380 135155 -129001 -17307 -364103 -22221 -49501 -31277 -153071 167217 -90564 -293319
18565 -293319 -270192 -225149 65552 204302 78410 -329035 76175 -64768 -281613 86750 -219204
18553 -51971 109665 -221716 -172100 52612 186769 -214063 -205134 -187058 308269 -454943 -200266
18541 -203913 157951 37349 -127913 -273328 -211029 -137579 9188 -99922 -250117 9653 -81694
18529 24020 -183255 -260947 -202615 -63046 -76033 -10965 131197 -325419 335796 -242058 -337950
18518 -337950 83593 -129562 337513 -75953 193599 -259220 192189 -567397 -101450 6725
18507 -7271 389631 -83697 307831 16249 354781 302084 -474361 56793 32168 -90524 -4420
$$ packed form
18587B01632H0832b16283B20577a95416B08691D1914e2619F4743d10066e5208
18576a3380A35155a29001a7307l46796b2221k7280J8224j21794A67217i0564k02755
18565b93319K3127M5043F5552J38750G8410c29035G6175f4768k16845H6750b19204
18553e1971A09665b21716M9616E2612J34157b14063Q929J8076C08269d54943b00266
18541b03913A57951C7349a27913j45415O2299P3450I188i9922j50195I653h1694
18529B4020a83255p7692N8332f3046j2987a0965A31197c25419C35796b42058r5892
18518c37950H3593a29562C37513g5953A93599b59220A92189e67397a01450F725
18507g271C89631h3697C07831A6249L38532n2697d74361E6793k4625i0524d420
$$ plain form
18495 -12056 325036 -334805 99861 -278159 61631 339799 36881 -547841 293954 -90377
18484 -89087 -99476 -280377 -53845 114412 -159791 -8515 -216223 -224490 -1569 251096 182056
18473 182056 261290 -111681 -139146 -85798 -189058 145217 -285663 -51413 -137500 58713 -95121
18461 -25451 -347971 27707 114851 -60774 -4022 46678 -341990 153787 -40796 -252243 -178572
18450 -178572 -56991 -86856 -211132 -75685 -68583 185596 34693 44583 115542 -16954 83838
18438 -27634 41799 3147 116266 282093 17885 27502 -173485 172766 48319 -944 123186
18426 44482 -191415 -61267 -233445 -74855 144279 7989 -326859 -22954 -344445 66246 -47791
18414 143323 -147304 -220840 197561 -485 260927 -301435 -6075 90808 21845 262501 43416
$$ packed form
18495a2056C25036c34805I9861b78159F1631K78168C6881e47841B93954i0377
18484h9087j0389j80901e3845A14412a59791h515k07708q267a569B51096o9040
18473A82056P9234a11681k7465N3348j03260A45217b85663e1413q6087E8713i5121
18461b5451l22520B7707Q7144f0774d022D6678c41990A53787d0796k11447P3671
18450a78572e6991k9865j24276g5685P102A85596C4693R890P0959a6954H3838
18438b7634D1799C147J13119J65827A7885R617a73485A72766D8319i44A23186
18426D4482a91415f1267j72178g4855A44279G989c26859b2954l21491F6246d7791
18414A43323a47304p3536A97561d85B60927c01435f075I0808B1845K40656D3416
$$ plain form
18402 -431885 116959 229881 77419 -94334 -98368 -46476 173640 123889 -153279 257648 -85222
18390 95961 177940 -34497 -49033 -624108 -124005 43916 230605 -24567 277070 -316071 16147
18378 207418 -221816 -165573 -89669 -21531 63531 275351 -277962 -60181 53723 -134776 66657
18366 -265829 122909 -35312 34435 -33232 -54098 98530 294371 179991 -51542 -141806 78169
18354 181668 58105 -77171 -53261 -51209 51039 -153677 97218 268498 -189046 -326549 -12588
18342 15449 55431 50447 -52950 -244059 8906 -140418 108231 151301 -365573 -50867 113967
18330 -180374 -170807 -131876 -73335 265252 227417 -34817 -8505 189473 -65092 -200784 390725
18318 49465 100541 42376 -246731 6862 -31919 69172 87402 -98020 203590 -253766 -140862
$$ packed form
18402d31885A16959J12922G7419i4334m034d6476A73640m9751a53279B57648h5222
18390I5961Q1979c4497j4536n75075a24005D3916J86689b4567B77070c16071A6147
18378B07418b21816N6243P5904b1531F3531K11820b77962f0181E3723a34776F6657
18366b65829A22909c5312C4435c3232k0866I8530J95841j14380e1542r0264G8169
18354A81668E8105g7171K3910K052E1039a53677I7218J71280a89046j37503a2588
18342A5449L9982m984e2950j91109H906a40418A08231M3070c65573e0867A13967
18330a80374R567L8931N8541B65252l7835c4817h505A89473f5092j35692C90725
18318D9465N1076D2376b46731F862c1919F9172J8230i8020B03590b53766J12904
$$ plain form
18307 -140862 92470 -370937 -321932 62970 -309184 9580 116626 196426 -151270 -199167 -188577
18296 -188577 -81786 224028 -259710 321813 -334936 30148 -126163 -194286 -119108 -105951
18286 -105951 65633 32065 149984 165255 -155646 -84991 126717 38253 39326 129715 207681
18275 207681 -3934 144547 -237098 353127 -296472 -280457 223331 -224817 25004 295207
18265 295207 -40919 -64946 -4009 -87943 -434738 2078 -217198 347330 52753 -169162 -130159
18254 -130159 71138 150597 137945 63632 115017 76771 161521 -346749 9488 -158899 -42250
18242 -5568 -423192 283873 -69097 6702 -291135 50837 302810 -91086 45106 219220 93197
18230 -250223 131761 -75881 -185991 21043 362676 28287 58462 -13401 27700 -237774 261710
$$ packed form
18307a40862I2470c70937M9005F2970c09184I580J07046P9800a51270m7897J0590
18296a88577h1786B24028b59710C21813c34936C0148a26163o8123P5178J3157
18286a05951F5633C2065J17919J5271a55646P0655A26717C8253J073R0389P7966
18275B07681c934A44547b37098C53127b96472J6015B23331b24817B5004K70203
18265B95207d0919k4027d009q3934l46795B078b17198C47330E2753a69162L9003
18254a30159G1138P9459j2652F3632N1385l8246Q4750c46749I488a58899d2250
18242e568m17624B83873f9097F702b91135E0837K51973i1086D5106J74114I3197
18230b50223A31761g5881j10110B1043L41633B8287L0175a3401B7700b37774B61710
$$ plain form
18218 -167069 -91951 108103 -251029 -182472 -345456 -128024 -116469 34468 -93275 352161
18207 117569 -115894 -68096 -157745 -146780 162403 -166589 170336 -350779 28312 250944
18197 250944 5691 -182604 -105797 228917 -25140 128076 53964 -70114 -55794 -207799 72573
18185 50440 263321 -126962 231996 -77071 -262555 -136508 -5979 -381343 227284 -83167
18174 -30110 67505 55252 -19754 -268569 -33276 317656 -142147 -196974 -137224 -197742 -36351
18162 -137110 806 -151387 58881 -76377 74494 -101580 -66304 72871 -112352 -245489 173641
18150 72392 -125302 -62052 -107687 -208538 -276817 -136711 83644 161267 -103921 -63895 53660
18138 116287 -183551 -149600 151428 6413 -122660 139364 -246063 297073 175899 395044
$$ packed form
18218a67069P5118A08103b51029O8557j62984a28024J1555C4468i3275C52161
18207A17569a15894M7798q9649J0965A62403a66589A70336c50779B8312K22632
18197B50944E691a82604P6807B28917b5140A28076E3964g0114J4320j52005G2573
18185E0440K12881a26962B31996g7071j85484J26047e979l75364B27284h3167
18174c0110F7505j2253a9754k48815c3276C17656a42147n4827N9750o0518c6351
18162a37110H06a51387E8881g6377G4494a01580L5276G2871a12352j33137A73641
18150G2392a25302f2052m5635j00851o8279a36711H3644P7623a03921M0026E3660
18138A16287a83551L3951A51428F413a22660A39364b46063B97073j21174K19145
$$ plain form
18128 395044 -102855 68305 287744 268250 -200719 -44549 24299 167289 -73971 -183904
18118 -183904 -128854 112220 -65892 -270332 151086 437920 -257566 85024 -227142 11623
18107 183169 56178 -97699 -29262 45794 -401452 -262154 -30667 145890 -23734 96469 77310
18096 77310 227078 -262972 -164750 -79466 -26814 93253 495640 232309 -45611 -21574 -79579
18085 -79579 -439610 10064 -109613 76043 124091 -127167 -334720 51577 -68658 310011 -33314
18073 -35974 76064 57742 -11148 90105 16450 -111853 239508 -169264 -128360 -24479 23848
18061 345601 -123750 -5340 -355159 -302105 -166978 -162173 -125179 127744 -598 55172 -178479
18049 354913 40844 105771 -60163 14339 -80346 -22896 234417 -6398 60524 315070 74467
$$ packed form
18128C95044a02855F8305K19439j9494b00719d4549B4299J42990g3971j09933
18118a83904N5050A12220f5892k04440A51086K86834b57566H5024b27142A1623
18107A83169E6178i7699b9262D5794d01452J39298c0667A45890b3734I6469j9159
18096G7310J49768b62972R8222g9466b6814I3253M02387B32309d5611b1574n8005
18085g9579l60031A0064a09613G6043M8048a27167k07553E1577f8658C10011c3314
18073c5974G6064j8322a1148I0105A6450a11853B39508a69264M0904b4479B3848
18061C45601a23750e340l49819N3054J35127M805L6994A27744e98E5172a78479
18049C54913D0844O4927f0163A4339h0346b2896B34417f398F0524K54546G4467
$$ plain form
18037 231861 -389662 -141217 34610 -204679 -276229 -277949 -187610 -27064 -85904 -102109 -148053
18026 -148053 -115043 99991 -39938 -506 127420 -11018 193586 -222695 -74830 -253606 -259156
18015 -259156 -49360 -190490 -226682 -381707 34550 -203098 -136520 -136561 9923 195138 47004
18003 36363 107689 240250 78925 -218238 156391 51559 66190 105211 20600 -84535 57433
17991 181498 -112134 43523 40939 341003 262652 172532 142795 91390 128728 -48102 206008
17979 366269 -40868 127652 215158 -3842 49662 158993 -843 418057 194226 -226121 -11371
17967 -107493 38003 67786 -155868 390681 -47169 43921 -44075 86367 27136 -84997 93900
17955 279364 358860 -116476 167547 101777 346081 -354268 179248 -297381 -113988 218695
$$ packed form
18037B31861c89662a41217C4610b04679p1550j720R0339b7064n8840j6205m5944
18026a48053L3010I9991c9938e06A27420a1018A93586b22695g4830j78776n550
18015b59156d9360j41130l6192j55025C4550b03098O6578m1I923J85215D7004
18003C6363P1326J32561G8925b18238A56391E1559J4631L9021B0600h4535E7433
17991A81498a12134D3523k584L00064p8351r0120k9737n1405L7338d8102B06008
17979C66269d0868A27652Q7506c842D9662J09331h43D18057A94226b26121a1371
17967a07493C8003K9783a55868C90681d7169D3921d4075H6367B7136h4997I3900
17955B79364P9496a16476A67547o5770K44304c54268A79248b97381a13988B18695
$$ plain form
17944 87360 -196813 55534 37414 456016 132340 -58601 102013 185646 343635 21774 249194
17933 249194 213099 205914 -256260 -145269 23396 13630 -137822 105653 -28775 -8075 -157543
17922 -157543 -18158 -31988 -64247 126192 -220978 196812 175999 296630 178710 163389
17912 163389 -211773 -123714 299140 -153120 -52055 74506 32326 90924 362529 180481
17901 14916 107217 -121008 -44733 72543 166872 -56964 116465 72725 105382 62101 -196019
17889 -19317 40575 63950 -130946 164840 137648 39533 -66045 215790 29408 -199159 -49609
17877 11563 -41199 -165873 -130585 -83241 -503 -49522 -84631 40176 136795 -200489 -103607 77384
17864 201939 -95137 61749 41560 120329 -157094 -28232 355921 143344 -304676 438981
$$ packed form
17944H7360a96813E5534j8120M18602A32340e8601A02013Q3633J57989B1774K27420
17933B49194l6095p185b56260J10991B3396r766a37822A05653b8775h075j49468
17922a57543a8158j3830l2259A26192b20978A96812k0813J20631j17920j5321
17912A63389b11773Q8059B99140a53120e2055G4506C2326N8598K71605A80481
17901A4916R2301a21008d4733G2543R4329e6964A16465m3740L2657m3281a96019
17889a9317D0575K3375a30946A64840k7192C9533f6045B15790B9408a99159d9609
17877A1563d1199j24674L5288M7344e03m9019l5109D0176R6619b00489R6882G7384
17864B01939i5137F1749k0189P8769a57094b8232C55921A43344c04676D38981
$$ plain form
17853 -133572 166641 -240958 302460 -39071 472418 -245979 -224794 97345 92830 184169 -51199
17841 38182 65920 25297 76290 98280 -18814 -65525 298553 -33006 -70609 161240 -148097
17829 202712 -285083 -16323 157921 309632 38588 462179 -78506 -86110 -3986 -218663 252001
17817 211705 11293 1593 22291 -154803 -301210 75338 42423 -127404 346999 21596 258076
17806 258076 147060 323372 -131691 197114 -82709 -84147 -122731 147983 296682 100098
17795 -175667 -62207 -297691 -318084 -6930 -196531 -252064 -60611 -25628 150653 -17963 318740
17783 191621 282994 76822 155438 517906 10454 266189 70412 149951 203726 -111737 -83263
17772 -83263 215600 -243388 42120 -243872 -30646 30738 7481 72340 83919 -126844 -18023
$$ packed form
17853a33572A66641b40958C02460c9071D72418b45979K1185I7345m515R1339e1199
17841C8182K7738B5297N0993K1990a8814m6711B98553c3006l7603A61240a48097
17829B02712b85083a6323A57921J51711C8588M23591g8506p604c986k14677B52001
17817B11705A1293A593K0698a54803j46407G5338l2915a27404C46999B1596K36480
17806B58076j11016J76312a31691A97114h2709j438l8584A47983J48699A00098
17795a75667f2207k35484k0393f930j89601n5533f0611b5628A50653a7963C18740
17783A91621R1373G6822P8616L62468A0454K55735G0412P9539N3775a11737K8474
17772h3263B15600b43388D2120b43872c0646C0738G481O4859J1579a26844a8023
$$ plain form
17760 2092 -69468 -154499 -80550 277410 176079 -110551 263961 155651 339981 -14946 -123779
17749 -123779 203963 106420 9325 -69488 -263052 411967 -69244 -100998 98590 19140 86451
17738 86451 -99258 -32543 184754 166528 307301 259899 106474 20089 -44392 430811 -33108
17726 238426 -263525 -11138 -44976 270008 -101570 48852 291704 281046 191808 -341332
17715 4484 46171 156767 -117862 -40241 52727 -55082 92913 236519 223934 261060 205235
17704 205235 85675 -153921 152397 87611 221674 61254 170471 33840 -110549 -173547
17694 -173547 9748 -54724 199970 -122860 -97121 -58181 42858 182882 17943 5181 -20229
17682 -115977 320104 -60086 200029 -30388 -155773 -108682 -93491 -124137 -135414 181397 -111774
$$ packed form
17760B092f9468q5031P3949B77410j01331a10551B63961j08310J84330a4946j08833
17749a23779B03963r7543I325f9488j93564D11967f9244l1754I8590A9140O7311
17738H6451i9258c2543A84754j8226J40773m7402A06474B0089d4392D30811c3108
17726B38426b63525a1138l3838B70008a01570D8852K42852j0658q9238c41332
17715D484M1687J10596a17862d0241E2727e5082I2913J43606j2585L7126n5825
17704B05235H5675a53921A52397o4786J34063F1254J09217C3840a10549o2998
17694a73547I748e4724A99970a22860K5739L8940D2858J40024A7943E181b0229
17682a15977C20104f0086B00029c0388j25385M7091J5191l0646j1277A81397a11774
$$ plain form
17670 26241 28353 -356423 205571 193735 37414 394898 9403 -108561 -351628 -237854 162024
17658 52688 -168645 -53932 55111 129127 119322 193743 63013 -13611 180838 209534 -78997
17646 -189498 -222944 381491 375776 164924 300193 -77255 172428 116777 346120 542832
17636 542832 238555 326073 90050 57335 305767 87045 -268042 123085 319760 -20563
17625 -90603 207582 -17325 59900 74097 -119094 52867 -23340 372780 217992 9906 385155
17614 385155 162441 63086 -61678 550928 253827 401525 417528 76668 364974 161566
17603 182299 -23228 -101252 182950 353361 168244 160703 -40532 307300 79284 391996 217561
17592 217561 41205 24515 460972 110190 -197142 267939 353678 325107 -152204 281194
$$ packed form
17670B6241K112c56423B05571j1836C7414L57484I403a08561k43067J13774A62024
17658E2688a68645e3932E5111P4016r805P4421F3013a3611A80838K8696g8997
17646a89498l3446C81491n715A64924J35269g7255A72428n5651K29343J96712
17636E42832B38555Q7518I0050l2715K48432H7045b68042A23085J96675b0563
17625i0603B07582a7325E9900J4197a19094E2867b3340C72780j54788I906L75249
17614C85155A62441F3086f1678E50928B53827J47698J6003G6668K88306A61566
17603A82299b3228p8024A82950J70411A68244p541d0532C07300G9284L12712j74435
17592B17561D1205j6690M36457A10190a97142B67939Q5739k8571a52204B81194
$$ plain form
17581 53907 673204 269849 269393 477982 334306 166241 359774 81991 71151 -114360 179261
17569 45704 338464 -146617 -183346 -85857 263479 143607 246153 64998 8185 294120 227354
17558 227354 251615 52305 -4086 -2492 572414 324116 504008 157914 121294 -130056 224319
17546 183085 240825 309261 285399 257890 235959 248974 -41656 701302 391714 165587 40349
17534 150956 62783 146056 132975 486580 642179 363445 266384 759297 566517 1061810
17524 1061810 1031877 1375649 976079 798085 198371 676303 673388 310512 290427 486503
17514 486503 494262 754110 823112 537264 811573 974506 1112606 800728 755105 401863
17504 401863 611082 445689 325374 91612 37316 347839 530902 399614 356686 127799
$$ packed form
17581E3907O19297B69849m56K08589j43676A66241J93533H1991j0840a14360A79261
17569D5704K92760a46617l6729h5857B63479j19872J02546F4998H185K85935o6766
17558B27354K4261E2305d086J594E72414k48298J79892A57914l6620a30056B24319
17546A83085N7740O8436k3862k7509k1931J3015d1656G01302l09588A65587D0349
17534A50956F2783Q3273j3081L53605J55599k78734r7061M92913j92780M95293
17524A061810k9933L43772l99570j77994A98371M77932k915C10512k0085J96076
17514D86503P759K59848O9002k85848K74309J62933J38100l11878m5623l53242
17504D01863K09219j65393j20315I1612C7316L10523J83063j31288m2928A27799
$$ plain form
17493 435264 110907 307813 441309 212386 410782 463142 368898 266909 343108 423963
17483 423963 258544 147984 493877 387570 239422 276639 141810 186073 208958 499397
17473 499397 89498 60854 292516 120247 374714 214940 134929 206659 410660 370287
17463 370287 264787 62542 4122 336381 160600 237678 381022 312638 760114 478550
17453 478550 131577 304590 505244 307327 215434 589544 536068 201908 640140 388178
17443 388178 278255 721159 206645 508660 232074 213260 -36905 111646 364854 296087
17433 296087 2133 417996 430199 55014 134905 227582 110830 165529 261628 420061 152410
17421 293460 275208 461011 502462 406700 500546 148479 532999 -162089 394795 289284
$$ packed form
17493D35264A10907J96906J33496B12386J98396N2360r4244j01989P6199Q0855
17483D23963j65419j10560L45893j06307j48148L7217j34829M4263K2885K90439
17473D99397H9498k8644K31662A20247K54467j59774q0011P1730K04001m0373
17463C70287j05500F2542D122L32259A60600P7078J43344o8384M47476k81564
17453D78550A31577J73013K00654j97917r1893L74110n3476B01908M38232k51962
17443C88178j09923M42904B06645L02015B32074j8814c6905A11646K53208o8767
17433B96087B133M15863J2203E5014P9891R2677A10830N4699R6099J58433A52410
17421B93460j8252J85803M1451r5762R3846A48479L84520a62089C94795j05511
$$ plain form
17411 289284 109151 625085 133741 360008 338939 55205 572804 611040 432720 383998
17401 383998 450502 347121 479322 251710 159197 -20855 289868 23306 305608 -51854
17390 479067 360579 342261 555166 330673 -3208 244717 264104 568081 112114 409618
17380 409618 44557 237764 190801 -86738 195999 545981 429307 526400 401592 611642
17370 611642 367587 327098 406301 126714 621238 406218 37348 93674 62724 80609 275583
17359 275583 38246 475063 116228 442708 325640 397262 256518 251499 67262 195458
17349 195458 516012 380336 352899 -6603 12120 252986 197016 -70526 185925 303221 198565
17338 198565 265190 175295 86694 -369933 772930 -77388 346501 -185804 240335 -20758
$$ packed form
17411B89284A09151N15934A33741K26267k1069E5205N17599L8236j78320m8722
17401C83998O6504j03381J32201k27612r2513b0855B89868B3306K82302e1854
17390D79067j18488j8318K12905k24493c208B44717J9387L03977A12114K97504
17380D09618D4557J93207m6963h6738A95999L49982j16674R7093j24808K10050
17370F11642k44055m0489P9203A26714M94524k15020C7348N6326l0950J7885J94974
17359B75583C8246M36817A16228L26480j17068P1622j40744n019F7262J28196
17349A95458L20554j35676k7437f603A2120K40866n5970g0526A85925J17296j04656
17338A98565O6625q9895H6694c69933G72930g7388C46501a85804B40335b0758
$$ plain form
17327 330729 45682 319807 375778 283877 128397 107886 -9868 -58216 157214 128593 544807
17316 544807 65473 414943 190626 403844 426796 426690 249009 115899 211021 282027 513030
17305 513030 585570 58989 311590 235527 284487 146600 322602 221357 225670 681101 479420
17294 479420 321241 377512 303814 130848 510024 575516 124501 347336 98325 300241
17284 300241 165505 538205 343466 161169 121813 34001 329449 424355 185217 205077
17274 205077 421377 654120 570735 467419 148312 429588 58164 13406 726014 422857
17264 422857 445946 379442 169496 419925 160826 375711 332479 151714 184823 304049
17254 304049 363148 285264 318077 137296 265933 640156 126658 370242 351401 231537
$$ packed form
17327C30729D5682K74125N5971r1901A28397k0511i868m8348A57214k8621M16214
17316E44807F5473L49470A90626K13218K2952j06j77681A15899R5122P1006K31003
17305E13030P2540E8989K52601p6063M8960j37887J76002j01245M313M55431k01681
17294D79420j58179N6271p3698A30848L79176O5492A24501K22835I8325K01916
17284C00241j34736L72700j94739A61169l9356C4001K95448R4906A85217J9860
17274B05077K16300K32743q3385j03316A48312K81276E8164A3406P12608l03157
17264D22857K3089o6504A69496K50429A60826K14885m3232A51714L3109J19226
17254C04049N9099p7884L2813A37296J28637L74223A26658K43584j8841j19864
$$ plain form
17244 231537 330188 659579 341187 398662 88674 318374 535889 764181 65776 500607
17234 500607 181466 568279 459660 512032 405329 452473 404150 539933 896358 424203
17223 348200 366219 595375 486064 270207 393349 360819 59965 244192 423572 359795
17213 359795 497578 614770 235608 521550 765912 261354 349044 369609 706192 321396
17202 259794 425284 424569 678350 611594 616912 421472 454973 512091 403752 458724 183350
17190 307012 572315 624424 421020 758868 244991 628360 164046 69004 603642 136962
17179 677139 698169 297362 396170 627272 689805 426192 623768 708816 454134 495076
17169 495076 550183 289868 658534 486287 662868 152064 599764 353468 643735 707924
$$ packed form
17244B31537R8651L29391l18392N7475H8674K29700K17515K28292F5776M34831
17234E00607A81466L86813j08619N2372j06703M7144m8323J35783L56425D24203
17223C48200J8019K29156j09311k15857J23142l2530E9965J84227J79380o3777
17213C59795J37783J17192B35608K85942K44362B61354Q7690K0565L36583C21396
17202B59794J65490p15K53781o6756N318j95440L3501N7118j08339N4972A83350
17190C07012K65303N2109k03404L37848B44991L83369A64046F9004N34638A36962
17179F77139K1030B97362R8808K31102O2533k63613J97576Q5048k54682M0942
17169D95076N5107k60315L68666j72247J76581A52064M47700k46296K90267O4189
$$ plain form
17159 707924 817491 686621 642543 787140 749429 484674 791400 296851 698077 629192
17149 629192 472598 508170 271860 555488 452630 620055 506351 550199 687464 668691
17139 668691 530919 436329 547352 463495 647151 710884 876666 512142 626701 593580
17129 593580 534034 452587 390740 728973 624553 443037 630285 722742 683839 789188
17119 789188 613774 283509 663638 607789 646551 811772 576414 710267 661495 863572
17109 863572 738589 938472 696300 738412 599247 612999 792454 847935 787918 481320
17099 481320 848564 832600 650587 708102 677007 1029196 274049 339257 804456 875404
17089 875404 674710 962958 895554 706459 837406 728379 452091 489309 760578 978675
$$ packed form
17159G07924J09567j30870m4078J44597l7711k64755L06726B96851M01226o8885
17149F29192j56594L5572k36310K83628j02858J67425j13704M3848J37265j8773
17139F68691j37772r4590J11023q3857J83656O3733J65782l64524J14559l3121
17129E93580n9546q1447o1847L38233j04420j81516J87248R2457l8903J05349
17119G89188j75414B83509L80129n5849L8762J65221k35358J33853m8772K02077
17109H63572j24983J99883k42172M2112j39165J3752J79455N5481o0017l06598
17099D81320L67244j5964j82013N7515l1095L52189B74049O5208M65199P0948
17089H75404k00694K88248o7404j89095J30947j09027k76288L7218K71269K18097
$$ plain form
17079 978675 643677 727341 618421 841532 711261 846190 765140 700763 852613 584763
17069 584763 615330 951119 870844 758958 917276 835170 872546 807187 852160 943115 961080
17058 961080 1009667 1163729 881161 812974 739054 921997 652509 856829 870627 636904
17048 636904 730410 1007921 1015780 1264595 903165 908540 1274149 1166917 802644 1121846
17038 1121846 954781 705459 849986 894784 800548 1271962 959705 1186461 798272 1251725
17028 1251725 982568 927127 1152731 1276977 1249644 1107503 1302638 1100090 1034824 979842
17018 979842 1028470 1020829 1007700 1351320 1006615 1239850 1199138 1001751 840450 961844
17008 961844 1207574 1114360 909230 1204590 1275161 1094860 1483850 1249245 1303812 1370639
$$ packed form
17079I78675l34998Q3664j08920K23111j30271J34929q1050o4377J51850k67850
17069E84763L0567L35789q0275j11886J58318q2106L7376o5359M4973R0955J7965
17058I61080M8587J54062k82568o8187p3920J82943k69488K04320J3798k33723
17048F36904R3506K77511P859K48815l61430N375L65609j07232l64273L19202
17038A121846j67065k49322J44527M4798r4236M71414l12257K26756l88189M53453
17028A251725k69157n5441K25604J24246k7333j42141J95135k02548o5266n4982
17018I79842M8628p641j3129L43620l44705K33235m0712j97387j61301J21394
17008I61844K45730r3214k05130K95360P0571j80301L88990k34605N4567O6827
$$ plain form
16998 1370639 1251731 1020211 1433514 1497587 1146279 1458889 1195869 1520885 1526663 1012996
16988 1012996 1028719 1526616 1241799 1283004 1602289 1407296 1258061 1059274 1243084 1671017
16978 1671017 1227031 1560477 1473463 1671895 1661699 1547097 1328340 1642705 1548346 1674098
16968 1674098 1650292 1713415 1822830 1713553 1805503 1836579 1516943 1727914 1540967 1774693
16958 1774693 1999897 1766413 1887310 1666457 1617637 1754781 1871766 1857867 1444996 1906394
16948 1906394 1796210 1794941 2002788 1952698 2011110 1918127 2384173 2049121 2114549 1749095
16938 1749095 2168079 1834842 2296344 1992577 2152776 2253697 2306602 2365279 2209940 2140451
16928 2140451 2368730 2481960 1974285 2013017 2328354 2389554 2470596 2420851 2405901 2312292
$$ packed form
16998A370639j18908k31520M13303O4073l51308L12610k63020L25016N778n13667
16988A012996J5723M97897k84817M1205L19285j94993j49235j98787J83810M27933
16978A671017m43986L33446q7014J98432j0196j14602k18757L14365r4359J25752
16968A674098k3806O3123J09415j09277R1950L1076l19636K10971j86947K33726
16958A774693K25204k33484J20897k20853m8820J37144J16985j3899m12871M61398
16948A906394j10184j269K07847n0090N8412r2983M66046l35052O5428l65454
16938A749095M18984l33237M61502l03767J60199J00921N2905N8677j55339o9489
16928B140451K28279J13230n07675L8732L15337O1200Q1042m9745j4950r3609
$$ plain form
16918 2312292 2494342 2478910 2691400 2277326 2248020 2471556 2800644 2861112 2905892 2566901
16908 2566901 2532246 2592057 2869652 2892223 2742381 2697351 2762693 2674903 3161902 3021319
16898 3021319 2869371 2891746 3218875 2886810 3217594 3660539 3258061 3278331 3574076 3566724
16888 3566724 3219709 3454286 3554637 3800959 3473455 3496997 3454092 3461492 3901055 3961283
16878 3961283 3919211 4078627 3837374 4161382 4021513 4067661 4436863 4068082 4275989 4445809
16868 4445809 4217307 4278736 4336932 4497220 4733681 4578491 4483477 4776428 4840009 4505302
16858 4505302 4873958 5068652 5300258 5292452 5417343 5052898 5522863 5593938 5469454 5607423
16848 5607423 5873100 5765955 6270326 6031480 6009700 6248682 6345273 6289806 6452450 6555388
$$ packed form
16918B312292J82050j5432K12490m14074k9306K23536L29088O0468M4780l38991
16908B566901l4655N9811K77595K2571j49842m5030O5342q7790M86999j40583
16898C021319j51948K2375L27129l32065L30784M42945m02478K0270K95745p352
16888C566724l47015K34577J00351K46322l27504K3542m2905P400M39563O0228
16878C961283m2072J59416k41253L24008j39869M6148L69202l68781K07907J69820
16868D445809k28502O1429N8196J60288K36461j55190r5014K92951O3581l34707
16858D505302L68656J94694K31606p806J24891l64445M69965P1075j24484J37969
16848E607423K65677j07145N04371k38846k1780K38982R6591n5467J62644J02938
$$ plain form
16838 6555388 6572584 6549950 7092541 7311674 7106170 7419949 7145944 7681788 7825676 7764556
16828 7764556 8095843 8257176 8097927 7953406 8503996 8656355 8821257 8868271 8898493 9162450
16818 9162450 9729685 9646556 9695215 10067304 10033002 10620586 10682555 10771587 10977925 11113261
16808 11113261 11627698 11837911 11788338 12220728 12447517 12850520 13052900 13154424 13493500
16799 13493500 13919837 14145973 14640132 14631217 15324981 15439689 16035440 16731325 17125520 17492747
16789 17492747 17779724 18312553 18522045 18801056 19492794 19947830 20208507 21115228 21730306
16780 21730306 22255688 23007494 23239544 23755234 24662408 25117201 26216997 26906583 27711537
16771 27711537 28878356 29642318 30020541 31163687 32236874 33537844 34302844 35513937
$$ packed form
16838F555388J7196k2634N42591K19133k05504L13779k74005N35844J43888o1120
16828G764556L31287J61333j59249j44521N50590J52359J64902M7014L0222K63957
16818I162450N67235q3129M8659L72089l4302N87584O1969Q9032K06338J35336
16808A1113261N14437K10213m9573M32390K26789M03003K02380J01524L39076
16799A3493500M26337K26136M94159q915O93764J14708N95751O95885L94195L67227
16789A7492747K86977N32829K09492K79011O91738M55036K60677R06721O15078
16780B1730306N25382P51806K32050N15690R07174M54793J099796O89586Q04954
16771B7711537J166819P63962L78223J143146J073187J300970P65000J211093
$$ plain form
16763 35513937 36596519 37776439 38897684 40158972 41694236 43172051 44532779 46010613
16755 46010613 47539451 49296776 50985134 52930023 54805868 56784432 58748673 60732832
16747 60732832 63125665 65461036 67631613 70018899 72229043 74764279 77574066 79758058
16739 79758058 82301895 85150693 87752276 90499481 93258840 95702831 98547235 100987321
16731 100987321 103333088 105783850 107917564 109768829 111700569 113415372 114717886 115869912
16723 115869912 116808294 117648883 118292552 118200399 117862633 117396532 116505522 115390902 114295295
16714 114295295 112485681 110549223 108940597 106671326 103879224 101780645 99278410 96641939
16706 96641939 93903485 91298782 88592206 85742430 82766802 80112386 77454585 74936315
$$ packed form
16763C5513937J082582J179920J121245J261288J535264J477815J360728J477834
16755D6010613J528838J757325J688358J944889J875845J978564J964241J984159
16747F0732832K392833K335371K170577K387286K210144K535236K809787K183992
16739G9758058K543837K848798K601583K747205K759359K443991K844404K440086
16731A00987321K345767K450762K133714J851265J931740J714803J302514J152026
16723A15869912R38382Q40589O43669r2153l37766m66101q91010j114620j095607
16714A14295295j809614j936458j608626k269271k792102k098579k502235k636471
16706I6641939k738454k604703k706576k849776k975628k654416k657801k518270
$$ plain form
16698 74936315 72483537 70190835 67508367 65049015 62642016 60674818 58668813 56311677
16690 56311677 54517886 52482879 50494652 48898323 47060006 45758864 43836013 42606859
16682 42606859 40692603 39740989 38150365 37148856 35234412 34477084 33153648 32206830
16674 32206830 31734264 30113160 29522912 28289336 27901615 26620546 26247470 25133840 24496256
16665 24496256 23562139 23193173 22498462 21921773 21126422 20449494 20052058 19409134 19214453
16656 19214453 18312964 18251532 17298210 17119421 16584324 16248141 15601225 15283163 15093281
16647 15093281 14319209 14474589 14041184 13375070 13132974 13081172 12778819 12346938 12079681
16638 12079681 12214641 11578509 11383256 11312781 11060211 10603706 10545802 10324458 9970767 9829497
$$ packed form
16698G4936315k452778k292702k682468k459352k406999j967198k006005k357136
16690E6311677j793791k035007j988227j596329j838317j301142j922851j229154
16682D2606859j914256r51614j590624j001509j914444p57328j323436r46818
16674C2206830m72566j621104n90248j233576l87721j281069l73076j113630o37584
16665B4496256r34117l68966o94711n76689p95351o76928l97436o42924j94681
16656A9214453r01489o1432r53322j78789n35097l36183o46916l18062j89882
16647A5093281p74072J55380m33405o66114k42096n1802l02353m31881k67257
16638A2079681J34960o36132j95253p0475k52570m56505n7904k21344l53691j41270
$$ plain form
16628 9829497 9159626 9553140 9368555 8753970 9037545 8692446 8687704 8552311 8098128 7998606
16618 7998606 7689759 7599488 7721445 7316330 7442945 7025321 7033305 7075970 6869068 6878296
16608 6878296 6642170 6577627 6461442 6632894 6210499 6303819 6061913 5966400 5884515 5781180
16598 5781180 5215848 5617553 5682496 5242236 5144785 5463872 5105585 4748392 4662841 5193667
16588 5193667 4570791 5140256 4589858 4495183 4518059 4270842 4483296 4473031 4390871 4294068
16578 4294068 4088248 4137719 4299805 3956692 3987810 4142832 3749350 3652288 3764840 3555845
16568 3555845 3457725 3852300 3452612 3234641 3414916 3178865 3523023 3079677 3247371 3171531
16558 3171531 3033557 3146782 3095717 2923242 2872971 3235580 3213815 2891024 3430439 2833790
$$ packed form
16628I829497o69871L93514j84585o14585K83575l45099m742j35393m54183r9522
16618G998606l08847r0271J21957m05115J26615m17624P984M2665k06902R228
16608F878296k36126o4543j16185J71452m22395R3320k41906r5513q1885j03335
16598E781180n65332M01705O4943m40260r7451L19087l58287l57193q5551N30826
16588E193667o22876N69465n50398r4675K2876k47217K12454j0265q2160r6803
16578D294068k05820M9471J62086l43113L1118J55022l93482r7062J12552k08995
16568C555845r8120L94575l99688k17971J80275k36051L44158m43346J67694p5840
16558C171531j37974J13225n1065j72475n0271L62609k1765l22791N39415n96649
$$ plain form
16548 2833790 2725414 2923496 2747814 2914224 2916413 2528605 2748669 2436886 2536117 2467450
16538 2467450 2472528 2794498 2396976 2504301 2606386 2341397 2161652 2253280 2232134 2566731
16528 2566731 2166633 2059681 2283614 2233696 2104105 2222741 1970908 2054816 1967269 1978331
16518 1978331 2339662 2163803 1613957 1911787 2172406 1820218 1831032 2217421 1854683 2056752
16508 2056752 1981915 1539501 1682514 2034935 1724007 1911766 1734399 1921504 1919851 1643214
16498 1643214 1701488 1583007 1446830 1800307 1701692 1743695 1511405 1739818 1642970 1759746
16488 1759746 1857496 1276444 1484851 1561008 1739131 1737701 1629811 1311963 1639096 1306072
16478 1306072 1620451 1474354 1220875 1326560 1336369 1315872 1173918 1475242 1557967 1518151
$$ packed form
16548B833790j08376J98082j75682J66410K189l87808K20064l11783R9231o8667
16538B467450N078L21970l97522J07325J02085k64989j79745R1628k1146L34597
16528B566731m00098j06952K23933m9918j29591J18636k51833Q3908q7547J1062
16518A978331L61331j75859n49846K97830K60619l52188J0814L86389l62738K02069
16508B056752p4837m42414J43013L52421l10928J87759j77367J87105j653k76637
16498A643214N8274j18481j36177L53477r8615M2003k32290K28413r6848J16776
16488A759746R7750n81052K08407P6157J78123j430j07890l17848L27133l33024
16478A306072L14379j46097k53479J05685R809k0497j41954L01324Q2725l9816
$$ plain form
16468 1518151 1233538 1316146 1419153 1141794 1138074 1161251 1263800 1015898 1193772 1144870
16458 1144870 1357006 1199130 1134890 1503078 939552 1066767 1272859 1065748 1102490 1308066
16448 1308066 1285199 1026344 1010450 849623 1090135 967041 1014524 1316111 938840 950058
16438 950058 933033 1139467 956101 892811 1204403 998937 1092029 819931 1069261 1194710
16428 1194710 763533 906908 939291 885879 619006 1132081 1165046 603188 809786 580828
16418 580828 603474 648167 864238 713199 934389 789542 1012984 926393 711289 737192
16408 737192 1018950 989052 806533 637985 742258 606325 675518 662830 885611 1071786
16398 1071786 752911 571259 907765 862868 698242 933267 891423 627074 537964 720960
$$ packed form
16468A518151k84613Q2608J03007k77359l720K3177J02549k47902J77874m8902
16458A144870K12136j57876o4240L68188n63526J27215K06092k07111L6742K05576
16448A308066k2867k58855j5894j60827K40512j23094M7483L01587l77271J1218
16438I50058j7025K06434j83366o3290L11592k05466R3092k72098K49330J25449
16428A194710m31177J43375L2383n3412k66873N13075L2965n61858K06598k28958
16418E80828K2646M4693K16071j51039K21190j44847K23442q6591k15104K5903
16408G37192K81758k9898j82519j68548J04273j35933O9193j2688K22781J86175
16398A071786l18875j81652L36506m4897j64626K35025m1844k64349q9110J82996
$$ plain form
16388 720960 709168 930652 1041881 587667 553223 835748 1094209 568248 803305 513329
16378 513329 924642 510758 617153 482973 750493 687348 636983 805173 478324 562435
16368 562435 609248 605531 623390 718048 662179 753381 683612 560776 674314 555420 637728
16357 637728 536681 425915 683507 358953 482622 321176 373556 496706 229441 367535
16347 367535 510771 507764 454604 406248 696969 536367 555784 399235 620077 396288
16337 396288 477302 518129 593444 637893 622467 306350 704670 526643 467003 580499 452436
16326 452436 496017 418705 252126 726737 494012 438312 416285 218956 439558 -23824
16315 726732 617267 523433 481075 510665 336696 228073 259588 338688 304117 636204 175572
$$ packed form
16388G20960j1792K21484J11229m54214l4444K82525K58461n25961K35057k89976
16378E13329M11313m13884J06395j34180K67520o3145n0365J68190l26849Q4111
16368E62435M6813l717J7859R4658n5869R1202o9769j22836J13538j18894Q2308
16357F37728j01047j10766K57592l24554J23669j61446N2380J23150B29441J38094
16347C67535J43236l007n3160m8356K90721j60602J9417j56549K20842k23789
16337C96288Q1014M0827P5315M4449j5426C06350L98320j78027n9640J13496j28063
16326D52436M3581p7312j66579M74611k32725n5700k2027j97329K20602b3824
16315G26732j09465r3834m2358K9590j73969j08623L1515P9100l4571L32087A75572
$$ plain form
16303 431406 683797 198845 19408 95312 344013 445648 773412 261716 385039 258265
16293 258265 457153 131951 114659 596828 149023 134011 444788 155817 394200 270714
16283 270714 656524 412382 263853 293078 83602 410150 495373 401236 424115 452314 37522
16271 464782 344178 519081 416761 255387 -36579 275938 106371 331555 175502 229586
16261 229586 437742 214815 311249 372284 441217 286745 708652 264801 130017 455359
16251 455359 320251 444252 431635 377225 424428 283600 473583 116681 201921 -63456
16240 341839 304240 389049 39254 87399 272780 481350 252344 383732 381618 375409 316292
16229 316292 128386 60508 45336 219360 393411 -87933 -57979 305487 306810 86371 240236
$$ packed form
16303D31406K52391A98845A9408P5904K48701J01635L27764B61716J23323j26774
16293B58265J98888A31951j7292M82169A49023j5012L10777A55817K38383j23486
16283B70714L85810k44142j48529K9225H3602L26548Q5223r4137K2879K8199C7522
16271D64782j20604J74903j02320j61374c6579B75938A06371K25184j56053N4084
16261B29586K08156B14815R6434O1035O8933j54472M21907B64801A30017L25342
16251D55359j35108J24001j2617n4410M7203j40828J89983A16681Q5240f3456
16240C41839l7599Q4809C9254M8145J85381K08570k29006J31388k114o209n9117
16229C16292A28386F0508j5172J74024J74051h7933K9954C05487J323H6371J53865
$$ plain form
16218 240236 87366 94409 81974 125120 272172 139928 374842 -230589 79314 6922 499612
16207 499612 317912 176313 414653 366744 495388 237830 312436 557816 152885 334780
16197 334780 140639 205685 -197354 113505 106924 129430 49868 140685 239954 192790 73219
16185 329095 114080 305779 264028 251298 450734 104941 250718 241299 196252 -137962
16174 238830 538384 217245 164927 138361 7611 91232 226311 204212 757 115934 115650 -186719
16161 216674 64372 197940 -152215 32192 33809 354637 125616 -26449 180170 63793 121399
16150 121399 170287 82916 151491 242608 276436 281176 -137699 326189 360935 214193 -102530
16138 -27121 384627 92361 -7998 155292 246705 -23042 300778 547769 -221469 38144 -139482
$$ packed form
16218B40236H7366P043j2435M3146J47052j32244K34914b30589G9314F922M92690
16207D99612j81700j41599K38340m7909J28644B37830P4606K45380A52885J81895
16197C34780A40639O5046a97354A13505o581K2506D9868R0817R9269m7164G3219
16185C29095A14080J91699m1751j2730J99436A04941J45777r419m5047a37962
16174B38830K99554B17245n2318k6566G611Q3621J35079k2099G57J15177k84a86719
16161B16674F4372J33568a52215C2192J617L20828A25616b6449A80170F3793N7606
16150A21399M8888H2916O8575R1117L3828M740a37699C26189L4746j46742a02530
16138b7121C84627I2361g998A55292R1413b3042C00778K46991b21469C8144a39482
$$ plain form
16126 -55774 175687 56563 302931 194906 370828 -45918 -206759 255249 266858 -93482
16115 -309569 188003 364676 352210 244860 250132 115303 217595 119786 291191 125445
16104 27834 -138062 33649 130532 294164 238252 409660 198322 194522 -383363 100883 96364
16093 96364 -34367 412907 241591 137245 9065 252659 -13612 -35199 146968 -14506 207238
16081 -140499 185860 -328122 146330 240165 -163456 313626 -205426 113239 243450 338958
16071 338958 194758 -1223 80899 156288 -80206 298776 170699 32606 75902 203100 -84263
16059 -215533 249310 150243 -186993 186767 -116630 191435 -192939 -45466 -116248 -56020
16048 69640 180034 -313686 -8312 30313 -42989 359446 -46432 -190795 4280 -369752 80105
$$ packed form
16126e5774A75687E6563K46368j08025J75922d5918j60841B55249J1609i3482
16115c09569A88003J76673j2466j07350N272A15303J02292r7809J71405A25445
16104B7834a38062C3649R6883J63632n5912J71408A98322l800c83363A00883m519
16093I6364c4367D12907j71316j04346I065K43594a3612k1587A46968a4506B07238
16081a40499A85860c28122A46330R3835a63456C13626b05426A13239J30211R5508
16071C38958j44200a223H0899P5389h0206B98776j28077C2606M3296J27198h4263
16059b15533B49310r9067a86993A86767a16630A91435a92939d5466p0782e6020
16048F9640J10394c13686h312C0313d2989C59446d6432j44363D280c69752H0105
$$ plain form
16036 -6590 -112905 -148747 -309316 33149 60667 271928 -20443 -168591 281257 164396 198104
16025 198104 31375 239119 -64937 574 184686 -135233 -42800 -124422 106237 133266 -51850
16013 41607 -70849 -100077 150344 199193 -8904 34831 285554 256647 -8026 153330 -147760
16001 61183 5190 -197379 67032 -88081 260824 -86253 -178211 -30718 160747 224857 145353
15990 145353 666341 167980 757636 130972 1065968 1084914 1186796 1308519 1540573 708767
15979 975955 508076 222562 327657 180817 199827 145785 -170445 -81947 170122 38788
15968 244060 -299510 -243263 158132 -88853 -60542 -27268 -117368 28886 233125 -195322 100506
15956 -27293 -14094 -12741 -76332 -8725 57357 -62483 79244 -77661 -178533 130248 141208 33931
$$ packed form
16036f590j06315l5842j60569C3149K7518K11261b0443j48148B81257j16861L3708
16025A98104C1375K07744f4937E74J84112a35233d2800q1622A06237K7029e1850
16013D1607g0849k9228A50344M8849h904C4831K50723k8907h026A53330a47760
16001F1183E190a97379F7032h8081B60824h6253r1958c0718A60747O4110p9504
15990A45353N20988A67980N89656A30972R34996J8946J01882J21723K32054G08767
15979I75955m67879B22562J05095j46840J9010n4042a70445h1947A70122C8788
15968B44060b99510N6247A58132h8853K8311b7268r0100B8886K04239a95322A00506
15956b7293J3199J353o3591h725E7357f2483G9244g7661j00872A30248J0960C3931
$$ plain form
15943 -4328 -11987 -110793 -122343 -8941 82299 252961 -206646 -342577 25982 20166 290256 240445
15931 240445 225290 82089 -155456 -193317 -256693 27974 -173102 -335310 217163 -62113 -48629
15920 -48629 -126910 -175110 178534 -56929 99374 -1040 127901 -18783 -104741 -82566 -237015
15909 -237015 -1075 73613 -112326 47642 -529975 107664 31258 219908 -122011 258224
15898 103290 -347717 84934 -60818 62888 -83609 161396 -104890 85103 -15802 -48168 -223421
15887 -223421 12883 233992 -48502 -28368 289856 -83422 -185639 32383 49244 -12213 -171810
15876 -171810 -17341 58872 -38729 -18780 -28790 -248151 66693 -11414 -62613 258317 207973
15865 207973 127914 -56085 9480 13600 -57019 -247027 20139 -101824 273483 -100956 62092
$$ packed form
15943d328p659r8806j1550h941H2299J70662b06646j35931B5982n816K70090m9811
15931B40445j5155H2089a55456l7861o3376B7974a73102j62208B17163f2113J3484
15920d8629p8281m8200A78534e6929I9374a040A27901a8783q5958K2175j54449
15909b37015a075G3613a12326D7642e29975A07664C1258J88650a22011B58224
15898A03290c47717H4934f0818F2888h3609A61396a04890H5103a5802l2366j75253
15887b23421A2883K21109d8502K0134B89856h3422j02217C2383J6861a2213j59597
15876a71810a7341E8872c8729a8780j0010k19361F6693a1414n1199B58317n0344
15865B07973q0059e6085I480M120e7019j90008B0139a01824B73483a00956F2092
$$ plain form
15853 162175 72282 234402 69832 71119 56478 -180310 -348001 -9987 -234792 -173359 -179441
15842 -179441 78952 120917 33542 -187688 -31919 -65362 328432 123837 -255209 -35134 26538
15830 -289204 -147057 147781 -279919 -114719 -54311 8668 164339 109600 365604 -86936
15819 -187826 -57441 -111775 99799 -230195 -11126 126015 71459 34384 -135084 -217917 -93042
15807 -61392 285818 -327627 22719 -199199 387544 82367 141584 -130192 157805 -69571
15796 92133 -25877 -145627 -101327 325943 -358568 -62263 9691 -160293 34992 137346 67624
15784 -119382 9680 103325 67008 155794 104101 167559 -35102 24084 50975 -45016 -83297 -146245
15772 -146245 3148 230250 14778 -237031 -7489 201531 182109 155593 -76458 322586 95111
$$ packed form
15853A62175G2282J62120F9832J287j4641a80310j67691i987k24805O1433o082
15842a79441G8952M1965C3542a87688c1919l3443C28432A23837b55209c5134B6538
15830b89204J42147A47781b79919a14719e4311H668J55671n4739K56004h6936
15819a87826e7441n4334I9799b30195a1126A26015n4556C4384a35084q2833i3042
15807f1392B85818c27627B2719a99199C87544H2367N9217a30192A57805f9571
15796I2133b5877j19750M4300C25943c58568f2263I691a60293C4992J02354F7624
15784a19382I680R3645l6317Q8786n1693O3458c5102B4084K6891d5016l8281o2948
15772a46245C148K27102A4778b37031g489B01531j9422k6516g6458C22586I5111
$$ plain form
15760 -439664 -134430 -177200 363452 276707 148037 -73866 321790 548353 -253900 127737
15749 46004 196774 125219 193263 35994 228330 -33888 78123 160932 192962 -209735 55885
15737 270286 158077 118453 245922 -35993 -317446 -141690 21286 117071 -123484 -319311
15727 -319311 -252497 181868 -33025 -13621 -159850 184197 8532 60738 -84317 175258 -83296
15715 -33346 92183 13726 -70676 -8718 291115 -270858 -178634 -133377 159348 29823 -9063
15703 131147 -83535 207096 29300 -75190 -409820 -36527 33118 -15558 139338 -89414 -460
15691 -14102 202458 122629 54826 38831 131654 120388 67949 -61858 251480 40605 94776
15680 94776 -92432 -200512 178823 -83192 -306348 -336724 98172 47744 -105561 16656 31529
$$ packed form
15760d39664a34430m2770C63452q6745j28670g3866C21790K26563b53900A27737
15749D6004J50770p1555O8044C5994J92336c3888G8123Q2809L2030b09735E5885
15737B70286j12209l9624J27469c5993k81453a41690B1286R5785a23484j95827
15727c19311O6814A81868c3025a3621j46229A84197H532N2206h4317A75258h3296
15715c3346I2183A3726g0676h718B91115b70858R2224M5257A59348B9823i063
15703A31147h3535B07096B9300g5190l34630c6527C3118a5558A39338h9414d60
15691a4102B02458p9829E4826j5995R2823j1266n2439f1858B51480D0605N4171
15680I4776i2432j08080A78823h3192k23156l0376I8172D7744a05561A6656J4873
$$ plain form
15669 31529 375159 192320 105707 266957 31758 -32320 -382290 -240957 -351697 -1924 -301765
15658 -301765 -223447 -185291 -6629 190931 -338089 -95107 81682 99832 -50213 -92878 37067
15646 312095 -226787 28079 -62527 -106409 413661 57063 -166174 -2937 -287547 139074 98448
15635 98448 29186 3098 66319 -375094 44420 -7218 64483 360390 229801 -110607 -342122
15624 -342122 41661 -222185 -846 -230823 -55625 189397 -139958 -351051 -323686 80066 -75605
15612 -77976 -68555 22120 -129590 -237706 57139 -102736 -40692 -121295 -372525 133723 -285015
15600 96198 -368710 -381668 87979 -88683 -40249 78351 -91578 -142587 92285 -230543 -1513
15588 264115 73810 -362525 -78053 -143374 -122732 177147 -196422 -109516 106958 176611 -216957
$$ packed form
15669C1529L43630j82839q6613J61250C1758c2320l49970J41333j10740a924k99841
15658c01765P8318L8156f629A90931c38089i5107H1682J8150e0213m2665C7067
15646C12095b26787B8079f2527m3882D13661E7063a66174b937k84610A39074m0626
15635I8448B9186C098O3221c75094D4420g218F4483K95907j30589a10607k31515
15624c42122D1661b22185h46k29977e5625A89397a39958k11093K7365H0066g5605
15612g7976R421B2120a29590j08116E7139a02736d0692q0603k51230A33723b85015
15600I6198c68710j2958H7979h8683d0249G8351i1578n1009I2285b30543a513
15588B64115G3810c62525g8053o5321K0642A77147a96422Q6906A06958O9653b16957
$$ plain form
15576 225026 17352 -247219 126119 219484 -75198 -126699 -179209 -221637 -318068 94316 -7391
15564 -93717 -239950 -153311 -55018 123436 94666 -296692 36602 -121423 -50630 -350639 -19539
15552 -405774 -55772 -264130 109464 64047 -46402 471038 -66897 98692 28293 36870 -63510
15540 -33203 136500 314482 47520 2967 130672 -161031 -121092 252601 28065 122713 -31727
15528 27138 70819 36555 74132 63190 -36215 259985 -77940 198642 -27301 -50550 210772
15516 217644 228766 294196 -105466 -66882 -139229 199682 -6917 200545 329699 285662 308649
15505 308649 -29219 142805 304503 400682 293246 139882 229040 100334 292349 353057
15495 353057 -165804 197799 -76560 356974 232614 -13435 17124 428933 115841 384337
$$ packed form
15576B25026A7352b47219A26119R3365g5198n1501n2510m2428r6431I4316g391
15564i3717j46233Q6639e5018A23436k8770b96692C6602a21423e0630l00009a9539
15552d05774e5772k08358A09464m5417d6402D71038f6897I8692B8293Q577f3510
15540c3203A36500J77982D7520B967J27705a61031L9939B52601B8065R4648c1727
15528B7138M3681l4264L7577j0942c6215B59985g7940A98642b7301k3249B10772
15516B17644J1122O5430a05466L8584p2347A99682f917B00545J29154m4037K2987
15505C08649b9219A42805J61698R6179j07436A39882Q9158A00334J92015O0708
15495C53057a65804A97799g6560C56974j24360a3435A7124M11809A15841K68496
$$ plain form
15485 384337 -133082 119294 93418 196033 -90261 -9366 178498 -140353 -8397 296393 466262
15474 466262 645144 789495 577910 734445 482712 398188 138829 342435 -39813 -22458
15464 -22458 -33372 63345 328990 191604 -504967 -168523 -93113 4770 -147644 12044 -215498
15452 115547 190786 118801 -36971 55180 -100322 42525 -448695 166176 349850 33925 951288
15441 951288 845354 1356582 1052998 786729 230026 13112 -185041 5832 -294897 348690
15430 73995 -115691 -6942 -791 213884 667 -328748 -224241 -35899 -49016 130632 392187
15419 392187 313614 118330 -127320 7583 -38315 -32084 -174717 132782 23721 106329 103681
15408 103681 -125230 -454891 87449 -82227 346997 22616 -31982 -41598 318122 55709 -155183
$$ packed form
15485C84337a33082A19294k5876J02615i0261i366A78498a40353h397B96393J69869
15474D66262J78882J44351k11585J56535k51733q4524A38829K03606c9813J7355
15464b2458j0914F3345K65645j37386e04967a68523P5410D770a47644A2044b15498
15452A15547P5239p1985c6971E5180a00322D2525d48695A66176J83674C3925R17363
15441I51288j05934N11228l03584k66269B30026A3112a85041E832b94897C48690
15430G3995a15691f942g91B13884F67c28748J04507c5899j3117A30632K61555
15419C92187p8573A18330a27320G583c8315O231j42633A32782B3721Q2608k648
15408A03681a25230l29661H7449h2227C46997B2616c1982r616C18122E5709a55183
$$ plain form
15396 165534 82951 -137530 -168857 119374 3814 3654 305920 143014 -93232 249590 119601
15384 -35335 349342 194306 2364 -51338 -236557 -7123 112293 4409 -120951 87475 196601
15373 196601 -43999 233213 319349 127100 190368 178552 -102287 287587 198688 194509 250418
15362 250418 674 -29811 79270 -61132 195645 433023 87684 128075 551252 -153762 5562
15350 -5420 40317 -149329 46147 89426 68676 113019 398320 347948 465519 574163 427796
15339 427796 125617 192629 317564 190235 -23047 95396 -50227 82154 -34076 -115076 292741
15327 280603 211563 -19673 404779 137947 371423 -7600 158335 186018 29335 -159309 100075
15315 161030 -52153 48102 282156 71917 254113 118449 -165560 324483 115232 394140
$$ packed form
15396A65534q2583a37530l1327A19374C814j60L02266A43014i3232B49590A19601
15384c5335C49342j55036B364e1338j85219g123A12293D409a20951H7475J09126
15373A96601d3999B33213Q6136A27100O3268j1816a02287B87587q8899m179N5909
15362B50418F74b9811G9270f1132A95645K37378H7684M0391M23177a53762E562
15350e420D0317a49329D6147M3279k0750M4343K85301n0372J17571J08644j46367
15339D27796A25617O7012J24935j27329b3047I5396e0227H2154c4076q1000B92741
15327B80603o9040a9673D04779A37947K33476g600A58335K7683B9335a59309A00075
15315A61030e2153D8102K34054G1917J82196A18449a65560C24483A15232K78908
$$ plain form
15305 394140 233174 -71891 11014 222185 234780 -66572 160484 -285670 401701 -305314
15294 360624 249846 -174799 383282 -201995 166202 363525 328731 69818 195253 -157644
15283 51458 -143191 573864 167000 221550 146975 -46539 112008 38208 -370781 187405
15272 186346 -260735 162119 35011 159961 -3741 61686 -64197 171539 127871 121750 -19124
15260 230485 -10527 112295 106435 123993 -189879 -409526 94796 286143 307190 18253 18809
15249 18809 -104549 132485 -80431 323701 161356 77141 270920 224608 1307729 2220567
15239 2220567 1660624 2007305 1819901 633311 360098 36220 -92645 -173480 -85716 112172
15228 128970 301621 -182301 278638 -47619 25220 -107973 275743 -390925 179731 328837
$$ packed form
15305C94140j60966g1891A1014K11171J2595f6572A60484b85670D01701c05314
15294C60624j10778a74799C83282b01995A66202J97323l4794F9818J25435a57644
15283E1458a43191E73864A67000N4550p4575d6539A12008C8208c70781A87405
15272A86346b60735A62119C5011J24950c741F1686f4197A71539m3668o121a9124
15260B30485a0527A12295n860J7558a89879k19647I4796J91347K1047A8253N56
15249A8809a04549A32485h0431C23701A61356G7141J93779m6312J083121R12838
15239B220567n59943L46681j87404F33311k73213C6220i2645q0835h5716A12172
15228A28970J72651a82301B78638d7619B5220a07973B75743c90925A79731J49106
$$ plain form
15218 328837 163349 42462 66904 -8213 100367 -152166 -50595 67784 181825 142274 -1460
15206 -24109 87333 -54901 131431 150777 55187 173672 33050 58578 -53941 -88034 142715
15194 321520 326720 -17291 13946 205242 350186 27947 240458 -11746 195742 157945 4769
15182 206687 -15525 -675 -25889 -37059 249688 -25596 -372826 56857 202655 -154823 328535
15170 65683 69417 68438 49798 354926 312549 -7723 -1688 202081 57228 292447 49924 126399
15158 126399 -38700 70277 -8931 307440 -4331 135431 -127360 98535 -26463 -213201 70950
15146 187107 225432 350052 -130663 -51503 -141164 36889 39503 235365 80639 153862 -79600
15134 5591 -71758 70389 29450 150708 265438 52391 55219 62785 446450 74415 -189256
$$ packed form
15218C28837A63349D2462K4442h213A00367a52166e0595F7784J14041l9551a460
15206b4109H7333e4901A31431J9346E5187J18485C3050K5528e3941l4093A42715
15194C21520N200a7291A3946J91296J44944B7947K12511a1746A95742l7797D769
15182B06687a5525f75k5214j1170B49688b5596l47230E6857J45798a54823C28535
15170F5683L734r79j8640L05128m2377g723a688B02081E7228K35219D9924P6475
15158A26399c8700G0277h931C07440d331A35431a27360I8535b6463j86738G0950
15146A87107L8325J24620a30663e1503q9661C6889K614J95862H0639P3223g9600
15134E591g1758G0389B9450J21258J14730E2391K828P566L83665G4415a89256
$$ plain form
15122 313139 261722 127846 208916 78174 395854 174175 219089 185803 211491 -5692 215713
15110 -8191 94778 493626 96133 -88754 390080 332236 334876 263700 138888 162697 195554
15099 195554 -55990 444826 477387 -1411 433994 136855 361297 131399 103514 72825 301410
15088 301410 399320 242828 233769 268274 292158 277680 174128 333831 299604 -178398 534980
15076 262300 55462 240714 98319 194447 592036 -85029 300486 381743 144123 56265 249203
15065 249203 174745 367416 187452 183612 -176245 266146 217556 440748 -53227 354460
15054 432272 407029 -54874 326839 163817 268663 513909 340294 309715 681122 273115
15043 384097 438766 238317 179238 351890 130983 315121 335307 270076 271610 298043 528238
$$ packed form
15122C13139n1417A27846Q1070G8174L17680A74175M4914l3286K5688e692B15713
15110h191I4778L98848I6133h8754C90080n7844K640p1176j24812K3809L2857
15099A95554e5990D44826L2561a411D33994A36855K24442A31399k7885l0689K28585
15088C01410R7910j56492r059L4505K3884j4478j03552J59703l4227a78398E34980
15076B62300E5462J85252I8319R6128L97589h5029C00486Q1257A44123E6265J92938
15065B49203p4458J92671j79964l840a76245B66146m8590K23192e3227C54460
15054D32272k5243e4874C26839j63022J04846K45246j73615l0579L71407B73115
15043C84097N4669k00449n9079J72652A30983J84138K0186o5231J534K6433K30195
$$ plain form
15032 528238 762771 542148 835199 865804 754022 784838 551631 616093 576126 565315
15022 565315 792934 352845 691054 665927 547480 449145 455848 344144 263937 464571
15012 464571 104901 164257 619486 293940 339763 550446 393906 370716 418570 188001
15001 278354 49613 611553 600435 512601 600280 333335 -31983 -19360 518692 532028 372626
14990 372626 461487 360744 411699 317974 440485 762613 849980 516456 765420 460404
14980 460404 936224 786022 592516 260107 392530 747059 656881 208349 835874 811923
14970 811923 636673 486403 579040 650984 589340 -6355 348414 85040 516981 192099 583943
14959 583943 349227 157594 239361 566796 415345 467368 450642 366970 296559 376383 54761
$$ packed form
15032E28238K34533k20623K93051L0605j11782L0816k33207O4462l9967j0811
15022E65315K27619C52845L38209k5127j18447r8335O703j11704q0207K00634
15012D64571A04901N9356M55229B93940M5823K10683j56540k3190M7854A88001
15001B78354D9613N61940j1118q7834Q7679k66945c1983J2623E18692J3336j59402
14990C72626Q8861j00743N0955r3725J22511L22128Q7367l33524K48964l05016
14980D60404M75820j50202j93506B60107J32423L54529r0178B08349O27525k3951
14970H11923j75250j50270R2637P1944o1644f355C48414H5040M31941A92099L91844
14959E83943k34716A57594Q1767L27435j51451N2023j6726q3672p0411P9824E4761
$$ plain form
14947 596420 341875 275793 512196 855968 572135 1128313 544745 229432 640902 708363
14937 708363 658276 575370 649580 457217 516092 611240 566344 851822 1140641 1130234 1332358
14926 1332358 1601352 1514885 1966954 1346691 1589516 1406420 1935402 1741210 1841362 2224385
14916 2224385 2617590 1939766 1819451 1146240 1302129 1275506 751572 761574 556115 324185
14906 324185 675419 771278 726022 602061 206057 416493 535649 560756 458396 656207
14896 656207 503000 454678 436873 435557 514648 571112 442385 515575 550209 865693 938609
14885 938609 643487 985682 1115971 638253 937497 774298 643855 723801 942154 392037
14874 701718 607664 552531 456039 687169 630938 562319 773828 541106 578465 857149 716731
$$ packed form
14947E96420k54545o6082K36403L43772k83833N56178E44745B29432M11470O7461
14937G08363n0087q2906P4210j92363N8875R5148m4896K85478K88819j0407K02124
14926A332358K68994q6467M52069o20263K42825j83096N28982j94192J00152L83023
14916B224385L93205o77824j20315o73211J55889k6623n23934J0002k05459k31930
14906C24185L51234R5859m5256j23961B06057K10436J19156K5107j02360J97811
14896F56207j53207m8322j7805j316P9091N6464j28727P3190L4634L15484P2916
14885I38609k95122L42195J30289m77718K99244j63199j30443P9946K18353C92037
14874G01718r4054n5133r6492K31130n6231o8619K11509k32722L7359K78684j40418
$$ plain form
14863 716731 594790 376925 390577 382796 375965 461403 251605 295783 288008 747909 465641
14852 465641 387010 534806 439092 591493 777097 653568 751924 907903 1038899 1124587
14842 1124587 1119798 1281181 964730 860836 1177533 597849 900497 570384 581059 651185
14832 651185 388356 638804 787439 432648 669612 774341 490132 506783 544752 721558
14822 721558 701356 569638 328288 806948 950425 938545 397211 621671 665964 693477
14812 693477 570164 851745 706084 723858 910486 1022900 1141191 1052554 935335 947646
14802 947646 548135 574055 662655 705706 662172 825198 321928 513135 588739 432568
14792 432568 466307 801171 567731 577172 696266 708015 427038 524748 598280 603964 548710
$$ packed form
14863G16731j21941k17865J3652p781o831Q5438k09798M4178p775M59901k82268
14852D65641p8631J47796r5714J52401J85604j23529R8356J55979J30996Q5688
14842A124587m789J61383l16451j03894L16697n79684L02648l30113J0675P0126
14832F51185k62829K50448J48635l54791K36964J04729k84209J6651L7969J76806
14822G21558k0202j31718k41350M78660J43477j1880C97211K24460M4293K7513
14812F93477j23313K81581j45661J7774J86628J12414J18291q8637j17219J2311
14802I47646l99511K5920Q8600M3051m3534J63026C21928J91207P5604j56171
14792D32568L3739L34864k33440R441J19094J1749k80977R7710P3532N684n5254
$$ plain form
14781 548710 635288 888237 772418 904009 1101666 881044 1159383 961000 826935 725078
14771 725078 542551 1014714 484229 868799 527099 673960 546569 435707 448721 539222
14761 539222 612732 545570 599035 553610 853522 803068 368568 656532 664408 510248 597480
14750 597480 591272 761093 720283 692494 692402 1131943 1022759 891335 723590 530149 819985
14739 819985 646794 720309 782192 800581 1069540 488283 921001 935668 795746 1010273
14729 1010273 1843185 1629438 2135815 1928754 1564218 1409884 939124 1224913 1178943 965210
14719 965210 1009229 820894 1007129 936550 954820 875526 894447 643612 997925 954255 684214
14708 684214 962437 970785 1165824 1331789 1582414 1873155 2115596 2002019 2072564 1913625
$$ packed form
14781E48710Q6578K52949j15819J31591J97657k20622K78339j98383j34065j01857
14771G25078j82527M72163D84229L84570l41700J46861j27391j10862J3014R0501
14761E39222P3510o7162N3465m5425K99912n0454C68568K87964P876j54160Q7232
14750E97480o208J69821m0810k7789r2M39541j09184j31424j67745j93441K89836
14739H19985j73191P3515O1883J8389K68959D88283M32718J4667j39922K14527
14729A010273Q32912k13747N06377k07061l64536j54334m70760K85789m5970k13733
14719I65210M4019j88335J86235p0579J8270p9294J8921k50835L54313m3670k70041
14708F84214K78223Q348J95039J65965K50625K90741K42441j13577P0545j58939
$$ plain form
14698 1913625 1378363 1007818 1353390 852655 1136908 1101395 1068074 808160 1186241 1056430
14688 1056430 676808 779898 850267 928516 806004 935301 1064786 1100421 820358 889222
14678 889222 1017727 1291820 864804 1249966 1272796 940953 1063714 1198974 815334 1119625
14668 1119625 1207341 812553 1057854 1083733 1090296 1009694 1058770 852972 838583 989028 1180833
14657 1180833 964361 1071645 1095616 1229006 1285620 1581185 1501115 900532 1267629 962114
14647 962114 1312027 1051391 1145581 1385186 1265872 1425215 1280164 1485221 1215968 924347
14637 924347 1308618 1197598 1476071 1467455 1302786 1313390 1097421 1497886 1413391 1022473
14627 1022473 1049555 1030453 1652310 1525022 1759951 1446764 1405179 1269222 1562518 1449907
$$ packed form
14698A913625n35262l70545L45572n00735K84253l5513l3321k59914L78081j29811
14688A056430l79622J03090P0369P8249j22512J29297J29485L5635k80063O8864
14678H89222J28505K74093m27016L85162K2830l31843J22761J35260l83640L04291
14668A119625Q7716l94788K45301K5879O563q0602M9076k05798j4389J50445J91805
14657A180833k16472J07284K3971J33390N6614K95565q0070o00583L67097l05515
14647I62114L49913k60636R4190K39605j19314J59343j45051K05057k69253k91621
14637I24347L84271j11020K78473q616j64669J0604k15969M00465q4495l90918
14627A022473K7082j9102O21857j27288K34929l13187m1585j35957K93296j12611
$$ plain form
14617 1449907 1147740 1246791 1450896 1718384 1470165 1658642 1468827 2127669 1507432 1693506
14607 1693506 1285828 1680924 1547615 1301444 1650394 1714897 1818505 1555633 1726669 1777446
14597 1777446 1655567 1849130 1593619 1719987 1764820 1963893 1605191 1884876 1932751 1500149
14587 1500149 2099765 1797816 1963404 2090420 1899321 1661924 2271818 1949441 1990409 1980346
14577 1980346 1971628 2172824 2200348 2126945 2344182 2028062 2070832 1868750 2417238 2732025
14567 2732025 2103028 2606043 2583981 2253262 2452605 2542321 2555146 2304455 2811717 2559101
14557 2559101 3254460 3102546 3234358 3132185 3634169 4116142 4627357 5571538 7642163
14548 7642163 11094464 18837110 38831619 49412760 18624278 7019579 4021121 2522034
$$ packed form
14617A449907l02167R9051K04105K67488k48219J88477j89815O58842o20237J86074
14607A693506m07678L95096j33309k46171L48950O4503J03608k62872J71036N0777
14597A777446j21879J93563k55511J26368M4833J99073l58702K79685M7875m32602
14587A500149N99616l01949J65588J27016j91099k37397O09894l22377M0968j0063
14577A980346q718K01196K7524p3403K17237l16120M2770k02082N48488L14787
14567B732025o28997N03015k2062l30719J99343Q9716J2825k50691N07262k52616
14557B559101O95359j51914J31812j02173N01984M81973N11215R44181K070625
14548G642163L452301P742646J9994509J0581141A8624278G019579k998458j499087
$$ plain form
14540 2522034 2792503 2318581 2899167 3403099 5159861 5071519 2252799 2353017 2458639
14531 2458639 2070774 2182757 2379846 2088941 2225595 2210638 2222744 2519124 2192367 2554126
14521 2554126 2677803 2704164 2727940 2392163 2945092 2379230 2754635 2920877 2669791 2932959
14511 2932959 2911530 2399131 2806477 2552177 2777477 3083425 2967581 2962329 2755036 3135918
14501 3135918 2934460 2679252 3006906 3304258 3091474 3293578 3425914 3291201 3461025
14492 3461025 3177055 3512977 3477846 3815567 3680525 3532652 3426920 3524116 3916502 3802064
14482 3802064 3806495 3927257 3923641 3665628 3827426 3743885 4062684 4030402 3917321 4454058
14472 4454058 4124254 4380951 4229463 4237005 4131714 4374274 4709444 4569802 4714597 4358759
$$ packed form
14540B522034K70469m73922N80586N03932J756762q8342B252799J00218J05622
14531B458639l87865J11983J97089k90905J36654j4957J2106K96380l26757L61759
14521B554126J23677K6361K3776l35777N52929n65862L75405J66242k51086K63168
14511B932959k1429n12399M07346k54300K25300L05948j15844n252k07293L80882
14501C135918k01458k55208L27654K97352k12784K02104J32336j34713J69824
14492C461025k83970L35922l5131L37721j35042j47873j05732R7196L92386j14438
14482C802064M431J20762l616k58013J61798q3541L18799l2282j13081N36737
14472D454058l29804K56697j51488P542j05291K42560L35170j39642J44795l55838
$$ plain form
14462 4358759 4826870 4672950 4895643 4770770 4752908 5245148 4970041 4982444 5040889 5147811
14452 5147811 5101128 5216185 5258002 5492524 5024733 5621719 5831522 5437215 5799086 5969040
14442 5969040 5857181 5918519 6480611 6307893 6168644 6468196 6378608 6670519 6338598 6664620
14432 6664620 7061410 6766175 6678283 6911672 7039265 7099820 7446467 7316804 7619675 7526661
14422 7526661 8119254 7954977 8064438 8526500 8488412 8469056 8599687 8596696 8480670 8857284
14412 8857284 8897757 9340131 8952706 9283779 9484505 9466808 9856567 10550071 10335028 10332537
14402 10332537 10198400 10447514 10792679 10529426 11042349 10943486 11404121 11794229 11488718
14393 11488718 11736298 12048113 11935181 12482094 12706091 12955111 13105126 13519570 13518717 14110437
$$ packed form
14462D358759M68111j53920K22693j24873j7862M92240k75107J2403N8445J06922
14452E147811m6683J15057M1817K34522m67791N96986K09803l94307L61871J69954
14442E969040j11859O1338N62092j72718j39249K99552q9588K91911l31921L26022
14432F664620L96790k95235q7892K33389J27593O0555L46647j29663L02871r3014
14422G526661N92593j64277J09461M62062l8088j9356J30631k991j16026L76614
14412H857284M0473M42374l87425L31073K00726j7697L89759O93504k15043k491
14402A0332537j34137K49114L45165k63253N12923r8863M60635L90108l05511
14393A1488718K47580L11815j12932N46913K23997K49020J50015M14444q53N91720
$$ plain form
14383 14110437 14015541 14436309 15010076 15332241 15576816 15507711 15963239 16319329 16365304 16605881
14373 16605881 17110784 16985536 17441188 18084661 18378699 19207200 19605332 19717696 20577693
14364 20577693 20490471 20969603 21129463 21950600 22125389 22584993 23180352 23513175 24264220
14355 24264220 24817846 25409945 25915544 26974207 27304323 27793828 28233724 29410528 30321147
14346 30321147 30932232 31145874 32274273 33340208 34236368 35067545 35886639 37300000 38204010
14337 38204010 39024756 40299754 41662609 42988435 43862310 45320889 46464787 48273196
14329 48273196 49464512 51418301 52921907 54810237 56918607 58348235 60463416 62595925
14321 62595925 64931208 67340356 69774427 72399869 74823846 77309289 80456931 83330406
$$ packed form
14383A4110437r4896M20768N73767L22165K44575o9105M55528L56090M5975K40577
14373A6605881N04903j25248M55652O43473K94038Q28501L98132J12364Q59997
14364B0577693q7222M79132J59860Q21137J74789M59604N95359L32823P51045
14355B4264220N53626N92099N05599J058663L30116M89505M39896J176804R10619
14346C0321147O11085K13642J128399J065935Q96160Q31177Q19094J413361R04010
14337C8204010Q20746J274998J362855J325826Q73875J458579J143898J808409
14329D8273196J191316J953789J503606J888330K108370J429628K115181K132509
14321F2595925K335283K409148K434071K625442K423977K485443L147642K873475
$$ plain form
14313 83330406 86720018 90131020 93887697 98024844 101624347 105822677 110840914 115683020
14305 115683020 120365454 126240979 131775280 137783931 144308387 151190543 158228532 165741227
14297 165741227 173982284 182717734 191544834 201296275 211112991 221995694 233147209 244826430
14289 244826430 257296456 269937747 283247932 297117598 311561954 326070772 340896991
14282 340896991 355652541 370462952 385140132 399486266 412797680 425545314 437058460
14275 437058460 447066904 454542577 458986602 460927626 462061924 462945520 461366764 456970903
14267 456970903 451950905 443704583 433583555 421864430 408523765 394385307 379680471
14260 379680471 364431543 348832274 333181048 317805839 302511091 287791858 273490188
$$ packed form
14313H3330406L389612L411002L756677M137147L599503M198330N018237M842106
14305A15683020M682434N875525N534301O008651O524456O882156P037989P512695
14297A65741227Q241057Q735450Q827100R751441R816716J0882703J1151515J1679221
14289B44826430J2470026J2641291J3310185J3869666J4444356J4508818J4826219
14282C40896991J4755550J4810411J4677180J4346134J3311414J2747634J1513146
14275D37058460J0008444P475673M444025J941024J134298Q83596j578756m395861
14267D56970903n019998q246322j0121028j1719125j3340665j4138458j4704836
14260C79680471j5248928j5599269j5651226j5375209j5294748j4719233j4301670
$$ plain form
14253 273490188 259734676 247019571 234232422 222538233 211135729 200772858 191246194
14246 191246194 183248429 173858162 166044586 157937753 150483920 143263117 136794418 130639197
14238 130639197 125141248 119343576 114196663 109175800 104805033 100269619 96582048 92741575
14230 92741575 89343779 85675727 82395912 79077311 76113439 73279903 70386959 68074128
14222 68074128 65680189 63569279 61382778 59134207 57256234 55400510 53491352 51699711
14214 51699711 50441810 49120517 47670273 46041348 44841346 42995857 42046948 41780968
14206 41780968 40380762 38896423 37693979 36579290 35551012 35032870 34235037 33249393
14198 33249393 32217745 31446668 30490404 29568328 29450459 28576206 27621941 27323438 26219528
$$ packed form
14253B73490188j3755512j2715105j2787149j1694189j1402504j0362871r526664
14246A91246194p997765r390267p813576q106833p453833p220803o468699o155221
14238A30639197n497949n797672n146913n020863m370767m535414l687571l840473
14230I2741575l397796l668052l279815l318601k963872k833536k892944k312831
14222F8074128k393939k110910k186501k248571j877973j855724j909158j791641
14214E1699711j257901j321293j450244j628925j200002j845489r48909k65980
14206D1780968j400206j484339j202444j114689j028278n18142p97833r85644
14198C3249393j031648p71077r56264r22076j17869q74253r54265k98503j103910
$$ plain form
14189 26219528 25572053 24995511 24921792 23872259 23478439 22996693 22376189 21920119 21389039
14180 21389039 21114339 20637962 20151188 20039257 19319000 18886179 18515685 18652690 17987823
14171 17987823 17588975 17121234 16815137 16552635 16347551 15825636 15697071 15431948 15005599
14162 15005599 14755701 14454899 14431343 14446783 14062918 13724360 13455556 13054636 13167969 13017773
14152 13017773 12804687 12202769 11951830 12008459 11632059 11546379 11360077 11584536 11125684 10634764
14142 10634764 10342952 10528723 10570451 10087448 10063373 10176382 9778394 9696967 9326456 9364394
14132 9364394 9236113 9162018 9210732 9204140 8871545 8323235 8355327 8488646 8266048 8220732
14122 8220732 8020526 7802960 7908062 7387306 7914053 7473998 7359092 7522771 7142960
$$ packed form
14189B6219528o47475n76542p3719j049533l93820m81746o20504m56070n31080
14180B1389039k74700m76377m86774j11931p20257m32821l70494J37005o64867
14171A7987823l98848m67741l06097k62502k05084n21915j28565k65123m26349
14162A5005599k49898l00802k3556J5440l83865l38558k68804m00920J13333j50196
14152A3017773k13086o01918k50939N6629l76400q5680j86302K24459m58852m90920
14142A0634764k91812J85771M1728m83003k4075J13009l97988q1427l70511L7938
14132I364394j28281p4095M8714o592l32595n48310L2092J33319k22598m5316
14122H220732k00206k17566J05102n20756N26747m40055j14906J63679l79811
$$ plain form
14113 7142960 7370151 7267687 6796179 7051007 7264590 6801749 6868908 6619680 6180448 6671179
14103 6671179 6465051 6043679 6154716 5822200 6162432 6216776 6307509 5809856 5640500 5938009
14093 5938009 5716018 5319593 5360316 5364635 5627532 5315584 5463320 4964699 5178331 5253452
14083 5253452 4990296 4905829 4747822 4741151 4713588 4795088 4754689 4639733 4633511 4245573 4526955
14072 4526955 4110509 4299396 4190527 4397213 4447229 4005297 4152245 4300351 4186086 4348886
14062 4348886 4155833 4209970 4429998 4021023 4116882 4098163 4184171 4052380 4136638 3752465
14052 3752465 3746719 3785882 3662213 3634413 3359558 3223727 3435941 3478504 3343008 3391432
14042 3391432 3466225 3373489 3234740 3284525 3252649 3106501 3167577 3148323 3014288 3258611
$$ packed form
14113G142960K27191j02464m71508K54828K13583m62841O7159k49228m39232M90731
14103F671179k06128m21372J11037l32516L40232N4344R0733m97653j69356K97509
14093E938009k21991l96425M0723M319K62897l11948J47736m98621K13632P5121
14083E253452k63156q4467j58007o671k7563Q1500m0399j14956o222l87938K81382
14072D526955m16446J88887j08869K06686N0016m41932J46948J48106j14265J62800
14062D348886j93053N4137K20028m08975R5859j8719Q6008j31791Q4258l84173
14052C752465n746L9163j23669k7800k74855j35831K12214M2563j35496M8424
14042C391432P4793r2736j38749M9785l1876j46148O1076j9254j34035K44323
$$ plain form
14032 3258611 3019351 3548304 3155130 3059025 2929873 2669127 3093888 2772836 2779911 2802334
14022 2802334 2632022 3069744 2758061 2732186 2673556 2695533 2594589 2764462 2461915 2444618
14012 2444618 2848627 2041867 2465968 2103091 2520719 2371136 2542826 2519885 2584028 2303872
14002 2303872 2009948 2245408 2121638 2310796 2197571 2131546 2284060 2429579 2174397 1786452
13992 1786452 2441040 2403925 2719472 3623102 5845723 11418301 27802513 54093666 27082250
13983 27082250 12922894 7968081 6025844 4679405 3980098 3549137 3750580 3254707
13975 3254707 2714246 3172716 3050616 2842162 2415608 2637230 2371050 2593732 2021432
13966 2021432 2352437 2379630 2208066 2273384 1978485 2202330 2153445 1976197 2303443 2060285
$$ packed form
14032C258611k39260N28953l93174r6105j29152k60746M24761l21052P075K2423
14022B802334j70312M37722l11683k5875n8630K1977j00944J69873l02547j7297
14012B444618M04009q06760M24101l62877M17628j49583J71690k2941O4143k80156
14002B303872k93924K35460j23770J89158j13225o6025J52514J45519k55182l87945
13992A786452O54588l7115L15547R03630K222621N572578J6384212K6291153k7011416
13983B7082250A2922894m954813j942237j346439o99307m30961K01443m95873
13975C254707n40461M58470j22100k08454m26554K21622k66180K22682n72300
13966B021432L31005K7193j71564O5318k94899K23845m8885j77248L27246k43158
$$ plain form
13956 2060285 2122008 2081557 1885639 1679394 1739687 2003281 2141950 1862022 1981392 1654794
13946 1654794 2116851 2012764 1791710 1989148 1841288 2013149 1684260 1865923 1665094
13937 1665094 1740108 1720221 1695450 1455146 1743638 1200149 1884876 1660283 1912161 1474608
13927 1474608 1586591 1230108 1471365 2065517 1432528 1547732 1599871 1242238 1477520 1638238
13917 1638238 1520213 1738958 1845426 1806826 1497797 1498041 1295281 1437727 1507406 1611405
13907 1611405 1527898 1131933 1526074 1438654 1088860 1450051 1228861 1194957 1420318 1291971
13897 1291971 1455807 975618 1216759 1283672 1310428 1216960 1156926 1118635 1502041 971013
13887 971013 1190938 1449079 1209033 1432060 1379082 1072100 1243823 1253748 1308523 1027858
$$ packed form
13956B060285O1723m0451j95918k06245O0293K63594J38669k79928J19370l26598
13946A654794M62057j04087k21054J97438j47860J71861l28889J81663k00829
13937A665094P5014j9887k4771k40304K88492n43489O84727k24593K51878m37553
13927A474608J11983l56483K41257N94152o32989J15204N2139l57633K35282J60718
13917A638238j18025K18745J06468l8600l09029K44k02760J42446O9679J03999
13907A611405q3507l95965L94141q7420l49794L61191k21190l3904K25361j28347
13897A291971J63836m80189K41141O6913K6756r3468o0034l8291L83406n31028
13887I71013K19925K58141k40046K23027n2978l06982J71723R925N4775k80665
$$ plain form
13877 1027858 1105139 1389036 1233154 878786 1153905 1067851 1241502 1205361 1024525 1239834
13867 1239834 1363692 1074804 1255025 1220002 1281137 957084 1424424 810879 920248 1166596
13857 1166596 1154007 955272 1217360 1030206 1117148 1310338 741775 812409 1119043 1059785
13847 1059785 592870 1355554 785083 1120731 1038781 972405 786083 1123922 736685 852021
13837 852021 1214579 930179 936253 629940 928686 1072997 1195615 870101 1160368 809079
13827 809079 676088 937029 1094382 712733 1014591 1069674 918184 1062167 893586 729699
13817 729699 1005398 1197631 981571 502992 1035592 983373 647713 821581 701395 870232
13807 870232 617789 821762 675990 987236 677896 696065 1028788 838033 776445 1010790
$$ packed form
13877A027858P7281K83897j55882l54368K75119q6054J73651l6141j80836K15309
13867A239834J23858k88888J80221l5023O1135l24053M67340o13545J09369K46348
13857A166596j2589j98735K62088j87154Q6942J93190n68563P0634L06634n9258
13847A059785m66915P62684n70471L35648q1950o6376j86322L37839l87237J15336
13837H52021L62558k84400O074l06313K98746J44311J22618l25514K90267l51289
13827H09079j32991K60941J57353l81649L01858N5083j51490J43983j68581j63887
13817G29699K75699J92233k16060m78579N32600n2219l35660J73868j20186J68837
13807H70232k52443K03973j45772L11246l09340J8169L32723j90755o1588K34345
$$ plain form
13797 1010790 660243 945292 714412 844223 863481 838573 730719 734001 966001 891890
13787 891890 716398 941285 563598 652824 221372 941172 487162 471861 571648 1002813
13777 1002813 814977 547792 455397 706195 778675 540477 629923 725844 803548 564424
13767 564424 613537 903190 497877 957187 728084 1147505 428127 510895 704431 825160
13757 825160 927668 708783 434455 1092280 776147 627502 870464 667971 843585 630288
13747 630288 522791 590472 564913 731790 726674 339060 371007 458002 744774 665258 577390
13736 577390 501920 673725 689675 750627 598091 589440 730658 864772 480018 443374 675310
13725 675310 821446 426913 449286 538320 530767 457334 339665 513373 567467 428642 439258
$$ packed form
13797A010790l50547K85049k30880J29811J9258k4908j07854L282K32000p4111
13787H91890j75492K24887l77687Q9226B21372P19800m54010j5301R9787M31165
13777A002813j87836k67185r2395K50798P2480k38198Q9446R5921P7704k39124
13767E64424M9113K89653m05313M59310k29103M19421D28127Q2768J93536J20729
13757H25160J02508k18885k74328O57825l16133j48645K42962k02493J75614k13297
13747F30288j07497O7681k5559J66877n116C39060L1947Q6995K86772p9516q7868
13736E77390p5470J71805J5950O0952j52536q651J41218J34114l84754l6644K31936
13725F75310J46136l94533K2373Q9034p553p3433j17669J73708N4094j38825J0616
$$ plain form
13714 439258 518497 727364 405672 784921 583282 220688 668388 277491 619943 489511
13704 489511 273006 555894 342210 519259 457686 720723 594661 574658 672506 423037
13694 423037 749578 482926 654480 465293 554555 351198 564968 615167 447305 455625
13684 455625 309117 322748 771739 1080932 348933 526659 439941 296986 564667 523559
13674 523559 565210 235537 568788 741267 223608 444432 236345 502306 896829 330824
13663 542884 392743 346618 241567 525950 516287 370184 468764 702510 556559 389174
13653 389174 710638 490936 217930 489643 353482 85433 270124 338301 445921 296855
13643 296855 616646 4326 363681 266302 381028 246280 428679 576450 538109 140832
$$ packed form
13714D39258P9239K08867l21692L79249k01639B20688M47700B77491L42452j30432
13704D89511k16505K82888k13684J77049o1573K63037j26062k0003R7848k49469
13694D23037L26541k66652J71554j89187Q9262k03357K13770N0199j67862Q320
13684D55625j46508J3631M48991L09193C48933J77726q6718j42955K67681m1108
13674E23559M1651B35537L33251J72479B23608K20824k08087K65961L94523C30824
13663E42884j50141m6125j05051K84383r663j46103R8580K33746j45951j67385
13653C89174L21464k19702B17930K71713j36161H5433J84691O8177J07620j49066
13643B96855L19791D326L59355r7379J14726j34748J82399J47771l8341A40832
$$ plain form
13632 557465 291990 506664 536618 519624 550373 292256 426369 464955 535969 285574
13622 285574 87375 312372 295981 338058 308277 253843 353356 481872 314508 294459 467050
13611 467050 114115 220511 445351 682603 290450 297393 477131 555159 286667 511951
13601 511951 549964 419116 381864 347343 314107 496641 187436 327192 496865 -14390
13590 400549 403091 166933 328625 572937 427158 135187 441011 -9223 -205535 633090
13579 514139 347952 29129 143839 375495 340011 330301 263972 331339 635275 651670 351910
13568 351910 346831 254636 370077 543388 4464 266257 338387 260426 115162 327036 626741
13557 626741 306148 94430 247023 244779 620384 123259 418389 227545 279861 314733
$$ packed form
13632E57465k65475K14674K9954j6994L0749k58117J34113L8586P1014k50395
13622B85574H7375K24997j6391M2077k9781n4434R9513J28516j67364k0049J72591
13611D67050A14115J06396K24840K37252B90450O943J79738P8028k68492K25284
13601E11951L8013j30848l7252l4521l3236J82534A87436J39756J69673a4390
13590D00549K542A66933J61692K44312j45779A35187L05824i223j96312F33090
13579E14139j66187B9129J14710K31656l5484r710o6329O7367L03936J6395k99760
13568C51910n079r2195J15441J73311D464K61793P2130p7961A15162K11874K99705
13557F26741C06148I4430J52593k244L75605A23259K95130j90844N2316L4872
$$ plain form
13547 314733 394871 126060 87114 -54290 43493 379060 231529 382179 288348 410907
13537 410907 176326 319599 494886 458131 282843 369668 418804 459676 483059 328424
13527 328424 79676 272577 210846 88057 271818 504809 170209 113107 193709 88611 287787
13516 287787 57675 351533 302499 139879 22452 188410 384421 339813 334124 201751 125145
13505 125145 123639 244793 273429 -8321 106010 286242 642302 293207 242681 220689 273751
13494 273751 496782 436037 314508 163578 123951 597387 73435 98814 261730 284584
13484 284584 458260 120956 376157 516045 233109 502000 432114 513832 322105 189147
13474 189147 392294 244190 290066 318957 201997 384478 211866 493532 119461 -21925
$$ packed form
13547C14733Q0138A26060l8946e4290D3493L35567j47531J50650r3831J22559
13537D10907A76326J43273J75287l6755j75288Q6825M9136M0872K3383j54635
13527C28424G9676J92901o1731H8057J83761K32991A70209n7102Q0602H8611J99176
13516B87787E7675K93858m9034A39879B2452J65958J96011m4608n689j32373p6606
13505A25145j506J21154K8636h321A06010J80232L56060B93207n0526k1992N3062
13494B73751K23031o0745j21529j50930l9627M73436G3435K5379J62916K2854
13484B84584J73676A20956K55201J39888B33109K68891o9886Q1718j91727j32958
13474A89147K03147j48104M5876K8891j16960J82481j72612K81666A19461b1925
$$ plain form
13463 86313 98829 177434 42499 274377 66011 148003 -140782 302680 57944 161677 54122
13451 324960 529020 52117 201438 332732 244110 -184496 136650 -130457 397379 197559
13440 273520 81147 30531 126295 285871 139583 56382 -27337 -41714 191371 -288304 281704
13428 74594 -106330 204581 182511 409311 213978 -284380 197725 95083 202979 263391
13418 263391 296787 426305 350288 282092 -145878 468330 25541 200649 16817 296522
13408 296522 -41125 162030 -55034 298550 64372 186085 -131726 375390 331141 276805
13398 276805 192099 270700 26412 186830 -124230 250656 385033 312732 250641 254908 185486
13387 185486 -332681 128309 191837 413463 407750 -168785 -186361 360266 101998 286308
$$ packed form
13463H6313J2516P8605D2499K31878F6011Q1992a40782C02680E7944J03733E4122
13451C24960K04060E2117J49321J31294q8622a84496A36650a30457C97379A97559
13440B73520H1147C0531R5764J59576A39583E6382b7337j4377A91371b88304B81704
13428G4594a06330B04581k2070K26800j95333b84380A97725I5083J07896O0412
13418B63391L3396J29518p6017o8196a45878D68330B5541J75108A6817K79705
13408B96522d1125A62030e5034B98550F4372J21713a31726C75390m4249n4336
13398B76805q4706P8601B6412J60418a24230B50656J34377p2301o2091M267o9422
13387A85486c32681A28309O3528K21626n713a68785j7576C60266A01998J84310
$$ plain form
13377 286308 358332 157098 -29734 156896 203661 256105 138876 385113 408973 160254
13366 263075 155519 -68745 59213 203314 83615 264093 93596 277075 258499 87896 159624
13355 159624 397668 448746 -92759 217043 238912 -67535 236334 153194 301062 387381 166824
13343 211317 -62120 82619 380261 97588 249932 142084 501552 151648 487600 266062
13333 266062 342150 227054 -56776 86313 137129 279383 237626 92048 228816 337666 -52388
13321 223713 -141274 321638 129927 -305024 424335 485448 187766 758804 320404 229158
13311 229158 567199 291753 185673 33951 188220 381235 453366 128480 432059 -199107
13300 368603 443132 121996 104773 197559 244865 214922 172196 122089 92759 313677 466255
$$ packed form
13377B86308P2024A57098b9734A56896M6765N2444j17229K46237K3860A60254
13366B63075j07556f8745E9213J44101H3615J80478I3596J83479j8576H7896P1728
13355A59624K38044N1078i2759B17043K1869f7535B36334q3140J47868Q6319A66824
13343B11317f2120H2619K97642I7588J52344j07848L59468A51648L35952k21538
13333B66062P6088j15096e6776H6313N0816J42254m1757I2048J36768J08850e2388
13321B23713a41274C21638A29927c05024D24335O1113A87766N71038C20404r1246
13311B29158L38041k75446j06080C3951J54269J93015P2131A28480L03579a99107
13300C68603P4529A21996j7223R2786M7306k9943m2726n0107k9330K20918J52578
$$ plain form
13289 466255 24131 338017 6044 128170 54345 269497 81790 136409 132815 300545 24610
13277 19324 74337 247607 177796 -66422 36738 -53696 53459 152791 -16832 64432 40791
13266 40791 -192951 474368 219655 -36152 -14268 147229 377523 226663 -91833 -142152
13256 -142152 240100 -23616 -163444 62605 39056 168407 530608 44993 -140597 215651
13245 142224 -291497 337372 220568 -59453 -243990 264488 249618 -55992 319922 -18995
13234 460093 -41716 294246 86206 -15787 94426 257273 -13614 30775 377374 -3083 108911
13222 185932 211561 -113116 25968 322737 17569 33231 285372 -201334 -411414 -167348
13211 -275887 85687 -93228 92263 122314 -98881 48330 -24280 98444 93884 -109310 244914
$$ packed form
13289D66255B4131L13886F044J22126E4345K15152H1790N4619l594J67730B4610
13277A9324N5013J73270o9811f6422C6738e3696E3459R9332a6832F4432k3641
13266D0791a92951D74368B19655c6152a4268A47229K30294j50860i1833n0319
13256a42152B40100b3616j39828F2605k3549J29351L62201D4993a40597B15651
13245A42224b91497C37372j16804e9453j84537B64488j4870e5992C19922a8995
13234D60093d1716B94246H6206a5787I4426J62847a3614C0775L46599c083A08911
13222A85932K5629a13116B5968K96769A7569J5662K52141b01334k10080a67348
13211b75887H5687i3228I2263L0051i8881D8330b4280I8444m560a09310B44914
$$ plain form
13199 73691 267010 -34405 158967 -98609 -117184 -102736 177998 383072 222683 -40698 -17973
13187 362965 171826 -229353 -182448 265002 155555 178524 39822 142459 311994 28513
13176 5419 -98621 240591 347375 -25232 277967 321116 356114 -36085 -104925 23204 119376
13165 119376 -113944 -245539 281854 -174932 11635 124507 131157 583509 -183417 -194639
13155 -194639 61876 1049 210885 -36967 106559 57841 458482 -48747 57727 -185222 40751
13143 -10851 -124565 61475 74552 55818 -23042 128435 -210426 -143257 182545 -119419 -161651
13132 -161651 -113511 66882 12495 -247940 138503 -99504 247509 353393 -20117 -77272 38048
13120 101879 100379 -13541 192430 207911 -19601 -72745 100350 131932 89280 -278314 258640
$$ packed form
13199G3691J93319c4405A58967i8609j8575J4448A77998K05074j60389d0698a7973
13187C62965A71826b29353M6905B65002j09447K2969C9822J02637J69535B8513
13176E419i8621B40591J06784b5232B77967M3149L4998c6085o8840B3204R6172
13165A19376a13944j31595B81854a74932A1635J12872O650M52352a83417j1222
13155a94639F1876A049K09836c6967A06559m8718M00641d8747E7727a85222D0751
13143a0851j13714F1475J3077j8734b3042A28435b10426O7169A82545a19419m2232
13132a61651M8140F6882A2495b47940A38503i9504B47509J05884b0117n7155C8048
13120A01879j500a3541A92430J5481a9601n3144A00350L1582m2652b78314B58640
$$ plain form
13108 172094 19968 -116953 -693 -289942 171370 32465 -49468 130225 -107500 225562 150213
13097 150213 -108304 252542 -3229 -123864 116229 33708 201228 172554 -18263 -193412
13087 -193412 27706 136091 -250224 158118 -422966 -248323 -51374 148553 44927 72365
13077 72365 201930 85478 27443 -113401 81762 146874 -28818 301258 234340 59610 50576
13066 50576 75728 255444 25929 15300 245691 -56180 404 229101 5776 119660 23723
13054 477648 400651 -80782 256913 -9561 124116 322494 197102 52734 59661 139644 -357592
13042 -62541 47931 342902 -14261 58921 -222940 328876 130258 67004 124179 -86595 185087
13030 -31908 181571 32786 47188 83670 -41295 128957 95523 167980 -56495 66629 169808
$$ packed form
13108A72094A9968a16953f93k89249A71370C2465d9468A30225a07500B25562p5349
13097A50213a08304B52542c229j20635A16229C3708J67520k8674a8263j75149
13087a93412B7706J08385b50224A58118d22966J74643e1374A48553D4927K7438
13077G2365J29565H5478B7443a13401H1762O5112b8818C01258o6918E9610r034
13066E0576K5152J79716B5929j0629K30391e6180D04K28697E776J13884B3723
13054D77648p6997h0782B56913i561A24116J98378j25392E2734O927P9983c57592
13042f2541D7931K94971a4261E8921b22940C28876A30258o3254N7175h6595A85087
13030c1908A81571C2786J4402L6482d1295A28957l3434P2457e6495F6629J03179
$$ plain form
13019 169808 35722 158476 223819 -52687 -6928 -75551 273833 30263 -221546 5755 -24327
13007 -96343 58694 261024 -164816 -47586 37316 113029 -13953 3660 -252663 -49266 -203703
12996 -203703 -10495 32709 39371 -181208 49031 108006 86395 118708 172949 -425700 270101
12984 -354251 121910 -141616 231385 352211 48517 309286 -55422 -189640 -35445 90048
12973 79365 455115 98053 361690 313871 127518 -298110 2396 389569 -219198 103201
12962 16173 42603 -128587 48343 221129 -175283 261146 -89457 -57606 136955 -248115
12951 60430 71494 -101246 -21720 129788 -37088 -148546 59231 88865 243160 124394 -15275
12939 -458104 24502 -109855 198857 -70336 -54544 -333575 96350 115145 77675 195236 232489
$$ packed form
13019A69808C5722J22754O5343e2687f928o8623B73833C0263b21546E755b4327
13007i6343E8694K02330a64816d7586C7316P5713a3953C660b52663d9266j54437
12996b03703a0495C2709O662a81208D9031N8975k1611L2313N4241d25700B70101
12984c54251A21910a41616B31385J20826D8517K60769e5422j34218c5445I0048
12973G9365L75750I8053K63637m7819A27518b98110B396L87173b19198A03201
12962A6173K6430a28587D8343J72786a75283B61146h9457L1851A36955b48115
12951F0430J1064a01246b1720A29788c7088j11458E9231K9634J54295j18766a5275
12939d58104B4502a09855A98857g0336J5792k79031I6350J8795l7470J17561L7253
$$ plain form
12928 232489 161609 41956 210136 140625 11761 -97833 30440 104820 52735 72760 -188094
12916 64019 58301 134749 -93023 72622 -9610 233555 9553 59432 61177 81918 -211764 -220008
12904 -220008 119964 120262 320421 46458 2431 -43255 199924 -154655 -60120 91157 15585
12892 -98193 -380922 141242 208712 -240738 -73495 31019 348326 225338 119019 60184
12882 60184 74990 250583 36260 286315 -237105 44625 82960 285776 -132830 62744 -68552
12870 -8475 92808 61464 -26748 -295465 -149425 147395 395143 -225015 -191562 86430 -66514
12858 19411 -241698 -70614 165252 -214904 34772 -141250 -192967 -170447 -155996 -103980 149972
12846 -284 99935 111995 -384845 109769 -144652 -108750 45099 16015 -204697 50920 -7057
$$ packed form
12928B32489p0880D1956J68180o9511A1761i7833C0440P4380n2085K0025a88094
12916F4019n718P6448i3023G2622i610B33555I553M9879J745K0741b11764q244
12904b20008A19964K98K00159D6458B431d3255A99924a54655f0120I1157A5585
12892i8193k82729A41242O7470b40738g3495C1019L17307j22988j06319n8835
12882F0184J4806J75593C6260K50055b37105D4625L8335K02816a32830F2744f8552
12870h475I2808l1344b6748k68717J46040A47395K47748b25015L3453H6430f6514
12858A9411b41698g0614A65252b14904C4772a41250n1717K2520J4451N2016A49972
12846b84I9935J2060c84845A09769a44652L5902D5099A6015b04697E0920g057
$$ plain form
12834 49584 -203384 -190900 43841 -77454 -30112 -41769 -73858 -172278 -174408 -9532 -93138 -260047
12822 -260047 -200828 190863 25040 246318 277314 -245603 139640 163984 -43497 263119
12811 452935 251609 167796 167665 -113845 -82492 -102094 -66278 81589 -22890 -79806 -700288
12800 -700288 -48950 284953 -204297 45732 389007 -355008 -43495 -89876 -192600 1691 92908
12789 92908 -193914 -45919 -50857 -215132 -75599 59571 -29965 -89232 42881 -273794 96402
12777 125707 -56560 -32195 88693 222721 346060 -31921 -186275 -231485 213617 36348 199781
12766 199781 -71909 32809 -151015 79560 47812 108788 -221929 143428 155910 351254 212475
12755 212475 32335 102176 430710 -215688 379999 -123467 129374 -57008 -25309 -218934
$$ packed form
12834D9584b03384J2484D3841g7454c0112j1657l2089r8420k130i532q3606j66909
12822b60047N9219A90863B5040K21278L0996b45603A39640K4344d3497B63119
12811D52935k01326q3813j31a13845L1353j9602L5816H1589b2890n6916o20482
12800g00288d8950B84953b04297D5732L43275c55008d3495m6381j02724A691R1217
12789I2908a93914d5919m938j64275g5599E9571b9965n9267D2881b73794I6402
12777A25707e6560K4365H8693J34028J23339c1921j54354m5210B13617C6348J63433
12766A99781g1909C2809a51015G9560l1748O0976b21929A43428J2482J95344j38779
12755B12475C2335O9841L28534b15688C79999a23467A29374e7008b5309j93625
$$ plain form
12745 -218934 -164937 -387240 -262566 -130134 -89245 169780 373467 -47131 253293 43876
12734 47169 447887 6807 -23288 255336 -337086 127055 34379 -46211 263484 112040 191400
12723 191400 94025 -108462 103885 144278 345527 -466947 94526 73194 235937 93402
12712 84707 302125 219458 24088 216446 -53162 364578 -314043 1771 225109 154895 442162
12701 442162 86972 -145218 93010 54528 287401 46642 279951 -42298 -186006 191647
12690 271810 -130915 -38958 17552 335353 170602 215997 -36440 207571 17383 5449 379684
12679 379684 286488 175489 -34176 216951 -120383 -21508 151373 107569 15234 -138914
12668 78468 -89367 -125755 -80311 144331 162770 -107933 138122 -29070 31000 392633 32247
$$ packed form
12745b18934N3997k22303J24674a30134M0889A69780K03687d7131B53293D3876
12734D7169M00718F807b3288B55336c37086A27055C4379d6211B63484A12040P9360
12723A91400I4025a08462A03885M0393K01249d66947I4526k1332J62743I3402
12712H4707K17418q2667B4088J92358e3162C64578c14043A771K23338p0214K87267
12701D42162H6972a45218I3010l8482K32873D6642K33309d2298j43708A91647
12690B71810a30915c8958A7552L17801j64751M5395c6440B07571A7383E449L74235
12679C79684r3196j10999c4176B16951a20383b1508A51373m3804A5234a38914
12668G8468h9367l6388M5444A44331J8439a07933A38122b9070C1000L61633C2247
$$ plain form
12656 -406991 -4481 187518 103769 -14579 -83329 280439 115850 -12817 -73726 116082 -57302
12644 156224 57438 24817 -87829 -62084 109262 259966 -279416 156450 40815 -130815
12633 321771 106090 -49003 197531 -145461 328713 29183 208533 192250 74480 289363
12623 289363 192070 689784 -380458 22038 254120 -37493 -257044 -108020 57377 22962
12612 -57175 -165459 68465 -124129 -154746 -213379 58750 96278 -10701 146942 67766 123570
12601 123570 76646 129028 -82537 -3958 183251 296469 310645 33431 30513 -65836 -44834
12590 -44834 174397 56701 23008 164122 -80308 -151178 -71946 -165577 -85221 212665 150711
12579 150711 83658 -11827 39560 -71716 91853 -65406 4213 135378 -11906 -22404 86562
$$ packed form
12656d06991d481A87518q3749a4579o8750B80439A15850a2817o0909A16082e7302
12644A56224E7438B4817h7829K5745A09262J50704b79416A56450D0815a30815
12633C21771A06090d9003A97531a45461C28713B9183J79350j6283G4480K14883
12623B89363r7293M97714c80458B2038K32082c7493k19551a08020E7377B2962
12612e7175j08284F8465a24129l0617n8633E8750L7528a0701A46942F7766N5804
12601A23570m6924N2382h2537c958A83251J13218J4176C3431k918f5836K1002
12590d4834A74397E6701B3008J41114h0308p0870g1946r3631Q0356B12665o1954
12579A50711o7053a1827C9560g1716I1853f5406D213J31165a1906j0498H6562
$$ plain form
12567 -247266 -272490 5236 79519 224162 -241351 -78462 143004 -94772 -57150 -172297 24524
12555 146996 -110888 -97585 254742 193394 -149571 -322139 -76693 -83870 4402 -16106 19351
12543 47416 67474 -145758 15349 -4388 -80140 266123 101054 -143913 -138230 -274480 321101
12531 -20884 -205046 83210 87242 -54385 163634 41412 90944 -261760 385604 -214524 -153484
12520 -153484 -56875 25926 -208894 -297052 32236 216743 236092 149731 -200560 -52934 199184
12508 -124942 -108792 77414 203411 -81704 21982 106889 230760 212106 136562 -36767 3362
12496 -40124 14845 68106 -124701 299095 -7126 -243425 -257283 -88925 275335 48597 -253050
12484 -80233 196938 -97660 -166660 -321655 -336042 -386070 -4010 -80442 278281 154418 -338216
$$ packed form
12567b47266k5224E236P4283J44643b41351g8462A43004i4772L7622j15147B4524
12555A46996a10888J3303B54742o1348a49571j72568g6693p177D402a6106A9351
12543D7416K0058a45758A5349d388p5752B66123A01054a43913N683j36250C21101
12531b0884j84162H3210M032e4385A63634D1412M9532b61760C85604b14524O1040
12520a53484e6875B5926b08894q8158C2236J84507J9349q6361b00560e2934A99184
12508a24942J6150G7414J25997h1704B1982Q4907J23871j8654p5544c6767C362
12496d0124A4845N3261a24701B99095g126k36299j3858h8925B75335D8597b53050
12484h0233A96938i7660o9000j54995j4387n0028d010p6432B78281j23863c38216
$$ plain form
12472 -199867 -65618 -49936 -127647 72625 -66103 196917 61936 208032 55536 -385899 -111332
12460 -73220 -112392 -45831 -93123 -66341 -53356 -84538 -32572 -180214 160414 148710 60649
12448 -47844 -61172 -147744 90671 -50336 -434943 -29362 -19183 84958 -115870 -15550 -285768
12437 -285768 -56520 46526 138670 -24476 144905 -80248 272735 -72697 -118451 126272 -266625
12425 -30340 113684 111755 -105177 -363444 33537 164751 154872 -100101 14029 -368040 -154635
12413 -51887 -45631 -93416 -126269 50998 71013 -145673 -150173 355715 -117213 -116461 64260 129563
12401 129563 -111660 -85316 -147485 78443 -116169 83969 -14847 17284 -104445 -252879 164839
12389 -305923 263045 289664 70421 -246051 -267749 91021 185608 83517 -68956 -118308 85616
$$ packed form
12472a99867f5618J5682p7711G2625f6103A96917F1936J46096E5536c85899a11332
12460g3220l9172d5831m7292K6782J2985l1182c2572j47642A60414j1704F0649
12448d7844j3328q6572I0671e0336l84607b9362J0179H4958a15870a5550k70218
12437b85768e6520D6526R2144b4476A44905h0248B72735g2697m5754A26272b66625
12425c0340A13684j929a05177k58267C3537J31214r879a00101A4029c68040a54635
12413e1887O256m7785l2853E0998K0015a45673m500C55715a17213P52F4260O5303
12401A29563a11660K6344o2169G8443a16169H3969a4847A7284a04445j48434A64839
12389c05923B63045K6619G0421b46051k1698I1021R4587H3517f8956m9352H5616
$$ plain form
12377 187050 109711 57186 348287 91888 415794 100523 143459 -233999 -24433 -24296 -179181
12366 -179181 368358 -75820 4504 6109 228547 -218227 71106 -65466 -221945 69659 43881
12355 43881 47469 37738 -108564 -18909 -14828 -17946 -9601 166317 242845 117476 31050 -15208
12342 -12611 215665 115933 -209312 17438 -113251 371804 -9768 258997 87667 -92016 432294
12330 137311 280106 533168 185286 122708 -74417 203455 327545 143936 440120 -354723
12319 55198 -38357 345945 459214 209899 91378 75217 389252 74960 -39911 275526 266100
12308 266100 126536 -289615 25808 134763 838 204520 153442 125809 -2980 137487 3188
12296 -189552 178337 179789 191847 245745 53684 249368 196507 -65257 74953 18914 8175
$$ packed form
12377A87050p7339n2525K91101I1888L23906A00523M2936b33999b4433J37j54885
12366a79181C68358g5820D504J605K22438b18227G1106f5466j56479F9659k5778
12355D3881L588r731a08564a8909M081l118Q345A66317P6528A17476C1050a5208
12342a2611B15665r9732b09312A7438a13251C71804i768B58997H7667i2016D32294
12330A37311J42795K53062A85286o2578g4417B03455J24090A43936K96184c54723
12319E5198c8357C45945J13269B09899I1378j6161L14035G4960c9911B75526r426
12308B66100A26536b89615B5808J08955H38K03682n1078k7633b980A37487C188
12296a89552A78337J452J2058N3898E3684J95684n2861f5257G4953A8914H175
$$ plain form
12284 8036 233802 62049 176636 65545 259556 214069 -200451 262965 -71639 344733 254120
12273 254120 54060 87750 33262 410928 -287732 204048 -165016 357241 9445 107619 -159072
12261 377639 292775 -43717 65866 64571 241482 -181080 -146246 -59536 199545 219856 273774
12250 273774 135317 -73523 -160892 319913 265623 178902 292635 347376 422922 578557 -19833
12238 25485 198881 -135738 -6151 100375 -233574 148769 4165 -82643 4143 75790 239825
12227 239825 -71265 62504 204130 186632 83645 290322 168588 123017 32409 123919 399102
12216 399102 -30829 206261 -305730 40948 -68046 317817 482266 209123 -20272 -159159
12206 -159159 227572 136200 206674 152338 -94019 228850 -322867 533963 131539 -121334
$$ packed form
12284H036K25766F2049J14587F5545J94011m5487b00451B62965g1639C44733r0613
12273B54120E4060L3690C3262L77666b87732B04048a65016C57241I445R8174a59072
12261C77639q4864d3717F5866j295J76911a81080L4834e9536A99545K0311N3918
12250B73774A35317g3523q7369C19913n4290q6721J13733N4741P5546J55635a9833
12238B5485J73396a35738f151A00375b33574A48769D165h2643D143P1647J64035
12227B39825g1265F2504J41626j7498H3645K06677j21734m5571C2409R1510K75183
12216C99102c0829B06261c05730D0948f8046C17817J64449B09123b0272j38887
12206a59159B27572r1372P0474n4336i4019B28850c22867E33963A31539a21334
$$ plain form
12195 231569 183116 236469 43578 182861 125893 -64449 7216 -70783 261002 168412 231529
12184 231529 206117 253919 497509 166709 57486 440643 386664 57075 225554 -73999 318278
12172 40022 416234 -14968 249742 135897 106900 189210 117726 509607 665029 436209
12162 436209 -32355 -231201 312049 50717 308303 -62042 75576 220744 289469 189888 61815
12150 32117 -202110 -67119 319397 64615 -181212 -30762 149256 -155399 -123797 106000
12139 -28334 343269 76513 71645 175278 -51188 204519 134081 582498 -50341 137023 72870
12128 72870 -110928 43977 100426 153754 -113086 29348 609340 167497 523605 289112
12118 289112 -67450 342777 404477 143696 23392 111366 -59545 161381 2510 44912 -12997
$$ packed form
12195B31569m8453N3353D3578J39283n6968f4449G216g0783B61002r2590O3117
12184B31529k5412M7802K43590A66709E7486L83157n3979E7075J68479g3999C18278
12172D0022L76212a4968B49742j13845k8997Q2310p1484L91881J55422k28820
12162D36209c2355j98846C12049E0717K57586f2042G5576J45168O8725r9581F1815
12150C2117b02110f7119C19397F4615a81212c0762A49256a55399L1602A06000
12139b8334C43269G6513m868J03633e1188B04519p0438M48417e0341A37023o4153
12128G2870a10928D3977N6449N3328a13086B9348N79992A67497L56108k34493
12118B89112f7450C42777O1700A43696B3392Q7974e9545A61381B510M2402a2997
$$ plain form
12106 -153588 231767 78023 -156007 334205 152081 39523 -31531 -49666 42533 101477 68067
12095 68067 77631 329310 67940 -2512 129248 -127310 205612 -30683 406029 -20879 169113
12083 -42944 130449 116004 -55569 -45665 307409 -24259 120001 -152738 225373 313521 359848
12072 359848 156513 20216 -48988 97638 -266759 123112 176488 -92754 86653 20646 45477
12061 45477 256427 226696 17872 289929 321850 95101 439685 423441 203039 -242201 -115855
12049 -142905 41272 308335 -97837 195119 -2883 -170492 -128444 35121 -176924 54540 -170679
12037 -134316 80745 -260938 232443 53445 31225 428696 -10384 24583 -11100 85801 -7175
12025 14063 -46812 150028 92165 164542 137693 253723 244390 65549 250249 -16547 128505
$$ packed form
12106a53588B31767G8023a56007C34205A52081C9523c1531j8135D2533N8944l3410
12095F8067R564K51679F7940b512A29248a27310B05612c0683D06029b0879A69113
12083d2944A30449j4445e5569R904C07409b4259A20001a52738B25373Q8148M6327
12072C59848A56513B0216d8988I7638b66759A23112N3376i2754H6653B0646K4831
12061D5477K10950k9731A7872K72057L1921I5101L44584j6244B03039b42201a15855
12049a42905D1272K67063i7837A95119b883j67609M2048C5121a76924E4540a70679
12037a34316H0745b60938B32443E3445k2220L97471a0384B4583a1100H5801g175
12025A4063d6812A50028n7863P2377k6849J16030r333F5549J84700a6547A28505
$$ plain form
12013 342197 921 268507 -141428 37188 -81352 72793 114547 271192 220502 -113120 529940
12001 81693 -49784 109656 90015 128951 -251134 -55345 103435 45207 -80274 -145408 -201312
11990 -201312 163080 123430 83538 -313186 108522 201194 -198002 63907 389 -45491 -895
11978 53658 -261287 29476 88102 -205859 -158526 -42571 102153 39684 7567 -336964 -220507
11967 -220507 -83082 -15500 275157 102080 -187599 236926 -147769 194764 -137699 -77579
11957 -77579 -12912 403056 -178514 -11483 -346551 -102082 -132421 285256 -50092 138180
11946 17270 -57573 263889 16349 -17926 6616 -14916 28143 -39144 -92663 90348 -56386 -258730
11934 -258730 -114947 -225942 -54366 -116868 75790 92303 -26166 -34972 16622 14093 -149294
$$ packed form
12013C42197I21K67586a41428C7188h1352G2793M1754J56645n0690a13120E29940
12001H1693d9784A09656j9641L8936b51134e5345A03435D5207h0274o5134n5904
11990b01312A63080l9650l9892c13186A08522R2672a98002F3907C89d5491h95
11978E3658b61287B9476N8626b05859M7333d2571A02153C9684G567c36964J16457
11967b20507h3082a5500B75157A02080a87599B36926a47769A94764a37699O0120
11957g7579a2912D03056a78514a1483l35068a02082l0339B85256e0092A38180
11946A7270e7573B63889A6349a7926F616a4916B8143c9144n3519I0348e6386k02344
11934b58730a14947j10995e4366o2502G5790J6513b6166q806A6622k529a49294
$$ plain form
11922 186425 182205 -90509 -7304 -315266 -61537 -94242 159479 -94951 189425 -268568 145192
11910 106843 240049 107937 -131653 407332 60405 -293972 374755 -52368 -9924 81321
11899 37638 -102470 48846 -8430 86908 -331094 49289 -137050 -318583 129112 127596 -36056
11887 261347 1852 23978 -159866 216690 227602 16796 172939 3620 -338586 -360016 -20817
11875 95244 -536438 -88634 -25384 -130006 131164 52260 -172099 -47437 10236 191335 -69876
11863 250223 -68456 -204137 -261402 39656 -90788 -330134 45654 -938 212444 -2124 56776
11851 -238152 -58350 -320602 -293600 -58951 -181909 196375 72143 244500 -44985 29343 37000
11840 37000 153906 -262555 -54963 -38827 -387389 -210744 21606 -237114 -124032 198212
$$ packed form
11922A86425m220i0509g304l07962f1537l2705A59479i4951A89425b68568A45192
11910A06843J33206A07937a31653D07332F0405b93972C74755e2368i924H1321
11899C7638a02470D8846h430H6908c31094D9289a37050j81533A29112j516c6056
11887B61347A852K2126a59866B16690J0912A6796J56143C620c38586k1430b0817
11875I5244e36438h8634b5384j04622A31164E2260a72099d7437A0236J81099f9876
11863B50223f8456j35681n7265C9656i0788k39346D5654i38B12444b124E6776
11851b38152e8350k62252K7002e8951j22958A96375G2143J72357d4985B9343P657
11840C7000J16906b62555e4963J6136l48562J76645B1606b37114J13082A98212
$$ plain form
11829 -72042 265082 10669 167344 -101561 -224150 89239 -294260 126945 -75286 -143842
11819 -143842 -256361 -226211 -223942 157043 -26395 -304026 -29101 -5123 -92564 64636 -158678
11807 19530 -365223 -165316 223422 124024 -86961 6111 -163498 -190112 -156742 -351103 -346454
11796 -346454 212974 103625 -365935 -248504 75017 -247963 163897 -174932 -68033 -388035
11786 -388035 192487 33335 -166565 -52824 -235766 123326 -165672 -50882 306212 225139
11776 225139 3784 -230176 -229742 -112310 312488 421128 244617 -315851 -196342 25217 27583
11765 27583 -262085 96149 21511 -287381 -180861 -13516 -89271 147313 -153168 -269160
11755 -269160 -64502 -1321 221635 -210807 -57214 254856 -357764 -170596 110278 235658
$$ packed form
11829g2042B65082A0669J56675a01561j22589H9239b94260A26945g5286o8556
11819a43842j12519L0150K269A57043b6395k77631b9101e123q7441F4636a58678
11807A9530c65223a65316B23422r9398h6961F111a63498k6614L3370j94361M649
11796c46454B12974A03625c65935J17431G5017b47963A63897a74932f8033l20002
11786c88035A92487C3335a66565e2824j82942A23326a65672e0882C06212q1073
11776B25139C784b30176M34a12310C12488J08640j76511c15851J19509B5217K366
11765B7583b62085I6149B1511b87381J06520a3516p5755A47313a53168j15992
11755b69160f4502a321B21635b10807e7214B54856c57764a70596A10278J25380
$$ plain form
11745 235658 269956 -178081 190423 26487 176416 -115346 152285 -14814 48642 4372 116462
11734 116462 -22410 -39721 -98163 86157 40025 -196431 -233072 34357 -39801 -115962 330285
11722 375201 -110866 14058 405026 -151730 -186482 34382 -259304 77095 109276 158331 -322332
11710 -169977 -288495 11491 -39574 -197154 154235 228220 139177 -61565 273638 160415
11700 160415 314105 29765 -172206 36802 -209701 259151 150209 184752 55041 224680
11690 224680 444945 77566 -31195 -3123 91449 -59387 -38238 -122994 -276125 53806 71955
11679 71955 -59636 256897 344284 -48019 -278145 264916 59455 -36638 -76319 -46170 108825
11667 215538 12145 226244 -36906 -33775 20617 124833 -151884 402367 39608 -91149 313113
$$ packed form
11745B35658L4298a78081A90423B6487J49929a15346A52285a4814D8642D372J12090
11734A16462b2410j7311n8442H6157D0025a96431l6641C4357c9801p6161C30285
11722C75201a10866A4058L90968a51730l4752C4382b59304G7095L2181M9055c22332
11710a69977j18518A1491c9574j57580A54235P3985q9043f1565B73638j13223
11700A60415J53690B9765a72206C6802b09701B59151j08942L4543E5041J69639
11690B24680K20265G7566c1195c123I1449e9387K1149q4756j53131E3806J8149
11679G1955e9636B56897Q7387d8019k30126B64916E9455c6638l9681L0149A08825
11667B15538A2145K14099c6906L131B0617J04216a51884D02367C9608i1149C13113
$$ plain form
11655 -186293 -35411 142890 -177771 408038 429945 -77233 27401 307323 -231470 -126791
11645 -126791 -105460 191491 -103232 149292 -62647 143744 130696 -382919 70745 -131029
11634 192999 -891 41622 27681 -183868 -143560 -217722 219667 78443 128674 -195212 -305875
11623 -305875 124713 107659 95572 -45027 280863 43279 -59366 -48248 -110391 -60560 -358408
11612 -358408 31584 316146 -108933 15745 -81517 78803 67852 -176943 51673 -73282 123837
11600 20028 -305073 -161115 95736 -80700 -79463 22500 277533 -101605 110353 -180257 193764
11588 -137188 -50004 242982 106205 -216247 95403 190136 78890 62306 205628 125646 219924
11577 219924 -89262 -181916 201845 -218827 -256717 127957 -32002 228557 -99150 104473
$$ packed form
11655a86293c5411A42890a77771D08038K1907g7233B7401K79922b31470J04679
11645a26791K1331A91491a03232A49292f2647A43744j3048c82919G0745a31029
11634A92999h91D1622j3941a83868M0308p4162B19667G8443N0231a95212j10663
11623c05875A24713j7054j2087d5027B80863D3279e9366J1118o2143M9831k97848
11612c58408C1584K84562a08933A5745h1517G8803j0951a76943E1673g3282A23837
11600B0028c05073J43958I5736h0700J237B2500K55033a01605A10353a80257A93764
11588a37188e0004B42982A06205b16247I5403R4733G8890j6584J43322p9982R4278
11577B19924h9262r2654B01845b18827l7890A27957c2002B28557i9150A04473
$$ plain form
11566 174791 105157 180396 107144 57118 52062 -39284 130322 100913 260506 287019 226112
11555 226112 98521 170424 295660 -94354 80185 104334 631287 -85693 -276745 48395 26279
11544 26279 112229 -24429 184260 42029 192394 -25252 -66546 115933 188414 -74723 236294
11532 330804 -188446 314864 -65668 -169033 -292547 34750 450264 -256701 -226066 92643
11521 -47422 216255 65669 125357 181437 -85363 -158739 187516 168814 179092 433112 393149
11510 393149 33678 -161864 47396 -114641 88513 103074 48596 134963 8269 113631 56230
11498 -125921 236792 21115 -186463 -301979 193349 122278 70849 174585 32486 274060
11488 274060 243644 -89099 322370 -159841 -75660 161356 -80127 196088 -56200 17494 403370
$$ packed form
11566A74791o9634P5239p3252n0026n056c9284A30322k9409J59593K6513o0907
11555B26112I8521P1903J25236i4354H0185K4149N26953h5693j91052D8395k2116
11544B6279Q5950b4429A84260D2029J50365b5252m1294A15933P2481g4723B36294
11532C30804a88446C14864f5668j03365j23514C4750M15514b56701L0635I2643
11521d7422B16255F5669N9688N6080h5363p3376A87516j8702J0278K54020l9963
11510C93149C3678a61864D7396a14641H8513J4561D8596Q6367H269J05362E6230
11498a25921B36792B1115a86463j15516A93349p1071n1429J03736C2486K41574
11488B74060l0416h9099C22370a59841g5660A61356h0127A96088e6200A7494L85876
$$ plain form
11477 403370 97659 120609 361304 -34145 -164085 550460 110312 449428 -15450 256090
11466 80726 -32969 -132522 166300 131815 95579 276417 47228 191161 101126 86489 29362
11454 242763 222725 283960 524115 342277 199669 120727 434404 -117768 157217 -243027
11443 -183131 55721 133424 84800 -123522 165255 60743 -80759 160924 -433537 -163324
11432 40626 -10055 -111562 20930 156091 5750 -37888 121233 -67860 -45322 -330681 -330285
11421 -330285 -33594 -205801 -241734 -227156 -158675 93010 68484 263208 -104906 -32756 38170
11409 -19511 45598 167625 210513 34093 51325 -1054 -303703 59264 267882 65637 -144874
11397 38693 58970 138830 8972 -219136 257958 217095 104398 177278 -163249 -11610 -60677
$$ packed form
11477D03370I7659K2950K40695c4145j29940E50460A10312L39116a5450B56090
11466H0726c2969r9553A66300l4485l6236J80838D7228J43933r0035j4637B9362
11454B42763k0038O1235K40155j81838j42608p8942L13677a17768A57217b43027
11443a83131E5721P7703m8624a23522A65255F0743h0759A60924d33537a63324
11432D0626a0055j01507B0930J35161E750c7888A21233f7860K2538k85359L96
11421c30285c3594j72207l5933J4578O8481I3010k4526J94724a04906c2756C8170
11409a9511D5598J22027M2888C4093J7232a054l02649E9264K08618F5637a44874
11397C8693K0277P9860H972b19136B57958m0863A04398P2880a63249a1610m9067
$$ plain form
11386 -60677 -32533 -16937 133043 -251680 -29143 -109021 -195413 379847 -191842 -62315 175010
11374 -117000 -210195 -43895 -185806 149891 36911 -24891 -55569 -229437 57243 -280476 -412238
11363 -412238 -20670 105138 -25464 56281 -208921 -126025 186552 -179419 110668 225741
11353 225741 -39876 -134826 -138954 -35070 -363931 -42886 -181729 -220452 -290571 -97047 37998
11341 -205419 145265 310821 -238397 -269437 -57208 148625 -189729 -268649 -186449 -231731
11331 -231731 84651 -60012 -59270 -213850 -60686 -173518 -50254 95113 -95269 -139870 58656
11319 -23929 -68553 -260722 24909 -68898 29548 -314860 99564 164019 -368519 -74985 -39353
11308 -39353 86421 319080 102797 263142 347557 42674 -274931 -73743 37131 -108497 -305549
$$ packed form
11386f0677K8144J5596A33043b51680b9143p9878q6392C79847a91842f2315A75010
11374a17000r3195d3895j41911A49891C6911b4891l0678j73868E7243b80476j31762
11363d12238b0670A05138b5464E6281b08921Q2896A86552a79419A10668J15073
11353B25741c9876r4950m128c5070l28861d2886j38843l8723p0119i7047C7998
11341b05419A45265J65556b38397l1040e7208A48625a89729p8920Q2200m5282
11331b31731H4651f0012P42j54580f0686j12832e0254I5113i5269m4601E8656
11319b3929m4624j92169B4909f8898B9548c14860I9564O4455c68519g4985L5632
11308c9353H6421K32659A02797J60345Q4415D2674b74931g3743C7131a08497j97052
$$ plain form
11297 -305549 153644 -146675 -156456 207776 94409 191412 58414 33604 27061 -64933 -144095
11286 -144095 -12271 -198496 136017 -96881 3635 -14595 -444464 149804 -147630 46254 47823
11275 47823 273592 108757 -116553 -140879 5674 74253 55962 677 382826 71136 313075
11264 313075 -34894 135230 -174178 -220296 -22879 -175558 -324221 401250 -152387 132909
11253 -127464 -221825 15658 62082 -173739 -256262 21076 65073 -174076 -58251 95397 -167154
11241 -153707 -7841 36332 -34828 262263 271331 -77516 126275 51554 -53409 378096 -107987
11229 -221652 -138427 167819 -132292 -175701 -117853 -208433 -143513 -101532 -217997 97767 -284823
11217 97892 115412 44646 -438280 -185624 -270679 -93949 87417 33894 48059 201253 9664
$$ packed form
11297c05549A53644a46675r781B07776I4409R7003E8414k4810o543f4933p9162
11286a44095a2271j86225A36017i6881C635a4595m29869A49804a47630D6254J569
11275D7823K25769A08757a16553k4326E674O8579j8291F77L82149G1136K41939
11264C13075c4894A35230a74178m6118b2879j52679j48663D01250a52387A32909
11253a27464r4361A5658M6424a73739q2523B1076M3997a74076e8251I5397a67154
11241a53707g841C6332c4828B62263R068g7516A26275E1554e3409C78096a07987
11229b21652Q3225A67819a32292m3409N7848r0580O4920M1981j16465I7767b84823
11217I7892J7520D4646d38280a85624q5055i3949H7417C3894J4165J53194I664
$$ plain form
11205 -112735 64775 -212231 -166158 -194176 -254066 -154099 -32398 -22007 -158450 -136336 -176955
11194 -176955 3361 -330542 -30457 49182 -184930 -61859 -185510 36147 62723 -46510 -134510
11183 -134510 -13502 3363 -221959 -166307 -57846 15173 153550 -98119 -119599 -9394 69430
11171 -199135 11541 -220913 -285102 -70290 220984 339554 -314852 -17911 -81993 39856 6580
11159 91342 -328526 -1834 -42989 481230 -198317 179546 -313 31245 -155117 126689 398622
11148 398622 19134 -49034 -98234 -267414 280848 -3261 151415 76883 -57489 188819 113626
11137 113626 -65745 11138 -44447 2998 267386 -273444 -199504 31503 -293067 378812 110386
11125 370678 269558 -111743 -142098 54055 -123591 87232 -102058 8294 -46279 92951 133255
$$ packed form
11205a12735F4775b12231M6073k8018n9890R9967c2398J0391j36443K2114m0619
11194a76955C361c30542c0457D9182a84930f1859j23651C6147K6576d6510q8000
11183a34510a3502C363b21959N5652e7846A5173J38377i8119k1480i394F9430
11171a99135A1541b20913o4189g0290B20984J18570c14852a7911o4082C9856F580
11159I1342c28526a834m1155D81230a98317A79546c13C1245a55117A26689K71933
11148C98622A9134d9034m9200j69180B80848c261A51415p4532e7489A88819p5193
11137A13626f5745A1138d4447B998K64388b73444P3940C1503b93067C78812A10386
11125C70678j01120a11743l0355E4055a23591H7232a02058H294d6279I2951M0304
$$ plain form
11114 133255 -19805 156343 90145 -44465 -147987 173831 182475 -181576 -44040 103021 9472
11102 30075 237361 22455 325101 161373 -42929 -62573 25391 -83484 108093 754071 -203850
11090 -31763 164465 199400 347073 266745 322903 228358 213446 -9143 -43865 88237 185075
11079 185075 89225 354523 81072 89322 274233 434301 16381 -281495 149599 -47555 273347
11067 198516 191540 152674 113251 429505 413233 147619 188796 100061 321512 175500 76645
11055 256463 974543 796451 375045 535080 394866 872702 351402 628589 836026 791533
11045 791533 619753 667299 745721 967043 629297 878704 758500 465286 605125 594063
11035 594063 478448 760104 976374 656838 655465 622216 723127 807442 680558 438550
$$ packed form
11114A33255a9805A56343o6198d4465j03522A73831Q644a81576d4040A03021I472
11102C0075K07286B2455L02646A61373d2929j9644B5391h3484A08093O45978b03850
11090c1763A64465L4935J47673q0328N6158r4545j4912i143l4722H8237R6838
11079A85075H9225K65298H1072Q250J84911J60068A6381b81495A49599d7555B73347
11067A98516o976l8866l9423L16254j6272A47619M1177q8735K21451j46012G6645
11055B56463P18080j78092C75045J60035j40214M77836C51402K77187K07437m4493
11045G91533j71780M7546P8422K21322l37746K49407j20204k93214J39839j1062
11035E94063j15615K81656K16270l19536j373l3249J00911Q4315j26884k42008
$$ plain form
11025 438550 397794 689748 403009 668031 574696 442691 160448 322482 333176 667676
11015 667676 661739 703722 496579 466054 343989 407997 627692 143721 357059 470573
11005 470573 289929 629082 486271 472212 649162 532581 535485 338056 651640 630527
10995 630527 200666 202889 627114 385840 624817 409793 701117 695167 441660 847837
10985 847837 530446 689291 932802 892343 946105 1007428 765918 806611 939468 989991
10975 989991 1186496 1347736 1389324 1631527 1537903 1948676 2172119 2023404 2470496 2011771
10965 2011771 1955501 2121801 1766430 1839752 1635905 1593932 1528091 1312117 1051415 1384985
10955 1384985 1349899 1427559 1553129 1357671 1835009 1718245 1387915 1218579 1170956 974976
$$ packed form
11025D38550m0756K91954k86739K65022r3335j32005A60448J62034J0694L34500
11015F67676n937M1983k07143l0525j22065O4008K19695A43721K13338J13514
11005D70573j80644L39153j42811j4059J76950j16581K904j97429L13584k1113
10995F30527B00666K223M24225k41274K38977k15024K91324n950k53507M06177
10985H47837l17391J58845K43511m0459N3762O1323k41510M0693J32857N0523
10975I89991J96505J61240M1588K42203r3624M10773K23443j48715M47092m58725
10965B011771n6270J66300l55371P3322k03847m1973o5841k15974k60702L33570
10955A384985l5086P7660J25570j95458M77338j16764l30330j69336m7623j95980
$$ plain form
10945 974976 1000549 720516 568133 265909 445669 502767 281570 559171 49437 401144
10935 401144 391325 63934 -21556 259531 229458 -79385 -211929 196791 30869 -33443 -32024
10924 -32024 20938 15223 168730 -11671 -360457 140841 176616 137577 7128 327436 -71260
10912 -34271 54083 -59920 227468 -3614 -84509 -160803 -222241 15342 -63626 -26703 125533
10900 26616 239739 -26687 -44847 29935 165195 124245 -92434 129228 113746 -449900 -129412
10888 -132463 6502 -134596 119422 -94369 -44781 242063 -304292 -35304 6030 -14610 433473
10876 -43807 -181392 -39461 -82089 -71401 158943 22179 13662 -18425 -284673 -279549 116701
10864 -590058 37371 -22761 -135329 313135 94006 156790 -108476 -29749 -184962 86814 -88958
$$ packed form
10945I74976K5573k80033j52383B65909J79760N7098k21197K77601D9437L51707
10935D01144r819F3934b1556B59531l0073g9385j32544A96791C0869c3443J419
10924c2024B0938n715J53507a1671l48786A40841L5775l9039G128L20308g1260
10912c4271E4083e9920B27468c614q0895p6294o1438A5342f3626b6703A25533
10900B6616K13123b6687j8160B9935J35260m0950i2434A29228j5482d49900a29412
10888a32463F502a34596A19422i4369d4781B42063c04292c5304F030a4610D33473
10876d3807j37585c9461m2628J0688A58943B2179q517a8425k66248N124A16701
10864e90058C7371b2761j12568C13135I4006O2784a08476b9749j55213H6814h8958
$$ plain form
10852 -341616 -13807 -93363 -308047 -209613 339347 132369 -135221 48289 -236826 -127554
10842 -127554 230496 179024 197569 48116 160913 -323108 -175403 -132414 -164302 -65816 344734
10830 207706 -9643 -61403 593791 -206222 -98657 -131204 22632 -97374 -138973 14770 -172154
10818 96778 -354168 -118506 -194797 -100938 -123900 -258381 -395598 -101104 -29271 -327884
10808 -327884 -113200 -199498 -290431 65659 -243986 218645 -109872 -38613 -10291 -238907
10798 -238907 -49931 301678 -132083 56184 -23902 119898 -11452 -23764 -199367 161644
10787 209244 -76882 -187381 -297574 -88226 145481 -162955 -15626 60474 30837 153458
10777 153458 -263054 -289193 133120 -1363 356298 -41139 -18269 -224745 -271888 209812 -142592
$$ packed form
10852c41616a3807p9556k14684R8434C39347A32369a35221D8289b36826J09272
10842a27554B30496n1472J8545D8116J12797c23108J47705M2989l1888f5816C44734
10830B07706i643n1760E93791b06222i8657l2547B2632i7374m1599A4770a72154
10818I6778c54168a18506p6291R3859k2962j34481j37217a01104b9271k98613
10808c27884a13200q6298r0933F5659b43986B18645a09872c8613a0291k28616
10798b38907d9931C01678a32083E6184b3902A19898a1452j2312j75603A61644
10787B09244g6882j10499j10193h8226A45481a62955a5626F0474k9637J22621
10777A53458b63054k6139A33120a363C56298d1139a8269k06476m7143B09812a42592
$$ plain form
10765 138106 -139290 -238703 7028 -278308 -219485 -387332 -34540 31190 -1214 -180789 -234567
10754 -234567 -280437 366509 40744 -247273 -116241 -248659 102077 175616 168640 -71182 121926
10742 -184736 -221735 -137711 74504 138043 -37814 154663 16498 -200250 60029 91138 -133032
10730 53645 -15298 92581 45426 59516 181904 36575 246807 -6533 -24574 8582 201348
10719 201348 185338 -49326 110083 -91501 114441 -84063 117062 -26560 -113485 -182930 -226738
10708 -226738 -7257 -155981 5793 187172 -375044 -29535 125526 36222 -25659 110106 -238576
10696 -39454 197052 -260481 -250654 -243130 26701 -94531 75995 -12109 -269431 -87107 -118892
10685 -118892 258763 250555 -177459 -150206 163531 -120486 135657 -143039 -122780 -198681
$$ packed form
10765A38106a39290r9413G028b78308N8823j67847c4540C1190a214j79575n3778
10754b34567m5870C66509D0744b47273a16241j32418A02077P3539o976g1182A21926
10742a84736l6999Q4024G4504O3539c7814A54663A6498b00250F0029L1109a33032
10730E3645a5298I2581D5426J4090J22388C6575K10232f533j8041H582J92766
10719B01348j6010d9326A10083i1501A14441h4063A17062b6560q6925o9445m3808
10708b26738g257j48724E793J81379c75044b9535A25526C6222b5659A10106b38576
10696c9454A97052b60481R827P524B6701i4531G5995a2109k57322h7107l1785
10685a18892B58763q208a77459K7253A63531a20486A35657a43039K0259p5901
$$ plain form
10675 -198681 -227473 197507 10783 -343427 -382142 65794 -22614 111000 -83107 -39908 -72624
10664 -72624 -131426 44215 -138354 -66885 295410 307651 -343896 -136516 -150905 -267417 -228973
10653 -228973 -99694 -281809 202416 -366050 -350331 -117797 -72425 -15874 -117248 -100797
10643 -100797 146484 -101161 -85376 -114982 -144055 -4516 9596 -161446 17643 43058 184087
10632 184087 166904 -94605 -324357 125796 -185851 55709 -304253 -27297 223533 -52124
10621 103473 303529 -107765 -47296 51186 277936 -275823 -326141 -86163 -21997 174396
10610 58812 -167702 -57716 -38223 71090 -26239 30905 -211345 -115646 -301756 -115947 -225144
10599 -225144 -271192 281244 -431674 2617 90340 -106621 -129662 -187298 176235 -174487 74475
$$ packed form
10675a98681k8792A97507A0783c43427l8715F5794b2614A11000h3107c9908l2716
10664g2624n8802D4215a38354f6885B95410J2241c43896a36516j4389j16512L8444
10653b28973i9694j82115B02416c66050J5719a17797M5372a5874j01374J6451
10643a00797A46484a01161J5785k9606k9073d516I596a61446A7643K5415J41029
10632A84087j7183i4605k29752A25796a85851E5709c04253b7297B23533e2124
10621A03473K00056a07765d7296E1186K26750b75823n0318h6163b1997A74396
10610E8812a67702e7716J9493G1090b6239C0905b11345R5699j86110a15947j09197
10599b25144m6048B81244d31674B617Q7723a06621k3041n7636A76235a74487G4475
$$ plain form
10587 -26456 53346 12598 24420 -222652 68302 11078 -30875 -88871 -58085 -41606 356322
10575 -235594 233751 67577 -105767 302432 103084 -86034 -153475 -202455 -135364 -35146 64621
10563 -59180 -255917 -208016 -39560 -130381 42724 5029 205750 256225 136464 125451 -161301
10551 -67803 111631 31281 87315 -40933 -101718 108886 -167249 20246 -436168 -316802 -34573
10539 -358632 -354344 -136645 -178794 2334 -197955 -103152 172471 18498 -88495 -221823 178367
10527 -211259 117051 78718 -73374 -273885 61697 313361 108108 -229754 149186 -47060
10516 33858 -62205 -22304 -94348 31269 212748 -112844 30041 -76597 -485662 -157423 -190537
10505 -190537 108679 -34740 165444 -34829 -220968 -311886 -372175 -138813 -256308 17044
$$ packed form
10587b6456E3346A2598J1822b22652F8302A1078c0875n7996L0786J6479C56322
10575b35594B33751F7577a05767C02432A03084h6034o7441m8980O7091c5146F4621
10563e9180j96737M7901c9560r0821D2724E029K00721N0475j19761j1013a61301
10551f7803A11631C1281N6034d0933o0785A08886a67249B0246d36168J19366c4573
10539c58632M288a36645m2149B334a97955R4803A72471A8498h8495j33328A78367
10527b11259A17051l8333g3374k00511F1697K51664A08108b29754A49186d7060
10516C3858f2205b2304p2044C1269J81479a12844C0041g6597m09065a57423l3114
10505a90537A08679c4740A65444c4829j86139r0918o0289a38813j17495A7044
$$ plain form
10494 -246202 -88103 -247235 136917 -208517 72386 250954 -130005 -164456 326539 -113926
10483 -75229 -284004 -151104 110530 447386 -146088 34597 403374 228680 509496 493254
10473 493254 567749 597762 382985 440086 443295 353434 -44658 97513 226039 -62847 -32780
10462 -32780 169114 48578 -191367 148734 -92288 147993 -162374 184247 261630 139579
10452 139579 -438782 -115442 64355 -56155 228903 47156 -37269 105194 -23838 60728 66831
10441 66831 59542 -248320 193208 185823 -307946 -212025 4909 -184108 191228 -101544 117389
10429 26082 75346 -547768 -1233 -23019 219847 78550 356460 -405278 -72738 -193663 -220874
10418 -220874 -247238 -212366 -248378 237408 -259611 -156549 -8243 52733 41666 -167006 -36828
$$ packed form
10494b46202h8103j59132A36917b08517G2386J78568a30005l4451C26539a13926
10483g5229k08775J32900A10530L36856a46088C4597L68777j74694K80816j6242
10473D93254P4495L0013k14777N7101L209q9861d4658I7513J28526f2847L0067
10462c2780A69114D8578a91367A48734i2288A47993a62374A84247P7383j22051
10452A39579d38782a15442F4355e6155B28903D7156c7269A05194b3838F0728O103
10441F6831p289b48320A93208p385c07946R5921D909a84108A91228a01544A17389
10429B6082M9264e47768a233k1786B19847G8550K77910d05278g2738j20925k7211
10418b20874k6364L4872l6012B37408b59611J03062h243E2733j1067a67006c6828
$$ plain form
10406 -186491 -354885 76931 -234218 108895 -210326 138662 -154160 450449 -129882 -32161
10395 -136417 -131347 -370813 -238672 420680 -219255 -201060 323454 -59341 535480 -74978
10384 -147394 143487 -224773 96661 53976 -466754 -121769 72258 -67529 89726 188430 31731
10372 305746 533227 380617 25406 154663 320821 186386 157455 507111 343277 744074
10362 744074 333219 391487 396748 56159 -83249 159928 222820 156492 -28549 115705 198731
10351 198731 302613 -362021 230164 255718 728856 202145 325031 169789 261837 256313
10341 256313 78208 349671 422893 318713 365127 -322829 104397 195494 -6991 121689 87717
10330 87717 -93371 -67992 -288031 152636 469209 11617 53309 -257268 321921 183456
$$ packed form
10406a86491j68394G6931b34218A08895b10326A38662a54160D50449a29882c2161
10395a36417N070k39466J32141D20680b19255J8195C23454e9341E35480g4978
10384a47394A43487b24773I6661m2685d66754a21769G2258f7529H9726R8704C1731
10372C05746K27481j52610B5406J29257J66158j34435k8931L49656j63834M00797
10362G44074C33219N8268N261E6159h3249A59928O2892o6328b8549A15705Q3026
10351A98731J03882c62021B30164K5554M73138B02145J22886j55242R2048n524
10341B56313G8208K71463P3222j04180M6414c22829A04397R1097f991A21689l3972
10330H7717i3371K5379k20039A52636L16573A1617M1692b57268C21921j38465
$$ plain form
10320 183456 198998 261079 -32323 57578 30593 66776 135312 191563 285032 17949 -32109
10308 -74254 -227680 358905 -191539 139556 -121938 499711 -251646 166729 -89170 149518
10297 128971 -76826 148086 93811 30920 -426396 -388655 -240011 84672 -145081 -152678 146147
10285 274895 -79768 8498 -46840 -370738 39971 93598 -146615 70481 -158036 -394623 29317
10273 241512 -62585 -128194 92521 -131839 -233210 -170735 -224840 66849 -34693 28308 -12534
10261 -139556 224503 7189 -56007 -37238 -4874 151885 43348 -196249 69036 153887 120974
10250 120974 47978 103454 7520 -106960 349891 75543 87547 -179862 -69932 -9015 -164054
10239 -164054 42450 41179 148450 -21871 153698 222213 -246839 -26391 -91506 1850 -235402
$$ packed form
10320A83456J5542O2081c2323E7578k6985L6183O8536N6251R3469A7949c2109
10308g4254j53426C58905a91539A39556a21938D99711b51646A66729h9170A49518
10297A28971g6826A48086n4275C0920d26396L7741J48644H4672a45081p597A46147
10285B74895g9768H498d6840l23898C9971N3627a46615G0481a58036k36587B9317
10273B41512f2585o5609I2521a31839j01371O2475n4105F6849c4693B8308a2534
10261a39556B24503G189e6007J8769d874A51885D3348a96249F9036Q4851l2913
10250A20974D7978N5476G520a06960C49891G5543J2004a79862f9932i015j55039
10239a64054D2450j271J07271b1871A53698O8515b46839b6391o5115A850b35402
$$ plain form
10227 -51849 184809 196055 -13295 -14147 -4729 302682 199234 -44417 163463 -115618 97077
10215 -66217 -307165 -278919 187685 -27175 -85848 -24242 -179250 -82228 -63212 34328 -339393
10203 66425 -68259 -58528 -119693 -582021 170082 63936 -346662 -159160 -15414 -344950 -63873
10191 -66752 -213287 117825 -162099 -222214 -74512 -101017 -102998 88062 -190158 96935 -86231
10179 -157153 123717 -150391 -339729 55755 -9730 -275277 -69424 118205 -73305 287352
10168 171097 -30126 -43459 -58151 -162984 242476 -60026 -459948 30308 -77067 -114232 -69349
10157 -69349 187873 -304301 -48751 210624 31235 -40764 -242493 -165402 -226595 198908 -44807
10145 -152192 108967 362996 -129201 14433 -67231 -156328 -347921 -240490 -250794 -276301
$$ packed form
10227e1849A84809J1246a3295q52d729C02682j03448d4417A63463a15618I7077
10215f6217k40948K8246A87685b7175n8673b4242j55008h2228J9016C4328c39393
10203F6425f8259R731o1165m62328A70082F3936c46662a59160a5414l29536f3873
10191f6752j46535A17825a62099o0115g4512k6505j981H8062a90158I6935h6231
10179a57153A23717a50391j89338E5755i730k65547f9424A18205g3305B87352
10168A71097c0126j3333j4692j04833B42476f0026l99922C0308g7067l7165M4883
10157f9349A87873c04301d8751B10624C1235d0764k01729P7091o1193A98908d4807
10145a52192A08967K54029a29201A4433f7231q9097j91593J07431j0304k5507
$$ plain form
10135 -276301 -144751 84455 49271 -303007 -104444 257410 -148491 -28217 -163349 -177140
10125 -177140 -318513 -56361 -64145 3616 95990 -257645 -76202 -237206 3311 90162 -265225
10113 -114330 -140179 -409596 -180783 -147309 42150 -211076 111730 188149 -216175 -91618
10102 -23740 -47994 33395 26871 -92228 -418949 -10890 -165853 -107234 -218327 -206237 -128866
10091 -128866 -15705 -123614 179346 -70110 -241615 37921 6201 -282662 91179 90124 -234173
10079 -172839 -339904 -281120 -467670 113040 -17626 -136389 -253666 -199912 -49949 -143442
10069 -143442 -157054 200944 -60230 -193001 -211415 -99377 76744 41644 -211007 -187419 -297740
10058 -297740 70465 -88949 92801 114468 -31745 91987 -380256 326468 -184924 101415 -125794
$$ packed form
10135b76301J31550H4455l5184c03007a04444B57410a48491b8217j35132j3791
10125a77140j41373e6361p784C616R2374b57645g6202j61004C311Q6851b65225
10113a14330k5849k69417a80783L3474D2150b11076A11730P6419b16175i1618
10102b3740k4254C3395o524i2228l26721a0890j54963N8619j11093J2090P7371
10091a28866a5705j07909A79346g0110j71505C7921F201b82662I1179j055b34173
10079a72839j67065N8784j86550A13040a7626j18763j17277N3754d9949r3493
10069a43442j3612B00944f0230j32771j8414i9377G6744l5100b11007K3588j10321
10058b97740G0465h8949I2801K1667c1745I1987c80256C26468a84924A01415a25794
$$ plain form
10046 -83901 170080 -92871 -110542 54232 -25936 -164281 -201344 -10688 242535 -200528 -131042
10035 -131042 -156936 -84271 -41080 -208119 -54823 69866 207950 -123837 -76788 -154985 153440
10023 -42246 -228351 -187825 28422 -48184 133896 -92946 -123554 -61960 -426071 -90523 86197
10011 -145097 -470767 160386 -374884 90507 15188 44553 -113676 -383145 -80307 -132649
10001 -132649 -310103 184234 12846 57795 83668 38116 227299 224045 -264797 -28622 112711
9989 -300355 228444 233023 80320 82877 20635 -104156 33919 -160540 -53158 -397796 90572
9977 134369 268315 -254640 -135360 -415002 -81146 -249568 -152420 348157 116893 -156000
9966 75148 -206093 116397 -155796 152023 46220 147948 -201099 -45072 -87099 -104286 173333
$$ packed form
10046h3901A70080i2871j7671E4232b5936j38345l7063a0688B42535b00528O9486
10035a31042k5894P2665d1080j67039e4823F9866J38084a23837M7049p8197A53440
10023d2246j86105M0526B8422d8184A33896i2946l0608O1594l64111i0523H6197
10011a45097l25670A60386c74884I0507A5188K9365a13676k69469h0307n2342
10001a32649j77454A84234A2846M4949K5873C8116J89183l254b64797b8622A12711
9989c00355B28444M579H0320K557B0635a04156C3919a60540e3158l44638I0572
9977A34369J33946b54640J19280k79642h1146j68422R7148C48157A16893a56000
9966G5148b06093A16397a55796A52023D6220J01728b01099d5072m2027j7187A73333
$$ plain form
9954 -52074 -114348 159335 -127566 -322510 -243 74884 96092 63049 34558 160752 -25108
9942 241357 -45750 53995 46847 4305 33970 3848 -79508 -119197 -150272 -248218 -281195 -173172
9930 -173172 -50443 33431 89225 -43119 -242202 42796 -147844 73190 -405678 94981 4016
9918 114896 73002 -200479 -144169 -31997 -48391 -311043 -47879 -25461 407951 63696 -106249
9906 -246914 -20763 97440 -130068 -47637 -131413 -44961 -7339 -170106 -260247 307335 -25064
9894 -209427 -160145 -284433 150960 -166164 -199661 -74022 -44098 -100289 96147 -12231 3940
9882 23693 -304457 -28784 42794 267990 75040 -221396 -4387 -3190 98515 19495 -103124
9870 -147892 -273347 -45770 -35809 210592 -146552 59261 -183101 97620 -133547 42328 -329532
$$ packed form
9954e2074o2274A59335a27566j94944b43G4884K1208l3043k8491J26194b5108
9942B41357d5750E3995p148D305K9665C848g9508l9689l1075r7946l2977J08023
9930a73172e0443C3431N5794d3119j99083D2796a47844G3190d05678I4981D016
9918A14896m1894b00479N6310c1997j6394k62652d7879K2418D07951F3696a06249
9906b46914b0763I7440a30068d7637q3776d4961g339j62767r0141C07335b5064
9894b09427M9282j24288A50960a66164l3497g4022K9924n6191I6147a2231C940
9882B3693c04457b8784D2794K25196G5040b21396d387J197I8515A9495a03124
9870a47892j25455d5770R961B10592a46552E9261a83101I7620a33547D2328c29532
$$ plain form
9858 -53542 -164586 -47515 290227 -131546 -332115 -192393 -249122 58475 123403 -208036 51472
9846 -90823 -395889 149617 139049 -137504 -20501 -37427 -218146 3211 -33311 -324631 -204849
9835 -204849 140523 -14069 -573576 -236937 -110522 98226 -93241 82787 -137710 -5399 -90058
9824 -90058 -164779 65621 -368611 -323563 -35463 121111 -44218 -146020 224367 -257608 -307918
9813 -307918 30526 -177487 120100 74659 177882 -87829 -246965 137162 -4716 -346609 -216895
9802 -216895 67499 76937 -14987 116960 -262440 -160259 19246 -182734 -275084 144516 -419126
9790 -5926 -40174 -129990 -220607 -178107 76856 -66894 -3490 -141372 -13156 32152 189528 -26828
9777 -6713 -270383 -146900 47981 -99420 -123489 -50052 -203473 -63233 62914 346601 -128088
$$ packed form
9858e3542j11044d7515B90227a31546k00569J39722n6729E8475O4928b08036E1472
9846i0823l05066A49617j0568a37504b0501j6926j80719C211c3311k91320J19782
9835b04849A40523a4069n59507b36937a10522I8226i3241H2787a37710e399q4659
9824i0058p4721F5621c68611M5048c5463A21111d4218j01802B24367b57608n0310
9813c07918C0526a77487A20100m5441J03223h7829j59136A37162d716l41893J29714
9802b16895F7499R438a4987A16960b62440J02181A9246a82734r2350A44516d19126
9790e926l4248q9816r0617M2500G6856f6894c490j37882a3156C2152J57376b6828
9777f713k63670J23483D7981i9420k4069e0052j53421f3233F2914K83687a28088
$$ plain form
9765 -332243 -20070 -103543 -159459 -94926 80443 -69868 -277960 22440 371222 -234398 3688
9753 -21860 -162641 242934 136835 164696 -142928 265954 -182992 -312538 -334415 121938
9742 281183 -163898 73563 -140482 74131 60464 -44281 -85542 -139282 53703 -251096 53851
9730 -470357 -166997 -119618 86391 -71613 -51502 185710 -84151 -268567 140243 19809 -329363
9718 112404 -121286 -84918 -260539 -44732 -49645 -315963 -67924 123450 -29731 -44756 -69850
9707 -69850 158477 -340060 -161365 -178607 14312 233154 116000 175047 70258 -15156 124760
9695 -85796 -128181 -106622 -12112 -300905 -214663 -207353 130674 14131 -115975 -52512 -44648 -123187
9683 -123187 -177518 -79347 -3808 220756 67838 -36604 -10553 69741 10081 80908 -315196
$$ packed form
9765c32243b0070q3473n5916O4533H0443f9868k08092B2440L48782b34398C688
9753b1860j40781B42934j06099K7861a42928B65954a82992j29546k1877A21938
9742B81183a63898G3563a40482G4131j3667d4281m1261n3740E3703b51096E3851
9730d70357a66997M7379H6391g1613K0111A85710h4151j84416A40243A9809c29363
9718A12404a21286L6368j75621d4732m913k66318f7924A23450b9731j5025k5094
9707f9850A58477c40060a61365j7242A4312K18842A16000N9047G0258a5156A24760
9695h5796m2385K1559a2112k88793Q6242P310A30674A4131a15975e2512P864p8539
9683a23187n4331g9347c808B20756F7838c6604a0553F9741A0081P0827c15196
$$ plain form
9671 -53981 -357712 -19855 -287542 -123349 -106113 -300926 95617 -266264 101173 -78995 -44473
9660 -44473 448 -31712 -394061 -262699 -90985 -176054 -129831 -122092 -3460 -544378 53409 -129438
9647 101594 121969 88198 -16609 -172299 151150 4149 40719 -75206 -257390 -12102 -129929
9636 -129929 -182261 167072 -92362 -176883 -30251 -173445 107348 -255497 -84246 204846 -190241
9624 -388284 -137409 -919 -238429 -476113 -166194 -144110 182211 -182972 -82359 -25605 53343
9612 -199189 -225344 -320116 -52639 119900 -296673 -82142 81959 92621 -56766 -445357 -301356
9601 -301356 169414 41734 -83894 -113083 -27227 71645 -14180 -175402 177616 269040 -19284
9589 82836 -43468 30462 -43157 -79915 -257500 -80417 -262456 -26182 -116985 -111795 -139675 73068
$$ packed form
9671e3981l03731a9855k67687a23349J7236j94813I5617b66264A01173g8995L4522
9660d4473D48c1712l62349J31362i0985q5069M6223P739c460n40918E3409a29438
9647A01594K0375l3771a6609j55690A51150D149L6570g5206j82184a2102j17827
9636a29929n2332A67072i2362q4521c0251j43194A07348b55497h4246B04846a90241
9624c88284a37409i19k37510k37684a66194K2084A82211a82972h2359b5605E3343
9612a99189k6155r4772e2639A19900b96673h2142H1959J0662e6766l88591J44001
9601c01356A69414D1734h3894k9189b7227G1645a4180j61222A77616R1424a9284
9589H2836d3468C0462d3157l6758j77585h0417j82039b6182r0803N190k7880G3068
$$ plain form
9576 -34948 -48551 -360460 -370168 -82368 -292730 -210301 -34202 236532 -157316 146950 33418
9564 68705 109108 -119565 11919 211877 -16459 2468 -230986 76589 33048 38546 -158064
9552 -94171 19337 -93241 -83784 83949 -106407 -45733 82318 -242109 -269429 236763 -307923
9540 126058 189651 200343 -120362 -10768 95634 -12978 -67562 273727 155165 -108424 256
9528 117321 -108352 -442029 63258 -245522 98161 230098 -64412 -275679 -51251 -155087
9518 -155087 -88113 -362398 103179 61203 176614 48152 -61868 -165420 102 -222977 -127204
9507 -127204 -130367 179131 -176525 108153 231074 -72998 316904 73413 -170635 -66778 210484
9495 -507100 -153413 144230 -40038 50840 9156 -55303 194630 -297269 -17467 -52268 -85574
$$ packed form
9576c4948j3603l11909r708h2368k10362Q2429c4202B36532a57316A46950C3418
9564F8705M0403a19565A1919J99958a6459B468b30986G6589C3048N498a58064
9552i4171A9337i3241R457H3949a06407d5733H2318b42109k7320B36763c07923
9540A26058O3593J0692a20362a0768I5634a2978n4584B73727j18562a08424B56
9528A17321a08352l33677F3258b45522I8161J31937f4412k11267e1251j03836
9518a55087O6974k74285A03179m1976J15411D8152f1868j03552A02b22977R5773
9507a27204l163A79131a76525A08153J22921g2998C16904G3413a70635f6778B10484
9495e07100a53413A44230d0038E0840I156e5303A94630b97269a7467l4801l3306
$$ plain form
9484 -85574 -361479 -409820 -15802 83455 -283825 103764 -225245 -352044 66697 -321049 54575
9472 155935 249841 -424137 -273218 24048 153561 8987 -75120 -138499 -182730 -15851 -98379
9461 -98379 -206027 58579 64425 -4951 10054 -39618 363723 -261001 260298 -250518 108470
9449 -305461 146452 -155033 36958 -40626 -96365 -293988 -21898 -251357 328326 -166953
9438 48957 -167084 -282032 -85388 -262459 88733 -307733 -170977 135467 -110956 -47877
9427 -175685 -372764 77225 -166650 -141479 -49189 -41817 16923 71033 -144314 90458 -19744
9415 19679 -370762 -405247 -43333 60880 -127627 -202655 -387257 235548 -531409 -285183 137373
9403 55796 -267012 -138974 -84408 -21626 200458 4536 -76265 124614 -180221 -159499 -57301
$$ packed form
9484h5574k75905m8341a5802H3455b83825A03764b25245j26799F6697c21049E4575
9472A55935R3906d24137J50919B4048J29513H987g5120o3379m4231a5851q2528
9461i8379j07648E8579N846d951A0054c9618C63723b61001B60298b50518A08470
9449c05461A46452a55033C6958d0626n5739j97623b1898k29459C28326a66953
9438D8957a67084j14948h5388j77071H8733c07733J36756A35467a10956d7877
9427a75685j97079G7225a66650K5171d9189P372A6923N4110a44314I0458a9744
9415A9679c70762l4485d3333F0880a27627p5028j84602B35548e31409K46226A37373
9403E5796b67012J28038N4566b1626B00458D536g6265A24614a80221K0722e7301
$$ plain form
9391 98094 9026 -266356 -12155 153044 256578 -145451 54659 -425705 325100 -51595 4915
9379 -150729 65991 14358 -275620 -24181 52933 89669 -252216 4836 -125302 -107715 49308
9367 189994 -85576 -7350 143657 -186932 73303 132951 54097 -174561 -343992 -149474 -212591
9356 -212591 -12304 -183991 61749 -176850 -133224 148095 163383 173083 21219 -264704 4916
9344 18840 -86751 -198477 172417 -286594 -235335 -34690 -328346 -229990 -153727 -55289 -417621
9333 -417621 211926 170376 -268627 -139787 -261805 -196799 -36698 -192543 -164175 -349186
9323 -349186 -53992 354319 167525 192936 -29261 675 -88872 -306273 -22695 -95665 -172950
9312 -172950 82618 -353110 32518 -206568 331753 68818 -178200 135731 -112510 219762
$$ packed form
9391I8094I026b66356a2155A53044J03534a45451E4659d25705C25100e1595D915
9379a50729F5991A4358b75620b4181E2933L6736b52216D836a25302J7587D9308
9367A89994h5576g350A43657a86932G3303N9648E4097a74561j69431a49474o3117
9356b12591a2304j71687F1749a76850M3626A48095J5288R700B1219b64704D916
9344A8840h6751j11726A72417b86594N1259c4690k93656R8356P6263e5289l62332
9333d17621B11926m1550b68627J28840j22018O5006c6698j55845K8368j85011
9323c49186e3992C54319A67525K5411b9261F75h8872k17401b2695p2970p7285
9312a72950H2618c53110C2518b06568C31753F8818a78200A35731a12510B19762
$$ plain form
9301 86087 -30924 -107005 -254682 222662 -257800 14267 -63750 162103 93849 15727 -241714
9289 203458 -264710 232327 -129085 -111834 126806 129175 -190584 87267 -312190 136917
9278 -61248 134069 279853 105747 -85070 -61318 6016 185401 -115933 -108175 1832 -237074
9266 -257615 -123335 634 -345401 -57507 -337155 79271 -66508 -72382 -467824 -76492 -94699
9255 -94699 -190961 270886 -58963 43886 -218914 -292106 81923 97078 -270626 127099 -39670
9243 -72386 -345681 -430484 198773 -68025 -9591 145346 15434 5909 22888 -186830 9453 -66107
9230 7894 -184870 47957 -207307 -100978 -59406 -282216 -16961 -309140 -81795 -290402 123723
9218 99914 6761 -107640 -99209 -115132 -156140 150584 -74565 -253212 -304249 -176365 1241 -96703
$$ packed form
9301H6087c0924p6081j47677B22662b57800A4267f3750A62103o8254A5727b41714
9289B03458b64710B32327a29085J7251A26806K369a90584H7267c12190A36917
9278f1248A34069J45784A05747h5070K3752F016J79385a15933P758A832b37074
9266b57615a23335F34c45401e7507k79648G9271f6508n874l95442g6492j8207
9255i4699r6262B70886e8963D3886b18914p3192H1923J5155b70626A27099c9670
9243g2386k73295q4803A98773f8025i591A45346A5434E909J6979a86830I453f6107
9230G894a84870D7957b07307a00978M1572k22810a6961k92179h1795k08607A23723
9218I9914F761a07640Q431j5923m1008A50584g4565j78647n1037J27884A241i6703
$$ plain form
9205 130900 -35403 -37658 -66535 -232392 115798 35138 198863 -137249 178234 -247206 -189723
9194 -189723 130987 -49476 -224328 -32150 125769 -115033 -73248 10541 256523 55844 -155209
9182 -16042 -7881 60889 170870 -189108 -96820 -42097 246497 -117304 -89454 189228 -40717
9170 -305144 -515609 -240504 -147694 -19225 53546 -256560 -58041 -59376 248391 -73059 -215215
9159 -215215 -275388 -150093 -155946 -100656 -276959 128601 -98862 52048 47451 -207841 80528
9147 -53447 -146543 -328355 -373821 -13248 -181554 -102707 -27840 43170 -107462 -104092 104023
9135 -25349 -97088 -166976 55801 -11861 -88350 -231849 145819 -251299 -185344 333043 21943
9123 195834 94522 -126227 50774 343053 -216065 -87743 -14770 -140076 -2138 -46387 -230683
$$ packed form
9205A30900c5403k255k8877j65857A15798C5138J63725a37249A78234b47206N7483
9194a89723A30987d9476j74852c2150A25769a15033M1785A0541K45982E5844a55209
9182a6042g881F0889J09981a89108R2288d2097B46497a17304K7850A89228d0717
9170c05144k10465b40504R2810a9225E3546b56560e8041j335B48391g3059j42156
9159b15215o0173J25295n853N5290j76303A28601i8862E2048m597b07841H0528
9147e3447r3096j81812m5466a3248j68306P8847b7840D3170a07462L370A04023
9135b5349p1739o9888E5801a1861p6489j43499A45819b51299O5955C33043B1943
9123A95834I4522a26227E0774K92279b16065h7743a4770j25306b138m4249j84296
$$ plain form
9112 -230683 -102136 12068 187034 -494513 -114159 31945 48020 113047 -12314 -158794 22367
9100 211140 22612 -367276 -58217 -214564 -85492 -88148 71227 -130564 109658 -346168 -171048
9088 -200795 193257 138493 156699 -159517 -254309 -177510 -16544 191934 50389 -4339 -156741
9077 -156741 1370 -126160 -292992 161812 -222262 -219840 27420 -43255 -151763 -410454 -181698
9065 57147 53775 -312240 -224067 -77964 36957 131192 -126351 -59541 -101702 -111583 251564 -98983
9052 -225361 -196610 8476 85576 -42468 -174145 317500 -23378 -9483 -169989 -97420 6291 -305474
9039 -130691 -85286 -251151 -70025 4800 77845 -93912 -10051 -526728 -65248 -135614 30583
9027 -389996 -135115 -273333 138667 -60648 -180605 -151067 -75795 -181596 94465 -100255
$$ packed form
9112b30683a02136A2068J74966d94513a14159C1945J6075O5027a2314j46480B2367
9100B11140B2612c67276e8217j56347h5492k656G1227a30564A09658c46168a71048
9088b00795A93257n4764J8206a59517r4792P6799a6544A91934E0389d339j52402
9077a56741A370a26160j66832A61812b22262K422B7420d3255j08508k58691a81698
9065E7147l372c12240Q8173g7964C6957R4235a26351e9541m2161r881B51564i8983
9052b25361K8751H476P7100d2468j31677C17500b3378i483j60506P2569F291c05474
9039a30691M5405j65865g0025D800P3045i3912a0051n16677f5248p0366C0583
9027c89996a35115j38218A38667f0648j19957K9538P5272j05801I4465a00255
$$ plain form
9016 -47962 39888 89983 65493 -291239 69591 -94120 -48545 -204007 -13851 36231 -171893
9004 -228715 -56848 57309 -76434 -158509 65749 20319 -213896 94054 -16765 -230017 -205710
8993 -205710 -3443 -399049 -349635 78838 -39761 109559 -409353 32617 -281480 -146210 31349
8981 -173492 -122212 -8524 -240223 -158236 -86553 303009 -28574 -7705 -427641 -42265 62647
8969 -97909 -114692 258988 -83836 -31050 -185581 193833 33072 13355 -188528 -237973 248071
8957 170607 95918 -163120 9402 362319 -24827 -232635 -110167 232317 217099 -283825 -29281
8945 -208463 -14978 179315 -230064 -110081 -111910 -150829 -72087 350883 -51004 43019 -274748
8933 174576 127009 222892 81662 104897 -228470 -18572 383562 -318020 -55387 -94458 183386
$$ packed form
9016d7962C9888N0095k4490b91239F9591i4120M5575j55462a3851C6231a71893
9004b28715e6848E7309g6434q2075F5749B0319b13896I4054a6765k13252K4307
8993b05710c443l95606M9414G8838c9761A09559d09353C2617b81480J35270C1349
8981a73492N1280h524k31699Q1987P1683C03009b8574g705m19936d2265F2647
8969i7909j6783B58988h3836c1050j54531A93833C3072A3355a88528m9445B48071
8957A70607p4689a63120I402L52917b4827k07808a10167B32317j5218b83825b9281
8945b08463a4978A79315b30064a10081j829l8919g2087C50883e1004D3019b74748
8933A74576m7567R5883H1662K3235b28470a8572C83562c18020e5387l9071A83386
$$ plain form
8921 481072 758987 2278540 8974094 2926886 1020509 81706 213099 113496 -18932 200134
8910 105174 57530 -78604 -22909 32963 28315 5989 -117304 -63415 -332257 -379785 -52174 -93809
8898 -93809 -16492 358610 236210 -2564 -303669 218623 411473 73834 -261534 -19211 -95460
8887 -95460 -83473 -241833 -376210 -1019 34160 -163371 66865 -203776 224942 -134186 -16410
8875 3102 -188424 272496 76078 -205835 46376 -190861 -98439 -484686 360853 70943 2396
$$ packed form
8921D81072K77915J519553O695554B926886A020509H1706J31393r9603a8932B00134
8910A05174m7644g8604b2909C2963m648E989a17304N3889k68842m7528e2174m1635
8898i3809a6492C58610j22400b564l01105B18623J92850G3834b61534a9211p6249
8887i5460J1987j58360j34377a019C4160a63371F6865b03776B24942a34186a6410
8875C102a88424B72496G6078b05835D6376a90861R2422l86247C60853G0943B396
$$ [...]
##END NTUPLES=NMR SPECTRUM
##END=
