
##TITLE=AC1335_MEXAH11120_6616011_TtothWJspJ
##JCAMPDX= 6.0         $$ Bruker NMR JCAMP-DX V2.0
##DATA TYPE= NMR SPECTRUM
##DATA CLASS= NTUPLES
##ORIGIN= BRUKER
##OWNER= Administrator
$$ 1.72 TOPSPIN		Version 2.1
$$ 2012-08-03 01:28:26.093 -0500  Administrator@TOPSPIN
$$ Compression mode = diff/dup
##.OBSERVE FREQUENCY= 400.02188249412
##.OBSERVE NUCLEUS= ^1H
##.ACQUISITION MODE= SIMULTANEOUS (DQD)
##.ACQUISITION SCHEME= undefined
##.AVERAGES= 64
##.DIGITISER RES= 22
##SPECTROMETER/DATA SYSTEM= spect
##.PULSE SEQUENCE= noesygpps1d.comp
##.SOLVENT NAME= COFFEE_meoh
##.SHIFT REFERENCE= INTERNAL, COFFEE_meoh, 1, 14.96252
##AUDIT TRAIL= $$ (NUMBER, WHEN, WHO, WHERE, PROCESS, VERSION, WHAT)
$$ ##TITLE= Audit trail, TOPSPIN		Version 2.1
$$ ##JCAMPDX= 5.01
$$ ##ORIGIN= Bruker BioSpin GmbH
$$ ##OWNER= Administrator
$$ $$ C:\Bruker\TOPSPIN/data/COFFEE/nmr/AC1335_MEXAH11120_6616011_TtothWJspJ/12/pdata/1/auditp.txt
$$ ##AUDIT TRAIL=  $$ (NUMBER, WHEN, WHO, WHERE, PROCESS, VERSION, WHAT)
(   1,<2012-08-03 01:28:21.390 -0500>,<Administrator>,<TOPSPIN>,<go>,<TOPSPIN 2.1>,
      <created by zg
	started at 2012-08-03 01:16:51.281 -0500,
	POWCHK enabled, PULCHK disabled,
       configuration hash MD5:
       6B 1B 68 BB D9 2E 58 E2 7F 35 AD 54 07 DF 0E 41
       data hash MD5: 64K
       7F 1C 20 AF 71 7A DF C5 36 D5 59 31 FC 79 99 E5>)
(   2,<2012-08-03 01:28:24.250 -0500>,<Administrator>,<TOPSPIN>,<proc1d>,<TOPSPIN 2.1>,
      <Start of raw data processing
       efp LB = 0.3 FT_mod = 6 PKNL = 1 PHC0 = 0 PHC1 = 0 SI = 128K 
       data hash MD5: 128K
       A4 DA E6 99 1D 9E B4 8D 70 7D 6F 5F 5F 93 C4 5A>)
(   3,<2012-08-03 01:28:25.312 -0500>,<Administrator>,<TOPSPIN>,<proc1d>,<TOPSPIN 2.1>,
      <pk PHC0 = 0.2966309 PHC1 = 0 
       data hash MD5: 128K
       A0 59 C9 51 E1 FC 38 68 DD 94 B8 FE A9 3D 71 36>)
(   4,<2012-08-03 01:28:25.562 -0500>,<Administrator>,<TOPSPIN>,<proc1d>,<TOPSPIN 2.1>,
      <abs ABSG = 1 
       data hash MD5: 128K
       89 1A BF C7 B7 BB 0B A1 52 22 F1 66 BA 27 46 0A>)
(   5,<2012-08-03 01:28:25.640 -0500>,<Administrator>,<TOPSPIN>,<proc1d>,<TOPSPIN 2.1>,
      <abs ABSG = 2 
       data hash MD5: 128K
       EC 57 C9 39 81 86 AC 8A C7 90 B5 19 CD 5B 1C C8>)
(   6,<2012-08-03 01:28:25.796 -0500>,<Administrator>,<TOPSPIN>,<proc1d>,<TOPSPIN 2.1>,
      <abs ABSG = 3 
       data hash MD5: 128K
       DE 5D 54 96 53 BB 41 63 ED B6 DF 75 E5 7D DC A9>)
(   7,<2012-08-03 01:28:25.937 -0500>,<Administrator>,<TOPSPIN>,<proc1d>,<TOPSPIN 2.1>,
      <abs ABSG = 4 
       data hash MD5: 128K
       28 BE 6F AC C0 F0 44 AB 47 CE F8 45 59 26 60 8D>)
(   8,<2012-08-03 01:28:26.000 -0500>,<Administrator>,<TOPSPIN>,<proc1d>,<TOPSPIN 2.1>,
      <abs ABSG = 5 
       data hash MD5: 128K
       E3 01 19 D4 7B 12 3F 3B 72 A8 3D 01 D5 2C E8 7E>)
$$ ##END=
$$ 
$$ $$ hash MD5
$$ $$ 9A 33 01 A7 F1 69 5D 02 94 A0 F8 7E 7C C2 5D AF
##$RELAX= 
##$RELAX= 
##$RELAX= 
##$RELAX= 
##$RELAX= 
##$RELAX= 
##$RELAX= 
##$RELAX= 
$$ Bruker specific parameters
$$ [...]
##$TP07= 0
##$TPNAME0= <>
##$TPNAME1= <>
##$TPNAME2= <>
##$TPNAME3= <>
##$TPNAME4= <>
##$TPNAME5= <>
##$TPNAME6= <>
##$TPNAME7= <>
##$TPOAL= (0..7)
0.5 0.5 0.5 0.5 0.5 0.5 0.5 0.5
##$TPOFFS= (0..7)
0 0 0 0 0 0 0 0
##$TUNHIN= 0
##$TUNHOUT= 0
##$TUNXOUT= 0
##$USERA1= <user>
##$USERA2= <user>
##$USERA3= <user>
##$USERA4= <user>
##$USERA5= <user>
##$V9= 5
##$VALIST= <valist>
##$VCLIST= <CCCCCCCCCCCCCCC>
##$VD= 0
##$VDLIST= <DDDDDDDDDDDDDDD>
##$VPLIST= <PPPPPPPPPPPPPPP>
##$VTLIST= <TTTTTTTTTTTTTTT>
##$WBST= 1024
##$WBSW= 4
##$XGAIN= (0..3)
0 0 0 0
##$XL= 0
##$YL= 0
##$YMAX_a= 16402102
##$YMIN_a= -9450534
##$ZGOPTNS= <>
##$ZL1= 120
##$ZL2= 120
##$ZL3= 120
##$ZL4= 120
##$ABSF1= 14.96252
##$ABSF2= -5.595662
##$ABSG= 5
##$ABSL= 3
##$ALPHA= 0
##$AQORDER= 0
##$ASSFAC= 0
##$ASSFACI= 0
##$ASSFACX= 0
##$ASSWID= 0
##$AUNMP= <proc_prof1d_extract.lims>
##$AXLEFT= 0
##$AXNAME= <>
##$AXNUC= <1H>
##$AXRIGHT= 0
##$AXTYPE= 0
##$AXUNIT= <>
##$AZFE= 0.1
##$AZFW= 0.1
##$BCFW= 0
##$BC_mod= 0
##$BYTORDP= 0
##$COROFFS= 0
##$CY= 15
##$DATMOD= 1
##$DC= 0
##$DFILT= <>
##$DTYPP= 0
##$F1P= 0
##$F2P= 0
##$FCOR= 0.5
##$FTSIZE= 131072
##$FT_mod= 6
##$GAMMA= 0
##$GB= 0
##$INTBC= 1
##$INTSCL= 1
##$ISEN= 128
##$LB= 0.3
##$LEV0= 0
##$LPBIN= 0
##$MAXI= 10000
##$MC2= 0
##$MEAN= 0
##$ME_mod= 0
##$MI= 0
##$NCOEF= 0
##$NC_proc= -2
##$NLEV= 6
##$NOISF1= 0
##$NOISF2= 0
##$NSP= 0
##$NTH_PI= 0
##$NZP= 0
##$OFFSET= 14.96252
##$PC= 1
##$PHC0= 0.2966309
##$PHC1= 0
##$PH_mod= 1
##$PKNL= yes
##$PPARMOD= 0
##$PPDIAG= 0
##$PPIPTYP= 0
##$PPMPNUM= 2147483647
##$PPRESOL= 1
##$PSCAL= 4
##$PSIGN= 0
##$PYNMP= <proc.py>
##$REVERSE= no
##$SF= 400.020009027453
##$SI= 131072
##$SIGF1= 0
##$SIGF2= 0
##$SINO= 400
##$SIOLD= 131072
##$SPECTYP= <>
##$SREGLST= <1H.CDCl3>
##$SSB= 0
##$STSI= 131072
##$STSR= 0
##$SW_p= 8223.68421052631
##$SYMM= 0
##$S_DEV= 0
##$TDeff= 65536
##$TDoff= 0
##$TI= <>
##$TILT= no
##$TM1= 0
##$TM2= 0
##$TOPLEV= 0
##$USERP1= <user>
##$USERP2= <user>
##$USERP3= <user>
##$USERP4= <user>
##$USERP5= <user>
##$WDW= 1
##$XDIM= 131072
##$YMAX_p= 457895314
##$YMIN_p= -15943
##$CURPLOT= <Network HP LaserJet P1505>
##$CURPRIN= <$Network HP LaserJet P1505>
##$DFORMAT= <normdp>
##$LAYOUT= <+/1D_H.xwp>
##$LFORMAT= <normlp>
##$PFORMAT= <normpl>
##$SURQMSG= 1
$$ End of Bruker specific parameters
$$ ---------------------------------
##NTUPLES= NMR SPECTRUM
##VAR_NAME=  FREQUENCY,     SPECTRUM/REAL,   SPECTRUM/IMAG
##SYMBOL=    X,             R,               I
##VAR_TYPE=  INDEPENDENT,   DEPENDENT,       DEPENDENT
##VAR_FORM=  AFFN,          ASDF,            ASDF
##VAR_DIM=   131072,        131072,          131072
##UNITS=     HZ,            ARBITRARY UNITS, ARBITRARY UNITS
##FACTOR=    0.0627417313425164, 1,          1
##FIRST=     8223.62146879497, -178,         -53456
##LAST=      0,             1604,            -53504
##MIN=       0,             -15943,          0
##MAX=       8223.62146879497, 457895314,    0
$$ Real data points
##PAGE= N=1
##DATA TABLE= (X++(R..R)), XYDATA
$$ [...]
63210A243252K7664K5711K2299J7328J1421M835k995j2281k2002l0819l8160m3831
63198A202422m7386m8758m8871m8594m7461m4461l9833l5098l1255k7809k3834
63187G59062j9321j5056j1531q456n378k412j5J938M275P385J0368J2042J2463
63174G45364J2698J3302J3867J4048J4159J4492J4918J5285J5533J5274J4104
63163I03044J2483J1345J0606R080O189K742l87l386o724j0173j3345j6335j9168
63150H85971k1249k2069k1873k1159k0095j8867j7848j6955j5543j3505j1687
63139F85121j0686j0037r142q203p463o459m836l293k780l232l820l952l380j950
63125F05888oJ474J943K036K626L633M457M983N414N606N436N394O004O931P394
$$ y = [1243252, 1270916, 1296627, 1318926, 1336254, 1347675, 1352510, 1349515, 1337234, 1315232, 1284413, 1246253, 1202422, 1155036, 1106278, 1057407, 1008813, 961352, 916891, 877058, 841960, 810705, 782896, 759062, 739741, 724685, 713154, 704698, 699320, 696908, 696893, 698831, 703106, 710491, 720859, 732901, 745364, 758062, 771364, 785231, 799279, 813438, 827930, 842848, 858133, 873666, 888940, 903044, 915527, 926872, 937478, 946558, 952747, 955489, 955102, 951716, 944992, 934819, 921474, 905139, 885971, 864722, 842653, 820780, 799621, 779526, 760659, 742811, 725856, 710313, 696808, 685121, 674435, 664398, 655256, 647053, 639590, 633131, 628295, 625002, 622222, 618990, 615170, 611218, 607838, 605888, 605882, 607356, 609299, 611335, 613961, 617594, 622051, 627034, 632448, 638054, 643490, 648884, 654888, 661819, 669213]
63110F69213P249P006P056P388P811Q019P776P398P540Q158Q350P616O623O089
63096G73292N664M689L359K334J659R75L83K73N34O09J85n93j339j525q48K01
63080G89852O64L66J89P53J699K632L858N518O978P865Q803J0268J1570J1948
63066H62963J1937J2577J4008J5758J7866K0545K3276K5323K6860K8667L1136
63055A090916L4270L8173M2571M6510M9478N2275N5832N9717O2903O5421O8024
63044A666090P0545P1902P1644P0443O9020O7484O5672O3488O1029N8914N8023
63033B394254N8419N9004N8891N8479N8379N7976N5945N1581M4741L5154K2858
63022B955681Q689o628k3252m0997n8150p2807q4737r4580j01870j05419j05276
$$ y = [669213, 676462, 683468, 690524, 697912, 705723, 713742, 721518, 728916, 736456, 744614, 752964, 760580, 767203, 773292, 778956, 783645, 787004, 789338, 790997, 791972, 792355, 792628, 793162, 793771, 793956, 793363, 792024, 790499, 789651, 789852, 790516, 790882, 791071, 791824, 793523, 796155, 800013, 805531, 812509, 820374, 829177, 839445, 851015, 862963, 874900, 887477, 901485, 917243, 935109, 955654, 978930, 1004253, 1031113, 1059780, 1090916, 1125186, 1163359, 1205930, 1252440, 1301918, 1354193, 1410025, 1469742, 1532645, 1598066, 1666090, 1736635, 1808537, 1880181, 1950624, 2019644, 2087128, 2152800, 2216288, 2277317, 2336231, 2394254, 2452673, 2511677, 2570568, 2629047, 2687426, 2745402, 2801347, 2852928, 2897669, 2932823, 2955681, 2964370, 2957742, 2934490, 2893493, 2835343, 2762536, 2677799, 2583219, 2481349, 2375930, 2270654]
63011B270654j02682r8257r1801q3799p5580o7750n9760n1222m2613l4467k6899
63000A535824j9911j3381o778J12O405J0941J3792J5975J7986J9636K0976K2219
62988A623796K2993K2804K2046K1393K0494J8516J5701J3070J0665P480L084k016
62976A800026p505j3541j9953k6398l3074l9988m5815m9138n0645n2338n4468
62965A407163n5196n3598n1067m9015m6962m3882m0017l6274l2869k9585k6504
62954I42194k3644k0571j7127j3940j1616r993q621p405o382n475m801m643m940
62941H03036n333n755o300o510n748m340l413l411l662l588l438l554l823m102
62927G40059m403m458l972l394l587m534n316n436n270n049m482l661l318l753
$$ y = [2270654, 2167972, 2069715, 1977914, 1894115, 1818535, 1750785, 1691025, 1639803, 1597190, 1562723, 1535824, 1515913, 1502532, 1495754, 1495866, 1502271, 1513212, 1527004, 1542979, 1560965, 1580601, 1601577, 1623796, 1646789, 1669593, 1691639, 1713032, 1733526, 1752042, 1767743, 1780813, 1791478, 1798958, 1802042, 1800026, 1792521, 1778980, 1759027, 1732629, 1699555, 1659567, 1613752, 1564614, 1513969, 1461631, 1407163, 1351967, 1298369, 1247302, 1198287, 1151325, 1107443, 1067426, 1031152, 998283, 968698, 942194, 918550, 897979, 880852, 866912, 855296, 845303, 836682, 829277, 822895, 817420, 812619, 807976, 803036, 797703, 791948, 785648, 779138, 773390, 769050, 765637, 762226, 758564, 754976, 751538, 747984, 744161, 740059, 735656, 731198, 727226, 723832, 720245, 715711, 710395, 704959, 699689, 694640, 690158, 686497, 683179, 679426]
62913F79426m391m711m799m757m412l901l736m026m356m511m578m320l376k161
62899F21391j558j657j692j360j141j297j587k012k769l472l549l433m051n108
62885E86705n238m088k897k639k931l121l133k889k165j419j433j906j739r78
62871E50129q28j407j281Q9J254J067L40K19M82O14J077K096K548J525J1n00r1
62854E57344J50M1J51L83J22n86j108j108n51O91K341L424L344K741K448K337
62838E72164J983J750K132K648K490J823J445J601J974K448L019L322L065K522
62824F04386J946J043k53j157r61j48L28L19K07l7n94j075r73n72n01p25o83j40
62806F00410Q09K147L571M258L851L286L792N309O723P329P369P396P881R176
$$ y = [679426, 675035, 670324, 665525, 660768, 656356, 652455, 648719, 644693, 640337, 635826, 631248, 626928, 623552, 621391, 619833, 618176, 616484, 615124, 613983, 612686, 611099, 609087, 606318, 602846, 599297, 595864, 591813, 586705, 581467, 577379, 574482, 571843, 568912, 565791, 562658, 559769, 557604, 556185, 554752, 552846, 551107, 550129, 549301, 547894, 546613, 546702, 547956, 549023, 549363, 549582, 550064, 550678, 551755, 553851, 556399, 557924, 557935, 557435, 557344, 557494, 557535, 557686, 558069, 558191, 557605, 556497, 555389, 554838, 555529, 557870, 561294, 564638, 567379, 569827, 572164, 574147, 575897, 578029, 580677, 583167, 584990, 586435, 588036, 590010, 592458, 595477, 598799, 601864, 604386, 606332, 607375, 607122, 605965, 605004, 604856, 605184, 605503, 605710, 605673, 605079, 604004, 603031, 602459, 601958, 601233, 600550, 600410, 601219, 603366, 606937, 611195, 615046, 618332, 622124, 627433, 634156, 641485, 648854, 656250, 664131, 673307]
62792F73307J1122J2995J4429J6011J8272K0563K1899K2574K3973K6897L0907
62781H92949L5305L9872M4549M9147N3716N8767O4904P2297Q0508Q8710R6207
62770A576931J02887J08932J14097J17656J19155J18662J16077J10750J01998
62761B587145Q9489P3102N3182L1207R277j1607l1947n2032p0680q6284r8369
62750B492483j07335j13431j16773j17842j17142j14768j10866j05998j00424
62741A487904r3629q5388p6809o9457o3734n8809n3853m8689m3490l8536l4141
62730H21369l0421k7268k4707k2907k1655k0334j8662j6903j5226j3515j1995
62719E97776j1174j0877j0272r132q110p381o198m287k491j362l33R86J913K086
$$ y = [673307, 684429, 697424, 711853, 727864, 746136, 766699, 788598, 811172, 835145, 862042, 892949, 928254, 968126, 1012675, 1061822, 1115538, 1174305, 1239209, 1311506, 1392014, 1480724, 1576931, 1679818, 1788750, 1902847, 2020503, 2139658, 2258320, 2374397, 2485147, 2587145, 2676634, 2749736, 2802918, 2834125, 2843402, 2831795, 2799848, 2747816, 2677136, 2590852, 2492483, 2385148, 2271717, 2154944, 2037102, 1919960, 1805192, 1694326, 1588328, 1487904, 1394275, 1308887, 1232078, 1162621, 1098887, 1040078, 986225, 937536, 894046, 855510, 821369, 790948, 763680, 738973, 716066, 694411, 674077, 655415, 638512, 623286, 609771, 597776, 586602, 575725, 565453, 556321, 548211, 540830, 534632, 530345, 527854, 526492, 526159, 527145, 529058, 531144]
62705E31144K440L759N395O663Q270J0951J3777J5501J6724J8960K2186K5163
62693F80933K7766L1085L5231L8899M1402M3546M6037M8320M9497M9445M8428
62682A140589M6344M2771L7358L0005K1056J1356J672p848j7245k6055l3562l9568
62670A206873m4430m8469n1654n3645n3896n2158m9204m6395m4208m1890l8944
62659F81980l5948l3376l0669k7353k4146k1873k0169j8283j6357j4799j3210
62648D25797j1173r402q737q649q113p366p333p753p474o352n361m930m556m066
62634C24532l909m147m314m292m312m193l603k889k550k150r71N14J142Q48O91
62619B90397J083J415J415J629K253K754K840K798K760K602K634L309M305M936
$$ y = [531144, 533584, 537343, 542738, 549401, 557671, 568622, 582399, 597900, 614624, 633584, 655770, 680933, 708699, 739784, 775015, 813914, 855316, 898862, 944899, 993219, 1042716, 1092161, 1140589, 1186933, 1229704, 1267062, 1297067, 1318123, 1329479, 1331151, 1323303, 1306058, 1280003, 1246441, 1206873, 1162443, 1113974, 1062320, 1008675, 954779, 902621, 853417, 807022, 762814, 720924, 681980, 646032, 612656, 581987, 554634, 530488, 508615, 488446, 470163, 453806, 439007, 425797, 414624, 405222, 396485, 387836, 379723, 372357, 365024, 357271, 349797, 343445, 338084, 333154, 328598, 324532, 320623, 316476, 312162, 307870, 303558, 299365, 295762, 292873, 290323, 288173, 287202, 287716, 288858, 289706, 290397, 291480, 292895, 294310, 295939, 298192, 300946, 303786, 306584, 309344, 311946, 314580, 317889, 322194, 327130]
62605C27130N456O731Q596R878J0236J0675J1966J3760J5622J7784K0357K2892
62593D81083K5234K7946L1429L5369L9427M3694M8115N2258N5951N9443O2559
62582I62508O4362O4021O1440N6869N0452M2399L3025K2518J1109n29j1621k1908
62570A334645l1337l9390m5430m9575n2429n4083n4248n3184n1577m9558m6745
62559H07089m3224l9556l5977l2421k9249k6904k5018k2906k0794j9469j8737
62548D92834j7542j5684j4157j3479j2931j1825j0471r442q771q269p841p202
62536C55220o059m734l841l295k506j591j306j684j777r97K82J627K955L926L985
62521C40205L456L491M583O042P248Q380R579J0481J1107J2165J3937J5789J7311
$$ y = [327130, 332586, 339317, 347913, 357791, 368027, 378702, 390668, 404428, 420050, 437834, 458191, 481083, 506317, 534263, 565692, 601061, 640488, 684182, 732297, 784555, 840506, 899949, 962508, 1026870, 1090891, 1152331, 1209200, 1259652, 1302051, 1335076, 1357594, 1368703, 1368174, 1356553, 1334645, 1303308, 1263918, 1218488, 1168913, 1116484, 1062401, 1008153, 954969, 903392, 853834, 807089, 763865, 724309, 688332, 655911, 626662, 599758, 574740, 551834, 531040, 511571, 492834, 475292, 459608, 445451, 431972, 419041, 407216, 396745, 387303, 378532, 370263, 362422, 355220, 349161, 344427, 340586, 337291, 334785, 333194, 331888, 330204, 328427, 327430, 327712, 329339, 332294, 336220, 340205, 343661, 347152, 351735, 357777, 365025, 373405, 382984, 393465, 404572, 416737, 430674, 446463, 463774]
62508D63774J9074K1645K4621K7244K9289L0816L1639L1629L0971K9728K7533
62497G67963K4077J9512J4215Q591L111j998p090j2466j7581k1601k4556k6998
62485G25179k8656k8677k7167k5327k3835k2293k0442j8751j7347j5631j3358
62474D83695j1069r022o884m837l797l887l892k944j623o85K16J559K711K817
62460D42358K296K453L842N828P485Q288Q201P661P376P817Q934J0310J1297J1267
62446E45413J0319R476R417R289P787N100K536L14k666o641j0276j2726j4815
62433E52527j7291j9280j9581j8396j6764j5147j3558j2294j1473j0518r003p393
62421C81829o167m958l329j765q98l61O95K358M039N383O393P009P264P527Q023
$$ y = [463774, 482848, 504493, 529114, 556358, 585647, 616463, 648102, 679731, 710702, 740430, 767963, 792040, 811552, 825767, 834358, 837469, 835471, 828381, 815915, 798334, 776733, 752177, 725179, 696523, 667846, 640679, 615352, 591517, 569224, 548782, 530031, 512684, 497053, 483695, 472626, 463604, 456720, 451883, 448086, 444199, 440307, 437363, 435740, 435055, 435271, 436830, 439541, 442358, 444654, 447107, 450949, 456777, 464262, 472550, 480751, 488412, 495788, 503605, 512539, 522849, 534146, 545413, 555732, 565208, 574625, 583914, 591701, 596801, 599337, 599651, 596985, 590344, 580068, 567342, 552527, 535236, 515956, 496375, 477979, 461215, 446068, 432510, 420216, 408743, 398225, 389222, 381829, 375662, 370704, 367375, 365610, 364712, 364351, 365046, 367404, 371443, 376826, 383219, 390228, 397492, 405019, 413042]
62406D13042Q446Q531Q501Q560Q495Q195P913P482O084L500R03m89r95j880l557
62391D82731n236o128o223n950n664n511n389n058m435l614k613j359K6J352K761
62376D29690M461O180P553R029J1465J4702J7591J9608K1545K4244K7601L1290
62364F24959L5325L9457M2884M5293M7344M9538N1402N2296N2155N0788M7408
62353A138849M1669L4438K6716J8470R341j32q824j6097k1894k6288k9520l2055
62341A134673l4022l5134l5543l6076l7043l7496l6360l3695l0338k6946k3971
62330G68049k1927k0828j9865j8364j6697j5665j5408j5390j5063j4132j2546
62319E82164j0632q865p295n725m337l490k858j861r52j270k705l697l487l208
$$ y = [413042, 421488, 430019, 438520, 447080, 455575, 463770, 471683, 479165, 485249, 488749, 489652, 489163, 488168, 486288, 482731, 477495, 471367, 465144, 459194, 453530, 448019, 442630, 437572, 433137, 429523, 426910, 425551, 425577, 426929, 429690, 434151, 440331, 447884, 456913, 468378, 483080, 500671, 520279, 541824, 566068, 593669, 624959, 660284, 699741, 742625, 787918, 835262, 884800, 936202, 988498, 1040653, 1091441, 1138849, 1180518, 1214956, 1241672, 1260142, 1269483, 1269351, 1260527, 1244430, 1222536, 1196248, 1166728, 1134673, 1100651, 1065517, 1029974, 993898, 956855, 919359, 882999, 849304, 818966, 792020, 768049, 746122, 725294, 705429, 687065, 670368, 654703, 639295, 623905, 608842, 594710, 582164, 571532, 562667, 555372, 549647, 545310, 541820, 538962, 537101, 536149, 534879, 532174, 528477, 524990, 521782]
62305E21782l954n078n474n381n765o692p443p585p010n563l461j534k98O56J738
62290D58938K625K999L219L582L828M042N013O898Q537Q964Q682Q587Q613Q421
62276E42948Q434R085R900J0362J0806J1528J1892J1484J1201J2078J3884J5902
62264F79504J8170K0818K3229K5194K7847L2084L6917M0887M4134M7376M9779
62253A045939M9700M7035M2945L7665L0452K1546J2369L690m824j3161k0538k6565
62241A226253l1525l5436l8065l9895m1776m3487m3798m2111l9058l5464l1760
62230H03878k8388k5692k3244k0234j6703j3505j1104r163p313n554l978k785
62218F36215k400k872l450l394k863k306j604o38J8M5L59J858L791M683M477M380
$$ y = [521782, 517828, 512750, 507276, 501895, 496130, 489438, 481995, 474410, 467400, 461837, 458376, 456842, 456544, 457200, 458938, 461563, 464562, 467781, 471363, 475191, 479233, 484246, 491144, 499681, 508645, 517327, 525914, 534527, 542948, 551382, 560467, 570367, 580729, 591535, 603063, 614955, 626439, 637640, 649718, 663602, 679504, 697674, 718492, 741721, 766915, 794762, 826846, 863763, 904650, 948784, 996160, 1045939, 1095639, 1142674, 1185619, 1223284, 1253736, 1275282, 1287651, 1291341, 1286517, 1273356, 1252818, 1226253, 1194728, 1159292, 1121227, 1081332, 1039556, 996069, 952271, 910160, 871102, 835638, 803878, 775490, 749798, 726554, 706320, 689617, 676112, 665008, 655845, 648532, 642978, 639000, 636215, 633815, 630943, 627493, 624099, 621236, 618930, 617326, 616688, 616706, 616751, 617110, 618968, 622759, 627442, 631919, 636299]
62202F36299M896N503O008O793P803Q581R287J0447J1787J2611J3193J4454J6358
62189G64020J7889J8631J9063J9343J9085J8422J7935J7426J6030J3675J1297
62178I52816R486Q136P441P967R498J1141J2755J5161J8660K2548K6357L0308
62166A132274L4306L7570L9649M0646M0195L7380L2188K5950J9818J3831P885
62155A461692K671j096l626n712p939j0587j3660j6682j8971k0336k1006k0898
62143A323850j9637j7397j4968j2816j0739q618o819n694n172m939m637m027l324
62130A205063l066l166k640r34J117K590M020O426R329J1233J1868J2467J3782
62117A268089J5318J6617J7947J9442K0736K1765K2885K4039K4799K5344K6331
$$ y = [636299, 641195, 646698, 652706, 659499, 667302, 675883, 685170, 695617, 707404, 720015, 733208, 747662, 764020, 781909, 800540, 819603, 838946, 858031, 876453, 894388, 911814, 927844, 941519, 952816, 962302, 970438, 977879, 985846, 995344, 1006485, 1019240, 1034401, 1053061, 1075609, 1101966, 1132274, 1166580, 1204150, 1243799, 1284445, 1324640, 1362020, 1394208, 1420158, 1439976, 1453807, 1461692, 1464363, 1463267, 1459641, 1453929, 1445990, 1435403, 1421743, 1405061, 1386090, 1365754, 1344748, 1323850, 1304213, 1286816, 1271848, 1259032, 1248293, 1239675, 1232856, 1227162, 1221990, 1217051, 1212414, 1208387, 1205063, 1201997, 1198831, 1196191, 1195257, 1196374, 1198964, 1202984, 1209410, 1218739, 1229972, 1241840, 1254307, 1268089, 1283407, 1300024, 1317971, 1337413, 1358149, 1379914, 1402799, 1426838, 1451637, 1476981, 1503312]
62106A503312K7721K8794K9398L0086L0949L1487L1783L2588L4026L5343L6162
62095A851649L6902L7805L8701L9850M1848M4480M6858M8864N1172N3699N5273
62084B347101N5215N3956N1840M8688M5066M2548M2034M2810M3850M4827M5280
62073B863215M4035M0500L5794L1805K9668K9606L1511L5003L9391M3943M7984
62062C272455N0758N1895N1827N1029M9080M5449M0961L7244L4810L2956L1393
62051C749857L0382K9318K6908K3214J9826J7550J5541J3249J1521J0907J0473
62040C958746R317P918O911N796L907J635l92k389m667o780q379j0094j2550j5236
62026C933743j7245j8487j9376j9952k0057j9874j9573j9044j8437j8237j8316
$$ y = [1503312, 1531033, 1559827, 1589225, 1619311, 1650260, 1681747, 1713530, 1746118, 1780144, 1815487, 1851649, 1888551, 1926356, 1965057, 2004907, 2046755, 2091235, 2138093, 2186957, 2238129, 2291828, 2347101, 2402316, 2456272, 2508112, 2556800, 2601866, 2644414, 2686448, 2729258, 2773108, 2817935, 2863215, 2907250, 2947750, 2983544, 3015349, 3045017, 3074623, 3106134, 3141137, 3180528, 3224471, 3272455, 3323213, 3375108, 3426935, 3477964, 3527044, 3572493, 3613454, 3650698, 3685508, 3718464, 3749857, 3780239, 3809557, 3836465, 3859679, 3879505, 3897055, 3912596, 3925845, 3937366, 3948273, 3958746, 3968063, 3975981, 3982892, 3988688, 3992595, 3994230, 3993838, 3991449, 3986782, 3980002, 3971623, 3961529, 3948979, 3933743, 3916498, 3898011, 3878635, 3858683, 3838626, 3818752, 3799179, 3780135, 3761698, 3743461, 3725145]
62015C725145j7729j5939j3441j0756p753m543j924k07J429L674O092Q118J0077
62002C682243J2380J4632J6395J8096K0182K2057K2670K1621J9100J5346J0805
61991C875527O074J174m388j0315j5262j8464k0721k3060k5428k7475k9521l1841
61979C676300l3918l5397l6895l8899m0713m1572m1961m2748m3683m3925m3454
61968C233135m2849m2159m1047l9716l8636l7695l6438l4885l3359l1842l0164
61957B824345k8466k6891k5287k3694k2522k1770k0788j9326j7943j6797j5127
61946B585734j2654j0438r311q523p097n447m343l297j549J43M74r1J89J694L097
61931B528581L752M723O978R946J2569J4730J6976J9598K2592K6148L0553L5906
$$ y = [3725145, 3707416, 3691477, 3678036, 3667280, 3659527, 3654984, 3653060, 3652853, 3654282, 3657956, 3664048, 3672166, 3682243, 3694623, 3709255, 3725650, 3743746, 3763928, 3785985, 3808655, 3830276, 3849376, 3864722, 3875527, 3881601, 3882775, 3878387, 3868072, 3852810, 3834346, 3813625, 3790565, 3765137, 3737662, 3708141, 3676300, 3642382, 3606985, 3570090, 3531191, 3490478, 3448906, 3406945, 3364197, 3320514, 3276589, 3233135, 3190286, 3148127, 3107080, 3067364, 3028728, 2991033, 2954595, 2919710, 2886351, 2854509, 2824345, 2795879, 2768988, 2743701, 2720007, 2697485, 2675715, 2654927, 2635601, 2617658, 2600861, 2585734, 2573080, 2562642, 2553331, 2544808, 2537711, 2532264, 2527921, 2524624, 2523075, 2523218, 2523692, 2523601, 2523790, 2525484, 2528581, 2532333, 2537056, 2544034, 2553980, 2566549, 2581279, 2598255, 2617853, 2640445, 2666593, 2697146, 2733052]
61919B733052M2113M9027N6621O5250P5604Q8114J02575J18669J36682J57350
61909C625057J81209K08444K39193K73713L12483L56360M06278M62432N24058
61900F589227N89993O58559P26045P85434Q26797Q38429Q07830P23828N81030
61891A3127172L84460J50764r5350l27602n24702o74315p73087q23985q33886
61882I609469q12314p69769p15094o54146n90879n28693m70164m16456l68030
61873D283924l25423k88659k56559k27679k01598j78677j58957j42001j27376
61864B376995j14572j02815r1665q1496p2800o5321n8463n2116m6527m1682l7334
61853A612204l3285k9239k4886k0563j7264j5463j4358j2822j0620q315o509n619
$$ y = [2733052, 2775165, 2824192, 2880813, 2946063, 3021667, 3109781, 3212356, 3331025, 3467707, 3625057, 3806266, 4014710, 4253903, 4527616, 4840099, 5196459, 5602737, 6065169, 6589227, 7179220, 7837779, 8563824, 9349258, 10176055, 11014484, 11822314, 12546142, 13127172, 13511632, 13662396, 13567046, 13239444, 12714742, 12040427, 11267340, 10443355, 9609469, 8797155, 8027386, 7312292, 6658146, 6067267, 5538574, 5068410, 4651954, 4283924, 3958501, 3669842, 3413283, 3185604, 2984006, 2805329, 2646372, 2504371, 2376995, 2262423, 2159608, 2067943, 1986447, 1913647, 1848326, 1789863, 1737747, 1691220, 1649538, 1612204, 1578919, 1549680, 1524794, 1504231, 1486967, 1471504, 1457146, 1444324, 1433704, 1425389, 1418880, 1413261]
61841A413261n817o654p197o917n932m359k236k42O43N97Q95J977K850L018L483
61826A387370M865N948N457M037L083K619J903J275J778L430N298O921Q423R748
61812A452155J1044J3147J6386J9536K1440K3026K6073L0438L4353L7326M0764
61801A725688M5505N0537N4719N8410O2651O7887P4060Q1084Q8634R6203J03865
61790B509243J12489J22764J34493J47161J60827J76293J94505K15946K40491
61781D014212K68057K99394L35780L77827M25298M78469N38841O07973O86350
61772H032201P74134Q71953R79727J094957J212728J326188J425059J493431J510131
61763A8720509J452424J301371J048233P01029K87309j50810n67678r25119j198968
$$ y = [1413261, 1407444, 1400790, 1393593, 1386676, 1380744, 1376385, 1374149, 1373907, 1374550, 1375147, 1376042, 1378019, 1380869, 1383887, 1387370, 1392235, 1398183, 1403640, 1407677, 1410760, 1413379, 1415282, 1416557, 1418335, 1421765, 1427063, 1433984, 1442407, 1452155, 1463199, 1476346, 1492732, 1512268, 1533708, 1556734, 1582807, 1613245, 1647598, 1684924, 1725688, 1771193, 1821730, 1876449, 1934859, 1997510, 2065397, 2139457, 2220541, 2309175, 2405378, 2509243, 2621732, 2744496, 2878989, 3026150, 3186977, 3363270, 3557775, 3773721, 4014212, 4282269, 4581663, 4917443, 5295270, 5720568, 6199037, 6737878, 7345851, 8032201, 8806335, 9678288, 10658015, 11752972, 12965700, 14291888, 15716947, 17210378, 18720509, 20172933, 21474304, 22522537, 23223566, 23510875, 23360065, 22792387, 21867268, 20668300]
61754B0668300j380705j475194j495828j459556j383674j283839j172239j057042
61746I960223r43961q37779p41647o55899n79253n11095m51701m00609l56218
61737D482061l16979k82057k50923k23321j99459j79284j61660j45187j29647
61728B593544j15733j03583r2660q2850p4521o7493o0992n4784m9489m5589m2826
61717A803024m0587l8281l5405l1896k8332k5334k2946k0984j9544j8610j7795
61706A503310j7017j6838j7405j7867j7657j7492j8143j9075j9450j9563k0040
61695A302763k0360j9765j8878j8802j9146j8653j7398j6570j6283j5442j3803
61684A107663j2450j2007j1885j1514j0902r817p838n455l846l269k858k157j538
$$ y = [20668300, 19287595, 17812401, 16316573, 14857017, 13473343, 12189504, 11017265, 9960223, 9016262, 8178483, 7436836, 6780937, 6201684, 5690589, 5238888, 4838279, 4482061, 4165082, 3883025, 3632102, 3408781, 3209322, 3030038, 2868378, 2723191, 2593544, 2477811, 2374228, 2281568, 2198718, 2124197, 2056704, 1995712, 1940928, 1891439, 1845850, 1803024, 1762437, 1724156, 1688751, 1656855, 1628523, 1603189, 1580243, 1559259, 1539715, 1521105, 1503310, 1486293, 1469455, 1452050, 1434183, 1416526, 1399034, 1380891, 1361816, 1342366, 1322803, 1302763, 1282403, 1262638, 1243760, 1224958, 1205812, 1187159, 1169761, 1153191, 1136908, 1121466, 1107663, 1095213, 1083206, 1071321, 1059807, 1048905, 1039088, 1031250, 1025795, 1021949, 1018680, 1015822, 1013665, 1012127]
61671A012127j033o8J229J808J156K9p04j016j277j710k479l489m128l977l661
61656I92807m094n076n744o065o590o977o300m905m381n378o776p389p217o668
61642I09247n742m534l511k776j906q23n3K08N45J600L491N888Q099R317R498
61627I28548R625J0305J0676R775Q265P452P184O352N034M280L991K940J009m67
61613A014969q44r97j696k725l988n841p927r187r469r752j0436j0923j1087j1566
61599I18531j2194j1815j0246q862q654r076r310r182q360o311l615j801j170
61586H17935l19J508L234L848L993M734O110P821J0000J2460J4478J6071J8153
61573I20026K0700K2333K2611K3167K5322K8103K9928L0919L2093L3394L4079
$$ y = [1012127, 1011094, 1011026, 1012255, 1014063, 1015219, 1015248, 1014544, 1013528, 1012251, 1010541, 1008062, 1004573, 1000445, 996468, 992807, 988713, 983637, 977893, 971828, 965238, 958261, 951961, 947056, 942675, 937297, 930521, 923132, 915915, 909247, 903505, 898971, 895460, 892684, 890778, 889955, 889902, 890110, 890655, 892255, 895746, 901634, 909733, 919050, 928548, 938173, 948478, 959154, 968929, 977194, 984646, 991830, 998182, 1003216, 1007496, 1011487, 1014427, 1015436, 1014969, 1014125, 1013128, 1011432, 1008707, 1004719, 998878, 990951, 981764, 972295, 962543, 952107, 941184, 930097, 918531, 906337, 894522, 884276, 875414, 866760, 857684, 848374, 839192, 830832, 824521, 820906, 819105, 817935, 817616, 819124, 822358, 826206, 830199, 834933, 841043, 848864, 858864, 871324, 885802, 901873, 920026, 940726, 963059, 985670, 1008837, 1034159, 1062262, 1092190, 1123109, 1155202, 1188596, 1222675]
61562A222675L4171L4095L3488L1735K9169K6619K4326K2207K0619J9739J8809
61551A517652J6985J4539J2313J0422Q377O045L664J172j734n175r106j3325j7136
61538A544693j9586k0501k0748k1020k0987k0065j8346j6326j4291j2363j0570
61527A349890q615o145l450j179P11K913N711Q894J2691J7576K3102K8306L3384
61514A463789L9617M7252N5091O2563P0617P9990R0208J01059J13415J27695J43038
61503B394334J59028J76643J96375K16809K36346K54805K71753K84278K88036
61494D478407K79913K58703K24352J78206J23437O4033L706n3609j03568j43247
61484E310333j72634j93182k05564k09967k07690k00870j90856j77995j62711
$$ y = [1222675, 1256846, 1290941, 1324429, 1356164, 1385333, 1411952, 1436278, 1458485, 1479104, 1498843, 1517652, 1534637, 1549176, 1561489, 1571911, 1580288, 1586333, 1589997, 1591169, 1589435, 1584260, 1575154, 1561829, 1544693, 1525107, 1504606, 1483858, 1462838, 1441851, 1421786, 1403440, 1387114, 1372823, 1360460, 1349890, 1341275, 1335130, 1331680, 1330501, 1331212, 1334125, 1339836, 1348730, 1361421, 1378997, 1402099, 1430405, 1463789, 1503406, 1550658, 1605749, 1668312, 1738929, 1818919, 1909127, 2010186, 2123601, 2251296, 2394334, 2553362, 2730005, 2926380, 3143189, 3379535, 3634340, 3906093, 4190371, 4478407, 4758320, 5017023, 5241375, 5419581, 5543018, 5607051, 5610757, 5557148, 5453580, 5310333, 5137699, 4944517, 4738953, 4528986, 4321296, 4120426, 3929570, 3751575, 3588864]
61475C588864j45839j28204j10671r4272p9444o5572n1903l8487k5698j3503j857
61464B833414Q842J8346K6939L4712M1216M6364N0763N4538N6818N7091N6086
61453C285129N4556N2250M8910M5304M2344M0052L8235L7240L7274L7961L9313
61442C758568M1969M5668M8716M9988N0159M9978M8720M5634M1482L7181L2105
61431D250168K5384J7665J0001K003p105j6525k4810l1951l8664m4348m7723m9037
61419D045058m9623m9551m7641m3716l9034l4388k9321k3444j7101j0642m249
61408C696348J346N223P408Q584Q733P143L790l87m689r167j3857j8369k2220
61395C669886k4816k5268k2886j7802j0455r11J0699K3619L7262N2163O9248Q8495
$$ y = [3588864, 3443025, 3314821, 3204150, 3109878, 3030434, 2964862, 2912959, 2874472, 2848774, 2835271, 2833414, 2842256, 2860602, 2887541, 2922253, 2963469, 3009833, 3060596, 3115134, 3171952, 3229043, 3285129, 3339685, 3391935, 3440845, 3486149, 3528493, 3568545, 3606780, 3644020, 3681294, 3719255, 3758568, 3800537, 3846205, 3894921, 3944909, 3995068, 4045046, 4093766, 4139400, 4180882, 4218063, 4250168, 4275552, 4293217, 4303218, 4305221, 4298116, 4281591, 4256781, 4224830, 4186166, 4141818, 4094095, 4045058, 3995435, 3945884, 3898243, 3854527, 3815493, 3781105, 3751784, 3728340, 3711239, 3700597, 3696348, 3697694, 3702917, 3710325, 3718909, 3727642, 3734785, 3738575, 3738188, 3733499, 3724332, 3710475, 3692106, 3669886, 3645070, 3619802, 3596916, 3579114, 3568659, 3567748, 3578447, 3602066, 3639328, 3691491, 3760739, 3849234]
61383C849234J09153J30770J53216J76166J99380K22978K46546K68467K86900
61374E642810L00671L08286L06962K93878K67950K29549J79649J20775N8038k641
61364G705927n7361j04669j44218j76690k04164k28468k49061k63990k72701k76421
61354E728184k76003k71218k62289k50591k37476k23575k09325j94989j80026
61345C622692j63672j46392j29730j14652j00856q7639p4515o1174m7832l5429
61335B660801k4571j4492m093O353J5670K3547L0566L6864M2117M6633N0987N4694
61323B925076N6629N6760N6104N4998N2837M9561M5929M2174L7781L2939K8829
61312C439617K6089K4170K2507K1143J9821J7593J3878R006L442k706r143j5282
$$ y = [3849234, 3958387, 4089157, 4242373, 4418539, 4617919, 4840897, 5087443, 5355910, 5642810, 5943481, 6251767, 6558729, 6852607, 7120557, 7350106, 7529755, 7650530, 7708568, 7705927, 7648566, 7543897, 7399679, 7222989, 7018825, 6790357, 6541296, 6277306, 6004605, 5728184, 5452181, 5180963, 4918674, 4668083, 4430607, 4207032, 3997707, 3802718, 3622692, 3459020, 3312628, 3182898, 3068246, 2967390, 2879751, 2805236, 2744062, 2696230, 2660801, 2636230, 2621738, 2617645, 2623998, 2639668, 2663215, 2693781, 2730645, 2772762, 2819395, 2870382, 2925076, 2981705, 3038465, 3094569, 3149567, 3202404, 3251965, 3297894, 3340068, 3377849, 3410788, 3439617, 3465706, 3489876, 3512383, 3533526, 3553347, 3570940, 3584818, 3593824, 3597266, 3594560, 3585417, 3570135]
61300C570135k1001k6711l2462l7778m2471m6778n0597n3440n5351n6995n8629
61289C087922n9734n9748n8449n5642n1300m6103m0951l5921l0479k4650j9081
61278B605864j3968r042m646j818r78j457k577m430p215j0531j3626j5865j6848
61265B502863j6577j5552j4251j2580j0242p461m655j665K135P208J3934K2814
61253B465971L3789M5741N7518O9183Q1410R4147J06775J19071J30760J40409
61243C344774J45924J46024J40042J26745J04740P4173L6927m675m8073q9523
61233C977078j24701j50954j68178j77398j79510j75631j67412j56448j43965
61224B532881j31169j19115j07914r6943q5994p5676o6609n8860n2198m6305m0800
$$ y = [3570135, 3549134, 3522423, 3489961, 3452183, 3409712, 3362934, 3312337, 3258897, 3203546, 3146551, 3087922, 3028188, 2968440, 2909991, 2854349, 2803049, 2756946, 2715995, 2680074, 2649595, 2624945, 2605864, 2591896, 2582854, 2578208, 2576390, 2575412, 2573955, 2571378, 2566948, 2559733, 2549202, 2535576, 2519711, 2502863, 2486286, 2470734, 2456483, 2443903, 2433661, 2426200, 2421545, 2419880, 2422015, 2429223, 2443157, 2465971, 2499760, 2545501, 2603019, 2672202, 2753612, 2847759, 2954534, 3073605, 3204365, 3344774, 3490698, 3636722, 3776764, 3903509, 4008249, 4082422, 4119349, 4114674, 4066601, 3977078, 3852377, 3701423, 3533245, 3355847, 3176337, 3000706, 2833294, 2676846, 2532881, 2401712, 2282597, 2174683, 2077740, 1991746, 1916070, 1849461, 1790601, 1738403, 1692098, 1651298]
61213A651298l5586l0958k6878k2620j7809j3243r694o539k638J878N979R435
61201A502625J2785J5912J8101J9401K0463K1077K0266J7899J4867J1629P897
61190A682922L869M06k254m673o931q469r437j0801j2822j4640j5773j6698j7590
61177A567109j7785j7149j6723j7232j8005j8102j7755j7864j8737k0056k1608
61166A366093k3372k5142k6568k7537k8275k9118l0131l0800l0387k8806k6810
61155A059147k4946k2883k0324j7949j6660j6431j6756j7731j9574k1577k2608
61144H41708k2453k1651k0281j8004j5135j2565j0682r252q090p012n426l016
61132F88141n31J043J814K518L226L583L910M773N900O707P526R002J0717J1736
$$ y = [1651298, 1615712, 1584754, 1557876, 1535256, 1517447, 1504204, 1494510, 1487971, 1485333, 1487211, 1493190, 1502625, 1515410, 1531322, 1549423, 1568824, 1589287, 1610364, 1630630, 1648529, 1663396, 1675025, 1682922, 1686791, 1687197, 1684943, 1680270, 1673339, 1664870, 1655433, 1644632, 1631810, 1617170, 1601397, 1584699, 1567109, 1549324, 1532175, 1515452, 1498220, 1480215, 1462113, 1444358, 1426494, 1407757, 1387701, 1366093, 1342721, 1317579, 1291011, 1263474, 1235199, 1206081, 1175950, 1145150, 1114763, 1085957, 1059147, 1034201, 1011318, 990994, 973045, 956385, 939954, 923198, 905467, 885893, 864316, 841708, 819255, 797604, 777323, 759319, 744184, 731619, 720937, 711685, 703595, 696583, 691157, 688141, 687610, 688653, 690467, 692985, 696211, 699794, 703704, 708477, 714377, 721084, 728610, 737612, 748329, 760065]
61118G60065J2173J2788J3396J3261J2813J3340J4954J6407J6984J7224J7661
61107I21066J8117J8256J7691J5652J1787P157L229J95k538m694n577n807o799
61094I87735q561r713r706r416r477r629r792j0204j0357r438p880p107p519q271
61080H60665q854r438r579q493o749o033o817p820q007p605o870n482l671k505
61066G62742k525l148l803m475m976m846m201l685l541l667m303n511o272n523
61052G02266l814k579k097j600j004q88r95m29Q29K073L324N015O644P385P699
61037G21829Q633R930J0581J0711J1087J1256J0283Q879Q661R601J0256J0209
61025H41916J0207J0261R893R752J0771J2086J2200J1737J2559J4528J5812J6139
$$ y = [760065, 772238, 785026, 798422, 811683, 824496, 837836, 852790, 869197, 886181, 903405, 921066, 939183, 957439, 975130, 990782, 1002569, 1009726, 1012955, 1013150, 1010612, 1005918, 1000341, 994534, 987735, 979174, 969461, 959755, 950339, 940862, 931233, 921441, 911237, 900880, 891442, 883562, 876455, 868936, 860665, 851811, 842373, 832794, 824301, 817552, 811519, 804702, 796882, 788875, 781270, 774400, 768918, 765247, 762742, 760217, 757069, 753266, 748791, 743815, 738969, 734768, 731083, 727542, 723875, 719572, 714061, 707789, 702266, 698452, 695873, 693776, 692176, 691172, 690284, 689289, 688860, 689689, 691762, 695086, 700101, 706745, 714130, 721829, 730462, 740392, 750973, 761684, 772771, 784027, 794310, 803189, 811850, 821451, 831707, 841916, 852123, 862384, 872277, 882029, 892800, 904886, 917086, 928823, 941382, 955910, 971722, 987861]
61013I87861J7038J8975K0820K2089K3280K4257K4727K5772K8389L1176L2365
61002A256749L3250L6395M1326M5559M9166N4400O1066O6401O9420P1657P3847
60991A859236P5863P9639Q7823R9610J12108J25360J41459J59288J75424J90111
60981C105921K07134K28405K54641K90392L41152M05812M80045N67098O76332
60972F556932Q11904R74987J178232J443216J779147K177466K623234L071040
60964B0616158L381381L322341K720559J656533M83179l95315p78030p13594l50917
60955B9942295J77876P13330R96923P63224m3006j168156k207687k873335l118238
60946B3183226l054497k811943k479896k121686j784370j488717j233555j015971
$$ y = [987861, 1004899, 1023874, 1044694, 1066783, 1090063, 1114320, 1139047, 1164819, 1193208, 1224384, 1256749, 1289999, 1326394, 1367720, 1413279, 1462445, 1516845, 1577911, 1644312, 1713732, 1785389, 1859236, 1935099, 2014738, 2102561, 2202171, 2314279, 2439639, 2581098, 2740386, 2915810, 3105921, 3313055, 3541460, 3796101, 4086493, 4427645, 4833457, 5313502, 5880600, 6556932, 7368836, 8343823, 9522055, 10965271, 12744418, 14921884, 17545118, 20616158, 23997539, 27319880, 30040439, 31696972, 32180151, 31784836, 31006806, 30293212, 29942295, 30120171, 30833501, 31830424, 32593648, 32550642, 31382486, 29174799, 26301464, 23183226, 20128729, 17316786, 14836890, 12715204, 10930834, 9442117, 8208562, 7192591]
60938G192591q37534o94441n76553m78362m01110l43384k98599k62585k35323
60929C064700k14419j94650j75039j59143j47181j34597j19561j05240r3337q1794
60919A639739p0569o3379o1524o1321n9868n8293n7458n5320n0840m6058m2174
60908A012935l7675l2118k7833k5868k4074k1018j8173j6557j4808j2274j0537
60897G72000j0156r217o804m694l976l147j135Q28J848K901M353M885M308M453
60883G56447N893O766O212N932O814P107N650L997L528L108J471n86k105l728
60869H06506n877p404p730q225r903j1668j2246j2003j1614j0810r554q627q058
60856F82787o810m754l130k374j595n35K08J189L690O891Q366Q051Q654J1319
$$ y = [7192591, 6355057, 5660616, 5084063, 4605701, 4204591, 3861207, 3562608, 3300023, 3064700, 2850281, 2655631, 2480592, 2321449, 2174268, 2039671, 1920110, 1814870, 1721533, 1639739, 1569170, 1505791, 1444267, 1382946, 1323078, 1264785, 1207327, 1152007, 1101167, 1055109, 1012935, 975260, 943142, 915309, 889441, 865367, 844349, 826176, 809619, 794811, 782537, 772000, 761844, 752627, 745823, 741129, 737153, 734006, 732871, 733699, 735547, 738448, 742801, 747686, 751994, 756447, 762340, 769106, 775318, 781250, 788064, 795171, 800821, 804818, 808346, 811454, 812925, 812339, 810234, 806506, 800629, 793225, 785495, 777270, 767367, 755699, 743453, 731450, 719836, 709026, 699472, 690845, 682787, 675977, 671223, 668093, 665719, 664124, 663589, 663797, 664986, 668676, 675567, 683933, 691984, 700638, 711957]
60842G11957J4019J5268J6210J7618J8087J7007J6329J7365J8448J7740J5957
60831H96005J4389J2635J0265Q499Q235Q425Q160Q338R450R779P832M743K415
60818A009170R71k96j171j458k047l368m329m284m447n991q325j0563j2909j5275
60804I35678j6428j6057j5804j6779j7822j7673j6934j6372j5297j3286j1605
60793G61621j1047j0203p779m909l257k402j134K17Q13J387L207N868Q015R389
60779G49786J0539J1435J1871J2402J3495J4557J4928J4956J5044J4788J4030
60768H97831J3470J3260J2307J0062P668O260N519M887M676M912M730M096M411
60755I94089O168P656P396O229N567N241M597M136M370M517L909L398L775M104
$$ y = [711957, 725976, 741244, 757454, 775072, 793159, 810166, 826495, 843860, 862308, 880048, 896005, 910394, 923029, 933294, 941793, 950028, 958453, 966613, 974951, 984401, 994180, 1002012, 1006755, 1009170, 1010141, 1009845, 1008674, 1007216, 1005169, 1001801, 997472, 993188, 988741, 982750, 974425, 963862, 950953, 935678, 919250, 903193, 887389, 870610, 852788, 835115, 818181, 801809, 786512, 773226, 761621, 750574, 740371, 732592, 727683, 724426, 722024, 720890, 721107, 721920, 723307, 726514, 732382, 740397, 749786, 760325, 771760, 783631, 796033, 809528, 824085, 839013, 853969, 869013, 883801, 897831, 911301, 924561, 936868, 946930, 954598, 960858, 966377, 971264, 975940, 980852, 985582, 989678, 994089, 1000257, 1007913, 1015309, 1021538, 1027105, 1032346, 1036943, 1041079, 1045449, 1049966, 1053875, 1057273, 1061048, 1065152]
60741A065152L217J559J19j277l082m742n724o666q088r223r495r821j1102j2649
60727I88178j3450j3702j3734j2899j0910q960p969p045n123k835j312m83N5j02
60713H89709j065j829j962k613m385n884n973n802o722p785p328n668m224l117
60699H25352j661j28Q52J734L118M409M999N667P082Q120P421N406L078R4m002
60684H71541p950j0297j1753j3945j6666j8448j9023j9195j8964j7773j5984j4345
60672F87198j2601j0272q079o845n849l989j849p32m13L23J426J759J075J44o87
60657F40609j598k339k533k369j950p68J029J980J340N76J286K805L580L728M231
60642F49607M675L888K233J216J306J854K577L499M077M043M408O101Q319R871
$$ y = [1065152, 1068369, 1069928, 1070047, 1068770, 1065688, 1060946, 1055222, 1048556, 1040468, 1031245, 1021750, 1011929, 1000827, 988178, 974728, 961026, 947292, 934393, 923483, 914523, 906554, 899509, 894386, 891551, 890239, 889756, 889811, 889709, 888644, 886815, 884853, 882240, 877855, 871971, 865998, 860196, 853474, 845689, 838361, 832693, 828469, 825352, 823691, 823563, 824415, 826149, 829267, 833676, 838675, 844342, 851424, 859544, 866965, 872371, 875449, 875543, 871541, 863591, 853294, 841541, 827596, 810930, 792482, 773459, 754264, 735300, 717527, 701543, 687198, 674597, 664325, 656246, 649401, 643552, 639563, 637714, 636982, 636569, 636892, 638318, 640077, 641152, 641296, 640609, 639011, 636672, 634139, 631770, 629820, 629052, 630081, 632061, 633401, 633977, 635263, 638068, 641648, 645376, 649607, 654282, 658170, 660403, 661619, 662925, 664779, 667356, 670855, 674932, 678975, 683383, 689484, 697803, 707674]
60628G07674J1191J3278J5592J6896J7429J8389J9917K1344K2679K4028K4468
60617I12885K3304K1619K0615J9377J6387J2364R246P022M039J4l634o263q518
60604A028457j0428j1210j1038j1031j1374j1252j0685j0712j1701j2977j4079
60593I01970j4900j4912j3729j2207j1393j0719q854n978l552k099r46J07M79
60580H03267R2n85j549k917l966l929l365l216l111k168q50k34J13J605M256O627
60564G90070P900Q404Q293P447O436O001N752M829L461K444J581K34j130j624
60550H50098j561j723j626l66J468K615L402N131P693R792J1254J3136J5838J9003
60536I34154K2915K8073L3688L8467M2357M5489M6080M1783L2882K1843J0013
$$ y = [707674, 718865, 732143, 747735, 764631, 782060, 800449, 820366, 841710, 864389, 888417, 912885, 936189, 957808, 978423, 997800, 1014187, 1026551, 1035797, 1042819, 1046858, 1046872, 1043238, 1036975, 1028457, 1018029, 1006819, 995781, 984750, 973376, 962124, 951439, 940727, 929026, 916049, 901970, 887070, 872158, 858429, 846222, 834829, 824110, 815256, 809278, 805726, 803627, 802681, 802788, 803267, 803359, 802774, 801225, 798308, 794342, 790413, 787048, 783832, 780721, 778553, 777703, 777469, 777582, 779187, 783443, 790070, 797970, 806374, 814667, 822114, 828550, 834551, 840303, 845132, 848593, 851037, 852618, 852852, 851722, 850098, 848537, 846814, 845188, 844822, 846290, 848905, 852307, 857438, 865131, 874923, 886177, 899313, 915151, 934154, 957069, 985142, 1018830, 1057297, 1099654, 1145143, 1191223, 1233006, 1265888, 1287731, 1297744]
60525A297744k860j5982k7034l4632l9025m0255l7882l2837k7186k1729j5693
60514A002629r120l339J174N311R219J1733J2394J2145J1580J0389Q954Q673J0061
60501A091803J2278J4879J8458K3201K8524L4474M1869N0763O0452P1114Q3627
60490A531442R7545J11178J24049J37423J52054J67405J83629K02401K25008K50963
60480C183097K78644L05046L23923L26086L03474K53031J77147Q2154k3028j28139
60470E081435k23021k98506l47756l68864l66243l47745l20065k87559k53942
60461B267734k22351j93644j66949j42350j21199j03832q9044p6136o5529n7079
60451A029621m9742m3199l8011l3933l0024k6489k4376k3260k1428j8631j6377
$$ y = [1297744, 1294884, 1278902, 1251868, 1217236, 1178211, 1137956, 1100074, 1067237, 1040051, 1018322, 1002629, 993509, 990170, 991344, 996655, 1005874, 1017607, 1030001, 1042146, 1053726, 1064115, 1073069, 1081742, 1091803, 1104081, 1118960, 1137418, 1160619, 1189143, 1223617, 1265486, 1316249, 1376701, 1447815, 1531442, 1628987, 1740165, 1864214, 2001637, 2153691, 2321096, 2504725, 2707126, 2932134, 3183097, 3461741, 3766787, 4090710, 4416796, 4720270, 4973301, 5150448, 5232602, 5209574, 5081435, 4858414, 4559908, 4212152, 3843288, 3477045, 3129300, 2809235, 2521676, 2267734, 2045383, 1851739, 1684790, 1542440, 1421241, 1317409, 1228365, 1152229, 1086700, 1029621, 979879, 936680, 898669, 864736, 834712, 808223, 783847, 760587, 739159, 720528, 704151]
60440G04151j5171j3805j1923j0806j0871j0755r756q973q954q456o717m971m400
60427E78593m332l709k790k113j353l44J07m04q73k98J052K481L814M827M946
60412E79604M247L629L451L156K612K473K859L104L144L669M622N108N111N581
60398F32370O531O858O452O579P622Q422Q478Q737R462R328P592N325L508J715
60384G28979m25k182l185m183n414n912n362m882m975m545l096k018k369l053
60370F77378k655j574q62l26O78J728K056J972K248K809L042K767K180J587J594
60355F94622K663M118M669M242M007M456M999N633P133R120R990R465R179R954
60341G84250J0463R676Q565Q133P635O244M763M135L666K353P72K31R95K514M401
$$ y = [704151, 688980, 675175, 663252, 652446, 641575, 630820, 621064, 612091, 603137, 594681, 587964, 582993, 578593, 574261, 570552, 567762, 565649, 564296, 563952, 564059, 563655, 562782, 562484, 563536, 566017, 569831, 574658, 579604, 583851, 587480, 590931, 594087, 596699, 599172, 602031, 605135, 608279, 611948, 616570, 621678, 626789, 632370, 638901, 645759, 652211, 658790, 666412, 674834, 683312, 692049, 701511, 710839, 718431, 723756, 727264, 728979, 728554, 726372, 723187, 719004, 713590, 707678, 702316, 697434, 692459, 687914, 684818, 682800, 680431, 677378, 674723, 673149, 672287, 671961, 672639, 674367, 676423, 678395, 680643, 683452, 686494, 689261, 691441, 693028, 694622, 697285, 701403, 706072, 710314, 714321, 718777, 723776, 729409, 736542, 745662, 755652, 765117, 774296, 784250, 794713, 804389, 812954, 821087, 828722, 834966, 839729, 843864, 847530, 849883, 850655, 850886, 851881, 854395, 858796]
60326H58796O194P213P589Q327R575J0087R119P420N578L008n08l867o317q537
60312I13677j0929j2402j2068j0736r531q389p024n989n582n043m017l458l919
60299H14590m353l710k484j486n07P40J767K442L564N191N958N243M349M217L721
60284H39242J783m27j203q19n37l49M95J666K280K566L383M639N556N971O300
60269H70546O828P803R487J1413J2682J3598J5715J9407K2939K4909K6163K8088
60257A069578L0586L3044L5898L9783M4311M8923N3872N9223O4292O9154P5231
60246A623895Q3116R1359R8732J06008J13953J21200J25969J28502J29860J29418
60236B752012J25543J17987J07889R6109Q3034O9317N5428M1038K5882J0493m665
$$ y = [858796, 864990, 872203, 879792, 888119, 897694, 907781, 916900, 924320, 929898, 932906, 932398, 928531, 922214, 913677, 902748, 890346, 878278, 867542, 858011, 849622, 842598, 836609, 831027, 825984, 821967, 818509, 814590, 810237, 806527, 804043, 802557, 802050, 802790, 804557, 806999, 810563, 815754, 821712, 826955, 831304, 835521, 839242, 841025, 840598, 839395, 838576, 838039, 837690, 838185, 839851, 842131, 844697, 848080, 852719, 858275, 864246, 870546, 877374, 885177, 894664, 906077, 918759, 932357, 948072, 967479, 990418, 1015327, 1041490, 1069578, 1100164, 1133208, 1169106, 1208889, 1253200, 1302123, 1355995, 1415218, 1479510, 1548664, 1623895, 1707011, 1798370, 1897102, 2003110, 2117063, 2238263, 2364232, 2492734, 2622594, 2752012, 2877555, 2995542, 3103431, 3199540, 3282574, 3351891, 3407319, 3448357, 3474239, 3484732, 3480067]
60225C480067j9572l3422m4413n1798n6642n9549n9424n5686m9761m2854l4116
60214B972830k2740j0116K139J4653K8731M3732N8056P1591Q5111R8421J10881
60203C453289J22607J33184J40424J42400J39710J33885J24801J11571R4798P5855
60193D672524N5080L2673J0270j0662l0906n1766p2107q9326j02412j11875j17524
60182D183969j18574j15508j09621j01096q9371p4873n8651m0994k2106l351J4094
60171C463918L0930M8205O4913P9010Q9924R7937J02018J00655R4305Q4920P3497
60160D330232O0018M5149K9876J4060k646j8873l2553m3253n1581n6841n7459
60149D216129n3270m5375l4224j9806l166J4370L2994N3431P4689R5015J14615
$$ y = [3480067, 3460495, 3427073, 3382660, 3330862, 3274220, 3214671, 3155247, 3099561, 3049800, 3006946, 2972830, 2950090, 2939974, 2942113, 2956766, 2985497, 3029229, 3087285, 3158876, 3243987, 3342408, 3453289, 3575896, 3709080, 3849504, 3991904, 4131614, 4265499, 4390300, 4501871, 4596669, 4672524, 4727604, 4760277, 4770547, 4759885, 4728979, 4677213, 4605106, 4515780, 4413368, 4301493, 4183969, 4065395, 3949887, 3840266, 3739170, 3649799, 3574926, 3516275, 3475281, 3453175, 3449824, 3463918, 3494848, 3543053, 3607966, 3686976, 3776900, 3874837, 3976855, 4077510, 4171815, 4256735, 4330232, 4390250, 4435399, 4465275, 4479335, 4476689, 4457816, 4425263, 4382010, 4330429, 4273588, 4216129, 4162859, 4117484, 4083260, 4063454, 4060288, 4074658, 4107652, 4161083, 4235772, 4330787, 4445402]
60138D445402J35276J57603J80747K04537K29722K56164K82817L09289L35593
60129F537150L60553L82180L99313M11258M16467M13488M02565L84367L57984
60120A0065325L22413K79286K31618J80386J24939O6272P042n1526j09955j67568
60110A0948232k21849k70944l14127l49379l73245l84141l83723l74222l56270
60101G920332l30204k97724k61170k22336j82455j42350j02260o2451k3868J2808
60091F308322M8095Q2260J13441J38880J57427J69074J72699J66567J50918J27942
60081G635625R9391O6331L0985l648l6214o6948r5232j19521j39887j58252j75451
60070G037179j90101k00864k07954k11779k11958k08316k01311j91051j77363
$$ y = [4445402, 4580678, 4738281, 4919028, 5123565, 5353287, 5609451, 5892268, 6201557, 6537150, 6897703, 7279883, 7679196, 8090454, 8506921, 8920409, 9322974, 9707341, 10065325, 10387738, 10667024, 10898642, 11079028, 11203967, 11270239, 11277281, 11225755, 11115800, 10948232, 10726383, 10455439, 10141312, 9791933, 9418688, 9034547, 8650824, 8276602, 7920332, 7590128, 7292404, 7031234, 6808898, 6626443, 6484093, 6381833, 6319382, 6295514, 6308322, 6356417, 6438677, 6552118, 6690998, 6848425, 7017499, 7190198, 7356765, 7507683, 7635625, 7735016, 7801347, 7832332, 7828684, 7792470, 7725522, 7630290, 7510769, 7370882, 7212630, 7037179, 6847078, 6646214, 6438260, 6226481, 6014523, 5806207, 5604896, 5413845, 5236482]
60061E236482j61159j44118j26729j08115q7962o7100m6026k4466k588J8869L9839
60050D526927O0767Q1210J00058J17021J32208J44369J51410J52646J48799J39926
60040E755341J25303J05469Q2348N7139K9849J064k7785n6019q3674j09596j31502
60029E747937j48202j60109j67332j69216j65921j58676j48223j34782j19626
60020D375850j04614q9888p4011n6621l9016k1786l955J4920L3885N2524P1971
60009D159259R3077J15093J36698J57040J75302J90604K02523K10395K12133K05473
59999E857597J90540J69551J44024J14182Q1149M7485J4836j7153m9054q0218
59989F472939j09447j35401j56104j69707j76155j76763j72178j62300j48062
$$ y = [5236482, 5075323, 4931205, 4804476, 4696361, 4608399, 4541299, 4495273, 4470807, 4468219, 4487088, 4526927, 4587694, 4668904, 4768962, 4885983, 5018191, 5162560, 5313970, 5466616, 5615415, 5755341, 5880644, 5986113, 6068461, 6125600, 6155449, 6156513, 6128728, 6072709, 5989035, 5879439, 5747937, 5599735, 5439626, 5272294, 5103078, 4937157, 4778481, 4630258, 4495476, 4375850, 4271236, 4181348, 4107337, 4050716, 4011700, 3989914, 3985959, 4000879, 4034764, 4087288, 4159259, 4252336, 4367429, 4504127, 4661167, 4836469, 5027073, 5229596, 5439991, 5652124, 5857597, 6048137, 6217688, 6361712, 6475894, 6557043, 6604528, 6619364, 6602211, 6553157, 6472939, 6363492, 6228091, 6071987, 5902280, 5726125, 5549362, 5377184, 5214884, 5066822]
59980E066822j31373j13219r3582p3121n2963l2930j2044R190K9113M7448O5251
59969D708592Q2289R6869J08383J17551J23901J25682J22753J17033J09476R9115
59959E811644Q5843P1575N7663M3517K8771J4609K010r141j8143k2875k2251j7408
59947F025814r361K623J9408M0571O5546R4413J26757J61446J98281K37999K80052
59936G243549L22334L63733M04672M44192M78566N03748N17058N15547M95120
59927A1288519M52898L88996L05186K03894Q9837k9283j45191k51110l41352m11368
59917A1551026m59653m87985m98729m93470m74859m47325m14477l77411l36697
59908G560420k94182k51627k09350j67399j26534q6952m7791q887K8508O3687
$$ y = [5066822, 4935449, 4822230, 4728648, 4655527, 4602564, 4569634, 4557590, 4566780, 4595893, 4643341, 4708592, 4790881, 4887750, 4996133, 5113684, 5237585, 5363267, 5486020, 5603053, 5712529, 5811644, 5897487, 5969062, 6026725, 6070242, 6099013, 6113622, 6115632, 6106491, 6088348, 6065473, 6043222, 6025814, 6016453, 6019076, 6038484, 6079055, 6144601, 6239014, 6365771, 6527217, 6725498, 6963497, 7243549, 7565883, 7929616, 8334288, 8778480, 9257046, 9760794, 10277852, 10793399, 11288519, 11741417, 12130413, 12435599, 12639493, 12729330, 12700047, 12554856, 12303746, 11962394, 11551026, 11091373, 10603388, 10104659, 9611189, 9136330, 8689005, 8274528, 7897117, 7560420, 7266238, 7014611, 6805261, 6637862, 6511328, 6424376, 6376585, 6367698, 6396206, 6459893]
59898F459893R7446J30219J61004J88843K13323K32672K43419K43183K31875K09368
59888H411245J74189J25975O7294J799o7434j36576k00414k54918k98899l32009
59878G490252l53053l61771l60321l51312l35928l15286k91735k67170k41642
59869D612034k15130j89116j64928j42212j20500j00685q3438o7906n3594m2053
59859C432472l4995l2016l1578l2932l5637l8578m0792m2144m2143l9584l4387
59848C027686k8132k1762j4509o246J121N897Q247Q229M330m184j5316k6564l7372
59835B901425m7605n5468n9181n9416n7988n5207n0299m3409l5460k6973j8392
59824B392027j0577l624L612J1694J9608K6709L4100M2799N2075O0769O8647P5087
$$ y = [6459893, 6557339, 6687558, 6848562, 7037405, 7250728, 7483400, 7726819, 7970002, 8201877, 8411245, 8585434, 8711409, 8778703, 8780502, 8713068, 8576492, 8376078, 8121160, 7822261, 7490252, 7137199, 6775428, 6415107, 6063795, 5727867, 5412581, 5120846, 4853676, 4612034, 4396904, 4207788, 4042860, 3900648, 3780148, 3679463, 3596025, 3528119, 3474525, 3432472, 3397477, 3365461, 3333883, 3300951, 3265314, 3226736, 3185944, 3143800, 3101657, 3062073, 3027686, 2999554, 2977792, 2963283, 2957037, 2958158, 2964055, 2972302, 2980531, 2984861, 2980677, 2965361, 2938797, 2901425, 2853820, 2798352, 2739171, 2679755, 2621767, 2566560, 2516261, 2472852, 2437392, 2410419, 2392027, 2381450, 2377826, 2381438, 2393132, 2412740, 2439449, 2473549, 2516348, 2568423, 2629192, 2697839, 2772926]
59812B772926P8384P7983P5834P3788P1268O6982O1271N4883M6981L6265K3043
59801C439608Q752n234j7128k4714k7400k6788k3947j7942q417K597J3349K4885
59789C337621L8868N4767P1350Q9272J09837J32668J56893J83389K13761K48290
59779D636716K86689L29287L75197M20304M58676M84335M89601M63964L98557
59770H343326K92929J57077Q300j33332k50064l31993l78928l96318l90279l66978
59760F553740l33548k96139k57634k19120j82395j49170j19252r1706o6726m4573
59750D793477k4135m564J3232K8718M3765O0247P7244R3096J08730J26277J45623
59739E461710J65108J84639K05545K28188K52206K78378L07885L40398L75031
$$ y = [2772926, 2851310, 2929293, 3005127, 3078915, 3150183, 3217165, 3278436, 3333319, 3380300, 3416565, 3439608, 3448360, 3443126, 3425998, 3401284, 3373884, 3347096, 3323149, 3305207, 3296790, 3299387, 3312736, 3337621, 3376489, 3431256, 3502606, 3591878, 3701715, 3834383, 3991276, 4174665, 4388426, 4636716, 4923405, 5252692, 5627889, 6048193, 6506869, 6991204, 7480805, 7944769, 8343326, 8636255, 8793332, 8801632, 8668300, 8418236, 8086243, 7707315, 7310997, 6920718, 6553740, 6220192, 5924053, 5666419, 5447299, 5264904, 5115734, 4996482, 4904776, 4838050, 4793477, 4769342, 4764778, 4778010, 4806728, 4850493, 4910740, 4987984, 5081080, 5189810, 5316087, 5461710, 5626818, 5811457, 6017002, 6245190, 6497396, 6775774, 7083659, 7424057, 7799088]
59730G799088M12231M52671M95194N37982N80670O22973O62205O94357P16675
59721A2974046P27052P22327P00167O62219O13382N58848N03902M55243M19482
59712A8336668M00342L98979M15802M49737M96682N50965O07572O61106P04229
59703B3022082P29671P32856P10550O58933N76261M66422L37186J96124N1005
59694B7481090q7658k08772l05497l75416m17021m29490m15303l79397l25366
59685B4537170k55170j72109q0749J6473J19837K29451L44335M64243N89482P18457
59675B6511420Q47350R71922J086924J183677J250471J275528J247807J156387
59667C5531486R93198P58250M61542J20991k39420n91266r06731j165137j355065
$$ y = [7799088, 8211319, 8663990, 9159184, 9697166, 10277836, 10900809, 11563014, 12257371, 12974046, 13701098, 14423425, 15123592, 15785811, 16399193, 16958041, 17461943, 17917186, 18336668, 18737010, 19135989, 19551791, 20001528, 20498210, 21049175, 21656747, 22317853, 23022082, 23751753, 24484609, 25195159, 25854092, 26430353, 26896775, 27233961, 27430085, 27481090, 27393432, 27184660, 26879163, 26503747, 26086726, 25657236, 25241933, 24862536, 24537170, 24282000, 24109891, 24029142, 24045615, 24165452, 24394903, 24739238, 25203481, 25792963, 26511420, 27358770, 28330692, 29417616, 30601293, 31851764, 33127292, 34375099, 35531486, 36524684, 37282934, 37744476, 37865467, 37626047, 37034781, 36128050, 34962913, 33607848]
59658C3607848j472284j518790j503269j438700j337968j212832j076082r41638
59650B3106285q22330p29523o74097o63722o97343p63372q43559r18304r71144
59641A6022891r93063r84362r51033q99372q34966p64599o94893o28735n65699
59632H706169n06070m51780m03549l60030l20265k84568k52807k24144j98588
59623E704368j76523j56705j37032j17307r9059q2880o8288n5819m6670m0425
59613D723660l5774l3277l4736m0004m7131n5462o5781p7321q7653r5700j02211
59602D048610j07059j08868j07510j04293r9487r2365q3797p5940o9127o1762
59592C138402n3493m5665l8439l0415k1496j3284o225P71P579J2724J6408K0576
$$ y = [33607848, 32135564, 30616774, 29113505, 27674805, 26336837, 25124005, 24047923, 23106285, 22283955, 21554432, 20880335, 20216613, 19519270, 18755898, 17912339, 16994035, 16022891, 15029828, 14045466, 13094433, 12195061, 11360095, 10595496, 9900603, 9271868, 8706169, 8200099, 7748319, 7344770, 6984740, 6664475, 6379907, 6127100, 5902956, 5704368, 5527845, 5371140, 5234108, 5116801, 5017742, 4934862, 4866574, 4810755, 4764085, 4723660, 4687886, 4654609, 4619873, 4579869, 4532738, 4477276, 4411495, 4334174, 4246521, 4150821, 4048610, 3941551, 3832683, 3725173, 3620880, 3521393, 3429028, 3345231, 3269291, 3200164, 3138402, 3084909, 3039244, 3000805, 2970390, 2948894, 2935610, 2929385, 2930156, 2937735, 2950459, 2966867, 2987443]
59580B987443K5335K8424K9017K8927K9070K7936K4962K2534K2888K5327K8100
59569C279963L1046L4944L9960M6060N3486O1926P0554P9395Q9255J00099J11203
59558C997891J22949J36624J52259J68699J85825K04566K24684K44749K64419
59549E702665K84383L03882L20668L33643L43286L49302L50181L45365L35730
59540H669105L21878L04193K84513K65338K47413K30068K13201J96375J77118
59531A0909202J53916J30669J14360J07933J08713J13701J22249J32817J41207
59522A2034767J43537J37822J21688R1921M7841p729p1709j42152k15660k86810
59512A1853516l51479m08038m54455m87574n06454n13420n10575m98202m77569
$$ y = [2987443, 3012778, 3041202, 3070219, 3099146, 3128216, 3156152, 3181114, 3203648, 3226536, 3251863, 3279963, 3311009, 3345953, 3385913, 3431973, 3485459, 3547385, 3617939, 3697334, 3786589, 3886688, 3997891, 4120840, 4257464, 4409723, 4578422, 4764247, 4968813, 5193497, 5438246, 5702665, 5987048, 6290930, 6611598, 6945241, 7288527, 7637829, 7988010, 8333375, 8669105, 8990983, 9295176, 9579689, 9845027, 10092440, 10322508, 10535709, 10732084, 10909202, 11063118, 11193787, 11308147, 11416080, 11524793, 11638494, 11760743, 11893560, 12034767, 12178304, 12316126, 12437814, 12529735, 12577576, 12569847, 12498138, 12355986, 12140326, 11853516, 11502037, 11093999, 10639544, 10151970, 9645516, 9132096, 8621521, 8123319, 7645750]
59503G645750m52025m23847l92794l59158l25317k93041k61981k32072k04540
59494D700975j79518j55563j32679j12826r6236q0417o4003m8475l4767k1408
59484C775083p487N866J8489L2420M8461O4700Q0124R6520J14966J33766J51873
59473D514781J71068J92561K14448K34903K54875K75104K93153L05834L12178
59464F768905L11549L01329K79085K45122K00784J46374Q2982J4416n4707j21251
59454H174588j82490k35117k77139l08875l30633l41560l42186l35561l24310
59445E496717l08802k89567k68882k48337k27464k06332j86800j69555j52787
59436C438191j35582j19818j06862r5198q3243p1752o1540n1670m1865l3736k7631
$$ y = [7645750, 7193725, 6769878, 6377084, 6017926, 5692609, 5399568, 5137587, 4905515, 4700975, 4521457, 4365894, 4233215, 4120389, 4024153, 3943736, 3879733, 3831258, 3796491, 3775083, 3767596, 3773462, 3791951, 3824371, 3872832, 3937532, 4017656, 4114176, 4229142, 4362908, 4514781, 4685849, 4878410, 5092858, 5327761, 5582636, 5857740, 6150893, 6456727, 6768905, 7080454, 7381783, 7660868, 7905990, 8106774, 8253148, 8336130, 8350546, 8295839, 8174588, 7992098, 7756981, 7479842, 7170967, 6840334, 6498774, 6156588, 5821027, 5496717, 5187915, 4898348, 4629466, 4381129, 4153665, 3947333, 3760533, 3590978, 3438191, 3302609, 3182791, 3075929, 2980731, 2897488, 2825736, 2764196, 2712526, 2670661, 2636925, 2609294]
59425B609294k1222j3271n859o70L783Q930J3335J5728J7786K1247K5060K8010
59413B702151L1313L6127M1349M6214N1690N6564N6094M8243L8232L3045L4278
59402C175300L9825M9294O3228P9677R6357J14327J34908J54626J68142J75647
59392D251331J83320J96848K17934K46251K81051L20696L63560M09387M57842
59383F928220N06632N52989N95459O31883O57297O66787O59176O35716N97203
59374A2431362N45398M85485M23564L62636L03811K49661K02893J62729J25865
59365A5293404R0261N5076J7934k4502p3550j28470j88310k51080l11974l65093
59355A4113696m06401m33214m42682m33848m10250l77844l41281l04365k72320
$$ y = [2609294, 2588072, 2574801, 2568942, 2568272, 2572055, 2580985, 2594320, 2610048, 2627834, 2649081, 2674141, 2702151, 2733464, 2769591, 2810940, 2857154, 2908844, 2965408, 3021502, 3069745, 3107977, 3141022, 3175300, 3215125, 3264419, 3327647, 3407324, 3503681, 3618008, 3752916, 3907542, 4075684, 4251331, 4434651, 4631499, 4849433, 5095684, 5376735, 5697431, 6060991, 6470378, 6928220, 7434852, 7987841, 8583300, 9215183, 9872480, 10539267, 11198443, 11834159, 12431362, 12976760, 13462245, 13885809, 14248445, 14552256, 14801917, 15004810, 15167539, 15293404, 15383665, 15438741, 15456675, 15432173, 15358623, 15230153, 15041843, 14790763, 14478789, 14113696, 13707295, 13274081, 12831399, 12397551, 11987301, 11609457, 11268176, 10963811, 10691491]
59346A0691491k50170k39505k39237k48461k66024k88608l12125l34248l53326
59337H159787l66347l70784l67316l58100l43611l23780l00731k77314k53960
59328E197844k29773k05591j83181j62484j42393j23203j05693q9095p2644n7749
59318C826038m5838l5472k4498j3496m038M884J5298K6488L6321M5257N5427O6603
59306C952974P6611Q5132R3724J02451J09715J15028J18930J20648J18695J13342
59296E007250J05827R5771Q2196O6288N0389L5018J9691N766m482j0871j4500
59285E438343j4848j0635k687P168J9245L4920N3203P1440Q8800J05898J21684
59274E912531J33862J41870J46354J46140J38916J24508J04697Q0398N1980K1861
$$ y = [10691491, 10441321, 10201816, 9962579, 9714118, 9448094, 9159486, 8847361, 8513113, 8159787, 7793440, 7422656, 7055340, 6697240, 6353629, 6029849, 5729118, 5451804, 5197844, 4968071, 4762480, 4579299, 4416815, 4274422, 4151219, 4045526, 3956431, 3883787, 3826038, 3780200, 3744728, 3720230, 3706734, 3702696, 3707580, 3722878, 3749366, 3785687, 3830944, 3886371, 3952974, 4029585, 4114717, 4208441, 4310892, 4420607, 4535635, 4654565, 4775213, 4893908, 5007250, 5113077, 5208848, 5291044, 5357332, 5407721, 5442739, 5462430, 5468196, 5463714, 5452843, 5438343, 5423495, 5412860, 5410173, 5417341, 5436586, 5471506, 5524709, 5596149, 5684949, 5790847, 5912531, 6046393, 6188263, 6334617, 6480757, 6619673, 6744181, 6848878, 6929276, 6981256, 7003117]
59264G003117o430l1752n5376p7874r8303j15535j27794j31926j26096j12579
59254F119452r5340p5916n4312l2414j3063L303J7820K9922L8115M3015M6286
59243F026868M7578M5825M2592M0726M0699M1742M5470N4542O8757Q6336J08173
59232F649308J36677J71081K08093K46706K88006L30304L68540L98574M18105
59223I215394M23511M10090L76151L23418K53382J66848O7275l9128j46977k52134
59213A0797830l48834m30298m92763n35902n59619n63977n52108n29278m98821
59204F286230m62171m22391l83584l46814l10588k75478k44280k17459j92685
59195C430780j69294j49140j32489j17201j02740r1075q2675p5373o8075o2031
$$ y = [7003117, 6996687, 6964935, 6909559, 6831685, 6733382, 6617847, 6490053, 6358127, 6232031, 6119452, 6024112, 5948196, 5893884, 5861470, 5848407, 5851710, 5869530, 5899452, 5937567, 5980582, 6026868, 6074446, 6120271, 6162863, 6203589, 6244288, 6286030, 6331500, 6386042, 6454799, 6541135, 6649308, 6785985, 6957066, 7165159, 7411865, 7699871, 8030175, 8398715, 8797289, 9215394, 9638905, 10048995, 10425146, 10748564, 11001946, 11168794, 11236069, 11196941, 11049964, 10797830, 10448996, 10018698, 9525935, 8990033, 8430414, 7866437, 7314329, 6785051, 6286230, 5824059, 5401668, 5018084, 4671270, 4360682, 4085204, 3840924, 3623465, 3430780, 3261486, 3112346, 2979857, 2862656, 2759916, 2668841, 2586166, 2510793, 2442718, 2380687]
59185B380687n7532n2931m7747m3437m0221l6519l2104k8511k5703k1763j6494
59174A977725j1905q565m945p56K603N440R839J5727K0639K4129K8489L4241L8838
59161B131499M1113M3338M7408N2392N7180O2276O7682P2209P6121Q1504Q8871
59150B821593R6254J02525J08663J14975J20108J23722J27006J29682J29421J25113
59140C999062J17911J08473R6110Q1162O5284M8939L1516J4121r27j3372k4494
59129D523785l3374l7376l6362l2634k6593j6537k840J2031K8012M7420O9909
59118D495441R2069J12964J35407J60544J85688K08875K31062K52198K69244K79628
59108F423120K82628K76074K55992K21236J74785J19378N6352r954p1580j22875
$$ y = [2380687, 2323155, 2270224, 2222477, 2179040, 2138819, 2102300, 2070196, 2041685, 2015982, 1994219, 1977725, 1965820, 1957255, 1952310, 1951554, 1954157, 1959597, 1969436, 1985163, 2005802, 2029931, 2058420, 2092661, 2131499, 2172612, 2215950, 2263358, 2315750, 2372930, 2435206, 2502888, 2575097, 2651218, 2732722, 2821593, 2917847, 3020372, 3129035, 3244010, 3364118, 3487840, 3614846, 3744528, 3873949, 3999062, 4116973, 4225446, 4321556, 4402718, 4468002, 4516941, 4548457, 4562578, 4561651, 4548279, 4523785, 4490411, 4453035, 4416673, 4384039, 4357446, 4340909, 4338069, 4350100, 4378112, 4425532, 4495441, 4587510, 4700474, 4835881, 4996425, 5182113, 5390988, 5622050, 5874248, 6143492, 6423120, 6705748, 6981822, 7237814, 7459050, 7633835, 7753213, 7809565, 7799611, 7728031, 7605156]
59098G605156j63147j91999k07016k08297k00761j89130j74437j57664j42567
59089E970138j32012j25102j20537j19481j22827j28944j36356j45422j55436
59080D784021j63584j68783j73004j76967j78209j75399j70715j65860j59541
59071C251959j51133j42864j35947j28218j18227j08049r9617r1802q3472p5858
59061B116772o9464o2252n3397m5449m0360l6705l2964l0001k8206k6037k3658
59050A668279k4019k7891l1782l3282l4305l6378l7139l4654l1061k8557k5687
59039A323524k1072j6821j4736j2746q858n069l576k574L47L802N449O204P846
59026A261720R326R135Q575R053Q865O301L202J931J433k00j889j813r17p34k64
$$ y = [7605156, 7442009, 7250010, 7042994, 6834697, 6633936, 6444806, 6270369, 6112705, 5970138, 5838126, 5713024, 5592487, 5473006, 5350179, 5221235, 5084879, 4939457, 4784021, 4620437, 4451654, 4278650, 4101683, 3923474, 3748075, 3577360, 3411500, 3251959, 3100826, 2957962, 2822015, 2693797, 2575570, 2467521, 2367904, 2276102, 2192630, 2116772, 2047308, 1985056, 1931659, 1886210, 1845850, 1809145, 1776181, 1746180, 1717974, 1691937, 1668279, 1644260, 1616369, 1584587, 1551305, 1517000, 1480622, 1443483, 1408829, 1377768, 1349211, 1323524, 1302452, 1285631, 1270895, 1258149, 1249291, 1244222, 1240646, 1238072, 1238419, 1242221, 1247670, 1253874, 1261720, 1271046, 1280181, 1288756, 1297809, 1306674, 1312975, 1316177, 1318108, 1319541, 1319341, 1317452, 1315639, 1314722, 1313988, 1313724]
59011A313724J644L461L794M408O995R772J0667J1067J2768J4072J2726J0192
58999A415290R046Q590O838M634L891L903L132K578L753N385N710N996Q138J0835
58985A497719J1721J1360J1589J1952J1330J1080J2873J5213J5732J5223J5980
58974A641772J7763J8883J9654K1481K3991K6169K8810L2890L7174M0154M2599
58963A951340M5508M7588M7516M6568M6308M5936M4575M3660M4253M4691M3874
58952B451817M4122M7598N2662N7079O1955O9009P6797Q3493R0639J00227J10614
58941C246012J19413J27982J38999J51792J64221J77042J92299K09330K26392
58932D753482K44511K65862K90097L15955L44621L77761M14235M52336M93288
$$ y = [1313724, 1315368, 1318829, 1322623, 1327031, 1334026, 1343798, 1354465, 1365532, 1378300, 1392372, 1405098, 1415290, 1424336, 1432926, 1439764, 1444398, 1448289, 1452192, 1455324, 1457902, 1461655, 1467040, 1472750, 1478746, 1486884, 1497719, 1509440, 1520800, 1532389, 1544341, 1555671, 1566751, 1579624, 1594837, 1610569, 1625792, 1641772, 1659535, 1678418, 1698072, 1719553, 1743544, 1769713, 1798523, 1831413, 1868587, 1908741, 1951340, 1996848, 2044436, 2091952, 2138520, 2184828, 2230764, 2275339, 2318999, 2363252, 2407943, 2451817, 2495939, 2543537, 2596199, 2653278, 2715233, 2784242, 2861039, 2944532, 3035171, 3135398, 3246012, 3365425, 3493407, 3632406, 3784198, 3948419, 4125461, 4317760, 4527090, 4753482, 4997993, 5263855, 5553952, 5869907, 6214528, 6592289, 7006524, 7458860, 7952148]
58923G952148N38860N87601O37107O87747P40268P91720Q37538Q75463R03450
58914A4551902R15784R05268Q67522P99972O99473N65527M04010K23931L2762
58905A9966151j61386l46197n09207o44178p49861q25048q69433q87143q84413
58896A4089285q64953q31371p88712p42051o92508o39968n87482n38566m92372
58887G911302m46373m01848l61979l26637k93920k64859k41570k22626k05276
58878E146214j90321j79767j71576j62014j51513j42875j35334j25875j14987
58869C771952j05551r7273q7619p7214o8863o2184n4593m6640m1126l7667l3324
58858C059898k7849k3246j9033j3107o462j876J364O315J2825J8311K3135K9943
$$ y = [7952148, 8491008, 9078609, 9715716, 10403463, 11143731, 11935451, 12772989, 13648452, 14551902, 15467686, 16372954, 17240476, 18040448, 18739921, 19305448, 19709458, 19933389, 19966151, 19804765, 19458568, 18949361, 18305183, 17555322, 16730274, 15860841, 14973698, 14089285, 13224332, 12392961, 11604249, 10862198, 10169690, 9529722, 8942240, 8403674, 7911302, 7464929, 7063081, 6701102, 6374465, 6080545, 5815686, 5574116, 5351490, 5146214, 4955893, 4776126, 4604550, 4442536, 4291023, 4148148, 4012814, 3886939, 3771952, 3666401, 3569128, 3481509, 3404295, 3335432, 3273248, 3218655, 3172015, 3130889, 3093222, 3059898, 3032049, 3008803, 2989770, 2976663, 2970201, 2968325, 2969689, 2976004, 2988829, 3007140, 3030275, 3060218]
58846C060218L8265M5132N0613N7549O6243P4366Q1797R0516J00178J08729J16928
58835C890534J27360J39562J50963J62062J75706J91906K08351K25358K45250
58826E517052K67609K90342L14767L44344L78970M15739M54647M98160N45788
58817I027418N94623O44593O97434P50713P98501Q37492Q66715Q81393Q73151
58808A5972033Q36725P71316O75725N48209L91895K15238K6935j64750l48393
58799A8924933n11530o47331p54730q32572q79227q97561q94242q73698q38058
58790A1795984p92384p43643o94219o42496n90077n42165n00305m61055m22735
58781F406905l87535l56072l25832k96262k69809k46922k25304k04935j88438
$$ y = [3060218, 3098483, 3143615, 3194228, 3251777, 3318020, 3392386, 3474183, 3564699, 3664877, 3773606, 3890534, 4017894, 4157456, 4308419, 4470481, 4646187, 4838093, 5046444, 5271802, 5517052, 5784661, 6075003, 6389770, 6734114, 7113084, 7528823, 7983470, 8481630, 9027418, 9622041, 10266634, 10964068, 11714781, 12513282, 13350774, 14217489, 15098882, 15972033, 16808758, 17580074, 18255799, 18804008, 19195903, 19411141, 19438076, 19273326, 18924933, 18413403, 17766072, 17011342, 16178770, 15299543, 14401982, 13507740, 12634042, 11795984, 11003600, 10259957, 9565738, 8923242, 8333165, 7791000, 7290695, 6829640, 6406905, 6019370, 5663298, 5337466, 5041204, 4771395, 4524473, 4299169, 4094234, 3905796]
58772C905796j75873j64504j54155j47099j42247j35367j25755j16866j09721
58763B634209j01636r2115q3915p7365o9770o1290n5215n1451m6026l8274l2186
58752A924966k9339k6791k3417k1844k2352k1248j7414j4537j4586j4875j3622
58741A704941j2837j3613j3948j3250j3736j5677j6458j5758j6288j8153j8266
58730A536957j6598j6966k0041k1795k0683k0147k2013k3591k3543k4545k7609
58719A299426k9592k8850k7829k7727k6130k2257j9026j7706j5922j2969j1555
58708A059863j2272j2055j0067r336j0590j0493q098o909q215q564o374m863n783
58695I46244o315m951m475o180o978n190l591l945m083l080l594o505q825r356
$$ y = [3905796, 3729923, 3565419, 3411264, 3264165, 3121918, 2986551, 2860796, 2743930, 2634209, 2532573, 2440458, 2356543, 2279178, 2209408, 2148118, 2092903, 2041452, 1995426, 1957152, 1924966, 1895627, 1868836, 1845419, 1823575, 1801223, 1779975, 1762561, 1748024, 1733438, 1718563, 1704941, 1692104, 1678491, 1664543, 1651293, 1637557, 1621880, 1605422, 1589664, 1573376, 1555223, 1536957, 1520359, 1503393, 1483352, 1461557, 1440874, 1420727, 1398714, 1375123, 1351580, 1327035, 1299426, 1269834, 1240984, 1213155, 1185428, 1159298, 1137041, 1118015, 1100309, 1084387, 1071418, 1059863, 1047591, 1035536, 1025469, 1016133, 1005543, 995050, 986952, 980043, 971828, 963264, 956890, 952027, 946244, 939929, 934978, 930503, 924323, 917345, 912155, 908564, 904619, 900536, 897456, 893862, 887357, 878532, 869176]
58681H69176j0607j2838j2464q847o179o062m778p08K335K297K460M488M764J533
58667H24570j087k13J142O31J253N102Q651Q816P884Q008O703K322j645k321k024
58652H67792k847k212J722N725P063Q190J1595J5115J6600J8059K1069K3184K3036
58639A014091K3687K7000K9999L0764L2410L7184M2296M5662N0077N7496O4996
58628A455662P0723P8015Q9149J00986J11346J23772J41145J60412J78548J97814
58618B707572K20090K41748K59337K74469K87784K93619K86179K65626K33109
58609E069533J85777J22748N0821k1452r0522j53818k04914k39002k58496k67732
58599D192943k66818k55722k39084k21343k01895j80183j60219j44815j30752
$$ y = [869176, 858569, 845731, 833267, 824420, 818241, 812179, 807401, 806693, 809028, 811325, 813785, 818273, 823037, 824570, 823483, 823270, 824412, 825043, 826296, 831398, 840049, 848865, 856749, 864757, 871460, 873782, 872137, 869816, 867792, 864945, 862733, 864455, 870180, 877243, 885433, 897028, 912143, 928743, 946802, 967871, 991055, 1014091, 1037778, 1064778, 1094777, 1125541, 1157951, 1195135, 1237431, 1283093, 1333170, 1390666, 1455662, 1526385, 1604400, 1693549, 1794535, 1905881, 2029653, 2170798, 2331210, 2509758, 2707572, 2927662, 3169410, 3428747, 3703216, 3991000, 4284619, 4570798, 4836424, 5069533, 5255310, 5378058, 5428879, 5407427, 5316905, 5163087, 4958173, 4719171, 4460675, 4192943, 3926125, 3670403, 3431319, 3209976, 3008081, 2827898, 2667679, 2522864, 2392112]
58590B392112j15115j01038r1640q3968p4704o6310o1573n7511n0818m4006m0017
58579A605412l6185k9695k3720k1743k1047j8213j5859j7422k0363k1133k1809
58568A358223k5134k7999k6603k3380k2225k1614j8979j6928j8419k0545j9773
58557A116624j8539k0108k1819k0197j7767j7930j8065j4691j0588r635r548o819
58545I30918l938m444n669l836j500k436l930j822J470J626N56K149M386L459
58531I16989J398J812K299j164o389r177j1016j5056j8784j8466j6607j7296j8449
58518G90094j6364j3488j3752j4623j1940q202p916q929o678k942k201l203k189
58505F77667m72j027j738K50J943Mj983L24L688L203J310K397L928J852n63J409
$$ y = [2392112, 2276997, 2175959, 2084319, 2000351, 1925647, 1859337, 1797764, 1740253, 1689435, 1645429, 1605412, 1569227, 1539532, 1515812, 1494069, 1473022, 1454809, 1438950, 1421528, 1401165, 1380032, 1358223, 1333089, 1305090, 1278487, 1255107, 1232882, 1211268, 1192289, 1175361, 1156942, 1136397, 1116624, 1098085, 1077977, 1056158, 1035961, 1018194, 1000264, 982199, 967508, 956920, 947285, 937737, 930918, 926980, 922536, 916867, 913031, 911531, 909095, 905165, 903343, 904813, 906439, 906995, 909144, 913530, 916989, 918387, 920199, 922498, 921334, 914945, 905768, 894752, 879696, 860912, 842446, 825839, 808543, 790094, 773730, 760242, 746490, 731867, 719927, 711725, 703809, 694880, 688202, 685260, 683059, 679856, 677667, 677195, 676168, 674430, 674680, 676623, 676627, 674644, 674968, 678656, 681859, 683169, 685566, 689494, 691346, 690783, 692192]
58489F92192M476L249L77J116L000R56k255j108K041J758K63K775O693O240L601
58474G25374M634P644P270N372P105J0189R171O349P321R664P320K345P82Q09
58460H11349l295r230j0618r183j1006j4274j3018r465j0171j3208j1805p647
58448F88429p582j0123q250l106j767l720k614P13J21l018j987K088K309o12o2
58433F50819L175K568r41n84K807K309j537j849J301J800K40K490P035P147M221
58418F81001N468R876J0153P135Q210J2817J3754J1584J3269J7634J6928J1934
58406H19763J0716J3018J0948M556J588K205p43o657p825m849n815j0191r457
58393H17257l837k296n489m998j57Q53k416j626L586M419l0j047K687K992j109
$$ y = [692192, 696668, 699917, 700294, 701410, 704410, 705366, 703111, 702003, 704044, 705802, 706065, 708840, 715533, 721773, 725374, 730008, 737652, 744922, 750294, 757399, 767588, 776759, 783108, 790429, 800093, 807413, 809758, 810540, 811349, 808054, 798824, 788206, 779023, 768017, 753743, 740725, 731260, 721089, 707881, 696076, 688429, 680847, 670724, 662474, 659368, 657601, 653881, 651267, 651980, 652101, 649083, 647096, 649184, 651493, 650881, 650819, 653994, 656562, 655621, 655037, 657844, 660153, 658616, 656767, 658068, 659868, 660108, 662598, 669633, 676780, 681001, 686469, 696345, 706498, 713633, 721843, 734660, 748414, 759998, 773267, 790901, 807829, 819763, 830479, 843497, 854445, 859001, 860589, 862794, 862051, 855394, 847569, 842720, 836905, 826714, 817257, 813420, 811124, 805635, 800637, 800480, 801333, 798917, 797291, 800877, 805296, 805266, 804219, 806906, 809898, 808789]
58378H08789j287L448M632J157J476O655P927L749K680O614P700M557M812Q919
58364H71828Q457L140K447P460Q491L657K184O203P023K926K603P395Q114L263
58350I45191K327P148Q206L338J686N197M849o51j457M013N457Q04L76O522Q985
58335A001991N337N798J2544J4761R805Q629J4256J5748R826P559J2819J5004
58323A134077J0111Q153J2687J3975R330R091J5465J7054J1275J0113J6604J8361
58311A286296J1782R379J5223J7036J0874R327J6338J8631J1668R158J6691K1014
58299A453417J6045J4106K0546K2857J6410J4882K3361K7412K0999J8521K6423
58288A674979L0200K3045J9689K7617L2347K6131K3200L1224L5839K9457K6981
$$ y = [808789, 807502, 810950, 815582, 816739, 818215, 824870, 832797, 836546, 839226, 845840, 853540, 858097, 862909, 871828, 880285, 883425, 885872, 893332, 901823, 905480, 907664, 913867, 920890, 923816, 926419, 933814, 941928, 945191, 947518, 954666, 962872, 966210, 967896, 973093, 977942, 977291, 975834, 979847, 985304, 986108, 986484, 993006, 1001991, 1007328, 1013126, 1025670, 1040431, 1050236, 1058865, 1073121, 1088869, 1098695, 1106254, 1119073, 1134077, 1144188, 1152341, 1165028, 1179003, 1188333, 1197424, 1212889, 1229943, 1241218, 1251331, 1267935, 1286296, 1298078, 1307457, 1322680, 1339716, 1350590, 1359917, 1376255, 1394886, 1406554, 1415712, 1432403, 1453417, 1469462, 1483568, 1504114, 1526971, 1543381, 1558263, 1581624, 1609036, 1630035, 1648556, 1674979, 1705179, 1728224, 1747913, 1775530, 1807877, 1834008, 1857208, 1888432, 1924271, 1953728, 1980709]
58277A980709L6441M2752L7393L5146M4237M9408M2368L8913M7544N1836M2843
58266B449590L7736M6580N2580M5602M2680N3951O1594N4790N1768O3905P2521
58255C033297O5464O1629P3915Q3498P7174P3933Q7226R7789R2191R0548J06584
58244C943248J18971J12958J10763J28578J44072J40114J39117J58845J76820
58235E173486J75151J77019K00328K20271K18030K20178K47684K73786K76650
58226G182583K83969L18678L52128L60676L75073M21149M67217M86155N11747
58217A0759375N73897O38421O74613P19368Q06345Q97928R60821J039396J175067
58208A8245231J326625J456154J615776J856089K132918K407981K752051L234056
$$ y = [1980709, 2017150, 2059902, 2097295, 2132441, 2176678, 2226086, 2268454, 2307367, 2354911, 2406747, 2449590, 2487326, 2533906, 2586486, 2632088, 2674768, 2728719, 2790313, 2845103, 2896871, 2960776, 3033297, 3098761, 3160390, 3234305, 3317803, 3394977, 3468910, 3556136, 3653925, 3746116, 3836664, 3943248, 4062219, 4175177, 4285940, 4414518, 4558590, 4698704, 4837821, 4996666, 5173486, 5348637, 5525656, 5725984, 5946255, 6164285, 6384463, 6632147, 6905933, 7182583, 7466552, 7785230, 8137358, 8498034, 8873107, 9294256, 9761473, 10247628, 10759375, 11333272, 11971693, 12646306, 13365674, 14172019, 15069947, 16030768, 17070164, 18245231, 19571856, 21028010, 22643786, 24499875, 26632793, 29040774, 31792825, 35026881]
58200C5026881L804815M418016N160309O118181P236746Q483147J0025631J2059519
58192I2333245J4605994J7719299K1715297K6872514L3042609L9811101M6561086
58185B92661145N1527840N1022865M1151109K1532355k952875k4985956l9600028
58178C90356455m6237063m7011723m4191689l9376373l3811020k8416466k3573196
58171A27738925j9315169j5702781j2810624j0526975q646844p100641n905492
58164D7730399m976140m169829l458656k892604k438084k001647j575883j220041
58156B4997515r18590n88149k10938J62796N45177J026083J642887K343473L102858
58147C2103112L941871M719545M977050M166044K148493n40403k996989m563358
$$ y = [35026881, 38831696, 43249712, 48410021, 54528202, 61764948, 70248095, 80273726, 92333245, 106939239, 124658538, 146373835, 173246349, 206288958, 246100059, 292661145, 344188985, 395211850, 436362959, 457895314, 454942439, 429956483, 390356455, 344119392, 297107669, 252915980, 213539607, 179728587, 151312121, 127738925, 108423756, 92720975, 79910351, 69383376, 60736532, 53635891, 47730399, 42754259, 38584430, 35125774, 32233170, 29795086, 27793439, 26217556, 24997515, 24078925, 23490776, 23279838, 23442634, 23987811, 25013894, 26656781, 29000254, 32103112, 36044983, 40764528, 45741578, 49907622, 52056115, 51515712, 48518723, 43955365]
58139D3955365n166037n123496m749385m196355l561276k957851k449683k016344
58131A3734938j634521j328471j110060r37683p75973o41271n50253m76120l95362
58122E885224l29679l00368k84038k54070k26343k23153k28019k16495j98880
58113C624179j93356j87321j63554j36490j25518j18508r7279p4017o7916o9877
58103B390343o3952o0020p1791q5148q1558p1573p2968p6708o6757n3140n2869
58092A633859n7082m9191l7673l9119m5571m0142k9337k9225l4223k9779k2027
58081A220490k5243l2896l0049k2150k3447k8822k4728j6519j7701k3117j9445
58070I56373j1745j3208j8805j5163o867p269j2398r426k197l352r291p638j782
$$ y = [43955365, 38789328, 33665832, 28916447, 24720092, 21158816, 18200965, 15751282, 13734938, 12100417, 10771946, 9661886, 8724203, 7948230, 7306959, 6756706, 6280586, 5885224, 5555545, 5255177, 4971139, 4717069, 4490726, 4267573, 4039554, 3823059, 3624179, 3430823, 3243502, 3079948, 2943458, 2817940, 2699432, 2602153, 2528136, 2460220, 2390343, 2326391, 2266371, 2194580, 2109432, 2027874, 1956301, 1883333, 1806625, 1739868, 1686728, 1633859, 1576777, 1527586, 1489913, 1450794, 1405223, 1365081, 1335744, 1306519, 1272296, 1242517, 1220490, 1195247, 1162351, 1132302, 1110152, 1086705, 1057883, 1033155, 1016636, 998935, 975818, 956373, 944628, 931420, 912615, 897452, 890585, 883316, 870918, 861492, 859295, 855943, 846652, 839014, 837232]
58057H37232l875j0762j0626o453r587j6587j5475q795q050j1350q472k135k641
58044G22424p026m865Q40m70n918m739P51L49l496p82N748N900K383N375J1739
58029G28213J0180K745P70L568J374m309l661J458N43n323n816j498k218p567
58015G18459q053l997m558r386r496n160n143r308r340n599o086r900q692l420
58001F20321k859o553n951j432j499o042o840l918m959r211q363k921j483m083
57987E54207k473L305M828J785K519P656R026N527M689P577P330L536L134O177
57973F18823N388P49j41K922K080l312n437l131l630p892q721n182m475p653p615
57958E72773l313j908m599m334nR24l281n261k414r73l157l168P30K639P50O05
$$ y = [837232, 833357, 822595, 811969, 805516, 795929, 779342, 763867, 755072, 747022, 735672, 727200, 725065, 722424, 715398, 710533, 711373, 710903, 704985, 700246, 700997, 701346, 697850, 697068, 702816, 708716, 711099, 716474, 728213, 738393, 741138, 741908, 745476, 746850, 742541, 738880, 740338, 740881, 735558, 729742, 728244, 726026, 718459, 710406, 706409, 701851, 692465, 682969, 677809, 672666, 663358, 654018, 648419, 642333, 632433, 623741, 620321, 617462, 610909, 604958, 603526, 602027, 595985, 589145, 585227, 580268, 571057, 562694, 559773, 558290, 554207, 551734, 555039, 559867, 561652, 564171, 571827, 580853, 586380, 591069, 598646, 605976, 609512, 612646, 618823, 624211, 624960, 624819, 627741, 629821, 626509, 621072, 617941, 614311, 606419, 597698, 592516, 588041, 580388, 572773, 569460, 567552, 562953, 558619, 558614, 559538, 556257, 550996, 548582, 547609, 544452, 541284, 542014, 544653, 545403, 546008]
57942E46008L589M078R30J04K797K770j606m191k856k976o240p441n397n702r568
57927E14299j1083q631p944j0700j1260p857n999p457o769k134J014O28J639N569
57913D43315P253N295N226Q712J0150P621O736R798J1483R309Q092R965J0015
57900E52970O128L352M150L889K89k050q63p02l965o377n573n426p857r078p733
57885E21154p942j0602j0638o612l985n093n121j972n91l212m639j941K76r64
57871D58118j447J623M131L239K792N495P703O875O471Q597R586P483O219P738
57857E34623P789M116J018J164P79k389m317k739k040n005p406o003m405n790
57843E09395p144n897n087o728p263m693l100m906n913l238r89k640m848m328
$$ y = [546008, 549597, 553675, 554605, 554709, 557506, 560276, 558670, 554479, 551623, 548647, 542407, 534966, 529569, 523867, 514299, 503216, 494585, 486641, 475941, 464681, 456824, 450825, 443368, 436599, 434465, 435479, 436107, 437746, 443315, 450568, 455863, 461089, 469801, 479951, 487572, 494308, 504106, 515589, 524898, 532990, 542955, 552970, 559098, 562450, 566600, 570489, 570778, 568728, 567865, 567163, 563198, 556821, 551248, 545822, 537965, 528887, 521154, 513212, 502610, 491972, 485360, 481375, 476282, 471161, 469189, 468598, 465386, 460747, 458806, 459082, 458118, 456671, 458294, 462425, 465664, 468456, 473951, 481654, 488529, 495000, 503597, 513183, 520666, 526885, 534623, 542412, 546528, 547546, 548710, 549489, 547100, 542783, 540044, 538004, 532999, 525593, 519590, 515185, 509395, 502251, 496354, 491267, 484539, 477276, 472583, 469483, 464577, 458664, 455426, 454437, 451797, 446949, 442621]
57829D42621l882o026p492n766m520o766r047q045o528p321p726n609m494o860
57815C52539q682o479l673m080n191l726j936k454k729m55J298J37m18K354M531
57800C21036K527K9J470M284M279L401N336Q308R041R327J2088J5208J5481J4505
57786D26320J4586J3268Q023K109l77j131l438n651m878l113l574m802m207l564
57772D29571n236o927n948m693o095p681o055l244k693k826p28J649J165k80O54
57757C80633K418J937Q60K317M610M295K508K401L187K546J933L664N670M851
57743D23830K834K813L651K709J444K470M035L115J227J496K802K404J504K542
57729D58876L958L315K658M948Q117Q615P956R686J2631J3359J2802J4172J6577
$$ y = [442621, 438739, 432713, 425221, 419455, 414935, 408169, 399122, 391077, 384549, 377228, 369502, 363893, 359399, 352539, 343857, 337378, 333705, 329625, 324434, 320708, 318772, 316318, 313589, 313134, 314432, 314569, 314151, 316505, 321036, 323563, 323592, 325062, 329346, 333625, 337026, 342362, 350670, 359711, 369038, 381126, 396334, 411815, 426320, 440906, 454174, 462197, 464306, 463929, 462798, 459360, 453709, 448831, 445718, 442144, 437342, 433135, 429571, 424335, 417408, 411460, 406767, 400672, 392991, 386936, 383692, 380999, 378173, 377445, 379094, 380259, 379979, 380633, 383051, 384988, 385848, 388165, 392775, 397070, 399578, 401979, 405166, 407712, 409645, 413309, 418979, 423830, 426664, 429477, 433128, 435837, 437281, 439751, 443786, 446901, 448128, 449624, 452426, 454830, 456334, 458876, 462834, 466149, 468807, 473755, 481872, 490487, 498443, 508129, 520760, 534119, 546921, 561093, 577670]
57716E77670J6875J5726J5936J6882J6516J6572J9874K4558K6987K8215L1524
57705H07335L5836L7856L8796M2510M8594N3647N7950O4610P3372Q1458Q9456
57694A431420J00395J14007J27686J42074J59970J80711K01226K21533K43536
57685B922558K65446K82938K94566L00373K96390K76657K40176J90610J30479
57676E200193O1737q827p1213j19595j53158j70674j70117j53481j26522r4177
57666D194166o1807m0239m2525p3136j23514j78258k22585k46314k47337k32469
57656B725982k10905j86590j59671j32721j09934r1453p4208n7946m5085l5333
57646A622136k5827j6262q691k635M483J2458J9029K4905L2910M2590N1087N8975
$$ y = [577670, 594545, 610271, 626207, 643089, 659605, 676177, 696051, 720609, 747596, 775811, 807335, 843171, 881027, 919823, 962333, 1010927, 1064574, 1122524, 1187134, 1260506, 1341964, 1431420, 1531815, 1645822, 1773508, 1915582, 2075552, 2256263, 2457489, 2679022, 2922558, 3188004, 3470942, 3765508, 4065881, 4362271, 4638928, 4879104, 5069714, 5200193, 5261930, 5253103, 5181890, 5062295, 4909137, 4738463, 4568346, 4414865, 4288343, 4194166, 4132359, 4092120, 4049595, 3976459, 3852945, 3674687, 3452102, 3205788, 2958451, 2725982, 2515077, 2328487, 2168816, 2036095, 1926161, 1834708, 1760500, 1702554, 1657469, 1622136, 1596309, 1580047, 1571356, 1568721, 1573204, 1585662, 1604691, 1629596, 1662506, 1705096, 1756183, 1815158]
57634A815158O9684Q3399R7008J10144J25686J44009J62178J79218J97002K15317
57624C198803K30990K42270K49087K48719K36204K09683J70858J20474N8750r477
57614D956361p5507j33604j82522k20482k44365k54788k56499k52399k41882k25891
57604B868422k08484j91961j75114j57565j41423j27445j13938j00631q9520q0893
57594A481448p2674o4449n7990n3137m7539m1219l6947l5169l2980k9093k5504
57583I84747k3287k1064j8552j7296j6990j5256j2064j0091r918r149p027n494
57571H18559m826k928O4J197j5l09J841M020M636N407P439R040R282R847J1648
57556H74902J3263J4114J5554J7655J8678J8752K0212K3354K6020K8153L2272
$$ y = [1815158, 1884842, 1968241, 2065249, 2175393, 2301079, 2445088, 2607266, 2786484, 2983486, 3198803, 3429793, 3672063, 3921150, 4169869, 4406073, 4615756, 4786614, 4907088, 4965838, 4956361, 4880854, 4747250, 4564728, 4344246, 4099881, 3845093, 3588594, 3336195, 3094313, 2868422, 2659938, 2467977, 2292863, 2135298, 1993875, 1866430, 1752492, 1651861, 1562341, 1481448, 1408774, 1344325, 1286335, 1233198, 1185659, 1144440, 1107493, 1072324, 1039344, 1010251, 984747, 961460, 940396, 921844, 904548, 887558, 872302, 860238, 850147, 840229, 831080, 824053, 818559, 813733, 810805, 810869, 812066, 812051, 811742, 813583, 817603, 822239, 827646, 835085, 844125, 853407, 863254, 874902, 888165, 902279, 917833, 935488, 954166, 972918, 993130, 1016484, 1042504, 1070657, 1102929]
57545A102929L8371M3257M6303N1015N9025O7462P4383Q2097R2582J04040J14747
57534A876211J26307J40176J54664J68021J81072J94062K04030K07770K04419
57525C456732J92929J70235J34563Q8205L5245k0645p4791j21395j57181j82785
57515C521112j99149k05588k02774j94148j82503j68130j51786j36120j22351
57506A958563j08814r4649q1784p1569o2632n3787m6006l9769l3637k7027k1343
57495A317546j6959j2233o915k902l16L408Q920J3393J5431J7614K2020K7114
57483A386121L1436L6566M3821N1505N8141O5230P4285Q4188R3948J04980J18279
57472B148500J32265J45752J59918J74979J87905J95704J97889J93476J78891
$$ y = [1102929, 1141300, 1184557, 1230860, 1281875, 1340900, 1408362, 1482745, 1564842, 1657424, 1761464, 1876211, 2002518, 2142694, 2297358, 2465379, 2646451, 2840513, 3044543, 3252313, 3456732, 3649661, 3819896, 3954459, 4042664, 4077909, 4057264, 3982473, 3861078, 3703897, 3521112, 3321963, 3116375, 2913601, 2719453, 2536950, 2368820, 2217034, 2080914, 1958563, 1849749, 1755100, 1673316, 1601747, 1539115, 1485328, 1439322, 1399553, 1365916, 1338889, 1317546, 1300587, 1288354, 1281439, 1278537, 1278221, 1281629, 1290549, 1303942, 1319373, 1336987, 1359007, 1386121, 1417557, 1454123, 1497944, 1549449, 1607590, 1672820, 1747105, 1831293, 1925241, 2030221, 2148500, 2280765, 2426517, 2586435, 2761414, 2949319, 3145023, 3342912, 3536388, 3715279]
57463C715279J51540J12833O5621J1848m4950r8259j42617j76642k00320k12669
57453C181664k14440k09579k01200j88934j72596j55183j39539j25229j11286
57444A663678r8921q8842p9146o8684n9466n3010m7530m1481l6529l3973l1659
57433A024437k7603k3502k1296j9509j6417j3728j3344j3409j1487q928q233q503
57421H38478p414n509m714m591l709k804l091l409k331j175j616k369j577l50
57407G93819m86q16O08K691L255K965L694M742M351L330L634M740M898M592N368
57392H41385O635O775O139N994N984N466N591P116Q041O662M926N460P165P328
57378I30667O238O047O644O381N443N122N029M415M609O758Q840Q482O995P025
$$ y = [3715279, 3866819, 3979652, 4045273, 4057121, 4012171, 3913912, 3771295, 3594653, 3394333, 3181664, 2967224, 2757645, 2556445, 2367511, 2194915, 2039732, 1900193, 1774964, 1663678, 1564757, 1475915, 1396769, 1328085, 1268619, 1215609, 1168079, 1126598, 1090069, 1056096, 1024437, 996834, 973332, 952036, 932527, 916110, 902382, 889038, 875629, 864142, 855214, 846981, 838478, 831064, 825555, 820841, 816250, 812541, 809737, 806646, 803237, 800906, 799731, 798115, 795746, 794169, 793819, 793333, 792517, 793125, 795816, 799071, 802036, 805730, 810472, 814823, 818153, 821787, 826527, 831425, 836017, 841385, 848020, 854795, 860934, 866928, 872912, 878378, 883969, 891085, 899126, 905788, 910714, 916174, 923339, 930667, 936905, 942952, 949596, 955977, 961420, 966542, 971571, 975986, 980595, 987353, 996193, 1004675, 1011670, 1018695]
57364A018695P938P529O539P289R138R554Q677Q635R312Q934Q052Q755J0504J0824
57350A140375R748R648J0922J1628J1256J1225J1779J1728J1211J1508J2356J2373
57338A275757J1794J1821J1980J1115J0199J0946J2531J2912J2503J3091J4071
57327A408720J3464J1968J2113J3919J5073J5027J5256J5866J5663J5215J6226
57316A568510J8051J8507J7817J8147J9532J9996J9468J9795K0949K1088K0393
57305A782253K1035K3138K4524K4655K5153K6207K6254K5561K6340K8779L0615
57294B064514L1155L2122L3930L4863L4798L6076L9522M2884M4385M4890M5532
57283B484671M6117M6801M8498N0735N1669N1009N0280M9692M7463M2867L7218
$$ y = [1018695, 1026633, 1034162, 1040701, 1047990, 1057128, 1066682, 1075359, 1083994, 1093306, 1102240, 1110292, 1119047, 1129551, 1140375, 1150123, 1159771, 1170693, 1182321, 1193577, 1204802, 1216581, 1228309, 1239520, 1251028, 1263384, 1275757, 1287551, 1299372, 1311352, 1322467, 1332666, 1343612, 1356143, 1369055, 1381558, 1394649, 1408720, 1422184, 1434152, 1446265, 1460184, 1475257, 1490284, 1505540, 1521406, 1537069, 1552284, 1568510, 1586561, 1605068, 1622885, 1641032, 1660564, 1680560, 1700028, 1719823, 1740772, 1761860, 1782253, 1803288, 1826426, 1850950, 1875605, 1900758, 1926965, 1953219, 1978780, 2005120, 2033899, 2064514, 2095669, 2127791, 2161721, 2196584, 2231382, 2267458, 2306980, 2349864, 2394249, 2439139, 2484671, 2530788, 2577589, 2626087, 2676822, 2728491, 2779500, 2829780, 2879472, 2926935, 2969802, 3007020]
57272C007020L1218K4103J6063Q774K903k442p273j0306j1461j2150j2700j1919
57260C021830r562o691l453Q13N219P903R176J1191J4352J7002J8759K1009K3740
57247C131288K5200K5238K5910K7938K9623K9968L0020L0479L0712L0777L1651
57236C448804L2968L3182L2375L2180L2807L2997L2970L4308L6695L8152L8648
57225C826086M0085M2402M3402M2839M2933M4158M4447M3406M3329M4824M5345
57214D303256M3606M1779M1576M1614M0412L8878L8014L7142L6006L5814L6679
57203D734776L6792L5493L4289L3651L1967K8934K6801K6677K6783K5989K5858
57192E068010K7460K9225L0007L1270L4218L7460L9575M1503M4409M7505M9711
$$ y = [3007020, 3038238, 3062341, 3078404, 3087178, 3090081, 3087639, 3080366, 3070060, 3058599, 3046449, 3033749, 3021830, 3012268, 3005577, 3002124, 3002937, 3008156, 3016059, 3025235, 3036426, 3050778, 3067780, 3086539, 3107548, 3131288, 3156488, 3181726, 3207636, 3235574, 3265197, 3295165, 3325185, 3355664, 3386376, 3417153, 3448804, 3481772, 3514954, 3547329, 3579509, 3612316, 3645313, 3678283, 3712591, 3749286, 3787438, 3826086, 3866171, 3908573, 3951975, 3994814, 4037747, 4081905, 4126352, 4169758, 4213087, 4257911, 4303256, 4346862, 4388641, 4430217, 4471831, 4512243, 4551121, 4589135, 4626277, 4662283, 4698097, 4734776, 4771568, 4807061, 4841350, 4875001, 4906968, 4935902, 4962703, 4989380, 5016163, 5042152, 5068010, 5095470, 5124695, 5154702, 5185972, 5220190, 5257650, 5297225, 5338728, 5383137, 5430642, 5480353]
57181E480353N1305N2351N1886N0104M8886M8728M7588M4205M0050L6653L3575
57170E985684L0388K7993K6465K4160K0506J7134J4990J2890J0211Q202P298O007
57158F191928L889K684L008K895J263j02L52J727L112N366Q772J1754J3585J5603
57144F265836J8203J9605J9098J8453J8546J7708J5033J2134R870O666J779k966
57132F419965o514j0176j4162j5987j4456j1730r380n908l15N386R583J3443J7544
57119F377293J9701J8628J6547J5802J6289J8286K4057L4165M5721N6653O8165
57108F711307Q1019R3586J06093J22603J46242J76450K13258K59785L18211L88177
57098H616731M71708N74546O99948Q46487J014310J207249J425808J664709J920214
$$ y = [5480353, 5531658, 5584009, 5635895, 5685999, 5734885, 5783613, 5831201, 5875406, 5915456, 5952109, 5985684, 6016072, 6044065, 6070530, 6094690, 6115196, 6132330, 6147320, 6160210, 6170421, 6178623, 6185921, 6191928, 6195817, 6198501, 6201509, 6204404, 6205667, 6205565, 6205917, 6207644, 6210756, 6216122, 6224894, 6236648, 6250233, 6265836, 6284039, 6303644, 6322742, 6341195, 6359741, 6377449, 6392482, 6404616, 6414486, 6421152, 6422931, 6419965, 6413451, 6403275, 6389113, 6373126, 6358670, 6346940, 6337560, 6331652, 6331337, 6336723, 6346306, 6359749, 6377293, 6396994, 6415622, 6432169, 6447971, 6464260, 6482546, 6506603, 6540768, 6586489, 6643142, 6711307, 6792326, 6885912, 6992005, 7114608, 7260850, 7437300, 7650558, 7910343, 8228554, 8616731, 9088439, 9662985, 10362933, 11209420, 12223730, 13430979, 14856787, 16521496, 18441710]
57089A8441710K192005K474345K753509L016722L253144L444332L571593L640640
57081D2788000L674438L656803L498663L096884K434224J600635P11759j72161
57073F1289245j042220j885820k660462l312090l798910m099632m215488m169781
57065C6104842l998642l738351l420849l075277k726047k389273k074506j788615
57057A2893282j535287j313526j120653r55627q17309p01915o05157n24827m58992
57048D859989m03942l56375l15591k81402k52063k26230k04484j86901j71361
57039B461640j56241j42412j30622j19384j07515r6464q7965q1380p5279o9642
57029A394736o4765n9933n4892n0608m7219m3274l8369l4201l1661k9301k6116
$$ y = [18441710, 20633715, 23108060, 25861569, 28878291, 32131435, 35575767, 39147360, 42788000, 46462438, 50119241, 53617904, 56714788, 59149012, 60749647, 61461406, 61289245, 60247025, 58361205, 55700743, 52388653, 48589743, 44490111, 40274623, 36104842, 32106200, 28367849, 24947000, 21871723, 19145676, 16756403, 14681897, 12893282, 11357995, 10044469, 8923816, 7968189, 7150880, 6448965, 5843808, 5318981, 4859989, 4456047, 4099672, 3784081, 3502679, 3250616, 3024386, 2819902, 2633001, 2461640, 2305399, 2162987, 2032365, 1912981, 1805466, 1709002, 1621037, 1539657, 1464378, 1394736, 1329971, 1270038, 1215146, 1164538, 1117319, 1074045, 1035676, 1001475, 969814, 940513, 914397]
57018I14397k3328k1803k0277j7801j5509j4154j2449r701p505o892o222m007
57006G54749j386M26K714P004J2496J8084K4742L3475M3329N4111O8767Q9881
56994A108392J16174J45844J79992K15990K37724K20474J51693M6261o1631j41907
56984B219006j84434j96185j88909j71577j50744j32058j18547j09039j00390
56975H67123r0924q0755p0043n8974m8745m0476l3301k5430j6996r950n233j927
56963C84369Q76L426O480J1034J6625K1903K6808L1892L5388L3536K4692J1151
56951F08180l445j6431k5620k9347k8273k5217k2142j8854j5063j1610q879o018
56939C97281k599O51L542P016J1503J6342K1308K7033L3415L9202M3031M3005
$$ y = [914397, 891069, 869266, 848989, 831188, 815679, 801525, 789076, 779375, 771870, 764978, 758756, 754749, 753363, 753789, 756503, 763507, 776003, 794087, 818829, 852304, 895633, 949744, 1018511, 1108392, 1224566, 1370410, 1550402, 1766392, 2004116, 2224590, 2376283, 2422544, 2360913, 2219006, 2034572, 1838387, 1649478, 1477901, 1327157, 1195099, 1076552, 967513, 867123, 776199, 695444, 625401, 566427, 517682, 477206, 443905, 418475, 401479, 391529, 386296, 384369, 385245, 388671, 395151, 406185, 422810, 444713, 471521, 503413, 538801, 572337, 597029, 608180, 604735, 588304, 562684, 533337, 505064, 479847, 457705, 438851, 423788, 412178, 403299, 397281, 394682, 395333, 398875, 405891, 417394, 433736, 455044, 482077, 515492, 554694, 597725, 640730]
56927F40730L5851J9631k199k2181l5174m1195m2172l9302l4316k9838k6657k3163
56915D00015j8761j5270j3747j2586j0423q258p152o222m671l548l713m095l620
56902B87949k942k748k343j336p28q99n45J005K487L082L943N973Q272J0290J3289
56887C24749J8067K3339K7809L1424L2956K9059J8306M221p942j5901k0131k1136
56875D44820j9369j6367j3455j0224n907j146L153P368J2101J6908K1490K6837
56863D66209L3823M2021N1077O1584P3091Q2281Q4162P4365N0920J6702j9346
56852A016889m6688o0910o5251o4173n8664m9019l8005k8316j9533j0275j026
56841E75029P548J6673K7376L8672N0147O3858Q1068R9574J16606J30825J37864
$$ y = [640730, 676581, 696212, 694013, 671832, 636658, 595463, 553291, 513989, 479673, 449835, 423178, 400015, 381254, 365984, 352237, 339651, 329228, 320970, 313818, 307596, 302925, 299377, 295664, 291569, 287949, 285007, 282259, 279916, 278580, 277852, 276953, 276408, 277413, 279900, 282982, 286925, 292898, 301170, 311460, 324749, 342816, 366155, 393964, 425388, 458344, 487403, 505709, 509930, 501988, 486087, 465956, 444820, 425451, 409084, 395629, 385405, 379498, 378352, 381505, 388873, 400974, 417882, 439372, 466209, 500032, 542053, 593130, 654714, 727805, 810086, 894248, 968613, 1019533, 1036235, 1016889, 970201, 909291, 844040, 779867, 721203, 672184, 634179, 605863, 586330, 576055, 575029, 582577, 599250, 626626, 665298, 715445, 779303, 860371, 959945, 1076551, 1207376, 1345240]
56830A345240J27454R1296L3929k8178p8632j10065j23282j22700j13654j00714
56820I20694q6267p1136n6248m2487k9727j7584o499L330J3242K4701L7464N0681
56808G40164O4788Q0340R5101J03348R7959P3928L2626j6076n8392q5641r8130
56797A030015j00274r5029q4533p2214o0785m9932l8723k8408k0395j3509o048
56786D60165J342P599J4126K2732L2371M0920M8256N4149N4614M4399K3127l712
56774H00088k9203m8348n8558o0252n6860n1818m5914l8973l2418k7670k3684
56763C26390j8926j4460j2231j1467r842p239n429m805m288l724l656l475k322
56750B24526j090j107j729j622j253j713k281j767j006j338j931j422p69j544
$$ y = [1345240, 1472694, 1563990, 1597919, 1569741, 1491109, 1381044, 1257762, 1135062, 1021408, 920694, 834427, 763291, 707043, 664556, 634829, 617245, 610746, 614076, 627318, 652019, 689483, 740164, 804952, 885292, 980393, 1083741, 1181700, 1255628, 1288254, 1272178, 1213786, 1128145, 1030015, 929741, 834712, 750179, 677965, 617180, 567248, 528525, 500117, 479722, 466213, 460165, 461507, 469106, 483232, 505964, 538335, 579255, 627511, 681660, 736274, 780673, 803800, 800088, 770885, 722537, 663979, 603727, 546867, 495049, 449135, 410162, 377744, 350074, 326390, 307464, 293004, 280773, 269306, 259464, 252225, 246796, 241991, 237703, 233979, 230323, 226848, 224526, 223436, 222329, 220600, 218978, 217725, 216012, 213731, 211964, 210958, 209620, 207689, 206267, 205498, 203954]
56736B03954k754k526j604j894k745k133n17k0o51p66n08j293k581k635j853j954
56720A77520k452j469M76J036N8m68j49m25j286j223m04m89j363j229%O12L29
56703A69074M62R47L73r85j305m77k19r11j194p45o20q64n13K29L70L05Q80J113
56685A65920k27j571m21K413L845L207K395K008J057N5N06J564J023o12q82J02
56669A80382o4j427j625n10n37k091k695j543p22j150j228m01j72p06k44J169
56653A66436J193o68k076j969j964k689k521j114n14j436j979j289j058k015k376
56638A43961j245l00o26r12k21L81K42L89J160J353P57Q51K046K885K703K414
56622A55838K189J262L33J013K545K522J088Q57K183K443P32o86n92n11j198j209
$$ y = [203954, 201200, 198674, 197070, 195176, 192431, 190298, 189781, 189761, 189110, 188344, 187836, 186543, 183962, 181327, 179474, 177520, 175068, 173599, 174075, 175111, 175169, 174701, 174552, 174127, 172841, 171618, 171214, 170725, 169362, 168133, 168133, 168745, 169074, 169536, 170483, 170856, 169871, 168566, 168089, 167870, 166959, 165765, 165020, 164400, 163536, 163023, 163252, 163622, 163927, 164807, 165920, 165693, 164122, 163701, 166114, 169959, 173166, 175561, 177569, 178626, 178681, 179187, 180751, 181774, 181162, 180280, 180382, 180318, 178891, 177266, 176756, 176219, 174128, 171433, 169890, 169168, 168018, 166790, 166389, 166217, 165511, 165267, 166436, 167629, 166961, 164885, 162916, 160952, 158263, 155742, 154628, 154114, 152678, 150699, 149410, 148352, 146337, 143961, 142716, 142416, 141790, 140878, 140657, 141038, 141280, 141669, 142829, 144182, 144939, 145790, 147836, 150721, 153424, 155838, 158027, 159289, 159622, 160635, 163180, 165702, 166790, 167647, 169830, 172273, 173005, 172319, 171727, 171216, 170018, 168809]
56606A68809k10J7r26j126l9N76L44J069K785L063J424L89P98L87j552k415r81
56589A72412L06k28q09m7N52L5J11J597K434J499Q13J726K502J866J409K201K595
56572A90974J602J046K083L035K822L067M642N674N237N393P277Q766Q448Q242
56558B58308R492J0212Q923P664Q291R114Q123O418N593M763K951J440J129M92
56544C42913j456l087l354l864n520o514n942n898p475q379p115n899o534p111
56530B64765n813m346m480m648l341k325l197m032k910j562k111l171k670j610
56516B18549j677j997j432j253k392k976j654l97r41j649r75o55k138l297k160
56501A92956o52r80j655p03L89j85o76R59K958K838J728J727J820L42j268j037
$$ y = [168809, 168599, 168616, 167690, 166564, 166525, 167101, 167445, 168514, 171299, 174362, 175786, 176175, 176973, 177360, 175808, 173393, 172412, 172718, 172490, 171681, 171634, 172186, 172221, 172332, 173929, 176363, 177862, 178675, 180401, 182903, 184769, 186178, 188379, 190974, 192576, 193622, 195705, 198740, 201562, 204629, 209271, 214945, 220182, 225575, 232852, 241618, 250066, 258308, 267800, 278012, 286935, 294599, 302890, 312004, 320127, 326545, 332138, 336901, 339852, 341292, 342421, 342913, 341457, 338370, 335016, 331152, 325632, 319118, 313176, 307278, 299803, 291424, 284309, 278410, 271876, 264765, 258952, 254606, 250126, 245478, 242137, 239812, 236615, 232583, 229673, 228111, 226000, 222829, 220159, 218549, 216872, 214875, 213443, 212190, 209798, 206822, 205168, 204771, 203830, 202181, 201206, 200551, 198413, 195116, 192956, 192304, 191324, 189669, 188966, 189355, 189170, 188494, 189453, 192411, 195249, 196977, 198704, 200524, 200866, 199598, 198561]
56485A98561j46l22l56J090K157J104K9J342L445L824L470M252M905L753K504
56470B29612L188M197L531K881M263N697M722L188L907N579N666N317O597P732
56456B96077O235L999M146N373M583K659K363K942K060P99J412K327Q47j289n18
56441C34015K199L096J939J330J290q9k102k685k819m669o945p003n926o507p855
56426B97269p191n338n196o268n912m500m202m155k126M83O24q62r00L8p89k801
56410B48174l173k275k636l647k702m67K34l55J7O54o92k814k805j542j973l279
56394B20719k405p8M05p18m59J052J209M09J117K507J793J9O67L324M539M140
56378B38240M796O120N238K708J853K696K297O71N48J725J505J88M42J725J093
$$ y = [198561, 198415, 198093, 197737, 198827, 200984, 202088, 202117, 203459, 206904, 210728, 214198, 218450, 223355, 227108, 229612, 232800, 236997, 240528, 243409, 247672, 253369, 258091, 261279, 265186, 270765, 276431, 281748, 288345, 296077, 302312, 306311, 310457, 315830, 320413, 323072, 325435, 328377, 330437, 331236, 332648, 334975, 335822, 334533, 334015, 336214, 339310, 341249, 342579, 343869, 343780, 341678, 338993, 336174, 331505, 324560, 317557, 311631, 305124, 297269, 290078, 284740, 279544, 273276, 267364, 262864, 258662, 254507, 252381, 252864, 253488, 252626, 251726, 251764, 250975, 248174, 245001, 242726, 240090, 236443, 233741, 233274, 233508, 233153, 233170, 233824, 233132, 230318, 227513, 225971, 223998, 220719, 218314, 218236, 218641, 217923, 217464, 218516, 219725, 220134, 221251, 223758, 225551, 225570, 226237, 229561, 234100, 238240, 243036, 249156, 254394, 257102, 258955, 261651, 263948, 264619, 265167, 266892, 268397, 268585, 269027, 270752, 271845]
56363B71845r04r92P57J355P05J134J972O19j722j507O34J054oQ48L214L371J360
56346B83737R31K561L072K060K217L355K658P82J199L534M086K856L355N605O139
56331C28147M934N432P555P665N701N481P521Q399P479P550Q580P790N975O706
56317D24915R174R061O578O067P553O534K657N21J133N99j793k250m41o41l431
56302D66236m224j697Q0m67j16J926K289P12J259M455N836M291M108O819Q695
56287E00202Q338R078J1800J3057J2329J3455J6863J8270J7113J8178K2615K5585
56275F86883K5287K6035K9773L2782L3701L6581M2867M8430N1657N6621O5040
56264A135657P3109P9435Q8027J00122J11160J19421J29586J44046J58486J69739
$$ y = [271845, 270941, 269949, 270706, 272061, 272766, 273900, 275872, 276491, 274769, 273262, 273896, 274950, 274944, 275792, 279006, 282377, 283737, 284668, 287229, 290301, 292361, 294578, 297933, 300591, 301373, 302572, 306106, 310192, 313048, 316403, 322008, 328147, 333081, 338513, 346068, 353733, 359434, 364915, 372436, 380835, 388314, 395864, 404444, 412234, 418209, 424915, 434089, 443150, 449728, 455795, 463348, 469882, 472539, 473060, 474193, 474792, 472999, 470749, 470308, 469667, 466236, 462012, 460315, 460395, 459928, 459812, 461738, 464027, 464739, 465998, 470453, 476289, 480580, 484688, 491507, 500202, 508540, 517618, 529418, 542475, 554804, 568259, 585122, 603392, 620505, 638683, 661298, 686883, 712170, 738205, 767978, 800760, 834461, 871042, 913909, 962339, 1013996, 1070617, 1135657, 1208766, 1288201, 1376228, 1476350, 1587510, 1706931, 1836517, 1980563, 2139049, 2308788]
56254B308788J80294J91268J98774K01045K01497K00989J94638J80024J61028
56245D018345J40041J14135Q2700N1002K2382n438l2782n4876o9910q2234r3806
56234D089559j00548j00931r9808r9882r7784r2627q9717r1469r3284r2788r4534
56223C036187j00899j07058j09823j12825j18071j21055j19358j17426j17771
56214B011901j15978j09657j03599j00628r6154q7279p8681p3774o8656o0458
56204A117037n3153m9293m4716l7113l1234k9845k8260k3581k0341k1075k0523
56193G57903j5481j1211j1582j2048q920o414p747q387n064k372l519l758O3K847
56179F64310J247O86M981Q619P057N199P682J0268Q918P934J0856J2673R468O295
$$ y = [2308788, 2489082, 2680350, 2879124, 3080169, 3281666, 3482655, 3677293, 3857317, 4018345, 4158386, 4272521, 4355221, 4406223, 4428605, 4423167, 4390385, 4335509, 4265599, 4183365, 4089559, 3989011, 3888080, 3788272, 3688390, 3590606, 3497979, 3408262, 3316793, 3223509, 3130721, 3036187, 2935288, 2828230, 2718407, 2605582, 2487511, 2366456, 2247098, 2129672, 2011901, 1895923, 1786266, 1682667, 1582039, 1485885, 1398606, 1319925, 1246151, 1177495, 1117037, 1063884, 1014591, 969875, 932762, 901528, 871683, 843423, 819842, 799501, 778426, 757903, 742422, 731211, 719629, 707581, 698661, 692247, 684500, 676113, 671049, 668677, 665158, 661400, 661463, 664310, 665557, 666243, 671224, 679843, 686900, 692099, 699781, 710049, 718967, 726901, 737757, 750430, 759898, 766193]
56165G66193P242P333K781o16J772M281J680r25J581M157J601j033J838N728N349
56150H08962M966R276J3428J2595J2044J7126K2738K3389K4273L1323L9819M4144
56138A064083M9245O1000P4605Q4187R4443J10626J26304J33073J33437J32108
56128B063111J24356J05756Q4346P0083O0938N1529M5694M7166M7403L6776J9645
56117B756803N209p435k1894l2056l1801k8570l3079m3737n4512o8547q9440j08444
56105B242497j15592j15032j14960j11762r9239q3896p5098o8975n7832m6377
56095A353734m2448m0969l3580k5222k4394k6035k1113j4074j3546j4897r687
56084A087769l258m815q992n670Q15P66j687K558Q630O979K639N692J1383R620
$$ y = [766193, 773435, 780768, 783549, 782933, 784705, 788986, 790666, 789741, 791322, 795479, 797080, 796047, 797885, 803613, 808962, 813928, 823204, 836632, 849227, 861271, 878397, 901135, 924524, 948797, 980120, 1019939, 1064083, 1113328, 1174328, 1248933, 1333120, 1427563, 1538189, 1664493, 1797566, 1931003, 2063111, 2187467, 2293223, 2377569, 2447652, 2508590, 2560119, 2605813, 2652979, 2700382, 2737158, 2756803, 2762012, 2754577, 2732683, 2700627, 2668826, 2640256, 2607177, 2563440, 2508928, 2440381, 2350941, 2242497, 2126905, 2011873, 1896913, 1785151, 1685912, 1602016, 1526918, 1457943, 1400111, 1353734, 1311286, 1270317, 1236737, 1211515, 1187121, 1161086, 1139973, 1125899, 1112353, 1097456, 1087769, 1084511, 1079696, 1070704, 1065034, 1065849, 1066615, 1064928, 1067486, 1076116, 1083095, 1085734, 1091426, 1102809, 1112429]
56070A112429N291Q754J5105J3651R116J2279J8409J6509J1235J3625J9018J6451
56058A271872J1058J4286K0824J8615J2763J5651K2382K0546J5238J9114K6716
56047A469065K4570J7971K1103K9253K8084K2009K5434L4011L3055K6623K9407
56036A760585L7470L6362L0456L4448M3581M2725L6992M2226N3056N2461M5106
56025B215468M8388N8323N7914N1360N5473O5152O2850N4243N8066O8769O6892
56014B862898N8098O2859P5745P5508O7432P3651Q9227R1356Q4619R2142J09146
56003C742681J11743J04899J13587J32931J36978J30523J40794J63579J71014
55994D948729J67083J80080K05418K13434K08942K23240K51844K62427K60069
$$ y = [1112429, 1117720, 1126474, 1141579, 1155230, 1164346, 1176625, 1195034, 1211543, 1222778, 1236403, 1255421, 1271872, 1282930, 1297216, 1318040, 1336655, 1349418, 1365069, 1387451, 1407997, 1423235, 1442349, 1469065, 1493635, 1511606, 1532709, 1561962, 1590046, 1612055, 1637489, 1671500, 1704555, 1731178, 1760585, 1798055, 1834417, 1864873, 1899321, 1942902, 1985627, 2022619, 2064845, 2117901, 2170362, 2215468, 2263856, 2322179, 2380093, 2431453, 2486926, 2552078, 2614928, 2669171, 2727237, 2796006, 2862898, 2920996, 2983855, 3059600, 3135108, 3202540, 3276191, 3365418, 3456774, 3541393, 3633535, 3742681, 3854424, 3959323, 4072910, 4205841, 4342819, 4473342, 4614136, 4777715, 4948729, 5115812, 5295892, 5501310, 5714744, 5923686, 6146926, 6398770, 6661197, 6921266]
55985F921266K79495L16543L35385L40178L68329M15899M44562M59854N03660
55976A0385171N71208O18651O51313P16484Q10080Q84278R47217J054796J203397
55967A7842595J338339J470040J666006J925854K190889K481218K885045L406641
55959C5206627L977548M625561N461993O493221P643592Q986135J0732078J2973433
55951I6100188J5701658J9112553K3558984K9108379L5453855M2156934M8144625
55944C09337176N0583874M5339959L0131198P593689j5589178l3137452m2725614
55937C51533652m5637682m4208165m0248491l5082314k9761844k4869588k0528007
55930A11197561j6772519j3700530j1278991r312893p676501o379677n386250
$$ y = [6921266, 7200761, 7517304, 7852689, 8192867, 8561196, 8977095, 9421657, 9881511, 10385171, 10956379, 11575030, 12226343, 12942827, 13752907, 14637185, 15584402, 16639198, 17842595, 19180934, 20650974, 22316980, 24242834, 26433723, 28914941, 31799986, 35206627, 39184175, 43809736, 49271729, 55764950, 63408542, 72394677, 83126755, 96100188, 111801846, 130914399, 154473383, 183581762, 219035617, 261192551, 309337176, 359921050, 405261009, 435392207, 442985896, 427396718, 394259266, 351533652, 305895970, 261687805, 221439314, 186357000, 156595156, 131725568, 111197561, 94425042, 80724512, 69445521, 60132628, 52456127, 46076450, 40690200]
55923D0690200m564407l848580l279868k855760k489883k145846j872062j677395
55915A7956399j497518j308696j158434j059295r59442q41337p49409o97223o40535
55906I044510n64054n07106m81912m49186l95625l57418l46506l27583k88180
55897E326940k61064k57489k45364k13072j91038j90735j83332j57630j40902
55888C486314j43761j40207j20297j09079j15591j14695r6734q5603r0879r0171
55878B379297p5204o8361p7288p8824o4246n6023o3492o5156n1458m2879m8951
55867A687415n0168l7495l0378l8402m3028l4301k9043l5958l8310k7805k1157
55856A301370k6596k7536j5617p167j0819j0739J864J1663R154P194J2138Q800
$$ y = [40690200, 36125793, 32277213, 28997345, 26141585, 23651702, 21505856, 19633794, 17956399, 16458881, 15150185, 13991751, 12932456, 11973014, 11131677, 10382268, 9685045, 9044510, 8480456, 7973350, 7491438, 7042252, 6646627, 6289209, 5942703, 5615120, 5326940, 5065876, 4808387, 4563023, 4349951, 4158913, 3968178, 3784846, 3627216, 3486314, 3342553, 3202346, 3082049, 2972970, 2857379, 2742684, 2645950, 2560347, 2469468, 2379297, 2304093, 2235732, 2158444, 2079620, 2015374, 1959351, 1895859, 1830703, 1779245, 1736366, 1687415, 1637247, 1599752, 1569374, 1530972, 1487944, 1453643, 1424600, 1388642, 1350332, 1322527, 1301370, 1274774, 1247238, 1231621, 1224454, 1213635, 1202896, 1204760, 1216423, 1225577, 1232771, 1244909, 1253709]
55844A253709r617k5682k7934k8967l7810m2185l4417k8096l2399l5330k8451
55833I22821k3380k7996l0609k3392j7921k1986k4123j6394r971j2977j5031q829
55821F90212n238j1841j7579j3790j0043j4268j7226j1373n703p461q015j078
55809E66597L896L30k116L554P737K880k040O54K894k169o249k686J0n075r738
55794E58479p265n911j2256j7574j4335j0346j2971j5126j0453o751j0547j3602
55782D21342q562l173n168p576k923K224O85j364K344M545j895r688j0334r074
55768C71383j3044j6783j3267p765p385p882l619L90j280l329p33M09n104j0220
55754B81771q275n454q574j1989r045n147o841q920n163j046l033n789k823N26
$$ y = [1253709, 1244092, 1218410, 1190476, 1161509, 1123699, 1081514, 1047097, 1019001, 986602, 951272, 922821, 899441, 871445, 840836, 817444, 799523, 777537, 753414, 737020, 727049, 714072, 699041, 690212, 684974, 673133, 655554, 641764, 631721, 617453, 600227, 588854, 583151, 575690, 567675, 566597, 570493, 570823, 568707, 572261, 579998, 582878, 580838, 581492, 584386, 582217, 575968, 573282, 573292, 568217, 558479, 551214, 545303, 533047, 515473, 501138, 490792, 477821, 462695, 452242, 445491, 434944, 421342, 412780, 409607, 404439, 396863, 393940, 396164, 396849, 395485, 397829, 402374, 400479, 390791, 380457, 371383, 358339, 341556, 328289, 320524, 313139, 305257, 301638, 302028, 300748, 297419, 296686, 297095, 291991, 281771, 273496, 268042, 259468, 247479, 238434, 233287, 226446, 217526, 212363, 211317, 208284, 202495, 199672, 200198]
55740B00198k434o419m280n90k246m971k150K043J071j224J131L997J519j915
55726A83730l86J479k440p190n757k338m025p233n165j156j877m381k447J109
55712A41923O00r47J713M832K857j9K607P001O415L958O199J0259R436N809N362
55697B08005O130K912j635k018o38k505m759k505O40j124m581l719j318l096n989
55682A83800l874N04Q38p22J531N079M009Q66J867M798L355o05q27J342K09k720
55666A99450j855J274J082j078J10L137K648K8M72K555J251j694q91K159J968
55651B10616m50j85J379p71n133o305n143o403q976q295n780o177q114p000m497
55636A38766n376p750o362k850k800n192m732k194k360m114k631O31K63k749k838
$$ y = [200198, 197764, 191345, 187065, 186475, 184229, 179258, 177108, 179151, 180222, 178998, 180129, 184126, 185645, 183730, 183344, 184823, 182383, 175193, 169436, 167098, 163073, 155840, 150675, 149519, 147642, 143261, 140814, 141923, 142523, 141576, 143289, 148121, 150978, 150959, 153566, 160567, 166982, 170940, 177139, 187398, 196834, 202643, 208005, 214135, 217047, 215412, 213394, 212756, 210251, 205492, 202987, 203627, 202503, 197922, 194203, 192885, 189789, 183800, 179926, 180430, 181268, 180546, 182077, 187156, 191165, 192031, 193898, 198696, 202051, 201446, 200619, 201961, 202170, 199450, 197595, 198869, 199951, 198873, 198983, 202120, 204768, 204796, 205268, 207823, 209074, 207380, 206489, 208648, 210616, 210166, 209981, 211360, 210589, 205456, 199151, 194008, 187605, 178629, 170334, 164554, 158377, 150263, 143263, 138766, 133390, 125640, 119278, 116428, 113628, 108436, 103704, 101510, 99150, 95036, 92405, 93036, 93299, 90550, 87712]
55621H7712k33J65j511j132N42n10k857j921Q43M61j849j074J510N16l101l680
55605G3881j457j586l856l384n79n23l096l282q46k89j738j087J280J022j389
55590E3071j333J064J522K55J232L521K526q44j296J051J117j433k034m21q17
55575E7181l071k748n2K94j839j864L80L44k225k739o44j34j608j113J313J403
55559D2878p88o58K046K636M27k54J368J396n55m94J763J921l20n08J891K374
55543E5123J30l63K164L767L051L078M284L394O75M06K809L302J073M95K647L396
55527H9431J545R12K557K673J92j170l31q36l500m483k751k176m127n089l703
55512F9144l103m250l905j358k62j687k145n38k68k347l203j464l43j226j383
$$ y = [87712, 87479, 87644, 86133, 85001, 85543, 85033, 82176, 80255, 81098, 81559, 79710, 78636, 80146, 80662, 77561, 73881, 72424, 70838, 66982, 63598, 63019, 62496, 59400, 56118, 55272, 54983, 53245, 52158, 53438, 54460, 53071, 51738, 52802, 54324, 54579, 55811, 59332, 61858, 61014, 59718, 60769, 61886, 60453, 58419, 57998, 57181, 54110, 51362, 51310, 51604, 49765, 47901, 48281, 48625, 46400, 43661, 43017, 42883, 41275, 40162, 41475, 42878, 42090, 41432, 43478, 46114, 46541, 46287, 47655, 49051, 48496, 48002, 49765, 51686, 51366, 50858, 52749, 55123, 55253, 54890, 57054, 60821, 63872, 66950, 71234, 74628, 75303, 75709, 78518, 81820, 82893, 83388, 86035, 89431, 90976, 91888, 94445, 97118, 97310, 96140, 95809, 94973, 91473, 86990, 84239, 82063, 77936, 72847, 69144, 66041, 61791, 57886, 56528, 56266, 54579, 52434, 51896, 51628, 49281, 46078, 44614, 44271, 43045, 41662]
55497D1662k6r3k076k636j239j570m399n740m073k811l538l497j837j663B892
55481i13j169O49p2k87d15A412l80a285k431k953m405l884r85O39j95k75J495
55464a4279K012N05M48K706L394J095l16J196g77G60J088K378K295m17k118o53
55448C333R72M14k69L83K80j270j366Q12J824K58n96Q70J493l93j621l39M14j283
55430C916A543n62J513J384Q46J644K011Q50L45J407J424n71j571k04N96p80j652
55413H223n02J03j123j460K47R72n50j002J196K589J092j65J077K011M97p37M90
55396A2958J571L42q03K0K75j723k815n78K034J825L96P8m29k263k977j099M34
55379G246o54j929j023K05n1J03J761K082l53j979k45J826J271M01J784L018J440
$$ y = [41662, 41636, 41543, 39467, 36831, 35592, 34022, 29623, 23883, 19810, 16999, 13461, 9964, 8127, 6464, 2892, -913, -2082, -1433, -1505, -1792, -415, 1412, 1032, -1285, -3716, -6669, -11074, -14958, -15943, -15304, -15499, -15774, -14279, -12267, -11762, -11314, -8608, -5214, -4119, -4435, -3239, -777, 760, 1848, 4226, 6521, 6104, 3986, 3333, 4305, 4719, 4450, 4833, 5113, 3843, 2477, 3289, 5113, 5371, 4775, 5645, 7138, 6745, 5124, 4785, 5199, 3916, 1543, 981, 2494, 3878, 4724, 6368, 8379, 9229, 9574, 10981, 12405, 11834, 10263, 10059, 10655, 9875, 8223, 7721, 7824, 6701, 5241, 5488, 6460, 5910, 4908, 6104, 8693, 9785, 9620, 10697, 12708, 13205, 12468, 12958, 14529, 14871, 14068, 14088, 14363, 12640, 9825, 9247, 11281, 13106, 13502, 13580, 13151, 10888, 7911, 6812, 7246, 6592, 4663, 3640, 3845, 3794, 3897, 5658, 7740, 7387, 5408, 5163, 6989, 8260, 8661, 10445, 13463, 14903]
55362A4903n68pJ205J97j460j148k49r84j893j050k12j323k392j183N26N24K87
55345E173J481K238R44j67O56R39j246l033j754J22k68q58R72K897J864p2M44
55328A0332J941J237o36r62o46j739k657j061J241J235q8k55j38j463k413o85
55312C243J813K070J122J392J745O5j980j728m61p72j586o14Q18L04q36j29J188
55295E654O29n96N5J608J752J445K534L375J692o00m35R41M96r42o19P03M30p86
55277A7336o55l8j111k679k157m91k55p49K80J870J695P27J268K214J162o48m32
55260A7337Q89N82o20j57J138O21r49r57j03q75k269j370R79J376k14q25P2M31
55242A5086J11O47J295N8k079k465j449j344j807q28P73N63p59n68P34O63l62
$$ y = [14903, 14335, 14328, 15533, 15730, 14270, 13122, 12873, 11889, 9996, 8946, 8734, 7411, 5019, 3836, 4362, 4886, 5173, 6654, 8892, 9836, 9669, 10325, 11264, 10018, 6985, 5231, 5353, 5085, 4227, 5199, 8096, 9960, 9888, 10332, 12273, 13510, 12874, 11912, 11266, 9527, 6870, 5809, 7050, 8285, 8197, 7942, 7804, 6341, 3928, 3243, 5056, 7126, 8248, 9640, 11385, 11450, 9470, 7742, 7281, 6509, 4923, 4309, 5127, 5431, 4595, 4466, 5654, 6283, 5687, 5742, 7350, 9102, 10547, 13081, 16456, 18148, 17548, 17113, 18054, 18550, 17608, 16989, 17692, 18122, 17336, 16681, 16643, 15532, 12853, 10696, 10205, 9950, 9201, 9481, 11351, 13046, 13773, 15041, 17255, 18417, 17769, 17337, 18226, 18808, 18188, 18031, 19169, 19790, 18841, 17884, 17781, 16906, 14637, 13267, 14246, 15622, 15408, 14583, 14655, 15086, 15197, 15844, 17139, 17197, 15118, 12653, 11204, 9860, 8053, 7225, 7998, 8561, 7802, 7234, 7968, 8631, 8269]
55225H269J42J666J413m64j065P7O53M9j20L52K02j59O75J829J445L25M60J081
55207A6830K82q25L0J665J305k34r2J141O39j013p81R57R32r53j510j27N44j35
55189A8655O1J329J224n28j284k73L27k75k85Q21J309O65K99L74m01j639j573
55172A8806n21m18j030m58Q53N61j231k005j144l69j00P09J432M52j219j133K47
55155A3432M19l72L29K259K629J166K83L30p34k699k942j281m15j044r57M24J061
55138A1888M21L15R53M88r52j005M86J034J31N3J294J555J92m91N16J386J239
55121A9503J506K506K463J092M61J232J512M62l61j57j06o39p31m30r65j955j784
55104B3609p86o70r22M38K650K892J174K67O33k8j793j858L34J885J435R65J555
$$ y = [8269, 8411, 10077, 11490, 11026, 9961, 10038, 10691, 10740, 10620, 10972, 11174, 11015, 11690, 13519, 14964, 15289, 15749, 16830, 17112, 16287, 16317, 17982, 19287, 19053, 18961, 20102, 20741, 19728, 18947, 19904, 20836, 19883, 18373, 18246, 18790, 18655, 18716, 20045, 21269, 20741, 19457, 19184, 19511, 19236, 18951, 19772, 21081, 21746, 22045, 22419, 22018, 20379, 18806, 18285, 17867, 16837, 16379, 17232, 17793, 16562, 14557, 13413, 13044, 12944, 13653, 15085, 15537, 14318, 13185, 13432, 13851, 13479, 13808, 16067, 18696, 19862, 20145, 20475, 19741, 17042, 14100, 12819, 12404, 11360, 10403, 10827, 11888, 12309, 12624, 13577, 14065, 13113, 12108, 12594, 13628, 13759, 13812, 15106, 16661, 16853, 16362, 16878, 18264, 19503, 21009, 23515, 25978, 27070, 27531, 28763, 30275, 30737, 30376, 30219, 30113, 29474, 28743, 28313, 27348, 25393, 23609, 22823, 22153, 21231, 21669, 24319, 27211, 28385, 28652, 29285, 29257, 27464, 25606, 25940, 27825, 29260, 30225, 31780]
55087C1780J630O47L55J136J057j80l53J079J813R30L41Q79R16j8j74O73M65j006
55069D1970j231M01J281J66q33l91l5o27o54M36R18K44J06P60K61j424j672K6
55051C9702P81n42j216M11K050J702P42O23K91q39j089R6N40p15j341J00J509
55034D2805J066K77Q01J453P61l67q01j197j903j717n04j14j038j226J46J074
55018C9516N67N46K047K998J968P03P18O77o18j809j757j621k125j899n99l50
55002C8962j853k488o49J321J079l4J25R04Q08L09K43l3p10l95J046J395j74j302
54984C8554m25O12J56m04K89Q60K02r5J112J987J117L07J208K217J646R67J849
54967E2159K849K208J259J819K763K385J816K808M409M888M936N906P006P161
$$ y = [31780, 33410, 34057, 34412, 35548, 36605, 36425, 36072, 37151, 38964, 39894, 40235, 41114, 42030, 42012, 41838, 42511, 42976, 41970, 40739, 41140, 42421, 42587, 41754, 41363, 41328, 40701, 40047, 40483, 41401, 41645, 41751, 42511, 42772, 41348, 39676, 39702, 40483, 39941, 38725, 39136, 41186, 42888, 43630, 44253, 44544, 43705, 42616, 42712, 43252, 42537, 41196, 41296, 42805, 43871, 44148, 44949, 46402, 47163, 46796, 45995, 44798, 42895, 41178, 40674, 40560, 39522, 38296, 38442, 39516, 40083, 40629, 42676, 45674, 47642, 48345, 49063, 49740, 49122, 47313, 45556, 43935, 41810, 39911, 39312, 38962, 37109, 34621, 33972, 35293, 36372, 36338, 36463, 37367, 38175, 38484, 38727, 38694, 37984, 37589, 38635, 40030, 39856, 38554, 38129, 38741, 38897, 38493, 38782, 39642, 39844, 39749, 40861, 42848, 43965, 44272, 45480, 47697, 49343, 50310, 52159, 55008, 57216, 58475, 60294, 63057, 65442, 67258, 70066, 74475, 79363, 84299, 90205, 97211, 104372]
54953A04372P585R585J1813J2604J2922J4130J4923J3451J0578P996M978Q0n611
54940B19406r841j2373j4131j4725j3502j1575j0300r208p696o932p705q204o535
54927H6679l786k200j943j982k326k987k526k24K030K389J901K404L397L483L184
54912H7493L784M858N398N920P309R044J0515J2356J4573J5238J3102R583O260
54899B05433K524k271o593q960j0249j1644j2459j2097j1766j2039j1233q505
54887A00141n972n337n185m112l579m710n303l410j110j147k293j802j98K59j67
54872E6075J79P46J05p93l30L26p78k515k432j081q38j684j760j039q76r52p1
54855D2282R06L53q92q58jj83j063q83J08K48k99j43L72r5r76p11J61n5j012r94
$$ y = [104372, 111957, 121542, 133355, 145959, 158881, 173011, 187934, 201385, 211963, 219959, 224937, 225017, 219406, 209565, 197192, 183061, 168336, 154834, 143259, 132959, 123751, 116055, 109123, 101418, 93214, 86679, 82893, 80693, 78750, 76768, 74442, 71455, 68929, 68705, 70735, 73124, 75025, 77429, 80826, 84309, 87493, 91277, 96135, 101533, 107453, 114762, 123806, 134321, 146677, 161250, 176488, 189590, 199173, 205433, 207957, 205686, 199093, 190133, 179884, 168240, 155781, 143684, 131918, 119879, 108646, 100141, 94169, 88832, 83647, 79535, 75956, 71246, 65943, 62533, 61423, 60276, 57983, 56181, 55983, 56242, 56075, 56254, 57000, 57105, 56312, 55982, 56308, 55530, 53015, 50583, 49502, 48664, 46980, 45220, 44181, 43305, 42353, 42282, 43188, 43541, 42649, 41791, 41790, 41607, 40544, 39661, 39769, 40017, 39718, 39575, 39947, 39852, 38876, 38165, 38326, 38271, 37259, 36265]
54835C6265J6P97J443K539K882J143j184j634o11l20q57o64J57L11L24J622L342
54818D5571L393K131J659K076J718O50N23J333J579J363K112L492L818L277L655
54803G8350M988N576N270N736P346Q722R436J0519J2198J3531J4268J4763J4380
54790B05083J2219Q977N807K205k610p187r461j0030j0939j2033j1562r694q264
54777A52511p527o265m674m096m245l688k664k493k658j592J27N65ON09K155L090
54761A19061L137M016N918P125P308Q129J0278J2688J4941J7650K0385K1928K2613
54748B75177K3670K4398K2750J8708J4199R728M047k803r090j4111j8580k2227
54736C25866k3798k3489k2663k1272j8384j5037j3490j3608j3056j1159r506q642
$$ y = [36265, 36281, 37078, 38521, 41060, 43942, 45085, 43901, 42267, 41656, 41336, 40479, 39815, 39972, 40283, 40607, 42229, 45571, 48964, 51095, 52754, 54830, 56548, 57198, 57721, 59054, 60633, 61996, 64108, 67600, 71418, 74695, 78350, 83338, 88914, 94184, 99920, 107266, 115988, 125424, 135943, 148141, 161672, 175940, 190703, 205083, 217302, 226279, 232086, 234291, 231681, 224494, 215033, 205003, 194064, 182031, 170469, 160775, 152511, 144984, 138719, 134045, 129949, 125704, 122016, 119352, 116859, 114201, 112609, 112736, 113301, 113307, 113816, 115971, 119061, 122198, 126214, 132132, 139257, 146565, 154694, 164972, 177660, 192601, 210251, 230636, 252564, 275177, 298847, 323245, 345995, 364703, 378902, 388630, 392677, 389874, 380784, 366673, 348093, 325866, 302068, 278579, 255916, 234644, 216260, 201223, 187733, 174125, 161069, 149910, 140404, 131762]
54724A31762p342n459m392m248l582k342k147l152l538k584j590j217o61J32J52
54709H9792m42l12M81N05k94n29j28l20q68l00R32P54p48j093M76J795J464O51
54691I1816L68j07j072j374o01P5R7K86Q05P04l8k86R9K03L09J586L387L621K097
54672A01975P92N30L14M1Q72K460L005K552L119M969O019N591N471O405O831O132
54656A57078N892O773P173O271N422N372N013M138M372O055P130O692O732Q839
54642B42952J1848J4405J7130K0561K3421K4749K5504K6366K5992K3018J7839
54631D73785J1085K438p608j6825k3570k8204l1257l2151l0871k8800k6697k3763
54619B37562j9738j5978j3403j1407r595q567q083o709m247k328j699j107K08
$$ y = [131762, 124420, 118961, 114569, 110321, 106739, 104397, 102250, 99098, 95560, 92976, 91386, 90169, 89508, 89640, 89792, 89350, 89038, 89519, 90024, 89730, 89201, 89073, 88753, 87885, 87585, 88517, 89271, 88523, 87430, 87906, 89701, 91165, 91816, 92184, 92077, 91005, 89631, 89030, 89105, 89202, 89488, 90293, 90997, 90959, 90673, 90772, 90975, 91284, 92870, 96257, 99878, 101975, 102767, 103297, 103611, 103652, 104524, 106984, 109989, 112541, 115660, 120629, 126648, 132239, 137710, 144115, 150946, 157078, 162970, 169743, 176916, 183187, 188609, 193981, 198994, 203132, 207504, 213559, 220689, 227381, 234113, 242952, 254800, 269205, 286335, 306896, 330317, 355066, 380570, 406936, 432928, 455946, 473785, 484870, 487308, 479700, 462875, 439305, 411101, 379844, 347693, 316822, 288022, 261325, 237562, 217824, 201846, 188443, 177036, 167441, 158874, 150791, 144082, 139835, 137507, 135808, 134701, 134909]
54606A34909J267J496J810K500K394J144O7k87j063k633l551l115k650l093l572
54591A25623l430l419l883l916l336l157l424k924j811j781k878l023j668q88
54577H6085j652k188j447j027j942k551j641p32j235j985j673j161j314j008N41
54562F5070J809J469O77Q02J053M34j31K89O43o1o94j05O81M28p3K47O37K74K69
54543G3718J789L773M590M482M462M424M131M468N828O904O836O924Q475J0550
54529A51354J1709J2317J3243J3867J3189J1467R121N564P72l614o375q353j0503
54516B13758j2030j2085j1577j1565j1470j0541r490r058q575p410o268n623m665
54503I3401l134k280k637k844k062j398j525j284k33n4j516k567j596j88l06j109
$$ y = [134909, 136176, 137672, 139482, 141982, 144376, 145520, 145587, 145300, 144237, 141604, 138053, 134938, 132288, 129195, 125623, 122193, 118774, 114891, 110975, 107639, 104482, 101058, 98134, 96323, 94542, 91664, 88641, 86973, 86085, 84433, 82245, 80798, 79771, 77829, 75278, 73637, 72905, 71670, 69685, 68012, 66851, 65537, 64529, 65070, 66879, 68348, 69025, 69827, 70880, 71314, 71183, 71472, 72115, 72054, 71360, 71255, 71936, 72364, 72291, 72538, 73175, 73449, 73718, 75507, 79280, 83870, 88352, 92814, 97238, 101369, 105837, 111665, 118569, 125405, 132329, 140804, 151354, 163063, 175380, 188623, 202490, 215679, 227146, 236267, 241831, 242603, 238989, 232614, 224261, 213758, 201728, 189643, 178066, 166501, 155031, 144490, 135000, 125942, 117367, 109957, 103689, 98066, 93401, 90267, 87987, 85350, 82506, 80444, 79046, 77521, 76237, 76004, 75950, 74434, 71867, 70271, 70083, 69777, 68668]
54487F8668q79K5N77J280K518K815J361J67J047K400J841J17m68J48N52Q88K025
54470H5082K979K156K63p94r20j263j646j156l92n98j356j390q69p61q57n90p26
54453G7162k016l295l032j777j020p77m18n49j729k639j895o12p52j939k306j499
54437E0907n42K85J207J545P41j34M5M71qn93l7R10Q46K61L56O30P3m64L10J541
54417E8350J650J172J491J907Q32r31j112M03J584J480Q97L88o9J40J504K910
54401G2596L049K565K843L537L503L150L519M029L591L028L811N245N509M677
54387A24652M160L974L071J718R36L79q34j955j898j755l209n294n664m406l615
54372A10260l768l512k665k436k765k370j335j022j528j697j484j755k152j611
$$ y = [68668, 67789, 67814, 68391, 69671, 72189, 75004, 76365, 76532, 77579, 79979, 81820, 81937, 81469, 81617, 82169, 83057, 85082, 88061, 90217, 90480, 89686, 88766, 87503, 85857, 84701, 84309, 83711, 82355, 80965, 80096, 79335, 78478, 77888, 77162, 75146, 71851, 68819, 67042, 66022, 65245, 64827, 64278, 62549, 59910, 58015, 57403, 56651, 54712, 52406, 50907, 50365, 50650, 51857, 53402, 54143, 54009, 54054, 54525, 54517, 53924, 53887, 54797, 55643, 55904, 56260, 56890, 56963, 56499, 56809, 58350, 60000, 61172, 62663, 64570, 65402, 64471, 63359, 63762, 65346, 66826, 67723, 68111, 68042, 68182, 69686, 72596, 75645, 78210, 81053, 84590, 88093, 91243, 94762, 98791, 102382, 105410, 109221, 114466, 119975, 124652, 128812, 132786, 135857, 137575, 138511, 138890, 138056, 136101, 134203, 132448, 129239, 123945, 118281, 113875, 110260, 106492, 102980, 100315, 97879, 95114, 92744, 91409, 90387, 88859, 87162, 85678, 83923, 81771, 80160]
54358H0160o62o32j092o84Q4k94j242q94M11O34k14j27J096J463N36L02J627K921
54340H3393L093L179M021M831M957N001N340N412M975M452L731K367Q92J56m02
54325A35398j819l403l679l100l325m153l964l015l308n006n923n085m001l791
54311H1826l606k689j671j054m99j59p78k022k633k414k217j965q79L58J55j217
54295E8536j807j086m76o28o57l93q48k044k718k553k356j938l33J654J889K85
54279D4527r18p08l99o25j72J260J968J064r0k99j56j73L45J464J820Q84N4M04
54261E0250J126J201R13P27M22N6K58Q65Q92K61p9rl17p88l58O74Q10O8M3R63
54241E7978J130k5q85m37L05M56N25O92J83q04q29K74Q67K27m89o91j273k168
$$ y = [80160, 79498, 78866, 77774, 77090, 77174, 76880, 75638, 74744, 75155, 75789, 75575, 75448, 76544, 78007, 78543, 78845, 80472, 83393, 86486, 89665, 93686, 98517, 103474, 108475, 113815, 119227, 124202, 128654, 132385, 134752, 135644, 135800, 135398, 133579, 130176, 126497, 123397, 120072, 115919, 111955, 108940, 105632, 100626, 94703, 89618, 85617, 81826, 78220, 75531, 73860, 72806, 72307, 72148, 71370, 69348, 66715, 64301, 62084, 60119, 59240, 59598, 59753, 58536, 56729, 55643, 55167, 54539, 53882, 53489, 52641, 50597, 47879, 45326, 42970, 41032, 40699, 42353, 44242, 44527, 43609, 42901, 42502, 41877, 41705, 42965, 44933, 45997, 45907, 45608, 45452, 45279, 45624, 47088, 48908, 49792, 49846, 50250, 51376, 52577, 53490, 54217, 54639, 54695, 54953, 55818, 56710, 56971, 56892, 56883, 56566, 55778, 55420, 56094, 56904, 56972, 57015, 57978, 59108, 59083, 58198, 57761, 58066, 58522, 59047, 59739, 59922, 59118, 58289, 58563, 59430, 59657, 59168, 58477, 57204, 55036]
54223E5036j741K47J602R61l02o81o64r13p53J0O6j006j514m87M37k35j279q31
54205D7953O48J472J316Q69K63n39q07j00P82J021R72J111J090P04N14O27K43
54188E8139o98r82q0Q73R78Q46J079J129O29K29J58l42j294j493o35o6m15m26
54170E7629O29J433Q54j90n51p34j372j604o23O16Q58M36K66K07j63l64qK35j33
54151E7421l93PK91k50r20q35k84J75P45J525J864J455R21N53r4p27j93J368K121
54132F4750J273K95L18L22o54j530j083j75k09q38r12n41n04p16o85n56m77j4
54114E8064P11N63p76j860j527o16m61r38j153r00l26N89J329R33k75o40K87R56
54096E3960M61L6O50J189N65k76j71J56l98j224j206o76m82m42k50n49j527j861
$$ y = [55036, 53295, 53542, 55144, 56105, 55803, 55122, 54458, 53545, 52792, 52802, 52868, 51862, 50348, 49861, 50298, 50063, 48784, 47953, 48601, 50073, 51389, 52258, 52521, 51982, 51175, 51075, 51857, 52878, 53850, 54961, 56051, 56755, 57269, 57896, 58139, 57441, 56459, 56379, 57252, 58230, 59076, 60155, 61284, 61913, 62142, 62300, 61958, 60664, 59171, 58536, 58470, 58055, 57629, 58258, 59691, 60545, 60355, 59804, 59070, 57698, 56094, 55471, 56087, 56945, 57381, 57647, 57854, 57691, 57327, 57319, 57554, 57421, 57028, 57035, 57326, 57076, 56156, 55321, 55037, 55212, 55957, 57482, 59346, 60801, 61722, 62275, 62181, 61454, 61261, 62629, 64750, 66023, 66318, 66636, 66958, 66304, 64774, 63691, 63516, 63307, 62469, 61557, 61016, 60512, 59796, 59111, 58555, 58078, 58064, 58775, 59338, 58562, 56702, 55175, 54559, 54098, 53160, 52007, 51107, 50781, 51370, 52699, 53632, 53357, 52717, 53004, 53960, 54421, 54457, 55107, 56296, 56861, 56585, 56414, 56570, 56172, 54948, 53742, 53066, 52584, 52142, 51892, 51343, 49816, 47955]
54078D7955o92P18R30N28P32J149P38k08p77j091j595j801j233n63m34k74L69
54061D4451P23L08J65J015J785J469R27J151J333N42k37K61J240J270P64R48J494
54044E9609J287O16N12P81N84K32N16J089J174J056J326J568J388J610K801L839
54028G9988L705L462M508O053O440N857N576N443M429K918K210K273K096J787
54014A36745K303L445L966L457K492J419L80KM84P15k46j575j994j819k062k480
53998A45232k215j548j277j152o18k09n36p62P4J141J087K95k0o2p98j851k198
53981A34583k180k843l765l640k525j527q61p1L75k65j252j229l86Nk78m98o48
53964A12995j135j384o53K66J7j071j538j123o83l20M84J352J458J158J410K041
$$ y = [47955, 47263, 47981, 48911, 49439, 50171, 51320, 52058, 51850, 51073, 49982, 48387, 46586, 45353, 44790, 44356, 44082, 44451, 45174, 45482, 45647, 46662, 48447, 49916, 50843, 51994, 53327, 53869, 53632, 53893, 55133, 56403, 57167, 58115, 59609, 60896, 61512, 62024, 62805, 63389, 63621, 64137, 65226, 66400, 67456, 68782, 70350, 71738, 73348, 76149, 79988, 83693, 87155, 91663, 97716, 104156, 110013, 115589, 121032, 125461, 128379, 130589, 132862, 134958, 136745, 139048, 142493, 146459, 149916, 152408, 153827, 154207, 154209, 154693, 155408, 155162, 153587, 151593, 149774, 147712, 145232, 143017, 141469, 140192, 139040, 138422, 138213, 137677, 136915, 136989, 138130, 139217, 139512, 139492, 139430, 138632, 136781, 134583, 132403, 129560, 125795, 122155, 119630, 118103, 117242, 117171, 117546, 117281, 116029, 114800, 114414, 114419, 114141, 113643, 112995, 111860, 110476, 109823, 110089, 110106, 109035, 107497, 106374, 105691, 105371, 105855, 107207, 108665, 109823, 111233, 113274]
53948A13274K251K283K865L610L761L861M816O010O318O289P252Q934J0042J0562
53934A92128J1275J1608J0362Q101O507N570L809R88j660l741n956q056q830q208
53920B13897p387o773n721m258l183k450j346q0N88R94J953K909K777K190K663
53905A96773L872M129L393L289M116M397L607K888K661J899K91j028j535k033
53891B26719k785k860j945j035q42j063j576k685l890m189l816m014m846n071
53877A86102m387l944m285m589m380m227m332m100l467l119l052k519j692j677
53863A36332k567l168k955k743l069l464l638l895m053l465k353j765j938k113
53849I5146j972j878j725j068l00k84q05j021j112j808k571k141p69N3L6K39Q55
$$ y = [113274, 115525, 117808, 120673, 124283, 128044, 131905, 136721, 142731, 149049, 155338, 162590, 171524, 181566, 192128, 203403, 215011, 225373, 233474, 239981, 245551, 249360, 250348, 248688, 244947, 238991, 230935, 222105, 213897, 206510, 199737, 194016, 189758, 186575, 184125, 182779, 182699, 183287, 184281, 186234, 189143, 191920, 194110, 196773, 200645, 204774, 208167, 211456, 215572, 219969, 223576, 226464, 229125, 231024, 231315, 230287, 228752, 226719, 223934, 221074, 219129, 218094, 217252, 216189, 214613, 211928, 208038, 203849, 200033, 196019, 191173, 186102, 181715, 177771, 173486, 168897, 164517, 160290, 155958, 151858, 148391, 145272, 142220, 139701, 138009, 136332, 133765, 130597, 127642, 124899, 121830, 118366, 114728, 110833, 106780, 103315, 100962, 99197, 97259, 95146, 93174, 91296, 89571, 88503, 88203, 87919, 87114, 86093, 84981, 83173, 80602, 78461, 77692, 77745, 77781, 78020, 78875]
53832G8875Q66J16l45j80j34l66k45R9q3m74j38M90J12r22r17L16J190J076R06
53813H0242Q81J64q20m58J110J699O03j77P35K017K087J457J240J281J149J343
53797I4553K250L233L756M152M518M329L700L573M003L904K964K237K282K437
53783A41891K385K641L022K521J206L90M29L28j08J29Q86N40j169k350j991j465
53767A49285j858k156j496j005j766k867l071k805k849k663j606m95l61q17j005
53752A22465j069j450j768j547j097o99K0J096J662J167J57p30j368j388k17J547
53736A16781K265J384L9q04j273j332n22N53M19r29j758j295o57n57k12O30R13
53719A13645M73P29K020K637J776J114J905K776K199J073Q85J161P17j35n12o82
$$ y = [78875, 79741, 79857, 79512, 79332, 79198, 78832, 78587, 78686, 78603, 78129, 77991, 78481, 78593, 77671, 76754, 77070, 78260, 79336, 80242, 81123, 81287, 80467, 80009, 81119, 82818, 83421, 83244, 83979, 85996, 88083, 89540, 90780, 92061, 93210, 94553, 96803, 100036, 103792, 107944, 112462, 116791, 120491, 124064, 128067, 131971, 134935, 137172, 139454, 141891, 144276, 146917, 149939, 152460, 153666, 154056, 154485, 154813, 154705, 154834, 155720, 156260, 155091, 152741, 150750, 149285, 147427, 145271, 143775, 142770, 141004, 138137, 135066, 132261, 129412, 126749, 125143, 124648, 124287, 123470, 122465, 121396, 119946, 118178, 116631, 115534, 114835, 114855, 115951, 117613, 118780, 118937, 118207, 116839, 115451, 115234, 116781, 119046, 120430, 120469, 119665, 118392, 117060, 116538, 117091, 117510, 116581, 114823, 113528, 112871, 112314, 112102, 112732, 113645, 114118, 114847, 116867, 119504, 121280, 122394, 124299, 127075, 129274, 130347, 131232, 132393, 133110, 132975, 132463, 131781]
53703A31781j117j204n21m5m92q51j41Q30J032J044J699K377K338K321L054L543
53687A45648K685J289P13P16M67M17J308K348K316J543J076Q35L24J30Q96J712
53671A64423J399N75O51J452J677J161R05J233J513J425J203R39P28R95J661J764
53655A83704Q21j53j26L51Q9r72k014k558k412j374N1N76k54j341j675j503j110
53638A70100l5J437J734K71j285j478j137j407j465k46J127R51j82l39P20J623
53622A70389J824J867J794J268Q66J438K464K666J968J364J218J158J208J666
53608A93158K224K390K366K517K637K701L366M647N245M414L381L450L962L651
53594B40109K907K902L463L675L672M087M476M148L707M011M356L548K055J260
$$ y = [131781, 130664, 129460, 128939, 128894, 128402, 127551, 127410, 128240, 129272, 130316, 132015, 134392, 136730, 139051, 142105, 145648, 148333, 149622, 150335, 151051, 151518, 151935, 153243, 155591, 157907, 159450, 160526, 161361, 161685, 161815, 162711, 164423, 165822, 166397, 167048, 168500, 170177, 171338, 172243, 173476, 174989, 176414, 177617, 178556, 179284, 180279, 181940, 183704, 184525, 184372, 184246, 184597, 184686, 183714, 181700, 179142, 176730, 175356, 175407, 175983, 175729, 174388, 172713, 171210, 170100, 170065, 171502, 173236, 173507, 172222, 170744, 169607, 168200, 166735, 166489, 167616, 168567, 168385, 168046, 168766, 170389, 172213, 174080, 175874, 177142, 178008, 179446, 181910, 184576, 186544, 187908, 189126, 190284, 191492, 193158, 195382, 197772, 200138, 202655, 205292, 207993, 211359, 216006, 221251, 225665, 229046, 232496, 236458, 240109, 243016, 245918, 249381, 253056, 256728, 260815, 265291, 269439, 273146, 277157, 281513, 285061, 287116, 288376]
53580B88376J226J029P23J066J803J967J580J328J129N56J82P14J406J058J14
53565C04257PQ97J746K185K583K761K318J871K221K767K426J650J776K819L665
53550C35949M085M672N207M920M155L979M376M481M385M907N872O294O154O273
53536D05709O611O313N398M824M912N156N399N792N925N401M896N175N619N251
53522D82381M677N140O229O509O065O324P559Q627R176J0054J1410J2304J2460
53509E88915J2657J3188J3585J3958J4909J6001J6107J5492J5833J7810K0203
53498G58658K1761K2534K3036K3437K3910K4565K4848K4191K3272K3410K4671
53487A018293K5787K5918K5286K4165K2632K1255K0732K0804K0668K0228J9855
$$ y = [288376, 289602, 290631, 291354, 292420, 294223, 296190, 297770, 299098, 300227, 300783, 300965, 301679, 303085, 304143, 304257, 304264, 305161, 306907, 309092, 311675, 314436, 316754, 318625, 320846, 323613, 326039, 327689, 329465, 332284, 335949, 340034, 344706, 349913, 354833, 358988, 362967, 367343, 371824, 376209, 381116, 386988, 393282, 399436, 405709, 412320, 418633, 424031, 428855, 433767, 438923, 444322, 450114, 456039, 461440, 466336, 471511, 477130, 482381, 487058, 492198, 498427, 504936, 511001, 517325, 524884, 533511, 542687, 552741, 564151, 576455, 588915, 601572, 614760, 628345, 642303, 657212, 673213, 689320, 704812, 720645, 738455, 758658, 780419, 802953, 825989, 849426, 873336, 897901, 922749, 946940, 970212, 993622, 1018293, 1044080, 1069998, 1095284, 1119449, 1142081, 1163336, 1184068, 1204872, 1225540, 1245768, 1265623]
53476A265623J9334J8384J7706J7976J8366J7711J6665J6763J7626J7339J5442
53465A458935J3466J2318J1250R796Q690Q199P323N442L313J771O18o64k192m009
53451A534256o121q042r367j0703j2741j4688j5129j4437j4605j6427j8492j9433
53439A374071j9654k0270k1563k3030k4046k4116k3327k2631k2850k3501k3482
53428A125601k2588k1312j9577j7024j4216j2122j0670r098p478o458n886n139
53416I74033m443m273l944k507n84M84R09J918L381M134M451N843Q461J0900J2708
53401A011471J4779J7033J8068J7634J7268J7928J9061K0432K2725K5687K7778
53390A229864K8511K9235L0885L2815L4465L6321L8448L9953M0747M1986M3960
$$ y = [1265623, 1284957, 1303341, 1321047, 1339023, 1357389, 1375100, 1391765, 1408528, 1426154, 1443493, 1458935, 1472401, 1484719, 1495969, 1505765, 1514455, 1522654, 1529977, 1535419, 1538732, 1540503, 1541121, 1540457, 1538265, 1534256, 1528135, 1520093, 1510726, 1500023, 1487282, 1472594, 1457465, 1443028, 1428423, 1411996, 1393504, 1374071, 1354417, 1334147, 1312584, 1289554, 1265508, 1241392, 1218065, 1195434, 1172584, 1149083, 1125601, 1103013, 1081701, 1062124, 1045100, 1030884, 1018762, 1008092, 998994, 991516, 985058, 979172, 974033, 969590, 965317, 961373, 958866, 958282, 958766, 959675, 961593, 964974, 969108, 973559, 979402, 987863, 998763, 1011471, 1026250, 1043283, 1061351, 1078985, 1096253, 1114181, 1133242, 1153674, 1176399, 1202086, 1229864, 1258375, 1287610, 1318495, 1351310, 1385775, 1422096, 1460544, 1500497, 1541244, 1583230, 1627190]
53379A627190M5371M5584M5770M6788M7719M7599M7030M6778M6311M4889M2955
53368B133984M1249L9597L7566L5351L3189L0726K7648K4082J9975J5150J0236
53357B448753O321L301j35m563r226j3624j8152k2689k6163k8166k9587l1128
53345B274942l2641l4277l6725l9716m1859m2594m2769m2811m2003m0228l8665
53334A840654l7935l7197l5845l4599l4026l3574l2836l2251l1751l0370k8019
53323A472251k6034k5039k3856k1628j9291j7791j6379j4013j1185r004p627o794
53311A273610o796p817r177j0209j1043j1764j1843j1061r980q862p323n631m801
53298A157303m765l933j464J409L207L984M377M422M318N066P127R597J1603J3410
$$ y = [1627190, 1672561, 1718145, 1763915, 1810703, 1858422, 1906021, 1953051, 1999829, 2046140, 2091029, 2133984, 2175233, 2214830, 2252396, 2287747, 2320936, 2351662, 2379310, 2403392, 2423367, 2438517, 2448753, 2455074, 2458375, 2458240, 2453677, 2444451, 2430827, 2412675, 2389986, 2363823, 2335657, 2306070, 2274942, 2242301, 2208024, 2171299, 2131583, 2089724, 2047130, 2004361, 1961550, 1919547, 1879319, 1840654, 1802719, 1765522, 1729677, 1695078, 1661052, 1627478, 1594642, 1562391, 1530640, 1500270, 1472251, 1446217, 1421178, 1397322, 1375694, 1356403, 1338612, 1322233, 1308220, 1297035, 1288031, 1280404, 1273610, 1266814, 1258997, 1249820, 1239611, 1228568, 1216804, 1204961, 1193900, 1183920, 1175058, 1167735, 1162104, 1157303, 1152538, 1148605, 1147141, 1148550, 1151757, 1155741, 1160118, 1164540, 1168858, 1173924, 1181051, 1190648, 1202251, 1215661]
53284A215661J5329J6899J7994J9403K1414K3087K3846K4403K5285K5868K5766
53273A454955K5622K5579K4581K2299K0110J8965J7854J5675J3059J0948Q936
53262A658583O535M523L409J979q48l976n814o886q739j1228j2902j3533j4404
53249A596699j6181j8118j9316j9643j9580j9878k1035k2442k2717k1524k0114
53238A376151j9459j8947j7739j6251j5223j4545j4050j4291j5335j5971j5312
53227A199028j4124j3282j2252j0398q641q183q561q553q113p852p467o316m901
53214A080385m179l927l295k603l032m858p139q957j0022j0509j1082j2509j4444
53201I83829j5437j4928j4195j4371j4655j3815j2343j1587j1698j1881j1989
$$ y = [1215661, 1230990, 1247889, 1265883, 1285286, 1306700, 1329787, 1353633, 1378036, 1403321, 1429189, 1454955, 1480577, 1506156, 1530737, 1553036, 1573146, 1592111, 1609965, 1625640, 1638699, 1649647, 1658583, 1665118, 1669641, 1673050, 1675029, 1674181, 1670205, 1664391, 1657505, 1648766, 1637538, 1624636, 1611103, 1596699, 1580518, 1562400, 1543084, 1523441, 1503861, 1483983, 1462948, 1440506, 1417789, 1396265, 1376151, 1356692, 1337745, 1320006, 1303755, 1288532, 1273987, 1259937, 1245646, 1230311, 1214340, 1199028, 1184904, 1171622, 1159370, 1148972, 1140331, 1132148, 1123587, 1115034, 1106921, 1099069, 1091602, 1085286, 1080385, 1076206, 1072279, 1068984, 1066381, 1063349, 1058491, 1051352, 1042395, 1032373, 1021864, 1010782, 998273, 983829, 968392, 953464, 939269, 924898, 910243, 896428, 884085, 872498, 860800, 848919, 836930]
53190H36930j2364j2767j2898j3375j4836j6592j7483j7552j7669j8032j8287
53179F65075j8480j8632j8137j6773j5663j5876j6732j6840j6114j5350j4484
53168D81994j2923j1157j0407j0785j1178j0874j0179r571r279r438r776r479
53156C56948q254p011o644o776o646o496o856p234o801n860n304n108m568l689
53142B69701l100k926k791k637k504j944o91M91O63O6k42K40J219K253K884K678
53126B63360J879J365J453J508J273J359J740J154r14k983l649l611m242n290
53112B54402n689n622n998o621o578n887n276m786m026l249k870k590k160k260
53098A90790l322m301m120l377l234l400k869j874j479j795k135k281k277j733
$$ y = [836930, 824566, 811799, 798901, 785526, 770690, 754098, 736615, 719063, 701394, 683362, 665075, 646595, 627963, 609826, 593053, 577390, 561514, 544782, 527942, 511828, 496478, 481994, 469071, 457914, 447507, 436722, 425544, 414670, 404491, 394920, 385641, 376203, 366427, 356948, 348694, 341683, 335039, 328263, 321617, 315121, 308265, 301031, 294230, 288370, 283066, 277958, 273390, 269701, 266601, 263675, 260884, 258247, 255743, 253799, 253108, 253599, 254262, 254328, 254086, 254326, 255545, 257798, 260682, 263360, 265239, 266604, 268057, 269565, 270838, 272197, 273937, 275091, 274177, 271194, 267545, 263934, 259692, 254402, 248713, 243091, 237093, 230472, 223894, 218007, 212731, 207945, 203919, 200670, 197800, 195210, 193050, 190790, 187468, 183167, 179047, 175670, 172436, 169036, 166167, 164293, 162814, 161019, 158884, 156603, 154326, 152593]
53084A52593p41n04j508k180j123M51N21n82j052o91p18j109p30J55M9j097j704
53067A40030j236q71j187j277n65L11Q13J130J198O06k80n42k30k60p28q09l50
53050A35753j42m13m77n0L47M11L78L24J82K58P57J149R39N86N31J94p60j203
53032A38764k93O26j12j568j493R6J099Q32O90J315J592R02J03k32n39p85k47
53015A40750Q42J232P14M41Q25R11L31pL38O04L89L26N98M58k48n48N1Q39J213
52996A50059J439J672J574J203J032Q70J96m47Q9J553K473K503K742L538L906
52981A74402L623L865N037N782N108L882L181K653J552K11n78p44o98o71q24j302
52965B04479j824j947j843j959k069j728j428j974k833k707j639r52j032r81o02
$$ y = [152593, 151852, 151348, 149840, 147660, 146537, 146988, 147509, 146927, 145875, 145184, 144466, 143357, 142627, 142782, 142831, 141734, 140030, 138794, 137923, 136736, 135459, 134894, 135205, 136018, 137148, 138346, 138952, 138672, 138130, 137900, 137640, 136912, 136103, 135753, 135611, 135198, 134721, 134671, 135018, 135429, 135807, 136131, 136313, 136571, 137328, 138477, 139416, 140002, 140533, 140727, 139967, 138764, 138471, 139097, 138985, 137417, 135924, 136020, 137119, 137951, 138641, 139956, 141548, 142450, 142553, 142321, 141782, 140997, 140750, 141592, 142824, 143538, 143979, 144804, 145715, 146046, 146039, 146377, 146981, 147370, 147696, 148294, 148752, 148504, 147956, 148007, 148846, 150059, 151498, 153170, 154744, 155947, 156979, 157849, 158045, 157598, 157687, 159240, 161713, 164216, 166958, 170496, 174402, 178025, 181890, 186927, 192709, 197817, 201699, 204880, 207533, 209085, 209296, 208718, 207974, 207276, 206605, 205781, 204479, 202655, 200708, 198865, 196906, 194837, 193109, 191681, 189707, 186874, 184167, 182528, 181576, 180544, 179563, 178961]
52950A78961q44j876k481j970j141p53n20j15K23N31J097J390M31j325k187j566
52934A67855o52l68l39k38m37q40p32k59l67q57l35J293K230J433O4n27n54o51
52916A65719o22k93j62l42j74M08N69J85K35J002J540J474J566J904J385j29j063
52899A73202n31L38M59L15M00O0q43r95K31J383J154M33N42R65N50k69k62N31
52881A77663J111J152R97P24L84M41J004J413J372J561K318K851K581K040J622
52866A99234P77m86p80P75L037M396M732M650M150L229K697L007L334L004K709
52851B38465L059L134J914R7r25j041j015j029r49j198k063k831k843k581k617
52836B27577k401j341k15j91j163k180k808l035k650j835j488j915k192j730j388
$$ y = [178961, 178117, 176241, 173760, 171790, 170649, 169896, 169376, 169261, 169484, 170015, 171112, 172502, 172933, 171608, 169421, 167855, 167203, 166835, 166496, 166258, 165821, 164981, 164249, 163990, 163623, 162766, 162431, 163724, 165954, 167387, 167451, 166924, 166370, 165719, 165097, 164804, 164642, 164300, 164126, 164534, 165103, 165288, 165523, 166525, 168065, 169539, 171105, 173009, 174394, 174265, 173202, 172671, 173009, 173468, 173783, 174183, 174243, 173400, 172405, 172636, 174019, 175173, 175606, 176148, 177113, 177663, 177394, 177132, 177663, 178774, 179926, 180923, 181647, 182031, 182472, 183476, 184889, 186261, 187822, 190140, 192991, 195572, 197612, 199234, 200011, 199525, 198745, 199520, 202557, 206953, 211685, 216335, 220485, 223714, 226411, 229418, 232752, 235756, 238465, 241524, 244658, 246572, 246669, 245744, 244703, 243688, 242659, 241710, 240512, 238449, 235618, 232775, 230194, 227577, 225176, 223835, 223620, 223429, 222266, 220086, 217278, 214243, 211593, 209758, 208270, 206355, 204163, 202433, 201045]
52821B01045j841k185j523p07r07j524j315o22o73j355j560j233j272j774k023
52806A80531k008k341k778k402j236l98n14j116j586j733j478q63l40k84m54n45
52790A60455q72j725k527k470j623o89r4N2l68j141j537j233q03p38p19m75m83
52773A43010j013j335q43j54k02q55j325j249o45L63J119O72p67j709j503j308
52757A32256j978k431j543l39n78k034k965k651j849j288j130j542k371k676j829
52742A05052o55l22o51p33n83r06j697k328k496k055o17J456K479J351o11j221
52726I5463k96N95O73O04Q39J035J077J323J706J779J589J542J534J265J134J792
52710A13654K960L709L684L146K197R12j35m72m58o26q00p85j244k663m129m347
$$ y = [201045, 199204, 197019, 195496, 194789, 193882, 192358, 191043, 190421, 189748, 188393, 186833, 185600, 184328, 182554, 180531, 178523, 176182, 173404, 171002, 169766, 169368, 168854, 167738, 166152, 164419, 162941, 162078, 161738, 161454, 161000, 160455, 159583, 157858, 155331, 152861, 151238, 150549, 150455, 150507, 150139, 148998, 147461, 146228, 145425, 144687, 143968, 143493, 143010, 141997, 140662, 139819, 139665, 139463, 138608, 137283, 136034, 135389, 135752, 136871, 137543, 136776, 135067, 133564, 132256, 130278, 127847, 126304, 125965, 125387, 123353, 120388, 117737, 115888, 114600, 113470, 111928, 109557, 106881, 105052, 104397, 104075, 103424, 102691, 102108, 101202, 99505, 97177, 94681, 92626, 92009, 93465, 95944, 97295, 96684, 95463, 95167, 95762, 96435, 97039, 97878, 98913, 99990, 101313, 103019, 104798, 106387, 107929, 109463, 110728, 111862, 113654, 116614, 120323, 124007, 127153, 129350, 130262, 130127, 129655, 129197, 128571, 127771, 126986, 125742, 123079, 118950, 114603]
52694A14603l499k852k938l253l362l170k516j572j175j701k179j635o73m98r84
52679H2596j075o21l57m75n05m18n93r30j052j039j015n78L19O32l65j619j643
52662G1262o49K6K6rJl38o83l17M59P27M30J44j59q02j307j084o94r06j068r0
52642F4969J426J772O90m20o81m66p8O24J325J487J438J917K690K995K921K838
52626H5447J985n05l444m564l542k172j515r80k73j21n54m48N02J069M47n89j092
52609F9651j076o93L06J604K071J202j69j024j148o88J48P75O43K06L64Q71N98
52592G3641n14j116m24P16J224J021N50O5j73J12O71R76J043J161J039K83m45
52575G9830p1J148J906J918K165K925L105K018M94l19k38L09Q96J041M90j91j85
$$ y = [114603, 111104, 108252, 105314, 102061, 98699, 95529, 93013, 91441, 90266, 88565, 86386, 84751, 84078, 83580, 82596, 81521, 80900, 80543, 80068, 79563, 79145, 78552, 77622, 76570, 75531, 74516, 73938, 74257, 74889, 74524, 72905, 71262, 70613, 70639, 70665, 70656, 70657, 70319, 69636, 69319, 69778, 70505, 70935, 71079, 70920, 70118, 68811, 67727, 67033, 66127, 65059, 64969, 66395, 68167, 68857, 68437, 67756, 67290, 67212, 67836, 69161, 70648, 72086, 74003, 76693, 79688, 82609, 85447, 87432, 86927, 83483, 78919, 75377, 73205, 71690, 70710, 70437, 70316, 69762, 69314, 69816, 70885, 71332, 70743, 69651, 68575, 67882, 68188, 69792, 71863, 73065, 72896, 71872, 70724, 70036, 70184, 70959, 71602, 71808, 72172, 73043, 73641, 73127, 72011, 71587, 72303, 73527, 74548, 75098, 75163, 74990, 75102, 75773, 76749, 77792, 78953, 79992, 80275, 79830, 79759, 80907, 82813, 84731, 86896, 89821, 92926, 94944, 95438, 95119, 94881, 95190, 96086, 97127, 97617, 97426, 97241]
52558I7241L56N55K63J69N07Q34J050J459J818J566R89Q74J085Q02J76K05R36
52541A10885J316J037R35J314J372P67L30O94J397J782J711J142J14p02n77N8
52525A23575J59k30j21O35J204J352J534J452L25j285j725p18K36K82J91M41L23
52508A27630l53n26K39Q45N89L24P47J096O07j02k81l14p38j090q32l97k83j77
52490A26984J74J79n19j173r69j88M74Q75J087R40N35L76M92L68J14N88J869K752
52472A34958K443J551Q76L85RK42J155J876J799J333Q77K71k27K58J641K363J452
52455A53262j04r04r60r65q66k89M54Q30R21R72Q25M72M59J000J493J511J451
52438A59562J610J490P55nj68O6K84N68R71J131J002J158J776K131J627O08l30
$$ y = [97241, 97597, 98152, 98415, 98584, 99091, 99925, 100975, 102434, 104252, 105818, 106807, 107681, 108766, 109568, 109744, 109949, 110885, 112201, 113238, 114173, 115487, 116859, 117626, 117956, 118650, 120047, 121829, 123540, 124682, 124796, 124094, 123517, 123575, 123734, 123504, 123383, 124018, 125222, 126574, 128108, 129560, 129885, 128600, 126875, 126157, 126393, 126675, 126866, 127307, 127630, 127277, 126751, 126990, 127835, 128424, 128748, 129495, 130591, 131198, 131096, 130815, 130501, 129763, 128673, 127841, 127444, 127161, 126984, 127158, 127337, 126818, 125645, 124676, 124488, 124962, 125837, 126924, 127864, 128399, 128775, 129267, 129635, 129749, 130337, 132206, 134958, 137401, 138952, 139828, 140213, 140222, 140464, 141619, 143495, 145294, 146627, 147504, 147775, 147548, 147806, 149447, 151810, 153262, 153158, 152254, 151294, 150329, 149463, 149174, 149628, 150458, 151379, 152351, 153176, 153648, 154107, 155107, 156600, 158111, 159562, 161172, 162662, 163417, 163412, 163244, 163310, 163594, 164162, 165133, 166264, 167266, 168424, 170200, 172331, 173958, 174566, 174236]
52421A74236j035j464j496j407j696k152k045j440j189j503j726j718k064k653
52407A50648k497j415l88J73R45J988K155J017k01m42j00K64R01J726J723N51
52391A57048n95p11k46J55P40J568J790J075L82M04N78M91P41J423J499O71J95
52374A67208O67P57m34j564j172K0O97J204K383L570L704L266L168K882J673N73
52358A88602J042K458L048K607K366K662K746K522K653L108L196K872K628K442
52344B24952K129K202L067L839L415K274J794K236K741K855K808K636K329K361
52330B61638K931L255K742K145K351K797K561K100K378K988K890K409K663L470
52316B99318L624L051K887L528M198M477M777N241N501N575N876O310O503O663
$$ y = [174236, 173201, 171737, 170241, 168834, 167138, 164986, 162941, 161501, 160312, 158809, 157083, 155365, 153301, 150648, 148151, 146736, 146348, 146521, 147466, 149454, 151609, 152626, 152425, 151983, 151883, 152147, 153048, 154774, 156497, 157048, 156453, 155742, 155496, 155651, 156391, 157959, 159749, 160824, 161206, 161610, 162188, 162679, 163420, 164843, 166342, 167013, 167208, 167875, 168632, 168198, 166634, 165462, 165482, 166179, 167383, 169766, 173336, 177040, 180306, 183474, 186356, 188029, 188602, 189644, 192102, 195150, 197757, 200123, 202785, 205531, 208053, 210706, 213814, 217010, 219882, 222510, 224952, 227081, 229283, 232350, 236189, 239604, 241878, 243672, 245908, 248649, 251504, 254312, 256948, 259277, 261638, 264569, 267824, 270566, 272711, 275062, 277859, 280420, 282520, 284898, 287886, 290776, 293185, 295848, 299318, 302942, 305993, 308880, 312408, 316606, 321083, 325860, 331101, 336602, 342177, 348053, 354363, 360866, 367529]
52302C67529P243P979Q332Q530R092R770J0120J0616J1863J3200J3502J3049J3147
52289E03972J4157J5236J5890J6407J6949J7494J8406J9888K1089K1135K0732
52278G01355K1309K2734K3409K2598K1317K0718K0889K1354K1630K1176J9713
52267I38202J7747J5980J4381J2601J0887R589Q196O073L771K314J535L52j440
52254A040188k958l657l846l827l683l833m647n571n643m850l962l244k279r04
52240I87284N67J917L078L967M916O674R114J0853J1057J0803J1351J2193J2239
52227A086013J2007J2723J3988J4356J3750J3289J3006J1801R628P725O575N412
52215A220273L880K417Q74j467m240o106o847p667r177j0703j1922j3462j5333
$$ y = [367529, 374772, 382751, 391083, 399613, 408705, 418475, 428595, 439211, 451074, 464274, 477776, 490825, 503972, 518129, 533365, 549255, 565662, 582611, 600105, 618511, 638399, 659488, 680623, 701355, 722664, 745398, 768807, 791405, 812722, 833440, 854329, 875683, 897313, 918489, 938202, 955949, 971929, 986310, 998911, 1009798, 1019387, 1027583, 1033656, 1037427, 1039741, 1041276, 1041628, 1040188, 1037230, 1033573, 1029727, 1025900, 1022217, 1018384, 1013737, 1008166, 1002523, 997673, 993711, 990467, 988188, 987284, 987851, 989768, 992846, 996813, 1001729, 1008403, 1017517, 1028370, 1039427, 1050230, 1061581, 1073774, 1086013, 1098020, 1110743, 1124731, 1139087, 1152837, 1166126, 1179132, 1190933, 1200561, 1208286, 1214861, 1220273, 1224153, 1226570, 1227444, 1225977, 1221737, 1215631, 1208784, 1201117, 1191940, 1181237, 1169315, 1155853, 1140520]
52202A140520j6473j6553j6716j7747j8865j9120j8871j8987j9489j9740j9347
52191I38612j8370j7110j5997j5126j3977j2214j0509r637r170q145o766o133
52179G95458o378o542o236o011n990n565m721m207m144l843l218l047l515l846
52165G28195l719l678l818l481k677k366k792k939k283j753k096k553k091r92
52151F90957k75k93p01j208j632j673j278q97r92j587k402l126l443l350l358
52136F64742l859m430m336l525k473j383l56K2o52j643j831j250q24q79j038j313
52120F34972k003k666k512j748j270j131o04L07Q55R31J110J426J485J717K815
52105F33684M151M429L997M544O327P649P654P649Q962J1156J3264J5179J6928
$$ y = [1140520, 1124047, 1107494, 1090778, 1073031, 1054166, 1035046, 1016175, 997188, 977699, 957959, 938612, 920242, 903132, 887135, 872009, 858032, 845818, 835309, 825672, 816502, 808357, 801591, 795458, 789080, 782538, 776302, 770291, 764301, 758736, 754015, 749808, 745664, 741821, 738603, 735556, 732041, 728195, 724476, 720798, 716980, 713499, 710822, 708456, 705664, 702725, 700442, 698689, 696593, 694040, 691949, 690957, 690682, 690389, 689688, 688480, 686848, 685175, 683897, 683000, 682008, 680421, 678019, 674893, 671450, 668100, 664742, 660883, 656453, 652117, 648592, 646119, 644736, 644380, 644402, 643750, 642107, 640276, 639026, 638202, 637323, 636285, 634972, 632969, 630303, 627791, 626043, 624773, 623642, 623038, 623345, 624200, 625131, 626241, 627667, 629152, 630869, 633684, 637835, 642264, 646261, 650805, 657132, 664781, 672435, 680084, 689046, 700202, 713466, 728645, 745573]
$$ [...]
##END NTUPLES=NMR SPECTRUM
##END=
