
##TITLE=AC1335_MEXAH11120_6528214_WYYS4kpn0q
##JCAMPDX= 6.0         $$ Bruker NMR JCAMP-DX V2.0
##DATA TYPE= NMR SPECTRUM
##DATA CLASS= NTUPLES
##ORIGIN= BRUKER
##OWNER= Administrator
$$ 1.72 TOPSPIN		Version 2.1
$$ 2012-07-15 11:46:28.531 -0500  Administrator@TOPSPIN
$$ Compression mode = diff/dup
##.OBSERVE FREQUENCY= 400.02188249412
##.OBSERVE NUCLEUS= ^1H
##.ACQUISITION MODE= SIMULTANEOUS (DQD)
##.ACQUISITION SCHEME= undefined
##.AVERAGES= 8
##.DIGITISER RES= 22
##SPECTROMETER/DATA SYSTEM= spect
##.PULSE SEQUENCE= zg30
##.SOLVENT NAME= COFFEE_meoh
##.SHIFT REFERENCE= INTERNAL, COFFEE_meoh, 1, 14.98509
##AUDIT TRAIL= $$ (NUMBER, WHEN, WHO, WHERE, PROCESS, VERSION, WHAT)
$$ ##TITLE= Audit trail, TOPSPIN		Version 2.1
$$ ##JCAMPDX= 5.01
$$ ##ORIGIN= Bruker BioSpin GmbH
$$ ##OWNER= Administrator
$$ $$ C:\Bruker\TOPSPIN/data/COFFEE/nmr/AC1335_MEXAH11120_6528214_WYYS4kpn0q/10/pdata/1/auditp.txt
$$ ##AUDIT TRAIL=  $$ (NUMBER, WHEN, WHO, WHERE, PROCESS, VERSION, WHAT)
(   1,<2012-07-15 11:46:21.281 -0500>,<Administrator>,<TOPSPIN>,<go>,<TOPSPIN 2.1>,
      <created by zg
	started at 2012-07-15 11:45:14.343 -0500,
	POWCHK enabled, PULCHK disabled,
       configuration hash MD5:
       6B 1B 68 BB D9 2E 58 E2 7F 35 AD 54 07 DF 0E 41
       data hash MD5: 64K
       10 6E 5A 35 FC BC 41 12 01 F7 7E 1B CA AE 01 F3>)
(   2,<2012-07-15 11:46:24.187 -0500>,<Administrator>,<TOPSPIN>,<proc1d>,<TOPSPIN 2.1>,
      <Start of raw data processing
       efp LB = 0 FT_mod = 6 PKNL = 1 PHC0 = 0 PHC1 = 0 SI = 32K 
       data hash MD5: 32K
       48 D6 19 49 31 16 DC 68 EE 82 D1 D5 91 44 51 FE>)
(   3,<2012-07-15 11:46:24.609 -0500>,<Administrator>,<TOPSPIN>,<proc1d>,<TOPSPIN 2.1>,
      <pk PHC0 = 173.4521 PHC1 = 0 
       data hash MD5: 32K
       19 EF 12 B7 C7 E5 AF D2 BB 7F E1 02 9D DB F2 D6>)
(   4,<2012-07-15 11:46:24.812 -0500>,<Administrator>,<TOPSPIN>,<proc1d>,<TOPSPIN 2.1>,
      <abs ABSG = 1 
       data hash MD5: 32K
       F4 BF E0 5B C6 0E DE 32 45 61 A8 18 BE A4 17 1C>)
(   5,<2012-07-15 11:46:24.921 -0500>,<Administrator>,<TOPSPIN>,<proc1d>,<TOPSPIN 2.1>,
      <abs ABSG = 2 
       data hash MD5: 32K
       89 CD 9A 67 88 31 BA 0A C9 8D F3 40 CB 75 72 AB>)
(   6,<2012-07-15 11:46:24.968 -0500>,<Administrator>,<TOPSPIN>,<proc1d>,<TOPSPIN 2.1>,
      <abs ABSG = 3 
       data hash MD5: 32K
       E8 6C 57 6B 69 5C 91 75 6A CD 6C 41 A4 F1 4F 39>)
(   7,<2012-07-15 11:46:25.000 -0500>,<Administrator>,<TOPSPIN>,<proc1d>,<TOPSPIN 2.1>,
      <abs ABSG = 4 
       data hash MD5: 32K
       76 BB CA 67 3F CF B4 16 FA B7 81 25 AF 29 3C 65>)
(   8,<2012-07-15 11:46:25.031 -0500>,<Administrator>,<TOPSPIN>,<proc1d>,<TOPSPIN 2.1>,
      <abs ABSG = 5 
       data hash MD5: 32K
       0A 9E 4E 69 86 0B 01 B2 FF FA BF D9 EE F7 B7 35>)
$$ ##END=
$$ 
$$ $$ hash MD5
$$ $$ 1D 94 29 80 1D 01 AB 0C B5 03 A3 BE 1C F5 A4 28
##$RELAX= 
##$RELAX= 
##$RELAX= 
##$RELAX= 
##$RELAX= 
##$RELAX= 
##$RELAX= 
$$ Bruker specific parameters
$$ --------------------------
$$ [...]
150 150 150 150 150 150 150 150
##$TP07= 0
##$TPNAME0= <>
##$TPNAME1= <>
##$TPNAME2= <>
##$TPNAME3= <>
##$TPNAME4= <>
##$TPNAME5= <>
##$TPNAME6= <>
##$TPNAME7= <>
##$TPOAL= (0..7)
0.5 0.5 0.5 0.5 0.5 0.5 0.5 0.5
##$TPOFFS= (0..7)
0 0 0 0 0 0 0 0
##$TUNHIN= 0
##$TUNHOUT= 0
##$TUNXOUT= 0
##$USERA1= <user>
##$USERA2= <user>
##$USERA3= <user>
##$USERA4= <user>
##$USERA5= <user>
##$V9= 5
##$VALIST= <valist>
##$VCLIST= <CCCCCCCCCCCCCCC>
##$VD= 0
##$VDLIST= <DDDDDDDDDDDDDDD>
##$VPLIST= <PPPPPPPPPPPPPPP>
##$VTLIST= <TTTTTTTTTTTTTTT>
##$WBST= 2048
##$WBSW= 25
##$XGAIN= (0..3)
0 0 0 0
##$XL= 0
##$YL= 0
##$YMAX_a= 512248
##$YMIN_a= -636320
##$ZGOPTNS= <>
##$ZL1= 120
##$ZL2= 120
##$ZL3= 120
##$ZL4= 120
##$ABSF1= 14.98509
##$ABSF2= -5.573092
##$ABSG= 5
##$ABSL= 3
##$ALPHA= 0
##$AQORDER= 0
##$ASSFAC= 0
##$ASSFACI= 0
##$ASSFACX= 0
##$ASSWID= 0
##$AUNMP= <proc_prof1d_extract_pilot.lims>
##$AXLEFT= 0
##$AXNAME= <>
##$AXNUC= <1H>
##$AXRIGHT= 0
##$AXTYPE= 0
##$AXUNIT= <>
##$AZFE= 0.1
##$AZFW= 0.1
##$BCFW= 0
##$BC_mod= 0
##$BYTORDP= 0
##$COROFFS= 0
##$CY= 15
##$DATMOD= 1
##$DC= 0
##$DFILT= <>
##$DTYPP= 0
##$F1P= 0
##$F2P= 0
##$FCOR= 0.5
##$FTSIZE= 32768
##$FT_mod= 6
##$GAMMA= 0
##$GB= 0
##$INTBC= 1
##$INTSCL= 1
##$ISEN= 128
##$LB= 0
##$LEV0= 0
##$LPBIN= 0
##$MAXI= 10000
##$MC2= 0
##$MEAN= 0
##$ME_mod= 0
##$MI= 0
##$NCOEF= 0
##$NC_proc= -8
##$NLEV= 6
##$NOISF1= 0
##$NOISF2= 0
##$NSP= 0
##$NTH_PI= 0
##$NZP= 0
##$OFFSET= 14.98509
##$PC= 1
##$PHC0= 173.4521
##$PHC1= 0
##$PH_mod= 1
##$PKNL= yes
##$PPARMOD= 0
##$PPDIAG= 0
##$PPIPTYP= 0
##$PPMPNUM= 2147483647
##$PPRESOL= 1
##$PSCAL= 4
##$PSIGN= 0
##$PYNMP= <proc.py>
##$REVERSE= no
##$SF= 400.02
##$SI= 32768
##$SIGF1= 0
##$SIGF2= 0
##$SINO= 400
##$SIOLD= 32768
##$SPECTYP= <>
##$SREGLST= <1H.CDCl3>
##$SSB= 0
##$STSI= 32768
##$STSR= 0
##$SW_p= 8223.68421052631
##$SYMM= 0
##$S_DEV= 0
##$TDeff= 65536
##$TDoff= 0
##$TI= <>
##$TILT= no
##$TM1= 0
##$TM2= 0
##$TOPLEV= 0
##$USERP1= <user>
##$USERP2= <user>
##$USERP3= <user>
##$USERP4= <user>
##$USERP5= <user>
##$WDW= 1
##$XDIM= 32768
##$YMAX_p= 478177913
##$YMIN_p= -726438
##$CURPLOT= <Network HP LaserJet P1505>
##$CURPRIN= <$Network HP LaserJet P1505>
##$DFORMAT= <normdp>
##$LAYOUT= <+/1D_H.xwp>
##$LFORMAT= <normlp>
##$PFORMAT= <normpl>
##$SURQMSG= 1
$$ End of Bruker specific parameters
$$ ---------------------------------
##NTUPLES= NMR SPECTRUM
##VAR_NAME=  FREQUENCY,     SPECTRUM/REAL,   SPECTRUM/IMAG
##SYMBOL=    X,             R,               I
##VAR_TYPE=  INDEPENDENT,   DEPENDENT,       DEPENDENT
##VAR_FORM=  AFFN,          ASDF,            ASDF
##VAR_DIM=   32768,         32768,           32768
##UNITS=     HZ,            ARBITRARY UNITS, ARBITRARY UNITS
##FACTOR=    0.250966925370066, 1,           1
##FIRST=     8223.43324360094, -99762,       -234231
##LAST=      0,             -149400,         -235908
##MIN=       0,             -726438,         0
##MAX=       8223.43324360094, 478177913,    0
$$ Real data points
##PAGE= N=1
##DATA TABLE= (X++(R..R)), XYDATA
$$ [...]
19527A4712c37040a00489r8459E3371j8912K5122b59186L523o994j93511a61795
$$ 14712 -337040 -100489 -198948 53371 34459 59581 -259186 -255663 -262657 -456168 -161795
19515B51078b8852J709l04543A68810n7938m8183b01739A51313l8963a0410A31174
$$ 251078 -28852 -27143 -331686 168810 110872 62689 -201739 151313 112350 -10410 131174
19503a43531e2674k06752a28866q6503k26945b3023j02974N7643m3658A9734J30332
$$ -143531 -52674 -259426 -128866 -215369 -442314 -23023 -125997 -68354 -112012 19734 150066
19492A50066A5257J24870d3482m1504D9034f7102j37652j49280J51411K5612M040
$$ 150066 15257 140127 -43482 -84986 49034 -67102 -204754 -354034 -202623 -177011 -172971
19481a72971j27212H2884B9800b78328l645m5505H964K18356H0733J51156d28244
$$ -172971 -300183 82884 29800 -278328 -281973 -327478 8964 227320 80733 231889 -428244
19469a42755F2059b98341G4406c9997k51815G2735b48261h4083j08456C39443
$$ -142755 62059 -298341 74406 -39997 -291812 72735 -248261 -84083 -192539 339443
19458b47736c4244j34102A05842O4376o5277h8118A39546d9534b493q19j84191
$$ -247736 -34244 -168346 105842 170218 104941 -88118 139546 -49534 -2493 -3312 -187503
19447a87503e9824k29684e1432A34419i6340k36127A9149J81201e3337j21295
$$ -187503 -59824 -289508 -51432 134419 -96340 -332467 19149 200350 -53337 -174632
19437a74632c5640G2243J02234g0292j15266H9618K11980D4713a14274c0605C0985
$$ -174632 -35640 72243 174477 -70292 -185558 89618 301598 44713 -114274 -30605 30985
19425A18843B4053a42707e742l4707p444b2593g658j6671j35952F3345b62747
$$ 118843 24053 -142707 -5742 -40449 -47893 -22593 -7658 -24329 -160281 63345 -262747
19413a07878A63458K7455j6093j3306p9684c7405k75898a22024N2136k8017j41287
$$ -107878 163458 190913 174820 161514 81830 -37405 -313303 -122024 -69888 -97905 -239192
19402b39192k1219b4013j67065j33925J57782C46799A23006q173b48390N9518
$$ -239192 -260411 -24013 -191078 -325003 -167221 346799 123006 114833 -248390 -188872
19392a88872f9426l15270h5045l09834e4217j92580b1590A81973L5327c24270
$$ -188872 -69426 -384696 -85045 -394879 -54217 -246797 -21590 181973 217300 -324270
19381c21202B07133a4696j991j91006B5490b84591A02501i4088A90708a80700
$$ -321202 207133 -14696 -16687 -207693 25490 -284591 102501 -94088 190708 -180700
19370A22054i1827I4118k1619J89506A4024a95865A36956J8298a17408j57565
$$ 122054 -91827 94118 72499 262005 14024 -195865 136956 155254 -117408 -274973
19360b74973d7554l52072e3448k44811C3252A1462f5327B39543a98682O5484H7957
$$ -274973 -47554 -399626 -53448 -298259 33252 11462 -65327 239543 -198682 -133198 87957
19348C4016f3840I7174f3464m32448e8942p2042n3591e2770o0653j9960E4793
$$ 34016 -63840 97174 -63464 -495912 -58942 -130984 -184575 -52770 -113423 -133383 54793
19336A72650E9837a72311Q2452c321k64512A62336b56929I2907h9582I425J7089
$$ 172650 59837 -172311 -89859 -3321 -267833 162336 -256929 92907 -89582 9425 26514
19325B6514b8572q5250A35751d58090A76127a1592k30357A73816a70616B8742
$$ 26514 -28572 -113822 135751 -458090 176127 -11592 -241949 173816 -170616 28742
19314C16107h8747B7328c21949h1851j1257L5516A38810A9289K9443K59928c15773
$$ 316107 -88747 27328 -321949 -81851 -93108 -57592 138810 19289 48732 308660 -315773
19302G5107g651B85961A3339a44420D3620h3547j91086a4959o6325o2341A50879
$$ 75107 -7651 285961 13339 -144420 43620 -83547 -274633 -14959 -81284 -143625 150879
19290e1728J901A79274J13891f9539o5459F6344f7764A85910Q3454a36776A42850
$$ -51728 -49827 179274 293165 -69539 -134998 66344 -67764 185910 269364 -136776 142850
19278b62253r1623A70571b75531A72032k0889g2398J4540k20327r2014h6254I7134
$$ -262253 -353876 170571 -275531 172032 151143 -72398 -57858 -278185 -370199 -86254 97134
19266G4767b23037o1405h3698M0819A2792J09897b22092A4058a10182A28340g6277
$$ 74767 -223037 -284442 -83698 -42879 12792 122689 -222092 14058 -110182 128340 -76277
19254C5961a32909F1264M0125O4419b98959K6280J08631J0433p672d4834k87129
$$ 35961 -132909 61264 101389 165808 -298959 -272679 -164048 -153615 -161287 -44834 -331963
19243c31963a9085H7316l6904L3790C8027a14355A44208k2990a56465B34570b27771
$$ -331963 -19085 87316 50412 84202 38027 -114355 144208 121218 -156465 234570 -227771
19231a53195b2855B03961c9630B77056l142b30353A52b78695h5218A31734A6778
$$ -153195 -22855 203961 -39630 277056 273914 -230353 152 -278695 -85218 131734 16778
19219A42309a24655j21382A44586g0172A02318a26647A93185e5978n2656C2908
$$ 142309 -124655 -246037 144586 -70172 102318 -126647 193185 -55978 -108634 32908
19208D9817a31538f1295m6891o5039B4288a56973C0696b82294A9718d7543C0704
$$ 49817 -131538 -61295 -108186 -173225 24288 -156973 30696 -282294 19718 -47543 30704
19196B8570J11688d89480b1348C9254j5605a43499j01351J3494g2992j46503A23369
$$ 28570 140258 -489480 -21348 39254 23649 -143499 -244850 -231356 -72992 -219495 123369
19184A70957G702c64028G2304a78555d7252B62022J2312I0218n928b77255P3472
$$ 170957 7702 -364028 72304 -178555 -47252 262022 274334 90218 84290 -277255 -203783
19173b03783d0959k9283j08058O165b7689n1837j66019a20767B10207k2101c51349
$$ -203783 -40959 -70242 -178300 -172135 -27689 -79526 -245545 -120767 210207 188106 -351349
19161i0330m1795j61706b6815j66821h7220A08948c04493c969j43686A90246a71548
$$ -90330 -132125 -293831 -26815 -193636 -87220 108948 -304493 -3969 -147655 190246 -171548
19149d4664c43j64885i260A3698g2731K8867m45044b7693j34920k3030R0827C77058
$$ -44664 -343 -165228 -9260 13698 -72731 -43864 -488908 -27693 -162613 -185643 -94816 377058
19136D8454d67135D8659g1950j91017H0341h3652k8693A85762k8376b22589F1592
$$ 48454 -467135 48659 -71950 -262967 80341 -83652 -112345 185762 157386 -222589 61592
19124c71843a23575k33112Q4219J29175B9778f6944H9863C5183b2113n5375J7991
$$ -371843 -123575 -356687 -272468 -143293 29778 -66944 89863 35183 -22113 -77488 -59497
19113e9497p6805C1330b07363r7188e0322j90922E0300k731b23848a10865K5365
$$ -59497 -136302 31330 -207363 -304551 -50322 -241244 50300 47569 -223848 -110865 -85500
19102h5500n6696j21448E1099b75326c5439j34145n6277f573n3481G3799a6679
$$ -85500 -142196 -263644 51099 -275326 -35439 -169584 -225861 -6573 -60054 73799 -16679
19090E6747a81945P8742G3816c14075A56133k1364F1444K4078a77297C8054N9013
$$ 56747 -181945 -103203 73816 -314075 156133 134769 61444 85522 -177297 38054 97067
19079I7067f7115A19117J1205J36415H5215c80854a7373j40062B1062f3162A3693
$$ 97067 -67115 119117 130322 266737 85215 -380854 -17373 -157435 21062 -63162 13693
19067A98485a3559p1430j81557a9264j34443c188I4582A0135a14776A31515a26096
$$ 198485 -13559 -84989 -266546 -19264 -153707 -3188 94582 10135 -114776 131515 -126096
19055A20268i8874I4748a23359c6889K838j59726A9906a4700C23777m5324c6054
$$ 120268 -98874 94748 -123359 -36889 -34051 -193777 19906 -14700 323777 278453 -36054
19043c4036B00816E5117a86460P3126I3750j6296L38705A34743a82312B56051
$$ -34036 200816 55117 -186460 -113334 93750 77454 416159 134743 -182312 256051
19032A60037c4076p5072C78196H2594J16609H8361j1708a09837E0538K64097D167
$$ 160037 -34076 -109148 378196 82594 199203 88361 76653 -109837 50538 314635 4167
19020B44318b7483l45617D4784L5424g1461A28807a68998P1393p9622E4054c6760
$$ 244318 -27483 -373100 44784 80208 -71461 128807 -168998 -97605 -177227 54054 -36760
19008a71719A30314a43627c4271j80348M1545A90713c8078A01078N1635Q6408
$$ -171719 130314 -143627 -34271 -214619 -173074 190713 -38078 101078 152713 239121
18998B39121D2726E193c04187i3793J9910L1429j50664e4165o0178I9718c35730
$$ 239121 42726 5193 -304187 -93793 -73883 -42454 -193118 -54165 -114343 99718 -335730
18986a81645j33004D5559b94512A48434c02652M6412E7652R707a98494N8209B74160
$$ -181645 -314649 45559 -294512 148434 -302652 -256240 57652 67359 -198494 -140285 274160
18974a96224a2990l39502J70732O9083D054b15711A40569A0965P8161e4083K3495
$$ -196224 -12990 -352492 -181760 -112677 4054 -215711 140569 10965 89126 -54083 -30588
18963c0588C7410J11823R4032B027b5963C21795e3810F6706a16129P560A01509
$$ -30588 37410 149233 243265 2027 -25963 321795 -53810 66706 -116129 -108569 101509
18951b88651E4475b95407I2994J0919h8174j95482K4494a9564G8100g3326p6340
$$ -288651 54475 -295407 92994 103913 -88174 -283656 -259162 -19564 78100 -73326 -149666
18940a49666j08709A42493a84827f5379r2128A0296h1529j31180L155F4342b66206
$$ -149666 -258375 142493 -184827 -65379 -157507 10296 -81529 -212709 -209554 64342 -266206
18928A15673L9639l4758c9861A05539b40070H8490b19451A0175c7011F2609L3620
$$ 115673 155312 120554 -39861 105539 -240070 88490 -219451 10175 -37011 62609 96229
18917I6229b30128q0199H0472b20272h4785k0048A69166o0370a42512G6355a23308
$$ 96229 -230128 -310327 80472 -220272 -84785 -104833 169166 108796 -142512 76355 -123308
18905a5230j0666j82878A66846a15897A04101a21889A1381h5944A09376c15529
$$ -15230 -25896 -208774 166846 -115897 104101 -121889 11381 -85944 109376 -315529
18894H0546a53067a5369J82o2389c4163B06314a20382N3216O76G3464a62860a6957
$$ 80546 -153067 -15369 -15187 -77576 -34163 206314 -120382 -67166 -66490 73464 -162860 -16957
18881a98274p8325A7684f4478a1256j39009B2544b35848I1150c01928I1452c31389
$$ -198274 -276599 17684 -64478 -11256 -150265 22544 -235848 91150 -301928 91452 -331389
18869c59071A96752c31704J32448j44396a0767r8715A40341b86860l4871c4535
$$ -359071 196752 -331704 -199256 -343652 -10767 -109482 140341 -286860 -321731 -34535
18858a46962d3515k49425a26977B03267J3176a91926d4460j65737A20635A1819
$$ -146962 -43515 -292940 -126977 203267 216443 -191926 -44460 -210197 120635 11819
18847g0173D08348B1323N9887a45050k08647M409D9635i2514a3695l44016a72014
$$ -70173 408348 21323 81210 -145050 -353697 -349288 49635 -92514 -13695 -357711 -172014
18835c72114A28369a34116p0050O9415L436B02295a29554M2969l9706b9018o9602
$$ -372114 128369 -134116 -204166 -134751 -131315 202295 -129554 -86585 -126291 -29018 -98620
18824i8620i496k45A7102h8460J6169D24953a45261j94518J03006d4248j60731
$$ -98620 -9496 -9741 17102 -88460 -72291 424953 -145261 -339779 -236773 -44248 -204979
18813b04979d7611j03085A16831J59697D6724j0430K59928i7911l7259J1163k23006
$$ -204979 -47611 -150696 116831 276528 46724 36294 296222 -97911 -135170 -124007 -347013
18802c47013H4879J35408A9818O7076j9588b50771A66600a06546B57111i150A93535
$$ -347013 84879 220287 19818 86894 67306 -250771 166600 -106546 257111 -9150 193535
18790A28105E7680i54p6566j3278b5700j82408b6395A25965J94491a02104d241
$$ 128105 57680 -954 -77520 -90798 -25700 -208108 -26395 125965 320456 -102104 -4241
18778a79377q1230k1199k0396N090i2670L9513I1901a61222P8277j14217A64636
$$ -179377 -260607 -281806 -302202 -297112 -92670 -53157 91901 -161222 -82945 -197162 164636
18766a23815e8256A38101g7017G631b25791A13876b07552B4370K972a35989a9519
$$ -123815 -58256 138101 -77017 7631 -225791 113876 -207552 24370 27342 -135989 -19519
18754h9544q7705A37246B8706O1137b34306b5035A20945b4740B7121a38327k32912
$$ -89544 -177249 137246 28706 89843 -234306 -25035 120945 -24740 27121 -138327 -371239
18743c71239a28994I6839k8007K92444a49718k25798J76061P3388l1388A92967
$$ -371239 -128994 96839 68832 361276 -149718 -375516 -199455 -126067 -157455 192967
18732B79026a8126A52936h4781B6380j2394d32888b0313B0246c9026k24095A0717
$$ 279026 -18126 152936 -84781 26380 13986 -432888 -20313 20246 -39026 -263121 10717
18720A625J80987a16576j73041J05613P6117M544o6268a3216D3327K4909g0485
$$ 1625 182612 -116576 -289617 -184004 -107887 -103343 -169611 -13216 43327 68236 -70485
18708b3884n0405E7206g0814j48992R614n1511a22007C5789J88377b44921l8610
$$ -23884 -74289 57206 -70814 -219806 -210192 -261703 -122007 35789 224166 -244921 -283531
18697b83531J6235B53068a06509k4285A1630a15576N7512A53992a44238m1620
$$ -283531 -267296 253068 -106509 -130794 11630 -115576 -58064 153992 -144238 -185858
18687a85858n7062a10893A75807E589L39989a26029d6120j95543d0737j58843
$$ -185858 -242920 -110893 175807 5589 345578 -126029 -46120 -241663 -40737 -199580
18677a99580D674d82211J48281e9812k11332Q8119k9354a1104A20416N7038e3374
$$ -199580 4674 -482211 -333930 -59812 -271144 -183025 -212379 -11104 120416 177454 -53374
18665A11794a41390c3527m125k49819p0860E8457i4615D2839J78813a7994j17543
$$ 111794 -141390 -33527 -37652 -287471 -358331 58457 -94615 42839 221652 -17994 -135537
18654a35537A1124b27478A7169e4043m8547c7757j66646J01533A82290A0546J95632
$$ -135537 11124 -227478 17169 -54043 -102590 -37757 -204403 -102870 182290 10546 206178
18643B06178b19437C65028a85804A30949b38974c8458a1491k87580J44153d3489
$$ 206178 -219437 365028 -185804 130949 -238974 -38458 -11491 -299071 -154918 -43489
18632A77155a76787e2995H4626c44813h8304A18254M4583B7307a54676k56955
$$ 177155 -176787 -52995 84626 -344813 -88304 118254 162837 27307 -154676 -411631
18622d11631K03307A88849a08184j33319B6052M5635e7399H7768B4990P8371n0924
$$ -411631 -208324 188849 -108184 -241503 26052 71687 -57399 87768 24990 103361 52437
18611E2437a30301e8375k07018h8237r6197Q2628D5413c85919G8672b52033J19045
$$ 52437 -130301 -58375 -265393 -88237 -184434 -101806 45413 -385919 78672 -252033 -132988
18600a32988d4082C188J02597K87565g1196j42496A16736i6363j87217A73239
$$ -132988 -44082 3188 105785 393350 -71196 -213692 116736 -96363 -283580 173239
18589C9325c334r6557F4593J41963H4860c34711E5002a72652j33834a15948p2605
$$ 39325 -3334 -99891 64593 206556 84860 -334711 55002 -172652 -306486 -115948 -188553
18578a88553A0217a95043N2237r5740A88764b86865I3254J23690b84611j39148
$$ -188553 10217 -195043 -142806 -238546 188764 -286865 93254 216944 -284611 -423759
18568d23759E4650J42012a82281K3112N3264p8858B3362a7464k08523E01124E8740
$$ -423759 54650 196662 -182281 -159169 -105905 -184763 23362 -17464 -225987 501124 58740
18556c90379H1373M7617A8156d4725j67488q5085a20838C25587k2015h4411j63037
$$ -390379 81373 128990 18156 -44725 -212213 -297298 -120838 325587 303572 -84411 -247448
18545b47448Q7814k67561d4924F427a52753G2225c29536j70527c5681j30802C0672
$$ -247448 -159634 -427195 -44924 6427 -152753 72225 -329536 -500063 -35681 -166483 30672
18533a1953A36669b30426a09397m10824b16215F5013a05713B11004G985R3980
$$ -11953 136669 -230426 -109397 -520221 -216215 65013 -105713 211004 7985 101965
18523A01965A4305b42475B04799H0392C5183b31856P9639j16395m8032M1148B50623
$$ 101965 14305 -242475 204799 80392 35183 -231856 -152217 -268612 -316644 -275496 250623
18511D9086i8554j58550Q3848n281r7113B02767b27549j3570Q4118c0650E0485
$$ 49086 -98554 -257104 -173256 -178537 -275650 202767 -227549 -241119 -157001 -30650 50485
18499B50458e8552J8446B55887c38090d9245q5043B39280C468g7111A37831L8519
$$ 250458 -58552 -40106 255887 -338090 -49245 -134288 239280 3468 -77111 137831 176350
18488A76350a22028K6475A64697J31972b27621L355a9021l54975a26543A54046
$$ 176350 -122028 -95553 164697 296669 -227621 -224266 -19021 -373996 -126543 154046
18477F1955b95491k3878i9402A74990a50099j58632a36018A48722B852b42739
$$ 61955 -295491 -319369 -99402 174990 -150099 -308731 -136018 148722 2852 -242739
18466A68533k1873f0018B62670b42060D3989a58961l66623C5052e499j66027C47249
$$ 168533 146660 -60018 262670 -242060 43989 -158961 -525584 35052 -5499 -171526 347249
18454H1913a62580B36603a87109A60728a54555B3583h7248A03880h9711C5529
$$ 81913 -162580 236603 -187109 160728 -154555 23583 -87248 103880 -89711 35529
18443A11845l1446O0848K46405b37328D8575L6576a48884K5619H672J30702b60732
$$ 111845 80399 141247 387652 -237328 48575 85151 -148884 -123265 8672 139374 -260732
18431A52194b61H1757h1621j93368P5818N0384C19216d9669j09555j69837J55190
$$ 152194 -261 81757 -81621 -274989 -199171 -148787 319216 -49669 -159224 -329061 -173871
18420a73871g2752A2642c1013l6195B28163j10502b09508i2930k8306j5944A19739
$$ -173871 -72752 12642 -31013 -67208 228163 117661 -209508 -92930 -121236 -137180 119739
18408C06730b15594B421L42977a0092A56704m8314e9109j45630P6226K1229k71382
$$ 306730 -215594 2421 345398 -10092 156704 108390 -59109 -204739 -128513 -107284 -378666
18397c78666F9813f1919k79003b0129B13369e8108o3886j43921D302a19362A15940
$$ -378666 69813 -61919 -340922 -20129 213369 -58108 -121994 -265915 4302 -119362 115940
18385A3968h6377B32028e9898j364B93996e5538r0780A60905a38543A25308a41010
$$ 13968 -86377 232028 -59898 -61262 293996 -55538 -146318 160905 -138543 125308 -141010
18373B36610c33q0591l7520k10065A12893R388P8650e6091k2895C56590j59300
$$ 236610 -333 -80924 -118444 -328509 112893 122281 200931 -56091 -78986 356590 197290
18362A97290c8323P363G4707a81339f5730B4391b56312D9679i6011A41244i5012
$$ 197290 -38323 -30960 74707 -181339 -65730 24391 -256312 49679 -96011 141244 -95012
18350a90537I5229J1338h3705i637A35693G826a44276k251A18530A6717a69589
$$ -190537 95229 106567 -83705 -9637 135693 7826 -144276 -146527 118530 16717 -169589
18338a90620A58086b68779I48f319k6345g428C8622a66484N5944L9330l0789C94
$$ -190620 158086 -268779 948 -6319 -32664 -7428 38622 -166484 -110540 -71210 -101999 394
18325B20555b41586g3579o8124k9221f6436B2281a9294q0108F187e5207A09150
$$ 220555 -241586 -73579 -141703 -170924 -66436 22281 -19294 -99402 6187 -55207 109150
18313F881a10868e4694O613j89015a13222J0587G4127a28266f1068m3998A87284
$$ 6881 -110868 -54694 -48081 -237096 -113222 -102635 74127 -128266 -61068 -105066 187284
18301a15406j98229J15461k55673h5349o4979J6139m3494Q635C1262d7877p9563
$$ -115406 -313635 -198174 -453847 -85349 -150328 -134189 -177683 -169048 31262 -47877 -127440
18290a27440N1928k07853A51329J0023f3585l35748c4246l95614J10910E7683
$$ -127440 -75512 -283365 151329 161352 -63585 -399333 -34246 -429860 -318950 57683
18279d798r7853B1852i5967A61207F6300J81865i4053k2708G9779d0569A01306
$$ -4798 -102651 21852 -95967 161207 66300 248165 -94053 -116761 79779 -40569 101306
18267a8505k41210A21593A5910N5700c47385D2064O376i3374m5516A34363a20566
$$ -18505 -259715 121593 15910 71610 -347385 42064 48440 -93374 -138890 134363 -120566
18255H4189a26955J1635M6723A37246c1956j2562j17705r0747A7154a35267A11810
$$ 84189 -126955 -115320 -68597 137246 -31956 -44518 -162223 -252970 17154 -135267 111810
18243A21644k4303l6621h5108G5848c96896i6990b4109k69373B6527d4354j56968
$$ 121644 97341 60720 -85108 75848 -396896 -96990 -24109 -293482 26527 -44354 -201322
18232b01322e1870l72343a671N50n3157j61542A93923b0065B94473a52476A4182
$$ -201322 -51870 -424213 -1671 -1121 -54278 -215820 193923 -20065 294473 -152476 14182
18220e2582J6626C6801a1193m7012j29775I3016a03105H9952Q140B4756b42474
$$ -52582 -35956 36801 -11193 -58205 -187980 93016 -103105 89952 98092 24756 -242474
18208F6674J75699B2137b65262j5367M2523B40474P1809h4869b8190j84681m3516
$$ 66674 242373 22137 -265262 -280629 -238106 240474 312283 -84869 -28190 -212871 -256387
18197b56387C276K547b15454P635h8014k53997A66840c03560a17951p350P459
$$ -256387 3276 5823 -215454 -207819 -88014 -342011 166840 -303560 -117951 -125301 -117842
18186a17842E9957b90233G1556d30671J69970E3792J58158c77709E9684l871e4195
$$ -117842 59957 -290233 71556 -430671 -260701 53792 211950 -377709 59684 55813 -54195
18174A35515d72851a03079k14741A17899a31824A24303l7752M1141D7494a38390
$$ 135515 -472851 -103079 -317820 117899 -131824 124303 86551 127692 47494 -138390
18163B7015a62084H463c74244A48628J31248d18500a50923P2017q1976B9635i4647
$$ 27015 -162084 8463 -374244 148628 279876 -418500 -150923 -78906 -160882 29635 -94647
18151C18825A07329c9491o5522j17401J08304C04047A8369L07956a74812B56749
$$ 318825 107329 -39491 -105013 -222414 -114110 304047 18369 326325 -174812 256749
18140A86834r2107R0828a12812k7486C144c075F358a14133L1385E6758Q5416P2867
$$ 186834 94727 185555 -112812 -140298 3144 -3075 6358 -114133 -82748 56758 142174 215041
18128B15041j04192c62979a15730D64619h1994J0694A66649C7116a00400B65525
$$ 215041 110849 -362979 -115730 464619 -81994 -71300 166649 37116 -100400 265525
18117B7692K47447A2300a21266c5680k73593K9546L721Q4143B96135M5511j17035
$$ 27692 275139 12300 -121266 -35680 -309273 -279727 -276006 -191863 296135 341646 224611
18106B24611k3627a15173d1466k75733B18381c08689J14464d324B56207L29226
$$ 224611 200984 -115173 -41466 -317199 218381 -308689 -194225 -4324 256207 585433
18096E85433a26418b1818I4813j1333g3726D27452h1429A45196a04532F1582Q8637
$$ 585433 -126418 -21818 94813 83480 -73726 427452 -81429 145196 -104532 61582 150219
18085A50219n6080f1394C63893a37960B81654D269f6907A08925K88381A47562
$$ 150219 94139 -61394 363893 -137960 281654 4269 -66907 108925 397306 147562
18074g7595J1784k83397B0848b70660A34469K61047a30007O0128j76494H9000
$$ -77595 -65811 -349208 20848 -270660 134469 395516 -130007 -69879 -246373 89000
18063e8915j15228A02539g9418k26088I5273k6306J36890d3487A32206j1960l4215
$$ -58915 -174143 102539 -79418 -305506 95273 68967 205857 -43487 132206 120246 86031
18052H6031J9959c08556J38372M4509H7539l911B3329a14081j21405b1027r0298
$$ 86031 105990 -308556 -170184 -125675 87539 83628 23329 -114081 -235486 -21027 -111325
18041a11325A50071a24662j93862A33468e42379F6627i922l8698q9827b699I9665
$$ -111325 150071 -124662 -318524 133468 -542379 66627 -9922 -48620 -138447 -2699 99665
18029d09322A7824M6454J0880a3498A52441J13456a80914r0499i3437l37452D9764
$$ -409322 17824 64278 75158 -13498 152441 265897 -180914 -271413 -93437 -430889 49764
18017c3961q5425m3919K7256k49085b9777j19569j03769E0712N8907a0592m31263
$$ -33961 -119386 -163305 -136049 -385134 -29777 -149346 -253115 50712 109619 -10592 -441855
18006d41855J86324R8806j89686d5569A2704i718A13650M0414E9906c44758J22287
$$ -441855 -255531 -156725 -346411 -45569 12704 -9718 113650 154064 59906 -344758 -222471
17995b22471B72152h3548j07485Q29D4549J33354C4730O4397M7671o5428g1708
$$ -222471 272152 -83548 -191033 -190204 44549 177903 34730 99127 146798 81370 -71708
17983b09209O2038B77927a79178F3899c18802B36321a30930j78685A35763K29771
$$ -209209 -147171 277927 -179178 63899 -318802 236321 -130930 -309615 135763 365534
17973C65534a93736c934j64664H2687c37377a63488c7025a6108j38051N443j40317
$$ 365534 -193736 -3934 -168598 82687 -337377 -163488 -37025 -16108 -154159 -148716 -289033
17962b89033p7300B11490m8714J46010b54526j2252G5291c00732A21638E8997
$$ -289033 -366333 211490 162776 308786 -254526 -266778 75291 -300732 121638 58997
17951A72674A4589O3130c4140j79780a8708E3679a33594H0139b48602d6170B9310
$$ 172674 14589 77719 -34140 -213920 -18708 53679 -133594 80139 -248602 -46170 29310
17939b44864d136k32120D4230J28461Q1309a84894k5114k85768A68721q4137b74641
$$ -244864 -4136 -236256 44230 172691 254000 -184894 -210008 -495776 168721 84584 -274641
17927B98831h6212A79415b55675A23184b60028M4560A63277G1677L9349a15311
$$ 298831 -86212 179415 -255675 123184 -260028 -215468 163277 71677 111026 -115311
17916B59067a35586j51711A34660f2757j9281B81162a21347D5600a47287A0854
$$ 259067 -135586 -287297 134660 -62757 -82038 281162 -121347 45600 -147287 10854
17905C5811N7446a48439g2242B02097J02740G6315b03856g9320B24740H533f0866
$$ 35811 93257 -148439 -72242 202097 304837 76315 -203856 -79320 224740 8533 -60866
17893A08577A5292i9231p9893A11759P5216M4752A8808N6388D730d3820k03906
$$ 108577 15292 -99231 -179124 111759 186975 231727 18808 75196 4730 -43820 -247726
17882b47726Q114a7518k75336F4935K34446I0773J02277q264k922a54936b1446
$$ -247726 -239612 -17518 -292854 64935 299381 90773 193050 184786 181864 -154936 -21446
17870i7165b3088B6337c5131G0241j0542A8076a57239H7720a69633A42424a43742
$$ -97165 -23088 26337 -35131 70241 59699 18076 -157239 87720 -169633 142424 -143742
17858c9800l08089a4968B07584m6941a80340H7458d8639p6579c8744j1802j05638
$$ -39800 -347889 -14968 207584 160643 -180340 87458 -48639 -125218 -38744 -50546 -156184
17847a56184e077C21793G4006c7096k64030P1054q7424O5068j31343J27954N4597
$$ -156184 -5077 321793 74006 -37096 -301126 -230072 -317496 -252428 -383771 -255817 -201220
17836b01220B044J07221c86337a04083d3446o1576F4946b65400F0090J44055n6693
$$ -201220 2044 109265 -386337 -104083 -43446 -105022 64946 -265400 60090 204145 147452
17825A47452d3241j6599B9066j3063h4613L1669C56948a23317E3886r183c118
$$ 147452 -43241 -59840 29066 16003 -84613 -52944 356948 -123317 53886 44703 -3118
17813A31350M6944G6736i9669G6552K3178K30725a14000A93212C0363J21550b24596
$$ 131350 178294 76736 -99669 76552 99730 330455 -114000 193212 30363 151913 -224596
17801A52011a24394p7096c0860B4352G680c5293j1225A84766b23628A6690a58293
$$ 152011 -124394 -201490 -30860 24352 7680 -35293 -46518 184766 -223628 16690 -158293
17789I3383b09520B16688c1315A03489a3222E1344J39287a42403C7336J2435J07588
$$ 93383 -209520 216688 -31315 103489 -13222 51344 190631 -142403 37336 49771 157359
17778A57359a37648I7650K52060e0330B91256a96866j41959i6085n3546A45189
$$ 157359 -137648 97650 349710 -50330 291256 -196866 -338825 -96085 -149631 145189
17767b24482O4242r9818G4305L37958a7876r5115A5508e991n4748I8460a3624
$$ -224482 -160240 -260058 74305 412263 -17876 -112991 15508 -5991 -60739 98460 -13624
17755a50719j16712h7946n1765J95J9033a5571q649j04034C00526C5827a24349
$$ -150719 -267431 -87946 -139711 -139516 -120483 -15571 -24220 -128254 300526 35827 -124349
17743b29788a02563D48679A88961b21564i7557B25634g5772K4273A10569D1643
$$ -229788 -102563 448679 188961 -221564 -97557 225634 -75772 -51499 110569 41643
17732D95543A67516a76030h5491o9806B86244a29778A33692P6280a49187A44295
$$ 495543 167516 -176030 -85491 -155297 286244 -129778 133692 209972 -149187 144295
17721D976J68779o0965E4265i081m3710R239m8558j7918C2118d7803k6317B8885
$$ 4976 173755 112790 54265 -9081 -52791 -43552 -92110 -110028 32118 -47803 -74120 28885
17708D0102a61617j39305O2733G3215b10222I785K93848F4772a27776A40042o9937
$$ 40102 -161617 -300922 -238189 73215 -210222 9785 303633 64772 -127776 140042 70105
17697G0105h2532g226o2982C8599J15333a6262j08114i532o4281k00565H8025
$$ 70105 -82532 -7226 -70208 38599 153932 -16262 -124376 -9532 -73813 -274378 88025
17685a59217C40630i9668A18742O9628q210m403H2777f1654I4331J23284a71765
$$ -159217 340630 -99668 118742 188370 180160 175757 82777 -61654 94331 217615 -171765
17673A80346A3395i545l8629A41564P9269g9327I0574P783m6866B268J08096k9441
$$ 180346 13395 -9545 -48174 141564 220833 -79327 90574 98357 51491 2268 110364 80923
17661H0923a16772C74238h1845o2746B50750I4555l0124e9643B59053l2596G737
$$ 80923 -116772 374238 -81845 -144591 250750 94555 64431 -59643 259053 226457 7737
17649a54583j6281P3553G4192e5400j35799h2020B4412b7563k64290d9266r0035
$$ -154583 -170864 -97311 74192 -55400 -191199 -82020 24412 -27563 -291853 -49266 -139301
17638a39301N8565C0919L8119l3798c16691d3324j7424A94526J3872D6785J53685
$$ -139301 -80736 30919 69038 35240 -316691 -43324 -60748 194526 208398 46785 200470
17627B00470f415D5097L30724a65148C0987b15858e6236b3135A52741a68615B19747
$$ 200470 -6415 45097 375821 -165148 30987 -215858 -56236 -23135 152741 -168615 219747
17615c9179j06914A119K02239D0426O4623K9643d9195p2574C25945G6677B1819
$$ -39179 -146093 1119 203358 40426 105049 134692 -49195 -121769 325945 76677 21819
17603d7505j61425H0697B1775J50481d99120a60438A49955e4666p5060I6291J7982
$$ -47505 -208930 80697 21775 172256 -499120 -160438 149955 -54666 -129726 96291 114273
17592A14273k1125K03815E9240j2635J2888a39898A77848b26498A94966b75141
$$ 114273 93148 296963 59240 46605 59493 -139898 177848 -226498 194966 -275141
17581A5634c2324A20063M3955L2695r2549a8434j07655p0513O3455A31564n4658
$$ 15634 -32324 120063 164018 196713 104164 -18434 -126089 -196602 -133147 131564 76906
17570G6906J35919C1877b5989l9840A90401r2033J34456L0088A29093A5762a0140
$$ 76906 212825 31877 -25989 -65829 190401 98368 232824 262912 129093 15762 -10140
17558g9105j14965C57814j45429d9650j03850B46771O0258q7053I6326K41876
$$ -79105 -194070 357814 212385 -49650 -153500 246771 307029 219976 96326 338202
17548C38202E3857a98666O3898B3506J21110K1760e100l16755A04703d24434D9985
$$ 338202 53857 -198666 -134768 23506 144616 166376 -5100 -321855 104703 -424434 49985
17536C9208d52012e632A88485a89792e683D21052B7149b74739a26905F7146R1162
$$ 39208 -452012 -5632 188485 -189792 -5683 421052 27149 -274739 -126905 67146 158308
17525A58308n9819C1550d6353K2611C55889D8746J11400a5526O244G6596C6169
$$ 158308 98489 31550 -46353 -23742 355889 48746 160146 -15526 -9282 76596 36169
17513H6581J8266M3481C4474G308L82776B8030K94481h844a450j2595D1460K82734
$$ 86581 104847 148328 34474 7308 390084 28030 322511 -8844 -1450 -14045 41460 324194
17501C24194b5932A72657d7305a3398j3097B20646M6781Q1315f8423k34325F6236
$$ 324194 -25932 172657 -47305 -13398 -26495 220646 267427 348742 -68423 -302748 66236
17489C0489a94651D5343g9564D3573K16625J51612a2380B51830P0202a12637I8369
$$ 30489 -194651 45343 -79564 43573 260198 411810 -12380 251830 322032 -112637 98369
17477a41097C25097n2490j18503J38745n4347q0082K36003B7890M7679J38644
$$ -141097 325097 272607 154104 292849 238502 158420 394423 27890 75569 214213
17467B14213l5519J23247B8139a1020C8141N1734b42688B16138k1537a14952B0831
$$ 214213 178694 301941 28139 -11020 38141 89875 -242688 216138 194601 -114952 20831
17455A54237L4540o4782P8619b528C07170K25278B59222K77985A34505K88964
$$ 154237 188777 123995 202614 -2528 307170 532448 259222 537207 134505 423469
17445D23469B03983M0158r6667L20686a17631B40840j00643n3959M02649b13409
$$ 423469 203983 244141 147474 468160 -117631 240840 140197 86238 488887 -213409
17434D47324B17687o0021o7114K71829r4648o9475D34L55141d7364C5768L80243
$$ 447324 217687 157666 90552 362381 267733 198258 434 355575 -47364 35768 416011
17423D16011b4290A29135K49983H775M03724o3862J1633A34980K926J94062A51956
$$ 416011 -24290 129135 379118 8775 412499 348637 360270 134980 137906 331968 151956
17411F1732J79028k9378d4637B37797J7894j21593N1642a28358B44579A6106K03224
$$ 61732 240760 211382 -44637 237797 255691 134098 185740 -128358 244579 16106 219330
17400B19330j05878R2206J36709Q5472B1115f5628c2253D7806o678J11987J36874
$$ 219330 113452 205658 342367 427839 21115 -65628 -32253 47806 41128 153115 289989
17389B89989J8022b656E20443I1815J44950n7057e2454e815C61334K52969A22845
$$ 289989 308011 -2656 520443 91815 236765 179708 -52454 -5815 361334 614303 122845
17377C25067a32862F3870R363L27762A68127M03112h3113B96170a09551B05821
$$ 325067 -132862 63870 73233 400995 168127 571239 -83113 296170 -109551 205821
17366C9932K01317G8615a25531A81616R7406G5650J68333L6070b86513A51898
$$ 39932 241249 78615 -125531 181616 279022 75650 243983 280053 -286513 151898
17355A05200J47914H3574a34965A02692K07360j46458a33842E6770J06118E9114
$$ 105200 253114 83574 -134965 102692 310052 163594 -133842 56770 162888 59114
17344b3707G3478n864P3865l6981O6313K42555j99211C7177h7969a3904B20063
$$ -23707 73478 67614 141479 104498 170811 413366 214155 37177 -87969 -13904 220063
17332E5935K36117a14989A9918J25106J1056K95827a1342C07128K21620A87066
$$ 55935 292052 -114989 19918 145024 156080 451907 -11342 307128 528748 187066
17321A42897A4523O200a05403C87451A69231a55872E5890a30918A86405D9014
$$ 142897 14523 20723 -105403 387451 169231 -155872 55890 -130918 186405 49014
17310A90347I0988g5639H898K93847i3456a8637B66595j28583k3697J9207B8759
$$ 190347 90988 -75639 8898 302745 -93456 -18637 266595 138012 114315 133522 28759
17298D52104j69767a60744A25978K74546F516M4146c3963E98671D9518L92650
$$ 452104 282337 -160744 125978 400524 6516 50662 -33963 598671 49518 442168
17288D42168A68292D1500J93782b18601E04104k16818j29258k6035k5226J40960
$$ 442168 168292 41500 235282 -218601 504104 287286 158028 131993 106767 247727
17278B47727d4673l5131B81923j24105p8891K44811n2370p9300J09242L5951l1911
$$ 247727 -44673 -79804 281923 157818 78927 323738 271368 192068 301310 337261 305350
17267C05350N5989A61613j536F1917g1937j44c4608D6978L10321N067j09080K86803
$$ 305350 361339 161613 160077 61917 -71937 -72081 -34608 46978 357299 362366 253286 540089
17255E40089q3968n6053A89325B8529K28763J35921b72040J12470B48647K68150
$$ 540089 456121 400068 189325 28529 257292 393213 -272040 -159570 248647 516797
17245E16797B24557B1933K51931k4806A22574Q4220n1331a9819B54367L4454I0319
$$ 516797 224557 21933 273864 249058 122574 206794 155463 -19819 254367 288821 90319
17233a65260A94385J30890E6875K00689o2386e5410j81019C66017p3125K24314
$$ -165260 194385 325275 56875 257564 195178 -55410 -236429 366017 292892 517206
17223E17206k30468A41939K23973q1429O9171j36829A2814J48444K0453C6053
$$ 517206 286738 141939 365912 284483 353654 216825 12814 161258 181711 36053
17212B66595e0252B1821G873K47532H8488J54579e945B35535b5462I8975b5546
$$ 266595 -50252 21821 7873 255405 88488 243067 -5945 235535 -25462 98975 -25546
17200d0503C18881K01016k01788I5875a08467G9499l7793K4065O3961J30355L13510
$$ -40503 318881 519897 318109 95875 -108467 79499 41706 65771 129732 260087 573597
17189E73597G459L73508p2738j37847K0401N0756N4029A12025J36654K51996A14465
$$ 573597 7459 380967 308229 170382 190783 241539 295568 112025 248679 500675 114465
17177c5664D98950A35104K02559h3256E51397H7167K76777A65755K75410m4548
$$ -35664 498950 135104 337663 -83256 551397 87167 363944 165755 441165 396617
17167C96617j85129R7616p0984J54216D8890R6853J23923q156A17866J51053n3863
$$ 396617 211488 309104 238120 392336 48890 145743 269666 261510 117866 268919 215056
17156B15056J54093J50647n2883F9417N73867A64819P8124j15103C025g4082B47311
$$ 215056 369149 519796 466913 69417 643284 164819 242943 127840 3025 -74082 247311
17144C41163c6959F30059H0370L28212o4127j20609Q0923k3716R2859j29224L67320
$$ 341163 -36959 630059 80370 408582 344455 223846 304769 281053 373912 244688 612008
17133F12008A86015J95745k7415j01310n3789Q7111H3027d4706E03163k09269
$$ 612008 186015 381760 354345 253035 199246 286357 83027 -44706 503163 293894
17123B93894k3252I8977d0790F09772A74591K0528R5514J02120L5650j99504j05053
$$ 293894 270642 98977 -40790 609772 174591 195119 290633 392753 428403 228899 123846
17112A23846K10103J393J00455P067I2279K52333J35799j90048j02334K45655
$$ 123846 333949 335342 435797 442864 92279 344612 480411 290363 188029 433684
17102D33684r4038j16801K04281J41710j87090J82147k01578l2276R3959j25462
$$ 433684 339646 222845 427126 568836 381746 563893 362315 330039 423998 298536
17092B98536L796L16100A77812K01003o8465J20473L6267P1756J7125B39864J95576
$$ 298536 302332 618432 177812 378815 310350 430823 467090 538846 555971 239864 435440
17081D35440J06701o2165n1823J56867m1651j43222k447J02145p7530k06163M67312
$$ 435440 542141 479976 428153 585020 543369 400147 397700 499845 422315 216152 683464
17070F83464l9446O8495a01169A86047J94830M1823K5011K2084k24362o0501K05130
$$ 683464 644018 712513 -101169 186047 380877 422700 447711 469795 245433 184932 390062
17059C90062N3986M9804n4485j10343L92450k65838J3609L09371k68676R1151
$$ 390062 444048 493852 439367 329024 721474 455636 469245 778616 509940 601091
17049F01091k84574J11344m3695L24911B75641K71704r0389J10906K71681k52432
$$ 601091 316517 427861 384166 709077 275641 547345 456956 567862 839543 587111
17039E87111L5392A79884L2881K80537J48846j92134J99845j02715J61668C35970
$$ 587111 622503 179884 212765 493302 642148 450014 649859 547144 708812 335970
17028E99724k89144L34354r176N2109B12211L73571L3100M01268k31083k16511
$$ 599724 310580 644934 635758 687867 212211 585782 618882 1020150 789067 572556
17018E72556j56428J52266K25614l71148L19019J2468N477r3154j18025K2357
$$ 572556 416128 568394 794008 422860 741879 754347 759824 666670 548645 571002
17008E71002j33055m1450K46140k85829R579M17261o5790B54040M49863j04594
$$ 571002 437947 396497 642637 356808 366387 783648 717858 254040 703903 599309
16998E99309K29051J44106l43604K64217m05503j233M41217l73525N3077J84965
$$ 599309 828360 972466 628862 893079 487576 486343 927560 554035 607112 792077
16988G92077k60167N18949D84333O38551m36417J17802l4881R8922B53426L48558
$$ 792077 531910 1050859 484333 1122884 686467 804269 769388 868310 253426 601984
16978F01984L33693k01942k8321L31134k92114J63152k23237J13886r2676J78358
$$ 601984 935677 733735 705414 1036548 744434 907586 684349 798235 705559 883917
16968H83917J12653l26397K02013j77610J39186L01095k04685J0716m7827N7705
$$ 883917 996570 670173 872186 694576 833762 1134857 930172 940888 893061 950766
16958I50766j45188L41903l25181N9312J09517n3534K641k02333M49118k91795
$$ 950766 805578 1147481 822300 881612 991129 937595 940236 737903 1187021 895226
16948H95226L23401m58557L12633K56949k00424r9940J90713k61345J60122j64877
$$ 895226 1218627 760070 1072703 1329652 1129228 1029288 1220001 958656 1118778 953901
16938I53901K80731O3840m62442l62232N72299P3525K12448n02535M20482K16372
$$ 953901 1234632 1298472 836030 473798 1046097 1119622 1332070 829535 1250017 1466389
16928A466389l04119Q1127K5315j40411L1868K43204l0425l44322J72772j4345
$$ 1466389 1162270 1243397 1268712 1128301 1160169 1403373 1372948 1028626 1201398 1187053
16918A187053o962K95198k28796L4968J43146j70535L74286j37147m14924O25555
$$ 1187053 1180091 1475289 1246493 1281461 1424607 1254072 1628358 1491211 1076287 1701842
16908A701842m03517j81694O33137l04108j46089J91862J9596P049L70094k56325
$$ 1701842 1298325 1116631 1749768 1445660 1299571 1491433 1511029 1518078 1888172 1631847
16898A631847J7977P4440j23135J24913L1130M9654J621j69174R4396p6556M90036
$$ 1631847 1649824 1724264 1601129 1726042 1757172 1806826 1808447 1639273 1733669 1657113 2147149
16887B147149o57498O09816k41794n6040K11675m90978O64015L1374n0597k66383
$$ 2147149 1489651 2099467 1857673 1801633 2013308 1522330 2186345 2217719 2167122 1900739
16877A900739L9577j08302J35374K42607m08325M69667K2860k23285m5287K3322
$$ 1900739 1940316 1832014 1967388 2209995 1801670 2271337 2294197 2070912 2025625 2048947
16867B048947k7171l8937M24529M20615n53655M0587P6895k2195q1545M99656
$$ 2048947 2021776 1982839 2407368 2827983 2274328 2314915 2391810 2369615 2288070 2787726
16857B787726J5460r7681l08068K41789n1980J60284L13672J02127p9975l74165
$$ 2787726 2803186 2705505 2397437 2639226 2587246 2747530 3061202 3163329 3083354 2709189
16847B709189O98503k6649m71965J54869L43862l42746R6222K44268K56851j06660
$$ 2709189 3407692 3381043 2909078 3063947 3407809 3065063 3161285 3405553 3662404 3555744
16837C555744M2981M65167l71620J07272R1487L72876l14203L39311l15779M78074
$$ 3555744 3598725 4063892 3692272 3799544 3891031 4263907 3949704 4289015 3973236 4451310
16827D451310k79667K49888J41568J46259M4416K0738J83953l1097K20355j26669
$$ 4451310 4171643 4421531 4563099 4709358 4753774 4774512 4958465 4927368 5147723 5021054
16817E021054Q3068k39077M39933Q0681J13064P4686L61828K0570j29369J62256
$$ 5021054 5104122 4865045 5304978 5385659 5498723 5573409 5935237 5955807 5826438 5988694
16807E988694N7016J04105J10739L20656N26368k73296J59115L24605L77172R8852
$$ 5988694 6045710 6149815 6260554 6581210 7107578 6834282 6993397 7318002 7695174 7794026
16797G794026k58489P37907k0431J98937J06602J69502M58257J72255J58883M60482
$$ 7794026 7535537 8273444 8253013 8451950 8558552 8728054 9186311 9358566 9517449 9977931
16787I977931L1924o4380M77569O58269J97390J97878N25771J57442K62539O05781
$$ 9977931 10009855 9945475 10423044 11081313 11278703 11476581 12002352 12159794 12422333 13028114
16777A3028114J05720L06710P32626N88056L06631j37890Q90133P26274M24640
$$ 13028114 13133834 13440544 14173170 14761226 15067857 14929967 15820100 16546374 16971014
16768A6971014P40004N87445Q98738P78072N11010P09671P03079J091282M17006
$$ 16971014 17711018 18298463 19197201 19975273 20486283 21195954 21899033 22990315 23407321
16759B3407321J128778J247789P25450J595682J239319J163601J267236J524491
$$ 23407321 24536099 25783888 26509338 28105020 29344339 30507940 31775176 33299667
16751C3299667J768520J672002J650115K112038J869725K469462K137284K211104
$$ 33299667 35068187 36740189 38390304 40502342 42372067 44841529 46978813 49189917
16743D9189917L074506L021080K835979L633157L358821M250293M106313N001347
$$ 49189917 52264423 55285503 58121482 61754639 65113460 69363753 73470066 78471413
16735G8471413M851261N476308N526669O274846O695099P064416P615052Q150366
$$ 78471413 83322674 88798982 94325651 100600497 107295596 114360012 121975064 130125430
16727A30125430Q185724R042956R371622R246681R484426R394074R058330Q243842
$$ 130125430 138311154 147354110 156725732 165972413 175456839 184850913 193909243 202153085
16719B02153085P341891N933341M563389K939037Q96993n89105k885736m196408
$$ 202153085 209494976 215428317 219991706 222930743 223827736 223238631 220352895 216156487
16711B16156487o198496o918905q108216q967019q975665r699493r514882r648269
$$ 216156487 209957991 203039086 194930870 185963851 176988186 167288693 157773811 148125542
16703A48125542r079440q753052q715201p551252p574244o707153o682334o418293
$$ 148125542 139046102 130293050 121577849 114026597 106452353 99745200 93062866 86644573
16695H6644573n103211n203824m818471m174092m094549l651916l428403l550502
$$ 86644573 81541362 76337538 71519067 67344975 63250426 59598510 56170107 52619605
16687E2619605k712696k782020k603252k083463k278866k110112k001199j690974
$$ 52619605 49906909 47124889 44521637 42438174 40159308 38049196 36047997 34357023
16679C4357023j584608j199607k055349j378691j157850j064589j197199j235316
$$ 34357023 32772415 31572808 29517459 28138768 26980918 25916329 24719130 23483814
16671B3483814r66369r61756l08109r94229j006524q24763m55759o57334n78722
$$ 23483814 22517445 21555689 21247580 20253351 19246827 18422064 17966305 17308971 16730249
16662A6730249m68293j010462m60577j6166n73358p15381k13804p21806l12702
$$ 16730249 16261956 15251494 14790917 14774751 14201393 13486012 13272208 12550402 12237700
16653A2237700n45742m8502o08941j89156k74857j01447j81748p81413k23137
$$ 12237700 11691958 11643456 11034515 10845359 10570502 10469055 10287307 9505894 9282757
16644I282757j62573l00879l06875l87350j2445q8176m99141k35361J64707l06477
$$ 9282757 9120184 8819305 8512430 8125080 8112635 8024459 7525318 7289957 7454664 7148187
16634G148187j99730j68763o7256k55668o6235l14711p8227k81001J79441m23403
$$ 7148187 6948457 6779694 6712438 6456770 6390535 6075824 5997597 5716596 5896037 5472634
16624E472634Q2481j95264q3866k79400m2333q5170m84998L24066j54300k63521
$$ 5472634 5555115 5359851 5275985 4996585 4954252 4869082 4384084 4708150 4553850 4290329
16614D290329J54548k41351j82960L00830l96221K56026l25779j16790L18135
$$ 4290329 4444877 4203526 4020566 4321396 3925175 4181201 3855422 3738632 4056767
16605D056767l30630l6760n09918J22695p668K23814k43957k49507K97719q00
$$ 4056767 3726137 3689377 3179459 3302154 3294486 3518300 3274343 3024836 3322555 3321755
16595C321755J53266l67744r3400J06191k84975J63298l29431J32064j81891k29105
$$ 3321755 3475021 3107277 3013877 3120068 2835093 2998391 2668960 2801024 2619133 2390028
16585B390028M01878k76051j23934M71022n43681m407J48111l52405M82168m80160
$$ 2390028 2791906 2515855 2391921 2862943 2319262 2314855 2462966 2110561 2592729 2112569
16575B112569j13672o3168k22301M27722Q1676k19201j37273J82199j26651k48362
$$ 2112569 1998897 1935729 1713428 2141150 2222826 2003625 1866352 2048551 1921900 1673538
16565A673538L70423Q0702j58855J2892j07818k52951p4063J52554M9717l7303
$$ 1673538 2043961 2124663 1965808 1978700 1870882 1617931 1543868 1696422 1746139 1708836
16555A708836l05456J98936n05432L37862k04008L50132j76089j0975o5269K80339
$$ 1708836 1403380 1602316 1096884 1434746 1230738 1580870 1404781 1393806 1328537 1608876
16545A608876j94620l5215J57867k63625Q7917K13249k58727M3867K14836l19086
$$ 1608876 1414256 1379041 1536908 1273283 1361200 1574449 1315722 1359589 1574425 1255339
16535A255339J28584j22347J35121m22203J43855q6485j30131J09050L65529k23135
$$ 1255339 1383923 1261576 1396697 974494 1118349 1031864 901733 1010783 1376312 1153177
16525A153177l25123n3788L40365M7094J74762o16453L55878L1079j89281L21878
$$ 1153177 828054 774266 1114631 1161725 1336487 720034 1075912 1106991 917710 1239588
16515A239588j16214k02771j35605L08803k17781K61689k07529m26900P16563
$$ 1239588 1123374 920603 784998 1093801 876020 1137709 930180 503280 1219843
16506A219843J06030n86990J70553l93728M49515j42716j90213J81661R2577k97141
$$ 1219843 1325873 738883 909436 515708 965223 822507 632294 813955 906532 609391
16496F09391o7686M33192D14665M59403l32326J05038L11880j72984M5461l21269
$$ 609391 541705 974897 414665 874068 541742 646780 958660 785676 831137 509868
16486E09868L10772k8850r3184j92235J26500j46088J297K46284m7246j44181
$$ 509868 820640 791790 698606 506371 632871 486783 488080 734364 687118 542937
16476E42937Q5553j58409J19974L396r5878L4948P9948J56227C81017L70191k32752
$$ 542937 628490 470081 590055 593451 497573 532521 612469 768696 381017 751208 518456
16465E18456M6087J47782k11309K38563K56376D31810J24230K49576l98332L4026
$$ 518456 564543 712325 501016 739579 995955 431810 556040 805616 407284 441310
16455D41310K25640J01199B74901K63757L3259j82938O09836D08173j0938K72497
$$ 441310 666950 768149 274901 538658 571917 388979 998815 408173 397235 669732
16445F69732B40125J92545N1325I0825M50675K29422l78885O2613A68861L00124
$$ 669732 240125 432670 483995 90825 541500 770922 392037 454650 168861 468985
16435D68985B13147K11666A59263M18127j50903O2193J324K1764Q3184m7317B61307
$$ 468985 213147 424813 159263 577390 426487 488680 490004 511768 594952 547635 261307
16423C32177K68863k9349k28516r2102J56808d0674D35627j77074J42001P4538
$$ 332177 601040 571691 343175 251073 407881 -40674 435627 258553 400554 475092
16413D75092A85322L21618A45773L79380O3745q0802j24411j31842L14023j03733
$$ 475092 185322 506940 145773 525153 588898 508096 383685 251843 565866 462133
16403D62133I7282M22357B20796H3036L17772J14359N2410A61479J50977J99008
$$ 462133 97282 519639 220796 83036 400808 515167 567577 161479 312456 511464
16393E11464j73527o4069D5069K95222A02253a3723D92917o3203g2594C27556
$$ 511464 337937 273868 45069 340291 102253 -13723 492917 429714 -72594 327556
16382B92346J84504B04142M4635B2397J97927e3472A80016J97618J60417B27372
$$ 292346 476850 204142 248777 22397 220324 -53472 180016 377634 538051 227372
16371A13200J60932K62781A84428K73243A36800K99758O5994A83226J41415I8674
$$ 113200 274132 536913 184428 457671 136800 436558 502552 183226 324641 98674
16360D38250q4563I6272b74338b9304B48280L6170A28192a5902r2918j2260A24785
$$ 438250 353687 96272 -274338 -29304 248280 284450 128192 -15902 -108820 -121080 124785
16348A15853m2668J38659r4152J34693P8109A28426Q6689j4229K53530B0934J55338
$$ 115853 73185 211844 117692 252385 330494 128426 215115 200886 454416 20934 176272
16337A76272E9548K6903L65891k2130A94114e2477C13052O2124a11002g836j23131
$$ 176272 59548 86451 452342 430212 194114 -52477 313052 375176 -111002 -7836 -130967
16326a30967C7158P2751L40524k19794e7346C78753H0819a90993h4336A67248
$$ -130967 37158 109909 450433 230639 -57346 378753 80819 -190993 -84336 167248
16315A45087L7684m4220K38474q2806j16671J18997a67067E0291K3338Q67a71238
$$ 145087 182771 138551 377025 294219 177548 296545 -167067 50291 73629 74496 -171238
16303A18103P3007J00203M1952b0998l9223D35294j67569O9372A40077P8575e2136
$$ 118103 191110 291313 333265 -20998 -60221 435294 267725 337097 140077 218652 -52136
16291B82193A02278K04397J70980B2998K30525A05915P9117a58271D32206b0749
$$ 282193 102278 306675 477655 22998 253523 105915 185032 -158271 432206 -20749
16280B82984a39146H3655a05083A85243k7572j876f8493I1669J15768H9715K18853
$$ 282984 -139146 83655 -105083 185243 157671 155795 -68493 91669 207437 89715 308568
16269C08568j51154p2863b25725B29536o542K07908E8628h7568B20866g2097A89967
$$ 308568 157414 84551 -225725 229536 222994 430902 58628 -87568 220866 -72097 189967
16257B03197J21609a66041C07786a90935A95027J6647K23287A81276F46b11177
$$ 203197 324806 -166041 307786 -190935 195027 211674 434961 181276 646 -211177
16246B88359D1059j2345a5779E4254g5269B2884K21487m6999e9895n2561H6244
$$ 288359 41059 28714 -15779 54254 -75269 22884 244371 197372 -59895 -112456 86244
16234A83634p2605J93607F3531N2522K16839G4408N2422n7035O1336a5756k08248
$$ 183634 111029 304636 63531 116053 332892 74408 126830 69795 131131 -15756 -224004
16223b24004C16187b9198A49664c58824B18517m3986c8767F2398a82350f9785
$$ -224004 316187 -29198 149664 -358824 218517 174531 -38767 62398 -182350 -69785
16212B11410a26855A92167h2814C08538A5836J03650l1422l0490d9385D5261a19889
$$ 211410 -126855 192167 -82814 308538 15836 119486 88064 57574 -49385 45261 -119889
16200a5369D55693L4020F7272c93107a41021L3085D44940a01074q7754f1244K1469
$$ -15369 455693 489713 67272 -393107 -141021 -107936 444940 -101074 -188828 -61244 -39775
16189c9775A61574c34541a59603C32612H8718L556g9100j2614L1276n0088C3485
$$ -39775 161574 -334541 -159603 332612 88718 92274 -79100 -91714 -60438 -110526 33485
16177A48193P0983a13711D26646a10361d4281C04959a73186f8475A93308K10924
$$ 148193 219176 -113711 426646 -110361 -44281 304959 -173186 -68475 193308 404232
16167D04232a49341J0699K9012d5569A9477q40K21579a34482A61768p7905R6625
$$ 404232 -149341 -138642 -109630 -45569 19477 18637 240216 -134482 161768 83863 180488
16156A80488a49321A22647J21057o4752B0671a71061A08349d6877j19762r1068
$$ 180488 -149321 122647 243704 178952 20671 -171061 108349 -46877 -166639 -257707
16146b57707k5784B08190r0519g8677j87889A06126c15572h9700A69478f0724
$$ -257707 -283491 208190 117671 -78677 -266566 106126 -315572 -89700 169478 -60724
16135D031J82368d5927A03204a28262b8037j14252O0252A4242a95094N112A00317
$$ 4031 186399 -45927 103204 -128262 -28037 -142289 -82037 14242 -195094 -189982 100317
16123A24593a42812J9598j08803j54443A15935a31113j03892J1088M3049N7817
$$ 124593 -142812 -123214 -232017 -386460 115935 -131113 -235005 -223917 -180868 -123051
16113a23051j99386H9163a25718A72524b014l59673c0495o2365I676a7570B71076
$$ -123051 -322437 89163 -125718 172524 -2014 -361687 -30495 -92860 9676 -17570 271076
16101G1645c3598E2944a14253A34484a91797j24224c7998j46237K9885j02317
$$ 71645 -33598 52944 -114253 134484 -191797 -316021 -37998 -184235 -154350 -256667
16091b56667J08467p0743Q5974k70590J20795A95153a29171B16770H6466a41963
$$ -256667 -148200 -218943 -132969 -403559 -282764 195153 -129171 216770 86466 -141963
16080B20269j09598a67078c6706j2212A59827B8559a4634k63526k3829a19732
$$ 220269 110671 -167078 -36706 -48918 159827 28559 -14634 -278160 -301989 -119732
16069c16089e9859E1050a1858F0713a77257A82500b13461A24433Q1417b2671H4882
$$ -316089 -59859 51050 -11858 60713 -177257 182500 -213461 124433 205850 -22671 84882
16057b03516O1195e7147A54973g1984n996m7954j05211K677A44886B352b80957
$$ -203516 -142321 -57147 154973 -71984 -77980 -125934 -231145 -228468 144886 2352 -280957
16045B10152D7295d22021A76913b75175c6228A81885n5297a72633H5716a8060
$$ 210152 47295 -422021 176913 -275175 -36228 181885 126588 -172633 85716 -18060
16034a12567e5956A62175b75675B92943g8639m06993a40490H4352a050A38780
$$ -112567 -55956 162175 -275675 292943 -78639 -485632 -140490 84352 -1050 138780
16023b92805b2860k54510A81976a12045G8613b0364D3367b79612B41006E7323
$$ -292805 -22860 -277370 181976 -112045 78613 -20364 43367 -279612 241006 57323
16012b5138k0364b18k68283A55379a91554F6282l1275a50780C6643a17663D0255
$$ -25138 -45502 -218 -268501 155379 -191554 66282 35007 -150780 36643 -117663 40255
16000E3260A7482K57274a33309A7267a58781B8042a13838l4518A83554e1084l2060
$$ 53260 17482 274756 -133309 17267 -158781 28042 -113838 -148356 183554 -51084 -83144
15989h3144B5237c11291G5129c46253A96572N6214J24116j27218G4503J31884
$$ -83144 25237 -311291 75129 -346253 196572 252786 376902 249684 74503 206387
15979B06387M235g2333k09542i7415g890B00720C4307Q4887f4683F9349R1632
$$ 206387 210622 -72333 -281875 -97415 -7890 200720 34307 119194 -64683 69349 160981
15968A60981c24646b8743q3742E8917J38263A2442g9623B85369h6021G5851g4489
$$ 160981 -324646 -28743 -112485 58917 197180 12442 -79623 285369 -86021 75851 -74489
15956A60179b80396I220J71463d5492k98583B60739b6497r4211A74171b32614
$$ 160179 -280396 9220 180683 -45492 -344075 260739 -26497 -120708 174171 -232614
15945b24634R6633l4244j04314H7428i3672j73125p1379a15550A72739d22552
$$ -224634 -128001 -162245 -266559 87428 -93672 -266797 -338176 -115550 172739 -422552
15934e0409B08919C14J4009e6553B62387A28219c34906J19275b1781j74410m563
$$ -50409 208919 314 14323 -56553 262387 128219 -334906 -215631 -21781 -196191 -200754
15923b00754D4145a67784a4318C7588e45635H0443l3073N0818b5694k63086G3448
$$ -200754 44145 -167784 -14318 37588 -545635 80443 47370 98188 -25694 -288780 73448
15911B39926i0741I2725a28653C0790L72720A77698a09173B9958b26772A44266
$$ 239926 -90741 92725 -128653 30790 403510 177698 -109173 29958 -226772 144266
15900c05243J50574j69499a31840j24311f2060q8649F6908b03181C8279a97126
$$ -305243 -154669 -324168 -131840 -256151 -62060 -150709 66908 -203181 38279 -197126
15889b18932q6067D62412A60638J56801G8891B9859P0421K4801g1480K7426I972
$$ -218932 -304999 462412 160638 317439 78891 29859 100280 125081 -71480 -44054 9972
15877B1952g944A04320c35924J58079j63170C4433a57906A02585a76679l19588
$$ 21952 -7944 104320 -335924 -177845 -341015 34433 -157906 102585 -176679 -496267
15867d96267a77272M567A39195b88534o2429B54459H241a37453A03b90620H2424
$$ -496267 -177272 -172705 139195 -288534 -350963 254459 8241 -137453 103 -290620 82424
15855a40788B59073a36738G8220b06127e3758j13640d7417k78263B976d7917l93322
$$ -140788 259073 -136738 78220 -206127 -53758 -167398 -47417 -325680 2976 -47917 -441239
15844d41239A69829G2787b17108d4253n1311A8139b13352N553C10450E5844j0875
$$ -441239 169829 72787 -217108 -44253 -95564 18139 -213352 -207799 310450 55844 44969
15833D4969e8106A42759b75217f4050k29161m2558a67422f4748j52311B23690
$$ 44969 -58106 142759 -275217 -64050 -293211 -335769 -167422 -64748 -217059 223690
15822A94966p1974J53162j18000a16467a1368r7943o2588j37350A31567a34249
$$ 194966 122992 276154 158154 -116467 -11368 -109311 -171899 -309249 131567 -134249
15811d8480k6903n3491A16568k2006e8977p4256N5719b2231m06263b1240p4850
$$ -48480 -75383 -128874 116568 94562 -58977 -133233 -77514 -22231 -428494 -21240 -96090
15800i6090E1853K13601a98393k7170B13725i5492A4030f9361J8935k90254R4099
$$ -96090 51853 265454 -198393 -225563 213725 -95492 14030 -69361 -50426 -340680 -246581
15789b46581A777c4449B08647a97321l23365B26798E9426a99119d6866B99174
$$ -246581 1777 -34449 208647 -197321 -520686 226798 59426 -199119 -46866 299174
15778B5440c29640K1626h1385A11369c64383a17120H5837C772K03440d2214A96487
$$ 25440 -329640 -308014 -81385 111369 -364383 -117120 85837 3772 207212 -42214 196487
15766D6407a97836j41799E1245f3321A26199j1703C2577J10312N391K6546m3136
$$ 46407 -197836 -339635 51245 -63321 126199 114496 32577 142889 148280 174826 131690
15755A31690c5419I6781J9821c7532A15851b78758C1723b31579A03835R3014a70833
$$ 131690 -35419 96781 116602 -37532 115851 -278758 31723 -231579 103835 196849 -170833
15743G2153a44708M2538j89040e4776k01339C98050A12174l5716a24505j88783
$$ 72153 -144708 -102170 -291210 -54776 -256115 398050 112174 76458 -124505 -313288
15733c13288D2117b48500a7694l99761J29584a17236A93436C9445N2991J8124
$$ -313288 42117 -248500 -17694 -417455 -287871 -117236 193436 39445 92436 110560
15723A10560a8771Q62k414H8671J14244a48033I0498a52093q907J9489C6514K34348
$$ 110560 -18771 -17909 -20323 88671 202915 -148033 90498 -152093 -161000 -141511 36514 270862
15711B70862i0905k4574A78001c009n0028A5246a6067k21622C1060c75253a49087
$$ 270862 -90905 -115479 178001 -3009 -53037 15246 -16067 -237689 31060 -375253 -149087
15699e7080j68178M9261B335L28388a59285N883k67236O2460c5508H8510R8935
$$ -57080 -225258 -175997 2335 330723 -159285 -153402 -420638 -358178 -35508 88510 187445
15688A87445L4636c1752k48945c0210A5869K21018p0764b95811J18901L5080L2200
$$ 187445 222081 -31752 -280697 -30210 15869 236887 166123 -295811 -176910 -141830 -109630
15677a09630m5895F8965c20461a32768p3235G9545N4535a90413Q9622B93675b9106
$$ -109630 -155525 68965 -320461 -132768 -206003 79545 134080 -190413 -100791 293675 -29106
15665e1026j62946A21208a29014a3570j26865A45058d35751R8007b1748j4340
$$ -51026 -213972 121208 -129014 -13570 -140435 145058 -435751 -337744 -21748 -36088
15655c6088C6430a12409C6415b68081F0847A5822a0981A9589N762J10158P8018
$$ -36088 36430 -112409 36415 -268081 60847 15822 -10981 19589 25351 135509 213527
15644B13527a08316J9138A86584b35055A82921E9966a90445B0239J06249a35410
$$ 213527 -108316 -89178 186584 -235055 182921 59966 -190445 20239 126488 -135410
15633c24039B79592F2809K1086b63328m9399c6044j90398A85430K7664J18170
$$ -324039 279592 62809 83895 -263328 -312727 -36044 -226442 185430 213094 331264
15623C31264A09860d4302j6451O706m88816B25102A3197Q1997E306N013a6351
$$ 331264 109860 -44302 -60753 -54047 -542863 225102 13197 95194 5306 10319 -16351
15611B76401G6596a23032A24325e2793j57871D0550e2993a172j3862j26135f8129
$$ 276401 76596 -123032 124325 -52793 -210664 40550 -52993 -1172 -15034 -141169 -68129
15599b11438f4627j70744K7945d8797A51646a3393B33708F7601N8461E0428b70160
$$ -211438 -64627 -235371 -207426 -48797 151646 -13393 233708 67601 126062 50428 -270160
15587g4516B5237f8398c525D178K25552G5876k8980a9574k80627B03723a22492
$$ -74516 25237 -68398 -3525 4178 229730 75876 46896 -19574 -300201 203723 -122492
15575A33287b4755d775n378B7217d358k95189C65670e4496j74003d8309B4570
$$ 133287 -24755 -4775 -10153 27217 -4358 -299547 365670 -54496 -228499 -48309 24570
15563F9980J50496A0019J16289b19164A35364a58979B68911b6612A11218a8268
$$ 69980 220476 10019 126308 -219164 135364 -158979 268911 -26612 111218 -18268
15552b40836e8201J7679p7180F8742J51717b9372j84518A01564H366K70827C6412
$$ -240836 -58201 -40522 -117702 68742 220459 -29372 -213890 101564 8366 279193 36412
15540c7940o1664A19585e3946j4916m7199i144k52740A70133a3633E4087K33873
$$ -37940 -99604 119585 -53946 -68862 -116061 -9144 -261884 170133 -13633 54087 287960
15529B87960b32387B1155a9045l19047Q3502G407Q8803r240Q0711F3623K1463
$$ 287960 -232387 21155 -19045 -338092 -254590 7407 96210 86970 167681 63623 85086
15518H5086b63225A0995a76875a5241D49131G7077K0309a99052B62759b1385C9378
$$ 85086 -263225 10995 -176875 -15241 449131 77077 97386 -199052 262759 -21385 39378
15506b98241J39703A33302a83378F2519R0856a07709I7085b30868A13722l4549
$$ -298241 -158538 133302 -183378 62519 153375 -107709 97085 -230868 113722 79173
15496G9173a03907a7381C16026E0610P8475b20850o9439L5777h4658I1791a0438
$$ 79173 -103907 -17381 316026 50610 129085 -220850 -290289 -254512 -84658 91791 -10438
15484B56523c0176A65220i688B8991M75577B36497G2229c51571B57352r7550E5584
$$ 256523 -30176 165220 -9688 28991 504568 236497 72229 -351571 257352 159802 55584
15472g7095A8005K19898b18660q9349D8279b52129a10311N20D1863a77336l4235
$$ -77095 18005 237903 -218660 -308009 48279 -252129 -110311 -109791 41863 -177336 -211571
15461b11571A01576J40727B5027a17717c2329j43653A25548b40935A72362C8899
$$ -211571 101576 242303 25027 -117717 -32329 -175982 125548 -240935 172362 38899
15450B15110L59612b42952B64322R7171A6658g9766G2406A5292J32609a31563
$$ 215110 574722 -242952 264322 361493 16658 -79766 72406 15292 147901 -131563
15439a13564c851o4489A12909a49536c4266k1219j7451b2970k30288a7994r6413
$$ -113564 -3851 -68340 112909 -149536 -34266 -55485 -72936 -22970 -253258 -17994 -114407
15428a14407C6036b49860j69443A43820k8078h4471q0828A95006a27680b1669
$$ -114407 36036 -249860 -419303 143820 115742 -84471 -165299 195006 -127680 -21669
15417b45080Q6000A9965c87429d918n74A05380M25356A95420a51628A07874b59013
$$ -245080 -159080 19965 -387429 -4918 -5492 105380 530736 195420 -151628 107874 -259013
15405a55713A14638f2785j4460C55301h0567o4930A26931b33136B70427C5907
$$ -155713 114638 -62785 -77245 355301 -80567 -145497 126931 -233136 270427 35907
15394h5723j45515d8680m1297d4714a5092o9532a3171A252R6395c0543n3238l64923
$$ -85723 -231238 -48680 -89977 -44714 -15092 -84624 -13171 1252 97647 -30543 -83781 -448704
15382d48704Q8667H5304J09775C7042Q9075c6491A26402a4625C38388A08845i445
$$ -448704 -360037 85304 195079 37042 126117 -36491 126402 -14625 338388 108845 -9445
15370b3787j43848B4646b153j52308O2203j47736J8331N4626A80027J14866A35968
$$ -23787 -167635 24646 -2153 -154461 -92258 -239994 -221663 -167037 180027 294893 135968
15358G2876a78307H0419N1683g0330r0888B12596G4997J63821A15900L3378a02961
$$ 72876 -178307 80419 132102 -70330 -161218 212596 74997 238818 115900 149278 -102961
15346b05111B28310c7195B16800d44510C40361E081i8534O255j2412A42683K47642
$$ -205111 228310 -37195 216800 -444510 340361 5081 -98534 -92279 -104691 142683 390325
15335C90325I4268K7009b36301C04064b82289B38635p5477e6552r2640l184j35456
$$ 390325 94268 121277 -236301 304064 -282289 238635 163158 -56552 -149192 -152376 -287832
15324b87832A94002e1575B41711b72489a23627D7776b43330a4057q6149A35005
$$ -287832 194002 -51575 241711 -272489 -123627 47776 -243330 -14057 -100206 135005
15313F5115K06589C9379L09821A06486K41068i6945j74070J14655L0874A48364
$$ 65115 271704 39379 349200 106486 347554 -96945 -271015 -156360 -125486 148364
15302b6188A32249b78061A6125K28851I56h7457A2240a73457A42610a58213O3621
$$ -26188 132249 -278061 16125 244976 956 -87457 12240 -173457 142610 -158213 -94592
15291i4592B21217A1955K02216J56600h1493m980A32294E3356c28130H3553L4099
$$ -94592 221217 11955 214171 370771 -81493 -86473 132294 53356 -328130 83553 117652
15280A17652j3908J34238F8248L5102L19366h8824C4140J95104b19966B20584
$$ 117652 103744 237982 68248 103350 422716 -88824 34140 229244 -219966 220584
15269C10972Q893i8876d4153A66650Q6668a18650f934A52256a47435j01065A21552
$$ 310972 319865 -98876 -44153 166650 253318 -118650 -6934 152256 -147435 -248500 121552
15257B30907A00327K92583I5685a29103B28012Q3641F1994K83406L89890N43886
$$ 230907 100327 392910 95685 -129103 228012 311653 61994 345400 735290 1279176
15247A279176J66252m68942Q05183G43556B91675I1702L3482J90421m5670M5709
$$ 1279176 1445428 976486 1781669 743556 291675 91702 125184 315605 269935 315644
15237C15644A12346J43025l9965A723O7726M1435a80368L4592K1916G79334A51834
$$ 315644 112346 255371 215406 1723 69449 110884 -180368 -145776 -123860 779334 151834
15225B7728P7295j3880J07379b1659j76644B45106J37907A28492c5956b259j08034
$$ 27728 105023 91143 198522 -21659 -198303 245106 383013 128492 -35956 -2259 -110293
15214a10293A39159J733k5326D7506L23332c8490D9623J88170C5545Q1119F3J77179
$$ -110293 139159 140892 115566 47506 370838 -38490 49623 237793 35545 116664 63 177242
15202A77242g663A5254a00743M9517A65016B8013a73970P0425A50398b36751A10069
$$ 177242 -7663 15254 -100743 -51226 165016 28013 -173970 -103545 150398 -236751 110069
15190H9126j5971g2546A82907a50050B7369K53583r0002n5827K9051A1981K21355
$$ 89126 73155 -72546 182907 -150050 27369 280952 190950 135123 164174 11981 233336
15179B33336f1192B86200H1887K9787M21782E4316N6293l7139a8131j16164B98871
$$ 233336 -61192 286200 81887 111674 533456 54316 110609 73470 -18131 -134295 298871
15167b9896B6796a85795B524a453B0246R347a2694B56111j00744A9801J6670K16870
$$ -29896 26796 -185795 2524 -1453 20246 29593 -12694 256111 155367 19801 36471 253341
15155B53341a10988C64276b68054B52087n6307A3673Q8153e732j01351C952L59211
$$ 253341 -110988 364276 -268054 252087 195780 13673 101826 -5732 -107083 3952 363163
15144C63163B6123P6434o771D6597h7844A79963J53522D9810N9763J55340I0275
$$ 363163 26123 102557 95786 46597 -87844 179963 333485 49810 109573 264913 90275
15132b66699C01862j19160a83912e2420B78407h5861A59999a03339C37747j10557
$$ -266699 301862 182702 -183912 -52420 278407 -85861 159999 -103339 337747 227190
15122B27190R4209D323c9442J4889p9081C70734f5457r8753D46885k22161L12637
$$ 227190 321399 4323 -39442 -24553 -103634 370734 -65457 -164210 446885 224724 537361
15111E37361k23889a47621A43001J8590E4963B5470l805K04427C7616J33338J50611
$$ 537361 313472 -147621 143001 161591 54963 25470 21665 226092 37616 170954 321565
15100C21565e992A23615J9405P882F6551K00524b41026A41132B2889K13052c8421
$$ 321565 -5992 123615 143020 150902 66551 267075 -241026 141132 22889 235941 -38421
15088A98013a63757K3025j41932C63970A00246F281L80296i4681C081J41047K65703
$$ 198013 -163757 -140732 -282664 363970 100246 6281 386577 -94681 3081 144128 409831
15077D09831A06493m4535b424j83517A56679K41995i8666A64914C7515J834J32616
$$ 409831 106493 61958 -2424 -185941 156679 398674 -98666 164914 37515 39349 171965
15066A71965p0495J1082K6796r288a33175d2019a9712C94308i2293I4856L19434
$$ 171965 101470 112552 139348 130060 -133175 -42019 -19712 394308 -92293 94856 414290
15055D14290A07121a43722H6320L15736A23451K22244j22180K730J73736j80735
$$ 414290 107121 -143722 86320 402056 123451 345695 223515 226245 399981 219246
15045B19246a41628B94776K77368A59257K46791P3285f2413B24106Q9559k7327
$$ 219246 -141628 294776 572144 159257 406048 479333 -62413 224106 313665 286338
15035B86338G7352M4216L9693L0926G2958e9100C65420a3787C44474n9177f6674
$$ 286338 77352 121568 161261 192187 72958 -59100 365420 -13787 344474 285297 -66674
15023E52962B57512J73668h3630L1555B28610J34102c0908J2352A6002K1135K07633
$$ 552962 257512 431180 -83630 -52075 228610 362712 -30908 -18556 16002 37137 244770
15012B44770c07052B41217F0664J65692r5309J4775r205J87627A58243K32263
$$ 244770 -307052 241217 60664 226356 131047 145822 136617 324244 158243 390506
15002C90506p7418a0733D22510g5472e68F45449A21069j1930B940M5503N7128
$$ 390506 313088 -10733 422510 -75472 -568 645449 121069 109139 2940 48443 105571
14991A05571J13390r483c0176A8759K37561r2589M9338f4052D48390A07344M5023
$$ 105571 218961 209478 -30176 18759 256320 163731 213069 -64052 448390 107344 152367
14980A52367L48842j85485A10412N74486B25940q8616R0086H5194L34293A52676
$$ 152367 501209 315724 110412 684898 225940 137324 227410 85194 419487 152676
14969A51425B2829h1688B18751J76556A51418J08504p9150K17477l9467O7966
$$ 151425 22829 -81688 218751 395307 151418 259922 180772 398249 358782 426748
14959D26748j92226L92810B46185K67307B8378K67307L51236A26844J10934n6999
$$ 426748 234522 627332 246185 513492 28378 295685 646921 126844 237778 180779
14949A80779N8804J5558o655K61238J18599j94437j32273L4632r0832B4366K81008
$$ 180779 239583 255141 248486 509724 628323 433886 301613 336245 245413 24366 305374
14938C05374n423A40326K38430k5643J10481A02558P8695L33822j18141j54658
$$ 305374 299951 140326 378756 353113 463594 102558 181253 515075 396934 242276
14928B42276n5597K84425j0645j32294j45859J44221r9490K34920k1932j82050
$$ 242276 186679 471104 460459 328165 182306 326527 227037 461957 440025 257975
14918B57975J78078A97599L99762k92983J00700A97281J93625l950B6604J25752
$$ 257975 436053 197599 597361 304378 405078 197281 390906 386956 26604 152356
14908A52356K09449J49880K13091c9877A42691J98147J27757B19620J155J82441
$$ 152356 361805 511685 724776 -39877 142691 340838 468595 219620 220775 403216
14898D03216a2112D82103j2293A79590J89538F3762L40669J04995k06764A32557
$$ 403216 -12112 482103 469810 179590 369128 63762 404431 509426 302662 132557
14887E88275A64039L07656Q0949j81582A79549J63617J10357A54668Q8794L03802
$$ 588275 164039 471695 552644 371062 179549 343166 453523 154668 243462 547264
14877E47264B23546J09174J59245j16322b2374D50627R1857B34214L43565p2525
$$ 547264 223546 332720 491965 375643 -22374 450627 542484 234214 577779 505254
14867E05254j25089J9553K9930k14481k5396K98709k01193L77587k28436j5939
$$ 505254 380165 399718 429648 215167 189771 488480 287287 664874 436438 420499
14857D20499j54134L47521j86748j50548Q1822m7237M84807g9647F77317j18572
$$ 420499 266365 613886 427138 276590 358412 311175 795982 -79647 677317 558745
14847E58745K5426k24856J90469k17695N5113r1598J97748p1577G2464P26239
$$ 558745 584171 359315 549784 332089 387202 295604 493352 421775 72464 798703
14837G98703l59720L9514p8350r7829J9173A55065K04178K25924k30490L35988
$$ 798703 438983 478497 400147 302318 321491 155065 359243 585167 354677 690665
14827F90665m7840k42734K30173B91223J7226M45433j42898j15909K35272C44578
$$ 690665 642825 400091 630264 291223 308449 753882 610984 495075 730347 344578
14816E31328B61422M08932j47788K60189r2352l14113K08353A48000Q4995N93450
$$ 531328 261422 670354 522566 782755 690403 376290 584643 148000 232995 826445
14806H26445C67065K33488k03641L01742k34058Q9262J26948k80703n0396J70838
$$ 826445 367065 600553 396912 698654 464596 553858 680806 400103 349707 520545
14796E20545O324n0159A25526J23641M72480l01046J66257J01324j9102k43302
$$ 520545 526869 476710 125526 249167 721647 420601 586858 688182 669080 425778
14786D25778L18877q2179k82194L86732k36130M84578k65627C51639L52961K30718
$$ 425778 744655 662476 380282 767014 530884 1015462 749835 351639 704600 935318
14776I35318k38623l07232L61944k25380l1435k6822R5117j21025K01291j11762
$$ 935318 696695 389463 751407 526027 494592 467770 562887 441862 643153 531391
14766E31391J60000J03858k53253M23045D65090q5293O15765j2096D37079J32504
$$ 531391 691391 795249 541996 965041 465090 379797 995562 983466 437079 569583
14756E69583L08506k1835l32422L06314J59849l1153l10807J40142j55721K77381
$$ 569583 878089 856254 523832 830146 989995 958842 648035 788177 632456 909837
14746I09837j56425j97426J12316n5319j9243J64343k80967P9766K18347l85009
$$ 909837 753412 555986 668302 612983 593740 758083 477116 556882 775229 390220
14736C90220M15502k57889M39389J2195l55888J93704J06962l50081j4388M9277
$$ 390220 805722 547833 987222 999417 643529 837233 944195 594114 579726 629003
14726F29003J01087K47424J21393k72283l73248O0217J77711M06618j22814L46426
$$ 629003 730090 977514 1098907 826624 453376 513593 691304 1097922 975108 1321534
14716A321534m15278J46058m912C44363L49056M36622l3321m75207L03833K9453
$$ 1321534 906256 1052314 1047402 344363 693419 1130041 1096720 621513 925346 954799
14706I54799l79978m4242O73236l87852K28061l89351K4364K2904K09306O4866
$$ 954799 574821 530579 1203815 815963 1044024 654673 679037 701941 911247 976113
14696I76113j34933n6203J38858k6109o9887j59043L25476k35646J74738K40931
$$ 976113 841180 784977 923835 897726 827839 668796 994272 758626 933364 1174295
14686A174295j10306k08390M7110J37676N4692K88221k70403R4639q2324j11840
$$ 1174295 1063989 855599 902709 1040385 1095077 1383298 1112895 1207534 1125210 1013370
14676A013370q3693M24707j53459N6770j62310j96225L48566j61620j69835k08296
$$ 1013370 929677 1354384 1200925 1257695 1095385 899160 1247726 1086106 916271 707975
14666G07975M54931j33799Q5001Q6319j89822K89365l24976n5734K55885n2667
$$ 707975 1162906 1029107 1114108 1200427 1010605 1299970 974994 919260 1175145 1122478
14656A122478J69775k82339K26600j1180m2878K24925k70920o955J53693M7225
$$ 1122478 1292253 1009914 1236514 1225334 1182456 1407381 1136461 1129506 1283199 1330424
14646A330424j1079p5015O9789M2119K2509j32613K10443j12173k64959R5552
$$ 1330424 1319345 1244330 1314119 1356238 1378747 1246134 1456577 1344404 1079445 1174997
14636A174997J87297J79104Q28k27705R0204R0557m16421J77932K87932l1067
$$ 1174997 1362294 1541398 1542226 1314521 1404725 1495282 1078861 1256793 1544725 1513658
14626A513658L11776n86526J87502J9569j47662K99795m23967K65660J86039j11067
$$ 1513658 1825434 1238908 1426410 1445979 1298317 1598112 1174145 1439805 1625844 1514777
14616A514777J77161k26623N7352L2125K7180j50703L2235j17520J10521L52084
$$ 1514777 1691938 1465315 1522667 1554792 1581972 1431269 1463504 1345984 1456505 1808589
14606A808589q6734j88956J44286j09748k29957J31547K62925K68938m29098N3891
$$ 1808589 1721855 1532899 1677185 1567437 1337480 1469027 1731952 2000890 1571792 1625683
14596A625683K60854N8038l7277l6542J07911j23877k9877N14850k72590k21967
$$ 1625683 1886537 1944575 1907298 1870756 1978667 1854790 1824913 2339763 2067173 1845206
14586A845206P314j56505K44109O5926r3779J54371k3653j27515L14858J33668
$$ 1845206 1852520 1696015 1940124 2006050 1912271 2066642 2042989 1915474 2230332 2364000
14576B364000k25280L79898l45599j41913J32145n7537J93322J68256j56000L33111
$$ 2364000 2138720 2518618 2173019 2031106 2163251 2105714 2299036 2467292 2311292 2644403
14566B644403k42239O8733M32429l45446M22595n1238p8551J63168K16951k34953
$$ 2644403 2402164 2470897 2903326 2557880 2980475 2929237 2850686 3013854 3230805 2995852
14556B995852M97121K10951q943N67318k05110P00859J407401J739306L560831
$$ 2995852 3492973 3703924 3694981 4262299 4057189 4758048 6165449 7904755 11465586
14547A1465586Q136180J9863712R213274k4200044A1377719n426787k155340o31977
$$ 11465586 19601766 39465478 48678752 24478708 11377719 5950932 3795592 3163615
14539C163615o24704m01449J95596j596P5012j25366J56750k69981N31747j29766
$$ 3163615 2538911 2137462 2333058 2331462 2406474 2281108 2437858 2167877 2699624 2569858
14529B569858k26869j46359m6619K21804O4470k0443M39578l00344j53238m7277
$$ 2569858 2342989 2196630 2150011 2371815 2436285 2415842 2855420 2555076 2401838 2354561
14519B354561M74642J16032K8183k83721L22068m3597j11176N7017N5516J43420
$$ 2354561 2829203 2945235 2973418 2689697 3011765 2968168 2856992 2914009 2969525 3112945
14509C112945j0565L895l8031K21104P6071R8762l22731L82380m45886K18801
$$ 3112945 3102380 3106275 3068244 3289348 3365419 3464181 3141450 3523830 3077944 3296745
14499C296745K2331L02363k92902R4899J80449J38028k84707N3007M22820k46621
$$ 3296745 3319076 3621439 3328537 3423436 3603885 3741913 3457206 3510213 3933033 3686412
14489C686412k28625L10395J9844J55094J37432j48096L18673o15114N50548J51979
$$ 3686412 3457787 3768182 3788026 3943120 4080552 3932456 4251129 3636015 4186563 4338542
14479D338542j59094M52401m58459J81156K19831J14257l5448k33084k1590J3875
$$ 4338542 4179448 4631849 4173390 4354546 4574377 4688634 4653186 4420102 4398512 4412387
14469D412387N37798l08387M3974O4650M17869j81703k38063M61892J1046K28094
$$ 4412387 4950185 4641798 4685772 4750422 5168291 4986588 4748525 5210417 5221463 5449557
14459E449557J81569j64525m27700Q11342k82868K05449k88525P7892J43377K25020
$$ 5449557 5631126 5466601 5038901 5850243 5567375 5772824 5484299 5562191 5705568 5930588
14449E930588j04826M27933m75059M02726L1433J43780M7866K15606l74096M87941
$$ 5930588 5825762 6253695 5778636 6181362 6212795 6356575 6404441 6620047 6245951 6733892
14439F733892j45297R5263L22757j75169Q9072J99291m4232L41328l7522L79852
$$ 6733892 6588595 6683858 7006615 6831446 6920518 7119809 7075577 7416905 7379383 7759235
14429G759235j55846J82102J30015J67031k91481N47984O3735j92660L01434N3508
$$ 7759235 7603389 7785491 7915506 8082537 7791056 8339040 8402775 8210115 8511549 8565057
14419H565057J38566M71698K8543J18460K06373j13154K48864N7499k66345L59198
$$ 8565057 8703623 9175321 9203864 9322324 9528697 9415543 9664407 9721906 9455561 9814759
14409I814759K42025J48997L11003O5311J97533r7427M68511O1111M5535L08495
$$ 9814759 10056784 10205781 10516784 10582095 10779628 10682201 11150712 11211823 11257358 11565853
14399A1565853J45554j64774M48333L44405K12065N58577l16897M68594j79586
$$ 11565853 11711407 11546633 11994966 12339371 12551436 13110013 12793116 13261710 13082124
14390A3082124N59435N01073P1973J3194M42845K06774K25780J96570J95647L14164
$$ 13082124 13641559 14142632 14214605 14227799 14670644 14877418 15103198 15299768 15495415 15809579
14380A5809579O02218j00646R91363l09992L24633O35786K26466L6188P72598
$$ 15809579 16411797 16311151 17302514 16992522 17317155 17952941 18179407 18215595 18988193
14371A8988193M73437K62764N23843K75715L84261M99238M96970L04335L74278
$$ 18988193 19461630 19724394 20248237 20523952 20908213 21407451 21904421 22208756 22583034
14362B2583034N35632O69120L77204O60151N41140M69964N78226L82887Q85011
$$ 22583034 23118666 23787786 24164990 24825141 25366281 25836245 26414471 26797358 27682369
14353B7682369Q30686O32509M16713Q46834P64365J033261O40635P46657Q96020
$$ 27682369 28513055 29145564 29562277 30409111 31173476 32206737 32847372 33594029 34490049
14344C4490049J282614N18582J337881R66796R14354J128718J278833J143422
$$ 34490049 35772663 36291245 37629126 38595922 39510276 40638994 41917827 43061249
14336D3061249R42984J553774J444437J093869J727460J441083J852221J640673
$$ 43061249 44004233 45558007 47002444 48096313 49823773 51264856 53117077 54757750
14328E4757750J593104J915301J782372J999350J908043K657199K053795K264067
$$ 54757750 56350854 58266155 60048527 62047877 63955920 66613119 68666914 70930981
14320G0930981K738960K480396K711398K918225L236631L631444L250283L485361
$$ 70930981 73669941 76150337 78861735 81779960 85016591 88648035 91898318 95383679
14312I5383679L805120M088375M258377M741658M602003N214088N097537N687636
$$ 95383679 99188799 103277174 107535551 112277209 116879212 122093300 127190837 132878473
14304A32878473N881619O378615O770508O611770P210816Q030550Q593193Q527615
$$ 132878473 138760092 145138707 151909215 158520985 165731801 173762351 182355544 190883159
14296A90883159R373429R754558J0440420J0580506J1352984J1954814J2630030
$$ 190883159 200256588 210011146 220451566 231032072 242385056 254339870 266969900
14289B66969900J2857163J3591066J4094000J4435557J4683226J5181674J5007930
$$ 266969900 279827063 293418129 307512129 321947686 336630912 351812586 366820516
14282C66820516J4846093J4806618J4673856J3780662J3024114J1574661J0497903
$$ 366820516 381666609 396473227 411147083 424927745 437951859 449526520 460024423
14275D60024423Q780519O287363L085608m96608j442533k367049m227723p051151
$$ 460024423 468804942 475092305 478177913 477681305 476238772 473871723 469644000 462592849
14267D62592849q475120r122317j0839219j1678613j2887171j4047147j4497277
$$ 462592849 454117729 444995412 434156193 422477580 409590409 395543262 381045985
14260C81045985j5205031j4995550j5505810j5322110j5118435j4603996j3245210
$$ 381045985 365840954 350845404 335339594 320017484 304899049 290295053 277049843
14253B77049843j3513639j2730699j2507709j1446821j1153334j0339784r875741
$$ 277049843 263536204 250805505 238297796 226850975 215697641 205357857 195482116
14246A95482116r122977r097232q120624p459082p503072o852265o663000o200908
$$ 195482116 186359139 177261907 169141283 161682201 154179129 147326864 140663864 134462956
14238A34462956n651560m998988n486493m984227m672015m693511l703008l559679
$$ 134462956 128811396 123812408 118325915 113341688 108669673 103976162 100273154 96713475
14230I6713475l461248l985662l463051l103057l397526k687989k704235k352355
$$ 96713475 93252227 89266565 85803514 82700457 79302931 76614942 73910707 71558352
14222G1558352k591557k334775j761215k207951k341104k376679j495774j764668
$$ 71558352 68966795 66632020 64870805 62662854 60321750 57945071 56449297 54684629
14214E4684629j283888j381075j847860j703687j184018j444000j046912r32653
$$ 54684629 53400741 52019666 50171806 48468119 47284101 45840101 44793189 43860536
14206D3860536j107087j554985j118271j048010q71270j238920k10347j429162
$$ 43860536 42753449 41198464 40080193 39032183 38160913 36921993 36711646 35282484
14198C5282484r38090r95980o82868p03827q83356o79785p18746q21782n30304
$$ 35282484 34344394 33348414 32665546 31961719 31078363 30398578 29679832 28858050 28327746
14189B8327746o17040p91109q12308n29094m45769j58218r01403m47919n90170
$$ 28327746 27710706 26919597 26107289 25578195 25132426 24974208 24072805 23624886 23034716
14180B3034716l53078n61615n60437j91694n60864j3460r20775l67173M5170l82637
$$ 23034716 22681638 22120023 21559586 21367892 20807028 20793568 19872793 19505620 19550790 19168153
14170A9168153m84190o06109j86520j39328m45795m97287k52166l96898k94596
$$ 19168153 18683963 18077854 17891334 17752006 17306211 16808924 16556758 16159860 15865264
14161A5865264j87028m67517j99108k14216k44014j99362k53420k87124l63679
$$ 15865264 15678236 15210719 15011611 14797395 14553381 14354019 14100599 13813475 13449796
14152A3449796k24153n9743l82980K42487l07894l64748o2292l31319k12223l07964
$$ 13449796 13225643 13165900 12782920 13025407 12717513 12352765 12290473 11959154 11746931 11438967
14142A1438967n8739q2476j50407k5897n5840k42805o82627K63849j89213O6269
$$ 11438967 11380228 11297752 11147345 11121448 11065608 10822803 10140176 10404025 10214812 10281081
14132A0281081l52927l05933J69727n05436k4141j24487L6552l03746J05767k73829
$$ 10281081 9928154 9622221 9791948 9286512 9262371 9137884 9174436 8870690 8976457 8702628
14122H702628j43068P0025j34948p8019j304k90135K1093k92087j36326L31934
$$ 8702628 8559560 8629585 8494637 8416618 8415314 8125179 8146272 7854185 7717859 8049793
14112H049793m37496o1625j25991j90808k3420R0156n48171J99477n2812o3353
$$ 8049793 7612297 7550672 7424681 7233873 7210453 7300609 6752438 6951915 6899103 6835750
14102F835750o3927j09432l1013m45119L05426l18082L1891q364j94678k16449
$$ 6835750 6771823 6662391 6631378 6186259 6491685 6173603 6205494 6197130 6002452 5786003
14092E786003J39998m21468J98519J08264K11263l47481n2775j08636j14193o9528
$$ 5786003 5926001 5504533 5703052 5811316 6022579 5675098 5622323 5513687 5399494 5329966
14082E329966J33663J35341j59597l02217l2980K99605k11111k22093q2777j8965
$$ 5329966 5463629 5598970 5439373 5137156 5104176 5403781 5192670 4970577 4887800 4868835
14072D868835j70582q9741J49529J58643l15856k1721J43162K9277k68939O3926
$$ 4868835 4698253 4608512 4758041 4916684 4600828 4579107 4722269 4751546 4482607 4546533
14062D546533o57868M53799j22235k6073K82899K7035l28499J29579J53266k59299
$$ 4546533 3888665 4342464 4220229 4194156 4477055 4504090 4175591 4305170 4458436 4199137
14052D199137j4662j52502k32445J88250j28269k29373j20892J35874j72047K19340
$$ 4199137 4184475 4031973 3799528 3987778 3859509 3630136 3509244 3645118 3473071 3692411
14042C692411J13985o0857m42122K09762N6956K28344n25846P9242J30126j03958
$$ 3692411 3806396 3745539 3303417 3513179 3570135 3798479 3272633 3351875 3482001 3378043
14032C378043k35372K01097M7115l36743L0295L07937k52491k40917K27060o9430
$$ 3378043 3142671 3343768 3390883 3054140 3084435 3392372 3139881 2898964 3126024 3056594
14022C056594k36623L30048n79119J49893J8284J35447k42264L05974l13546n1371
$$ 3056594 2819971 3150019 2570900 2720793 2739077 2874524 2632260 2938234 2624688 2573317
14012B573317P6514k5090N47989o74803J25749J53606j97529r957o9102L9234
$$ 2573317 2649831 2624741 3172730 2497927 2623676 2777282 2579753 2569796 2500694 2539928
14002B539928k10874K41971j3154j65234J72536J31105k58474r214k59614K60357
$$ 2539928 2329054 2571025 2557871 2392637 2565173 2696278 2437804 2428590 2168976 2429333
13992B429333P431J91211O13792N93673K563824O116709J8517474J8467756k1697673
$$ 2429333 2436764 2627975 3241767 3835440 6399264 12515973 31033447 49501203 27803530
13983B7803530j3523834m909788k938729j051423p81034n32297j65994j00339
$$ 27803530 14279696 9369908 6431179 5379756 4598722 4066425 3900431 3800092
13975C800092o06240n9085j55503r5137l225k20429O0158M0887j29561r4989R3080
$$ 3800092 3193852 3134767 2979264 2884127 2880902 2660473 2720631 2761518 2631957 2536968 2630048
13964B630048K37572j22269k46528m6281K76193n40775K34555K2908j89179O9697
$$ 2630048 2867620 2745351 2498823 2452542 2728735 2187960 2422515 2445423 2256244 2325941
13954B325941r3018l9869J52793k49370K22637J67759m64775J84568j12156K55592
$$ 2325941 2232923 2193054 2345847 2096477 2319114 2486873 2022098 2206666 2094510 2350102
13944B350102l15541k4758j12610m0013n1379M08359l67555q9647L41190j54876
$$ 2350102 2034561 2009803 1897193 1857180 1805801 2214160 1846605 1756958 2098148 1943272
13934A943272l9049p0939j09575J59393J23349j4922o8759j41000l27465M93095
$$ 1943272 1904223 1833284 1723709 1883102 2006451 1991529 1922770 1781770 1454305 1947400
13924A947400n08115L11018Q4693m8148r0102j44117M30938j25766l65751J9162
$$ 1947400 1439285 1750303 1834996 1786848 1696746 1552629 1983567 1857801 1492050 1511212
13914A511212K26219j64399J75538j94687O15874o16239r1481J84399O8707k37493
$$ 1511212 1737431 1573032 1748570 1553883 2169757 1553518 1462037 1646436 1715143 1477650
13904A477650k60559L25717L0022l5417J9047r4687Q8667l10115k1079K50685
$$ 1477650 1217091 1542808 1572830 1537413 1556460 1461773 1550440 1240325 1219246 1469931
13894A469931K50555l99787R3243R476O3737n5304j60068K81835m35507O76082
$$ 1469931 1720486 1320699 1413942 1423418 1487155 1431851 1271783 1553618 1118111 1794193
13884A794193m58387r1934J04929j17877j40214K23578j91866L97683k13094j8145
$$ 1794193 1335806 1243872 1348801 1230924 1090710 1314288 1122422 1520105 1307011 1288866
13874A288866O3703P1090L43700m38774j14376M1253p082r4340J78231j08630
$$ 1288866 1352569 1423659 1767359 1328585 1214209 1255462 1248380 1154040 1332271 1223641
13864A223641m8669K7712J04153q8721Q6615N7544l31549J18445R3447l6518j05583
$$ 1223641 1174972 1202684 1306837 1218116 1304731 1362275 1030726 1149171 1242618 1206100 1100517
13853A100517k28214K98404J75578m91252L23066J38443k58344j68710M72211
$$ 1100517 872303 1170707 1346285 855033 1178099 1316542 1058198 889488 1361699
13844A361699q7191j56904J5227J32992m46324o5609M58626Lk4739n0977r1868
$$ 1361699 1274508 1117604 1132831 1265823 819499 753890 1212516 1212519 1187780 1136803 1044935
13833A044935J53326j86532k33033J30846n9973J9011K35262n8020o4957J98989
$$ 1044935 1198261 1011729 778696 909542 849569 868580 1103842 1045822 980865 1179854
13823A179854k1390K3851k53576O2611k6228j53934K82837l5004k56343M01307
$$ 1179854 1158464 1182315 928739 991350 965122 811188 1094025 1059021 802678 1203985
13813A203985l7925m6009q4072k4247k61754K87734j4558k53444N14245m68567
$$ 1203985 1166060 1120051 1035979 1011732 749978 1037712 1023154 769710 1283955 815388
13803H15388J60760m5455J58651p5438j0340k98824L23292r3272O5118k26180
$$ 815388 976148 930693 1089344 1013906 1003566 704742 1028034 934762 999880 773700
13793G73700J00576K1196j70490J10030P2274j0714L8726j35538Q6775J61542
$$ 773700 874276 895472 724982 835012 907286 896572 935298 799760 886535 1048077
13783A048077k06875j83705K3298L52357E08730J36035J58920J71956j63333j18475
$$ 1048077 841202 657497 680795 1033152 508730 644765 803685 975641 812308 693833
13773F93833M0230Q0859j91271K0927K84687j89979J86362r4300P9462j34574
$$ 693833 734063 814922 623651 644578 929265 739286 925648 831348 910810 776236
13763G76236Q9990k08547R6456L6389m9466L24380m91764M33416m17778L98496
$$ 776236 866226 657679 754135 790524 741058 1065438 573674 1007090 589312 987808
13753I87808k9666l21935M9878J54861P0851l38572K79202j14776l6450M02745
$$ 987808 958142 636207 686085 840946 911797 573225 852427 737651 701201 1103946
13743A103946l14222J17417D07367K70449Q5379j00178l1403N5270Q7493j68771
$$ 1103946 789724 907141 407367 677816 763195 663017 631614 686884 774377 605606
13733F05606M5952J6749J37836K2387j69389K02320l70955K00945r6776k60640
$$ 605606 651558 668307 806143 828530 659141 861461 490506 691451 594675 334035
13723C34035L55002k09883K54359m7225L923j16096J24328j22108J19740j6902
$$ 334035 689037 479154 733513 686288 690211 574115 698443 576335 696075 679173
13713F79173J98887q8043J10609D06381K16565P8208k27790l8099m7286L5643
$$ 679173 878060 790017 900626 406381 622946 701154 473364 435265 387979 423622
13703D23622J39398j1953P6120n0667L4765J06469m2078N8506k91660O31195D93459
$$ 423622 563020 551067 627187 576520 611285 717754 675676 734182 442522 1073717 493459
13691E85705R8279k49535K5392L93068l39016M00134C17686L52254L67591l48287
$$ 585705 683984 434449 459841 852909 513893 914027 317686 669940 1037531 689244
13681F89244j79474O4857n8121Q3609j49775P4359J11761j77758O0520J83988
$$ 689244 509770 574627 516506 600115 450340 524699 636460 458702 519222 703210
13671G03210K1679l04659K85689M6752j28423k40470L03188j28503k46085K52312
$$ 703210 724889 420230 705919 752671 624248 383778 686966 558463 312378 564690
13661E64690j57635J80496J07864l23357O3927l3548M13926C12679L8965J47042
$$ 564690 407055 587551 695415 372058 435985 402437 816363 312679 351644 498686
13651D98686j34323L31910k87629J85688j95829q2547J25352K57846P6517C22539
$$ 498686 364363 696273 408644 594332 398503 315956 441308 699154 775671 322539
13640F98869k51934k0628N0497P9518j07195J03777k26376K35799o0378j04081
$$ 698869 446935 426307 476804 556322 449127 552904 326528 562327 501949 397868
13630C97868J58748J1465K71481C86203K75920k65365j65025k3484p379L14303
$$ 397868 556616 568081 839562 386203 662123 396758 231733 208249 200870 515173
13620E15173j74675k8473m7574j8814J88676A80391R5187M76429B14589K08454
$$ 515173 340498 312025 264451 245637 434313 180391 275578 752007 214589 423043
13610D23043j25036K56587k1787P3785j49046k7319K8527m8334L2127K6860j56092
$$ 423043 298007 554594 532807 606592 457546 430227 458754 410420 442547 469407 313315
13599C13315M86604l80336L6455P9034J00131j01429q7911j1750A98021M58747
$$ 313315 799919 419583 456038 535072 635203 533774 445863 434113 198021 656768
13589F56768J68562A29960J10017J18316m9398K04981r1824N8253C002K49634
$$ 656768 825330 129960 239977 358293 308895 513876 422052 480305 3002 252636
13579B52636J68857j99263m5843M1597M453l185R6665K36065k585J91168l31758
$$ 252636 421493 222230 176387 217984 222437 219252 315917 551982 549397 740565 408807
13568D08807K596A91285J55839J76384k02562J07720j85377f1895B01838o1943
$$ 408807 411403 191285 347124 523508 320946 428666 243289 -61895 201838 139895
13558A39895J09633N3007J42601q6693p8708J89856j03318E6442L52441J56550
$$ 139895 249528 302535 445136 358443 279735 469591 366273 56442 408883 565433
13548E65433l4395K44706a9456C59135K04925b24165C28785J40061A49166K82041
$$ 565433 531038 775744 -19456 359135 564060 -224165 328785 468846 149166 431207
13538D31207D0695J34933J69178j61262M00952A76855N05769C18776J02257M7045
$$ 431207 40695 175628 344806 183544 584496 176855 682624 318776 421033 468078
13528D68078H9939L92604I9046K74671G396N03521j00446j52614J86657A96236
$$ 468078 89939 482543 99046 373717 7396 510917 410471 257857 444514 196236
13517C77039A52364J64683j21563J22368m5197G934O70873k71556r1319H4101
$$ 377039 152364 317047 195484 317852 272655 7934 678807 407251 315932 84101
13506B89843j00457R8962J25911M4702A35451L91868j66763j41459n4953e6155
$$ 289843 189386 288348 414259 458961 135451 527319 360556 219097 164144 -56155
13495E8544L18884a9051C21234J04845A46994L6165O2175J53707o8462i0574C50491
$$ 58544 377428 -19051 321234 426079 146994 183159 245334 399041 330579 -90574 350491
13483F19611C614N70070A70837Q819L06615j93010K4537J21540p2685L4427r4093
$$ 619611 3614 573684 170837 179656 486271 293261 317798 439338 366653 401080 306987
13472C06987a0967C87376L3294O2896j01183F9071O9739B0834K14728L00282k19574
$$ 306987 -10967 387376 420670 483566 382383 69071 138810 20834 235562 535844 316270
13461C16270p1096J29235j14053K35986k40352H7949J89611J23002G1188J40289
$$ 316270 245174 374409 260356 496342 255990 87949 277560 400562 71188 211477
13451B11477A3145a46896E69925j01081Q3061A67193R5986A9854J52502N1455
$$ 211477 13145 -146896 569925 468844 551905 167193 263179 19854 172356 223811
13441B23811k430k1205j0526M26493B53647a24824B35833J50227n7419o3480A03072
$$ 223811 221381 200176 189650 616143 253647 -124824 235833 386060 328641 265161 103072
13429A65608a5750D13633A1006M3382N11005A50370J99178A67034N55178j12366
$$ 165608 -15750 413633 11006 54388 565393 150370 349548 167034 722212 609846
13419F09846A17140f0585J7913B52024B0343R3568l8322i6583A65539K16662A05449
$$ 609846 117140 -60585 -42672 252024 20343 113911 75589 -96583 165539 382201 105449
13407A57168J61546A35253P8871N1318O1219o2692J97404A37920n5301J93500
$$ 157168 318714 135253 214124 265442 326661 263969 461373 137920 82619 276119
13397B76119D1886J98466L66325A46126j4145M6758c765C08369P6959j22755J52737
$$ 276119 41886 240352 606677 146126 131981 178739 -3765 308369 385328 262573 415310
13386D15310J7337j81293n33J58910k3731J20555R8402k02338J42422K8156j69769
$$ 415310 432647 251354 250821 409731 386000 506555 604957 402619 545041 573197 403428
13375D03428H7430L10452m5131L5728A01988K82212M7894F2972J82928n5294M8370
$$ 403428 87430 397882 352751 388479 101988 384200 432094 62972 245900 190606 238976
13364B38976K83280j11780A24694Q8607K4853p4837R9317F5222Q8469n7504J67850
$$ 238976 522256 410476 124694 213301 238154 163317 262634 65222 153691 96187 264037
13353B64037O3853K24615j48859j51133c0889B04555J08044N0458A18735M09016
$$ 264037 327890 552505 403646 252513 -30889 204555 312599 363057 118735 527751
13343E27751m7387j70477N312G5295J17467p6534J14267K35361b39417A07384
$$ 527751 480364 309887 315199 75295 192762 116228 230495 465856 -239417 107384
13332E1133K02385J51422K0749j73855A08567M192L32382j31698E2493F611a69625
$$ 51133 253518 404940 425689 251834 108567 112759 445141 313443 52493 6611 -169625
13320B90613K08767j59801K27780B0452J26999L58525k31637K9307J27122J9595
$$ 290613 499380 339579 567359 20452 147451 505976 274339 303646 430768 450363
13310D50363j46726J74555C5091K11978M3721l3346P7247j59091K51196j97743
$$ 450363 303637 478192 35091 247069 290790 257444 334691 175600 426796 229053
13300B29053R7415j17985E9486K81594o2081p7890j2178J19530n5627K61069A34167
$$ 229053 326468 208483 59486 341080 278999 201109 188931 308461 252834 513903 134167
13288E01303B17116O7027J48633j60292n2559N9342c4339D01814A09617J76796
$$ 501303 217116 284143 432776 272484 219925 279267 -34339 401814 109617 286413
13278B86413R4093j19824f464C4992L32241A28875k7418Q7705E917f5511D73427
$$ 286413 380506 260682 -6464 34992 367233 128875 101457 189162 5917 -65511 473427
13266B3408K00415C6890J95598m6109R7920A21113B2686O1346K68608b19203H4071
$$ 23408 223823 36890 232488 186379 284299 121113 22686 84032 352640 -219203 84071
13254A83444o509C119L19783j26752o5715l4482l2884K61245A59291B6687h9366
$$ 183444 176935 3119 322902 196150 130435 95953 63069 324314 159291 26687 -89366
13242C20143A53583G5228i411D20549a14457A03695Q2134E3021L06517p9278K20887
$$ 320143 153583 75228 -9411 420549 -114457 103695 185829 53021 359538 280260 501147
13231E01147B148h5960L0641H5519J8703c2494D5948K38116B5134b30724B39148
$$ 501147 2148 -85960 -55319 85519 104222 -32494 45948 284064 25134 -230724 239148
13219a32701B59489Q626d1819A44196j0370N4447p7200K5219K90389j11160A52939
$$ -132701 259489 268115 -41819 144196 133826 188273 111073 136292 426681 315521 152939
13207B11941K98977j87608h5210A99178L17636A25694k5495J01018q4924L2407
$$ 211941 510918 323310 -85210 199178 516814 125694 100199 201217 116293 148700
13197A48700f4923A5170J28077F2204K05431j30177m5980J48309k834h5198E26061
$$ 148700 -64923 15170 143247 62204 267635 137458 91478 239787 236953 -85198 526061
13185a87634h3263A37589J6885B4374P1572k2036J51825L9617j11581j9156A1742
$$ -187634 -83263 137589 154474 24374 95946 73910 225735 265352 153771 134615 11742
13173A39319J26992j00575J25261a6799B51593F0292J04280J6038O9427F68J34602
$$ 139319 266311 165736 290997 -16799 251593 60292 164572 180610 250037 668 135270
13162A35270L28537j77418p0567A8699P1717D4332P9704d7218I4237M0448L46224
$$ 135270 463807 286389 215822 18699 90416 44332 124036 -47218 94237 134685 480909
13151D80909A82469a5289A25513m8556K45241C1549J70096h1925B13206c6201
$$ 480909 182469 -15289 125513 76957 322198 31549 201645 -81925 213206 -36201
13140B99120g5715A87482a29527C62266A5325K02678f0566C08717H3447J81833
$$ 299120 -75715 187482 -129527 362266 15325 218003 -60566 308717 83447 265280
13130B65280a10952C43594R261A35643l8333J78267a4883A30652a50426F9094
$$ 265280 -110952 343594 352855 135643 97310 275577 -14883 130652 -150426 69094
13119A18843O2617Q3396a70139B48348m0278B9981M3286B8595K4497b68893a6565
$$ 118843 181460 264856 -170139 248348 208070 29981 73267 28595 53092 -268893 -16565
13107B40647c33139H2833f6204H8147m1132O7512J12507n6160F6566J12252J96753
$$ 240647 -333139 82833 -66204 88147 47015 114527 227034 170874 66566 178818 375571
13096C75571I8807g4040C79593A60141G692L03559I7247J42248f6339A21270K08968
$$ 375571 98807 -74040 379593 160141 7692 311251 97247 239495 -66339 121270 330238
13085C30238j56625J252J16014A04006O2768l9397K34053G7367A4738h9499B57902
$$ 330238 173613 174865 290879 104006 166774 127377 361430 77367 14738 -89499 257902
13073A84077n8566J79720h0973A77726E2617J61693L4230a20820a1430j4091n0863
$$ 184077 125511 305231 -80973 177726 52617 214310 248540 -120820 -11430 -25521 -76384
13062g6384I9217a26830H8220J2106R3781L27864j30071h0961A08006l5183O7264
$$ -76384 99217 -126830 88220 100326 194107 521971 391900 -80961 108006 72823 140087
13051A40087j2025K5162m7952B0392F20J00519L8716J36952k7944a14910a6121
$$ 140087 128062 153224 105272 20392 620 101139 139855 276807 248863 -114910 -16121
13039e448m258B42598A02792J43548C0925e4911B07270a31480b8958B27485r6359
$$ -5448 -9706 242598 102792 246340 30925 -54911 207270 -131480 -28958 227485 131126
13028A31126L36770j94707K17546j97796J25853c8117H713L3517M26978G2435
$$ 131126 467896 273189 490735 292939 418792 -38117 8713 42230 469208 72435
13017H463j340K06980b39952C92915j23477p440c52947D4932b12305B52435a118
$$ 8463 7123 214103 -239952 392915 269438 261998 -352947 44932 -212305 252435 -1118
13005A32591n2322K58111a00638A04657a77359C4750k256P0758a3662B33262f8012
$$ 132591 80269 338380 -100638 104657 -177359 34750 32494 103252 -13662 233262 -68012
12993B56259l3083j06492m7133M1796C7776K50875B6757b77513j59534a90167
$$ 256259 223176 116684 69551 111347 37776 288651 26757 -277513 -437047 -190167
12982e0982I9698R2142k5700a13145B11439E798K3884R8641b6428m067D4782L0984
$$ -50982 99698 191840 166140 -113145 211439 5798 29682 128323 -26428 -30495 44782 75766
12970G5766J61153i0424q2332B01229b38p0881B05472j6622B4888b41851E51747
$$ 75766 236919 -90424 -172756 201229 -238 -71119 205472 188850 24888 -241851 551747
12958D41820A10602P4046j6323F4245O1583f8099K1821C94953c07565B94734g4167
$$ 441820 110602 184648 168325 64245 125828 -68099 -46278 394953 -307565 294734 -74167
12946B42689E7501K8375Q1139A066e2934A02847L81904I5953L19012a385A83078
$$ 242689 57501 85876 167015 1066 -52934 102847 484751 95953 414965 -1385 183078
12934A9901a2251C18257D931J45658G2452J41828a7020C78411A83214J33027j21899
$$ 19901 -12251 318257 4931 150589 72452 214280 -17020 378411 183214 316241 194342
12923A94342b11529J00188C7545L61127e4742j1192B13847J2171J75825a19198
$$ 194342 -211529 -111341 37545 398672 -54742 -65934 213847 226018 401843 -119198
12912C05233A47510e5023A33797l7719Q5120H6611K04294a90142j73182i4067
$$ 305233 147510 -55023 133797 96078 181198 86611 290905 -190142 -363324 -94067
12901A04239P026i7301A47921A6493a83733C7821a1105E1496b61745A69965n1445
$$ 104239 111265 -97301 147921 16493 -183733 37821 -11105 51496 -261745 169965 118520
12890A18520a1859A27658l7230b78455p98J0795a07369A07184P4838J074c96381
$$ 118520 -11859 127658 90428 -278455 -279253 -268458 -107369 107184 182022 183096 -396381
12878A69606K3271n5884b38205A82217k0466a89616Q0172A38915K97437c2390
$$ 169606 192877 136993 -238205 182217 161751 -189616 -109444 138915 436352 -32390
12867e609k90770B2120c45561A19403c7880C51200l3065a89759B41397E8250M56625
$$ -5609 -296379 22120 -345561 119403 -37880 351200 318135 -189759 241397 58250 514875
12856E14875A83699o2411K6847J0222F4737a81099C37936B0472a70768A82598
$$ 514875 183699 121288 148135 158357 64737 -181099 337936 20472 -170768 182598
12845B13429b6810H4116J06660k9270a3359j9939k77034D78099a13680K733A12033
$$ 213429 -26810 84116 190776 161506 -13359 -33298 -310332 478099 -113680 -110947 112033
12833b2290j51723e5727k01741B42699b6645A24041A6483d6005I9136c2120k07842
$$ -22290 -174013 -55727 -257468 242699 -26645 124041 16483 -46005 99136 -32120 -239962
12822b39962G5469J91367j08775E9722L36617E473K57906b22259A835J60130c8224
$$ -239962 75469 266836 158061 59722 396339 5473 263379 -222259 1835 161965 -38224
12810B995i1853b3676r0807C02137l3581b999F8311B3549b4761A85676b28596
$$ 2995 -91853 -23676 -114483 302137 268556 -2999 68311 23549 -24761 185676 -228596
12798B60061A14184a63909h1705P752A77998J43143b93802F6891d8955A54828
$$ 260061 114184 -163909 -81705 -73953 177998 321141 -293802 66891 -48955 154828
12787b37669B29547C8010a08732d0407l214k00771B46238n7539c6637A22965b82892
$$ -237669 229547 38010 -108732 -40407 -43621 -244392 246238 188699 -36637 122965 -282892
12775B45953E6136i7222A16202J42733F5303J88169b4327A26487J09605b89040
$$ 245953 56136 -97222 116202 258935 65303 253472 -24327 126487 236092 -289040
12764B58061F2140a73736C49526b68791D3384a70217A85565A3328K8095a81288
$$ 258061 62140 -173736 349526 -268791 43384 -170217 185565 13328 41423 -181288
12753f8937A80815q8310K87352j43089i2787I4748a16506p720N5077j92711A31515
$$ -68937 180815 92505 379857 236768 -92787 94748 -116506 -124226 -69149 -261860 131515
12741f069B17646m9841K8889o0697m8665O9953a18745B21167b04326J9800B15930
$$ -6069 217646 167805 196694 135997 87332 157285 -118745 221167 -204326 -184526 215930
12729g1800B22915c1907j48964E18252f2402A6038J52802l6214J72277a17247
$$ -71800 222915 -31907 -180871 518252 -62402 16038 168840 132626 304903 -117247
12718b03344c3332j93444m466A80146K7898J1866c04863B53778F481K28856j12388
$$ -203344 -33332 -226776 -231242 180146 208044 219910 -304863 253778 6481 235337 122949
12707A22949P3253K00839H7099M25840j93319j14108q0338P4741C029c07538A82135
$$ 122949 196202 397041 87099 512939 319620 205512 125174 199915 3029 -307538 182135
12695B04184j9899m9531h9715A53151K76054j41035h6320B36296A10313g364j90926
$$ 204184 184285 134754 -89715 153151 429205 288170 -86320 236296 110313 -7364 -198290
12684a98290N5642A42120R3970K5676a41868C23147L3094p1007j32932b4676F4684
$$ -198290 -142648 142120 236090 261766 -141868 323147 356241 285234 152302 -24676 64684
12672B29334a75730I0588o345A1997K57171N5398G4425a55109G6912P4938f881
$$ 229334 -175730 90588 84243 11997 269168 324566 74425 -155109 76912 151850 -6881
12660i6467j42286B20226a00361H1113K2628f4902B1834L3768J51547q879K97021
$$ -96467 -238753 220226 -100361 81113 103741 -64902 21834 55602 207149 198270 495291
12649D95291D3165K73681j06102a1149D69343i2517A42703E4697L60633j90006
$$ 495291 43165 316846 210744 -11149 469343 -92517 142703 54697 415330 225324
12639B25324P7064b45311C76817I2214J03831B1669J95209K62878j15390j32169
$$ 225324 302388 -245311 376817 92214 196045 21669 216878 479756 364366 232197
12629B32197r168L536N2641A36212k1142m010D2608K37043C3411J99813j7737
$$ 232197 223029 226565 279206 136212 115070 111060 42608 279651 33411 233224 215487
12618B15487M4871M804a74021A57394R3623a81919Q3462A13413a53407B41610
$$ 215487 260358 265162 -174021 157394 251017 -181919 -98457 113413 -153407 241610
12607A99122a2120A84476B0606j0029J75407E3433P3684H374L21912q0557G2743
$$ 199122 -12120 184476 20606 10577 185984 53433 127117 8374 330286 249729 72743
12595A82253B348J61873B3173J49592D8748H86L10376I2045g7608A57116E2973
$$ 182253 2348 164221 23173 172765 48748 886 311262 92045 -77608 157116 52973
12583A3815K66722A37230a60511A8040N4815f3980D8934J38853g4655B73116a84700
$$ 13815 280537 137230 -160511 18040 72855 -63980 48934 187787 -74655 273116 -184700
12571F9269K73536E7132a9954B28476i7772L0562r046A13814J78338D8562N2841
$$ 69269 342805 57132 -19954 228476 -97772 -67210 -76256 113814 292152 48562 101403
12560A01403c10275G2048j8669d3878l0802A40653b61816d9679F7625f0027k34162
$$ 101403 -310275 72048 53379 -43878 -74680 140653 -261816 -49679 67625 -60027 -294189
12549b94189B15110q0905M4975a76384A57009J19606e362j74884E6592L7471J1350
$$ -294189 215110 134205 179180 -176384 157009 276615 -5362 -180246 56592 94063 105413
12538A05413r782a04290A13439M4306b56620B83109A33763J77485o9318f4326
$$ 105413 95631 -104290 113439 157745 -256620 283109 133763 311248 241930 -64326
12527i3342E177c09255a15778b8696A09049C0223J06125L5010a84920J5395a2578
$$ -93342 5177 -309255 -115778 -28696 109049 30223 136348 171358 -184920 -169525 -12578
12515H2425b00612G1721A3391c24363B0012d6774A19534g3115b5918l89642a597
$$ 82425 -200612 71721 13391 -324363 20012 -46774 119534 -73115 -25918 -415560 -1597
12503b14317B32363b79494d0371E3849A8009a61562A83219l6161b29470A05249
$$ -214317 232363 -279494 -40371 53849 18009 -161562 183219 147058 -229470 105249
12492B1118b79861A46386a22702j08395A55442B7455a04301B44568b34829d2034
$$ 21118 -279861 146386 -122702 -231097 155442 27455 -104301 244568 -234829 -42034
12481b3423B62543A22771D9822P5705M610K95880k11121c75682D69281c39650
$$ -23423 262543 122771 49822 125527 130137 426017 214896 -375682 469281 -339650
12470C1798Q6593a23229q567A58702a24647B31228q3885K21245h3191n1755a2305
$$ 31798 118391 -123229 -131796 158702 -124647 231228 147343 368588 -83191 -134946 -12305
12458a76458K6262D84147A28997o478B3313J64776l4622o0405L5202e78898A64436
$$ -176458 -150196 484147 128997 122519 23313 188089 153467 93062 128264 -578898 164436
12446A57443d50343a69393B28830I3938c6519B63469A27555b4931B96566F4612
$$ 157443 -450343 -169393 228830 93938 -36519 263469 127555 -24931 296566 64612
12435a43624I2597b55608B33321g9217A89496H4430N6880i1292o0935d3179m2502
$$ -143624 92597 -255608 233321 -79217 189496 84430 141310 -91292 -152227 -43179 -85681
12424h5681P97r7591d6151D867J1755J20223a60868e1586J757B7141a244k96551
$$ -85681 -84884 -182475 -46151 4867 16622 136845 -160868 -51586 -49829 27141 -1244 -297795
12412b97795j57036A23833a11272A69940a47538B01029F8657j3253L11640b17355
$$ -297795 -454831 123833 -111272 169940 -147538 201029 68657 55404 367044 -217355
12401B09942J14804b25967D0184a82152B16365I521K3372c87542a83282b0814
$$ 209942 324746 -225967 40184 -182152 216365 9521 32893 -387542 -183282 -20814
12390b4984j64097A84114d9748I5444q025K9556J56714A21684a05700I1617a08452
$$ -24984 -189081 184114 -49748 95444 87419 116975 273689 121684 -105700 91617 -108452
12378b175k15323B72188n7569b07429e239B217J12601a14819b6503A28243b83460
$$ -2175 -217498 272188 214619 -207429 -5239 2217 114818 -114819 -26503 128243 -283460
12366C6592a75187G2001J05635R1035n5241A01459d3888A44388b77577A04834
$$ 36592 -175187 72001 177636 268671 213430 101459 -43888 144388 -277577 104834
12355a19790j80750J38110m4979D8393J07880c76860a2541m17776O9714B10978
$$ -119790 -300540 -162430 -207409 48393 156273 -376860 -12541 -430317 -360603 210978
12344D4568r791Q8264b16961D35506B13755q8041g7101K2039j077b0331I6068
$$ 44568 34777 123041 -216961 435506 213755 125714 -77101 -55062 -56139 -20331 96068
12332b01570F1844K75358b60096B48422A00895K34662j01756g9691j40990B06531
$$ -201570 61844 337202 -260096 248422 100895 335557 233801 -79691 -220681 206531
12321B81416F5673b6623B21160B0956F869h0618G9540A0476J27472l2348B1946
$$ 281416 65673 -26623 221160 20956 6869 -80618 79540 10476 137948 105600 21946
12309a36072e9179j27587E2788b80331b6067A50198F2983J85507k6831J75931
$$ -136072 -59179 -186766 52788 -280331 -26067 150198 62983 248490 221659 397590
12299C97590j7119A06563i4767j58340a18188A50202f1176D5475c3011A18271
$$ 397590 380471 106563 -94767 -253107 -118188 150202 -61176 45475 -33011 118271
12288a69719I1030K35919A55430a92586a2248D5389F397J18829N1622L15034h8507
$$ -169719 91030 326949 155430 -192586 -12248 45389 6397 125226 176848 491882 -88507
12276H5639A9714R3567d14689C33024j06993C0740I146A467d5923C16026F5093
$$ 85639 19714 113281 -414689 333024 226031 30740 9146 1467 -45923 316026 65093
12264a31856B40590d374D37560e6444k73980F0017K73631D7174b60033D15895
$$ -131856 240590 -4374 437560 -56444 -330424 60017 333648 47174 -260033 415895
12253H8345J32204J31696j25874E2921f5205B27693r6765P5282o8943a89038D1222
$$ 88345 220549 352245 226371 52921 -65205 227693 130928 206210 137267 -189038 41222
12241C03235e40G0183L7229J17522K32058h7099A89598L3443p8321M1861n9073
$$ 303235 -540 70183 107412 224934 456992 -87099 189598 223041 144720 186581 127508
12230A27508a08742A23845L5013F02O6435P6104K02797p1223I7818K54644O0407
$$ 127508 -108742 123845 158858 602 67037 143141 345938 274715 97818 352462 412869
12219D12869a70834B29810J06481P9451r068B4065a74151I6130M51412A61584
$$ 412869 -170834 229810 336291 415742 406674 24065 -174151 96130 547542 161584
12208A37626L0775b44189B92813I1669b9754l9631A09826R1878l5921K99176A66534
$$ 137626 168401 -244189 292813 91669 -29754 -69385 109826 201704 165783 464959 166534
12196B06287l542g8527B20006a18524B66489A33243J21208H0244J8410J08861
$$ 206287 202745 -78527 220006 -118524 266489 133243 254451 80244 98654 207515
12186B07515J16032j7098J5667J7646e8041B690N1404e201B24343c7780C13835
$$ 207515 323547 306449 322116 339762 -58041 2690 54094 -5201 224343 -37780 313835
12174g2588B22988a37387D91644E4083J39278A3856M8100r497N26673h043A67584
$$ -72588 222988 -137387 491644 54083 193361 13856 61956 52459 579132 -8043 167584
12162H9303I508h5584I6473k8147J87129E3848J99168Q3941b18803A61522A450
$$ 89303 9508 -85584 96473 68326 255455 53848 253016 336957 -218803 161522 1450
12150C16360j41077i7953j3806J3649M2482A16234K3487h1861A56985h1694A33314
$$ 316360 175283 -97953 -111759 -98110 -55628 116234 139721 -81861 156985 -81694 133314
12138c60939C20559a29910G2209a65774M0554a4083A4342b50895b4081B60311
$$ -360939 320559 -129910 72209 -165774 -125220 -14083 14342 -250895 -24081 260311
12127D03648c2905r3181B93591A36734J07360f518j56244j8578e5550B345K4127
$$ 403648 -32905 -126086 293591 136734 244094 -6518 -162762 -181340 -55550 2345 26472
12116B6472e4616A27091m0749b32045b2479C43488A64614k6354b40914B40065
$$ 26472 -54616 127091 86342 -232045 -22479 343488 164614 138260 -240914 240065
12105A11692a93157G1958e899j15831B77402b45381E4278M50525A47023b3235
$$ 111692 -193157 71958 -5899 -121730 277402 -245381 54278 504803 147023 -23235
12094a21160C94955n6597b67399b4890B44195b3673k04683a00323d6458c454A92292
$$ -121160 394955 338358 -267399 -24890 244195 -23673 -228356 -100323 -46458 -3454 192292
12082g5525D26370b34045N2151A7070c46570a20962b29A41331a56696B36743B894
$$ -75525 426370 -234045 -181894 17070 -346570 -120962 -229 141331 -156696 236743 2894
12070D86886J323177m69950B19390b17834A40316c92075a51201B07008e0420B21547
$$ 486886 1810063 1340113 219390 -217834 140316 -392075 -151201 207008 -50420 221547
12059a21912E6972L9364N8523L632R1579m0398i7097A07718m6514J03168c4070
$$ -121912 56972 96336 154859 158491 250070 209672 -97097 107718 61204 164372 -34070
12047a935A35628a63633Q0317j60914a3089m8017D73481B27088g9757K1840b6881
$$ -1935 135628 -163633 -83316 -244230 -13089 -61106 473481 227088 -79757 -57917 -26881
12035a96404F8511N3451i392E9287R3857M8138H4982a19000a5974k9162F8055
$$ -196404 68511 121962 -9392 59287 153144 201282 84982 -119000 -15974 -45136 68055
12023a9585h514A26657f1501A40858F0496f172n7402A51490l2980J08081a88475
$$ -19585 -8514 126657 -61501 140858 60496 -6172 -63574 151490 118510 226591 -188475
12011f7815A12041c3472j0708C44759G7677l0126J29734G9161g6789p2454e5472
$$ -67815 112041 -33472 -44180 344759 77677 47551 177285 79161 -76789 -149243 -55472
11999a41852e7721b0737j56781F6022c148C9846J0702a3988l1044B4636f9051
$$ -141852 -57721 -20737 -177518 66022 -3148 39846 50548 -13988 -45032 24636 -69051
11987A4828J67274b58428B69698e1930o3991L3328F7071c11448a1216m2856D5721
$$ 14828 182102 -258428 269698 -51930 -115921 -82593 67071 -311448 -11216 -54072 45721
11975d02820B16275a14018M3176o0855j58197a01025j7331r6628d6398F1921A4625
$$ -402820 216275 -114018 -70842 -131697 -289894 -101025 -118356 -214984 -46398 61921 14625
11963G036N8162J9863e0627A86904C8135c23416g7242J241D0428f5417j16474
$$ 7036 65198 85061 -50627 186904 38135 -323416 -77242 -76001 40428 -65417 -181891
11952a81891Q3785I7564C5229p164K17952c8470n5081C511J28695i3393a6268
$$ -181891 -98106 97564 35229 28065 246017 -38470 -93551 3511 132206 -93393 -16268
11940B49491m6004f3504f071n0278j43222j19194c1375k88002i1020I8958R839
$$ 249491 203487 -63504 -6071 -56349 -199571 -318765 -31375 -319377 -91020 98958 108797
11929A08797b19661G4984a54737e2318K496B62056a67608A59264l4678C524J04260
$$ 108797 -219661 74984 -154737 -52318 -49822 262056 -167608 159264 124586 3524 107784
11918A07784i3677A08535H250J28481A6105N4745K81115b38795g7047B827J54299
$$ 107784 -93677 108535 8250 136731 16105 70850 351965 -238795 -77047 2827 157126
11907A57126l6080b70749A03080P2100c46470E6232a32602E421P8313e3756k3860
$$ 157126 121046 -270749 103080 175180 -346470 56232 -132602 5421 83734 -53756 -77616
11896g7616C5351P7923b03765A16170i4375A02627B424K7538a33710e1538A59209
$$ -77616 35351 113274 -203765 116170 -94375 102627 2424 29962 -133710 -51538 159209
11884E167J2357a41343r8577b2661A43230a63258j24610C5031a65747q1036A00504
$$ 5167 17524 -141343 -239920 -22661 143230 -163258 -287868 35031 -165747 -246783 100504
11872a2968l52194H2467J91909a26793q2980A03858K4545E83a11407j90833c7458
$$ -12968 -365162 82467 274376 -126793 -209773 103858 128403 583 -111407 -302240 -37458
11860G9331d2646q2214B11541a77828l2787M5091K1151f0170A45624a72497g9076
$$ 79331 -42646 -124860 211541 -177828 -210615 -165524 -144373 -60170 145624 -172497 -79076
11848a16647j63109K4150f8455C08300a42486I1397O5700Q5180A09624N1802c85341
$$ -116647 -279756 -255606 -68455 308300 -142486 91397 157097 242277 109624 161426 -385341
11836a02227b846k73239a29458A14374a3958l5740A13859F288J00400d3286q620
$$ -102227 -2846 -276085 -129458 114374 -13958 -49698 113859 6288 106688 -43286 -51906
11825e1906k4272j48945R4038A04224b030p1101C5423b14523A64160c1868k92769
$$ -51906 -76178 -225123 -131085 104224 -2030 -73131 35423 -214523 164160 -31868 -324637
11814c24637C3858i288j37738A91771G1340O7795E8420Q0706b83481P4574b0161
$$ -324637 33858 -9288 -147026 191771 71340 139135 58420 139126 -283481 -208907 -20161
11802b5894d401k84121B01323m6912a04077i025A94261a83306H5527a25289D5824
$$ -25894 -4401 -288522 201323 154411 -104077 -9025 194261 -183306 85527 -125289 45824
11790C03173a67510C7115c08842F1005J53877a00836A8128P5256J01460P0667
$$ 303173 -167510 37115 -308842 61005 214882 -100836 18128 93384 194844 265511
11780B65511e7764m2654b4099A57947O674b10479A51403a4609G6105J1737a83339
$$ 265511 -57764 -100418 -24099 157947 164621 -210479 151403 -14609 76105 87842 -183339
11768A65678d73301b203B672h1422F3290b9973A00186a11491K5142l35533A14546
$$ 165678 -473301 -2203 2672 -81422 63290 -29973 100186 -111491 -86349 -421882 114546
11756c92036N9331A40521a83769g721A09826J01807o1382f357j34518A11400a45259
$$ -392036 -332705 140521 -183769 -7721 109826 211633 150251 -6357 -140875 111400 -145259
11744d4621A87914E4318j9834M22849e6830A68402A2445b7990A74170n1435h4365
$$ -44621 187914 54318 34484 457333 -56830 168402 12445 -27990 174170 122735 -84365
11732h7634a8205E1643N3638a24662A7583R7504J20238A02970K2503B9106K88261
$$ -87634 -18205 51643 105281 -124662 17583 115087 235325 102970 125473 29106 317367
11721C17367j26566a46129j08750d4888J8120q7830B02339a62870b4820A18463
$$ 317367 190801 -146129 -254879 -44888 -26768 -114598 202339 -162870 -24820 118463
11710C76941E7344L05900j51590J86709b49634G4269J08933L2072r8784K3380
$$ 376941 57344 363244 211654 398363 -249634 74269 183202 215274 116490 139870
11700A39870j0666P9178e3556H0939J29133H1462c2248C06722e0316b4903A45849
$$ 139870 129204 208382 -53556 80939 210072 81462 -32248 306722 -50316 -24903 145849
11688a50498B5101r284J75690G4231d7023k67834P3357p9640C95026j21930g229
$$ -150498 25101 15817 191507 74231 -47023 -314857 -241500 -321140 395026 273096 -7229
11676a07844B57342c4733q7911B576M3365J91057a61043C15748F4166K4208M128
$$ -107844 257342 -34733 -122644 2576 45941 236998 -161043 315748 64166 88374 92502
11665I2502a63626A78967a81472F6788b22783A20160a76939I1140a53584E9861
$$ 92502 -163626 178967 -181472 66788 -222783 120160 -176939 91140 -153584 59861
11654B05268d3421l8915A5698K23861e2684j51723A76483E4966J05327P5502e7024
$$ 205268 -43421 -82336 15698 239559 -52684 -204407 176483 54966 160293 235795 -57024
11642i3584C07703a00298D757K0626J08292L8019B4705a72963c6650H8393j5935
$$ -93584 307703 -100298 4757 25383 133675 171694 24705 -172963 -36650 88393 72458
11631G2458J1464b5803A46933a19409f978B64542I9734K2350N0233A4720K32085
$$ 72458 83922 -25803 146933 -119409 -6978 264542 99734 122084 172317 14720 246805
11620B46805b83702a29641j327B19807j3591g9459A70667Q4199a34400M7205a3119
$$ 246805 -283702 -129641 -130968 219807 206216 -79459 170667 254866 -134400 -87195 -13119
11608B54050D4621a04439j4512N2872l4631A33050h2608J6525j53671B15315I1436
$$ 254050 44621 -104439 -118951 -66079 -100710 133050 -82608 -66083 -219754 215315 91436
11596i126k54228b6862j6164k04288h1651A06103e3890g479D88309H1040J2024
$$ -9126 -263354 -26862 -43026 -247314 -81651 106103 -53890 -7479 488309 81040 93064
11585I3064i284A91035l5150O4313Q8769A32748E3756b00192h8206A040L00302
$$ 93064 -9284 191035 155885 220198 308967 132748 53756 -200192 -88206 1040 301342
11574C01342A25651J9266K22160A8984d5606D39715A14215a79192L3610o9077
$$ 301342 125651 144917 367077 18984 -45606 439715 114215 -179192 -145582 -214659
11564b14659M3960A36383d6882B07832n094J15431o4276A19089k6997L85522B058
$$ -214659 -170699 136383 -46882 207832 202738 318169 253893 119089 92092 477614 2058
11552B04919D8612J58817p9975a28416A14060b8309C82703a03020K454H1671f7199
$$ 204919 48612 207429 127454 -128416 114060 -28309 382703 -103020 -100566 81671 -67199
11540b01525A06353N7587d1008B5072a76256D17150j80356Q2631H3074K09026
$$ -201525 106353 163940 -41008 25072 -176256 417150 236794 319425 83074 292100
11530B92100k5442A0120M38055B13125e04486K39441a1433I652a80529b8269B13159
$$ 292100 266658 10120 448175 213125 -504486 -265045 -11433 9652 -180529 -28269 213159
11518G7900d2602C31015d1799C1056J1831L53094E5280J30832K91400I6292J60249
$$ 77900 -42602 331015 -41799 31056 42887 395981 55280 186112 477512 96292 256541
11507B56541N9525A32270m6028b94852D8514J03421C6719e6465B31703A07719
$$ 256541 316066 132270 86242 -294852 48514 151935 36719 -56465 231703 107719
11496C29008A30734R5398o3496j3106d1918B00391K43563j63901b3722B25402
$$ 329008 130734 226132 162636 149530 -41918 200391 443954 280053 -23722 225402
11485C47092B2381N73568B45947J5880p9498a14370C5164K29642J2011j15882
$$ 347092 22381 595949 245947 261827 182329 -114370 35164 264806 276817 160935
11475A60935h6827A52903a07926A44564o7182i4164A2748K19520i1282A60383
$$ 160935 -86827 152903 -107926 144564 77382 -94164 12748 232268 -91282 160383
11464A92056g1130C49752E3392K0562N6361n9229B8581J32138b41827C33268A55701
$$ 192056 -71130 349752 53392 73954 130315 71086 28581 160719 -241827 333268 155701
11452A97773F7773B4214J9406a05773j40299J4210d3585A32393O8107H738K30832
$$ 197773 67773 24214 43620 -105773 -246072 -231862 -43585 132393 200500 8738 239570
11441B39570f9137F0737k8593Q2784Q0441b04575I1877h5105I4413J11356c7043
$$ 239570 -69137 60737 32144 114928 195369 -204575 91877 -85105 94413 205769 -37043
11429H5242C6279a3296j97539f1055j62021J3019C00636j35821N866J84567c16785
$$ 85242 36279 -13296 -210835 -61055 -223076 -210057 300636 164815 170681 355248 -316785
11417a51451C56835c81338F6814C2998K8138a28871A36942A6936c1083j9933l7550
$$ -151451 356835 -381338 66814 32998 61136 -128871 136942 16936 -31083 -51016 -88566
11406h8566c7643B07812d6036B08824r7268j8894K5373f4736B3022L35895a41296
$$ -88566 -37643 207812 -46036 208824 111556 92662 118035 -64736 23022 358917 -141296
11394a49719B8331J2119b77717A26529b24365i6446B44019H3911J2548b5041k12024
$$ -149719 28331 40450 -277717 126529 -224365 -96446 244019 83911 96459 -25041 -237065
11383b37065B4528J34406b46229e9930D6955L77249F3001d4945j25913A7295P1423
$$ -237065 24528 158934 -246229 -59930 46955 424204 63001 -44945 -170858 17295 88718
11372H8718k1805h1728A1739K45382a99139B67553b6717A87250j5593d2205k95707
$$ 88718 66913 -81728 11739 257121 -199139 267553 -26717 187250 171657 -42205 -337912
11361c37912A15349b02082d6908C16215a72540B0437Q100c53660J20127J05102
$$ -337912 115349 -202082 -46908 316215 -172540 20437 28537 -353660 -233533 -128431
11351a28431B25895c88462A1248f8041b0781A52166e6392j14293j7898f9402B7977
$$ -128431 225895 -388462 11248 -68041 -20781 152166 -56392 -170685 -188583 -69402 27977
11339b3393j14271f0524E5084J57419d0171C77219b08540Q1056C9061Q187b9040
$$ -23393 -137664 -60524 55084 212503 -40171 377219 -208540 -127484 39061 47248 -29040
11327F094b71056P0503A15187m8290G639J24375c5753B1318b5119A54426B9243
$$ 6094 -271056 -200553 115187 66897 7639 132014 -35753 21318 -25119 154426 29243
11315c4261k67353h561j66969H9791P831R978m5592b5818j57540O0728N317K3592
$$ -34261 -301614 -8561 -175530 89791 97622 107600 62008 -25818 -183358 -122630 -117313 -93721
11303i3721F543L00511B3712e24k88485B64536k9281E9522P8281g825I1813d42906
$$ -93721 6543 307054 23712 -524 -289009 264536 235255 59522 137803 -7825 91813 -442906
11290A15313L830O9858h1811B888O5138a66588I8934c2116D7739J92012l3503
$$ 115313 119143 189001 -81811 2888 68026 -166588 98934 -32116 47739 239751 206248
11279B06248d42323a28077n6094B9200H208R5588l3710b33670a02066n8157k7979
$$ 206248 -442323 -128077 -184171 29200 8208 103796 70086 -233670 -102066 -160223 -188202
11268a88202a6400I0372a78795B07254c7543A30983c06483A2370b28380n1886
$$ -188202 -16400 90372 -178795 207254 -37543 130983 -306483 12370 -228380 -280266
11258b80266B6716a22636B56072b0521D53645a70689A91986h361j0988n3848C0607
$$ -280266 26716 -122636 256072 -20521 453645 -170689 191986 -8361 -19349 -73197 30607
11246b20843f4562j78818E1425l463R4357b46784L3306O1114q7962A92254a40041
$$ -220843 -64562 -243380 51425 47962 142319 -246784 -213478 -152364 -240326 192254 -140041
11234a38617L9991D05598a2511A31595M6326g9983j04238K2062r8275A15522a10489
$$ -138617 -98626 405598 -12511 131595 177921 -79983 -184221 -162159 -260434 115522 -110489
11222f4114K0337j24198O1960B21364R0143b96196a22896C1493a48101f6325B15131
$$ -64114 -43777 -167975 -106015 221364 311507 -296196 -122896 31493 -148101 -66325 215131
11210A0434d51310b00142m4878D619a02606j73413M5349b0991B90385f1099G2135
$$ 10434 -451310 -200142 -245020 4619 -102606 -276019 -230670 -20991 290385 -61099 72135
11198a52533c2600k0860c43j19301L6455C11979j4030j30597A1721a25580j73083
$$ -152533 -32600 -53460 -343 -119644 -83189 311979 297949 167352 11721 -125580 -298663
11187b98663D83f6017I7089a19484k18818h9451A2986f5984E1244i8298n607A32224
$$ -298663 483 -66017 97089 -119484 -338302 -89451 12986 -65984 51244 -98298 -103905 132224
11174A19213c42203A18496k8182k9515a02003k26872E08040a06866q8886k782
$$ 119213 -342203 118496 90314 60799 -102003 -328875 508040 -106866 -195752 -198534
11164a98534b6204k39263O8506R0180B8785K30693a02585A73916H228L57335b89911
$$ -198534 -26204 -265467 -196961 -106781 28785 259478 -102585 173916 8228 365563 -289911
11152B0738d9242l1563B03213c30646A26119J09624j6455j03134J67302r3524
$$ 20738 -49242 -80805 203213 -330646 126119 235743 219288 116154 283456 189932
11142A89932c94093B31320c13044C39255C444L9644K62973a41935F1186i579A54126
$$ 189932 -394093 231320 -313044 339255 3444 43088 306061 -141935 61186 -9579 154126
11130H0688a6844L526A77639l9420b8566A82275H8911d410k99425C61208A44605
$$ 80688 -16844 -13318 177639 138219 -28566 182275 88911 -4410 -303835 361208 144605
11118b932j56392A16077J35811p8478o1091j911K2835M8263B2381K6895P7425
$$ -2932 -159324 116077 251888 173410 112319 110408 133243 181506 22381 49276 126701
11107A26701i5599A33620J74158I7843K37968h3648A30292M04120f104k5623C09632
$$ 126701 -95599 133620 307778 97843 335811 -83648 130292 534412 -6104 -31727 309632
11095a83909B39508R6888D1781Q0569b33818i7988D7161L66727r5874j8855n0808
$$ -183909 239508 336396 41781 122350 -233818 -97988 47161 413888 318014 299159 248351
11084B48351R3044j17084a24107A62505C8384J87918L3240M7959M887j07905K9514
$$ 248351 341395 224311 -124107 162505 38384 226302 259542 307501 312388 204483 233997
11073B33997P030K55168j88595K43576b21990A9335N73835k02848L3126J28553
$$ 233997 241027 496195 307600 551176 -221990 19335 593170 390322 423448 552001
11063E52001L8865k63447M42732B43066L72001j98092J30898k7133k0445N53246
$$ 552001 590866 327419 770151 243066 615067 416975 547873 520740 500295 1053541
11053A053541m32299m0212J87271o1371J82239p6353M7908k93508J92386n656
$$ 1053541 621242 581030 768301 706930 889169 812816 860724 567216 759602 753946
11043G53946J4189j31178K40920K05889j78734m30277K61673j31529J64590J09513
$$ 753946 768135 636957 877877 1083766 905032 474755 736428 604899 769489 879002
11033H79002O3475D64502L86274K31442l48765K3976j16436N2571L1275j36702
$$ 879002 942477 464502 850776 1082218 733453 757429 640993 693564 724839 588137
11023E88137k53145J71299N717j8453J21944J88781Q1360k88435j68838n9567
$$ 588137 334992 506291 512008 493555 615499 804280 885640 597205 428367 368800
11013C68800L08559J08425J48763k78445p094J38500C20348L96375r169k8148
$$ 368800 677359 785784 934547 656102 649008 787508 320348 716723 707554 679406
11003F79406q4173j86085N18438j23072C91392K3948j4030J40120M25154O1466
$$ 679406 595233 409148 927586 804514 391392 415340 401310 541430 966584 1028050
10993A028050l34581J13597k26215K77844l54552r353M96418o8330L26940n89019
$$ 1028050 693469 807066 580851 858695 504143 494790 991208 922878 1249818 660799
10983F60799N72683j49248M26435m92511N16542O5897K46374J26647L46223K72520
$$ 660799 1233482 1084234 1510669 1018158 1534700 1600597 1846971 1973618 2319841 2592361
10973B592361L0521L36624J30024R77m16270l27244j9219o35360Q5264N2907p4574
$$ 2592361 2622882 2959506 3089530 3090507 2674237 2346993 2327774 1692414 1777678 1830585 1756011
10962A756011j33124r8586N60085n48699M7498J08790M42290n59120J26926k95652
$$ 1756011 1622887 1524301 2084386 1535687 1583185 1691975 2134265 1575145 1702071 1406419
10952A406419k03567l9556k39203k41649J36790B25713L17551j37870P7046Q1494
$$ 1406419 1202852 1163296 924093 682444 819234 225713 543264 405394 482440 563934
10942E63934k05519J36503B16668d7849B01065j985I5149J022A5905M93795B28746
$$ 563934 358415 494918 216668 -47849 201065 199080 95149 96171 15905 509700 228746
10930a02976D09912A33875J54262N090D1645K1321J1833K32421b80547a00126
$$ -102976 409912 133875 288137 293227 41645 62966 74799 307220 -280547 -100126
10919B5147J0028g2162A17313J31337I057N4515f5978D8535L16964f3890l74376
$$ 25147 35175 -72162 117313 248650 9057 63572 -65978 48535 365499 -63890 -438266
10908d38266D3327J80411G7503g071A39908A4190J45600b87194f3688K840A16496
$$ -438266 43327 223738 77503 -7071 139908 14190 159790 -287194 -63688 -60848 116496
10896a49313e6357l2788r2569J7255d4712p3807H9487g5128A27517d8929j29526
$$ -149313 -56357 -89145 -181714 -164459 -44712 -118519 89487 -75128 127517 -48929 -178455
10885a78455k2889o9602I8210a14243A44739F6424c83310J34957A73934A250O1601
$$ -178455 -201344 -270946 98210 -114243 144739 66424 -383310 -248353 173934 1250 62851
10874F2851f0063l32622a37919A4311L832a06907M5992A40572a84854E1289K28391
$$ 62851 -60063 -392685 -137919 14311 18143 -106907 -60915 140572 -184854 51289 279680
10863B79680I0422d7525F3274a35459q6826G5472k2823l712i7188a2947j69943
$$ 279680 90422 -47525 63274 -135459 -222285 75472 52649 48937 -97188 -12947 -182890
10852a82890A96871l8017A9832a2999B8610d33426a88923I5173B1092g0709j83856
$$ -182890 196871 158854 19832 -12999 28610 -433426 -188923 95173 21092 -70709 -254565
10841b54565M2181d496A87206R9344f1415o7747L0514j79797C02977D4141c24036
$$ -254565 -212384 -4496 187206 286550 -61415 -129162 -98648 -278445 302977 44141 -324036
10829a82910A51061e7447H6574L9372g0743B15663K52439A14149R3646A02087
$$ -182910 151061 -57447 86574 125946 -70743 215663 468102 114149 207795 102087
10818b31306d2801A84195a10543A42554H294e2488A94054b92096h9417B11214
$$ -231306 -42801 184195 -110543 142554 8294 -52488 194054 -292096 -89417 211214
10807b51730C8930d07917f7218A17455B3793a42706j7G3908a03753D8033K48619
$$ -251730 38930 -407917 -67218 117455 23793 -142706 -142723 73908 -103753 48033 296652
10796B96652b25235j8832F5679a03101G4157b6957B1039Q2546a34838g018k32601
$$ 296652 -225235 -244067 65679 -103101 74157 -26957 21039 103585 -134838 -7018 -239619
10785b39619A61089j3367J698M2294b15326K430A75342p9342O2172j2760c1966
$$ -239619 161089 147722 149420 191714 -215326 -212896 175342 96000 158172 145412 -31966
10773B45301q557b3084j19592c6011C9676K30555a27104N3314l08732G647c10451
$$ 245301 236744 -23084 -142676 -36011 39676 270231 -127104 -73790 -382522 7647 -310451
10761a06176j64490a24551l8537A00798a67842j1748o4291a8596q7071c4558C7546
$$ -106176 -270666 -124551 -163088 100798 -167842 -179590 -243881 -18596 -105667 -34558 37546
10749B62881A07999J869J77219b38986G591P4867a71758C02963b96949D7718b01558
$$ 262881 107999 109868 287087 -238986 7591 82458 -171758 302963 -296949 47718 -201558
10737E1b5261C43076b17042A38094L3261a11787H3993J56436J67332E6958a42143
$$ 51 -25261 343076 -217042 138094 171355 -111787 83993 240429 407761 56958 -142143
10725a90393C8885c3190l4145A82285L8623C1333g6624B40963b33789e7320A33607
$$ -190393 38885 -33190 -67335 182285 220908 31333 -76624 240963 -233789 -57320 133607
10713G2156c11970R1980e5365o7338G0103A7542c5995j13755I1461b50603j64351
$$ 72156 -311970 -219990 -55365 -122703 70103 17542 -35995 -149750 91461 -250603 -414954
10702d14954J03717A18692J22569a41182j62581a15258A35857c1484l02710h7134
$$ -414954 -311237 118692 241261 -141182 -303763 -115258 135857 -31484 -334194 -87134
10691C4650d50775A00206c0897A8255J22228g198j2768A1178b6209H948c5394
$$ 34650 -450775 100206 -30897 18255 140483 -7198 -19966 11178 -26209 8948 -35394
10679c8480q7555j4008b3387j7511j95875A10908b50398A69180b53000C7745j7563
$$ -38480 -126035 -140043 -23387 -40898 -236773 110908 -250398 169180 -253000 37745 20182
10668B0182c9279m1393P292R627G4187J9568l1102L8792m9199a41141I6221i3572
$$ 20182 -39279 -80672 -73380 -63753 74187 93755 62653 101445 52246 -141141 96221 -93572
10655a1584k67868a22425m4871A13985a55057B48248I8026e295A31903H020Q1022
$$ -11584 -279452 -122425 -167296 113985 -155057 248248 98026 -5295 131903 8020 89042
10644H9042J25710i2533D4504P646O4658D2296O5297a16409D1499a02787k7027
$$ 89042 214752 -92533 44504 52150 116808 42296 107593 -116409 41499 -102787 -129814
10633a29814N6837L1544k499A20293e8340m0589K2390l48624e2285A46465f2704
$$ -129814 -72977 -41433 -43932 120293 -58340 -98929 -76539 -425163 -52285 146465 -62704
10621b42968f0692j16802B45362a21079G1450j5294J24331H0304a95249R7563
$$ -242968 -60692 -177494 245362 -121079 71450 56156 180487 80304 -195249 -97686
10611i7686k3030k0568G5536l6566a83240e4185j53218B38670h0855e355o5438
$$ -97686 -120716 -141284 75536 38970 -183240 -54185 -207403 238670 -80855 -5355 -70793
10600g0793A79996G7435d9579j74168r65R6221h536k18709B29893h0659j43086
$$ -70793 179996 77435 -49579 -223747 -224712 -128491 -8536 -227245 229893 -80659 -223745
10589b23745r3516A11118A5029R6786a26045l4654A6404h1815b0112n7371B73102
$$ -223745 -317261 111118 15029 111815 -126045 -160699 16404 -81815 -20112 -77483 273102
10577A8078f7704F6969A0332a06940a3018D719J0361e0822b5193j59196j3004
$$ 18078 -67704 66969 10332 -106940 -13018 4719 15080 -50822 -25193 -184389 -197393
10566a97393k60472a09660e2605k63889j78938c2469A61847l3653J88192j14063
$$ -197393 -457865 -109660 -52605 -316494 -495432 -32469 161847 128194 316386 202323
10556B02323D8358b10526A68626A5009h8873j2864j7257k56830A01252f7447j38813
$$ 202323 48358 -210526 168626 15009 -88873 -101737 -118994 -375824 101252 -67447 -206260
10545b06260D72322H0488g8666C7151a77977a7368j1519I1942a14205d1513A01069
$$ -206260 472322 80488 -78666 37151 -177977 -17368 -28887 91942 -114205 -41513 101069
10533d2115q5171B30187d1680j45979g9151O284F3591N7064D4136a78226G9866
$$ -42115 -127286 230187 -41680 -187659 -79151 -72867 63591 120655 44136 -178226 79866
10521b15459L9737g7769L4893a1109B1525b77532I7775d73190I8714g2311B62469
$$ -215459 -175722 -77769 -42876 -11109 21525 -277532 97775 -473190 98714 -72311 262469
10509b75667C0215a58722A19364N8965b46370a13820j81612A25792a43908K0678
$$ -275667 30215 -158722 119364 178329 -246370 -113820 -295432 125792 -143908 -123230
10499a23230L7804C2707K6507a04443C65104m2997b19553e7062D1481g999C12454
$$ -123230 -85426 32707 59214 -104443 365104 322107 -219553 -57062 41481 -7999 312454
10487I525a65808O7591D1482a8852A28476L19074M99940j41535l41874B26759
$$ 9525 -165808 -98217 41482 -18852 128476 447550 947490 805955 464081 226759
10476D70837A60866h3596B6592O0818O2833n3143D3819d9734A24419m102b76807
$$ 470837 160866 -83596 26592 87410 150243 97100 43819 -49734 124419 120317 -276807
10464D5325b13591N3977B1930h5543j13611H1783M0299a12383A51837a5631k5780
$$ 45325 -213591 -159614 21930 -85543 -199154 81783 122082 -112383 151837 -15631 -41411
10453d1411B2318J5539R3666a1711B74078e1764B6987b26779B95421G7810R5740
$$ -41411 22318 37857 131523 -11711 274078 -51764 26987 -226779 295421 77810 173550
10442A73550J1287b14432A68213a49369b5679B15367a54707A79016E1833h5080
$$ 173550 184837 -214432 168213 -149369 -25679 215367 -154707 179016 51833 -85080
10431c6686A40127l1512a4544l32791d7388B19901a06059c9631f221A31335K29901
$$ -36686 140127 108615 -14544 -347335 -47388 219901 -106059 -39631 -6221 131335 361236
10420C61236c25306B30004H9489J53349I7752J4868b58240J27470k8250r4959
$$ 361236 -325306 230004 89489 242838 97752 112620 -258240 -130770 -159020 -253979
10410b53979q3837a7816l14234B23664a60973c1059A32049a235F6119b05920K0873
$$ -253979 -337816 -17816 -332050 223664 -160973 -31059 132049 -1235 66119 -205920 -185047
10399a85047A21917k2546g0144K5906A20696J24454L0955j33608K1186m2048Q4392
$$ -185047 121917 99371 -70144 -44238 120696 245150 276105 142497 163683 121635 206027
10388B06027K58252A52507o735O5969B1179a00640A39002c7962C67329r0014k7011
$$ 206027 464279 152507 145772 211741 21179 -100640 139002 -37962 367329 277315 250304
10377B50304K5001L27630k40148n4027b09161B57227j2932g1245B61623M36084
$$ 250304 275305 602935 362787 308760 -209161 257227 244295 -71245 261623 697707
10367F97707k07980j19676K27770j78328j45756J8073a5497A41953a31585E7144
$$ 697707 489727 370051 597821 419493 273737 291810 -15497 141953 -131585 57144
10356A60856k6423R6112a02881C7523K49850J65879M1886F9739M52394k57795
$$ 160856 134433 230545 -102881 37523 287373 453252 495138 69739 522133 264338
10346B64338A07557J41929J7833J60326o8953j57828O1764e9983B31995K6954
$$ 264338 107557 249486 267319 427645 358692 200864 262628 -59983 231995 258949
10336B58949a9273C34115C7936K81947a06099B0250a2881A35118N6167J9143k657
$$ 258949 -19273 334115 37936 319883 -106099 20250 -12881 135118 191285 210428 207771
10325B07771D6402K10428q8461k1864R938J30015j40227a24659B37759r1544D4957
$$ 207771 46402 256830 168369 146505 156443 286458 146231 -124659 237759 146215 44957
10313I3942K87835E9344b30714H025K03678b82649A73668n3026a47692F4958f3463
$$ 93942 381777 59344 -230714 8025 211703 -282649 173668 120642 -147692 64958 -63463
10301D3459b07435J0768B443J16089c3059F3030a3034j2400E4816a4918l38033
$$ 43459 -207435 -196667 2443 118532 -33059 63030 -13034 -25434 54816 -14918 -352951
10290c52951A5533J53340P2203J8690b4008p6107A81163G9543b3146A14509d9829
$$ -352951 15533 168873 241076 259766 -24008 -100115 181163 79543 -23146 114509 -49829
10278h2296B2932a19826k91034B76130A30780J21838j04277g9031B28325c328
$$ -82296 22932 -119826 -410860 276130 130780 252618 148341 -79031 228325 -3328
10267A30011n654R5098o2604b13065A49319K52145A88428m0115J31964H9719J84575
$$ 130011 124357 219455 156851 -213065 149319 401464 188428 148313 280277 89719 274294
10256B74294R0519A59499J11524m2611J02341a77863B59712c9333M045j15923
$$ 274294 364813 159499 271023 228412 330753 -177863 259712 -39333 -35288 -151211
10246a51211m4499A53371a16520o0348A13031f2500A91001a93437D54712a12163
$$ -151211 -195710 153371 -116520 -176868 113031 -62500 191001 -193437 454712 -112163
10235a31811H808l350J13639b14311A35537b30454a6883r8306G9818K6139c35028
$$ -131811 8808 5458 119097 -214311 135537 -230454 -16883 -115189 79818 105957 -335028
10223c02331J35947c2412G6076h531j14291j51799P7439h5542B339g5922l3779
$$ -302331 -166384 -32412 76076 -8531 -122822 -274621 -197182 -85542 2339 -75922 -109701
10212a09701d0688G9888J39938a42325a0462o9553A18203b09932R374D2888d27771
$$ -109701 -40688 79888 219826 -142325 -10462 -80015 118203 -209932 -200558 42888 -427771
10200a64811A85651c53326B28381M3461D6958c3953r8917B1033i1884A40106i6533
$$ -164811 185651 -353326 228381 271842 46958 -33953 -132870 21033 -91884 140106 -96533
10188a9065q6444o5675O6470d7291c439j15533H2258j6427B2793f2362m9864e913
$$ -19065 -105509 -171184 -104714 -47291 -3439 -118972 82258 65831 22793 -62362 -112226 -5913
10175a8191D5526b5906G5134g8854j45280D7470O0933b49109i8916l6866e6709
$$ -18191 45526 -25906 75134 -78854 -224134 47470 108403 -249109 -98916 -135782 -56709
10163c317A19428c13859a24630j08136g6709j30075G8396b85154A66768n8735
$$ -3317 119428 -313859 -124630 -232766 -76709 -206784 78396 -285154 166768 108033
10153A08033a36571R37C3635e17930A86159a55687C2168f7874C1847a01789l0153
$$ 108033 -136571 -135634 33635 -517930 186159 -155687 32168 -67874 31847 -101789 -131942
10142a31942j11675k63489A34174a25439l5766g4098A27405i8525d5227M738l89079
$$ -131942 -243617 -507106 134174 -125439 -161205 -74098 127405 -98525 -45227 -40489 -429568
10131d29568b08129A10849D2920J53846D7130h9161I0672N8031a76837L7290j95790
$$ -429568 -208129 110849 42920 196766 47130 -89161 90672 148703 -176837 -139547 -335337
10120c35337B72878c36627f4941p608j15259e0966B0472h6166m0970B08499a51456
$$ -335337 272878 -336627 -64941 -72549 -187808 -50966 20472 -86166 -127136 208499 -151456
10108i2683k43654f7243A01664a26812A25435i4248E9589b294A09869B606b26627
$$ -92683 -336337 -67243 101664 -126812 125435 -94248 59589 -2294 109869 2606 -226627
10096A75370e9520j24937G865a35916l8492Q6631A72076d2768D1795J7726O4130
$$ 175370 -59520 -184457 7865 -135916 -174408 -87777 172076 -42768 41795 59521 123651
10085A23651a01436B0824b91408g4407b2212k75441E7155g1870A32818b08519
$$ 123651 -101436 20824 -291408 -74407 -22212 -297653 57155 -71870 132818 -208519
10074a58260D7565a94635M7679b0782j33298l7433A58947a55560G0835g5685M917
$$ -158260 47565 -194635 -146956 -20782 -154080 -191513 158947 -155560 70835 -75685 -70768
10063g0768b6249A54191j3423f6057j2712j89233e8753q1256k04869a13456B768
$$ -70768 -26249 154191 140768 -66057 -78769 -268002 -58753 -140009 -344878 -113456 2768
10051D6743c22734i6283k08523a40145m0686A937Q187N833J81230a86381m3404
$$ 46743 -322734 -96283 -304806 -140145 -180831 1937 10124 15957 197187 -186381 -229785
10040b29785L3432L5869A11179f0783j19690o8381f1140m5338k9597A53298D0747
$$ -229785 -196353 -160484 111179 -60783 -180473 -248854 -61140 -106478 -136075 153298 40747
10028f9574A70347p4522a45172j65422A67349J14601b7034j41901A03330Q6916
$$ -69574 170347 95825 -145172 -310594 167349 281950 -27034 -168935 103330 190246
10018A90246c11996f9706I7346c40149B7262K18422a8728B8871h9454L609j77118
$$ 190246 -311996 -69706 97346 -340149 27262 245684 -18728 28871 -89454 -85845 -262963
10007b62963A56838b41946a9468j53828m6003j29660a25555l2334B08848a80392
$$ -262963 156838 -241946 -19468 -173296 -219299 -348959 -125555 -157889 208848 -180392
9996b90409j5855J07940A3600d0424A08213O9947c62942B95215g2308A39323b07820
$$ -290409 -306264 -198324 13600 -40424 108213 178160 -362942 295215 -72308 139323 -207820
9984d2970K1290k22075c1118j09040a4485j4062j36597c4356A4825K30357d42303
$$ -42970 -21680 -243755 -31118 -140158 -14485 -28547 -165144 -34356 14825 245182 -442303
9972f2321G6402g5007k24770F210a03947I020a90685j01355G7908J41558F5412
$$ -62321 76402 -75007 -299777 6210 -103947 9020 -190685 -292040 77908 219466 65412
9960B89181b1285e537j2335k06357a08784j7230m5455g3457k03483M6314a06305
$$ 289181 -21285 -5537 -17872 -224229 -108784 -126014 -171469 -73457 -276940 -230626 -106305
9948a34979F9080J17914b68785A993b84501j03783C6611f46k43122A13765a4696
$$ -134979 69080 186994 -268785 1993 -284501 -388284 36611 -646 -243768 113765 -14696
9936b00754j65985a29165k81292c9525j87247B64960H0537A5227b37301C1573
$$ -200754 -366739 -129165 -410457 -39525 -226772 264960 80537 15227 -237301 31573
9925b0319B7393j2265L1539i253E9476A5252a83014A10598b30437Q0368E3301
$$ -20319 27393 15128 46667 -9253 59476 15252 -183014 110598 -230437 -150069 53301
9913h8044D2703O6909a37762A47135b59895L5775d4758k97321j36147b0584j60885
$$ -88044 42703 109612 -137762 147135 -259895 -224120 -44758 -342079 -478226 -20584 -181469
9902a81469A783N62986A64538o6012B2613i432k92310J32454B18918b29689F3827
$$ -181469 1783 564769 164538 98526 22613 -9432 -301742 -169288 218918 -229689 63827
9890A22259O8433b13053k4346c6182r6814a5410q7369k93033e8235m07599a41008
$$ 122259 190692 -213053 -237399 -36182 -132996 -15410 -102779 -395812 -58235 -465834 -141008
9878b07395B52840b77540C86959a53152L4317L1300K9589k77107c1936j93609
$$ -207395 252840 -277540 386959 -153152 -118835 -87535 -57946 -335053 -31936 -225545
9868b25545i2839B7801a67064j0712j93319g3719B6966a4692l6615I2471A1026
$$ -225545 -92839 27801 -167064 -177776 -371095 -73719 26966 -14692 -51307 92471 11026
9856A17382E1102J0609a44766n0216j66979J67250N0984a0231k1208k80875L0859
$$ 117382 51102 61711 -144766 -194982 -361961 -194711 -143727 -10231 -31439 -312314 -281455
9845b81455A75580G0673c50125a15965j08529k5217D8564K2966a70818l6834B7928
$$ -281455 175580 70673 -350125 -115965 -224494 -249711 48564 71530 -170818 -207652 27928
9833b4338B55475a05917A07521a14362B7906a37328k37628J21491A19901J21824
$$ -24338 255475 -105917 107521 -114362 27906 -137328 -374956 -253465 119901 241725
9823B41725a74136A28014a12633I0354b60650g6588p6757f9873l6696D8476J64656
$$ 241725 -174136 128014 -112633 90354 -260650 -76588 -153345 -69873 -106569 48476 213132
9812B13132g7041k48454h5906c6036k2630m3929a1961k14565J07439k32537r3713
$$ 213132 -77041 -325495 -85906 -36036 -58666 -102595 -11961 -226526 -119087 -351624 -445337
9801d45337M7100E0716a27048L4264l774j22831k741I1478a35826j90486F0789
$$ -445337 -398237 50716 -127048 -92784 -96558 -219389 -222130 91478 -135826 -326312 60789
9789C3290h327A4208i3202J2127A83817C5487J36724c14486A85872q3717D3863
$$ 33290 -8327 14208 -93202 -81075 183817 35487 172211 -314486 185872 102155 43863
9777B14247H4580i6464J0957c9752I4980a89666g9319k07327N9439C82455a98806
$$ 214247 84580 -96464 -85507 -39752 94980 -189666 -79319 -286646 -227207 382455 -198806
9765B16298D7845J55305l4046d2045D2980f9633j08933B172P2970L1861J30931
$$ 216298 47845 203150 169104 -42045 42980 -69633 -178566 2172 75142 107003 237934
9754B37934b06985k4032P4581O203K1631c2920p04k1888J9950p6873A84984o5896
$$ 237934 -206985 -231017 -156436 -150233 -128602 -32920 -33624 -55512 -35562 -112435 184984 119088
9742A19088c41123c695q8296A18853b7648l08414a13251k01270j64388a11373
$$ 119088 -341123 -3695 -91991 118853 -27648 -336062 -113251 -314521 -478909 -111373
9731c63356R8350P1851B9066b68372g6061r0492g2761j4985l8017k1768D1217
$$ -363356 -265006 -193155 29066 -268372 -76061 -166553 -72761 -87746 -125763 -147531 41217
9719A32822c0704A47996d46911J98318A52353b44859A7426J68559f1499o0179
$$ 132822 -30704 147996 -446911 -248593 152353 -244859 17426 185985 -61499 -121678
9709a21678D0904K0224a10149k94059A13776j1799a1754k66847k41704A11766
$$ -121678 40904 61128 -110149 -404208 113776 101977 -11754 -278601 -520305 111766
9698A28494c39353J35580i0204A36054a30558a7184D8463K08664b2135j12947
$$ 128494 -339353 -203773 -90204 136054 -130558 -17184 48463 257127 -22135 -135082
9688a35082H6903a17924B03779b59440j12551c6598E766J0386h4336b6473j37847
$$ -135082 86903 -117924 203779 -259440 -371991 -36598 5766 16152 -84336 -26473 -164320
9677a64320K7690e8797j22708H0954e4924O686H8230N7807A5339a47818A27773
$$ -164320 -136630 -58797 -181505 80954 -54924 -48238 88230 146037 15339 -147818 127773
9665b90173i9876m0541N4137q3097A83358c5672D4634a36651a8052m4719m9748
$$ -290173 -99876 -140417 -86280 -169377 183358 -35672 44634 -136651 -18052 -62771 -112519
9654a12519l7475k52701A8728a73935f5010j2976C37663a64011B41939D2675J11185
$$ -112519 -149994 -402695 18728 -173935 -65010 -77986 337663 -164011 241939 42675 153860
9643A53860i8562k14967o7314A6023b37649n925f4648E1874b02476g789j9742
$$ 153860 -98562 -313529 -380843 16023 -237649 -243574 -64648 51874 -202476 -7789 -27531
9632b7531k55465b1066j69072J6620D31459E3418c41180a7055k46468a01469c1388
$$ -27531 -282996 -21066 -190138 -173518 431459 53418 -341180 -17055 -263523 -101469 -31388
9620g0688a1353C0581K83811F946a65506j82417J14577Q3830f7128A49922b77578
$$ -70688 -11353 30581 314392 6946 -165506 -347923 -233346 -149516 -67128 149922 -277578
9608h525k7269A33284D0735P3108f9161J4064l8397F7379a15409F7573K0676b17847
$$ -8525 -35794 133284 40735 113843 -69161 -55097 -93494 67379 -115409 67573 88249 -217847
9595b8219j7910n1963c6355B77859i4040o8374A36270a71408b8861A02644M0368
$$ -28219 -46129 -98092 -36355 277859 -94040 -162414 136270 -171408 -28861 102644 143012
9584A43012c71748J02625b3579j52980e4713F7468O120f320C3261J42657b15778
$$ 143012 -371748 -269123 -23579 -176559 -54713 67468 73588 -6320 33261 175918 -215778
9572a07015G4548b96725H1780O9747M9127c27510B3254r368b01279B0332a20667
$$ -107015 74548 -296725 81780 151527 200654 -327510 23254 13886 -201279 20332 -120667
9560I9575a73621B59314i9516A12684a02561D6389M213a21053G9873I962b9926
$$ 99575 -173621 259314 -99516 112684 -102561 46389 50602 -121053 79873 9962 -29926
9548c1085q336A96645q5697A3006c6984B12837F914a11420d5933J9384j09845
$$ -31085 -39421 196645 110948 13006 -36984 212837 6914 -111420 -45933 -26549 -136394
9537a36394J7479c1149I255J6864h9965C03318F3385j7156b6969k7567k0879n05780
$$ -136394 -118915 -31149 9255 26119 -89965 303318 63385 46229 -26969 -54536 -75415 -581195
9525e81195A20836a77255m606O9083n7396g9253H5922c40478I9048J8901A0774
$$ -581195 120836 -177255 -181861 -112778 -170174 -79253 85922 -340478 99048 117949 10774
9513B02949a77945j00118a4087j19741e3962k07095g5905j81784B47258B7573
$$ 202949 -177945 -278063 -14087 -133828 -53962 -261057 -75905 -257689 247258 27573
9502h9429c9943p4832e1697A06092b08694H0564b05414I2841b08799A00072a74642
$$ -89429 -39943 -114775 -51697 106092 -208694 80564 -205414 92841 -208799 100072 -174642
9490h2698E1421a19561C2184M24335k24258F9004K8114d03568l0694J01024B01048
$$ -82698 51421 -119561 32184 456519 232261 69004 97118 -403568 -434262 -333238 201048
9478b21402A74353K423a04912K1776H8104j2123P3104E873J42576a35641f835
$$ -221402 174353 176776 -104912 -83136 88104 75981 149085 5873 148449 -135641 -6835
9466B85764D4576A9905Q2795O1528b17874h8755p4794I6372c202l9596A78482
$$ 285764 44576 19905 102700 164228 -217874 -88755 -163549 96372 -3202 -42798 178482
9454a79278c5699D3374M55a89512l7829b803A30382Q4393c5287F6321b36404R9138
$$ -179278 -35699 43374 43829 -189512 -227341 -2803 130382 214775 -35287 66321 -236404 -137266
9442a37266K9617m1584I4521b9373n9291B43076d8670j5203D00650b71758n1452
$$ -137266 -107649 -149233 94521 -29373 -88664 243076 -48670 -63873 400650 -271758 -323210
9431c23210J22631A14457a06878P467A07134P4997a45440a5487j30278O1204A68060
$$ -323210 -200579 114457 -106878 -99411 107134 182131 -145440 -15487 -145765 -84561 168060
9419I4048b2449r8993N1500b6617q3173j2188k0849j61933A53798H52e0199m6897
$$ 94048 -22449 -121442 -69942 -26617 -109790 -121978 -142827 -304760 153798 852 -50199 -97096
9407i7096k4394j20274J01640A8854b6866j62790a4604I2786g9749L8445k64956
$$ -97096 -121490 -241764 -140124 18854 -26866 -189656 -14604 92786 -79749 -41304 -306260
9396c06260B71060c90057D5314O4622B5372a37074B97775a69578f207r9551E6469
$$ -306260 271060 -390057 45314 109936 25372 -137074 297775 -169578 -6207 -105758 56469
9384d1329j91651N8456B05990a55664j16354J17525N8899k668F0761c71042B14757
$$ -41329 -232980 -174524 205990 -155664 -272018 -154493 -95594 -98262 60761 -371042 214757
9372c05195p388A58599A8037i002r4592j38293A47128a97103B02826d82416a60986
$$ -305195 -312583 158599 18037 -9002 -103594 -241887 147128 -197103 202826 -482416 -160986
9360b03025R6813B28982a6868j78691K8222r4100B07857a17175i90k82954f1199
$$ -203025 -106212 228982 -16868 -195559 -167337 -261437 207857 -117175 -990 -283944 -61199
9348H5184a85001A84792Q2947a757j98569A91405a65562A02637A7105b666F879
$$ 85184 -185001 184792 267739 -1757 -200326 191405 -165562 102637 17105 -2666 6879
9336b1406P125A49353C0698j4623a69500M6724I205e5877q8033A22654b10779
$$ -21406 -14281 149353 30698 16075 -169500 -122776 9205 -55877 -143910 122654 -210779
9324a44511K3071j68824I8189c06374A8197d27582A84678K35255c1617l9565A1488
$$ -144511 -121440 -290264 98189 -306374 18197 -427582 184678 419933 -31617 -71182 11488
9312a61492F4428J06308D8860a54722A34044J41879a45201m4590g8754j43842
$$ -161492 64428 170736 48860 -154722 134044 275923 -145201 -189791 -78754 -222596
9302b22596L3420P0467e4820l879A48575b38854d9929A29628J6094b0383l93216
$$ -222596 -189176 -118709 -54820 -58699 148575 -238854 -49929 129628 145722 -20383 -413599
9291d13599g7014m1300j43143k0047b2285B00519c1592n285k91781h6777q0352
$$ -413599 -77014 -118314 -261457 -281504 -22285 200519 -31592 -36877 -328658 -86777 -167129
9280a67129k7100f6312j53200p5408d5934j01313p5518A23814d18573e148k21451
$$ -167129 -194229 -66312 -219512 -294920 -45934 -147247 -222765 123814 -418573 -5148 -226599
9269b26599A30648a8464k53838Q1955B63308a33109I1143K01502j15683H1306
$$ -226599 130648 -18464 -272302 -190347 263308 -133109 91143 292645 176962 81306
9258A28091c58112F1216A3614J92359j00601e6373A19781a51457I8937b18988
$$ 128091 -358112 61216 13614 205973 105372 -56373 119781 -151457 98937 -218988
9247b34962A25331k8447c07538E4773k5700J18005F6698f5351j38059P2634A712
$$ -234962 125331 96884 -307538 54773 29073 147078 66698 -65351 -203410 -130776 1712
9235A50348a6742L940n1158l73357J62787r6072d6939A54037K6032a76908m9005
$$ 150348 -16742 -12802 -63960 -437317 -274530 -370602 -46939 154037 180069 -176908 -225913
9224b25913A19974b84869F5473a50396A30351i4268o9713E358P2958j1998A3528
$$ -225913 119974 -284869 65473 -150396 130351 -94268 -163981 5358 78316 66318 13528
9212c2255A13673P362a02688j04902A25467d19769J15338a21828D9815b55107
$$ -32255 113673 121035 -102688 -207590 125467 -419769 -304431 -121828 49815 -255107
9201g0254j19059j04394A72273c5541B4607a92005q7578B55178p725D9685A2593
$$ -70254 -189313 -293707 172273 -35541 24607 -192005 -279583 255178 247453 49685 12593
9189G0038O2547J3159b61430J6505E4187a88036J1014A94140g988A733g4027r1528
$$ 70038 132585 145744 -261430 -244925 54187 -188036 -177022 194140 -7988 1733 -74027 -165555
9177a65555c9228l2279i378r8644n8089A89498b44587d8901b783k1667B1595L34356
$$ -165555 -39228 -71507 -9378 -108022 -166111 189498 -244587 -48901 -2783 -24450 21595 355951
9165C55951b95044A9520r144b13171j9881D17798a58326c6726F4836k8993a68484
$$ 355951 -295044 19520 10376 -213171 -233052 417798 -158326 -36726 64836 35843 -168484
9153A59370b07256A24547c5797A03846f3479G968P0236b33673j36546F1058a32115
$$ 159370 -207256 124547 -35797 103846 -63479 7968 78204 -233673 -370219 61058 -132115
9141e0082j54214R4227B35723b20067c5453A06851K7988a48866C93087A8930a77669
$$ -50082 -204296 -110069 235723 -220067 -35453 106851 134839 -148866 393087 18930 -177669
9129A20359a573j11052L2737k47634A05180e769j97362i59k11825A36174f5767
$$ 120359 -1573 -112625 -79888 -327522 105180 -5769 -203131 -959 -212784 136174 -65767
9117e6146A2053a15383D4231h3774B6815J06135a51178b4174C23208j9437a06643
$$ -56146 12053 -115383 44231 -83774 26815 132950 -151178 -24174 323208 303771 -106643
9105f5871l44434E7594H23J37582a32661j58745a6253B14113e5438p3118A74095
$$ -65871 -410305 57594 823 138405 -132661 -291406 -16253 214113 -55438 -128556 174095
9093e8311B35519a31308c2318F9969c19438F2318b02342B3263M2405a11337L888
$$ -58311 235519 -131308 -32318 69969 -319438 62318 -202342 23263 65668 -111337 -107449
9082a07449b9760j85395I2875c75037B2776l268M945M3163J0407K04188D3460
$$ -107449 -29760 -215155 92875 -375037 22776 19508 24453 67616 78023 282211 43460
9070A92699f6258j08570C5849d03967b4588j65256B69664a19529K1310B9514a91240
$$ 192699 -66258 -174828 35849 -403967 -24588 -189844 269664 -119529 -98219 29514 -191240
9058a1238B14254d15303g9800G0192e1736j93973L4708G3595J91729H7543M8856
$$ -11238 214254 -415303 -79800 70192 -51736 -245709 -211001 73595 265324 87543 136399
9047A36399c2293O874k17058K1922A28095b32544B327a53387l86957B16490c72578
$$ 136399 -32293 -25419 -242477 -220555 128095 -232544 2327 -153387 -540344 216490 -372578
9035b39030d6785A16964E1829b42520F8086g2176A10635D7418c8302H5962i1987
$$ -239030 -46785 116964 51829 -242520 68086 -72176 110635 47418 -38302 85962 -91987
9023b01094c3192n511p0093j23989b3552A80822b88351J13879A05138N6957d882
$$ -201094 -33192 -38703 -108796 -232785 -23552 180822 -288351 -174472 105138 162095 -4882
9011b7564D4197e5574l43783B65756c06286a23888D87162C0022b90914j92352
$$ -27564 44197 -55574 -399357 265756 -306286 -123888 487162 30022 -290914 -483266
9001d83266B63493m9662b21392f5388j81332J19400d3586j29141E8579a94080
$$ -483266 263493 213831 -221392 -65388 -246720 -127320 -43586 -172727 58579 -194080
8990b61320R5539a6832A69841k1754d8757A03507b3040r9035J2448d8360A93419
$$ -261320 -165781 -16832 169841 148087 -48757 103507 -23040 -122075 -109627 -48360 193419
8978C2948b53461B13564a94770P3863J8197r9912H7524K3247a04261d0642A26200
$$ 32948 -253461 213564 -194770 -120907 -102710 -202622 87524 110771 -104261 -40642 126200
8966b27818R4875E9509a96965B14496b05125f6921G3554b54207I7231a01502G9416
$$ -227818 -132943 59509 -196965 214496 -205125 -66921 73554 -254207 97231 -101502 79416
8954a5743F8862A6669k228i7674k64996E1186f0450J3237k7727H7597D2240e3152
$$ -15743 68862 16669 14441 -97674 -362670 51186 -60450 -47213 -74940 87597 42240 -53152
8941A39827E5298g3112K7382B5798J25255b74210E4383L28467F0660a19365R52
$$ 139827 55298 -73112 -45730 25798 151053 -274210 54383 382850 60660 -119365 -118413
8930a18413A02327Q0758Q646p3120h379D72774L34917J584540J0450305D456099
$$ -118413 102327 183085 191731 118611 -8379 472774 807691 2392231 12842536 4456099
8919A082368E11148j93886C714K00829a95996J4475B9370I823d54205K19181B18990
$$ 1082368 511148 317262 3714 204543 -195996 -181521 29370 9823 -454205 -235024 218990
8907d90865b2900C0217j2320J74569b01432d059B1671j763d62714c7872J655j56709
$$ -490865 -22900 30217 17897 192466 -201432 -4059 21671 19908 -462714 -37872 -36217 -192926
8895a92926a4898l8352B6376a02166k86174a88820d6220H0399e94804g2426J9618
$$ -192926 -14898 -53250 26376 -102166 -388340 -188820 -46220 80399 -594804 -72426 -52808
8884e2808A57826a57424k487F3726P870b12292f5390l0640a5398k33495A38077
$$ -52808 157826 -157424 -159911 63726 71596 -212292 -65390 -96030 -15398 -248893 138077
8872a02352A28824J16761i7572B0290N5366J5576a52841J7385B96423c861j24364
$$ -102352 128824 245585 -97572 20290 75656 91232 -152841 -135456 296423 -3861 -128225
$$ [...]
##END NTUPLES=NMR SPECTRUM
##END=
