
##TITLE=AC1335_MEXAH11120_6528214_WYYS4kpn0q
##JCAMPDX= 6.0         $$ Bruker NMR JCAMP-DX V2.0
##DATA TYPE= NMR SPECTRUM
##DATA CLASS= NTUPLES
##ORIGIN= BRUKER
##OWNER= Administrator
$$ 1.72 TOPSPIN		Version 2.1
$$ 2012-07-15 11:59:31.343 -0500  Administrator@TOPSPIN
$$ Compression mode = diff/dup
##.OBSERVE FREQUENCY= 400.02188249412
##.OBSERVE NUCLEUS= ^1H
##.ACQUISITION MODE= SIMULTANEOUS (DQD)
##.ACQUISITION SCHEME= undefined
##.AVERAGES= 64
##.DIGITISER RES= 22
##SPECTROMETER/DATA SYSTEM= spect
##.PULSE SEQUENCE= noesygpps1d.comp
##.SOLVENT NAME= COFFEE_meoh
##.SHIFT REFERENCE= INTERNAL, COFFEE_meoh, 1, 14.96068
##AUDIT TRAIL= $$ (NUMBER, WHEN, WHO, WHERE, PROCESS, VERSION, WHAT)
$$ ##TITLE= Audit trail, TOPSPIN		Version 2.1
$$ ##JCAMPDX= 5.01
$$ ##ORIGIN= Bruker BioSpin GmbH
$$ ##OWNER= Administrator
$$ $$ C:\Bruker\TOPSPIN/data/COFFEE/nmr/AC1335_MEXAH11120_6528214_WYYS4kpn0q/12/pdata/1/auditp.txt
$$ ##AUDIT TRAIL=  $$ (NUMBER, WHEN, WHO, WHERE, PROCESS, VERSION, WHAT)
(   1,<2012-07-15 11:59:26.546 -0500>,<Administrator>,<TOPSPIN>,<go>,<TOPSPIN 2.1>,
      <created by zg
	started at 2012-07-15 11:47:56.296 -0500,
	POWCHK enabled, PULCHK disabled,
       configuration hash MD5:
       6B 1B 68 BB D9 2E 58 E2 7F 35 AD 54 07 DF 0E 41
       data hash MD5: 64K
       F0 63 CF BB 1A F4 5B 84 63 7E 06 35 FE 5F B6 03>)
(   2,<2012-07-15 11:59:29.359 -0500>,<Administrator>,<TOPSPIN>,<proc1d>,<TOPSPIN 2.1>,
      <Start of raw data processing
       efp LB = 0.3 FT_mod = 6 PKNL = 1 PHC0 = 0 PHC1 = 0 SI = 128K 
       data hash MD5: 128K
       0A 87 C7 51 C4 A3 BE 84 83 70 00 2F 0B BD 41 18>)
(   3,<2012-07-15 11:59:30.484 -0500>,<Administrator>,<TOPSPIN>,<proc1d>,<TOPSPIN 2.1>,
      <pk PHC0 = -4.465942 PHC1 = 0 
       data hash MD5: 128K
       A0 84 5B BA 7A F0 5C 40 EC 28 4C C9 50 48 AF F6>)
(   4,<2012-07-15 11:59:31.031 -0500>,<Administrator>,<TOPSPIN>,<proc1d>,<TOPSPIN 2.1>,
      <abs ABSG = 1 
       data hash MD5: 128K
       F6 36 8A 6C 6C CC BC 36 52 4E 8A B8 9C F0 32 94>)
(   5,<2012-07-15 11:59:31.109 -0500>,<Administrator>,<TOPSPIN>,<proc1d>,<TOPSPIN 2.1>,
      <abs ABSG = 2 
       data hash MD5: 128K
       CB E3 2D 82 71 15 1C 25 72 2C 0B B2 F9 53 61 F1>)
(   6,<2012-07-15 11:59:31.156 -0500>,<Administrator>,<TOPSPIN>,<proc1d>,<TOPSPIN 2.1>,
      <abs ABSG = 3 
       data hash MD5: 128K
       B1 ED 8F 03 95 B7 CA 58 BF 96 E6 E2 9D 09 DC 87>)
(   7,<2012-07-15 11:59:31.203 -0500>,<Administrator>,<TOPSPIN>,<proc1d>,<TOPSPIN 2.1>,
      <abs ABSG = 4 
       data hash MD5: 128K
       8B DD F2 A2 C9 EF 98 63 55 FF EF 88 ED FF 7B 19>)
(   8,<2012-07-15 11:59:31.265 -0500>,<Administrator>,<TOPSPIN>,<proc1d>,<TOPSPIN 2.1>,
      <abs ABSG = 5 
       data hash MD5: 128K
       24 4C 63 1E DB 98 91 64 5F A6 C8 A4 8F B4 54 C6>)
$$ ##END=
$$ 
$$ $$ hash MD5
$$ $$ DB ED 57 6E E6 8D B0 0A DD 63 D5 F3 C6 5D D6 DA
##$RELAX= 
##$RELAX= 
##$RELAX= 
##$RELAX= 
##$RELAX= 
##$RELAX= 
##$RELAX= 
##$RELAX= 
$$ Bruker specific parameters
$$ [...]
##$TP07= 0
##$TPNAME0= <>
##$TPNAME1= <>
##$TPNAME2= <>
##$TPNAME3= <>
##$TPNAME4= <>
##$TPNAME5= <>
##$TPNAME6= <>
##$TPNAME7= <>
##$TPOAL= (0..7)
0.5 0.5 0.5 0.5 0.5 0.5 0.5 0.5
##$TPOFFS= (0..7)
0 0 0 0 0 0 0 0
##$TUNHIN= 0
##$TUNHOUT= 0
##$TUNXOUT= 0
##$USERA1= <user>
##$USERA2= <user>
##$USERA3= <user>
##$USERA4= <user>
##$USERA5= <user>
##$V9= 5
##$VALIST= <valist>
##$VCLIST= <CCCCCCCCCCCCCCC>
##$VD= 0
##$VDLIST= <DDDDDDDDDDDDDDD>
##$VPLIST= <PPPPPPPPPPPPPPP>
##$VTLIST= <TTTTTTTTTTTTTTT>
##$WBST= 2048
##$WBSW= 25
##$XGAIN= (0..3)
0 0 0 0
##$XL= 0
##$YL= 0
##$YMAX_a= 11301617
##$YMIN_a= -9381833
##$ZGOPTNS= <>
##$ZL1= 120
##$ZL2= 120
##$ZL3= 120
##$ZL4= 120
##$ABSF1= 14.96068
##$ABSF2= -5.597502
##$ABSG= 5
##$ABSL= 3
##$ALPHA= 0
##$AQORDER= 0
##$ASSFAC= 0
##$ASSFACI= 0
##$ASSFACX= 0
##$ASSWID= 0
##$AUNMP= <proc_prof1d_extract.lims>
##$AXLEFT= 0
##$AXNAME= <>
##$AXNUC= <1H>
##$AXRIGHT= 0
##$AXTYPE= 0
##$AXUNIT= <>
##$AZFE= 0.1
##$AZFW= 0.1
##$BCFW= 0
##$BC_mod= 0
##$BYTORDP= 0
##$COROFFS= 0
##$CY= 15
##$DATMOD= 1
##$DC= 0
##$DFILT= <>
##$DTYPP= 0
##$F1P= 0
##$F2P= 0
##$FCOR= 0.5
##$FTSIZE= 131072
##$FT_mod= 6
##$GAMMA= 0
##$GB= 0
##$INTBC= 1
##$INTSCL= 1
##$ISEN= 128
##$LB= 0.3
##$LEV0= 0
##$LPBIN= 0
##$MAXI= 10000
##$MC2= 0
##$MEAN= 0
##$ME_mod= 0
##$MI= 0
##$NCOEF= 0
##$NC_proc= -2
##$NLEV= 6
##$NOISF1= 0
##$NOISF2= 0
##$NSP= 0
##$NTH_PI= 0
##$NZP= 0
##$OFFSET= 14.96068
##$PC= 1
##$PHC0= -4.465942
##$PHC1= 0
##$PH_mod= 1
##$PKNL= yes
##$PPARMOD= 0
##$PPDIAG= 0
##$PPIPTYP= 0
##$PPMPNUM= 2147483647
##$PPRESOL= 1
##$PSCAL= 4
##$PSIGN= 0
##$PYNMP= <proc.py>
##$REVERSE= no
##$SF= 400.020009766139
##$SI= 131072
##$SIGF1= 0
##$SIGF2= 0
##$SINO= 400
##$SIOLD= 131072
##$SPECTYP= <>
##$SREGLST= <1H.CDCl3>
##$SSB= 0
##$STSI= 131072
##$STSR= 0
##$SW_p= 8223.68421052631
##$SYMM= 0
##$S_DEV= 0
##$TDeff= 65536
##$TDoff= 0
##$TI= <>
##$TILT= no
##$TM1= 0
##$TM2= 0
##$TOPLEV= 0
##$USERP1= <user>
##$USERP2= <user>
##$USERP3= <user>
##$USERP4= <user>
##$USERP5= <user>
##$WDW= 1
##$XDIM= 131072
##$YMAX_p= 432726388
##$YMIN_p= -11764
##$CURPLOT= <Network HP LaserJet P1505>
##$CURPRIN= <$Network HP LaserJet P1505>
##$DFORMAT= <normdp>
##$LAYOUT= <+/1D_H.xwp>
##$LFORMAT= <normlp>
##$PFORMAT= <normpl>
##$SURQMSG= 1
$$ End of Bruker specific parameters
$$ ---------------------------------
##NTUPLES= NMR SPECTRUM
##VAR_NAME=  FREQUENCY,     SPECTRUM/REAL,   SPECTRUM/IMAG
##SYMBOL=    X,             R,               I
##VAR_TYPE=  INDEPENDENT,   DEPENDENT,       DEPENDENT
##VAR_FORM=  AFFN,          ASDF,            ASDF
##VAR_DIM=   131072,        131072,          131072
##UNITS=     HZ,            ARBITRARY UNITS, ARBITRARY UNITS
##FACTOR=    0.0627417313425164, 1,          1
##FIRST=     8223.62146879497, 529,          -58457
##LAST=      0,             1890,            -58833
##MIN=       0,             -11764,          0
##MAX=       8223.62146879497, 432726388,    0
$$ Real data points
##PAGE= N=1
##DATA TABLE= (X++(R..R)), XYDATA
$$ [...]
61651C70756J302J404J260J003J193J971K559K189J284J032J829K790K932K339
61637C95843J839J956K472K794K550J804Q91J8p82j379j513j220r91j123j240
61622D01919q84l91n76j576k623l024k852k485k025j522j356j926l025l887l935
61607C69832l390l069l521m410m919m801m671n025n438n192m410l817l559l011
61593C10599j884p99m73q70j499k057k428k542k543k786l230l212k295j083o45
61578B82253j196j835j661q47l76q72j844k161j271K00J109R84L20j89l48m43
61562B71823p65j266j487r57J28Q32N81P8L94J343J670J052P31J610K695K521
61546B80983J358Q26J478K109J574K39q16j189j112o69J69J009J211P24K38L18
$$ y = [370756, 372058, 373462, 374722, 375725, 376918, 378889, 381448, 383637, 384921, 385953, 387782, 390572, 393504, 395843, 397682, 399638, 402110, 404904, 407454, 409258, 410149, 410167, 409385, 408006, 406493, 405273, 404282, 403159, 401919, 401035, 400644, 400068, 398492, 395869, 392845, 389993, 387508, 385483, 383961, 382605, 380679, 377654, 373767, 369832, 366442, 363373, 359852, 355442, 350523, 345722, 341051, 336026, 330588, 325396, 320986, 317169, 313610, 310599, 308715, 307916, 307443, 306573, 305074, 303017, 300589, 298047, 295504, 292718, 289488, 286276, 283981, 282898, 282253, 281057, 279222, 277561, 276714, 276338, 275466, 273622, 271461, 270190, 270390, 271499, 272483, 272803, 272614, 272266, 271823, 271058, 269792, 268305, 267348, 267476, 268308, 268889, 268967, 269361, 270704, 272374, 273426, 274157, 275767, 278462, 280983, 282341, 283167, 284645, 286754, 288328, 288567, 287751, 286562, 285450, 284781, 284950, 285959, 287170, 287894, 288132, 288450]
61530B88450P50R22O43K63P2n9l46o87q80j009j281j513j205k49P94J242R45J80
61512B87032p24j501j889j743j144k56P20J366J206K75o74q37j81O45J018Q00
61496B84113K89k7J74P13J052R08M91L5n02j062j265j017q97j361j870j502k72
61479B78000Q67J316J415J667K055K344K443K236J622J002J108J949K486J902
61465C02412P13l3k69p43j520j668p04M84P64J89l15l46k75l18j67K51M54J82
61447B99091q3J35N21M86R9j76l22n60n19M30J944K762K332J569J524K069K425
61430C13727K397K313K211J895J497J328J298J084P27N53O58Q92J160J288R44
61415C33972K46J3P57J797K183K121K438K936K597J445P24Q54O08q57k438k606
$$ y = [288450, 289200, 290122, 290765, 291028, 291100, 291041, 290695, 290008, 289128, 288119, 286838, 285325, 284120, 283871, 284665, 285907, 286852, 287032, 286308, 284807, 282918, 281175, 280031, 279775, 280495, 281861, 283067, 283342, 282668, 281831, 281650, 282295, 283313, 284113, 284402, 284375, 284549, 285262, 286314, 287222, 287713, 287748, 287246, 286184, 284919, 283902, 283005, 281644, 279774, 278272, 278000, 278867, 280183, 281598, 283265, 285320, 287664, 290107, 292343, 293965, 294967, 296075, 298024, 300510, 302412, 303125, 303092, 302823, 302080, 300560, 298892, 298188, 298672, 299436, 299625, 299310, 298964, 298689, 298371, 298204, 298455, 298909, 299091, 299008, 299143, 299664, 300150, 300249, 300073, 299751, 299191, 298672, 299102, 301046, 303808, 306140, 307709, 309233, 311302, 313727, 316124, 318437, 320648, 322543, 324040, 325368, 326666, 327750, 328477, 329030, 329688, 330580, 331740, 333028, 333972, 334218, 334231, 334988, 336785, 338968, 341089, 343527, 346463, 349060, 350505, 351229, 352083, 352691, 351834, 349396, 346790]
61399C46790j661j187j784k534k556j932j034j6Q58J154Q71M69O5p23j833k378
61383C32569j774p28l99q07q88o0R98J364J053P06O35P42J060J697K297K334K003
61366C42802K093K650K592J274l15o98J22Q69R08Q95J448K197K547K545K513K511
61350C66953K690L547N142O521O639N677M788M617M739M504L868L180K574J958
61336D27397J453J525K504L993M986M813L866L080K759K393J648R42P35O60Kj256
61320D61500k319k513j940j137m34L02J348K666L817M479M957N873P346Q834R925
61305E02704J0867J2030J3352J4591J5757J6816J7296J6637J4737J1735P649K827
61293F56998j588m420n733o679p970r169r685r745r985j0527j0989j1156j1144
$$ y = [346790, 345129, 343942, 342158, 339624, 337068, 335136, 334102, 334086, 334944, 336098, 336969, 337438, 337503, 336780, 334947, 332569, 330795, 330067, 329668, 328861, 327973, 327913, 328911, 330275, 331328, 332034, 332669, 333411, 334471, 336168, 338465, 340799, 342802, 344895, 347545, 350137, 351411, 351096, 350398, 350520, 351389, 352297, 353192, 354640, 356837, 359384, 361929, 364442, 366953, 369643, 373190, 378332, 384853, 391492, 397169, 401957, 406574, 411313, 415817, 419685, 422865, 425439, 427397, 428850, 430375, 432879, 436872, 441858, 446671, 450537, 453617, 456376, 458769, 460417, 461359, 462094, 462754, 462756, 461500, 459181, 456668, 454728, 453591, 453157, 453459, 454807, 457473, 461290, 465769, 470726, 476599, 483945, 492779, 502704, 513571, 525601, 538953, 553544, 569301, 586117, 603413, 620050, 634787, 646522, 654171, 656998, 655410, 650990, 645257, 638578, 630608, 621439, 611754, 602009, 592024, 581497, 570508, 559352, 548208]
61280E48208j1000j0574r872r142q487p622o244m530k990j807n85R90K483K994
61266D81822K223R10J08K04Q67J653K377L000L540M181N221O686Q053Q550P851
61251E37246O416N035M110L490K979K653K639K861L245L737L935L147J356l15
61237E82534p63k95j23o91j339j582j672j706j242j80Q10J299J792K828M141N217
61221E89028O021O582O583O064N847O441P157P185O903P161P725P576O522N402
61207F82197M744M315L929L795L813L436K499J505R11O91P73J289K249L445M775
61192G24366O303P940R435J0648J1414J1307R997P709M880J684j517l750m289
61179G96127l786l614m202m926n484o291p326p716o898n395m087l405l519m508
$$ y = [548208, 537208, 526634, 516762, 507620, 499133, 491511, 485267, 480737, 477747, 475940, 475355, 476345, 478828, 481822, 484045, 484955, 485063, 485267, 486134, 487787, 490164, 493164, 496704, 500885, 506106, 512792, 520845, 529395, 537246, 543662, 548697, 552807, 556297, 559276, 561929, 564568, 567429, 570674, 574411, 578346, 581493, 582849, 582534, 581771, 581476, 581353, 580662, 579323, 577741, 576069, 574363, 573121, 572941, 573751, 575050, 576842, 579670, 583811, 589028, 595049, 601631, 608214, 614278, 620125, 626566, 633723, 640908, 647811, 654972, 662697, 670273, 676795, 682197, 686941, 691256, 695185, 698980, 702793, 706229, 708728, 710233, 711144, 711835, 712608, 713897, 716146, 719591, 724366, 730669, 738609, 748044, 758692, 770106, 781413, 791410, 799119, 803999, 805683, 804166, 800416, 796127, 792341, 788727, 784525, 779599, 774115, 767824, 760498, 752782, 745884, 740489, 736402, 732997, 729478, 724970]
61165G24970n885o715o673o485o861p549p874p729p579p781q311q890r139q797
61151F18702q024p198o399n354l974k540j305l27K25jj172l044n133o848p652
61136E59956p496o917o358n628m473l248k370j539k67J110J893K192K765L839
61122E33459N072O457Q189R821J0691J1181J2330J4240J6009J7261J8497J9811
61110F83018K0621K0920K1490K2485K3050K2678K1878K1093K0174J9191J8543
61099I15141J7900J6306J3682J0960Q383N076P55l570p125j0217j2983j4840j5824
61086I23644j6989j8675j9846j9875j9515j9317j8704j7523j6901j7411j7899
61075G20989j7247j5892j4534j2884j0839r352q815q139o667n394m961m222k330
$$ y = [724970, 719085, 712370, 705697, 699212, 692351, 684802, 676928, 669199, 661620, 653839, 645528, 636638, 627499, 618702, 610678, 603480, 597081, 591727, 587753, 585213, 583908, 583581, 583806, 583805, 582633, 579589, 574456, 567608, 559956, 552460, 545543, 539185, 533557, 529084, 525836, 523466, 521927, 521660, 522770, 524663, 526855, 529620, 533459, 538531, 544988, 553177, 562998, 573689, 584870, 597200, 611440, 627449, 644710, 663207, 683018, 703639, 724559, 746049, 768534, 791584, 814262, 836140, 857233, 877407, 896598, 915141, 933041, 949347, 963029, 973989, 982372, 987448, 988203, 984633, 977508, 967291, 954308, 939468, 923644, 906655, 887980, 868134, 848259, 828744, 809427, 790723, 773200, 756299, 738888, 720989, 703742, 687850, 673316, 660432, 649593, 640241, 631426, 623287, 616620, 611226, 606265, 602043, 599713]
61062E99713n28o2M7J149K495K696K315K807L993M756N219O199P413Q218R111
61047F55541J0668J2064J2518J3032J4694J6588J7468J8154J9948K2098K3296
61036H36069K4313K6528K9087L0336L0944L2784L5812L8815M2078M6386N0588
61025A223740N3076N4414N5597N5506N3436N2165N4599N9389O4209P1028Q2761
61014A879920R6636J07148J14358J22949J34555J48324J68010J99922K43892K95162
61004C510876L55199M30648N21970O26594P55125R28324J154996J435041J789209
60995A1507982K239202K706810K953273K705909J908220Q30286j11255o47563
60987B4092864p63972n62183j17104M77208R84901J077233N75091l72555j385789
$$ y = [599713, 599185, 599123, 599170, 600319, 602814, 605510, 607825, 610632, 614625, 619381, 624600, 630799, 638212, 646430, 655541, 666209, 678273, 690791, 703823, 718517, 735105, 752573, 770727, 790675, 812773, 836069, 860382, 886910, 915997, 946333, 977277, 1010061, 1045873, 1084688, 1126766, 1173152, 1223740, 1276816, 1331230, 1386827, 1442333, 1495769, 1547934, 1602533, 1661922, 1726131, 1797159, 1879920, 1976556, 2083704, 2198062, 2321011, 2455566, 2603890, 2771900, 2971822, 3215714, 3510876, 3866075, 4296723, 4818693, 5445287, 6200412, 7128736, 8283732, 9718773, 11507982, 13747184, 16453994, 19407267, 22113176, 24021396, 24851682, 24740427, 24092864, 23328892, 22766709, 22649605, 23126813, 24111714, 25188947, 25764038, 25391483, 24005694]
60978B4005694k128093k485043k525871k368509k105255j804506j517449j267248
60970G803720j052128q67294p14593n92423m91430m05075l34832k81597k40360
60961B823988k06756j81281j63457j48436j32969j19030j08201r7784q5677p4075
60951A506322o4835n5856m5653l7307l3990l3941l3543l2271l1286k9878k6927
60940A080835k3542k1097j8668j5190j2140j1210j1277j0342q727p779p168n993
60928I27702m950m860m611k897o16P75J828L784O133P729R010J0889J2716J3520
60914I76152J3944J4847J5296J4189J2537J1765J0997Q512M844J847m26l334o800
60901A074370r455j1275j3552j6371j8331j8903j9041j9330j9295j8633j7650
$$ y = [24005694, 21877601, 19392558, 16866687, 14498178, 12392923, 10588417, 9070968, 7803720, 6751592, 5884298, 5169705, 4577282, 4085852, 3680777, 3345945, 3064348, 2823988, 2617232, 2435951, 2272494, 2124058, 1991089, 1872059, 1763858, 1666074, 1580397, 1506322, 1441487, 1385631, 1339978, 1302671, 1268681, 1234740, 1201197, 1168926, 1137640, 1107762, 1080835, 1057293, 1036196, 1017528, 1002338, 990198, 978988, 967711, 957369, 948642, 940863, 933695, 927702, 922752, 917892, 913281, 910384, 909768, 910543, 912371, 916155, 922288, 930017, 939027, 949916, 962632, 976152, 990096, 1004943, 1020239, 1034428, 1046965, 1058730, 1069727, 1078239, 1083083, 1084930, 1084504, 1081170, 1074370, 1064915, 1053640, 1040088, 1023717, 1005386, 986483, 967442, 948112, 928817, 910184, 892534]
60890H92534j6419j4903j3776j3807j4560j4992j5124j5812j7110j8096j8132
60879G19803j7286j5816j4231j3290j2984j2152j0235q501q245q688q204o867
60867E83304o049o098o189o033n999n835m929l727l273l481l354k798k769l636
60853E19134m735n507n905n810n162m447l975l196j841j110k168m074m884m411
60839D61909m124m581m910m825n202o309p082o666n430m121l205l101l906m711
60825C93736m401l134j959j148j40J013J634J789K211K857K990K681K751L145
60811D04025K935K031J364J167P20K9N1Q41J151M48k40j70n1o05j339j540j326
60794D09491r73l91R1l50j599k297j802j221j664k592k979k975l270l639l422
$$ y = [892534, 876115, 861212, 847436, 833629, 819069, 804077, 788953, 773141, 756031, 737935, 719803, 702517, 686701, 672470, 659180, 646196, 634044, 623809, 615308, 607063, 598375, 590171, 583304, 577255, 571157, 564968, 558935, 552936, 547101, 542172, 538445, 535172, 531691, 528337, 525539, 522770, 519134, 514399, 508892, 502987, 497177, 492015, 487568, 483593, 480397, 478556, 477446, 475278, 471204, 466320, 461909, 457785, 453204, 448294, 443469, 438267, 431958, 424876, 418210, 412780, 408659, 405454, 402353, 398447, 393736, 389335, 386201, 384242, 383094, 382954, 383967, 385601, 387390, 389601, 392458, 395448, 398129, 400880, 404025, 406960, 408991, 410355, 411522, 412242, 412271, 412322, 413163, 414314, 414762, 414522, 414352, 414301, 413696, 412357, 410817, 409491, 408518, 408127, 408218, 407868, 406269, 403972, 402170, 400949, 399285, 396693, 393714, 390739, 387469, 383830, 380408]
60779C80408k853k792l354l823l711l240k884k986l569m168m108l254k169j341
60765C36156o69J20J042J993K742K755J679K31k34O80J934K413K085J552J193
60750C55672J133J379J695J885K355L600N095N605M903M141M084L975K791P59
60736C99072j132k409l288m043m813n637o219o132n512n047n012m920m359l616
60722C36933l094k841k811k948k852k136j290j329k293l049k925k487k276j892
60708C02710r70o6K54L12N43N90O4n64o47m08m17n51k58M64J112J403J401J267
60690C06239J240J432J470R18L24Q79K545L576K751J161Q03K074L734M800N364
60675C39310N750N935N817N415M763M111M016M772N897O541O135M530K008n52
$$ y = [380408, 377555, 374763, 371409, 367586, 363875, 360635, 357751, 354765, 351196, 347028, 342920, 339666, 337497, 336156, 335487, 335607, 336649, 338642, 341384, 344139, 345818, 346049, 345815, 346495, 348429, 350842, 352927, 354479, 355672, 356805, 358184, 359879, 361764, 364119, 367719, 372814, 378419, 383322, 387463, 391547, 395522, 398313, 399072, 397940, 395531, 392243, 388200, 383387, 377750, 371531, 365399, 359887, 354840, 349828, 344908, 340549, 336933, 333839, 330998, 328187, 325239, 322387, 320251, 318961, 317632, 315339, 312290, 309365, 306878, 304602, 302710, 301740, 301674, 301928, 302240, 302783, 303373, 303437, 302873, 302226, 301818, 301401, 300850, 300592, 301056, 302168, 303571, 304972, 306239, 307479, 308911, 310381, 311299, 311623, 312502, 315047, 318623, 321374, 322535, 323338, 325412, 329146, 333946, 339310, 345060, 350995, 356812, 362227, 366990, 371101, 375117, 379889, 385786, 392327, 398462, 402992, 405000, 404448]
60661D04448k193k881l385l916l809k924k295k617l134k939k398k237k127j426
60647C66167n84m54p03l21N84R26M15j27k84o36j661l090m431n312n203l779j788
60630C39719o31p76j322j363j081j157j649j902j314l2J064J204O43M15R31J381
60614C34130R80J55k28j73k21l06k7L00M5m57k29P82J612J825J937K127J750N96
60596C44598m51o36k78P5N60J364J927J666R47N13L33j66r46j313r92n43m71n51
60578C45636l02K58P07Q89J073J484J995K477L142M242N543O528P166Q005R360
60563C98203J0783J1632J1756J1277J0075P950N087J870j545n015p845r105q557
60550D36566o903m976l058j073R02K561L632M140M461N119O381Q002R510J0762
$$ y = [404448, 402255, 399374, 395989, 392073, 388264, 385340, 383045, 380428, 377294, 374355, 371957, 369720, 367593, 366167, 365583, 365129, 364426, 364105, 364689, 365615, 366030, 365903, 365619, 364983, 363322, 360232, 355801, 350489, 345286, 341507, 339719, 339088, 338312, 336990, 335627, 334546, 333389, 331740, 329838, 328524, 328492, 329556, 330760, 331403, 331818, 332749, 334130, 335110, 335265, 335037, 334864, 334643, 334337, 334310, 334610, 334655, 334198, 333969, 334751, 336363, 338188, 340125, 342252, 344002, 344598, 344147, 343511, 343233, 343308, 343868, 345232, 347159, 348825, 349772, 350285, 350618, 350452, 349506, 348193, 347201, 346658, 346187, 345636, 345334, 345592, 346299, 347188, 348261, 349745, 351740, 354217, 357359, 361601, 367144, 373672, 380838, 388843, 398203, 408986, 420618, 432374, 443651, 453726, 461676, 466763, 468633, 467088, 462073, 454228, 445123, 436566, 429663, 424687, 421629, 420556, 421458, 424019, 427651, 431791, 436252, 441371, 447752, 455754, 465264, 476026]
60536D76026J2149J4113J6477J8294J8520J6925J4167J0898P185L053q44l771
60524F03192n854p676r071r261q270p220o851o707o184n490m953m228k962j619
60510E16846p99l17L63J216J933K611L478M355N211O714R398J2687J5682J8651
60496E98029K2676K7903L3008L6562L8241L8681L8647L8403L7467L5047L0997
60485I75661K6013K0553J4166O404k171j0686j9079k7567l5424m1295m4587m5660
60473H16328m4904m2532l9125l5451l1774k8075k4720k2061j9622j6691j3570
60462D97803j1299j0173r466q593p687p022o693o719o793o169m698l509l604m243
60448D01135m039l180k993l469l180j785p35r25j439j370j198j413j349n26K00
$$ y = [476026, 488175, 502288, 518765, 537059, 555579, 572504, 586671, 597569, 604754, 607807, 606963, 603192, 597338, 589662, 580591, 571330, 563060, 555840, 548989, 542282, 536098, 530608, 525655, 521427, 518465, 516846, 516047, 515730, 516093, 517309, 519242, 521853, 525331, 529686, 534897, 541611, 551009, 563696, 579378, 598029, 620705, 648608, 681616, 718178, 756419, 795100, 833747, 872150, 909617, 944664, 975661, 1001674, 1022227, 1036393, 1042797, 1040626, 1029940, 1010861, 983294, 947870, 906575, 861988, 816328, 771424, 728892, 689767, 654316, 622542, 594467, 569747, 547686, 528064, 511373, 497803, 486504, 476331, 466865, 458272, 450585, 443563, 436870, 430151, 423358, 417189, 412491, 408982, 405378, 401135, 397096, 393916, 390923, 387454, 384274, 382489, 381754, 380829, 379390, 378020, 376822, 375409, 374060, 373534, 373734]
60433C73734P2j60L75R15J89j454k533k586k365k196j563l74N94P37K82k50m83
60416C62934r3R53K031K327J798J156Q70P24M06M4m1K32O34Q51Q01Q35J447K595
60398C80504L593L878L559K940K004Q44J45N56J743K701K972K939L002L011K697
60383D17088K126J522J017P40Q83J459K152K593K659K488K374K674L523M526M951
60368D52775M451L479K745K366J859J006K71J37L62L88K53M86J136J617J732K113
60352D77176L151M150M258L867M340O371R234J1543J2248J1083Q705O369M850
60339E67345L646J664j348m524o904q133q290p681o828o100n314m152k885k160
60325E08336k194k762l740m968n791n662n120n160n583n096l198r85L52Q76J282
$$ y = [373734, 373806, 373646, 374021, 374936, 375125, 373671, 371138, 368552, 366187, 363991, 362428, 362054, 362648, 363385, 363667, 363417, 362934, 362841, 363794, 365825, 368152, 369950, 371106, 371976, 372700, 373106, 373150, 373109, 373341, 373975, 374826, 375627, 376462, 377909, 380504, 384097, 387975, 391534, 394474, 396478, 397322, 397467, 398023, 399766, 402467, 405439, 408378, 411380, 414391, 417088, 419214, 420736, 421753, 422493, 423376, 424835, 426987, 429580, 432239, 434727, 437101, 439775, 443298, 447824, 452775, 457226, 460705, 463450, 465816, 467675, 468681, 468952, 469089, 469451, 469839, 470092, 470578, 471714, 473331, 475063, 477176, 480327, 484477, 488735, 492602, 496942, 503313, 512547, 524090, 536338, 547421, 556126, 562495, 567345, 570991, 572655, 571307, 566783, 559879, 551746, 543456, 535775, 528947, 522847, 517533, 513381, 510496, 508336, 506142, 503380, 499640, 494672, 488881, 483219, 478099, 472939, 467356, 462260, 459062, 458077, 458429, 459305, 460587]
60310D60587J813K425L314M626O137P644R373J1709J4946J9154K3637K6468K5755
60297F17588K1710J6441J1243N180k861j1792j9085k3318k4869k4598k2915k0076
60285E22648j6492j2662r182o613m986l732k526j716j571j579j177o76p85j485
60271D57466k066k040j529r03n99j026k123l228l797l979m102m000l420k673k205
60256D19776j821j087l34m51j636k939l232k285p67M45R28Q60O72N56M39L82N83
60239D10089R75J243J327J440J531J314R65J025J373J189M01J92J296K632K665
60224D29657J538P10Q68J286J250R59Q83J009J115J232J584K331L414M469M964
60209D57269M781M465M608N190N767O071O058N750N433N602O262O655O255N696
$$ y = [460587, 462400, 464825, 468139, 472765, 478902, 486546, 495919, 507628, 522574, 541728, 565365, 591833, 617588, 639298, 655739, 666982, 672162, 669301, 657509, 638424, 615106, 590237, 565639, 542724, 522648, 506156, 493494, 484312, 477699, 472713, 468981, 466455, 464739, 463168, 461589, 460412, 459736, 458951, 457466, 455400, 453360, 451831, 450928, 450329, 449303, 447180, 443952, 440155, 436176, 432074, 428074, 424654, 421981, 419776, 417955, 416868, 416534, 416083, 414447, 411508, 408276, 405991, 405224, 405669, 406597, 407457, 408129, 408685, 409124, 409506, 410089, 411064, 412307, 413634, 415074, 416605, 417919, 418884, 419909, 421282, 422471, 422872, 423064, 424360, 426992, 429657, 431195, 431905, 432773, 434059, 435309, 436268, 437151, 438160, 439275, 440507, 442091, 444422, 447836, 452305, 457269, 462050, 466515, 471123, 476313, 482080, 488151, 494209, 499959, 505392, 510994, 517256, 523911, 530166, 535862]
60195E35862N942O823P118O088M272K729K018J968K040J781J171N02q6o92j259
60180E76277j546j706k284l374m400n107n970p044p302o060m288l469l626l713
60166E16388l483l630m216m348l676k967k843k889k503j795j151n71K4M17L74
60151D83131O0j91k30p0J64K96L65Q07J874K972L115K181J154R79J662K625L484
60134E04378M180M706N025N144N160N256N589O043O192N730M729L442K084J049
60120E68707P50R65Q97L65L02J371K689K946K329K221L144M188M507M234L651
60105F03266K622J301M48M47O46L02m41r84j244j617k265k988l597m047m314m343
60089E83192m071l392k304j160m94m67o63o05k44Q7R6j37j89K81J017J288O65
$$ y = [535862, 541804, 548627, 555745, 561833, 566105, 568834, 570852, 572820, 574860, 576641, 577812, 578314, 578228, 577536, 576277, 574731, 573025, 570741, 567367, 562967, 557860, 551890, 544846, 537544, 531484, 527196, 523727, 520101, 516388, 512905, 509275, 505059, 500711, 497035, 494068, 491225, 488336, 485833, 484038, 482887, 482316, 482340, 482757, 483131, 483191, 483000, 482770, 482700, 482864, 483160, 483525, 484332, 486206, 489178, 492293, 494474, 495628, 496607, 498269, 500894, 504378, 508558, 513264, 518289, 523433, 528593, 533849, 539438, 545481, 551673, 557403, 562132, 565574, 567658, 568707, 569457, 570422, 571319, 571684, 571986, 573357, 576046, 578992, 581321, 583542, 586686, 590874, 595381, 599615, 603266, 605888, 607189, 607637, 608084, 608730, 609032, 608591, 607607, 606363, 604746, 602481, 599493, 595896, 591849, 587535, 583192, 579121, 575729, 573425, 572265, 571771, 571304, 570641, 570036, 569792, 569879, 569975, 569838, 569649, 569930, 570947, 572235, 572900]
60072E72900m86j565k440l321m237n115o113p371q557r175r155q752q089p268
60058D91256o649o418o142n345m319l709l534l284k822k371j764o11P86J514J297
60043D47885Q73R86J578K220K703L047L403M048N020N785N860N630N824O254N932
60028E07048M567K959J761P12n71j866k896l836m776n325n251m934m713m370l790
60013D74719l579m275n398n932n629n161m963m617l612k331j844k612l727l816
59999D17223k635j284p17o11k19K79J34o25j070o66J47P51J048J208J391J895
59983D16249K938M118M627M211L412K799K456K304K299K190J626O59l06j068j653
59968D46861j879j557j125j261j843k025j464o15K69J477K875L582L204K565K617
$$ y = [572900, 572414, 570849, 568409, 565088, 560851, 555736, 549623, 542252, 533695, 524520, 515365, 506613, 498524, 491256, 484607, 478189, 472047, 466702, 462383, 458674, 455140, 451856, 449034, 446663, 444899, 444288, 445074, 446588, 447885, 448758, 449744, 451322, 453542, 456245, 459292, 462695, 466743, 471763, 477548, 483408, 489038, 494862, 501116, 507048, 511615, 514574, 516335, 517047, 516476, 514610, 511714, 507878, 503102, 497777, 492526, 487592, 482879, 478509, 474719, 471140, 466865, 461467, 455535, 449906, 444745, 439782, 435165, 431553, 429222, 427378, 424766, 421039, 417223, 414588, 413304, 412587, 411976, 411757, 412036, 412170, 411545, 410475, 409809, 409956, 410707, 411755, 412963, 414354, 416249, 419187, 423305, 427932, 432143, 435555, 438354, 440810, 443114, 445413, 447603, 449229, 449888, 449582, 448514, 446861, 444982, 443425, 442300, 441039, 439196, 437171, 435707, 435092, 435361, 436838, 439713, 443295, 446499, 449064, 451681]
59953D51681L212L505L084K142R26l50j366j900k015j848j439r20n43l57j87K6
59937D53651K06M98J084J632J508O90j05l41j42K12O65J112J386J650K201K830
59921D68737L042K963L249M003M586M782N196O171P162P580P493P124O358N166
59907E43612L832K368N45j213j828r95J39K90o57k071l495m551m708l865k662
59892E24741j674q33k3M91O71J051J930K891L637M487N494N901N267M427M520
59877E62978N549O619P138P083O611N997N498M817L343J302j81p42j501l311n237
59862F05963n871n413n145n454n601n196m599m000l176k181j387p54J56J422K636
59847E61400L600M601N991P715R087Q898O333K159j568l413l623k889j137J589
$$ y = [451681, 454893, 458398, 461482, 463624, 464550, 464200, 462834, 460934, 458919, 457071, 455632, 454712, 454169, 453812, 453625, 453651, 453857, 454355, 455439, 457071, 458579, 459269, 459164, 458823, 458681, 458893, 459558, 460670, 462056, 463706, 465907, 468737, 471779, 474742, 477991, 481994, 486580, 491362, 496558, 502729, 509891, 517471, 524964, 532088, 538446, 543612, 547444, 549812, 550357, 549144, 547316, 546321, 546460, 546750, 546093, 544022, 540527, 535976, 531268, 527403, 524741, 523067, 522234, 522211, 522702, 523373, 524424, 526354, 529245, 532882, 537369, 542863, 548764, 554031, 558458, 562978, 568527, 575146, 582284, 589367, 595978, 601975, 607473, 612290, 615633, 616935, 616754, 616012, 614511, 611200, 605963, 600092, 594679, 589534, 584080, 578479, 573283, 568684, 564684, 561508, 559327, 557940, 557186, 557342, 558764, 561400, 565000, 569601, 575592, 583307, 592394, 601292, 607625, 609784, 608216, 604803, 601180, 598291, 597154, 598743]
59833E98743L880L935J464k252n856q522r660r134p723o420n377m274l331l067
59819E42406l360l595l561l327k641j438n52q67j901k307j721j051j006j447k169
59804E11463l207m178m295l494k688k652l191l611l424k548j391p84j184j948
59790D72868j980j059J30J106J887K284J917J035M97O01O81J68o26j064r94o75
59774D76776m06l88o23p09j54J020K219K885K872K305J466P62M36L97N37J002
59758D90397J828K602K923K906K811K555K130J996K530L387M106M842N862O748
59744E37623P016P046P448P907P709P112O949P091O498M874L088J818R09K02r1
59729F13199k00q55k111k958k610j516p11p72j592k604k974k308j367j440k796
$$ y = [598743, 602623, 606558, 608022, 605770, 599914, 591392, 581732, 572598, 564875, 558455, 553078, 548804, 545473, 542406, 539046, 535451, 531890, 528563, 525922, 524484, 523932, 523065, 521164, 518857, 517136, 516085, 515079, 513632, 511463, 508256, 504078, 499783, 496289, 493601, 490949, 487758, 484147, 480723, 478175, 476784, 476000, 474816, 472868, 470888, 469829, 469959, 471065, 472952, 475236, 477153, 478188, 478685, 479286, 479967, 480135, 479509, 478445, 477451, 476776, 476370, 475982, 475359, 474650, 474496, 475516, 477735, 480620, 483492, 485797, 487263, 488025, 488461, 488858, 489395, 490397, 492225, 494827, 497750, 500656, 503467, 506022, 508152, 510148, 512678, 516065, 520171, 525013, 530875, 537623, 544639, 551685, 559133, 567040, 574749, 581861, 588810, 595901, 602399, 607273, 610361, 612179, 613088, 613290, 613199, 612999, 612144, 610033, 607075, 604465, 602949, 602238, 601466, 599874, 597270, 594296, 591988, 590621, 589181, 586385]
59714E86385m331m905m370l231k010j192j013j114r39n54m74o55m87J33O19P66
59698E62628J138K076L068L511L419L134K919L090L791M456M210L043J849J141
59684F03473N40k34q07r39r59r66n37K41L46p65k131k567k341k652l807m922n242
59667E75731m912m428m020l764l758l897l814l204k204j271p10l92kN14R65J404
59651E42238K191L355M322M629M551M513M301L502K356J435P17l05j685l037m258
59636E68825n495o388o303n338m378m019m127m451m815m760l822k315j111n83
59622E10920n19r76k199l649m186l499k506k092k294k870l743m543m690m189l620
59607D65345l153k453j592j063p28P6J186J551R20L15L91N08N9m80m94j68K25
$$ y = [586385, 582054, 577149, 572779, 569548, 567538, 566346, 565333, 564219, 563280, 562726, 562252, 561597, 561110, 561243, 561862, 562628, 563766, 565842, 568910, 572421, 575840, 578974, 581893, 584983, 588774, 593230, 597440, 600483, 602332, 603473, 604013, 603779, 602972, 602033, 601074, 600108, 599571, 599812, 600158, 599393, 597262, 594695, 592354, 589702, 585895, 580973, 575731, 570819, 566391, 562371, 558607, 554849, 550952, 547138, 543934, 541730, 540459, 539749, 539357, 539355, 539869, 540834, 542238, 544429, 547784, 552106, 556735, 561286, 565799, 570100, 573602, 575958, 577393, 578110, 577805, 576120, 573083, 568825, 563330, 556942, 550639, 545301, 540923, 536904, 532777, 528326, 523511, 518751, 514929, 512614, 511503, 510920, 510401, 509425, 507226, 503577, 499391, 495892, 493386, 491294, 489000, 486130, 482387, 477844, 473154, 468965, 465345, 462192, 459739, 458147, 457084, 456356, 456432, 457618, 459169, 460089, 460404, 460795, 461303, 461362, 460882, 460388, 460220, 460445]
59590D60445Q80J643J736J032N16O93O92j32q76n86N4j59r61j202q14p92j501
59573D60668k343k902l331l668l686l367k884k319j888j996k465k368j356m77
59559D25618p23j512j597r05k95K2N03J057J133R16J257K277L129L157K534J777
59543D38348J450K100L645N068N694O314P949J0051J1621J3797J8842K5747K8957
59530E79583K3441J0250m240j4095j7782j7217j4844j2022r095o007k918m26J017
59517E15645J828K937M505N459M740K715P57m10j361k779m344n333n741o089o415
59502E06114o319n948n956o325o147m981l592k855k621k304j931j810j727j308
59488D52290q28q71j303j384p98P2Q83J661K346K657K590K568K903L445L897M231
$$ y = [460445, 461325, 462968, 464704, 465736, 466252, 466945, 467637, 467505, 466629, 466043, 466097, 465938, 464977, 463775, 462961, 462169, 460668, 458325, 455423, 452092, 448424, 444738, 441371, 438487, 436168, 434280, 432284, 429819, 427451, 426095, 425618, 424895, 423383, 421786, 420881, 420586, 420608, 421111, 422168, 423301, 424217, 425474, 427751, 430880, 434037, 436571, 438348, 439798, 441898, 445543, 450611, 456305, 462619, 470568, 480619, 492240, 506037, 524879, 550626, 579583, 603024, 613274, 609034, 594939, 577157, 559940, 545096, 533074, 523979, 517972, 515054, 514628, 515645, 517473, 520410, 524915, 530374, 535114, 537829, 538586, 538176, 536815, 534036, 529692, 524359, 518618, 512529, 506114, 499795, 493847, 487891, 481566, 475419, 470438, 466846, 463991, 461370, 459066, 457135, 455325, 453598, 452290, 451462, 450591, 449288, 447904, 447106, 447178, 448061, 449722, 452068, 454725, 457315, 459883, 462786, 466231, 470128, 474359]
59472D74359M643N214N666N513M570L361K687K663K484J429k13j488j813j409
59458E07666r21q51j118j024N7J812L215L811M275N419P114Q643R556R746R148
59443E66548P979O795N701L889O79l205o169p435p588p534p579p507p032o064
59429E31478m933m260m226m170l431k277j401o63P70K979N001O187P041Q208R496
59414E45799J0624J2167J4649J7317J9367K2173K8081L5763L8704L0902J3855
59403G89401m197j6118k1014k1581j9402j4723q388j135P626J7201K2619J8000
59391G48289L684j2754k3807k8095k8382k6552k2884j8340j4621j2227j0282q126
59379E45903n860l720k052j421j728j713m23J427K509K664K572K375J938J877
$$ y = [474359, 479002, 484216, 489882, 495395, 499965, 503326, 506013, 508676, 511160, 512589, 512376, 510888, 509075, 507666, 506745, 505894, 504776, 503752, 503809, 505621, 508836, 512647, 516922, 522341, 529455, 538098, 547654, 557400, 566548, 574527, 581322, 587023, 590912, 591591, 588386, 582217, 574782, 567194, 559660, 552081, 544574, 537542, 531478, 526545, 522285, 518059, 513889, 510458, 508181, 506780, 506117, 506887, 509866, 514867, 521054, 528095, 536303, 545799, 556423, 568590, 583239, 600556, 619923, 642096, 670177, 705940, 744644, 775546, 789401, 785204, 769086, 748072, 726491, 707089, 692366, 683978, 682843, 690469, 707670, 730289, 748289, 751973, 739219, 715412, 687317, 658935, 632383, 609499, 591159, 576538, 564311, 554029, 545903, 540043, 536323, 534271, 532850, 531122, 529409, 528986, 530413, 532922, 535586, 538158, 540533, 542471, 544348]
59365E44348K879M289M748M074L419L627M567N798O861P103O353N644O158P534
59351F17402Q322Q104P959Q796J0223J1366J1881J1962J1984J2344J3076J3608
59339G47027J3422J2769J2130J1345R985Q341P057N976M253J578j499m321o555
59326H21508p999q768r492j0566j1476j1601j1274j1118j0842r817q532q056q268
59313F93699p966o770n536m674l564j999q42n64k70R92K894M522N720O919Q333
59298F90894J0087J2749J6688K0773K2261J8514R154l158j4239k1132k3658k3479
59286G15454k2105k0197j8094j6058j3978j1603r172p269o018m961l753k504j419
59273E78323n70O8P36J905L727N676P168Q252R209R878R973R671R171Q110O192
$$ y = [544348, 547227, 551516, 556264, 560338, 563757, 567384, 571951, 577749, 584610, 591713, 598066, 603710, 609868, 617402, 625724, 633828, 641787, 650583, 660806, 672172, 684053, 696015, 707999, 720343, 733419, 747027, 760449, 773218, 785348, 796693, 806678, 815019, 822076, 828052, 832305, 833883, 832384, 828063, 821508, 813509, 804741, 795249, 784683, 773207, 761606, 750332, 739214, 728372, 718555, 710023, 701967, 693699, 685733, 678963, 673427, 668753, 665189, 663190, 662348, 661784, 661514, 662506, 665400, 669922, 675642, 682561, 690894, 700981, 713730, 730418, 751191, 773452, 791966, 801120, 797962, 783723, 762591, 738933, 715454, 693349, 673152, 655058, 639000, 625022, 613419, 604247, 596978, 590960, 585999, 582246, 579742, 578323, 577753, 577821, 578557, 580462, 584189, 589865, 597033, 605285, 614494, 624372, 634345, 644016, 653187, 661297, 667489]
59258F67489M023K417J132o82l024n016o217p014p762q400q876r046q320o358
59244F04346l994k527k114j873j379j021q85m92J62M90M55P55J572K124J954J714
59228E99287K093K741K796K063J142O51N91L40p06k302l457l653l537l820m105
59213E90124l534k191r87n06p68j652k659k748j486Q3Q22J087J738K309J800P78
59197E82210P43J587J721P52j7l1l29j318j723p44M66O18K15M95J503K342K474
59180E90964J930R65J84K91J126J772J945K257K857L030K658K679L415L801L231
59165F23105K825L745N274N897N464N013N058N256N388N527N439M694L364K005
59151F88054R76J66p14j885l316m628n430n781n969n955n640n455n916o686o977
$$ y = [667489, 671512, 673929, 675061, 674379, 671355, 666339, 660122, 653108, 645346, 636946, 628070, 619024, 610704, 604346, 600352, 597825, 595711, 593838, 592459, 591438, 590553, 590061, 590223, 590713, 591168, 591923, 593495, 595619, 597573, 599287, 601380, 604121, 606917, 608980, 610122, 610773, 611364, 611704, 610998, 608696, 605239, 601586, 598049, 594229, 590124, 586590, 584399, 583412, 582906, 582138, 580486, 577827, 575079, 573593, 573676, 574498, 575585, 577323, 579632, 581432, 582210, 582953, 584540, 586261, 587013, 586996, 586965, 586636, 585318, 583595, 582851, 583317, 583935, 584150, 584645, 586148, 588490, 590964, 592894, 593859, 594043, 594334, 595460, 597232, 599177, 601434, 604291, 607321, 609979, 612658, 616073, 619874, 623105, 625930, 629675, 634949, 640846, 646310, 651323, 656381, 661637, 667025, 672552, 677991, 682685, 686049, 688054, 689030, 689196, 688482, 686597, 683281, 678653, 673223, 667442, 661473, 655518, 649878, 644423, 638507, 631821, 624844]
59136F24844o799o809o967o561n663n276n743o231o090n568m902l908k866k449
59122E49012k355j329R06L065M167M725N417N987O189O510P081P106O245N427
59108F08153N349N376M805M157M232M812N249N438N418M939M178L889M120L893
59094F74008K754J541Q35N2j136j897j772j656k074j967n52R25Q92k79j287k170
59078F66217l827o082p910q996r625r583q612p413o844o577n849m908m424m105
59064E71462l320k538k728l617m008l533k887k585k608k961l547l797l346k691
59050E27296k339j922j079l53k73l41j38m06j669k691j998k33P35N02K04L10K33
59033E15838p2J10P55J047R15J237K325L500M338N099N885O460P038Q158R763
$$ y = [624844, 618045, 611236, 604269, 597708, 592045, 586769, 581026, 574795, 568705, 563137, 558235, 554327, 551461, 549012, 546657, 545328, 546234, 549299, 553466, 558191, 563608, 569595, 575784, 582294, 589375, 596481, 602726, 608153, 613502, 618878, 623683, 627840, 632072, 636884, 642133, 647571, 652989, 657928, 662106, 665995, 670115, 674008, 676762, 678303, 679138, 679190, 678054, 676157, 674385, 672729, 670655, 668688, 668136, 669061, 669953, 669674, 668387, 666217, 662390, 656308, 648398, 639402, 629777, 620194, 611582, 604169, 597325, 590748, 584899, 579991, 575567, 571462, 568142, 565604, 562876, 559259, 555251, 551718, 548831, 546246, 543638, 540677, 537130, 533333, 529987, 527296, 524957, 523035, 521956, 521603, 521330, 520989, 520851, 520445, 518776, 516085, 514087, 513854, 514589, 515091, 515295, 515605, 515838, 515766, 515876, 516631, 517678, 518593, 519830, 522155, 525655, 529993, 535092, 540977, 547437, 554475, 562633, 572396]
59018E72396J1349J2919J4714J6182J6353J5194J3503J1504Q742N293J960q44
59006F99265l355n561o936p160o310m509k218n68l94j053j107J9J841L761N202
58991F70917N290L690J498J28l74q02j110p49l20j089k872m040l832l210l025
58976F60100k746j599J92J961L553N172O874Q556J0005J0929J1376J1895J2726
58963G38994J3186J2650J1702J1389J1594J1260R914Q018O020M008K092J77k306
58950H38698n450q222r770j0804j2370j3941j4351j4032j4424j5391j5235j3434
58938F91274j1363j0047q986p675o584n932n031l574k295j652j112l46J50K19
58924F27046O05J621K432K389K052K068K067J477O04%m89j198j766j655j112q26
$$ y = [572396, 583745, 596664, 611378, 627560, 643913, 659107, 672610, 684114, 692856, 698149, 700109, 699265, 695910, 690349, 683413, 676253, 669943, 665434, 663216, 662648, 662254, 661201, 660094, 660113, 661954, 665715, 670917, 676207, 679897, 681395, 681523, 681149, 680347, 679237, 678488, 678168, 677079, 674207, 670167, 666335, 663125, 660100, 657354, 655755, 655947, 657908, 661461, 666633, 673507, 682063, 692068, 702997, 714373, 726268, 738994, 752180, 764830, 776532, 787921, 799515, 810775, 820689, 828707, 834727, 838735, 840827, 841004, 838698, 833248, 825026, 815256, 804452, 792082, 778141, 763790, 749758, 735334, 719943, 704708, 691274, 679911, 669864, 660878, 653203, 646619, 640687, 635656, 632082, 629787, 628135, 627023, 626677, 626827, 627046, 627651, 629272, 631704, 634093, 636145, 638213, 640280, 641757, 642361, 642361, 641872, 640674, 638908, 637253, 636141, 635315]
58908F35315q86p65j40P09J403J950K774M246O291Q496J0585J2479J3803J3993
58894G10253J3212J2451J2183J1633J0144Q587Q374R675J1566J3480J5349J6785
58882H53692J7312J7167J6684J5262J2242Q486N727M374L251J444q10l058n160
58869I46613o854p910q782j0114j1577j2242j1889j1016r823q392p453p639q206
58856H24716p941p122p100q123r088r401r432r180q159o760o129o426o644o312
58842G16899n891n464m644l963m604o402p791q073q156q652q954q671q362q265
58828F19007p774o789o031n562m490k680j232n92K06J701K997L399L613M381N235
58813F05389N523N478N471N265M779M482M436M027L205K780K848K282M84j620
$$ y = [635315, 634429, 633664, 633524, 634233, 635636, 637586, 640360, 644606, 650897, 659393, 669978, 682457, 696260, 710253, 723465, 735916, 748099, 759732, 769876, 778463, 786837, 796512, 808078, 821558, 836907, 853692, 871004, 888171, 904855, 920117, 932359, 940845, 946572, 950946, 954197, 955641, 954831, 951773, 946613, 939759, 931849, 923067, 912953, 901376, 889134, 877245, 866229, 856406, 848014, 840561, 832922, 824716, 816775, 809653, 802553, 794430, 785342, 775941, 766509, 757329, 749170, 742410, 736281, 729855, 723211, 716899, 711008, 705544, 700900, 696937, 692333, 685931, 678140, 670067, 661911, 653259, 644305, 635634, 627272, 619007, 611233, 604444, 598413, 592851, 588361, 585681, 584449, 583857, 584063, 585764, 588761, 592160, 595773, 600154, 605389, 610912, 616390, 621861, 627126, 631905, 636387, 640823, 644850, 648055, 650835, 653683, 655965, 656449, 654829]
58799F54829l085m144n146n570n089m582n044o301p477q014p706o651n516m969
58785E75535m564l286j303J65R43K180M144N603O064O753Q371R688R630R038Q795
58770F37756P736M265q66n208p515q546r315r949j0140r751q939q141p792p729
58756E55866p294o227m850l294j334P78K258K788K763K339J348K62K2O28J024
58741E47077P05K80J85J77L54J334K958M148M501M715N121N154M695M408M381
58726E90193L903K947K394K353J936J089Q09J179J036K23R5J137K095K380L190
58711F16959N143O868P186O889O980O936O020M662L273J330j169l062m046n535
58697F58434q224j0714j1868j2613j3808j4407j3515j2413j2422j2490j1007q533
$$ y = [654829, 651744, 647600, 642454, 636884, 631795, 627213, 622169, 615868, 608391, 600377, 592671, 586020, 580504, 575535, 570971, 567685, 566382, 566547, 567490, 569670, 573814, 579417, 585481, 592234, 600605, 610293, 619923, 628961, 637756, 645492, 649757, 648891, 643683, 636168, 627622, 618307, 608358, 598218, 588467, 579528, 571387, 563595, 555866, 548572, 542345, 537495, 534201, 532867, 533645, 535903, 538691, 541454, 543793, 545141, 545403, 545425, 546053, 547077, 547782, 548062, 548247, 548424, 548778, 550112, 553070, 557218, 561719, 566434, 571555, 576709, 581404, 585812, 590193, 594096, 597043, 599437, 601790, 603726, 604815, 605624, 606803, 607839, 608062, 608157, 609294, 611389, 613769, 616959, 622102, 628970, 636156, 643045, 650025, 656961, 662981, 667643, 670916, 672246, 671077, 668015, 663969, 658434, 650210, 639496, 627628, 615015, 601207, 586800, 573285, 560872, 548450, 535960, 524953, 516420]
58685E16420o683n539m348l501l682m105l668k971l209l898l612k317j109l40
58671D67438L44Q30R43J345K606M129N320O806R140J1472J2893J3911J4899J4489
58657E66565J1335O374J483k957p279j0464j1180j0164r301q935q021o487n398
58644E05571n093m886m491m189l891l426l341m066m860m814m228l708k750p64
58630D51064J359K280K199K262K613K529J935J375Q72J68m80p56q80q27Q9J860
58614D67662L137L146L014L937N307N967O034O010N464M191L281L430L459K311
58600E26350J074J242K228K571K318K262K067J108Q2k21n25j567k300j628n75
58585E34486n51o90P30L363N481O603P194O997N917N399O595Q218Q543Q225Q732
$$ y = [516420, 509737, 504198, 499850, 496349, 492667, 488562, 484894, 481923, 478714, 474816, 471204, 468887, 467778, 467438, 467782, 468612, 469555, 470900, 473506, 477635, 482955, 489761, 498901, 510373, 523266, 537177, 552076, 566565, 577900, 584274, 585757, 582800, 575521, 565057, 553877, 543713, 534412, 525477, 517456, 510969, 505571, 500478, 495592, 491101, 486912, 483021, 479595, 476254, 472188, 467328, 462514, 458286, 454578, 451828, 451064, 452423, 454703, 456902, 459164, 461777, 464306, 466241, 467616, 468488, 468656, 468176, 467420, 466540, 465713, 465802, 467662, 470799, 473945, 476959, 480896, 486203, 492170, 498204, 504214, 509678, 513869, 517150, 520580, 524039, 526350, 527424, 528666, 530894, 533465, 535783, 538045, 540112, 541220, 541302, 541081, 540556, 538989, 536689, 535061, 534486, 533935, 533245, 533975, 537338, 542819, 549422, 556616, 563613, 569530, 574929, 581524, 589742, 598285, 606510, 615242]
58570F15242R338Q532P101O984P917Q273Q322R693J2233J4390J6124J8548K1204
58557G63901K2613K3168K4522K6349K6487K4241K0885J7093J2435P319K966m44
58545I71535l399n318n419m753m976n775n923o041p614j0117j2032j3992j7639
58532H68537k1936k3911k2974k1345k0291j8991j7093j5335j3486j0588p372n657
58520F69558n293m426k692j471j064n11n4q73k362k672j907j847k566k378j147
58505F38295n59r05p11J69J44j082j942j858j810j948j349l32k22p07k29J026
58489F25980J442J132J639K721K725K124L149N722P333P351P824R501J0633J0532
58475F99808J0894J2623J4458J5582J6607J7237J5955J2661Q863M895k4m856p243
$$ y = [615242, 624580, 633112, 640213, 647197, 655114, 663387, 671709, 681402, 693635, 708025, 724149, 742697, 763901, 786514, 809682, 834204, 860553, 887040, 911281, 932166, 949259, 961694, 969013, 971979, 971535, 968136, 962818, 957399, 952646, 947670, 941895, 935972, 929931, 922317, 912200, 900168, 886176, 868537, 846601, 822690, 799716, 778371, 758080, 739089, 721996, 706661, 693175, 682587, 675215, 669558, 664265, 659839, 657147, 655676, 654612, 654101, 654047, 653174, 650812, 648140, 646233, 644386, 641820, 639442, 638295, 637736, 636831, 636120, 636289, 636433, 635351, 633409, 631551, 629741, 627793, 626444, 626112, 625890, 625183, 624954, 625980, 627422, 628554, 630193, 632914, 635639, 637763, 640912, 646634, 653967, 661318, 669142, 678643, 689276, 699808, 710702, 723325, 737783, 753365, 769972, 787209, 803164, 815825, 824688, 829583, 829559, 824703, 817460]
58462H17460p312p612q838r065p603o022m810k649L53K393L552N946R568J1828
58448G97189J1981J2144J2970J2277R153N504K289j869o968j0372j0969j0884
58436H22445j1539j1487r751p830o748n440l474k171j596J00L051M867M766N028
58422G80221O912Q704R241R767J0806J0742R040P458O565M547Q97k297m025n705
58408H52873p601p828o272n514o287o135m184k981l766m184k802j753k574l320
58394G87672k185l33J010K672M751N381M229L588M209L958K177J294K320L073
58380H23816K663L205N105N435L278J951L352M821M258L668M800N887N663O174
58366H84076Q467R945R007Q105R207J0515J0488J0817J2527J3579J3140J3681
$$ y = [817460, 810148, 802536, 793698, 784633, 777030, 771008, 766198, 763549, 763902, 766295, 769847, 775793, 785361, 797189, 809170, 821314, 834284, 846561, 855714, 861218, 863507, 861638, 854670, 844298, 833329, 822445, 810906, 799419, 789668, 781838, 775090, 769650, 766176, 764005, 762409, 762509, 765560, 770427, 775193, 780221, 787133, 795837, 805078, 814845, 825651, 836393, 845433, 852891, 859456, 864003, 864900, 862603, 858578, 852873, 845272, 837444, 831172, 825658, 819371, 813236, 809052, 806071, 802305, 798121, 795319, 793566, 790992, 787672, 785487, 785154, 786164, 788836, 793587, 798968, 803197, 806785, 810994, 814952, 817129, 818423, 820743, 823816, 826479, 829684, 834789, 840224, 843502, 845453, 848805, 853626, 857884, 861552, 866352, 872239, 877902, 884076, 892543, 902488, 911495, 919600, 928807, 939322, 949810, 960627, 973154, 986733, 999873, 1013554]
58354A013554J6057J7212J5587J3865J3490J1678P106L228K508K501J233R81L105
58341A122105M560L596L547O748R998J0318R967J1440J2732J2061J2017J4502
58329A233591J6689J6431J6387J8409J9430J7442J5799J6767J6789J3210R692
58318A410636R525R748P475N882P812R663P950O055P849J0483J0196R506J1746
58305A524526J4148J3446J2716J5511J8685J8289J7039J8645K0425J9016J7660
58294A710106K0092K2942K2137K0948K3498K6206K4385K1563K3244K6966K7622
58283A969709K7241L0147L3787L3794L2943L5660L8910L8076L6419L8900M2185
58272B357771M1037L8948M1907M7033M8255M7841N1228N5792N6156N5413N9489
$$ y = [1013554, 1029611, 1046823, 1062410, 1076275, 1089765, 1101443, 1108549, 1111777, 1114285, 1116786, 1118019, 1119000, 1122105, 1126665, 1130261, 1133808, 1140556, 1150554, 1160872, 1170839, 1182279, 1195011, 1207072, 1219089, 1233591, 1250280, 1266711, 1283098, 1301507, 1320937, 1338379, 1354178, 1370945, 1387734, 1400944, 1410636, 1420161, 1429909, 1437384, 1443266, 1451078, 1460741, 1468691, 1474746, 1482595, 1493078, 1503274, 1512780, 1524526, 1538674, 1552120, 1564836, 1580347, 1599032, 1617321, 1634360, 1653005, 1673430, 1692446, 1710106, 1730198, 1753140, 1775277, 1796225, 1819723, 1845929, 1870314, 1891877, 1915121, 1942087, 1969709, 1996950, 2027097, 2060884, 2094678, 2127621, 2163281, 2202191, 2240267, 2276686, 2315586, 2357771, 2398808, 2437756, 2479663, 2526696, 2574951, 2622792, 2674020, 2729812, 2785968, 2841381, 2900870]
58261B900870O5502O7335O7448P1363P6081P6178P5660Q0973Q7972Q8997Q7045
58250C745424Q9501R3728R3106R1353R6025J03594J06154J07180J14925J26029
58240D767019J31886J35501J45340J58294J65949J71797J84426J99877K09203
58231F269292K17035K33210K52825K65144K75378K95811L22233L42103L59286
58222H832317L86463M19891M47240M73701N13490N62151O05726O50413P13034
58213A3604426P89174Q62872R40714J042065J163261J288620J428991J609393
58205B2729516J827218K067065K347849K705946L141486L637564M223962M959506
58197D7640112N861063O922645Q196235R771444J1689503J3984204J6797904K0321600
$$ y = [2900870, 2966372, 3033707, 3101155, 3172518, 3248599, 3324777, 3400437, 3481410, 3569382, 3658379, 3745424, 3834925, 3928653, 4021759, 4113112, 4209137, 4312731, 4418885, 4526065, 4640990, 4767019, 4898905, 5034406, 5179746, 5338040, 5503989, 5675786, 5860212, 6060089, 6269292, 6486327, 6719537, 6972362, 7237506, 7512884, 7808695, 8130928, 8473031, 8832317, 9218780, 9638671, 10085911, 10559612, 11073102, 11635253, 12240979, 12891392, 13604426, 14393600, 15256472, 16197186, 17239251, 18402512, 19691132, 21120123, 22729516, 24556734, 26623799, 28971648, 31677594, 34819080, 38456644, 42680606, 47640112, 53501175, 60423820, 68620055, 78391499, 90081002, 104065206, 120863110, 141184710]
58189A41184710K4619958K9661107L5404288M1340222M5608292M5020884L6919222
58182C99758683K1616329K940666j3968564k5698685l1871380l4136894l4341770
58175B84298385l3480305l1774835k9247302k6106591k2738022j9486523j6526009
58168A04938798j3911309j1671193r811078q281194p008997n954030n097008m397700
58160C8806289l806005l300877k880816k527853k216117j944628j726031j550450
58152A8853512j392860j249119j132966j042330r58673q76380q04705p42816o79138
58143I974525o14108n59225n14383m68420m20840l81815l52176l23847k98288
58134F041423k84153k77918k66500k48365k33338k22600k07607j88305j73930
$$ y = [141184710, 165804668, 195465775, 230870063, 272210285, 317818577, 362839461, 399758683, 421375012, 424315678, 410347114, 384648429, 352777049, 318640155, 284298385, 250818080, 219043245, 189795943, 163689352, 140951330, 121464807, 104938798, 91027489, 79356296, 69545218, 61264024, 54255027, 48300997, 43203989, 38806289, 35000284, 31699407, 28818591, 26290738, 24074621, 22129993, 20403962, 18853512, 17460652, 16211533, 15078567, 14036237, 13077564, 12201184, 11396479, 10653663, 9974525, 9360417, 8801192, 8286809, 7818389, 7397549, 7015734, 6663558, 6339711, 6041423, 5757270, 5479352, 5212852, 4964487, 4731149, 4508549, 4300942, 4112637, 3938707]
58125C938707j65333j54045j39459j30110j26970j21593j12012j05082j01938
58116B782165r6014q6804q1239q0063p6496o9663o5930o5835o2846n6337n2903
58105A988035n3417n1498m6189m3808m5513m5191m1407l9692m1143m0270l6135
58094A503772l4369l5992l5187l0420k7245k7643k6853k3170k0987k1731k1304
58083A198871j8852j8801k1867k3102k1097k0287k2047k2243j9729j8599j9921
58072I72326j9681j7064j6300j8261j8484j5757j4359j5648j5615j3015j1778
58061G96364j2905j2089q045n446o703q283p909q166j0291j1410j0610j0926j2820
58048F70761j2530r305p431q505q579n599k978l050l418k575k829m950o027n144
$$ y = [3938707, 3773374, 3619329, 3479870, 3349760, 3222790, 3101197, 2989185, 2884103, 2782165, 2686151, 2599347, 2518108, 2438045, 2361549, 2291886, 2225956, 2160121, 2097275, 2040938, 1988035, 1934618, 1883120, 1836931, 1793123, 1747610, 1702419, 1661012, 1621320, 1580177, 1539907, 1503772, 1469403, 1433411, 1398224, 1367804, 1340559, 1312916, 1286063, 1262893, 1241906, 1220175, 1198871, 1180019, 1161218, 1139351, 1116249, 1095152, 1074865, 1052818, 1030575, 1010846, 992247, 972326, 952645, 935581, 919281, 901020, 882536, 866779, 852420, 836772, 821157, 808142, 796364, 783459, 771370, 763325, 757879, 751176, 742893, 734984, 726818, 716527, 705117, 694507, 683581, 670761, 658231, 648926, 641495, 632990, 624411, 618812, 615834, 612784, 609366, 606791, 603962, 599012, 592985, 587841]
58034E87841n208o839o688m111l169n544p810q109r145j1816j2536r829p387p463
58020D82187p353n524m996p246q716o998m897m788m540k617j685l333m373k351
58006D12770O5q8j359j515j412j861j156J002J538p37k324p56J361J312P34J653
57990D09227K476J549O10J081Q96j465l578l198k117k530l272k902k832m068m533
57975C85344k973j883l217m737m007k460k182k105q40P1q21j792j139l19p40p60
57959C55440R29K282J575P31J642K467J142o89q82p84k307l956l568k306k190
57944C49526k299j058K84P3k85J035K700K835K872M930P596Q156P235P362Q491
57929C99453Q500O916N029L459K252J961K259J275j441l367k830j887k867m586
$$ y = [587841, 582633, 575794, 569106, 564995, 561826, 556282, 548472, 540363, 531218, 519402, 506866, 497037, 489650, 482187, 474834, 469310, 464314, 457068, 448352, 441354, 436457, 431669, 427129, 424512, 422827, 419494, 415121, 412770, 412835, 412747, 411388, 409873, 408461, 406600, 405444, 406446, 407984, 407247, 404923, 404167, 405528, 406840, 407574, 409227, 411703, 413252, 413862, 414943, 415839, 414374, 410796, 407598, 405481, 402951, 399679, 396777, 393945, 389877, 385344, 382371, 380488, 377271, 372534, 368527, 366067, 363885, 361780, 360940, 361011, 360190, 358398, 357259, 356940, 356200, 355440, 356369, 358651, 360226, 360957, 362599, 365066, 366208, 365519, 364637, 363853, 361546, 357590, 354022, 351716, 349526, 347227, 346169, 346453, 346526, 346241, 347276, 349976, 352811, 355683, 360613, 368209, 376365, 383600, 390962, 399453, 407953, 414869, 419898, 423357, 425609, 427570, 429829, 431104, 429663, 426296, 423466, 421579, 418712, 414126]
57915D14126m931m595n081n462m423l239l376l328j310R75Q99o78j146n74q69
57900C76988j991k538k769l767m839m781m410m871m968l250j148q71j650j345
57886C33790k80j75n61K87J954K665K561K970L451K611R96K02l4r41j906j473
57870C46117k47L1n22n99l93q78j478j173q60j781k761j892O1R01O09Q02J548
57853C37485J771J852K845L877L296J724J070J335J132N18L75pj702l445l299
57838C48827k164k325l358k948j243p99k329l926m511m783m738l418j371l66l73
57823C10175K87J674J958P68j2P36K063L079M004M750M788M601N080N314L355
57808C52620o23m169n799o248o393o151n684n516n173l640j284N06J573K873M227
$$ y = [414126, 409195, 404600, 399519, 394057, 389634, 386395, 383019, 379691, 378381, 379356, 380255, 379577, 378431, 377857, 376988, 374997, 372459, 369690, 365923, 361084, 356303, 351893, 347022, 342054, 338804, 337656, 336785, 335135, 333790, 333510, 333335, 332774, 333061, 335015, 337680, 340241, 343211, 346662, 349273, 350269, 350471, 350437, 349496, 347590, 346117, 345870, 345901, 345379, 344780, 344387, 343509, 342031, 340858, 339998, 338217, 335456, 333564, 333625, 334526, 335135, 335937, 337485, 339256, 341108, 343953, 347830, 351126, 352850, 353920, 355255, 356387, 356905, 357280, 357273, 355571, 352126, 348827, 346663, 344338, 340980, 338032, 336789, 335990, 333661, 329735, 325224, 320441, 315703, 312285, 310914, 310548, 310175, 310462, 312136, 314094, 314862, 314850, 315586, 317649, 320728, 324732, 329482, 334270, 338871, 343951, 349265, 352620, 351997, 347828, 342029, 335781, 329388, 323237, 317553, 312037, 306864, 303224, 301940, 302446, 304019, 306892, 311119]
57793C11119M376L267K254J981J879J762J877J590Q3j704j932o13M45M22J79K79
57777C27264L62N26J392K720L667M248M912N164M408L548L750M157L085R13n66
57762C69550j110j945l104l502l377l968m950m759l439k575k447j827o57k00l69
57747C31321M18K344L734L845L704L829L499K734K586L097L183K795K954L465
57733C73508L077K047J934K610K190M17p00k69J29o19j508j647j732k208k218
57718C75011j424q74j091j274j138j511k310k110o25M77J84m53m62m90j212k017
57702C58681k308k455k562j987q08j25j85N2R53J618J729K033K417J670k08j523
57686C56992j575j626k402k818k178j498j447j037M63K219L607N435Q133J0576
$$ y = [311119, 315495, 318762, 321016, 322997, 324876, 326638, 328515, 330105, 330188, 328484, 326552, 325939, 326384, 326806, 326985, 327264, 327626, 328152, 329544, 332264, 335931, 340179, 345091, 350255, 354663, 358211, 361961, 366118, 369203, 370116, 369550, 368440, 366495, 363391, 359889, 356512, 352544, 347594, 342835, 339396, 336821, 334374, 332547, 331890, 331690, 331321, 331739, 334083, 337817, 341662, 345366, 349195, 352694, 355428, 358014, 361111, 364294, 367089, 370043, 373508, 376585, 378632, 380566, 383176, 385366, 385783, 385083, 384814, 384943, 384324, 382816, 381169, 379437, 377229, 375011, 373587, 372713, 371622, 370348, 369210, 367699, 365389, 363279, 362654, 363131, 363315, 362862, 362400, 361910, 360698, 358681, 356373, 353918, 351356, 349369, 348561, 348436, 348251, 348303, 349256, 350874, 352603, 354636, 357053, 358723, 358515, 356992, 355417, 353791, 351389, 348571, 346393, 344895, 343448, 342411, 342874, 345093, 348700, 354135, 362268, 372844]
57672C72844J2086J3915J7438K2281K7514L3413M0856M9725N8241O2579N7411
57661G68303L9614J2703j4409l4272m5316m9539m8792m4675l9382l4231k8729
57650D81275k2552j7093j3602j1389r241p220n735m286k530j236r38q51k57L80
57636C84725O34J021J696J828J295J375K591L516K973J739Q46n8j274j727p20
57621D00460N08O09J10P6J82k35n67n2O97Q03P07J100J430R45K04J18M58O13P91
57602D08957J203J199N17J90Q88J559J089J63MM06M81K88L22L19q0l95k89l40
57584D16481p03l20J273K627K351J185O68R33J359K006K888K973J664J76j82K5
57568D35404k74n08L86J703J834O95m36q93p49J59J746K866K624J866J872K398
$$ y = [372844, 384930, 398845, 416283, 438564, 466078, 499491, 540347, 590072, 648313, 710892, 768303, 807917, 820620, 806211, 771939, 726623, 677084, 628292, 583617, 544235, 510004, 481275, 458723, 441630, 428028, 416639, 407398, 400178, 394443, 390157, 387627, 386391, 385453, 384602, 384345, 384725, 385359, 386380, 388076, 389904, 391199, 392574, 395165, 398681, 401654, 403393, 404239, 404181, 402907, 401180, 400460, 400968, 401577, 401687, 401763, 401945, 401710, 401143, 401091, 401788, 402591, 403298, 404398, 405828, 406773, 406977, 407095, 407553, 408166, 408957, 410160, 411359, 411876, 412066, 412954, 414513, 415602, 415765, 415769, 416175, 416656, 416944, 417266, 417585, 417505, 417110, 416821, 416481, 415778, 415458, 416731, 419358, 421709, 422894, 423562, 424495, 425854, 427860, 430748, 433721, 435385, 435561, 435379, 435404, 435130, 434622, 435008, 436711, 438545, 439240, 438804, 437911, 437162, 437321, 439067, 441933, 444557, 446423, 448295, 450693]
57552D50693K489K400L001M019M490M289L718K403K29j472j413l10K86L61R18
57537D76101J892K444K710L363L918L366K131J618K045K447K484K672K997K912
57523E13100K473K199K015J686J691K476L334L459L370L920M612M533M165M501
57509E57534N082M749L749L263L330L113K738K892L103K379J220R62J433J323
57495E96870O38N91J166R94r7n97K09J252J605J725K137K540K721L059L628M026
57479F22467M309M941N717N983N963O442P121O698M766K329L96o50l83J352L383
57464F80834M056L374K923L506M357M849N344N967O048N361M668M520M593M567
57450G44967M580M591M400M416N296O587P027O352N623N536N681N718N986O550
$$ y = [450693, 453182, 455582, 458583, 462602, 467092, 471381, 475099, 477502, 477731, 476259, 474846, 474536, 474822, 475183, 476101, 477993, 480437, 483147, 486510, 490428, 493794, 495925, 497543, 499588, 502035, 504519, 507191, 510188, 513100, 515573, 517772, 519787, 521473, 523164, 525640, 528974, 532433, 535803, 539723, 544335, 548868, 553033, 557534, 562616, 567365, 571114, 574377, 577707, 580820, 583558, 586450, 589553, 591932, 593152, 594114, 595547, 596870, 597508, 598099, 599265, 600259, 600162, 599565, 599774, 601026, 602631, 604356, 606493, 609033, 611754, 614813, 618441, 622467, 626776, 631717, 637434, 643417, 649380, 655822, 662943, 669641, 674407, 676736, 677132, 676482, 676099, 677451, 680834, 684890, 688264, 691187, 694693, 699050, 703899, 709243, 715210, 721258, 726619, 731287, 735807, 740400, 744967, 749547, 754138, 758538, 762954, 768250, 774837, 781864, 788216, 793839, 799375, 805056, 810774, 816760, 823310]
57436H23310O753O256N552N137N028N304O120P066P383P056O786O815O724O423
57422I11713O346O628O964P260P576P563O942O222O003N846N078M306M720O219
57408I99386P618Q537R490J0286J0020Q760P638P083O506N882O096P297Q390Q598
57394A111587Q291Q020P912Q165Q927R576R388Q885R171J0020J0193R705J0000
57381A229840J1582J3175J3599J2987J1793J0160Q666Q171Q529Q790Q829R251
57369A355372R661Q908P350O792P640Q174P438O788P591R169J0265J0872J1407
57356A467427J1583J1310J1416J2268J2934J2753J2474J2688J2572J1442J0333
57345A599200J0548J1665J2362J2398J2405J2442J2146J1766J1879J2368J2670
$$ y = [823310, 830063, 836319, 841871, 847008, 852036, 857340, 863460, 870526, 877909, 884965, 891751, 898566, 905290, 911713, 918059, 924687, 931651, 938911, 946487, 954050, 960992, 967214, 973217, 979063, 984141, 988447, 993167, 999386, 1007004, 1015541, 1025031, 1035317, 1045337, 1054097, 1061735, 1068818, 1075324, 1081206, 1087302, 1094599, 1102989, 1111587, 1119878, 1127898, 1135810, 1143975, 1152902, 1162478, 1171866, 1180751, 1189922, 1199942, 1210135, 1219840, 1229840, 1241422, 1254597, 1268196, 1281183, 1292976, 1303136, 1311802, 1319973, 1328502, 1337292, 1346121, 1355372, 1365033, 1373941, 1381291, 1388083, 1395723, 1403897, 1411335, 1418123, 1425714, 1434883, 1445148, 1456020, 1467427, 1479010, 1490320, 1501736, 1514004, 1526938, 1539691, 1552165, 1564853, 1577425, 1588867, 1599200, 1609748, 1621413, 1633775, 1646173, 1658578, 1671020, 1683166, 1694932, 1706811, 1719179, 1731849]
57334A731849J2670J2579J2357J2019J2009J2576J3202J3314J3119J3195J3659
57323A872548J4149J4265J3769J2858J2347J2873J3978J4684J4960J5491J6099
57312B028021J5846J4896J4687J5712J6666J6478J5863J5938J6562J6990J7036
57301B204695J6812J6302J5909J6390J7512J7974J7313J6651J6819J7120J6887
57290B390384J6812J7579J8429J8438J8117J8394J8938J8875J8366J8172J8286
57279B590790J8242J8145J8239J8011J6954J5735J5499J6335J7408J8199J8702
57268B782259J8860J8676J8585J8932J9433J9754K0060K0434K0391J9662J8835
57257B995881J8462J8239J7776J7506J8011J9061K0071K0970K1829K2312K2195
$$ y = [1731849, 1744519, 1757098, 1769455, 1781474, 1793483, 1806059, 1819261, 1832575, 1845694, 1858889, 1872548, 1886697, 1900962, 1914731, 1927589, 1939936, 1952809, 1966787, 1981471, 1996431, 2011922, 2028021, 2043867, 2058763, 2073450, 2089162, 2105828, 2122306, 2138169, 2154107, 2170669, 2187659, 2204695, 2221507, 2237809, 2253718, 2270108, 2287620, 2305594, 2322907, 2339558, 2356377, 2373497, 2390384, 2407196, 2424775, 2443204, 2461642, 2479759, 2498153, 2517091, 2535966, 2554332, 2572504, 2590790, 2609032, 2627177, 2645416, 2663427, 2680381, 2696116, 2711615, 2727950, 2745358, 2763557, 2782259, 2801119, 2819795, 2838380, 2857312, 2876745, 2896499, 2916559, 2936993, 2957384, 2977046, 2995881, 3014343, 3032582, 3050358, 3067864, 3085875, 3104936, 3125007, 3145977, 3167806, 3190118, 3212313]
57246C212313K1927K1917K1908K1714K1874K2804K3978K4703K5072K5451K5662
57235C469323K5490K5309K5468K5609K5370K5138K5387K5752K5556K4780K3920
57224C747102K3287K2915K2688K2249K1366K0549K0500K0811K0375J9227J8677
57213C979746J9147J9374J8473J7311J6882J6758J6248J5874J6395J7400J8031
57202D171639J8200J8135J7639J6862J6690J7354J7654J6702J5318J4619J4294
57191D355106J3649J3124J3434J4072J4167J3990J4170J4303J3750J2985J2749
57180D505499J2573J1637J0312R372Q387O460M037K405J776J301N66k10j033j942
57166D571140k352j815r87o85n29K81J353J614Q95k02j522l269n156o814q515
$$ y = [3212313, 3234240, 3256157, 3278065, 3299779, 3321653, 3344457, 3368435, 3393138, 3418210, 3443661, 3469323, 3494813, 3520122, 3545590, 3571199, 3596569, 3621707, 3647094, 3672846, 3698402, 3723182, 3747102, 3770389, 3793304, 3815992, 3838241, 3859607, 3880156, 3900656, 3921467, 3941842, 3961069, 3979746, 3998893, 4018267, 4036740, 4054051, 4070933, 4087691, 4103939, 4119813, 4136208, 4153608, 4171639, 4189839, 4207974, 4225613, 4242475, 4259165, 4276519, 4294173, 4310875, 4326193, 4340812, 4355106, 4368755, 4381879, 4395313, 4409385, 4423552, 4437542, 4451712, 4466015, 4479765, 4492750, 4505499, 4518072, 4529709, 4540021, 4549393, 4557780, 4564240, 4568277, 4570682, 4572458, 4573759, 4574325, 4574115, 4573082, 4571140, 4568788, 4566973, 4565986, 4565301, 4564772, 4565053, 4566406, 4568020, 4568915, 4568713, 4567191, 4563922, 4558766, 4551952, 4543437]
57151D543437j0508j2161j2970j3614j4948j6627j7943j9193k0985k2990k4677
57140D356821k6323k7953k8294k6411k3493k1287j9598j7123j3891j0942q225
57129D133281m867j110J939M153O185P809Q302Q184Q806J0503J2786J5955K0718
57116D232644K6632L2757L9544M8207N8602O9643Q1458R5191J10937J27839J46169
57105E069623J67532J93339K24915K64875L16415L81523M61731N60157O80878
57096H320988Q26728R99782J203111J439215J706775K001131K317348K649928
57088B1465006K989533L322389L632330L900938M107161M230259M250515M140699
57080E2038830L859117L364889K652218J770572Q07342j50411j040917j828171
$$ y = [4543437, 4532929, 4520768, 4507798, 4494184, 4479236, 4462609, 4444666, 4425473, 4404488, 4381498, 4356821, 4330498, 4302545, 4274251, 4247840, 4224347, 4203060, 4183462, 4166339, 4152448, 4141506, 4133281, 4128414, 4127304, 4129243, 4133396, 4139581, 4147390, 4155692, 4163876, 4172682, 4183185, 4195971, 4211926, 4232644, 4259276, 4292033, 4331577, 4379784, 4438386, 4508029, 4589487, 4684678, 4795615, 4923454, 5069623, 5237155, 5430494, 5655409, 5920284, 6236699, 6618222, 7079953, 7640110, 8320988, 9147716, 10147498, 11350609, 12789824, 14496599, 16497730, 18815078, 21465006, 24454539, 27776928, 31409258, 35310196, 39417357, 43647616, 47898131, 52038830, 55897947, 59262836, 61915054, 63685626, 64492968, 64342557, 63301640, 61473469]
57072F1473469k492407l023951l420057l682238l815997l832860l750450l589437
57064C3866072l370673l114205k838275k557780k283872k024810j786325j571375
57056A4318757j380647j213386j067640r40611q29909p34181o51942n80597n17636
57047F402208m62087m13852l72198l36004l04796k78353k55756k35894k18417
57038C524851k03148j89094j75293j62141j50514j39919j28907j17041j04829
57029B153965r1851p6822n9742m1582k0926O133L8972O5930O9179L9552j3772
57018B069036o9716j10977j32886j39576j36117j25808j11704r6894q3154p1042
57008I91162o1084n3517m7299m0981l4557k9206k5366k2338j9667j7567j5969
$$ y = [61473469, 58981062, 55957111, 52537054, 48854816, 45038819, 41205959, 37455509, 33866072, 30495399, 27381194, 24542919, 21985139, 19701267, 17676457, 15890132, 14318757, 12938110, 11724724, 10657084, 9716473, 8886564, 8152383, 7500441, 6919844, 6402208, 5940121, 5526269, 5154071, 4818067, 4513271, 4234918, 3979162, 3743268, 3524851, 3321703, 3132609, 2957316, 2795175, 2644661, 2504742, 2375835, 2258794, 2153965, 2062114, 1985292, 1925550, 1883968, 1863042, 1869175, 1908147, 1974077, 2043256, 2082808, 2069036, 1999320, 1888343, 1755457, 1615881, 1479764, 1353956, 1242252, 1145358, 1062204, 991162, 930078, 876561, 829262, 788281, 753724, 724518, 699152, 676814, 657147, 639580, 623611]
56997F23611j4458j3216j2792j2865j2444j1311j0142r172p948o408m952l375
56985E04528r38K399N868Q838J0603R585M495l532j1469j7297k1042k3042k3055
56972D45941k1365j9048j6566j3551j0266p735o033m059j466Q61K656M896Q020
56959C62285J1294J4555J8713K3524K6450K4917J8571Q767k565j2865j9593k2258
56947D51795k2702k2455k1173j8372j5082j2452j0119p176l765n98K163M712P180
56934C31956J0168J4605K0412K6321L1351L4903L5042K8864J5941p6j4578k5386
56922E09523l2236l4903l3668l0341k6943k3957k1009j8249j5950j3709j1272
56911B47286r237p950o791n521n047n630n697l873j128N37O17P4l14k45N58J855
$$ y = [623611, 609153, 595937, 583145, 570280, 557836, 546525, 536383, 527211, 519263, 512855, 507903, 504528, 503590, 505989, 511857, 520695, 531298, 540883, 545378, 541846, 530377, 513080, 492038, 468996, 445941, 424576, 405528, 388962, 375411, 365145, 357410, 351377, 347318, 345852, 346713, 349369, 354265, 362285, 373579, 388134, 406847, 430371, 456821, 481738, 500309, 509076, 506511, 493646, 474053, 451795, 429093, 406638, 385465, 367093, 352011, 339559, 329440, 322264, 318499, 317901, 320064, 324776, 331956, 342124, 356729, 377141, 403462, 434813, 469716, 504758, 533622, 549563, 549487, 534909, 509523, 477287, 442384, 408716, 378375, 351432, 327475, 306466, 288217, 272267, 258558, 247286, 238049, 230099, 223308, 217787, 212740, 207110, 201413, 197540, 196412, 196949, 197566, 197640, 197326, 197081, 197639, 199494]
56895A99494K749L070L978O166Q637J0340J1882J4345J7569K0860K4173K7072
56883C50335K7606K3913J6397P097k288j0599j6511j9226j9266j7589j4600j0853
56871C14416p469m726j410L198P965J1786J5464K0254K5813L1312L7435M5403
56859D99441N4591O2328O5237N9909M4290K0478m934k5346l8416m5034m6091m2390
56847F04063l6189k9884k3760j6968r904l500K921J0694J9461K7983L6660M7007
56835F28584N9192P2322Q6200R9642J07183J00791P6457L8086n044m3289p0079
56824A150045q3666q6897q4114p7755o8465n7491m6845l7279k8065j8894j0272
56813E50302k024O825J6422K5987L5503M6053N7991O9444P6447P3956N8154L0005
$$ y = [199494, 202243, 205313, 209291, 215457, 224094, 234434, 246316, 260661, 278230, 299090, 323263, 350335, 377941, 401854, 418251, 425348, 423060, 412461, 395950, 376724, 357458, 339869, 325269, 314416, 306947, 302221, 300811, 304009, 311974, 323760, 339224, 359478, 385291, 416603, 454038, 499441, 554032, 616360, 681597, 741506, 785796, 806274, 801340, 775994, 737578, 692544, 646453, 604063, 567874, 537990, 514230, 497262, 487358, 483858, 486779, 497473, 516934, 544917, 581577, 628584, 687776, 760098, 846298, 945940, 1053123, 1153914, 1230371, 1268457, 1263413, 1220124, 1150045, 1066379, 979482, 895368, 817613, 749148, 691657, 644812, 607533, 579468, 560574, 550302, 548278, 555103, 571525, 597512, 633015, 679068, 737059, 806503, 882950, 956906, 1015060, 1045065]
56801A045065l622l4034n6154o9362p4595p3058o7071n9429n1362m2725l4020
56790D79633k6462k0148j4148q315l172J777P669J4271K0386K6110L2371L7879
56778E47851L8839L2524J9637K951j4483k9474l9256m3274m3323m1368l8136l3985
56766C58503k9653k5683k2162j9235j6954j4770j2211r908q666q004o963n839
56754A78455n531n602m886l611k986k927k297j269j239k288k881k413j950k050
56740A36525j843p86L92J018J201R10p2j118j220o62o00r88o90M18J219J333J366
56723A36403J251L22q34p52M87J284J127J063J390J170M22L93J194J405O57K63
56707A47245O54N58m47r21j51N09L0n30P2J346K232K563K415J542M14K30J080
$$ y = [1045065, 1041443, 1007409, 951255, 881893, 807298, 734240, 667169, 607740, 556378, 513653, 479633, 453171, 433023, 418875, 410560, 407388, 409165, 416834, 431105, 451491, 477601, 509972, 547851, 586690, 619214, 638851, 641802, 627319, 597845, 558589, 515315, 471992, 430624, 392488, 358503, 328850, 303167, 281005, 261770, 244816, 230046, 217835, 207927, 199261, 191257, 184294, 178455, 172924, 167322, 162436, 158825, 155839, 152912, 150615, 149346, 148107, 145819, 142938, 140525, 138575, 136525, 134682, 133896, 134288, 135306, 136507, 137417, 137345, 136227, 135007, 134345, 133745, 132757, 132067, 132485, 133704, 135037, 136403, 137654, 137976, 137142, 136390, 136877, 138161, 139288, 140351, 141741, 142911, 143333, 143726, 144920, 146325, 146982, 147245, 147899, 148457, 148010, 147089, 146938, 147447, 147477, 146947, 147019, 148365, 150597, 153160, 155575, 157117, 157531, 157761, 158841]
56690A58841J627J212O37L54k28r81p08O58J524J190R09J460J793J190O65R00
56674A71043P91m68j705j677j045r05r13l58K52J42l22n17p04j169j330p25J28
56657A60518P28J297J884J986J678J682J855J196j15o49k27m38j799k617j819
56642A65160p33p34j181j127j085j435j074O07K074J850Q23N43O73O1r16j047
56626A62459l94M6J24M37J049J524J650J311L89n52n64J03Q1q70j337o80j83p48
56608A63845j421j339j332k110k697k190j435j345j139K6J160R45p3n51m33m40
56592A49471m83j03M03O19Q75J412J715J562J530J712J327M73M48J396J591K82
56576A64230p51L7J531J917J345R34P62M92N72J208J591J472J934L393M601M965
$$ y = [158841, 160468, 161680, 162317, 162671, 162443, 161462, 160754, 161412, 162936, 164126, 165035, 166495, 168288, 169478, 170143, 171043, 171834, 171366, 169661, 167984, 166939, 166034, 165121, 164763, 165015, 165157, 164835, 164318, 163614, 162445, 161115, 160390, 160518, 161246, 162543, 164427, 166413, 168091, 169773, 171628, 172824, 172709, 172060, 171833, 171395, 169596, 166979, 165160, 164427, 163693, 162512, 161385, 160300, 158865, 157791, 158398, 160472, 162322, 163145, 163688, 164361, 164422, 163506, 162459, 162065, 162111, 162235, 162672, 163721, 165245, 166895, 168206, 168595, 168043, 167479, 167582, 167663, 166793, 165456, 164776, 164593, 163845, 162424, 161085, 159753, 157643, 154946, 152756, 151321, 149976, 148837, 148863, 150023, 150968, 150895, 150344, 149911, 149471, 148988, 148885, 149288, 149907, 150782, 152194, 153909, 155471, 157001, 158713, 160040, 160513, 160961, 162357, 163948, 164230, 163479, 163516, 165047, 166964, 168309, 169243, 170005, 170497, 171069, 172277, 173868, 175340, 177274, 180667, 185268, 190233]
56560A90233N823Q033J0479J2419J4826J7532J7681J3461P178K134j384m474o343
56547B87598n722l851k940k968k767k726l611m187l054j569j894l309l544k634
56533B42822k333k640k214j460j963l220l185j832j120j499j374k31N12J45l53
56518B20055l74n29j084j431j463j761k286k393k111j995j929j465r16p76n97
56503A98945J87J051J336J471J822J524R6j027m88O33N16n10r06o14o59j019j050
56486B01308j136j795k176j474o37o24l54J229K591J771j95r20m35m04p14l8J098
56469A97095J092M18Q42K068K303J673J867K728K429R15J1J56rp46q02J8N43N57
56451B13158Q66J193N49m97n36Rl62j174o09J122K070J919K031K300J199q92j657
$$ y = [190233, 196056, 204089, 214568, 226987, 241813, 259345, 277026, 290487, 297665, 299799, 298415, 293941, 287598, 281876, 278025, 275085, 272117, 269350, 266624, 263013, 258826, 255772, 254203, 252309, 249000, 245456, 242822, 240489, 237849, 235635, 234175, 232212, 228992, 225807, 223975, 222855, 221356, 219982, 219751, 220263, 220408, 220055, 219681, 219152, 218068, 216637, 215174, 213413, 211127, 208734, 206623, 204628, 202699, 201234, 200318, 199542, 198945, 199132, 200183, 201519, 202990, 204812, 206336, 206432, 205405, 204917, 205550, 206066, 205556, 204650, 204036, 203377, 202358, 201308, 200172, 198377, 196201, 194727, 194090, 193466, 193112, 194341, 196932, 198703, 198508, 197588, 197153, 196749, 196035, 195997, 197095, 198187, 198605, 199447, 201515, 203818, 205491, 207358, 210086, 212515, 213430, 213441, 213597, 213588, 212842, 212040, 212058, 212601, 213158, 214024, 215217, 215766, 215269, 214733, 214742, 214380, 213206, 212597, 213719, 215789, 217708, 219739, 222039, 223238, 222346, 220689]
56434B20689n59M29K57j0K15Lq47j210q20p44j219j303r35r93j261o48N31R30
56416B12505O54R70J668J379L06n7K35j53r67p11K51R6r88r43L84Q75j12p96l17
56397B14279N7l21m02K24N81M47O73J127P60p2k2N81K85m56J48J736K138J202
56379B22965R29J638J571N43M28J514J941J288J204J922J716N37M85J906K587
56364B43174J790J429K248K467J355O48J117J267O50J092L167M759M538L799L523
56349B77023K800J399P06R24M28r39j213k5M11p48j543r65o53j328j089J077L412
56332B79677M610N677P006P009N356M302M993N634N039M690N513N755M154K152
56318C51567J195O70J27N40J758J796K25q02l45j38r09q25P03J439M85L05K367
$$ y = [220689, 220130, 220559, 220816, 220806, 221021, 221024, 220177, 218967, 218147, 217403, 216184, 214881, 213946, 212953, 211692, 211044, 211575, 212505, 213159, 214129, 215797, 217176, 217482, 217425, 217660, 217507, 216540, 215829, 216080, 216176, 215188, 214245, 214629, 215504, 215392, 214596, 214279, 214336, 214015, 213613, 213837, 214418, 214865, 215538, 216665, 217425, 217353, 217331, 217912, 218197, 217741, 217889, 219625, 221763, 222965, 223894, 225532, 227103, 227646, 228074, 229588, 231529, 232817, 234021, 235943, 237659, 238196, 238681, 240587, 243174, 244964, 246393, 248641, 251108, 252463, 253111, 254228, 255495, 256145, 257237, 260404, 265163, 269701, 273500, 277023, 279823, 281222, 281928, 282852, 283280, 282341, 281128, 281103, 281514, 280766, 279223, 278258, 277605, 276277, 275188, 276265, 279677, 284287, 289964, 296970, 303979, 309335, 313637, 318630, 324264, 329303, 333993, 339506, 345261, 349415, 351567, 352762, 353432, 353559, 354099, 355857, 357653, 357878, 357076, 356731, 356593, 355684, 354859, 355562, 357001, 357486, 357791, 360158]
56301C60158M362M170L211L412M010L896M014N012N375M226L181L320L169J862
56287D13378J222K593M441N182N524O157O199N705O512Q753R959R321R244J0776
56273E04966J1571J0532J0323J2618J4937J5158J5186J7079J9195J9646K0029
56262F71240K2313K5153K6695K8118L1100L4656L7588M1292M7123N3728N9783
56251A078789O6668P5709Q5651R5413J06267J18804J30962J41590J52501J64429
56241B216783J74508J80523J83880J85564J83145J74792J62311J46793J25505
56232C733804R6743O3973L1382q87l3328o3046q7419j08051j26910j41937j50841
56221C213483j55742j59633j61394j58708j52908j46574j39342j30222j21104
$$ y = [360158, 364520, 368690, 371901, 375313, 379323, 383219, 387233, 392245, 397620, 401846, 405027, 408347, 411516, 413378, 414600, 417193, 421634, 426816, 432340, 438497, 444696, 450401, 456913, 465666, 475625, 484946, 494190, 504966, 516537, 527069, 537392, 550010, 564947, 580105, 595291, 612370, 631565, 651211, 671240, 693553, 718706, 745401, 773519, 804619, 839275, 876863, 918155, 965278, 1019006, 1078789, 1145457, 1221166, 1306817, 1402230, 1508497, 1627301, 1758263, 1899853, 2052354, 2216783, 2391291, 2571814, 2755694, 2941258, 3124403, 3299195, 3461506, 3608299, 3733804, 3830547, 3894520, 3925902, 3925015, 3891687, 3828641, 3741222, 3633171, 3506261, 3364324, 3213483, 3057741, 2898108, 2736714, 2578006, 2425098, 2278524, 2139182, 2008960, 1887856]
56212A887856j13775j06403r7081q7754q0780p4789o7947o1830n7933n3932m7796
56201A037836m1971l9005l6681l2193k7436k5230k3905k0793j7595j6892j6832
56190G39303j4667j2216j2242j2671j0248o814o024o714n512l295l083l949l012
56177F38856j191j114j604n4J958J275p64o42J045J210K19N51J632J469J327L339
56161F47512N690N591M637N784P648P494P031R213J2097J2198J1298J3351J7059
56148G66603J8231J7367J8227K0954K3193K6099L2540M1149M8548N5630O5202
56137A133743P5560Q2955Q8164R3740R6907R2430Q0978O7967N6026M5342L8990
56126A952802M0152M5393M7818M5644M1319L4526K3512J1295K871k324q323j5173
$$ y = [1887856, 1774081, 1667678, 1570597, 1482843, 1402063, 1327274, 1259327, 1197497, 1139564, 1085632, 1037836, 995865, 956860, 920179, 887986, 860550, 835320, 811415, 790622, 773027, 756135, 739303, 724636, 712420, 700178, 687507, 677259, 670445, 664421, 657707, 652195, 648900, 645817, 641868, 638856, 637665, 636551, 634947, 634893, 636851, 638126, 637362, 636720, 637765, 638975, 639194, 639745, 641377, 642846, 644173, 647512, 653202, 658793, 663430, 669214, 676862, 684356, 691387, 700600, 712697, 724895, 736193, 749544, 766603, 784834, 802201, 820428, 841382, 864575, 890674, 923214, 964363, 1012911, 1068541, 1133743, 1209303, 1292258, 1380422, 1474162, 1571069, 1663499, 1744477, 1812444, 1868470, 1913812, 1952802, 1992954, 2038347, 2086165, 2131809, 2173128, 2207654, 2231166, 2242461, 2245332, 2243008, 2234685, 2219512]
56114B219512k0914k8467m2393o0364p5618q6099r3689r6891r2800q4386p7236
56103A460655p0645o0315m7905l9021l3471k6615j8960j5040j4043j0917n923
56092A117800l803m277k634R60J940M90J163L969M900M403O335R466R276P130
56078A157118Q188J1440J1543R288J0150J3589J4170J2259J3075J6065J6020J3875
56066A306780J5333J9527K0214J7703J8151K1581K2067J9529J9614K2177K1675
56055A524351J8683J9122K2454K2767K0977K3307K8267K8315K4134K3636K7007
56044A783020K6752K2786K2953K7938L0228K8941L0976L6394L7666L4743L5743
56033B118140M1208M2940M0012M0411M5233M6993M5270M7820N4392N6086N2664
$$ y = [2219512, 2198598, 2170131, 2127738, 2067374, 1991756, 1905657, 1811968, 1715077, 1622277, 1537891, 1460655, 1390010, 1329695, 1281790, 1242769, 1209298, 1182683, 1163723, 1148683, 1134640, 1123723, 1117800, 1113997, 1109720, 1107086, 1108046, 1109986, 1110476, 1111639, 1115608, 1120508, 1124911, 1131246, 1140712, 1149988, 1157118, 1165306, 1176746, 1188289, 1197577, 1207727, 1221316, 1235486, 1247745, 1260820, 1276885, 1292905, 1306780, 1322113, 1341640, 1361854, 1379557, 1397708, 1419289, 1441356, 1460885, 1480499, 1502676, 1524351, 1543034, 1562156, 1584610, 1607377, 1628354, 1651661, 1679928, 1708243, 1732377, 1756013, 1783020, 1809772, 1832558, 1855511, 1883449, 1913677, 1942618, 1973594, 2009988, 2047654, 2082397, 2118140, 2159348, 2202288, 2242300, 2282711, 2327944, 2374937, 2420207, 2468027, 2522419, 2578505, 2631169]
56022B631169N3534N9613O1692N8878O0546O7563P0211O7535O9727P8211Q2721
56011C361400Q1482Q4523R3521R8571R8458J03242J13261J17232J14965J19427
56001D386082J32197J40269J41440J48462J63313J72864J75441J85141K03847
55992E849056K16447K20432K31643K53468K69979K77635K93005L20269L42955
55983H274889L57263L80574M16931M48646M72614N08682N60877O08793O49309
55974A2678578P06066P84659Q62020R34424J029409J154693J285418J419401J591200
55965B2445868J812344K056430K325314K666628L102115L609410M202103M949223
55957D7169435N884134O983206Q271798R852283J1790868J4103498J6904086K0410662
$$ y = [2631169, 2684703, 2744316, 2806008, 2864886, 2925432, 2992995, 3063206, 3130741, 3200468, 3278679, 3361400, 3442882, 3527405, 3620926, 3719497, 3817955, 3921197, 4034458, 4151690, 4266655, 4386082, 4518279, 4658548, 4799988, 4948450, 5111763, 5284627, 5460068, 5645209, 5849056, 6065503, 6285935, 6517578, 6771046, 7041025, 7318660, 7611665, 7931934, 8274889, 8632152, 9012726, 9429657, 9878303, 10350917, 10859599, 11420476, 12029269, 12678578, 13384644, 14169303, 15031323, 15965747, 16995156, 18149849, 19435267, 20854668, 22445868, 24258212, 26314642, 28639956, 31306584, 34408699, 38018109, 42220212, 47169435, 53053569, 60036775, 68308573, 78160856, 89951724, 104055222, 120959308, 141369970]
55949A41369970K4733785K9832095L5662439M1835192M6629270M6737026L9053093
55942D05852870K3413304L460214j5503328k9608894l7740762m0716612l9973515
55935B69183277l6927415l2792827k8417728k4231724k0427828j7129771j4372743
55928I4883241j2077786j0153095q567280p288778o237175n345113m603825m006384
55920C6603805l504979l061013k682409k375982k111781j865995j652963j484183
55912A7864500j337390j194158j068835r73440q90185q03767p26890o70154o18781
55903I580900n61509n11985m79970m50339m11292l75698l54483l35295l07053
55894E793276k80501k65334k50812k27543k05954j95224j85438j67771j51670
$$ y = [141369970, 166103755, 195935850, 231598289, 273433481, 320062751, 366799777, 405852870, 429266174, 432726388, 417223060, 387614166, 349873404, 309156792, 269183277, 232255862, 199463035, 171045307, 146813583, 126385755, 109255984, 94883241, 82805455, 72652360, 64085080, 56796302, 50559127, 45214014, 40610189, 36603805, 33098826, 30037813, 27355404, 24979422, 22867641, 21001646, 19348683, 17864500, 16527110, 15332952, 14264117, 13290677, 12400492, 11596725, 10869835, 10199681, 9580900, 9019391, 8507406, 8027436, 7577097, 7165805, 6790107, 6435624, 6100329, 5793276, 5512775, 5247441, 4996629, 4769086, 4563132, 4367908, 4182470, 4014699, 3863029]
55885C863029j45357j39180j24477j09724j02599r5025q1462p3267p8988q7832
55875B825118q8137q5552q7894q8592q0790p2588p2831p5577p2900o9568p1215
55864A959474p1392o4055n6246n5135n4706m8112m1133m0727m1867l8125l3952
55853A414024l4522l4502k8839k3764k5406k8101k5500k2631k5475k8907k6714
55842A109663k3530k5312k7573k4574k0912k2586k5299k2962j9247j9729k0801
55831H57138j7317j3206j3782j5198j2090q140q723j0437q265n929q764j3224
55819G22063j3550j2274j4184j6395j4359j1378j2415j4372j2212q744r022j0616
55807E72542q869o184o922q471o377l057k693k813L77L687K679L91J577L508J331
$$ y = [3863029, 3717672, 3578492, 3454015, 3344291, 3241692, 3146667, 3065205, 2991938, 2912950, 2825118, 2736981, 2651429, 2563535, 2474943, 2394153, 2321565, 2248734, 2173157, 2100257, 2030689, 1959474, 1888082, 1824027, 1767781, 1712646, 1657940, 1609828, 1568695, 1527968, 1486101, 1447976, 1414024, 1379502, 1345000, 1316161, 1292397, 1266991, 1238890, 1213390, 1190759, 1165284, 1136377, 1109663, 1086133, 1060821, 1033248, 1008674, 987762, 965176, 939877, 916915, 897668, 877939, 857138, 839821, 826615, 812833, 797635, 785545, 777405, 768682, 758245, 749980, 744051, 735287, 722063, 708513, 696239, 682055, 665660, 651301, 639923, 627508, 613136, 600924, 592180, 583158, 572542, 563673, 557489, 550567, 542096, 535719, 532662, 529969, 527156, 527533, 531220, 533899, 534290, 535867, 539375, 540706]
55792E40706k451k643p28r51j716M29K864J534q02O80M106M847L717L130j0q821
55776E43891j8348k1764k0632k0405k0094j5617r452p220p500m519J221L919K310
55763D05790J85j258l772o273o126m627m632m728k325J25j138l957l775j787k450
55748C59252n392p007p623r811j1836j0191o668n675o448n047k151j611k935k416
55734B74441l47j58j637j712p05j320k809k506j648l260n882n889m330m901o794
55719B30543o380m439m599n895m137J93K480J891J901L325L524K443K935M927
55705B28712N429M324M297N104L786M82j728k608m725p770q650p273o646p165
55691B05569o233l715k362k613k092m79N5o41n98j9q34k198j299J524L229L355
$$ y = [540706, 538255, 535612, 534884, 533933, 532217, 532646, 535510, 537044, 536242, 536922, 541028, 545875, 549592, 552722, 552712, 543891, 525543, 503779, 483147, 462742, 442648, 427031, 417579, 410359, 402859, 398340, 399561, 403480, 405790, 405975, 404717, 400945, 394672, 388546, 383919, 379287, 374559, 372234, 372359, 371221, 367264, 363489, 361702, 359252, 353860, 346853, 339230, 329419, 317583, 307392, 300724, 295049, 288601, 283554, 281403, 279792, 276857, 274441, 274094, 273936, 272299, 270587, 269882, 268562, 265753, 263247, 261599, 258339, 252457, 246568, 242238, 237337, 230543, 224163, 219724, 215125, 209230, 205093, 205286, 207766, 209657, 211558, 214883, 218407, 220850, 223785, 228712, 234141, 238465, 242762, 247866, 251652, 252134, 250406, 247798, 243073, 235303, 226653, 219380, 212734, 205569, 199336, 195621, 193259, 190646, 188554, 188075, 188130, 187489, 186891, 186872, 186038, 183840, 182541, 184065, 187294, 190649]
55675A90649L973M819L590Q39m46r7o61k245k448j297j210k071j316Q94J553O0
55659A94586j075r56j132j639q16Q02J010K44Q77K363J877l02j019J19K39j356
55643A93822k274j829j925k607j615Q97J846K82j407k061l208n185o103n511n153
55628A57969n367m612l054k682l393k917j019O3l02n26l42j015j862q55J218J360
55612A32664n51j569q83p73j995k598j961j783k347j976p57p61k010k273j356
55597A09071j435k660k732j378q81j568j142O85J415L60k89J37k91j753j779J27
55581I5887J289N95K31J344K100J528J281K146K657K499L476N689O682N766N347
55566A38517O459O814M935K509J014m70k459l550l270l186l818l643k385j878
$$ y = [190649, 194622, 199441, 203031, 203870, 203424, 203327, 202666, 200421, 197973, 196676, 195466, 193395, 192079, 192973, 194526, 194586, 193511, 192555, 191423, 189784, 188968, 189770, 190780, 191024, 191901, 194264, 196141, 195839, 194820, 194939, 195178, 193822, 191548, 189719, 187794, 185187, 183572, 184469, 186315, 186597, 185190, 183129, 179921, 174736, 168633, 163122, 157969, 152602, 147990, 144936, 142254, 138861, 135944, 134925, 134988, 134686, 134160, 133818, 132803, 130941, 130086, 131304, 132664, 132113, 130544, 129661, 128888, 126893, 124295, 122334, 120551, 118204, 116228, 115471, 114710, 112700, 110427, 109071, 107636, 104976, 102244, 100866, 99985, 98417, 97275, 97960, 99375, 99735, 99446, 99583, 99292, 97539, 95760, 95887, 97176, 97771, 98002, 99346, 101446, 102974, 104255, 106401, 109058, 111557, 115033, 120722, 127404, 133170, 138517, 144976, 151790, 156725, 159234, 160248, 159778, 157319, 153769, 150499, 147313, 143495, 139852, 137467, 135589]
55552A35589k557k592j647j844l688m771l955l169l596l702k631j989k573k778
55538I4097j839j299j710j270O98K293K491K687L411L099J590J121K260K526P88
55523A10943p14n23l81j523k265j426o37j024j066O1M54r30k024j363o48j263
55507I5671j612m97J21j378l129k882j536q38l01Q66J383K75p78j32R87Q46J30
55490H7196P5n3j046j590n73N20J8j073j048m15m56o65kQ98R15M30K05j07p02
55471H2527o61K29N00n73j523j135k66J08M38P91J1j758k338r69J46m21q96L45
55453G4555J747J387K38J47O69M69j79n06r70j734j569k41K25j177k306j271M50
55436F9934O73M5K42Q03M45l57o31r53j777j694J61J830J330r9j44Q95J269R75
$$ y = [135589, 133032, 130440, 128793, 126949, 123261, 118490, 114535, 111366, 107770, 104068, 101437, 99448, 96875, 94097, 92258, 90959, 89249, 87979, 88677, 90970, 93461, 96148, 99559, 102658, 104248, 105369, 107629, 110155, 110943, 110229, 109706, 109325, 107802, 105537, 104111, 103474, 102450, 101384, 101445, 101899, 100969, 98945, 97582, 96934, 95671, 94059, 93562, 93683, 92305, 89176, 86294, 84758, 83920, 83619, 84485, 85868, 86143, 85365, 85233, 86220, 87066, 87196, 87271, 87218, 86172, 84582, 84009, 84529, 84547, 83474, 82426, 82011, 81555, 80890, 80888, 81786, 82701, 83131, 83336, 83229, 82527, 81866, 82095, 82595, 82022, 80499, 79364, 79098, 79206, 79644, 80435, 80446, 78688, 76350, 75381, 75527, 75106, 74210, 74555, 76302, 77689, 77927, 78074, 78743, 79212, 79033, 78527, 77557, 75823, 74254, 74013, 74238, 73061, 70755, 69484, 69934, 70607, 70652, 70894, 71697, 72142, 71785, 71154, 70201, 68424, 66730, 66891, 68721, 70051, 69952, 69808, 70703, 71972, 72947]
55418G2947J099J358R56O10J255J984J600Q96J115J523P75o03j282j394j610j432
55402G9797m37K20l19q64l70j29j406k704j945L1Q89L99O4K36J40j92k09k26n31
55383G2444k44J008J715P40m94k20P57O55k95p97r80j518j550p3J702J833O28
55366G5311j86k73m99q73p99n56o02l78M77R65L93j86O0J02p96j212n0J064L60
55347G2322r72q82M3R2k78L56J267P75n36q51l31l79p18j17Q31O17k95k65M88
55328G1167N45J71P33J800J670L90l85j87J22M14J115J462M31j101j494r94j000
55311G4859j425j220p23r63j296l98J110J580J152J051Q88m93k166k085n25L30
55295F9676n7k02M10P61N89O73Q72L49l59N0J174J394O03J07J13k45p31l36N33
$$ y = [72947, 74046, 75404, 76360, 76970, 78225, 80209, 81809, 82705, 83820, 85343, 86118, 85515, 84233, 82839, 81229, 79797, 79360, 79580, 79261, 78397, 78027, 77898, 76492, 73788, 71843, 71874, 72763, 73162, 73226, 73462, 73602, 73410, 73201, 72975, 72444, 72200, 73208, 74923, 75663, 75169, 74949, 75706, 76361, 76066, 75269, 74289, 72771, 71221, 71148, 72850, 74683, 75311, 75125, 74852, 74353, 73480, 72681, 72125, 71523, 71145, 71622, 72587, 72980, 72794, 72854, 72956, 72160, 70948, 70898, 71962, 72322, 71350, 70468, 70511, 70603, 70325, 70681, 71948, 72723, 72187, 71336, 71005, 70626, 69908, 69791, 70622, 71239, 70944, 70679, 71167, 71712, 71883, 72616, 74416, 76086, 76476, 76091, 75904, 76026, 76440, 77555, 79017, 79448, 78347, 76853, 75859, 74859, 73434, 72214, 71491, 70528, 69232, 68834, 69944, 71524, 72676, 73727, 74615, 74122, 71956, 69871, 69346, 69676, 69619, 69417, 69827, 70588, 71177, 71850, 72722, 73071, 72712, 72762, 73936, 75330, 75933, 76040, 76153, 75908, 75177, 74841, 75374]
55276G5374N83M7Q8K77o55k000j804k07P44M65K62M64k8j137j361l50O28J034
55258G2424J428J574O66n56m87N50P60O9Q1R31R96L4l72J58J78o30p66J23L90
55239G7551o56j453r40k32m94j218j550j528j171j23J124J369O08J50N03Q13O79
55222G3432O54P86M59j45k31l6l71o83K51J777J899L70j061j551j822j901q30
55205G0997R57J671J058P73J408J648R04K88L07J13l88k04M11j22j702k192r06
55188G5021K19m4l96K25P27J68m17q8K44k32n90J6O52L09k96j20N00P78Q12Q50
55168G8338O33L32P55J668J528j99k009k522k094j488o22M15P25N2n96n57l46
55151G4013k44K75J030R04q1l34P63J734J431P06N97O35J59l50m05m63o86l14
$$ y = [75374, 75957, 76004, 76092, 76369, 75714, 73714, 71910, 71703, 72447, 72912, 73174, 73638, 73610, 72473, 71112, 70762, 71390, 72424, 73852, 75426, 76092, 75536, 75049, 75599, 76359, 76428, 76509, 77440, 78436, 78470, 78098, 78256, 78434, 77804, 77038, 77161, 77551, 76895, 75442, 74502, 74270, 73776, 72558, 71008, 69480, 68309, 68186, 69310, 70679, 71287, 71437, 71940, 72753, 73432, 74086, 74872, 75331, 75186, 74955, 74919, 74548, 73865, 74116, 75893, 77792, 78162, 77101, 75550, 73728, 71827, 70997, 71954, 73625, 74683, 75456, 76864, 78512, 79416, 79704, 80011, 80124, 79736, 79532, 79943, 79821, 78119, 75927, 75021, 75240, 75196, 74800, 75025, 75752, 75920, 75503, 75415, 75659, 75427, 74837, 74853, 75505, 75814, 75518, 75398, 75898, 76676, 77488, 78338, 78971, 79303, 80058, 81726, 83254, 83055, 81046, 78524, 76430, 74942, 74320, 74735, 75460, 75512, 74916, 74359, 74013, 73769, 74044, 75074, 75978, 75897, 75563, 76326, 78060, 79491, 80197, 80794, 81429, 81588, 81238, 80833, 80370, 79684, 79370]
55133G9370O47Q31k99j298r77j45O5L1M92J021J005Q15P84L27p04j168l47P11
55115H1161P94K87J10R2l72r47r28l40M06J195J797J657P97L8j85k23k19J26N42
55096H5788L40j46J49J101J405Q21M48M94p5j121j010M65J310N50j30N97J423
55079I2409Q44k51l71O9k8l14p3O2o08j114k88J100J487Q29J14m51j139j483r64
55060H9830k05p2k79r6L17M73N47O99L74o02j226p21J92M64J42l15r88j737j736
55041H5061q50k47n43o96J08Q99O53P8K33N79J07p51r56o14l65M2J020J876J760
55022H7394J144R79J167J117R54R82P88O0o28r25j466k440k659j414R6N96O75
55005H6420J334J921J384M42M99J249J301N52N4N7kl5N25J355J554J034M00j25
$$ y = [79370, 80017, 80848, 80549, 79251, 78274, 78129, 78194, 78225, 78717, 79738, 80743, 81558, 82342, 82669, 81965, 80797, 80450, 81161, 81955, 82242, 82352, 82444, 82072, 81125, 80197, 79857, 80263, 81458, 83255, 84912, 85709, 85747, 85562, 85339, 85120, 85246, 85788, 86128, 85982, 86131, 87232, 88637, 89458, 89906, 90400, 90325, 89204, 88194, 88659, 89969, 90519, 90389, 90986, 92409, 93253, 93002, 92631, 92700, 92672, 92358, 92285, 92347, 91739, 90625, 90337, 91437, 92924, 93753, 93867, 93416, 92277, 90794, 89830, 89625, 89553, 89274, 89178, 89495, 89968, 90515, 91214, 91588, 90986, 89760, 89039, 89231, 89695, 89837, 89522, 88534, 86797, 85061, 84211, 83964, 83421, 82725, 82833, 83732, 84385, 84463, 84696, 85275, 85382, 84631, 83675, 83061, 82696, 82738, 83758, 85634, 87394, 88538, 89517, 90684, 91801, 92755, 93737, 94525, 94585, 93957, 93032, 91566, 89126, 86467, 85053, 85149, 85745, 86420, 87754, 89675, 91059, 91501, 92000, 93249, 94550, 95102, 95156, 95213, 95211, 95176, 95701, 97056, 98610, 99644, 100044, 99919]
54987I9919n05k71O55J259P72J7N5L53k32j306j465m89N42R31Q25L84k50n14j12
54968A00568K82mn67p82r16j291j276l73N87O43K69K74K02o29j370p43P09J355
54950I6938R78Q21J388J867J600O97o30j991k392j169P52J746J392M59m34j039
54934A00983r31m6P16N86J21J71M20K22Q0P15J436J118K34J37P34P68K19M96K143
54915A10322M011M999N245N340N522N864O255O120M995L307J765K94j514l377
54901A59148m757n841o956p454o451m407k712j910j464j063r79j244j504j597
54887A10809j515j026j13O38Q62J005J349J158p7j392j540p41k5N13J480K799
54871A14184L949N056O413P355O998N771M862M448L668K114J92j681l244m140
$$ y = [99919, 99414, 99143, 99798, 101057, 101829, 101846, 101901, 102254, 102022, 100716, 99251, 98762, 99304, 100235, 101060, 101444, 101194, 100680, 100568, 100850, 100846, 100279, 99497, 98581, 97290, 96014, 95641, 96228, 96871, 97140, 97414, 97616, 96987, 95617, 94874, 95583, 96938, 97916, 98737, 100125, 101992, 103592, 104289, 103659, 101668, 99276, 98107, 98859, 100605, 101997, 102456, 102022, 100983, 100052, 100006, 100722, 101308, 101429, 101600, 102020, 102242, 102322, 103037, 104473, 105591, 105825, 105962, 106696, 107464, 107683, 108179, 110322, 114333, 119332, 124577, 129917, 135439, 141303, 147558, 153678, 158673, 161980, 163745, 164039, 162525, 159148, 154391, 148550, 141594, 134140, 127689, 123282, 120570, 118660, 117196, 116133, 115154, 113910, 112406, 110809, 109294, 108268, 108155, 108793, 109655, 110660, 112009, 113167, 113090, 111698, 110158, 109417, 109392, 109905, 111385, 114184, 118133, 123189, 129602, 136957, 143955, 149726, 154588, 159036, 162704, 164818, 165010, 163329, 160085, 155945]
54857A55945m418m825n659n994n060l611k794k478j977j571j895k528k653k423
54843A08059k346k035j032j31l53j232j535j097n29J48J077J558J029K85K89N09
54827A02664P7m79l63l18j291k259j606R7R20N80L53N20K73k06N7P72P86L12M78
54808A01367R38L35j041j501q76o45j020m83J253K381J797O44K14K48J22oM0q0
54790A03687l81m89m98o60k98J313L125L305J971R41P81L07q28j397q93l73l89
54773A09224j48O37J036P49P63J454J867J574J485K114K742K995L506M396M822
54758A39216M595M573M917M743M065M033M554L739P66k687m876o020o786o573
54744A48259m851k741j833k351l447m325m307k980j076j04m31q51n57j96l68n66
$$ y = [155945, 151527, 146702, 141043, 135049, 129989, 126378, 123584, 121106, 119129, 117558, 115663, 113135, 110482, 108059, 105713, 103678, 102646, 102515, 102162, 100930, 99395, 98298, 97769, 97917, 98994, 100552, 101581, 101866, 102155, 102664, 102741, 102262, 101899, 101581, 100290, 98031, 96425, 96522, 97442, 98022, 98375, 98895, 99168, 98962, 99019, 99791, 100577, 100889, 101367, 102305, 102640, 101599, 100098, 99222, 98577, 97557, 97074, 98327, 100708, 102505, 103149, 103363, 103611, 103733, 103727, 103767, 103687, 103306, 102817, 102319, 101659, 101361, 102674, 105799, 109104, 111075, 112016, 112797, 113104, 112276, 110879, 109986, 109613, 109224, 109076, 109713, 110749, 111498, 112261, 113715, 115582, 117156, 118641, 120755, 123497, 126492, 129998, 134394, 139216, 143811, 148384, 153301, 158044, 162109, 166142, 170696, 174435, 175201, 172514, 167638, 161618, 154832, 148259, 143408, 140667, 138834, 136483, 133036, 128711, 124404, 121424, 120348, 120244, 119813, 118962, 118405, 118209, 117841, 117275]
54728A17275l07L6J78M67Q71P89L43M36J078J251Q90J272K802M214M687M991N630
54711A46903N716M619L090J721Mk072l253l042k838l781m932m903l895k835j931
54696A28571j241j365k265k719k084j377j445j517p12L55P86Q17P73Q0j365k230
54680A13062j629o47n12o00J40J105J107M17k7m20j321j991j372m9N06J15k77
54663A07607m26p34r07l05O22P62Q1m18l64l36o08p17l60J22K93L9m27o07j34
54644A03183N64O26Q0j1P86J542J463J035R00P12J03l01J02P00O32J13k05l75
54626A11649o88q33o07n62r58r85r3P85O06q5j33K76P4q15j405j155m03M12J030
54607A06110J181R27P90R30P91J55k78r9N9k38l03L24P66K93j97L93J333J070
$$ y = [117275, 116968, 117004, 117182, 117649, 118520, 119309, 119652, 120088, 121166, 122417, 123307, 124579, 127381, 131595, 136282, 141273, 146903, 152619, 157238, 160328, 162049, 162053, 159981, 156728, 153686, 150848, 147067, 142135, 137232, 133337, 130502, 128571, 127330, 125965, 123700, 120981, 118897, 117520, 116075, 114558, 113846, 114201, 114987, 115804, 116577, 116657, 115292, 113062, 111433, 110786, 110274, 109674, 109814, 110919, 112026, 112443, 112416, 111996, 110675, 108684, 107312, 107263, 107769, 107884, 107607, 107181, 106447, 105540, 105235, 105857, 106619, 106700, 106282, 105918, 105582, 104974, 104257, 103897, 104019, 104312, 104351, 103924, 103317, 103183, 103747, 104373, 104453, 104442, 105228, 106770, 108233, 109268, 110168, 110880, 110983, 110682, 110784, 111484, 112116, 112229, 112024, 111649, 110961, 110128, 109521, 108959, 108001, 107016, 106923, 107708, 108314, 108229, 108096, 108372, 108446, 107631, 106226, 105071, 104668, 105080, 106110, 107291, 108218, 109008, 109938, 110729, 110884, 110606, 110507, 110566, 110328, 110025, 110349, 111115, 111408, 111211, 111604, 112937, 114007]
54589A14007l90j673k091j995j577p27N1J04k28o9N29P25L11q5q6Q3K55M98P45
54570A08387R43J281J741J841J305M98k92j182j868j509j62Q18P06N39J230J795
54554A16071R55n87j136m97J20J34k3j34k16J77J255J974J186m83j345r26j14
54537A16411N94J406K014J704P32K04M21N66J97j63j23n8l68r25j413j551j045
54520A18603KP54M75m10q25l52M44Q66O44l1n25l04K05n2j129j759j230m99m71
54501A14406m50N19J796K102J453P74K78l21p35o06m91q68r33J37J454J559P25
54484A20799L46O08N47K1k13j00k37l82J81J025J042L86K40P16Q22M51N26J065
54466A27843R50p5r43j089j065j009k49J074J639Q92q3k74jJ15J43K23K4n31j006
$$ y = [114007, 113617, 111944, 109853, 107858, 106281, 105554, 105605, 105709, 105481, 105412, 105941, 106666, 106977, 106892, 106806, 106889, 107144, 107642, 108387, 109330, 110611, 112352, 114193, 115498, 115996, 115704, 114522, 112654, 111145, 110983, 111801, 112507, 113046, 114276, 116071, 117026, 116439, 115303, 114806, 114926, 115060, 115037, 114903, 114687, 114864, 116119, 118093, 119279, 118796, 117451, 116525, 116411, 117005, 118411, 120425, 122129, 122861, 123065, 123486, 124052, 124249, 124086, 123963, 123905, 123537, 122612, 121199, 119648, 118603, 118605, 119359, 119834, 119424, 118599, 118247, 118691, 119557, 120201, 120170, 119645, 119341, 119546, 119494, 118365, 116606, 115376, 114877, 114406, 113956, 114475, 116271, 118373, 119826, 120600, 120878, 120557, 119822, 119216, 118725, 117857, 116924, 117061, 118515, 120074, 120799, 121145, 121753, 122300, 122321, 122108, 122008, 121771, 121389, 121570, 122595, 123637, 124023, 124263, 124979, 125801, 126252, 126778, 127843, 128793, 128718, 127775, 126686, 125621, 124612, 124363, 125437, 127076, 127968, 127885, 127611, 127610, 127725, 127868, 128091, 128115, 127584, 126578]
54447A26578j263j544j538n68R38J504O04n49p64k92J10L73O55O54J43m74p22
54430A23845o32l49J59P22R36Q07P78R30Q85O03N53Q97J198J055M00p65k066k461
54412A27495j243O65J521J001M31O84J113R27M18J86J62K9j25j29j46k48j48L64
54394A32957J119J848K322K263J663J105J043J005K97o72q45j75K79J7k88o4L17
54377A44191L34L9l65q68j253j054k57N94J143J453J519J163N49J62K22N85J067
54360A49224J372J144O06O64J569K209J727J071J538K585K778K374K876M222M612
54345A80571L374J871J006r8k042l598l587k846k975m013m646m090k859j910j773
54330A52385k208k427j963j347j377j882k019j605j174q19j34O37P74L72K14K27
$$ y = [126578, 125315, 123771, 122233, 121665, 122603, 124107, 124711, 124162, 123398, 123106, 123216, 123589, 124244, 124898, 125041, 124567, 123845, 123213, 122864, 123023, 123745, 124681, 125488, 126266, 127196, 128081, 128684, 129237, 130134, 131332, 132387, 132787, 132022, 129956, 127495, 126252, 126917, 128438, 129439, 129870, 130554, 131667, 132594, 133012, 133198, 133360, 133389, 133264, 133135, 132989, 132741, 132593, 132957, 134076, 135924, 138246, 140509, 142172, 143277, 144320, 145325, 145622, 144950, 144105, 143930, 144209, 144226, 143938, 143874, 144191, 144525, 144564, 144199, 143331, 142078, 141024, 140767, 141361, 142504, 143957, 145476, 146639, 147188, 147350, 147572, 148157, 149224, 150596, 151740, 152346, 153010, 154579, 156788, 158515, 159586, 161124, 163709, 166487, 168861, 171737, 175959, 180571, 183945, 185816, 186822, 186724, 184682, 181084, 177497, 174651, 171676, 167663, 163017, 158927, 156068, 154158, 152385, 150177, 147750, 145787, 144440, 143063, 141181, 139162, 137557, 136383, 135564, 135430, 136067, 136841, 137213, 137427, 137654]
54314A37654l81j345j294j1R42N06m20o19k52k1J23M10M79Q0k59j05J65J60O8
54295A35880n2n56j219j072j0O50Q1p16m95L04M28j72m73K7Q90J608J958J765
54277A38826J121N95O40J007J156R15M19j51m82l02Q2O6k86k99J35K96p7k95J05
54258A43471O15P41P61R62J003O83M78O03M32m08j140q98l1M33J38m91r90j154
54240A45208r47o64p38j059r96l50K70L38Om00q05j028q21n11p38j317j254k11
54222A33983R65J547J713J724J409R42R92J583J784J172M69J99j76j025j694j656
54206A43931j482j720j840j231m01j15j95o0K26L14L12L90K78j23l29r7J05N2
54188A38015K21P07P28l3o99o63n99j056j255m97L64K04n54q03n62m52j44R86
$$ y = [137654, 137273, 135928, 134634, 134623, 135565, 136071, 135651, 135032, 134780, 134759, 134882, 135292, 135771, 135851, 135592, 135487, 135652, 135812, 135880, 135828, 135272, 134053, 132981, 132971, 133621, 133702, 132986, 132491, 132795, 133223, 133051, 132578, 132605, 133495, 135103, 137061, 138826, 139947, 140542, 141182, 142189, 143345, 144260, 144679, 144528, 144046, 143744, 143826, 143892, 143606, 143307, 143442, 143738, 143661, 143366, 143471, 144086, 144827, 145588, 146550, 147553, 148236, 148714, 149317, 149749, 149341, 148201, 147303, 147272, 147705, 147843, 147352, 146362, 145208, 144261, 143597, 142859, 141800, 140804, 140454, 140724, 141062, 141068, 140668, 139863, 138835, 138014, 137503, 136765, 135448, 134194, 133983, 134948, 136495, 138208, 139932, 141341, 142283, 143275, 144858, 146642, 147814, 148283, 148482, 148306, 147281, 145587, 143931, 142449, 140729, 138889, 137658, 137257, 137142, 136947, 136887, 137113, 137427, 137739, 138129, 138407, 138284, 137955, 137858, 137963, 138015, 138236, 138943, 139671, 139638, 138939, 138276, 137677, 136621, 135366, 134869, 135233, 135437, 134883, 134080, 133518, 133066, 132922, 133908]
54170A33908K187K068P45k51j73K54L73M03N65M48k44j200j950k217j827q72L8
54153A32255L59L67P78J617K109J679O45k16m15j47o8n57j130j013k41L21K30
54136A36573o3j43j93k57J30J034J649J359N85k5m78q82q40q3Q65J374J522J632
54118A43759J644J409J014M32m02r04k28J226J913J316P12J012J233L10r18r95
54102A52533j47K75m8l11k07k24n72r40j178j301j086m15L03P01R57J143Q60J71
54084A50514nP83J698J971K061K437K310R34q17j546j243p56j53R49K063K380
54068A63580K138K121K260K088J974K614L753M725N683O839P181N566K610j3j830
54053B11289l482m898n269m634l857l138k066j004p77j068p26L79J281J699K321
$$ y = [133908, 136095, 138163, 138908, 138657, 138484, 138738, 139111, 139514, 140079, 140527, 140283, 139083, 137133, 134916, 133089, 132217, 132255, 132614, 132981, 133759, 135376, 137485, 139164, 139809, 139593, 139178, 139031, 138963, 138406, 137276, 136263, 136022, 136343, 136573, 136510, 136367, 136174, 135917, 136047, 137081, 138730, 140089, 140674, 140649, 140171, 139289, 138449, 138366, 139231, 140605, 142127, 143759, 145403, 146812, 147826, 148258, 147856, 146952, 146724, 147950, 149863, 151179, 151891, 152903, 154136, 154446, 153528, 152533, 152386, 152661, 152613, 152302, 152095, 151871, 151299, 150359, 149181, 147880, 146794, 146379, 146682, 147383, 148340, 149483, 150343, 150514, 150509, 151292, 152990, 154961, 157022, 159459, 161769, 162703, 161886, 160340, 159097, 158341, 158188, 159137, 161200, 163580, 165718, 167839, 170099, 172187, 174161, 176775, 180528, 185253, 190936, 197775, 204956, 210522, 213132, 213119, 211289, 207807, 202909, 197640, 193006, 189149, 186011, 183945, 182941, 182164, 181096, 180370, 180749, 182030, 183729, 186050]
54038A86050L221L671L638L974M771N094M666M445M990N525N208M265L390K839
54024B45747K562K490K458K337K272K203J578K91o14k91L72q7j455k265k137k061
54008B53400k438k612k513l008m210n002m798m359m354m357l889l190k474j517
53994B04679n67n08j493k433k463j984j740j673j352p63j58L15M86K81Q5L34P54
53977A91800P60N98J106K310L285L571L576L408K464O64r91j638j550j471j682
53962B06210k081k466k485j929j257j151j442j268m14M25Q06J081J577K089K411
53947B00106K624K737K733K942L640M363M519M499N138O227O686O271N811N790
53933B64086N842N737N600N095L647J713M89K11R2O5J011K888M345M824N452P104
$$ y = [186050, 189271, 192942, 196580, 200554, 205325, 210419, 215085, 219530, 224520, 230045, 235253, 239518, 242908, 245747, 248309, 250799, 253257, 255594, 257866, 260069, 261647, 261938, 261324, 261033, 261405, 261318, 259863, 257598, 255461, 253400, 250962, 248350, 245837, 242829, 238619, 233617, 228819, 224460, 220106, 215749, 211860, 208670, 206196, 204679, 204112, 203604, 202111, 199678, 197215, 195231, 193491, 191818, 190466, 189703, 189545, 189860, 190346, 190627, 190712, 191046, 191800, 192560, 193158, 194264, 196574, 199859, 203430, 207006, 210414, 212878, 213542, 212551, 210913, 209363, 207892, 206210, 204129, 201663, 199178, 197249, 195992, 194841, 193399, 192131, 191717, 192142, 192948, 194029, 195606, 197695, 200106, 202730, 205467, 208200, 211142, 214782, 219145, 223664, 228163, 233301, 239528, 246214, 252485, 258296, 264086, 269928, 275665, 281265, 286360, 290007, 291720, 292209, 292420, 292512, 292577, 293588, 296476, 300821, 305645, 311097, 318201]
53917C18201R136J1008J3667J7858K2014K3267K0246J3979O601p1n056q218r808
53904D32824r975r102q273q416q931q326o411m672m093m054l822l787m269m473
53890C44220l743k953l450n208o964p752p500o655n929n957o573o845o241n215
53876B63235m335l577k941k898l524l973l518k566k014k092k407k667k783k720
53862B21220k640k783k992k887k606k631k749k196j107o46j249j841j486p40n03
53847A92164n91l82j35n48j500k177k143j565p60p1J60N9K04P06R03M02k26l72
53829A84128l50o77j040q00j44J07k96p00m07N87J661K189K110J941K049K144
53813A92502J840J342J051P79K86K07J252K737L242K775K720L485L876L291K835
$$ y = [318201, 327337, 338345, 352012, 369870, 391884, 415151, 435397, 449376, 455977, 455906, 450850, 442632, 432824, 422849, 413747, 405474, 397058, 388127, 379801, 373390, 368718, 364625, 360571, 356749, 352962, 348693, 344220, 340477, 337524, 334074, 328866, 321902, 314150, 306650, 299995, 294066, 288109, 281536, 274691, 268450, 263235, 258900, 255323, 252382, 249484, 245960, 241987, 238469, 235903, 233889, 231797, 229390, 226723, 223940, 221220, 218580, 215797, 212805, 209918, 207312, 204681, 201932, 199736, 198629, 197983, 196734, 194893, 193407, 192667, 192164, 191573, 191191, 191056, 190508, 189008, 186831, 184688, 183123, 182363, 182292, 182452, 182511, 182715, 183421, 184324, 184726, 184500, 184128, 183778, 183101, 182061, 181261, 181117, 181224, 180928, 180228, 179821, 180408, 182069, 184258, 186368, 188309, 190358, 192502, 194342, 195684, 196735, 197514, 197800, 198007, 199259, 201996, 205238, 208013, 210733, 214218, 218094, 221385, 224220]
53798B24220L427M330M547M333M190L726K710K098K618L290K784J456O48O08N91
53783B65576N20R54J723J921J263K95p18j969l203l686l293k766k691k897l130
53768B47899l567m368n089n027m088l089k897l336l316k280j107q88j328j311
53754B06208p57o67j332j842j692j536j772j714q79k5J0m25m91j46J15J39R6J67
53736A93457O79J820K842K561J103M2K86R49J026Q70J021R19Nq52m52R17J973
53719B09166K159J853J436J188J557K506L121K730J847J278J008Q29J154K237
53705B34069L289L458L018K723K685K778L252L931L800K505J358J596K531K795
53691B73788K460K459K705K421J767J406J069J73o36l19N10K75j010j750j376
$$ y = [224220, 227647, 231977, 236524, 240857, 245047, 248773, 251483, 253581, 256199, 259489, 262273, 263729, 264377, 264985, 265576, 266096, 267050, 268773, 270694, 271957, 272252, 271534, 269565, 266362, 262676, 259383, 256617, 253926, 251029, 247899, 244332, 239964, 234875, 229848, 225760, 222671, 219774, 216438, 213122, 210842, 209735, 208847, 207519, 206208, 205451, 204784, 203452, 201610, 199918, 198382, 196610, 194896, 194017, 193992, 194002, 193577, 193086, 192940, 193055, 193194, 193290, 193457, 194136, 195956, 198798, 201359, 202462, 202504, 202790, 203739, 204765, 205635, 206656, 207575, 207580, 206728, 206276, 207193, 209166, 211325, 213178, 214614, 215802, 217359, 219865, 222986, 225716, 227563, 228841, 229849, 230678, 231832, 234069, 237358, 240816, 243834, 246557, 249242, 252020, 255272, 259203, 263003, 265508, 266866, 268462, 270993, 273788, 276248, 278707, 281412, 283833, 285600, 287006, 288075, 288248, 287612, 287293, 287803, 288078, 287068, 285318, 283942]
53676B83942j133j884k808k875k250j623j169q20p93j226j793j983j505m51N47
53661B62176O58j45q78q37n37o18o42O9J001J163O59L39L02R4o0L91J065J169
53643B65369J044J664K715K774J521K93J74Q94J799K628L012K479J331N53N28
53628B88778Q12J190J896K647K707K129J835K173K503K448K452K814L254L748
53614C21386M661N669N783M894M235M687N571N809N377M967M888N005N225N436
53600C93593N325M720L819K850J863R40J78n35j314j894k072k300l130m076m032
53585C93935k893j853j801k311k539k318j994j773j725j927k290k509k420k063
53571C63519j438n46L34Q44R03N53k86j361j787r69M04J125R80O95O33N83O67
$$ y = [283942, 282809, 280925, 278117, 275242, 272992, 271369, 270200, 269380, 268587, 267361, 265568, 263585, 262080, 261629, 262176, 262834, 262689, 261811, 260974, 260437, 259819, 259177, 259246, 260247, 261410, 262069, 262408, 262710, 262804, 262744, 263135, 264200, 265369, 266413, 268077, 270792, 273566, 275087, 275380, 275554, 276448, 278247, 280875, 283887, 286366, 287697, 288250, 288778, 289590, 290780, 292676, 295323, 298030, 300159, 301994, 304167, 306670, 309118, 311570, 314384, 317638, 321386, 326047, 331716, 337499, 342393, 346628, 351315, 356886, 362695, 368072, 373039, 377927, 382932, 388157, 393593, 398918, 403638, 407457, 410307, 412170, 413110, 413288, 412753, 411439, 409545, 407473, 405173, 402043, 397967, 393935, 391042, 389189, 387388, 385077, 382538, 380220, 378226, 376453, 374728, 372801, 370511, 368002, 365582, 363519, 362081, 361535, 361869, 362713, 363616, 364169, 363883, 362522, 360735, 359766, 360170, 361295, 362275, 362970, 363603, 364186, 364853]
53554C64853J334K375K954K843K710K930L044K646K058J833K154K893L704M028
53540D02359L637L134L318M129M890N392O026O939P954R115J0456J1388J1300
53527D90037J0653J0475J0920J1355J1743J2724J4180J5049J4879J4517J4885
53516F31417J6007J7420J8741J9626K0043K0754K2489K4717K6201K6800K7446
53505H71661K8207K7879K6069K4239K3839K4432K4502K3443K1859K0539J9799
53494A136468J9523J9343J9083J9116J9849K0822K0964J9879J8231J6795J5848
53483A345921J5557J6073J7056J7746J7706J6909J5241J2661R718P079M617J914
53471A498198o72k545m268o953j0347j2981j4330j5297j6324j6664j6021j5365
$$ y = [364853, 366187, 368562, 371516, 374359, 377069, 379999, 383043, 385689, 387747, 389580, 391734, 394627, 398331, 402359, 405996, 409130, 412448, 416577, 421467, 426859, 432885, 439824, 447778, 456893, 467349, 478737, 490037, 500690, 511165, 522085, 533440, 545183, 557907, 572087, 587136, 602015, 616532, 631417, 647424, 664844, 683585, 703211, 723254, 744008, 766497, 791214, 817415, 844215, 871661, 899868, 927747, 953816, 978055, 1001894, 1026326, 1050828, 1074271, 1096130, 1116669, 1136468, 1155991, 1175334, 1194417, 1213533, 1233382, 1254204, 1275168, 1295047, 1313278, 1330073, 1345921, 1361478, 1377551, 1394607, 1412353, 1430059, 1446968, 1462209, 1474870, 1484588, 1491667, 1496284, 1498198, 1497526, 1494981, 1490713, 1483760, 1473413, 1460432, 1446102, 1430805, 1414481, 1397817, 1381796, 1366431]
53459A366431j5427j5809j6242j7356j9328k1106k1891k2201k2620k2613k1612
53448A150226k0259j9540j9407j9121j8241j6580j3983j0868q183o186m131j776
53436I91951j04K25N6M62J282J917K582L659M713N370O368Q441J0806J2051J2247
53421A062026J2855J4715J7191J9271K0590K1309K1687K1975K2418K3372K5427
53410A282836K8772L2396L4698L5375L5885L7532L9980M2312M4513M6966M9305
53399A710570N0951N2230N3767N5224N5800N5709N6045N7184N8325N8674N8237
53388B322716N7346N6110N4565N2769N0609M7878M4665M1364L8171L4733L0449
53377B831375K5068J9140J3724R395N655J563l284q854j5332k2790l0381l6919
$$ y = [1366431, 1351004, 1335195, 1318953, 1301597, 1282269, 1261163, 1239272, 1217071, 1194451, 1171838, 1150226, 1129967, 1110427, 1091020, 1071899, 1053658, 1037078, 1023095, 1012227, 1004044, 997858, 993727, 991951, 991847, 992072, 992128, 992590, 993872, 995789, 998371, 1002030, 1006743, 1012113, 1018481, 1026922, 1037728, 1049779, 1062026, 1074881, 1089596, 1106787, 1126058, 1146648, 1167957, 1189644, 1211619, 1234037, 1257409, 1282836, 1311608, 1344004, 1378702, 1414077, 1449962, 1487494, 1527474, 1569786, 1614299, 1661265, 1710570, 1761521, 1813751, 1867518, 1922742, 1978542, 2034251, 2090296, 2147480, 2205805, 2264479, 2322716, 2380062, 2436172, 2490737, 2543506, 2594115, 2641993, 2686658, 2728022, 2766193, 2800926, 2831375, 2856443, 2875583, 2889307, 2898702, 2904357, 2905920, 2902636, 2893782, 2878450, 2855660, 2825279, 2788360]
53365B788360m2320m7407n2180n5498n6862n7295n7875n8477n8595n8319n7657
53354B185875n5912n2704m8941m5850m3690m2122m1111m0646m0279l9733l9348
53343A695539l9106l7933l4988l1064k7810k5874k4696k3617k2257k0153j6954
53332A391087j3067r506p194o630p749r731j1424j2432j3303j4283j4725j4151
53320A256892j3171j2572j2203j1452j0221q711o886m878l233k078o60J491L589
53307A175907M657M886N120N590O134P144R148J1870J4559J7074J9737K2354K4248
53294A328428K5223K5831K6778K8369L0276L1472L0921K8717K6119K4058K2279
53283A628471K0249J8018J5694J2929R642O354L206m76m883q994j2018j4514j7131
$$ y = [2788360, 2746040, 2698633, 2646453, 2590955, 2534093, 2476798, 2418923, 2360446, 2301851, 2243532, 2185875, 2129963, 2077259, 2028318, 1982468, 1938778, 1896656, 1855545, 1814899, 1774620, 1734887, 1695539, 1656433, 1618500, 1583512, 1552448, 1524638, 1498764, 1474068, 1450451, 1428194, 1408041, 1391087, 1378020, 1368514, 1361320, 1354690, 1346941, 1337210, 1325786, 1313354, 1300051, 1285768, 1271043, 1256892, 1243721, 1231149, 1218946, 1207494, 1197273, 1188562, 1181676, 1176798, 1173565, 1171487, 1170827, 1172318, 1175907, 1180564, 1185450, 1190570, 1196160, 1202294, 1209438, 1218586, 1230456, 1245015, 1262089, 1281826, 1304180, 1328428, 1353651, 1379482, 1406260, 1434629, 1464905, 1496377, 1527298, 1556015, 1582134, 1606192, 1628471, 1648720, 1666738, 1682432, 1695361, 1705003, 1711357, 1714563, 1714087, 1709204, 1700210, 1688192, 1673678, 1656547]
53270A656547j9336k0613k1813k3908k6236k7527k7969k8665k9643l0060l0019
53259A370758l0460l1347l1594l0858l0039k9767k9635k9140k8330k7383k6420
53248A045785k5797k5725k5706k5158k4427k4199k4167k3347k1629j9891j8585
53237G87154j7300j5792j4363j3063j1457r463p677o595o110n914n918o195o882
53224F60425q078r537j0733j1583j2596j3939j4986j5318j5397j5549j5151j3758
53212E03800j2165j1299j0814r997r199r037q915p984o974p270q562r185q720
53199C83679q395q840r156q653p858p317o792o189n994o242o100n100l824k976
53185B90243k663k802l379l914l642k624j810j701j752j364p04k12o7l96j209
$$ y = [1656547, 1637211, 1616598, 1594785, 1570877, 1544641, 1517114, 1489145, 1460480, 1430837, 1400777, 1370758, 1340298, 1308951, 1277357, 1246499, 1216460, 1186693, 1157058, 1127918, 1099588, 1072205, 1045785, 1019988, 994263, 968557, 943399, 918972, 894773, 870606, 847259, 825630, 805739, 787154, 769854, 754062, 739699, 726636, 715179, 705716, 698039, 691444, 685334, 679420, 673502, 667307, 660425, 652347, 642810, 632077, 620494, 607898, 593959, 578973, 563655, 548258, 532709, 517558, 503800, 491635, 480336, 469522, 459525, 450326, 441289, 432374, 424390, 417416, 410146, 401584, 392399, 383679, 375284, 366444, 357288, 348635, 340777, 333460, 326668, 320479, 314485, 308243, 302143, 297043, 293219, 290243, 287580, 284778, 281399, 277485, 273843, 271219, 269409, 267708, 265956, 264592, 263888, 263676, 263609, 263213, 262004]
53170B62004j991k036j365o75l13q5m2n16j294j653j475j400j735k032j987j918
53154B41487k047k073j733j212o97j71K48K83l6l24l11J7N79J068J004M06k1J01
53136B36568K06j19k39M01J033P79K61N24R82K67j219j649n43O01P20L49J03k62
53118B38763o98n00L21P26L98L45J142J942J885J275O85J19l58l63k32j016k692
53101B41742l619k659p74K99L1r22j752j831r46R6Q2r40j553j094n07n08l27P21
53083B25539J718J520N79Q7Q2k27r30j381j373j145o73J10O30K31p91j449j251
53066B21276n18J93M46L8p44j239j187j031j157j305j105o71l08j09j74n90r20
53049B10895m23Q40J862J998J673J409J011K60m68q40j104j388j280o94l24n25
$$ y = [262004, 260013, 257977, 256612, 255937, 255624, 255539, 255497, 254981, 253687, 252034, 250559, 249159, 247424, 245392, 243405, 241487, 239440, 237367, 235634, 234422, 233725, 233554, 233802, 234085, 234049, 233725, 233414, 233431, 234010, 235078, 236082, 236488, 236467, 236568, 236774, 236655, 236416, 236817, 237850, 238629, 238890, 239414, 240396, 240663, 239444, 237795, 237252, 237853, 238573, 238922, 239025, 238763, 238065, 237565, 237886, 238612, 239010, 239355, 240497, 242439, 244324, 245599, 246284, 246403, 246045, 245682, 245450, 244434, 241742, 238123, 235464, 234690, 234989, 235020, 234098, 232346, 230515, 229569, 229665, 229747, 228807, 227254, 226160, 225653, 225145, 224818, 225539, 227257, 228777, 229356, 229443, 229525, 229298, 228368, 226987, 225614, 224469, 223796, 223906, 224536, 224767, 223976, 222527, 221276, 220758, 220951, 221397, 221435, 220691, 219452, 218265, 217234, 216077, 214772, 213667, 212996, 212688, 212579, 212405, 211815, 210895, 210472, 211312, 213174, 215172, 216845, 218254, 219265, 219525, 219057, 218217, 217113, 215725, 214445, 213751, 213427, 212902]
53033B12902n98M9Q58J042Q28Q68J075R48N57K64pm25n71QQ58J079M55m21r63
53014B18806r35l56M34R00R25R45J184J302J176J284J770J893J117P7k83oK56
52997B30489L59N38O49L86K9J45O72R74O79j3p11j084r03k69M03Q66J237J518
52979B35964J388P54M7l00k76O0P42J606K323K915L511L619K575R10J81R47K011
52962B58977K142J518P88r8j225j921j622q44l64j91r1l50j080j590j371r86j094
52945B50598j369j315j342j917k398j973j076p03q12o15o9J90J6k75p31j450j784
52928B32975j049J98O65Pr76j580j650j109o6P35O47J54J78N95M45m91j400j668
52910B26610j441r21j28O05P65M34J94K61L34K62J57q1o32j269j596j638j563
$$ y = [212902, 212304, 212353, 213211, 214253, 215081, 215949, 217024, 217972, 218529, 218793, 218786, 218361, 217790, 217798, 218656, 219735, 220190, 219769, 218806, 217871, 217515, 217949, 218849, 219774, 220719, 221903, 223205, 224381, 225665, 227435, 229328, 230445, 230522, 230239, 230233, 230489, 230848, 231386, 232035, 232421, 232450, 232595, 233267, 234241, 234920, 234907, 234196, 233112, 232209, 231940, 232343, 233209, 234446, 235964, 237352, 238106, 238153, 237853, 237577, 237637, 238379, 239985, 242308, 245223, 248734, 252353, 254928, 255838, 256019, 256966, 258977, 261119, 262637, 263425, 263327, 262102, 260181, 258559, 257715, 257351, 257160, 257069, 256719, 255639, 254049, 252678, 251692, 250598, 249229, 247914, 246572, 244655, 242257, 240284, 239208, 238505, 237693, 237078, 237009, 237199, 237215, 236940, 236209, 234759, 232975, 231926, 232124, 232789, 232796, 231820, 230240, 228590, 227481, 227415, 228150, 228797, 228951, 229129, 229724, 230169, 229678, 228278, 226610, 225169, 224248, 224120, 224725, 225490, 225924, 226118, 226379, 226713, 226975, 227132, 227051, 226419, 225150, 223554, 221916, 220353]
52893B20353j142k14P06J001Q75R07J052R46Q17J134J598J534J053Q09Q33O19
52877B32881K57K74N48M06j31l27QL37N10R08J381J158J24q61j238j318j294o95
52859B32928O53J972K489K353K129J929J568J070N81M5o27j387k155k820l095
52844B37633k777k192j969k279k706k836k666k369k112k000j903j452o06L9M1
52829B09846j25K58R82J173O62K35M55J011J263Q86j22j391k120j700n20L35K47
52812B11375m53j095j191n72M19R37N32j21M6J100K200K837L174L165K306N30
52796B25189j436k834l447l323k604j767j326j133n91K48N12k53j320j589q28
52781B03498K70R82J181J220J366J393Q64j21q24o85Q1R44J644J961J507L70n50
$$ y = [220353, 219211, 218997, 219703, 220704, 221579, 222486, 223538, 224484, 225301, 226435, 228033, 229567, 230620, 231429, 232262, 232881, 233138, 233412, 233960, 234366, 234235, 233908, 233916, 234253, 234763, 235671, 237052, 238210, 238334, 237473, 236235, 234917, 233623, 232928, 233581, 235553, 238042, 240395, 242524, 244453, 246021, 247091, 247672, 247717, 247090, 245703, 243548, 240728, 237633, 234856, 232664, 230695, 228416, 225710, 222874, 220208, 217839, 215727, 213727, 211824, 210372, 209766, 209805, 209846, 209721, 209979, 210961, 212134, 212796, 213031, 213486, 214497, 215760, 216646, 216524, 215133, 213013, 211313, 210793, 211128, 211375, 210922, 209827, 208636, 208064, 208483, 209420, 209952, 209831, 209877, 210977, 213177, 216014, 219188, 222353, 224659, 225189, 223753, 220919, 217472, 214149, 211545, 209778, 208452, 207319, 206728, 206976, 207488, 207235, 205915, 204326, 203498, 203768, 204750, 205931, 207151, 208517, 209910, 210774, 210653, 209829, 209144, 209225, 210169, 211813, 213774, 215281, 215651, 215101]
52764B15101n78k47n22j369j911j713j017n9R53J379O98n14j026m47M98J077J155
52747B11458Q15K22j11K41Q85J073P99P07R56J087R34Q11P89O43N54J026K038
52730B24927K954L321L116K313J023p6l39n6J4k20l59n38j104j569j212n40q01
52713B30854j882k230j164J35L95k11q45j114r02j04P70P46l10j302j312o04J93
52696B21113Q82J262R19L7m69k40L2p3J11J070J936J561J28j158j533j114l18
52679B24146M30O84L45j78m72n62n34k08N20J303J644J377P07R1l3J99M8p89j412
52660B27306q24M93J205J042Q91J038Q82M76P80J859K484K166K062K906L504K498
52644B50768M25j182j843k035j947j556j316j566j774j440j071j279j514r33Q9
$$ y = [215101, 214523, 214276, 213754, 212385, 210474, 208761, 207744, 207685, 208638, 210017, 210715, 210201, 209175, 208728, 209226, 210303, 211458, 212273, 212495, 212384, 212625, 213510, 214583, 215382, 216089, 217045, 218132, 219066, 219877, 220666, 221309, 221863, 222889, 224927, 227881, 231202, 234318, 236631, 237654, 237578, 237239, 237183, 237197, 236977, 236618, 236080, 234976, 233407, 232195, 231655, 230854, 228972, 226742, 225578, 225713, 226108, 225897, 225052, 223938, 223036, 222932, 223702, 224448, 224138, 222836, 221524, 220920, 221113, 221995, 223257, 224176, 224213, 223744, 223504, 223536, 223463, 223574, 224644, 226580, 228141, 228269, 227111, 225578, 224464, 224146, 224576, 225260, 225605, 225427, 224955, 224393, 223859, 223651, 224171, 225474, 227118, 228495, 229202, 229293, 229260, 229459, 229507, 228718, 227306, 226482, 226975, 228180, 229222, 230113, 231151, 232033, 232509, 233289, 235148, 237632, 239798, 241860, 244766, 248270, 250768, 251193, 250011, 248168, 246133, 244186, 242630, 241314, 239748, 237974, 236534, 235463, 234184, 232670, 231737, 231826]
52629B31826N35M23N58R96J132J139J873L231L895L107J622M20n68j813l015l374
52613B41987k745j848j295r06j40J001J856J918J382P59J95m15q70q24l40K01
52597B39916O88J206J434Q86k12j068j382j508j448p07O18J572J591J128O62L0
52581B43406p15q05J43J294J660J374J230J524J975K225J802K32k125l867l860
52566B45493k337l76J133J627Q87m27j053o29j74n25j179j348j249j368j352p64
52550B36359j56k48o50n11N7L53L41M50N53L02M6K61M74m3q42q59j35K52q4m66
52530B35454m43k67k9N31J172J210N98Q2Q9L38O01R70J261J071N89M96R08J215
52512B45846J102R28J005J262J743K591L454L716L442L260L222K713J592M33n94
$$ y = [231826, 232361, 232784, 233342, 234338, 235470, 236609, 238482, 241713, 245608, 248715, 250337, 250757, 250189, 248376, 245361, 241987, 239242, 237394, 236099, 235193, 235053, 236054, 237910, 239828, 241210, 241969, 242164, 241749, 240879, 240055, 239715, 239916, 240604, 241810, 243244, 244130, 243918, 242850, 241468, 239960, 238512, 237805, 238423, 239995, 241586, 242714, 243376, 243406, 242691, 241886, 242029, 243323, 244983, 246357, 247587, 249111, 251086, 253311, 255113, 255345, 253220, 249353, 245493, 243156, 242780, 243913, 245540, 246427, 246000, 244947, 244318, 244144, 243619, 242440, 241092, 239843, 238475, 237123, 236359, 236203, 235955, 235305, 234794, 234851, 235204, 235545, 235995, 236548, 236850, 236896, 237157, 237631, 237588, 236746, 235887, 235752, 236004, 235920, 235454, 235011, 234744, 234715, 235246, 236418, 237628, 238226, 238308, 238397, 238735, 239336, 240306, 241567, 242638, 243227, 243723, 244631, 245846, 246948, 247876, 248881, 250143, 251886, 254477, 257931, 261647, 265089, 268349, 271571, 274284, 275876, 276309, 275715]
52497B75715j980l630m516m149l416l232l192k484j373p49o88n12n9J18j44k94
52481B45415QL15J75j01R4P55J337J575J660J660J285N59J39M89J050Q86O4l61
52463B57004K22J249K007K556L155L444K955K042J481J308P77m95j950k760k730
52448B70265k380k376k864l307l072k284j740j799j883j444q60q17j175j255r88
52433B42021r11j071q46p3M37K1p01m32J117K720K947J742L73j05J39L97N61R68
52415B49304J499J642J390J230J136O07p7K94K157M316N516O083P121Q830J0507
52400C01555J1663J2007J0749P140J783l478p028q401q019o754n571m874m266
52387B96506l326k355j843j657j375j025q20n94k11K0R9Q51K659M323M432L417
$$ y = [275715, 273735, 270105, 265589, 261440, 258024, 254792, 251600, 249116, 247743, 246994, 246306, 245794, 245735, 245853, 245709, 245415, 245423, 245738, 245913, 245812, 245906, 246661, 247998, 249573, 251233, 252893, 254178, 254737, 254876, 255365, 256415, 257301, 257365, 257004, 257226, 258475, 260482, 263038, 266193, 269637, 272592, 274634, 276115, 277423, 278200, 277705, 275755, 272995, 270265, 267885, 265509, 262645, 259338, 256266, 253982, 252242, 250443, 248560, 247116, 246256, 245439, 244264, 243009, 242021, 241110, 240039, 239193, 239120, 239557, 239578, 238877, 238445, 239562, 242282, 245229, 246971, 247344, 247239, 247378, 247775, 248336, 249304, 250803, 252445, 253835, 255065, 256201, 256808, 256731, 257025, 259182, 263498, 269014, 275097, 282218, 291048, 301555, 313218, 325225, 335974, 343114, 344897, 341419, 334391, 325990, 317971, 311217, 305646, 300772, 296506, 293180, 290825, 288982, 287325, 285950, 284925, 284105, 283511, 283300, 283320, 283419, 284270, 286929, 291252, 295684, 299101]
52371B99101K929L444M010M173M551N314N716N551N593N964N468L395Q56o71j149
52356C54245j451j799j859j731j768j737j063J60J212J732J967K164K309K547
52342C54928L210M243N051N177M875M793N261O103P023P940Q898R948J1196J2781
52328D51427J4506J5747J6143J6258J7047J8589K0045K1021K2206K4214K6391
52317F63594K7490K7146K6119K5269K4865K4560K3668K1770J9471J8162J8464
52306I20578J9363J9456J8560J7367J6081J4374J2365J0638R355Q176P013O027
52294A079353M941L262J067j132l355o044r029j1481j2998j3904j4357j4007j2743
52281I89573j1068r486q087o819n552l822j280J587L915N743P944J0720J3047
$$ y = [299101, 302030, 305474, 309484, 313657, 318208, 323522, 329238, 334789, 340382, 346346, 351814, 355209, 356065, 355394, 354245, 352794, 350995, 349136, 347405, 345637, 343900, 342837, 342997, 344209, 345941, 347908, 350072, 352381, 354928, 358138, 362381, 367432, 372609, 377484, 382277, 387538, 393641, 400664, 408604, 417502, 427450, 438646, 451427, 465933, 481680, 497823, 514081, 531128, 549717, 569762, 590783, 612989, 637203, 663594, 691084, 718230, 744349, 769618, 794483, 819043, 842711, 864481, 883952, 902114, 920578, 939941, 959397, 977957, 995324, 1011405, 1025779, 1038144, 1048782, 1058137, 1066313, 1073326, 1079353, 1084294, 1087556, 1088623, 1087491, 1084136, 1078092, 1069063, 1057582, 1044584, 1030680, 1016323, 1002316, 989573, 978505, 969019, 960932, 954113, 948561, 944739, 943459, 945046, 948961, 954704, 962648, 973368, 986415]
52268I86415J4118J4549J5553J7386J9144J9852J9356J8297J7411J6813J6005
52257A174899J4665J3207J2178J1472J0576R361Q060O721N325M136L237J918o29
52244A275126m197p884j1294j4581j7479j9379k0352k1156k2074k2592k2331k1446
52232A070361k0158j8724j7806j7856j8106j7261j5260j3256j1829j0478r040
52221I00587q217q170p912o802n482m630l814k462r88k3O89J729K852L340L150
52206H63847K955L317M263N371N889N216L644K151J282P37K86K55P51J210J255
52191I02429J276J614J916J895J986K530K969K681K034J791J888J619P40l65j442
52176I25561k572l763m903o054p264q190q334p619o398n092l978l125k339j348
$$ y = [986415, 1000533, 1015082, 1030635, 1048021, 1067165, 1087017, 1106373, 1124670, 1142081, 1158894, 1174899, 1189564, 1202771, 1214949, 1226421, 1236997, 1246358, 1254418, 1261139, 1266464, 1270600, 1273837, 1275755, 1275126, 1270929, 1263045, 1251751, 1237170, 1219691, 1200312, 1179960, 1158804, 1136730, 1114138, 1091807, 1070361, 1050203, 1031479, 1013673, 995817, 977711, 960450, 945190, 931934, 920105, 909627, 900587, 892370, 884200, 876288, 869486, 864004, 859374, 855560, 853098, 852110, 852087, 852776, 854505, 857357, 860697, 863847, 866802, 870119, 874382, 879753, 885642, 890858, 894502, 896653, 897935, 898672, 898958, 899213, 899964, 901174, 902429, 903705, 905319, 907235, 909130, 911116, 913646, 916615, 919296, 921330, 923121, 925009, 926628, 927368, 927003, 925561, 922989, 919226, 914323, 908269, 901005, 892815, 884481, 876862, 870464, 865372, 861394, 858269, 855930, 854582]
52162H54582k65M92Q87J452K555L870M892N600O236O662O331M867K597N41k76
52147I01023J81Q67Q88N41O71J315J881K354L314M718N710N911N945O413P161
52132I48893P882Q612R370J0165J1564J4318J8046K1315K3427K5238K7704L0575
52120A157109L3119L5206L6989L8228L8690L8600L8184L7226L5507L3138L0198
52109A552194K6702K3024J9576J5936J1359O306K224n43l210o476r445j1315j2595
52096A613737j3719j3977j3048j2223j2688j3741j4180j4324j5089j6092j6423
52085A458233j6604j7873j9939k1140k0664j8997j6466j2888q709m963j949R05
52073A298946L766O191Q193J0368J2785J4787J6064J7014J7979J8872J9599K0059
$$ y = [854582, 854317, 854809, 855696, 857148, 859703, 863573, 868465, 874065, 880301, 886963, 893294, 898161, 900758, 901299, 901023, 901204, 902071, 902959, 903500, 904171, 905486, 907367, 909721, 913035, 917753, 923463, 929374, 935319, 941732, 948893, 956775, 965387, 974757, 984922, 996486, 1010804, 1028850, 1050165, 1073592, 1098830, 1126534, 1157109, 1190228, 1225434, 1262423, 1300651, 1339341, 1377941, 1416125, 1453351, 1488858, 1521996, 1552194, 1578896, 1601920, 1621496, 1637432, 1648791, 1655097, 1657321, 1656778, 1653568, 1647092, 1637647, 1626332, 1613737, 1600018, 1586041, 1572993, 1560770, 1548082, 1534341, 1520161, 1505837, 1490748, 1474656, 1458233, 1441629, 1423756, 1403817, 1382677, 1362013, 1343016, 1326550, 1313662, 1304953, 1299990, 1298041, 1298946, 1302712, 1308903, 1317096, 1327464, 1340249, 1355036, 1371100, 1388114, 1406093, 1424965, 1444564, 1464623]
52061A464623J9812J8543J6822J5611J5031J4350J2967J0737P643M068J106m78
52049A600835j404l100n816q504j0392j1774j3263j5227j7890k1122k4097k6041
52037A442205k7247k8506k9761l0212k9595k8377k6764k4613k2269k0409j8951
52026A155501j7102j4671j2338j0558r173q220q157q978j0010j0749j1224j1361
52014A022960j0898j0013r336r102r031r001r087r135r085r638j1496j3973j5559
52001H87606j5892j6011j6525j6793j6357j5829j5838j6088j6120j6003j5697
51990G10453j4611j2559j0307q575p191n825m781m377m226l859l506l587m040
51977F23009m725n948p811r562j0423j0729j1405j2516j3115j2548j1222r890
$$ y = [1464623, 1484435, 1502978, 1519800, 1535411, 1550442, 1564792, 1577759, 1588496, 1596139, 1600207, 1601313, 1600835, 1599431, 1596331, 1590515, 1582011, 1571619, 1559845, 1546582, 1531355, 1513465, 1492343, 1468246, 1442205, 1414958, 1386452, 1356691, 1326479, 1296884, 1268507, 1241743, 1217130, 1194861, 1174452, 1155501, 1138399, 1123728, 1111390, 1100832, 1091659, 1083439, 1075282, 1066304, 1056294, 1045545, 1034321, 1022960, 1012062, 1002049, 992713, 983611, 974580, 965579, 956492, 947357, 938272, 928634, 917138, 903165, 887606, 871714, 855703, 839178, 822385, 806028, 790199, 774361, 758273, 742153, 726150, 710453, 695842, 683283, 672976, 664401, 657210, 651385, 646604, 642227, 638001, 634142, 630636, 627049, 623009, 618284, 612336, 604525, 594963, 584540, 573811, 562406, 549890, 536775, 524227, 513005, 503115]
51965E03115q636o868m195j084J512L175M451O070P919R276R823R885R634Q726
51951E52803O909M473J846p88l271n253o530p203p314o626n021k892q76P00K105
51936E23062M016O870J0202J2806J3928J4035J3959J3653J2423J0048O919L155
51924F45076j385o202j0206j2918j4847j6425j7285j6982j5768j4274j2882j1661
51912D94241j0406q598n866k670O6K106M092O428Q642R949R802P775L871p59m245
51897E14428n662n657n087l944k087j42J111J561J226m89m022q479j2148j4024
51883D56585j4189j3032j0827q125n695l921k591j352o6J282K629L803M669N333
51869D14503N937O322O150N467M825M690M758M128K288k11k336l764n057o516
$$ y = [503115, 494479, 487611, 483416, 482332, 483844, 487019, 491470, 497540, 505459, 514735, 524558, 534443, 544077, 552803, 559712, 564185, 566031, 565243, 561972, 556719, 550189, 542986, 535672, 529046, 524025, 521133, 520257, 520957, 523062, 527078, 533948, 544150, 556956, 570884, 584919, 598878, 612531, 624954, 635002, 641921, 645076, 643691, 637489, 627283, 614365, 599518, 583093, 565808, 548826, 533058, 518784, 505902, 494241, 483835, 475237, 469371, 466701, 466767, 468873, 472965, 479393, 488035, 497984, 507786, 515561, 519432, 518673, 514428, 508766, 503109, 498022, 494078, 491991, 491849, 492960, 494521, 495747, 495258, 491236, 482757, 470609, 456585, 442396, 429364, 418537, 410412, 404717, 400796, 398205, 396853, 396787, 398069, 400698, 404501, 409170, 414503, 420440, 426762, 432912, 438379, 443204, 447894, 452652, 456780, 459068, 458857, 456521, 452757, 447700, 441184]
51855D41184p415o885n099k978j043P92K494L805M748N497N713M834L074J380
51841D50101K14q82k364l998n401o452p003o837o248o009o361o618o075m757l062
51826C78248j254L78J458J942K101J922J181J48n79j109k172l654m373l720k547
51811C67970j729r74J33R68R12P04J473K944L850L754L270K673J595J06j030j437
51795C85182j530j606j411q13k77k91r12j954l100l774l536k900l017m229n385
51780C50447n054l052m12J785L090L482L063K107J071L49N8R2K74M81P58J415
51764C59954K787M783O753Q056Q715R220R749J0006R843R487Q837P179M140M77
51750D59986k746n350p698r547j0217r815r229q767p821o123m347l115k240j362
$$ y = [441184, 433769, 426884, 421785, 418807, 417764, 418556, 421050, 424855, 429603, 435100, 440813, 445647, 448721, 450101, 450315, 449433, 447069, 443071, 437670, 431218, 424215, 417378, 411130, 405121, 398760, 392142, 386067, 381310, 378248, 376994, 377372, 378830, 380772, 382873, 384795, 385976, 386124, 385545, 384436, 382264, 378610, 374237, 370517, 367970, 366241, 365267, 365400, 366368, 367280, 367984, 369457, 372401, 376251, 380005, 383275, 385948, 387543, 387649, 386619, 385182, 383652, 382046, 380635, 379822, 379545, 379254, 378342, 376388, 373288, 369514, 365978, 363078, 360061, 355832, 350447, 345393, 342341, 341929, 343714, 346804, 350286, 353349, 355456, 356527, 356876, 356934, 357026, 357300, 357781, 358539, 359954, 362741, 367524, 374277, 382333, 391048, 400268, 410017, 420023, 429866, 439353, 448190, 455369, 459509, 459986, 457240, 451890, 444192, 434645, 424428, 414613, 405384, 396617, 388796, 382673, 378326, 375211, 372971, 371609]
51736C71609n25L87J978M439P010Q915J0179J0858J0258P850M567K121J261J497
51722D42404K315L675N144N456L469o09n179q377r315q409o599m447k206m79j08
51707D16735j191k864m343n565o484o468n034k608J28L114O253Q317P708M500
51693D12198Q42j121j299j258k063l012k585m45J861K430R70j180k839m079n374
51678C93046o488o760n990m509k698q86N10J262J659K207L180M554O136P629Q894
51663D01746J0256J2044J3686J3902J2058Q688M432o44o126j0567j2633j2447
51651D34395j1052q990o167k690J064M828Q111R741Q706N391J296k307m923o445
51637D30958p055p349p759p985p634p163p313p855p804o836n520m121k285j01
$$ y = [371609, 371084, 371471, 373449, 377888, 384898, 393813, 403992, 414850, 425108, 432958, 437525, 439646, 440907, 442404, 444719, 448394, 453538, 458994, 462463, 461854, 456675, 448298, 438983, 430574, 423975, 419528, 417322, 416843, 416735, 415544, 412680, 408337, 402772, 396288, 389820, 384786, 382178, 382306, 385420, 391673, 399990, 407698, 412198, 413040, 411919, 410620, 409362, 407299, 404287, 401702, 401257, 403118, 405548, 406518, 405338, 402499, 398420, 393046, 386558, 379798, 373808, 369299, 366601, 365715, 366225, 367487, 369146, 371353, 374533, 379087, 385223, 392852, 401746, 412002, 424046, 437732, 451634, 463692, 472380, 476812, 476168, 470042, 459475, 446842, 434395, 423343, 414353, 408186, 405496, 406560, 411388, 419499, 429240, 437946, 443337, 444633, 442326, 437403, 430958, 423903, 416554, 408795, 400810, 393176, 386013, 378700, 370845, 363041, 356205, 350685, 346564, 344279, 344178]
51623C44178J445J701J310J375K004K216J189p02k108k003p70J64n1q23j087o40
51607C47398Q5R94K215L240L189K028P16K5j44j22J27P24J595K637L838N097O417
51590C80059Q140J0295J1738J0773O927J575l356o736q290q173o962n452l982
51577C86556k405q29K88J057K454N101Q362J1208J3387J5039J5798J5346J4637
51564D85999J5371J7856K0229K0234J7448J3465J0455R961J2575J7785K4058K9759
51552F95195L4255L7686L9414L7445L0237J8872O601l936j2381j9590k5834l0584
51540H07380l3498l4798l4880l4097l2793l1100k8762k5554k1730j7893j4588
51529D97687j2286j1226j0886j0081q224o225n392n644n656m723l617l370l901
$$ y = [344178, 345623, 347324, 348634, 350009, 352013, 354229, 355418, 354716, 352608, 350605, 349835, 349999, 349948, 349125, 348038, 347398, 347483, 348477, 350692, 353932, 357121, 359149, 359865, 359890, 359746, 359624, 359751, 360475, 362070, 364707, 368545, 373642, 380059, 388199, 398494, 410232, 421005, 427932, 429507, 426151, 419415, 411125, 402952, 395990, 390538, 386556, 384151, 383322, 383610, 384667, 387121, 392222, 400584, 411792, 425179, 440218, 456016, 471362, 485999, 501370, 519226, 539455, 559689, 577137, 590602, 601057, 611018, 623593, 641378, 665436, 695195, 729450, 767136, 806550, 843995, 874232, 893104, 899705, 895769, 883388, 863798, 837964, 807380, 773882, 739084, 704204, 670107, 637314, 606214, 577452, 551898, 530168, 512275, 497687, 485401, 474175, 463289, 453208, 444984, 438759, 433367, 427723, 422067, 417344, 413727, 410357, 406456]
51516D06456m263l820k822j998j824k052j938j093L9Q39J395K289L556M450M312
51501D03526L177J435n72k401l500l680l369l100k975k821k633k539k493k174
51487C75881j336j19R40J348J099O36K58k48j227k582l785m441m591m545m542
51472C52746m513m177l478k897k959l393l328k495j671j503j582j224o89p53j382
51457C16702j720j314o29k78l47n19l96K52J152J608J423J429K506M331N932P189
51441C37321Q770J0707J2268J3401J4959J6865J7200J4126Q163J705l232n952
51429D46301o356m588j703K89k36l191o948r731j0753j0285q996p389n700m055
51415C66659k637j683j330j413j431r27J20J455L038M854O305O414N073L442K653
$$ y = [406456, 402193, 398373, 395551, 393553, 391729, 389677, 387739, 386646, 386685, 387524, 388919, 391208, 394764, 399214, 403526, 406703, 408138, 407566, 405165, 401665, 397985, 394616, 391516, 388541, 385720, 383087, 380548, 378055, 375881, 374545, 374426, 375366, 376714, 377813, 378449, 378707, 378459, 377232, 374650, 370865, 366424, 361833, 357288, 352746, 348233, 344056, 340578, 337681, 334722, 331329, 328001, 325506, 323835, 322332, 320750, 319526, 318837, 318084, 316702, 314982, 313668, 313039, 312761, 312414, 311895, 311499, 311751, 312903, 314511, 315934, 317363, 319869, 324200, 330132, 337321, 346091, 356798, 369066, 382467, 397426, 414291, 431491, 445617, 453780, 455485, 452253, 446301, 439945, 435357, 433654, 433943, 433707, 430516, 423568, 413837, 403084, 392799, 383803, 376414, 370714, 366659, 364022, 362339, 361009, 359596, 358165, 357238, 357358, 358813, 361851, 366705, 373010, 379424, 384497, 387939, 390592]
51400C90592K489K023J083L52K12K66P6l18o32n70J79J625L187M195M679N111
51384D14549N605N982O665Q626J2252J6805K1311K5463K9419L3232L6917M0800
51372F57626M5350N0344N4130N3926M7755L6546K3893J2935L817n194j4719k3577
51360I42832l0754l6521m1278m4537m5753m5229m3572m0912l7307l3343k9651
51349E13975k6214k2714j9232j6167j3620j1338r135p104n545m734m650m828m780
51336C63914m512m334m206l804l159k733k719k762k500j906j126m46m15j347k614
51321C25331l115k601j900j684j731j622j409j223q32o9Q13J530K121K656L039
51306C19304L314L600L618K923J768J068J185J470J340J032R50R00N36p8q46j913
$$ y = [390592, 393081, 395104, 396187, 396539, 396751, 397017, 397093, 396775, 396143, 395573, 395752, 397377, 400564, 404759, 409438, 414549, 420154, 426136, 432801, 441427, 453679, 470484, 491795, 517258, 546677, 579909, 616826, 657626, 702976, 753320, 807450, 861376, 909131, 945677, 969570, 982505, 986322, 981128, 966409, 942832, 912078, 875557, 834279, 789742, 743989, 698760, 655188, 614276, 576969, 543626, 513975, 487761, 465047, 445815, 429648, 416028, 404690, 395555, 388451, 382906, 378172, 373522, 368694, 363914, 359402, 355068, 350862, 347058, 343899, 341166, 338447, 335685, 333185, 331279, 330153, 329707, 329292, 327945, 325331, 322216, 319615, 317715, 316031, 314300, 312678, 311269, 310046, 309214, 309145, 309958, 311488, 313609, 316265, 319304, 322618, 326218, 329836, 332759, 334527, 335595, 336780, 338250, 339590, 340622, 341572, 342472, 343008, 342930, 342084, 340171]
51290C40171l071l592l237k792k957l239k714j444k98L25Q84J888L329M814N853
51275C33920O093N618M799L679J929k78j900k099j246l70R5M21Q41J379K177L290
51259C58348M190M018K516L92j297j985j938j882k270k842l075l008l132l555
51245C44480l810l617l150k438j234K15J041R31O24P58Q81L33n99j250j699k397
51229C29069l010k693j479m55m19j031j431j253q00n18m65k94K15P33Q75R64J654
51212C19662K696K955J960O27o7j96q3P06K489M346N035M651M307M436M477M014
51196C62015L215K228J083R2n18j246k621m047m343l402k310j791j601j546j892
51181C43316k385k149j032j72l86r59p45J69P96P84O71Q45J033R25O50M54L56
$$ y = [340171, 337100, 333508, 330271, 327479, 324522, 321283, 318569, 317125, 316827, 317152, 318036, 319924, 323253, 328067, 333920, 340013, 345631, 350430, 354109, 356038, 355760, 353860, 351761, 350515, 350145, 350240, 350661, 351502, 352881, 355058, 358348, 362538, 366556, 369072, 369464, 368167, 366182, 364244, 362362, 360092, 357250, 354175, 351167, 348035, 344480, 340670, 337053, 333903, 331465, 330231, 330446, 331487, 332418, 333042, 333800, 334681, 335014, 334415, 333165, 331466, 329069, 326059, 323366, 321887, 321432, 321013, 319982, 318551, 317298, 316498, 315980, 315515, 315221, 315436, 316169, 317044, 318008, 319662, 322358, 325313, 327273, 327900, 327833, 327637, 327554, 328260, 330749, 335095, 340130, 344781, 349088, 353524, 358001, 362015, 365230, 367458, 368541, 368633, 368115, 366869, 364248, 360201, 355858, 352456, 350146, 348355, 346754, 345208, 343316, 340931, 338782, 337750, 337578, 337192, 336233, 335488, 335657, 336453, 337237, 337908, 338753, 339786, 340711, 341361, 341815, 342171]
51164C42171L42O14J391K502L374L551L216K998L166L249K713J801J220J095P70
51149C74173j94j304j750j346n98m6J49J21R2K18L63J52n94j532k125k286k389
51132C61104k622k649k148j410j038j136j235j049q53p90l23J099L062M431M526
51117C58969L539K006L90p30p96J22J325K235K832L191L176K815K511K587K948
51102C87120L428M026M570M600L909K891K111J769J676J463P22n18j504j472p36
51087D14055l28n08n00N6M30J3o70q19m34Q4O14R20M40o81j233m91N30M72l47
51068D11603n17L60J408K017K443K908L286L770M910O989J0021J4067J8510K1201
51054E02976J9784J4311P641K901J327K693O514J1864J6664J8456J6482J2686
$$ y = [342171, 342513, 343127, 344518, 347020, 350394, 353945, 357161, 360159, 363325, 366574, 369287, 371088, 372308, 373403, 374173, 373979, 372675, 370925, 369579, 368981, 368935, 369084, 369205, 369297, 369515, 369878, 370030, 369436, 367904, 365779, 363493, 361104, 358482, 355833, 353685, 352275, 351237, 350101, 348866, 347817, 346964, 346174, 345851, 346950, 350012, 354443, 358969, 362508, 364514, 364904, 364174, 363378, 363500, 364825, 367060, 369892, 373083, 376259, 379074, 381585, 384172, 387120, 390548, 394574, 399144, 403744, 407653, 410544, 412655, 414424, 416100, 417563, 418285, 417767, 416263, 414791, 414055, 413727, 413219, 412719, 412775, 413205, 413218, 412548, 411729, 411295, 411379, 411993, 412913, 413353, 412672, 411439, 410948, 411478, 411950, 411603, 411086, 411446, 412854, 414871, 417314, 420222, 423508, 427278, 432188, 439177, 449198, 463265, 481775, 502976, 522760, 537071, 544712, 547613, 548940, 551633, 558147, 570011, 586675, 605131, 621613, 634299]
51042F34299J0091R733R487O477N93n350q929j0220j0165q682o045m730p389j3257
51028E95913j8581k0790k0466j9056j6801j3690j0662q538o817m594j920N50K509
51015D57057L877M526M796N596P275R051J0118J0653J0992J0716R413P790O949
51002E58809O958O971O620O440P018Q358J0010J1362J1877J1518J0882J0538J0398
50989F77759J0056R513R075Q736Q149P157O014N033M417M446N571Q111J1779J5536
50975G91352J8116J8974J8676J8200J8021J8290J9575K2712K7732L3669L9664
50964A044981M5764N2229N8689O4458O9446P4190P9059Q3726Q7381Q9300Q9348
50953A838571Q7940Q5347Q1035P4055O4247N2764M1202L0430K0248R960q32j1655
$$ y = [634299, 644390, 654123, 663610, 670087, 670680, 665330, 656401, 646181, 636016, 627334, 621289, 616559, 609170, 595913, 577332, 556542, 536076, 517020, 500219, 486529, 475867, 467329, 460512, 455918, 453998, 454548, 457057, 460934, 465460, 470256, 475852, 483127, 492178, 502296, 512949, 523941, 534657, 544070, 551860, 558809, 565767, 572738, 579358, 585798, 592816, 601174, 611184, 622546, 634423, 645941, 656823, 667361, 677759, 687815, 697328, 706403, 715139, 723288, 730445, 736459, 741492, 745909, 750355, 755926, 764037, 775816, 791352, 809468, 828442, 847118, 865318, 883339, 901629, 921204, 943916, 971648, 1005317, 1044981, 1090745, 1142974, 1201663, 1266121, 1335567, 1409757, 1488816, 1572542, 1659923, 1749223, 1838571, 1926511, 2011858, 2092893, 2166948, 2231195, 2283959, 2325161, 2355591, 2375839, 2385799, 2384967, 2373312]
50941B373312k1189k8084l1799l2777l2158l1575l2638l5660l9020m0614m0057
50930B007741l8728l7732l6801l5489l4389l4400l5513l7016l8575m0392m2607
50919A596099m5046m7385m9192n0042m9907m9246m8336m6789m4081m0333l6190
50908A089552l2122k8184k4380k0944j8176j6145j4620j3381j2537j2325j2409
50897H84329j1827j0055p879o527o126n713m702l549k859k526k093j368m37N07
50883H19175J220J699K390L529M477M486M059M442N685O431N997N510O251P998
50869H83349R799J1473J3270J4857J5820J6793J8936K2341K5873K8582L0604L2739
50857A124436L5651L9497M3969M8797N4372O1473P0136P9426Q8711R8550J09683
$$ y = [2373312, 2352123, 2324039, 2292240, 2259463, 2227305, 2195730, 2163092, 2127432, 2088412, 2047798, 2007741, 1969013, 1931281, 1894480, 1858991, 1824602, 1790202, 1754689, 1717673, 1679098, 1638706, 1596099, 1551053, 1503668, 1454476, 1404434, 1354527, 1305281, 1256945, 1210156, 1166075, 1125742, 1089552, 1057430, 1029246, 1004866, 983922, 965746, 949601, 934981, 921600, 909063, 896738, 884329, 872502, 862447, 854568, 848041, 841915, 836202, 831500, 827951, 825092, 822566, 820473, 819105, 818668, 819175, 820395, 822094, 824484, 828013, 832490, 836976, 841035, 845477, 851162, 857593, 863590, 869100, 875351, 883349, 893148, 904621, 917891, 932748, 948568, 965361, 984297, 1006638, 1032511, 1061093, 1091697, 1124436, 1160087, 1199584, 1243553, 1292350, 1346722, 1408195, 1478331, 1557757, 1646468, 1745018, 1854701]
50846A854701J21856J34308J46809J59211J70580J79939J87681J95004K01900
50837C351989K06640K07365K03155J93325J76838J53250J23805R0913N6763K2695
50827D786738j0349m1256o8693r1521j09133j21346j27892j28272j22450j11591
50817C854235r7839q3299o9450n7376m8168m2876m2110m5636n2366o0904p0348
50806C183863q0423r0879j00985j09852j16931j21939j24498j24250j21178j15676
50796B077252j08357r9981r1357q3009p4952o6923n8715n0292m1920l4166k7490
50785A340090k1687j6190j1068p207n207m533m130l527k942k733l098m024n016
50772A248728n320m815m415n037o520q025r207j0427j1954j3653j5291j6589j7063
$$ y = [1854701, 1976557, 2110865, 2257674, 2416885, 2587465, 2767404, 2955085, 3150089, 3351989, 3558629, 3765994, 3969149, 4162474, 4339312, 4492562, 4616367, 4707280, 4764043, 4786738, 4776389, 4735133, 4666440, 4574919, 4465786, 4344440, 4216548, 4088276, 3965826, 3854235, 3756396, 3673097, 3603647, 3546271, 3498103, 3455227, 3413117, 3367481, 3315115, 3254211, 3183863, 3103440, 3012561, 2911576, 2801724, 2684793, 2562854, 2438356, 2314106, 2192928, 2077252, 1968895, 1868914, 1777557, 1694548, 1619596, 1552673, 1493958, 1443666, 1401746, 1367580, 1340090, 1318403, 1302213, 1291145, 1283938, 1278731, 1274198, 1270068, 1266541, 1263599, 1260866, 1257768, 1253744, 1248728, 1243408, 1238593, 1234178, 1229141, 1222621, 1214596, 1205389, 1194962, 1183008, 1169355, 1154064, 1137475, 1120412]
50759A120412j6426j5196j4308j4020j3711j2837j1575j0243q580o117l031j70
50747I94198J990M019O802J0251J3282J5347J7488K1230K6670L2410L7415M2134
50735A223236M7607N4144O1301O8493P5196Q0964Q5771Q9976R3692R6580R8499
50724B075459R9772J00462J00097R8591R6728R5077R2862Q8638Q1515P1018N6326
50713C056545L6842J3484j1444l5676n7639p5892q8863r5577r6214r1878q4160
50702B469528p4728o4716n4380m3763l3609k5171j9107j5215j3342j4037j7948
50691B093512k4838l3505m2684n1759o0403o7651p1862p2111o9289o5115o0247
50680A474048n4258m7407m1061l5799l0448k3919j7011j1165o229q66N243J1038
$$ y = [1120412, 1103986, 1088790, 1074482, 1060462, 1046751, 1033914, 1022339, 1012096, 1003516, 997399, 994368, 994198, 996188, 1000207, 1007009, 1017260, 1030542, 1045889, 1063377, 1084607, 1111277, 1143687, 1181102, 1223236, 1270843, 1324987, 1386288, 1454781, 1529977, 1610941, 1696712, 1786688, 1880380, 1976960, 2075459, 2175231, 2275693, 2375790, 2474381, 2571109, 2666186, 2759048, 2847686, 2929201, 3000219, 3056545, 3093387, 3106871, 3095427, 3059751, 3002112, 2926220, 2837357, 2741780, 2645566, 2553688, 2469528, 2394800, 2330084, 2275704, 2231941, 2198332, 2173161, 2154054, 2138839, 2125497, 2111460, 2093512, 2068674, 2035169, 1992485, 1940726, 1880323, 1812672, 1740810, 1668699, 1599410, 1534295, 1474048, 1419790, 1372383, 1331322, 1295523, 1265075, 1241156, 1224145, 1212980, 1206751, 1205885, 1211128, 1222166]
50668A222166J5818J9923K3525K5941K6597K5856K4465K2751K0715J8414J6097
50657A462268J4251J3490J3997J5221J6492J7762J9214K0482K1082K1428K2595
50646A658282K5083K8423L1996L5544L8967M2332M6038N0344N4763N8553O1581
50635B131906O4024O5524O5438O3737O0785N6565N1215M5946M2062L9331L7009
50624B723542L6172L8473M1476L7732K1104o265l4806n5166o4068o3664n7507
50613B617023m8045l6748k4977j4153n203J802P206J0947J2428J1185P171K42
50601B538878r968k3133l7639n1469o3507p3541q1325q6362q8537q8362q6367
50590A848668q2661p7327p1006o4691n8954n3595m8207m2873l8083l3954k9974
$$ y = [1222166, 1237984, 1257907, 1281432, 1307373, 1333970, 1359826, 1384291, 1407042, 1427757, 1446171, 1462268, 1476519, 1490009, 1504006, 1519227, 1535719, 1553481, 1572695, 1593177, 1614259, 1635687, 1658282, 1683365, 1711788, 1743784, 1779328, 1818295, 1860627, 1906665, 1957009, 2011772, 2070325, 2131906, 2195930, 2261454, 2326892, 2390629, 2451414, 2507979, 2559194, 2605140, 2647202, 2686533, 2723542, 2759714, 2798187, 2839663, 2877395, 2898499, 2892234, 2857428, 2802262, 2738194, 2674530, 2617023, 2568978, 2532230, 2507253, 2493100, 2487897, 2489699, 2496905, 2507852, 2520280, 2531465, 2538636, 2538878, 2528910, 2505777, 2468138, 2416669, 2353162, 2279621, 2198296, 2111934, 2023397, 1935035, 1848668, 1766007, 1688680, 1617674, 1552983, 1494029, 1440434, 1392227, 1349354, 1311271, 1277317, 1247343]
50579A247343k5733k1667j8717j7349j7118j6990j5885j3260r577o017l309j034
50567A080687J536M243O343P713R009J0626J2317J3836J5320J6847J8307J9847
50555A216631K1872K4387K6920K9233L1452L3316L3978L3001L1018K9016K7366
50544A538190K5803K4048K2141K0559K0219K1959K5765L0801L6331M2204M8428
50533A856448N4830O1491O8970P7719Q7525R7770J07788J16898J24599J31056
50523B785094J36996J42794J47990J51905J54231J54706J52679J47450J38708
50514D112553J26352J10216R0461O7926M3657J8231q129l4830o0556q3715j03201
50503D278965j18736j30331j37329j38374j32787j21613j06591q8439o7002m3086
$$ y = [1247343, 1221610, 1199943, 1181226, 1163877, 1146759, 1129769, 1113884, 1100624, 1091047, 1085030, 1081721, 1080687, 1082223, 1086466, 1092809, 1100522, 1109531, 1120157, 1132474, 1146310, 1161630, 1178477, 1196784, 1216631, 1238503, 1262890, 1289810, 1319043, 1350495, 1383811, 1417789, 1450790, 1481808, 1510824, 1538190, 1563993, 1588041, 1610182, 1630741, 1650960, 1672919, 1698684, 1729485, 1765816, 1808020, 1856448, 1911278, 1972769, 2041739, 2119458, 2206983, 2304753, 2412541, 2529439, 2654038, 2785094, 2922090, 3064884, 3212874, 3364779, 3519010, 3673716, 3826395, 3973845, 4112553, 4238905, 4349121, 4439582, 4507508, 4551165, 4569396, 4561267, 4526437, 4465881, 4382166, 4278965, 4160229, 4029898, 3892569, 3754195, 3621408, 3499795, 3393204, 3304765, 3237763, 3194677]
50493C194677j8881L736K4320M2683N7523O6942O9652O4892N1808L0112J315l1362
50481C557417o4339r4622j19877j38550j50215j55550j55762j52159j45939j38003
50471B242401j28891j18952j08515r7863q7347p7479o8637o0664n3187m6275m0325
50460A354266l5238l0390k5574k1258j7554j3755r300m587l29L249O060P690P990
50447A221270P588P165O667N983N864P280J0169J3630J7047K0060K1673K0562
50435A364958J6564J1105N937J957o99k125k533k174j089P37K971N096P059R288
50421A417052J1956J4699J7277K0027K3367K7152L0885L4393L8008M2178M7013
50410A724007N2245N7419O2280O6876P1187P4691P6473P5978P3489O9806O5572
$$ y = [3194677, 3175796, 3179532, 3203852, 3246535, 3304058, 3371000, 3440652, 3505544, 3557352, 3587464, 3588779, 3557417, 3493078, 3398456, 3278579, 3140029, 2989814, 2834264, 2678502, 2526343, 2380404, 2242401, 2113510, 1994558, 1886043, 1788180, 1700833, 1623354, 1554717, 1494053, 1440866, 1394591, 1354266, 1319028, 1288638, 1263064, 1241806, 1224252, 1210497, 1201197, 1196610, 1196281, 1199530, 1205590, 1213280, 1221270, 1228858, 1236023, 1242690, 1248673, 1254537, 1261817, 1271986, 1285616, 1302663, 1322723, 1344396, 1364958, 1381522, 1392627, 1398564, 1400521, 1399822, 1397697, 1395164, 1392990, 1391901, 1392638, 1395609, 1400705, 1407764, 1417052, 1429008, 1443707, 1460984, 1481011, 1504378, 1531530, 1562415, 1596808, 1634816, 1676994, 1724007, 1776252, 1833671, 1895951, 1962827, 2034014, 2108705, 2185178, 2261156, 2334645, 2404451, 2470023]
50399B470023O0977N6021N0631M4439L6603K6215J2976k622j9722l7407n4504
50388B643630o9540q1294q9314r3656r4378r1621q5861p7599o7011n4404m0772
50377A798180k7271j4234j477J0580K0831K8523L3466L5045L2102K4297J2846
50366A952888n55j4772k8873m1659n2327o0913o7351p0795p0799o8495o5554o2312
50354A348483n8044n2820m7938m4389m1928l9864l7886l5709l2693k8500k3756
50343I04956j9551j6322j3538j0395o690k922L61L288O528J0372J4294J7571K0085
50330I08037K2032K2999K1802J7542J0648K868l759q020r892j0001q910o926m386
50317I54034j719P20K529L112K114J19j656k585l122l848m569m626l753k282p77
$$ y = [2470023, 2531000, 2587021, 2637652, 2682091, 2718694, 2744909, 2757885, 2755263, 2735541, 2698134, 2643630, 2574090, 2492796, 2403482, 2309826, 2215448, 2123827, 2037966, 1960367, 1893356, 1838952, 1798180, 1770909, 1756675, 1755198, 1765778, 1786609, 1815132, 1848598, 1883643, 1915745, 1940042, 1952888, 1952333, 1937561, 1908688, 1867029, 1814702, 1753789, 1686438, 1615643, 1544844, 1476349, 1410795, 1348483, 1290439, 1237619, 1189681, 1145292, 1103364, 1063500, 1025614, 989905, 957212, 928712, 904956, 885405, 869083, 855545, 845150, 838460, 835538, 835899, 839187, 845715, 856087, 870381, 887952, 908037, 930069, 953068, 974870, 992412, 1003060, 1005928, 1002169, 994149, 984257, 974256, 965346, 958420, 954034, 952315, 953035, 955564, 958676, 960790, 960909, 959253, 956668, 953546, 949698, 945129, 940503, 936750, 934468, 933691]
50302I33691L11Q68J157J445J655J797K387L837N582O755P579Q957J0714J1619
50288I98354J1391J1198J1801J2833J4450J7809K2984K8823L6265M8547O4435
50277A278890P3328O2480L0534r380m1265n8446o3662o1450n4306m4502l5198
50266A077023k8357k3476j9265j5582j3125j2111j1881j1491j0390q736p143n981
50254I09485m976l662k056n78N46J537K710M167N829P687R893J2521J5209J7329
50240I75641J8668J9718K0879K1659K1226J9652J7860J6379J4869J3137J1800
50229A171488J1433J1610J1320R903P157K841l179j0398j7756k4325k9698l3756
50217A106640l6272l6746l4672l0185k4490j9176j4826j0676o070k061r50m029
$$ y = [933691, 934002, 934870, 936027, 937472, 939127, 940924, 943311, 947148, 952730, 959485, 967064, 976021, 986735, 998354, 1009745, 1020943, 1032744, 1045577, 1060027, 1077836, 1100820, 1129643, 1165908, 1214455, 1278890, 1352218, 1414698, 1445232, 1435852, 1394587, 1336141, 1272479, 1211029, 1156723, 1112221, 1077023, 1048666, 1025190, 1005925, 990343, 977218, 965107, 953226, 941735, 931345, 922609, 915466, 909485, 904509, 900847, 898791, 898213, 898759, 900296, 903006, 907173, 913002, 920689, 930582, 943103, 958312, 975641, 994309, 1014027, 1034906, 1056565, 1077791, 1097443, 1115303, 1131682, 1146551, 1159688, 1171488, 1182921, 1194531, 1205851, 1215754, 1222911, 1225752, 1222573, 1212175, 1194419, 1170094, 1140396, 1106640, 1070368, 1033622, 998950, 968765, 944275, 925099, 910273, 899597, 893527, 891466, 890516, 886487]
50205H86487j0033j5984j9517k0356j9723j8688j7336j5407j3190j1359j0161
50194G14733r186q035o810n897n547n709o030o033n541n003n117n986o926p215
50180F25698o816o264o001n975n781n126m209l588l538l721l627l237k945k952
50166E61918k962k541j526j30J155J864K004K116K647L437M070M536N134N959
50152E87681O944Q276J0098J1860J2582J1985J0814R824Q918P588N771L904K360
50139F98605J225M72R2O0L64J084K395M406O971R664J2162J4675J7779K1687K5965
50124H17606L0112L3999L7442L9869M0904M0901M0268L8766L6240L3752L2907
50113A222766L4029L5863L7235L7966L7816L5402K9076J8674O012o289j6485k4621
$$ y = [886487, 876454, 860470, 840953, 820597, 800874, 782186, 764850, 749443, 736253, 724894, 714733, 705547, 697512, 690702, 684805, 679258, 673549, 667519, 661486, 655945, 650942, 645825, 639839, 632913, 625698, 618882, 612618, 606617, 600642, 594861, 589735, 585526, 581938, 578400, 574679, 571052, 567815, 564870, 561918, 558956, 556415, 554889, 554759, 555914, 557778, 559782, 561898, 564545, 567982, 572052, 576588, 581722, 587681, 594625, 602901, 612999, 624859, 637441, 649426, 660240, 670064, 678982, 686570, 692341, 696245, 698605, 699830, 700302, 700394, 700454, 700818, 701902, 704297, 708703, 715674, 725338, 737500, 752175, 769954, 791641, 817606, 847718, 881717, 919159, 959028, 999932, 1040833, 1081101, 1119867, 1156107, 1189859, 1222766, 1256795, 1292658, 1329893, 1367859, 1405675, 1441077, 1470153, 1488827, 1494839, 1488550, 1472065, 1447444]
50101A447444l1925l9027m4816m7530m6778m3879m0346l6914l4054l2116l0483
50090A019576k7575k2713j7336j3572j2022j1598j1173j0457r532q414p155n813
50078H62216m233k338n97L07K94j02o28j648l414n412o786p265p361p718q462
50063H06853r226r619r524r021q205p176o094n125m356l795l378k931k266j358
50049G24779l14Q22J995K840K967K696K982M225N679O528P030P897Q933R203Q409
50034G96671P229O279N538M900M502M239L717K988K698L147L686L434K314J053
50020H52395L41J91j9p96j835k293j903j223m71R83L095M165K898R11J262M523
50004H62224Q169J0169J1210J2612J4031J4503J4363J4582J5212J5883J7027J9275
$$ y = [1447444, 1415519, 1376492, 1331676, 1284146, 1237368, 1193489, 1153143, 1116229, 1082175, 1050059, 1019576, 992001, 969288, 951952, 938380, 926358, 914760, 903587, 893130, 883598, 875184, 868029, 862216, 857983, 855645, 855048, 855355, 855649, 855547, 854919, 853271, 849857, 844445, 837659, 830394, 823033, 815315, 806853, 797627, 788008, 778484, 769463, 761258, 754082, 747988, 742863, 738507, 734712, 731334, 728403, 726137, 724779, 724465, 725287, 727282, 730122, 733089, 735785, 738767, 742992, 748671, 755199, 762229, 770126, 779059, 788262, 796671, 803900, 810179, 815717, 820617, 825119, 829358, 833075, 836063, 838761, 841908, 845594, 849028, 851342, 852395, 852736, 852927, 852908, 852112, 850277, 847984, 846081, 844858, 844387, 845370, 848465, 852630, 855528, 856439, 857701, 862224, 870393, 880562, 891772, 904384, 918415, 932918, 947281, 961863, 977075, 992958, 1009985, 1029260]
49992A029260K2276K5271K8042K9992K9133K3706J4524M191n807j5755k5535l3573
49980A125725l8452m0407m0628l9978l8842l7436l5707l3407l0632k7862k5319
49969G37055k2725j9882j7012j4416j2172j0307q902p963p482p406p328o547m951
49956E89962l509l089l093k192k70J363J872J983K787M297N784O977Q251R854
49942F20977J1464J2422J2246J0970R042O946M962L432K853L288L882L467J469
49929G07420k100p086j2795j7453j9238j8172j6125j4637j3427j1483q751o186
49917E59967m488l510k681j607l20P53J186J044Q01Q14J086J639K616L913N088
49902E66301N810O096O011N611N294N728P102Q894J0559J1995J3007J2924J1298
$$ y = [1029260, 1051536, 1076807, 1104849, 1134841, 1163974, 1187680, 1202204, 1206395, 1200588, 1184833, 1159298, 1125725, 1087273, 1046866, 1006238, 966260, 927418, 889982, 854275, 820868, 790236, 762374, 737055, 714330, 694448, 677436, 663020, 650848, 640541, 631639, 623676, 616194, 608788, 601460, 594913, 589962, 586453, 583364, 580271, 578079, 577809, 579172, 581044, 583027, 585814, 590111, 595895, 602872, 611123, 620977, 632441, 644863, 657109, 668079, 677121, 684067, 689029, 692461, 695314, 698602, 702484, 705951, 707420, 705320, 698234, 685439, 667986, 648748, 630576, 614451, 599814, 586387, 574904, 566153, 559967, 555479, 551969, 549288, 547681, 547361, 548114, 549300, 550344, 551145, 551959, 553045, 554684, 557300, 561213, 566301, 572111, 578207, 584218, 589829, 595123, 600851, 607953, 616847, 627406, 639401, 652408, 665332, 676630]
49889F76630Q640N890L454J270m53j261j260j342k314m182o365q400j0225j1930
49875F48152j3379j4123j3826j2752j1646j0935j0162q595o271m092k742j938
49863E37691j011M2N77M09L30J215K862M203M623M640N074O033P041P905Q920
$$ y = [676630, 685270, 691160, 694614, 695884, 695431, 694170, 692910, 691568, 689254, 685072, 678707, 670307, 660082, 648152, 634773, 620650, 606824, 594072, 582426, 571491, 561329, 552734, 546463, 542371, 539629, 537691, 536680, 536722, 537299, 537708, 538038, 539253, 542115, 546318, 550941, 555581, 560655, 566688, 573729, 581634, 590554]
$$ [...]
##END NTUPLES=NMR SPECTRUM
##END=
