
##TITLE=AC1336_BRAAS12065_6528570_Xrn0UfIXm1
##JCAMPDX= 6.0         $$ Bruker NMR JCAMP-DX V2.0
##DATA TYPE= NMR SPECTRUM
##DATA CLASS= NTUPLES
##ORIGIN= BRUKER
##OWNER= Administrator
$$ 1.72 TOPSPIN		Version 2.1
$$ 2012-07-15 15:26:44.281 -0500  Administrator@TOPSPIN
$$ Compression mode = diff/dup
##.OBSERVE FREQUENCY= 400.02188249412
##.OBSERVE NUCLEUS= ^1H
##.ACQUISITION MODE= SIMULTANEOUS (DQD)
##.ACQUISITION SCHEME= undefined
##.AVERAGES= 8
##.DIGITISER RES= 22
##SPECTROMETER/DATA SYSTEM= spect
##.PULSE SEQUENCE= zg30
##.SOLVENT NAME= COFFEE_meoh
##.SHIFT REFERENCE= INTERNAL, COFFEE_meoh, 1, 14.98509
##AUDIT TRAIL= $$ (NUMBER, WHEN, WHO, WHERE, PROCESS, VERSION, WHAT)
$$ ##TITLE= Audit trail, TOPSPIN		Version 2.1
$$ ##JCAMPDX= 5.01
$$ ##ORIGIN= Bruker BioSpin GmbH
$$ ##OWNER= Administrator
$$ $$ C:\Bruker\TOPSPIN/data/COFFEE/nmr/AC1336_BRAAS12065_6528570_Xrn0UfIXm1/10/pdata/1/auditp.txt
$$ ##AUDIT TRAIL=  $$ (NUMBER, WHEN, WHO, WHERE, PROCESS, VERSION, WHAT)
(   1,<2012-07-15 15:26:36.796 -0500>,<Administrator>,<TOPSPIN>,<go>,<TOPSPIN 2.1>,
      <created by zg
	started at 2012-07-15 15:25:30.171 -0500,
	POWCHK enabled, PULCHK disabled,
       configuration hash MD5:
       6B 1B 68 BB D9 2E 58 E2 7F 35 AD 54 07 DF 0E 41
       data hash MD5: 64K
       F6 9E C3 DF 16 D3 1B DD 3F 12 F8 3F EE 78 EE 6B>)
(   2,<2012-07-15 15:26:39.890 -0500>,<Administrator>,<TOPSPIN>,<proc1d>,<TOPSPIN 2.1>,
      <Start of raw data processing
       efp LB = 0 FT_mod = 6 PKNL = 1 PHC0 = 0 PHC1 = 0 SI = 32K 
       data hash MD5: 32K
       9B 7C A5 E4 9F B1 D3 D4 FF B3 DB C2 AC 72 9C B9>)
(   3,<2012-07-15 15:26:40.265 -0500>,<Administrator>,<TOPSPIN>,<proc1d>,<TOPSPIN 2.1>,
      <pk PHC0 = 176.5228 PHC1 = 0 
       data hash MD5: 32K
       A1 72 00 53 9A C3 85 61 D9 F8 1A 46 76 84 C3 33>)
(   4,<2012-07-15 15:26:40.328 -0500>,<Administrator>,<TOPSPIN>,<proc1d>,<TOPSPIN 2.1>,
      <abs ABSG = 1 
       data hash MD5: 32K
       FB 55 04 6C F2 A5 A4 8D 30 44 F5 F7 9B 62 C2 1C>)
(   5,<2012-07-15 15:26:40.359 -0500>,<Administrator>,<TOPSPIN>,<proc1d>,<TOPSPIN 2.1>,
      <abs ABSG = 2 
       data hash MD5: 32K
       D5 64 D2 B3 EA 5D 24 1B 2F 84 C4 C5 35 9B 31 70>)
(   6,<2012-07-15 15:26:40.390 -0500>,<Administrator>,<TOPSPIN>,<proc1d>,<TOPSPIN 2.1>,
      <abs ABSG = 3 
       data hash MD5: 32K
       6A 07 78 C3 B9 85 6B FE 7C 21 1E 5E 41 05 30 DB>)
(   7,<2012-07-15 15:26:40.421 -0500>,<Administrator>,<TOPSPIN>,<proc1d>,<TOPSPIN 2.1>,
      <abs ABSG = 4 
       data hash MD5: 32K
       D7 FA 6B B8 73 4B 53 A6 A6 DA 27 A6 2E 71 A6 45>)
(   8,<2012-07-15 15:26:40.437 -0500>,<Administrator>,<TOPSPIN>,<proc1d>,<TOPSPIN 2.1>,
      <abs ABSG = 5 
       data hash MD5: 32K
       D2 C5 BA 6B CF F5 34 3A E2 72 47 58 97 19 E8 81>)
$$ ##END=
$$ 
$$ $$ hash MD5
$$ $$ 2E 7E B8 FA 2C 39 A7 35 CC 04 A9 CD 75 A4 35 0E
##$RELAX= 
##$RELAX= 
##$RELAX= 
##$RELAX= 
##$RELAX= 
##$RELAX= 
##$RELAX= 
$$ Bruker specific parameters
$$ --------------------------
$$ [...]
##$TP= (0..7)
150 150 150 150 150 150 150 150
##$TP07= 0
##$TPNAME0= <>
##$TPNAME1= <>
##$TPNAME2= <>
##$TPNAME3= <>
##$TPNAME4= <>
##$TPNAME5= <>
##$TPNAME6= <>
##$TPNAME7= <>
##$TPOAL= (0..7)
0.5 0.5 0.5 0.5 0.5 0.5 0.5 0.5
##$TPOFFS= (0..7)
0 0 0 0 0 0 0 0
##$TUNHIN= 0
##$TUNHOUT= 0
##$TUNXOUT= 0
##$USERA1= <user>
##$USERA2= <user>
##$USERA3= <user>
##$USERA4= <user>
##$USERA5= <user>
##$V9= 5
##$VALIST= <valist>
##$VCLIST= <CCCCCCCCCCCCCCC>
##$VD= 0
##$VDLIST= <DDDDDDDDDDDDDDD>
##$VPLIST= <PPPPPPPPPPPPPPP>
##$VTLIST= <TTTTTTTTTTTTTTT>
##$WBST= 2048
##$WBSW= 25
##$XGAIN= (0..3)
0 0 0 0
##$XL= 0
##$YL= 0
##$YMAX_a= 505726
##$YMIN_a= -645657
##$ZGOPTNS= <>
##$ZL1= 120
##$ZL2= 120
##$ZL3= 120
##$ZL4= 120
##$ABSF1= 14.98509
##$ABSF2= -5.573092
##$ABSG= 5
##$ABSL= 3
##$ALPHA= 0
##$AQORDER= 0
##$ASSFAC= 0
##$ASSFACI= 0
##$ASSFACX= 0
##$ASSWID= 0
##$AUNMP= <proc_prof1d_extract_pilot.lims>
##$AXLEFT= 0
##$AXNAME= <>
##$AXNUC= <1H>
##$AXRIGHT= 0
##$AXTYPE= 0
##$AXUNIT= <>
##$AZFE= 0.1
##$AZFW= 0.1
##$BCFW= 0
##$BC_mod= 0
##$BYTORDP= 0
##$COROFFS= 0
##$CY= 15
##$DATMOD= 1
##$DC= 0
##$DFILT= <>
##$DTYPP= 0
##$F1P= 0
##$F2P= 0
##$FCOR= 0.5
##$FTSIZE= 32768
##$FT_mod= 6
##$GAMMA= 0
##$GB= 0
##$INTBC= 1
##$INTSCL= 1
##$ISEN= 128
##$LB= 0
##$LEV0= 0
##$LPBIN= 0
##$MAXI= 10000
##$MC2= 0
##$MEAN= 0
##$ME_mod= 0
##$MI= 0
##$NCOEF= 0
##$NC_proc= -8
##$NLEV= 6
##$NOISF1= 0
##$NOISF2= 0
##$NSP= 0
##$NTH_PI= 0
##$NZP= 0
##$OFFSET= 14.98509
##$PC= 1
##$PHC0= 176.5228
##$PHC1= 0
##$PH_mod= 1
##$PKNL= yes
##$PPARMOD= 0
##$PPDIAG= 0
##$PPIPTYP= 0
##$PPMPNUM= 2147483647
##$PPRESOL= 1
##$PSCAL= 4
##$PSIGN= 0
##$PYNMP= <proc.py>
##$REVERSE= no
##$SF= 400.02
##$SI= 32768
##$SIGF1= 0
##$SIGF2= 0
##$SINO= 400
##$SIOLD= 32768
##$SPECTYP= <>
##$SREGLST= <1H.CDCl3>
##$SSB= 0
##$STSI= 32768
##$STSR= 0
##$SW_p= 8223.68421052631
##$SYMM= 0
##$S_DEV= 0
##$TDeff= 65536
##$TDoff= 0
##$TI= <>
##$TILT= no
##$TM1= 0
##$TM2= 0
##$TOPLEV= 0
##$USERP1= <user>
##$USERP2= <user>
##$USERP3= <user>
##$USERP4= <user>
##$USERP5= <user>
##$WDW= 1
##$XDIM= 32768
##$YMAX_p= 470803449
##$YMIN_p= -771721
##$CURPLOT= <Network HP LaserJet P1505>
##$CURPRIN= <$Network HP LaserJet P1505>
##$DFORMAT= <normdp>
##$LAYOUT= <+/1D_H.xwp>
##$LFORMAT= <normlp>
##$PFORMAT= <normpl>
##$SURQMSG= 1
$$ End of Bruker specific parameters
$$ ---------------------------------
##NTUPLES= NMR SPECTRUM
##VAR_NAME=  FREQUENCY,     SPECTRUM/REAL,   SPECTRUM/IMAG
##SYMBOL=    X,             R,               I
##VAR_TYPE=  INDEPENDENT,   DEPENDENT,       DEPENDENT
##VAR_FORM=  AFFN,          ASDF,            ASDF
##VAR_DIM=   32768,         32768,           32768
##UNITS=     HZ,            ARBITRARY UNITS, ARBITRARY UNITS
##FACTOR=    0.250966925370066, 1,           1
##FIRST=     8223.43324360094, 91757,        9481
##LAST=      0,             -82687,          -146001
##MIN=       0,             -771721,         0
##MAX=       8223.43324360094, 470803449,    0
$$ Real data points
##PAGE= N=1
##DATA TABLE= (X++(R..R)), XYDATA
$$ [...]
19521c69187i6210M0742r6240j42270A028M05488a31493L9533j39503E0897J50988
19510B01885j4697a09449K7167H3425a32046n4449h0949G7771R2624b25119j26635
19499c51754N5747f1412C4764a74012A26039d8798n3677A7279J33540g4492m6310
19488a20802a2368A07999a65643A87345b35724A41982b80547B10302G7384b38886
19477b4670A08639a80396C8581a36728k67975A60186a7869C7370b1221l1981j27283
19466a80485L1700j08679J17868K3580k3523k536K2486p432n8115O3352A00992
19454g2669A01125D5766b0901l72040A08475d990l25695J53930o1144B9785L8642
19443F8427j6158a92489B66735B9798J42080O740I229e4828A97073a50015A34731
$$ plain form
19521 -369187 -96210 -55468 -151708 -293978 1028 406516 -131493 -91960 -231463 50897 201885
19510 201885 187188 -109449 -82282 83425 -132046 -186495 -80949 77771 170395 -225119 -351754
19499 -351754 -296007 -61412 34764 -174012 126039 -48798 -102475 17279 150819 -74492 -120802
19488 -120802 -12368 107999 -165643 187345 -235724 141982 -280547 210302 77384 -238886
19477 -24670 108639 -180396 38581 -136728 -404703 160186 -17869 37370 -21221 -53202 -180485
19466 -180485 -148785 -257464 -139596 -116016 -139539 -142075 -119589 -127021 -185136 -121784 100992
19454 -72669 101125 45766 -20901 -392941 108475 -4990 -330685 -176755 -237899 29785 68427
19443 68427 52269 -192489 266735 29798 171878 178618 9229 -54828 197073 -150015 134731
19431B38363r7412d73178i6826A83191b62978g9250A68788m8239n6564a85723
19420a6599O635j2269l07954A40840a00881q0939k7915E30898C2596A0446h2236
19408a87190B7405J5357b28247D12286b15495D1088a62595B45140h3870J06n8966
19397a42730A59846G792J5715j0724J62599c4098l42052g8387k841o2870g1231
19385c29128A26943a60557q4281C1845J09711b8243j27464K2333a7507B0680L8476
19374E9156a26048M0151m6854D7707j1035A0583J17460m0111J17347a72004C06966
19362E4230a24757B09968e7009q6356N1096j20727o5311a06752a2358j03498C284
19350b96252a34439O1756K9059A10443c0965g291j88900C47495c12890D1457b77337
$$ plain form
19431 238363 140951 -473178 -96826 183191 -262978 -79250 168788 120549 63985 -185723
19420 -16599 -9964 -22233 -330187 140840 -100881 -181820 -209735 530898 32596 10446 -82236
19408 -187190 27405 42762 -228247 412286 -215495 41088 -162595 245140 -83870 -83764 -142730
19397 -142730 159846 7792 23507 12783 175382 -34098 -376150 -78387 -81228 -144098 -71231
19385 -329128 126943 -160557 -244838 31845 141556 -28243 -155707 -133374 -17507 20680 59156
19374 59156 -126048 -85897 -132751 47707 36672 10583 128043 87932 205279 -172004 306966
19362 54230 -124757 209968 -57009 -143365 -92269 -212996 -278307 -106752 -12358 -115856 3284
19350 -296252 -134439 -72683 -43624 110443 -30965 -7291 -196191 347495 -312890 41457 -277337
19338e0996o2870k50136O9712n809F5023c35667A4089N5838a37933b0344H7893
19326B5849b77226J30013i495m8980n3445j00072L5440E6558f5495A2601b27779
19314b44384O4119q9768a20385K2746F7463b49958a6561j01694a3479k26648E2038
19302A67604h2455j46233Q4741J781k64313e1271G7074M3712a17457j92875A94795
19290I052f0804p2345L0949B48186a50291C9361a03255p5738d2096j2427k8832
19279h3355p8602A27382K71008c63856J58754e0668b0835F5654k6117a49431c2957
19267A20487a74103j6345D1895e1536A4356a86126b3888r0023B68090c76344C2490
19255c4625H9371h9743c4227B1596b14911J6541R4426K1867m9170O5159A91407
$$ plain form
19338 -50996 -113866 -364002 -294290 -300099 65023 -335667 14089 69927 -137933 -20344 87893
19326 25849 -277226 -147213 -9495 -58475 -111920 -211992 -176552 56558 -65495 12601 -227779
19314 -244384 -180265 -270033 -120385 -97639 67463 -249958 -16561 -118255 -13479 -240127 52038
19302 167604 -82455 -228688 -143947 -142166 -406479 -51271 77074 120786 -117457 -310332 194795
19290 9052 -60804 -133149 -102200 248186 -150291 39361 -103255 -178993 -42096 -54523 -83355
19279 -83355 -161957 127382 398390 -363856 -205102 -50668 -20835 65654 39537 -149431 -32957
19267 120487 -174103 -190448 41895 -51536 14356 -186126 -23888 -113911 268090 -376344 32490
19255 -34625 89371 -89743 -34227 21596 -214911 -198370 -103944 -82077 -131247 -66088 191407
19243a11456A31744b24395J0034b1770q1882K4444k32116i1501o7300I1425K72249
19232C63674e5957l59530i3689A7649N361a13236A3779b41715K6038j3482G3319
19220d5159E1834a27916F387j269P4149k224f2577A06013b41371Q8110H7592k0506
19208F7086b64657d5246A54643b33792B02374a60951H9180Q9605d99598A3859
19197B46684n0666l0728c153k02916I5064a7946j30431k83E2564a31438C02347
19185a07020B0370J68787a50411A9356Q3526c13952G269b62804M1510A56662B8046
19173b67627C66145h0366I9467b81710a17183j0579a1565B00492b34781A09b06697
19161H396a49592b9926k59203f286j66012j94754a53552K7635b529C1723a69172
$$ plain form
19243 -111456 131744 -224395 -214361 -21770 -103652 -79208 -311324 -91501 -158801 91425 363674
19232 363674 -55957 -415487 -93689 17649 23010 -113236 13779 -241715 -215677 -229159 73319
19220 -45159 51834 -127916 6387 5118 79267 77043 -62577 106013 -241371 -153261 87592 67086
19208 67086 -264657 -45246 154643 -233792 202374 -160951 89180 178785 -499598 13859
19197 246684 196018 165290 -3153 -206069 95064 -17946 -148377 -148660 52564 -131438 302347
19185 -107020 20370 189157 -150411 19356 102882 -313952 7269 -262804 -221294 156662 28046
19173 -267627 366145 -80366 99467 -281710 -117183 -127762 -11565 200492 -234781 109 -206697
19161 8396 -149592 -29926 -289129 -6286 -172298 -367052 -153552 -125917 -2529 31723 -169172
19149B4091a3961m21151Q6267a3828F8846b09531n0612a26492m0578c4234l06032
19138c40266J20127N8681h692m490A12794a32683B13253a99671g6031i187j85446
19127a94633G4137B0784a10760J4395B3522a08391I0486i9625b2357l8246N763
19116e4840k9406j1535m8049G6293K9375j1772b37287c4653H9194g6233C73113
19104B76190E2379c2547n2172j26804G5210a57083L440P6122n9333b1380r1285
19093a12665c4455k03166D2495a12373A19270J6581E2172i0193r0859A8967a57851
19081a83712H711N4609J77031I1052O7863p5981O0512a60617A2318a77935E4025
19069b47223J02487A4541b6869k95415f9770a5073j18349I1258b62308Q7587f401
$$ plain form
19149 24091 -13961 -435112 -348845 -13828 68846 -209531 -260143 -126492 -167070 -34234 -340266
19138 -340266 -220139 -161458 -8692 -13182 112794 -132683 213253 -199671 -76031 -9187 -194633
19127 -194633 74137 20784 -110760 -96365 23522 -108391 90486 -99625 -22357 -60603 -54840
19116 -54840 -84246 -95781 -143830 76293 105668 93896 -237287 -34653 89194 -76233 373113
19104 276190 52379 -32547 -84719 -211523 75210 -157083 -153643 -77521 -136854 -21380 -112665
19093 -112665 -34455 -237621 42495 -112373 119270 135851 52172 -90193 -181052 18967 -157851
19081 -183712 8711 63320 240351 91052 158915 82934 143446 -160617 12318 -177935 54025
19069 -247223 -144736 14541 -26869 -322284 -69770 -15073 -133422 91258 -262308 -174721 -6401
19057C7108K54250B3335a57829m8218F1265e28291d5840B75364C869a79721j909
19046a81630n8087a5346A13536c48049G0771a64111A12411c16285F8297d17638
19035B29382a68603B7025g6906a7902I3892R3065k8540b50947R9030G7724L7306
19024A15030g5068A91332o3715b43338Q4785F2522i356n0117j30514a1930j72478
19013a84408b7438H231O1356k7524h8357H784a91394G9773d19385P9549a14200
19001a89802B19409m7664E1353M3439a1844B727K29158C2331K17521J50129b00192
18989g0963J5874n4700j50378R9815o7283e4251A33236h7808g070l0193A01284
18977c01469A25018B0690J49851a29721j63800J35527m8198c0070k62544e9552
$$ plain form
19057 37108 291358 23335 -157829 -206047 61265 -528291 -45840 275364 3869 -179721 -181630
19046 -181630 -239717 -15346 113536 -348049 70771 -164111 112411 -316285 68297 -417638
19035 229382 -168603 27025 -76906 -17902 93892 186957 158417 -250947 -151917 77724 115030
19024 115030 -75068 191332 127617 -243338 -158553 62522 -9356 -59473 -189987 -11930 -184408
19013 -184408 -27438 8231 69587 42063 -88357 8784 -191394 79773 -419385 -339836 -114200
19001 -189802 219409 171745 51353 94792 -11844 2727 231885 32331 249852 399981 -200192
18989 -70963 -55089 -109789 -260167 -160352 -227635 -54251 133236 -87808 -7070 -37263 101284
18977 -301469 125018 20690 170541 -129721 -293521 -157994 -206192 -30070 -292614 -59552
18966e234A253c71775C1501L6594c60034a32963j76228h6082B9141b27740D24617
18954A24955m3170m284a49317q5915j5577O6235J026b6029k02105e5028a4688
18942A77559c18471I1451J06165a12127H3224b71968B03567a83649C0679j4934
18932A5745c02286D274a3749B34678M3332b39872A20857J09899I8720K36847d41079
18920c29435J9404J04261d0993k0359k06477g01A21843D5569h1746l70730a5082
18908g4604q8095D0713K35037f157B60086I9732l3537O7520e61678a48270j49458
18897b97728B75718b4997B73366A31931a10003H8400J9314i8763p3705D2003a60927
18885b33261n3265N3886Q2092d9271C00884c862D762i5676j11534p4807P8504
$$ plain form
18966 -5234 1253 -371775 31501 68095 -360034 -132963 -309191 -86082 29141 -227740 424617
18954 124955 81785 77501 -149317 -235232 -250809 -184574 -183548 -26029 -228134 -55028 -14688
18942 177559 -318471 91451 197616 -112127 83224 -271968 203567 -183649 30679 15745
18932 15745 -302286 4274 -13749 234678 278010 -239872 120857 230756 98720 335567 -441079
18920 -329435 -310031 -205770 -40993 -61352 -267829 -701 121843 45569 -81746 -452476 -15082
18908 -74604 -162699 40713 275750 -6157 260086 99732 66195 133715 -561678 -148270 -297728
18897 -297728 275718 -24997 273366 131931 -110003 88400 107714 -98763 -172468 42003 -160927
18885 -233261 -286526 -232640 -150548 -49271 300884 -3862 4762 -95676 -207210 -282017 -203513
18874b03513r3567A42988B2393a01000B18260a81792B7976a84598B50880A20666
18863i0875j04521j28497e771B79432K74j36409o9663d33973A56795b31082d2827
18851a57318r8038B72900A34080d948E5082b0014E2995a36887j35993a30371A24938
18839A10488b92694A8312a87178L0789p9881P4559K5522a9268l16737b0172m16900
18828d37072J15190B37459k0861K5513A06295c13319h3017q4653A35147B4347
18817A99570C489Q4875Q5408o8984a53034K8319B67175j27430b57064A32893R6823
18806B29716A3293J81883b65271F5064e730A81790c13879D6707a39381K2933j1134
18795a27582E5388L71851g0871h669j46472K9935F1289b30571c4385n0831j13838
$$ plain form
18874 -203513 -297080 142988 22393 -101000 218260 -181792 27976 -184598 250880 120666
18863 -90875 -195396 -323893 -5771 279432 279706 143297 73634 -433973 156795 -231082 -42827
18851 -157318 -255356 272900 134080 -4948 55082 -20014 52995 -136887 -272880 -130371 124938
18839 110488 -292694 18312 -187178 -156389 -236270 -161711 -136189 -19268 -336005 -20172 -437072
18828 -437072 -321882 237459 216598 242111 106295 -313319 -83017 -167670 135147 24347
18817 199570 3489 88364 173772 104788 -153034 -124715 267175 139745 -257064 132893 229716
18806 229716 13293 195176 -265271 65064 -5730 181790 -313879 46707 -139381 -116448 -127582
18795 -127582 55388 427239 -70871 -8669 -155141 -125206 61289 -230571 -34385 -85216 -199054
18784a99054C2989a59473C57096j05166c84551A6425c80394f7497o9043k66492
18774d03032I4666g71721a566l7275j39291E9409K63111b39568A85382r1635b77241
18762a28382A37843a82944b0498K46k71459A02916P8813q2892J01332m7320b83433
18750a48717f6649k95271B64417a63503m6248R8910j91417a38968m8681C6530
18739G783a85604B58392B3040K48486c48492i3276j26374Q3654f3977j11475A85884
18727a5421r7047A30600n2563a32572j62843J8149i2071r260l1775M3750H4379
18715c21938a12342b2288E1046c18572p5497A2513J99446B290L38399A56041f1519
18703a09776L0336G8765a38929k6316J6053N1259M1622B8306a4936A00835j2316
$$ plain form
18784 -199054 32989 -159473 357096 251930 -384551 16425 -380394 -67497 -136540 -403032
18774 -403032 94666 -771721 -1566 -38841 -178132 59409 322520 -239568 185382 93747 -277241
18762 -128382 137843 -182944 -20498 -20252 -291711 102916 181729 98837 200169 152849 -283433
18750 -148717 -66649 -361920 264417 -163503 -209751 -110841 -302258 -138968 -187649 36530
18739 7783 -185604 258392 23040 271526 -348492 -93276 -219650 -135996 -63977 -175452 185884
18727 -15421 -112468 130600 78037 -132572 -295415 -277266 -92071 -101331 -133106 -89356 84379
18715 -321938 -112342 -22288 51046 -318572 -394069 12513 211959 2290 340689 156041 -61519
18703 -109776 -79440 78765 -138929 -165245 -149192 -97933 -56311 28306 -14936 100835 88519
18692H8519i0465A03707e3592k87609a62204p4099d6609B58156A09784b42075
18681H1081h2542p7597B32518c9251F2123J19285l2256a53380M8288F4742K68916
18670C33658g1878J2154m5155n4351k7854r0970Q0942A49998h3737A76491b99717
18658a46068j98771g016C8700J27022f1744l87159K06164d9790B38944D6533J60523
18647B07056a22884A7840g2346J367m2874k7657M4100J0617C02437a43356A87189
18635F7437i0138A32632p518L3866K87405a47082C0080R0828K755b0724k9876
18624e0600k5558A48673g3932j75532A37212C1887a38780l1608A23414a42355
18613c5092l79090b03393Q5152H9201B9186K33565a42250C5867k680J54369C0218
$$ plain form
18692 88519 -90465 103707 -53592 -341201 -162204 -236303 -46609 258156 109784 -242075
18681 81081 -82542 -160139 232518 -39251 62123 181408 149152 -153380 -105092 64742 333658
18670 333658 -71878 -59724 -104879 -159230 -187084 -278054 -197112 149998 -83737 176491 -299717
18658 -146068 -344839 -7016 38700 165722 -61744 -448903 -242739 -49790 238944 46533 207056
18647 207056 -122884 17840 -72346 -70979 -113853 -141510 -97410 -86793 302437 -143356 187189
18635 67437 -90138 132632 125114 158980 446385 -147082 30080 120908 123663 -20724 -50600
18624 -50600 -76158 148673 -73932 -249464 137212 31887 -138780 -170388 123414 -142355
18613 -35092 -414182 -203393 -118241 89201 29186 262751 -142250 35867 33187 187556 30218
18601a46728q1952g5445j38108o5317J10927d2762n5726b2077D3494R3245o5043
18590G1696N471B4223a51476L1609d8531k11573J1785J00010H4295c83298J81115
18579b02183d8955j85410c4224j37842o2221c4970I7422f5466A2348Q0735A1850
18567A70644a67758k30408G427a12573q9309G2491j7911b17740P9975c9279A6566
18555e6964k46F8072a02856I8829k467b19442J02909n0289j7741q2948i7516G5000
18542A98126E7187a32274J8592H1249R9731a59903P3395G5915a05510I8006b04721
18530b33385e2088A61219e5040H1116j2242a43015N7514L2935I6313D4368K46964
18519B91332a15533A9021J15605I655a55921C203b43949E7992a08554j04706K7591
$$ plain form
18601 -146728 -228680 -75445 -213553 -278870 -167943 -42762 -98488 -22077 43494 136739 71696
18590 71696 77167 24223 -151476 -119867 -48531 -260104 -248319 -148309 84295 -383298 -202183
18579 -202183 -48955 -234365 -34224 -172066 -234287 -34970 97422 -65466 12348 93083 11850
18567 170644 -167758 -398166 7427 -112573 -201882 72491 54580 -217740 -137765 -39279 16566
18555 -56964 -57210 68072 -102856 98829 96362 -219442 -116533 -166822 -184563 -267511 -97516 75000
18542 198126 57187 -132274 -113682 81249 180980 -159903 -86508 75915 -105510 98006 -204721
18530 -233385 -52088 161219 -55040 81116 68874 -143015 -85501 -52566 96313 44368 291332
18519 291332 -115533 19021 134626 9655 -155921 3203 -243949 57992 -108554 -213260 -185669
18508a85669Q3700m1276n0942i1148D2556L1326b59873h8485k23331c3677l02417
18497c36094a18623b7865R979e83j8554j33805G3727b98298Q1213P7674A36441
18485b441j50428A00257M4617b21543k6599A50785C3821b30617B84448a42492
18474I0336h7145o9825d9972q2227f217B74642O766a90257N9758j31646I2415
18462G0359a58482g4592J2641j07833K1941L7152A06410a02295K8813p0049E5785
18450e5205C51296A28220c41538A34637c86123D1353a44347A03206b02520F1809
18439a0233A47378b29776A55582b61388A5505a53447C6426b02180D5355M069O9071
18428A18495J42124a97411G8425B8363a83075A57933J71513A32042K14136h7864
$$ plain form
18508 -185669 -101969 -143245 -194187 -91148 42556 73882 -259873 -88485 -311816 -33677 -336094
18497 -336094 -118623 -27865 -17886 -583 -19137 -152942 73727 -298298 -217085 -139411 136441
18485 -2441 -152869 100257 144874 -221543 -248142 150785 33821 -230617 284448 -142492
18474 90336 -87145 -156970 -49972 -132199 -6217 274642 281408 -190257 -130499 -262145 92415
18462 70359 -158482 -74592 -61951 -169784 -147843 -110691 106410 -102295 -73482 -143531 55785
18450 -55205 351296 128220 -341538 134637 -386123 41353 -144347 103206 -202520 61809
18439 -10233 147378 -229776 155582 -261388 15505 -153447 36426 -202180 45355 49424 118495
18428 118495 260619 -197411 78425 28363 -183075 157933 329446 132042 346178 -87864
18417C4318O5307m9731c75979a13361j14127l9832Q6535e1624j41475A39441c30477
18405D22192a64779j28214a10898D00972A27682J55260i0727j49454M8326j06883
18395b98738M9362C22h6485n276B41113H9370j6919e6818H9990Q2133d8135q8909
18383a37044n6153l11202C0766b46522B33432A16360a00427j74774a11965G7288
18372c35155B1169a22253d8117q6439D8490c1773p4512k14595a10501J9186J1725
18361g9590B44407e7341l6350E9994b13241A23606J60199a26614A69829b1195
18350c5652o9134r6766E4249A2197a03069G4683e9170B4239a90188l38778A16055
18338C22527d1047J2402A34972R7357I985d4206k10379D6295e3034B3h6238A06061
$$ plain form
18417 34318 99625 49894 -375979 -113361 -227488 -267320 -180785 -51624 -193099 139441 -330477
18405 422192 -164779 -292993 -110898 400972 127682 282942 -90727 -240181 -191855 -298738
18395 -298738 -249376 322 -86485 -91761 241113 89370 72451 -56818 89990 172123 -48135 -137044
18383 -137044 -193197 -504399 30766 -246522 233432 116360 -100427 -275201 -111965 77288
18372 -335155 21169 -122253 -48117 -134556 48490 -31773 -106285 -320880 -110501 -91315 -79590
18361 -79590 244407 -57341 -93691 59994 -213241 123606 283805 -126614 169829 -21195
18350 -35652 -104786 -201552 54249 12197 -103069 74683 -59170 24239 -190188 -528966 116055
18338 322527 -41047 -28645 134972 232329 9985 -44206 -254585 46295 -53034 23 -86238 106061
18325B2292a62621n3420O6555d1228F9509h5984c7411B65844a94267b2455j49109
18314a71564O472A03473k8576K97477a20549A32253a34096p9907d9200B7283a96364
18302a10444A2502N8435L44079a37406k9920A56253B8093b04316D2499Q9473a18510
18290b75565C33703i1833B18057g0397D4707J27013l7018h6264B24110a45335
18279b06993d6705j03187k11645A12768M4946p4108B0121R4020b0949j5854H6574
18267a346j08886a5459j76337C25756b45380g2696c1363B88211b96297B04800
18256C6109a34184K8623E3532g7627m1625k5056h168n0488m87480A19176a72061
18244a2176B7964a52463B2607K65845H0045b36384n3800j98846A8023J41726N2793
$$ plain form
18325 22292 -162621 -216041 -149486 -41228 69509 -85984 -37411 265844 -194267 -22455 -171564
18314 -171564 -165092 103473 74897 372374 -120549 132253 -134096 -214003 -49200 27283 -196364
18302 -110444 12502 70937 415016 -137406 -167326 156253 28093 -204316 42499 131972 -118510
18290 -275565 333703 -91833 218057 -70397 44707 171720 134702 -86264 224110 -145335
18279 -206993 -46705 -149892 -361537 112768 157714 83606 20121 114141 -20949 -36803 86574
18267 -1346 -110232 -15459 -191796 325756 -245380 -72696 -31363 288211 -296297 204800
18256 36109 -134184 -105561 53532 -77627 -119252 -144308 -8168 -58656 -546136 119176 -172061
18244 -12176 27964 -152463 22607 288452 80045 -236384 -290184 -489030 18023 159749 212542
18233B12542J31446h0684n7984O4509K7825A2775i5901k27839b7078o3414m2930
18222a33422A17369K6798B7053a41327m22886K22573e1063F9614a58442A87229
18211A02637f4668A65210i5321F102K73086F331a24312j85969I4500f6151m05730
18200d71881a23749A21444i0430A13696d9250I940c576k08517B31476b64385A36480
18188B4855A1239i250I301O630O5764a29887L0539A48984M4865l5146b6270B5765
18175C19067A13651b50989j3380J7975B6049b55102j4897M8355d0147k33431J22605
18164a50973G3960A7643J38930M2162b20130i1439B12081j022l5723a95726j16514
18153c12240A40197b28860q0347a08107d9206G5176a24876K5522j88257G5260
$$ plain form
18233 212542 343988 -80684 -138668 -74159 -46334 12775 -95901 -323740 -27078 -90492 -133422
18222 -133422 117369 144167 27053 -141327 -564213 -341640 -51063 69614 -158442 187229
18211 102637 -64668 165210 -95321 6102 279188 6331 -124312 -310281 94500 -66151 -471881
18200 -471881 -123749 121444 -90430 113696 -49250 9940 -3576 -212093 231476 -264385 136480
18188 24855 11239 -9250 9301 15931 81695 -129887 -99348 148984 193849 158703 -26270 25765
18175 319067 113651 -250989 -264369 -246394 26049 -255102 -269999 -221644 -40147 -273578 -150973
18164 -150973 73960 17643 156573 198735 -220130 -91439 212081 211059 175336 -195726 -312240
18153 -312240 140197 -228860 -309207 -108107 -49206 75176 -124876 -99354 -287611 75260
18142a06155G3628b14310O1133B12766b12693L2487f1529F0412a44872G7662J78473
18131B56135C5224a86647j5888b7615A49667a60701q0359E7150p210b67257G9025
18119B6025M7257b45584c1490q0963N2858j83451A77427O5502I9757a18810D53432
18107B10607F7651f5393k26098e1934k4684A41333b62069A00459b70425E7674
18096a90109n659b8256C9830a81912H2449b80666c540j91425p140A49797a50786
18084i4327k61642J75365L0383j05016a16009H3090a22271d1918o8642j00391
18074b10951F3818B0783J74294a30273d4351H5974j7762b4193q2067I3133b4644
18062A71258F937b36502l9598B487J28421d2995j4518C1176a74323A33941a92822
$$ plain form
18142 -106155 73628 -214310 -153177 212766 -212693 -180206 -61529 60412 -144872 77662 256135
18131 256135 35224 -186647 -202535 -27615 149667 -160701 -241060 57150 49940 -267257 79025
18119 26025 73282 -245584 -31490 -112453 -59595 -243046 177427 242929 99757 -118810 453432
18107 210607 67651 -65393 -291491 -51934 -76618 141333 -262069 100459 -270425 57674
18096 -190109 -195768 -28256 39830 -181912 82449 -280666 -3540 -194965 -202105 149797 -150786
18084 -94327 -355969 -180604 -150221 -255237 -116009 83090 -122271 -41918 -110560 -210951
18074 -210951 63818 20783 195077 -130273 -44351 85974 68212 -24193 -106260 93133 -24644
18062 171258 6937 -236502 -276100 2487 130908 -42995 -57513 31176 -174323 133941 -192822
18050E8256a11595K0050k7438A18296d9517j37073C5551L33287A35692d00365
18039e9991j65041A62771c33255h1849A90051A6514a27546A66672C5362a07101
18028B14165A8653f7116m85639d7248E8136b05954k0137b9087E5576q495J80276
18017B27357a49268A02259b78042A52524f583A89577A2248a36168C53447i2241
18006A15111B7657a1812m48965B77572b21161A75444a8309m49062B7951c2165
17995d8628f664A27818n6296c4315j48169H1134b6171B64224d0115J9723j82297
17984b02689A16543a61375J8752L2450C08397G9143b95386A25461a75174m8926
17974b24100I5097b1470G4022D048J14493J53981a13635B11945d7371B5629L33697
$$ plain form
18050 58256 -111595 -91545 -118983 118296 -49517 -186590 35551 368838 135692 -400365
18039 -59991 -225032 162771 -333255 -81849 190051 16514 -127546 166672 35362 -107101
18028 214165 18653 -67116 -552755 -47248 58136 -205954 -226091 -29087 55576 47081 227357
18017 227357 -149268 102259 -278042 152524 -6583 189577 12248 -136168 353447 -92241
18006 115111 27657 -11812 -460777 277572 -221161 175444 -18309 -467371 27951 -32165
17995 -48628 -6664 127818 71522 -34315 -182484 81134 -26171 264224 -40115 -20392 -202689
17984 -202689 116543 -161375 -142623 -110173 308397 79143 -295386 125461 -175174 -224100
17974 -224100 95097 -21470 74022 4048 118541 272522 -113635 211945 -47371 25629 359326
17963C59326c79826F4609a29612j5855C1863i5835D07255a16133j81172M4410
17953b52895C1400a15986A58340D1844b51020Q2937B86648i7G1871B3701a03785
17941A34670Q605o4085g5075A87419a4055A47782k1969c418H7659J9884a86025
17929B24106b99772a7136A04456b53191G8633a99478A58430B0246c5786j93154
17919b28940i8543D4649K76884a38660A13419Q6959a29380I4926M2854c7422j24805
17908a62227B5757a27724l0519a1032B47218a16201n051l9813C30181c1595k9645
17897f1240n7723B34420G3506J88362I649b23588E8113J29932J33144D1520a80219
17885A43334m8258b41921F0950I191b60623g732A7905K34875A18946c22247J57974
$$ plain form
17963 359326 -379826 64609 -129612 -145467 31863 -95835 407255 -116133 -297305 -252895
17953 -252895 31400 -115986 158340 41844 -251020 -168083 286648 -97 71871 23701 -103785
17941 134670 143275 79190 -75075 187419 -14055 147782 125813 -3418 87659 107543 -186025
17929 224106 -299772 -17136 104456 -253191 78633 -199478 158430 20246 -35786 -228940
17919 -228940 -98543 44649 321533 -138660 113419 200378 -129380 94926 137780 -37422 -162227
17908 -162227 25757 -127724 -158243 -11032 247218 -116201 -121252 -161065 330181 -31595 -61240
17897 -61240 -118963 234420 73506 261868 9649 -223588 58113 188045 321189 41520 -180219
17885 143334 95076 -241921 60950 9191 -260623 -7732 17905 252780 118946 -322247 -164273
17874a64273b1479k86764A18213a30717A10356b82682C14181F6060J2255J34635
17864B12950J20927C2706b92215A27549d14789D4912a10660b5940B01568i1110
17853C4261a54588A64472D9112L99656a60342O529e6172j19127j15929J23713
17843a67515g7312C82696A3837R5897d3448B34390b7922A93864f3387h201G0956
17831A86706o1729a8047B3088K99036g4199c1768A11009a36105c1472n0592j32845
17820b14909p4969g6649q3020A12996d5119j47942f1564o7279A57329F0213L2115
17809I2328N8035a22663H4452a04465G3120a32524B12089l5173q7024a05391I3858
17797G6142K00869b02370R6768L791M9312j48881P8591j21965J19303A80335a38658
$$ plain form
17874 -164273 -21479 -308243 118213 -130717 110356 -282682 314181 66060 78315 212950
17864 212950 333877 32706 -292215 127549 -414789 44912 -110660 -25940 201568 -91110
17853 34261 -154588 164472 49112 448768 -160342 -153813 -56172 -175299 -291228 -167515
17843 -167515 -77312 382696 13837 109734 -43448 234390 -27922 193864 -63387 -8201 70956
17831 186706 124977 -18047 23088 322124 -74199 -31768 111009 -136105 -31472 -82064 -214909
17820 -214909 -289878 -76649 -159669 112996 -45119 -193061 -61564 -128843 157329 60213 92328
17809 92328 150363 -122663 84452 -104465 73120 -132524 212089 176916 89892 -105391 93858
17797 76142 277011 -202370 -105602 -101811 -52499 -201380 -122789 -244754 -125451 180335 -138658
17785h1779J0096K9853i928H7448P3523H838R3421p40f2354k49416h1496E2109
17772A33103n8632a84972K5839C88851A26612h3881E6439F895b8932K124A58121
17760B92607j45555a80615C35170H6964e0673j25221B14098o8614l900l4602b73858
17748C49747a35693O0262B93668H5472m166a69513B88693b18086C23272c97557
17737A5395J04489a09441c5432l66626O1447B02395j00581K58976b07093H1001
17726a06429J0489A81826J41020P7556a42724B8176c68452E6694a84334B89623
17715a59437k29280C758J04538g6292j12519C09080A47715b57936M8953h6246
17704b79758a0305p1443d0206C8665h6549E4070d2125n5625K4786A3847b65324
$$ plain form
17785 -81779 -71683 -41830 -9928 87448 160971 8838 102259 101519 -62354 -311770 -81496 52109
17772 133103 74471 -184972 -159133 388851 126612 -83881 56439 6895 -28932 -26808 158121
17760 292607 147052 -180615 335170 86964 -50673 -175894 214098 145484 141584 106982 -273858
17748 349747 -135693 -75431 293668 85472 81306 -169513 288693 -218086 323272 -397557
17737 15395 119884 -109441 -35432 -402058 -340611 202395 101814 360790 -207093 81001
17726 -106429 -95940 181826 322846 400402 -142724 28176 -368452 56694 -184334 289623
17715 -159437 -388717 3758 108296 -76292 -188811 309080 147715 -257936 -208983 -86246
17704 -279758 -10305 -81748 -40206 38665 -86549 54070 -42125 -97750 -72964 13847 -265324
17692A3397d16743E7968a72645r585B16562q2581A1715b70457a06561d5795n2943
17681i8738j1816B55320b46863M1294A51792J4786d51562A87986J31126j27171
17671A91941m7484b00391B12420C0977J82866f6782q9792N2511c449I9628p16
17660I8912J21583B3842O5930b80429a03952G883b22919C0041A546b16513B578
17648C6021L41769A39007a3415A18680d8742l74723B3629O9644J5549a09541j84520
17637b94061a18135N5212E5317a86186G8759L611d1188A23880E5340P8161D2364
17625B16361d459B87966H8982h5417D4107M18889A09754R9211E043N8254a9979
17613b1155N668p53A53766J28644i66k452B11880H6427P1008e2310j16040A49110
$$ plain form
17692 13397 -416743 57968 -172645 -182230 216562 133981 11715 -270457 -106561 -45795 -98738
17681 -98738 -110554 255320 -246863 -205569 151792 166578 -451562 187986 319112 191941
17671 191941 144457 -200391 212420 30977 213843 -66782 -156574 -104063 -3449 99628 98912
17660 98912 220495 23842 89772 -280429 -103952 7883 -222919 30041 1546 -216513 2578
17648 36021 377790 139007 -13415 118680 -48742 -423465 23629 93273 108822 -109541 -294061
17637 -294061 -118135 -62923 55317 -186186 78759 82370 -41188 123880 55340 133501 42364
17625 216361 -4459 287966 88982 -85417 44107 462996 109754 208965 5043 63297 -19979
17613 -21155 -15487 -16240 153766 282410 -966 -3418 211880 86427 157435 -52310 -168350 149110
17600F5897J6072L77224k17555D7500i6656G4342Q9439b09584A7131c5727q4307
17589a20034E0210j7221a50124C11255j10651a92363q4794H0640O4538M0970n3108
17578A33040a16722O705j74828a2308B29753o5336b38842J01753l2454d6883j53511
17567b00394B54925l3292f7017j65683I5150R098e0485A85145G0649A7652N8127
17556G5779I743c8298A52679b39029H6960b50243A82350K48409k13863J26740
17546C43636A35106b925B58314G5642a45805I6899K15364F5338b82276A65653
17535D3663d3808j89514C4936a50998A49588a22958k70869A49932i961I6591J28691
17524B25282b1615I1346J28045I4591L26807j91816E5300L27159e3169A37749
$$ plain form
17600 65897 81969 459193 241638 47500 -96656 74342 163781 -209584 17131 -35727 -120034
17589 -120034 50210 32989 -150124 311255 200604 -192363 -277157 80640 145178 186148 133040
17578 133040 -116722 -110017 -284845 -12308 229753 164417 -238842 -137089 -169543 -46883 -200394
17567 -200394 254925 221633 -67017 -232700 95150 104248 -50485 185145 70649 17652 75779
17556 75779 9743 -38298 152679 -239029 86960 -250243 182350 430759 216896 343636
17546 343636 135106 -2925 258314 75642 -145805 96899 312263 65338 -282276 165653
17535 43663 -43808 -233322 34936 -150998 149588 -122958 -393827 149932 -9961 96591 225282
17524 225282 -21615 91346 219391 94591 421398 229582 55300 382459 -53169 137749
17513c8856A39425J8646m6545J69601n4051H4966j1889a55499p3559e7481B18514
17501B44521a36328E1295b9749B07799N3750A22070O0515P9770r2108K13321F8180
17489D9089O105h2630B51693o8621q4372L3539H839K33589b9217A50510d7111
17477B04146d4511J5742o742j56853Q7531C04707C7437c12767J38108I6605M5683
17466A42288J49432j20490a73665D3525M25192F6553a28011A23917b3569A61940
17455g0122A90390L15825n7289B18516L3148G3715K52840r2413J70074J64649
17445E68865A32104K22631J41007B04728J65345L1103A55798a78745d8296A12730
17434A86284D9602L27668A78420L52164A58377l7190o0095P2301K80782j08250
$$ plain form
17513 -38856 139425 158071 111526 281127 227076 84966 73077 -155499 -229058 -57481 218514
17501 244521 -136328 51295 -29749 207799 261549 122070 182585 262355 170247 383568 68180
17489 49089 55194 -82630 251693 183072 98700 132239 8839 242428 -29217 150510 -47111
17477 204146 -44511 -28769 -35511 -192364 -104833 304707 37437 -312767 -174659 96605 142288
17466 142288 291720 171230 -173665 43525 468717 66553 -128011 123917 -23569 161940
17455 -70122 190390 506215 448926 218516 251664 73715 326555 234142 404216 568865
17445 568865 132104 354735 495742 204728 370073 401176 155798 -178745 -48296 112730
17434 186284 49602 377270 178420 530584 158377 121187 61092 133393 414175 305925
17424C05925A48776J38239j0814A11535J25004P1864J15556M1471B00043n6522
17414A43521N53245B8132L94281a1033F5116L01122a55158A52603m8046J14398
17404B18955J4078N2531H2824m0338a25240D41124B5039b06037A50652N5755h8984
17392B02526q2999l4542c2475D98595d7188B19188i6542n8959B01645n9780L40038
17381D81903E9613J54715J12685J6912F037K99128e5116g128A14664C2440K24002
17370B56442a34339C42294G8621l1495P70i527A9089K01794N2958L2066A20693
17358A02626m7125a3670l6284A43701K56530A4916Q9904J82024l3753j736H3405
17346A63590G5285K28215C3251K34615b6644B98768j6692K60610A02101L9657
$$ plain form
17424 305925 148776 287015 276201 111535 236539 308403 423959 465430 200043 143521
17414 143521 696766 28132 422413 -11033 65116 366238 -155158 152603 104557 218955
17404 218955 233033 285564 82824 42486 -125240 441124 25039 -206037 150652 206407 -88984
17392 202526 119527 84985 -32475 498595 -47188 219188 -96542 -155501 201645 141865 481903
17381 481903 59613 214328 327013 343925 6037 305165 -55116 -7128 114664 32440 256442
17370 256442 -134339 342294 78621 47126 47896 -9527 19089 220883 273841 305907 120693
17358 102626 55501 -13670 -49954 143701 400231 14916 104820 286844 253091 251355 83405
17346 163590 75285 303500 33251 267866 -26644 298768 282076 542686 102101 141758
17336A41758J42609b57724C9512K00172Q9262H9331K7285k4584J44717m0673H4495
17324A07625L50493j28443i9627F7612a90979e0205C24572A22755d753m3286C86645
17312B12366H2550a02555A21278A0462L54954b03387L5934C63591A79895B5064
17301C8600K14555a85773A22744a921F61625d41A28904g7548H6653L58408A22114
17289D88521I2815A8598b4852F0533L02650C0228L53224A87321K14835F4352d6295
17277A22391J34796l0086b666l1338I6906L58127A70443k9592J9464K18484A8468
17265C56292j54737o7972J8648Q8546K00174C2354J10997a42811c8372B78778
17254a5543D895L18464p1557C7013Q3062Q582R8191N3483L69196b48695A29341
$$ plain form
17336 141758 284367 -257724 39512 239684 328946 89331 116616 92032 236749 196076 84495
17324 107625 458118 329675 -99627 67612 -190979 -50205 324572 122755 -4753 -48039 386645
17312 212366 82550 -102555 121278 10462 365416 -203387 -167453 363591 179895 25064
17301 38600 253155 -185773 122744 -1921 661625 -441 128904 -77548 86653 445061 122114
17289 488521 92815 18598 -24852 60533 363183 30228 383452 187321 402156 64352 -46295
17277 122391 257187 227101 -2666 -34004 96906 455033 170443 140851 160315 378799 18468
17265 356292 201555 133583 152231 240777 440951 32354 143351 -142811 -38372 278778
17254 -15543 4895 323359 251802 37013 120075 128657 226848 280331 649527 -248695 129341
17242C37952c5605C85895A83329m3600J57765I6160J86948p1527l4929F7998K64172
17231C32170P2269A82405b20677B60365I6379K65182q3612a20081B31129F3183
17220A80574l9703J27772B0062N50278F4647J99185A25898K8752K95712o3710
17210C86652A66653N7759k4831p9672M272a6711C15124A16297L8747b87650C71287
17198B01364L18921A80152J59579K4930A71283g6037A01746m3241K65439j50670
17188A73274J22306K48509A92848j2703h8913B38258a01853B04023J88373J40065
17178E32461j41331h1052E48530B50256H5452L43349A68413f8167F75598A90968
17167B07238m0647j3687K69553J19768A81798J27160R034Q8264q4714b70541A47915
$$ plain form
17242 337952 -35605 385895 183329 139729 297494 96160 283108 211581 176652 67998 332170
17231 332170 404439 182405 -220677 260365 96379 361561 277949 -120081 231129 63183
17220 180574 140871 268643 20062 570340 64647 263832 125898 154650 450362 386652
17210 386652 166653 224412 199581 119909 124181 -16711 315124 116297 155044 -287650 371287
17198 201364 520285 180152 339731 364661 171283 -76037 101746 58505 323944 173274
17188 173274 295580 544089 192848 180145 -88913 238258 -101853 204023 392396 532461
17178 532461 391130 -81052 548530 250256 85452 428801 168413 -68167 675598 190968
17167 207238 166591 152904 422457 542225 181798 308958 317992 406256 321542 -270541 147915
17155b3751D18259r7793k6015j0050J75466A12568i6625B44770q5226P3241M32357
17144F65142C13041j43223N55895C26776L0853j59219N4418o2734K97229p6694
17134D10629D6457K54053R8097j68965O1561J75607j87916J5731h1579B84867
17123C81178L0028k01065K2023J92446j96143L34101o208k12956K68982C05112
17112G8887L45341N9930J50562k17583J6603o5760K90533k46663K46459k46364
17102D11945J36684k28364J95173p0078L3175j73522N9360A6311P13315C25752
17091D14471j89882J24448J44943k18700f6319D81002J3614n7433k11169l0822
17081A95192Q0556K21993k26859M36293p2997p0242j11607B10670J23614K98026
$$ plain form
17155 -23751 418259 320466 294451 284401 459867 112568 -96625 244770 159544 232785 665142
17144 665142 313041 169818 725713 326776 357629 198410 252828 190094 487323 410629
17134 410629 46457 300510 398607 229642 291203 466810 278894 294625 -81579 284867
17123 381178 411206 210141 232164 424610 228467 562568 556360 343404 612386 305112
17112 78887 424228 484158 634720 417137 433740 367980 658513 411850 658309 411945
17102 411945 548629 320265 515438 445360 478535 305013 364373 16311 729626 325752
17091 414471 224589 349037 493980 275280 -66319 481002 494616 437183 226014 195192
17081 195192 275748 497741 270882 707175 634178 563936 452329 210670 334284 632310
17071F32310k47829M9075p9349K68708B36784K74328j23875j13952K1268M49801
17061G44354l47443k5156P4675P529j81725J87020o0032K15593B52284K73601
17051E25885o3711p1683L20695j11145k13733M20083j94431k6541j83071n7896
17041C44452K06863k46967J52851k8121N19725k40067j40815F5809M86516j93787
17031C58538L07805J10912j42468m4269O6011n497J5690K48456C91378L05791
17021F97169j0919O5528j2504o6616M0557M1528k09078P4160j32686L54872l61213
17010D80798o3699K16252m0833N6134K20167m9857j82138J60304J17926k88706
17000F26348J08988L1409J49976J7507p2512Q958r9495o3096J84470j57134k10178
$$ plain form
17071 632310 384481 433556 354207 622915 236784 511112 387237 273285 294553 744354
17061 744354 396911 371755 446430 453959 272234 459254 399222 614815 252284 525885
17051 525885 462174 390491 711186 600041 386308 806391 611960 585419 402348 344452
17041 344452 551315 304348 457199 429078 948803 708736 567921 65809 552325 358538
17031 358538 666343 777255 634787 590518 656529 651032 666722 915178 391378 697169
17021 697169 686250 751778 739274 672658 713215 754743 545665 619825 487139 842011 480798
17010 480798 417099 633351 592518 648652 868819 818962 636824 797128 915054 626348
17000 626348 735336 766745 916721 934228 861716 870674 771179 708083 892553 735419 525241
16989E25241M04312l01138K38772j2036N127k04856K52923D14648N71180J34418
16979A120246k11820j09751K04377k67346L5480L13723K8023k14246M3513O2845
16969A005044j42383j92042J00167K63796n8944j65143N8800J29385j91520J63314
16959I70474j05779K52604p9603J16393L9413j48850k0610J37968O2446l71975
16949H52481J33270K01228j81627l0099J65719k08652L10523O512j38159p3438
16939A037758J23305J86710l8184o8357m61010J39690J29981K32228m9644K8505
16929A260982m7579J65131j20462j09316j70857N55857r6877K29402j78176k04098
16919A284007J77641j5139N2966j13517K69798n1759l7667L77766l14177k35505
$$ plain form
16989 525241 929553 628415 867187 855151 860278 655422 908345 414648 985828 1120246
16979 1120246 908426 798675 1003052 735706 771186 1084909 1112932 898686 942199 1005044
16969 1005044 862661 670619 770786 1034582 975638 810495 869295 998680 807160 970474
16959 970474 864695 1117299 1037696 1154089 1193502 1044652 1024042 1162010 1224456 852481
16949 852481 985751 1186979 1005352 975253 1140972 932320 1242843 1249355 1111196 1037758
16939 1037758 1161063 1347773 1309589 1241232 780222 919912 1049893 1282121 1232477 1260982
16929 1260982 1213403 1378534 1258072 1148756 977899 1533756 1436879 1666281 1488105 1284007
16919 1284007 1461648 1446509 1499475 1385958 1655756 1603997 1566330 1944096 1629919 1394414
16909A394414Q1250J93222q2062K45937m06950K95951l93879L68963k38450J32100
16899A590496K40346j13035n1231J77257j29294j88689J96088J58743k86576k5755
16889A568350M15315L294j58853L15370j96274J5821J08487j46519L56603K6306
16879B307900k42164j42536L03454M1909K3636O8996R3210J45765k99830K11730
16869B512070J43024m9522M5656l909q1581j19864K62352J48458K24251J5403
16859C096338m79333J22402M92136k51243n9575R1629L9500R3770J54282p7132
16849C222774M2081r4295k29824O99641J10135m55763L95354k26926K90771K26225
16839C980173j30844J66569j53288K8141K55916k48121O91836k74578k10444J06410
$$ plain form
16909 1394414 1475664 1668886 1586824 1832761 1425811 1721762 1327883 1696846 1458396 1590496
16899 1590496 1830842 1717807 1666576 1843833 1714539 1525850 1721938 1880681 1594105 1568350
16889 1568350 1983665 1986959 1828106 2143476 1947202 1963023 2071510 1924991 2281594 2307900
16879 2307900 2065736 1923200 2226654 2268563 2292199 2361195 2454405 2600170 2300340 2512070
16869 2512070 2655094 2605572 2651228 2647319 2565738 2445874 2708226 2856684 3080935 3096338
16859 3096338 2617005 2739407 3231543 2980300 2920725 3012354 3051854 3145624 3299906 3222774
16849 3222774 3264855 3170560 2940736 3640377 3750512 3294749 3690103 3463177 3753948 3980173
16839 3980173 3849329 4015898 3862610 3890751 4146667 3898546 4590382 4315804 4105360 4211770
16829D211770K70883J71431Q586o4551K13324K17490J9564J62235l4729L25482
16819E501485k12379K01764K12366j58619K13417L61655j33069M09757M8819K99635
16809F744831j53699J77711J38218J22765m9790L81205J58985J62766k22802P29754
16799H189944j70149M53780J01672R8197L01381L84915J71949J00147M04399j17585
16789I918650O45637J70770N18666l065L92320N25359K73251R6929P93960L76911
16779A3709388M70682K29027K00800N53671P26129J06222P71479O57423N50755
16770A7975576Q02664M48591M13197Q03553P13205R09022J077835Q32438J079181
16761B5055262J063496P98679Q16409J334198J943346N82210J349098J630028
$$ plain form
16829 4211770 4482653 4654084 4662670 4598119 4811443 5028933 5048497 5210732 5176003 5501485
16819 5501485 5289106 5490870 5703236 5544617 5758034 6119689 5986620 6396377 6445196 6744831
16809 6744831 6591132 6768843 6907061 7029826 6980036 7361241 7520226 7682992 7460190 8189944
16799 8189944 8019795 8473575 8575247 8673444 8974825 9359740 9531689 9631836 10036235 9918650
16789 9918650 10564287 10735057 11253723 11250658 11642978 12168337 12441588 12538517 13332477 13709388
16779 13709388 14180070 14409097 14609897 15163568 15889697 15995919 16767398 17424821 17975576
16770 17975576 18778240 19226831 19640028 20443581 21156786 22065808 23143643 23976081 25055262
16761 25055262 26118758 26917437 27733846 29068044 31011390 31593600 32942698 34572726
16753C4572726J920171J553518J796945K377869J799736K082046K484303K517541
16745E1104855K749751K927864L065578L826064L217987M260321L863232M488109
16737G9503761M844735N179597N371018O084611O242462O893529O897786P285554
16729A28303053P895450Q038130P830543Q344226Q129807Q011673P385964O754736
16721A90693582N878398M904661L340980K530748R99814q94579j882262l740485
16713B01830857m636969o078357o725402p430394q046056q333925q264240q574126
16705A43741388q197420q133680p598948p017951o863002o960674n825074n627108
16697H7517531n165473m896895m338994m637750l688736l655114l429789l640515
$$ plain form
16753 34572726 36492897 38046415 39843360 42221229 44020965 46103011 48587314 51104855
16745 51104855 53854606 56782470 59848048 63674112 66892099 71152420 75015652 79503761
16737 79503761 84348496 89528093 94899111 100983722 107226184 114119713 121017499 128303053
16729 128303053 136198503 144236633 152067176 160411402 168541209 176552882 183938846 190693582
16721 190693582 196571980 201476641 204817621 207348369 208348183 207453604 205571342 201830857
16713 201830857 197193888 191115531 184390129 176959735 168913679 160579754 152315514 143741388
16705 143741388 135543968 127410288 119811340 112793389 105930387 98969713 93144639 87517531
16697 87517531 82352058 77455163 73116169 68478419 64789683 61134569 57704780 54064265
16689E4064265k067307l135337k840693k205918j993841k061789j854960k098510
16681C5805910j691112j370840j252219j813831j125693j116325j330626q47135
16673B5258129j102242q13963j109050j072647p20770l71109p98794q47414q72611
16664A7549529m21900p23123k77912p53311n45915l90258n95358j86766o22232
16655A3032754k74454r14668J03530n12489l14339l22805m61827j4154m34851
16646I886697j84653k97857k84821l66224j34038M5699o76901j2373J04713m45183
16636G635059l8805k75208k36063L41389m41048m00007j47434l30273J0574j08365
16626F009819j22010k70302J12895k39110j33547j84956R7474n47808M19751L4247
$$ plain form
16689 54064265 51996958 48861621 46020928 43815010 41821169 39759380 37904420 35805910
16681 35805910 34114798 32743958 31491739 29677908 28552215 27435890 26105264 25258129
16673 25258129 24155887 23341924 22232874 21160227 20439457 20068348 19269554 18422140 17549529
16664 17549529 17127629 16404506 16126594 15373283 14827368 14437110 13841752 13654986 13032754
16655 13032754 12758300 11843632 11947162 11434673 11120334 10797529 10335702 10321548 9886697
16646 9886697 9702044 9404187 9119366 8753142 8619104 8664803 7987902 7975529 8080242 7635059
16636 7635059 7596254 7321046 7084983 7426372 6985324 6585317 6437883 6107610 6118184 6009819
16626 6009819 5887809 5617507 5730402 5491292 5357745 5172789 5270263 4722455 5142206 5176453
16616E176453k41620m64584o5851K3349L8663n4447k45328m7488J05175m9834
16606D174488l71333N65047m29391m23426K74874l09800j66885p2468O684j68732
16596C079058K55037r0146j69539J19991l08714L3553J52790k01269p2199J32575
16586B931137p1468O4403l26015N7818l7839j54477j53321q7807L19941k32321
16576B310051m6295k70390Q3563J85044j01491k71762N97666l81639n2259K39030
16566B291518r1321l05276K9156j8583N8152p5431M1238n2078K90966q9118q1545
16555A997678k654m01753O9344j00069p6111k018J92416k18262J39233l0939P0401
16544A637266P2944j18980j31867m3086n2135k29122N35976l38884L66173k53602
$$ plain form
16616 5176453 4934833 4470249 4404398 4427747 4466410 4411963 4166635 4119147 4224322 4174488
16606 4174488 3803155 4368202 3938811 3515385 3790259 3480459 3313574 3241106 3247790 3079058
16596 3079058 3334095 3243949 3074410 3194401 2885687 2919240 3072030 2870761 2798562 2931137
16586 2931137 2859669 2924072 2598057 2655875 2618036 2463559 2310238 2222431 2542372 2310051
16576 2310051 2263756 1993366 2076929 2261973 2160482 1888720 2486386 2104747 2052488 2291518
16566 2291518 2200197 1894921 1924077 1905494 1963646 1888215 1929453 1877375 2168341 2079223 1997678
16555 1997678 1995024 1593271 1662615 1562546 1486435 1484417 1676833 1458571 1597804 1566865 1637266
16544 1637266 1710210 1591230 1459363 1416277 1364142 1135020 1670996 1332112 1698285 1444683
16534A444683j23652L36304j23743m16990j23240N15283j31413j20153R6421k78475
16524A075025j22351M33332k61396k14849K56393K0639q7057q6976K6357j44615
16514H94502J96001J75914m36411L10493j47148j70775J95341J3140r1867L1816
16504I71006J82672m1613k06530n5758m0239K60298k03682R1440n6282q1955J60926
16493I80283j47526k42333J45928l704j17379J09940L39856k97686k41138M20540
16483I46781m43884L95422j87033O1092j38456J38116o9164j81071O6058L52380
16473I40241j3741l3635j83444K72225k01322J7366J06467P3490k49504k82021
16463D46122L43912k75623M4420n7705K03841j58745J1598M32166k36283k83211
$$ plain form
16534 1444683 1321031 1657335 1533592 1116602 993362 1508645 1377232 1257079 1353500 1075025
16524 1075025 952674 1386006 1124610 909761 1166154 1186793 1099736 1012760 1039117 894502
16514 894502 1090503 1266417 830006 1140499 993351 822576 1017917 1031057 939190 971006
16504 971006 1153678 1112065 905535 849777 809538 1069836 866154 957594 901312 819357 980283
16493 980283 832757 590424 736352 732648 615269 725209 1065065 767379 526241 946781
16483 946781 502897 898319 711286 772378 633922 772038 702874 521803 587861 940241
16473 940241 926500 892865 709421 981646 780324 797690 904157 977647 728143 446122
16463 446122 790034 514411 558831 501126 704967 546222 557820 989986 753703 470492
16453D70492M16214D11810J56006J9814O9208l00464J97155j62052K34765j43754
16443D82488P1442o869j26243K17239j37789L1571L53980l11001k53492J91661
16433E12987J42116P4876j10819r0003J68434j27480p7082k01920J79743J13134
16423E83986J16651n5598k22312n0109L75108B58095N55020k85964K27828B56344
16412D64300k30425P892J22856J18432k041k13931L13057A7603K31380N66565
16402H15548l16445A29499M55997j59522q7078L08840B08063q2745L45053j06943
16392C63428M58408B97768c3587B48887N01497j88821A93763l994K57738m2690
16382D04817J94558J53934A14173a82811E38197j52303K2146p2324J30972j96697
$$ plain form
16453 470492 886706 411810 567816 587630 656838 356374 553529 391477 626242 482488
16443 482488 553930 547061 420818 638057 500268 531839 885819 574818 321326 512987
16433 512987 655103 729979 619160 529157 697591 570111 493029 291109 470852 583986
16423 583986 700637 645039 422727 372618 747726 258095 813115 527151 754979 256344
16412 464300 233875 241767 364623 483055 481014 267083 580140 17603 248983 815548
16402 815548 499103 129499 585496 425974 338896 647736 208063 125318 470371 363428
16392 363428 821836 297768 -33587 248887 750384 561563 193763 189769 447507 404817
16382 404817 599375 753309 114173 -182811 538197 385894 408040 335716 466688 269991
16372B69991G1539K40727A21837K29661L6554J38163q1500e5597B30424o9625
16362A60799F5096Q6753K57781A29869M7889L24247M813m2220j89620K44320A28567
16350A93247g3928A64176J13699p6360C5942N51593a10287r015A11802O4682K71487
16339D47971G0096M60350a58880D58914k7390j61212F8513K56798O0376p5131
16329C10556J24602n9099I7717N299L82292A52396J61964g2361D49657k3601b2683
16317B92842r4907L52517k48920j20009O3484K6173A00796B3723M58624F9612
16306e1569j9989C87380j87514L3683J3841l9655k2830a03374C7131J12400m7279
16295A02252L79705j94527A07550K78363j31804m8735c5688B47688l1293K05077
$$ plain form
16372 269991 71539 312266 121837 351498 388052 526215 444715 -55597 230424 160799
16362 160799 65096 151849 409630 129869 177758 502005 506818 464598 274978 519298 128567
16350 193247 -73928 164176 277875 201515 35942 587535 -110287 -119302 111802 176484 447971
16339 447971 70096 530446 -158880 458914 431524 270312 68513 325311 385687 310556
16329 310556 435158 376059 97717 103016 485308 152396 314360 -72361 449657 426056 -22683
16317 292842 197935 550452 301532 181523 245007 271180 100796 23723 482347 69612
16306 -51569 -71558 387380 199866 233549 247390 207735 184905 -103374 37131 149531 102252
16295 102252 481957 287430 107550 385913 254109 205374 -35688 247688 216395 421472
16285D21472Q537A20023K80148j05358J64199d3852D87622I7297K82850p9740
16275C00407m6050a1825B04278J26647o6260L0784a9475D60098J2085A55741L4315
16264A90056k0522B4178f6964C62492F611J92879p5412m664a8024B576M04783
16253D07359m8275A29636k77K22667c3983B18165A08457M02374B36608C222a56392
16241A81951a89981A32307o4035K50890j13246a16792A08906j6025C2926K96788
16231C29714o2943A06583J0004D7051J97359B4087J8913N3310k5385a67783B45586
16219A74890P262m2884F5315a2556r928A30351k9723a46025f7323C66359m1061
16208C25298l9964G6104K77094r4573c8849B06100i8064f652p9211A49166R3412
$$ plain form
16285 421472 430009 120023 400171 294813 459012 -43852 487622 97297 380147 300407
16275 300407 254357 -11825 204278 330925 264665 295449 -19475 460098 472183 155741 190056
16264 190056 169534 24178 -66964 362492 6611 199490 124078 119414 -18024 2576 407359
16253 407359 359084 129636 129359 352026 -33983 218165 108457 510831 236608 3222 -156392
16241 181951 -189981 132307 68272 319162 205916 -116792 108906 92881 32926 329714
16231 329714 266771 106583 116587 47051 244410 24087 43000 96310 70925 -167783 245586
16219 174890 182152 139268 65315 -12556 -22484 130351 100628 -146025 -67323 366359 325298
16208 325298 285334 76104 353198 258625 -38849 206100 -98064 -6652 -85863 149166 242578
16197B42578E3541K41831N3856j18548p8213P6617A9540K10358b42242A87758
16186B68084p3216F7755b12987b3057B55315c0084l05300B13760B5063O0370G250
16174e5900j42478A03030P474D7084j5611b65492g0751B68371C1443g6324A24401
16162A08812f9264B00049c0971B10094a25738A51880B0013K85517E6737O0349
16152A17086a72454A66937F4982K7073K80296A63121e534B32711D5275L1868J8060
16141I5203J76749b9480k46356A66906A0079J74242a20895I773Q8684B6308b18401
16129f5561j73989k6552A24623L1870f0996j44293d7009I4287O7669o883o5665
16118H9408g3408A71677l3266b9035j6644G0112J78925a21321m32959I8217C7468
$$ plain form
16197 242578 53541 295372 349228 230680 152467 229084 19540 229898 -242242 187758
16186 268084 194868 67755 -212987 -23057 255315 -30084 -335384 213760 25063 85433 7250
16174 -55900 -198378 103030 110504 47084 31473 -265492 -70751 268371 31443 -76324 124401
16162 108812 -69264 200049 -30971 210094 -125738 151880 20013 305530 56737 117086
16152 117086 -172454 166937 64982 92055 372351 163121 -5534 232711 45275 77143 95203
16141 95203 271952 -29480 -275836 166906 10079 184321 -120895 9773 98457 26308 -218401
16129 -65561 -239550 -266102 124623 156493 -60996 -205289 -47009 94287 161956 155073 89408
16118 89408 -73408 171677 138411 -29035 -45679 70112 249037 -121321 -554280 98217 37468
16106A07459b33019j1542J04252Q222B30483Q1635a3420j4369A84053Q1762e3084
16094b0899C16606I5693l7192B5045a96341j35769a01041q8031D02745a71139
16083b7725G1500J01381B4876d05801B42677a69594a1756B68574l2979I8276a3783
16071b06060J00987C25406a62582p6717q8781A72120N0245b922A97433q0377b41781
16059b56335B84867J550A27424I004b62843B56540f0388a4790A42031O6316f5131
16047A44213C3835J12473d6121H436c64115B22308C7610c52902C4284e0100p7224
16036a27324j04072a7939C10365j43327b0109A88739a78464O035k34674J30698
16026b76405i5358L9816j64731J06315o8176k37251i0999B14706q8597o766a31751
$$ plain form
16106 107459 -233019 -244561 -140309 -132087 230483 312118 -13420 -27789 184053 265815 -53084
16094 -20899 316606 95693 58501 25045 -196341 -332110 -101041 -189072 402745 -171139
16083 -27725 71500 172881 24876 -405801 242677 -169594 -11756 268574 235595 98276 -13783
16071 -206060 -105073 325406 -162582 -239299 -328080 172120 222365 -2922 197433 117056 -241781
16059 -256335 284867 286417 127424 9004 -262843 256540 -60388 -14790 142031 208347 -65131
16047 144213 33835 146308 -46121 8436 -364115 222308 37610 -352902 34284 -50100 -127324
16036 -127324 -231396 -17939 310365 167038 -20109 188739 -178464 -172429 -407103 -276405
16026 -276405 -95358 -55542 -220273 -113958 -182134 -419385 -90999 214706 126109 119343 -131751
16014A09671J15048E703J3851K237O5494f1093p8904O8774j38862d8577A44028
16002B41360H4257C7226f5945B31181K47692A63973a65557j4870C3391J37386
15992A70777K3361G2973O7854c36399g432j5555j71830c2458a4599A21732K02477
15981C24209a87567B55717g1201C60768e4695D2448a27660G5834Q1928c9821A63118
15969D0762j3135h6425j4187B15066a05440K4721D4977J82305O5233j24177C3005
15957a53876A1712Q2328k3906a2158j74574A21052K10141A7553b6215D113g7469
15945d2022n818i933m2767b4161A48281b24289e7490g980A50366d35772C7364
15933b40432i4254r8102A43698A6134J05932E4857b97315j00999a61626b4022
$$ plain form
16014 109671 224719 5703 19554 21791 87285 -61093 -139997 -71223 -210085 -48577 144028
16002 241360 84257 37226 -65945 231181 478873 163973 -165557 -180427 33391 170777
15992 170777 194138 72973 140827 -336399 -7432 -22987 -194817 -32458 -14599 121732 324209
15981 324209 -187567 255717 -71201 360768 -54695 42448 -127660 75834 157762 -39821 163118
15969 40762 27627 -86425 -100612 215066 -105440 -80719 44977 227282 292515 168338 33005
15957 -153876 11712 94040 70134 -12158 -186732 121052 331193 17553 -26215 4113 -77469
15945 -42022 -47840 -9933 -52700 -24161 148281 -224289 -57490 -7980 150366 -435772 37364
15933 -240432 -94254 -192356 143698 16134 122066 54857 -297315 -398314 -161626 -24022
15922A90484h9473j15858N3338B54468i4364L5490a4673j2357A524K1502a00458
15910a8179A44388B1824C687a91118B3193b8819F7746b48592j81190B6277J71243
15899A97520f52732i1105A3781L7616c02893E2598a48222k07759B4125d2259B1111
15887a1232j33835B23044n9656j0689i9892A26104f758l30094m1789a68292P2574
15876i5718k28646a09356o8727p7771B43529g6238H484f9510k84136G5458Q1561
15865A57019a23539k47618g1465B01421f3769b1046A4840K22247g3171n7462J0092
15854a20541e8612l9642B60436D0428i632A0956a61047A76910e0639H2473Q9986
15843A72459f5093I0292r313J0439R2107k3943F9764k5958c3682A88369m7755
$$ plain form
15922 190484 -89473 -205331 -151993 254468 -94364 -58874 -14673 -27030 1524 23026 -100458
15910 -18179 144388 21824 3687 -191118 23193 -28819 67746 -248592 -429782 26277 197520
15899 197520 -652732 -91105 13781 51397 -302893 52598 -148222 -355981 24125 -42259 21111
15887 -11232 -145067 223044 163388 152699 -99892 126104 -6758 -336852 -378641 -168292 -95718
15876 -95718 -324364 -109356 -178083 -255854 243529 -76238 8484 -69510 -353646 75458 157019
15865 157019 -123539 -371157 -71465 201421 -63769 -21046 14840 237087 -73171 -130633 -120541
15854 -120541 -58612 -98254 260436 40428 -9632 10956 -161047 176910 -50639 82473 172459
15843 172459 -65093 90292 80979 91418 183525 159582 69764 43806 -33682 188369 140614
15832A40614e12672a81636a3844j39478m3758h4705r8422D76985a4479l038j96852
15821b14369A83663h5190J6198I1534D844d7034A06324a13818j41649J00024c3011
15809f4184k51007R9556C48724A20837l6069b42806a2346k6197A19600a45493
15798G4998a91772A1109J17393b21172A38517a5664C30477A9683a15157K6313
15788h8844q0910L0634A5743F141a19006j45137K7963o5861a28626L6127k4550
15777a17049N0398q8545g0539k46933c0859j72544M1018j22743a40751g0087A89230
15765b10701o482B75716n1893r2948b70679a7902m9352A32767J73250F763J77307
15754A84070c4222l7288b2234k17177k208G928g3755A41554b40553I0064N9478
$$ plain form
15832 140614 -512672 -181636 -13844 -153322 -197080 -84705 -183127 476985 -14479 -17517 -214369
15821 -214369 183663 -85190 -68992 91534 4844 -47034 106324 -113818 -255467 -155443 -33011
15809 -64184 -315191 -215635 348724 120837 84768 -242806 -12346 -38543 119600 -145493
15798 74998 -191772 11109 128502 -221172 138517 -15664 330477 19683 -115157 -88844
15788 -88844 -169754 -139120 15743 6141 -119006 -264143 -236180 -302041 -128626 -92499 -117049
15777 -117049 -66651 -155196 -70539 -317472 -30859 -203403 -162385 -285128 -140751 -70087 189230
15765 -210701 -217183 275716 223823 130875 -270679 -17902 -67254 132767 306017 6763 184070
15754 184070 -34222 -71510 -22234 -239411 -241619 7928 -73755 141554 -240553 90064 149542
15743A49542D1884J89225a82085a1641j84915M9691A0333c8285l12j33920E1206
15731A45911a34880r8669J9810A16113a41303k51817C8378J78288d05619a05423
15720B97140a92799P1109l9143n2904j08444I1362J35006G8442J7525g7421j15613
15709a93034B81677b07385K5055M3117n4336P4365K0651D3627a2333n6382l8599
15698a07314J2939k6206A42790b10228Q1889C02482o0123n2895i713l0789J3726
15687b6776o8618J4099A39072c28016C68132j50911a00875C39610a64083A41192
15676b18584d1927E7385F762a48694N8155A41504l3885c37652J57066d7038k46401
15665b93439A68650f5645j46336j96299J24634d1853A7278b77055h6190j22677
$$ plain form
15743 149542 41884 231109 -182085 -11641 -196556 -146865 10333 -38285 -38597 -172517 51206
15731 145911 -134880 -233549 -213739 116113 -141303 -393120 38378 216666 -405619 -105423
15720 297140 -192799 -121690 -160833 -213737 -322181 91362 226368 78442 95967 -77421 -193034
15709 -193034 281677 -207385 -182330 -139213 -193549 -119184 -98533 43627 -12333 -68715 -107314
15698 -107314 -94375 -120581 142790 -210228 -128339 302482 242359 189464 -9713 -40502 -26776
15687 -26776 -95394 -81295 139072 -328016 368132 217221 -100875 339610 -164083 141192
15676 -218584 -41927 57385 6762 -148694 -90539 141504 107619 -337652 -180586 -47038 -293439
15665 -293439 168650 -65645 -211981 -408280 -283646 -41853 17278 -277055 -86190 -208867
15655b08867M6768g805l34647B6528H231O616b37122D1124b5683F834a41433l7354
15643a78787G9684i9919A45446b83125C14017A38529a57656C8187J07107a9599
15632a38743B4587a54802M6071E424g0908j19893l58291C69737p3369a15817r6333
15621b12150e9440k00634E0451R133M4325K2970N5876c0401B91189b77339a08733
15609b4093q2012k2936b4525j27700e1680G1809c39643C32365a22022j05779e3896
15597G8269b42374N7590A73684I233b00470k6142i9678c1304A21084a71943B31470
15585b22335B68229j24930m9122a08440l1895A57472e22710I5497c17951J47436
15575a70515J5426E872K17371I1873a11553J0342A39348K30144c5195B17353d7254
$$ plain form
15655 -208867 -162099 -7805 -342452 26528 8231 14847 -237122 41124 -25683 6834 -141433 -178787
15643 -178787 79684 -99919 145446 -283125 314017 138529 -157656 38187 145294 -19599
15632 -138743 24587 -154802 -108731 5424 -70908 -190801 -549092 369737 296368 -115817 -212150
15621 -212150 -59440 -260074 50451 59584 103909 126879 182755 -30401 291189 -277339 -108733
15609 -24093 -106105 -129041 -24525 -152225 -51680 71809 -339643 332365 -122022 -227801 -53896
15597 78269 -242374 -184784 173684 9233 -200470 -226612 -99678 -31304 121084 -171943 231470
15585 -222335 268229 143299 94177 -108440 -140335 157472 -522710 95497 -317951 -170515
15575 -170515 -155089 5872 223243 91873 -111553 -101211 139348 369492 -35195 217353 -47254
15563B2307a49040A69879n6068F884K46301a15709A17128b26886a2924j00690
15553a13614M5344G1050a35204B88334m5262a42687O0837b7578A29816a94855
15542h8247k31469B41700a74379D9871b11957C13342A12317e787D14285a67315
15531A27563f4292A64472n4093b27166B05229a30873j29069E7960c7795E7030
15520d5800A95557J19831f551A05309D6003d1928B4072a32836j19701I3637C2758
15508I6858N2160b45861C75076D281b46244O5828e5641A54191a18777N9005C14628
15496d34643K13297P4866E717a53599l730N9473k20836B18346k0402a97876m688
15485b02564e020j32978A24476b33379A27998J67984E0348j9159a79113h3188
$$ plain form
15563 22307 -149040 169879 113811 6884 253185 -115709 117128 -226886 -12924 -113614
15553 -113614 -68270 71050 -135204 288334 243072 -142687 -81850 -27578 129816 -194855
15542 -88247 -319716 241700 -174379 49871 -211957 313342 112317 -5787 414285 -167315
15531 127563 -64292 164472 110379 -227166 205229 -130873 -259942 57960 -37795 57030
15520 -45800 195557 315388 -6551 105309 46003 -41928 24072 -132836 -252537 93637 32758
15508 96858 149018 -245861 375076 4281 -246244 -180416 -55641 154191 -118777 -59772 314628
15496 -434643 -221346 -146480 5717 -153599 -157329 -97856 -318692 218346 197944 -197876 -202564
15485 -202564 -5020 -137998 124476 -233379 127998 295982 50348 31189 -179113 -83188
15474A82211g6530I4667R7793G8543i0980j38055b5554A28349h1184j07279B36737
15462A91668d3527q5543j6648K9204l22225B03878a58393O6450j4190c8876A5497
15450A6427K08477a7101B0928a96960R2169J4573I574K17092b23404I8868c7949
15438f2132F030e22357A50204I321g6155B45100B6608K81229c92738C2664c84269
15426A42063D9610D916b82342B3979a59152j32739F0062J45455K24435e7820A5224
15414d3289q4949A09880a15625c5296A44732c61835h9050A96500l7389p6349J8199
15403A00961J0545g4968B3071e2210q4178A29332J06096c1190B4514Q2290L3749
15392A40553b59751C26731b53996f1207j11441J2020m9124B74606a19504G1569
$$ plain form
15474 182211 -76530 94667 192460 78543 -90980 -229035 -25554 128349 -81184 -188463 236737
15462 191668 -43527 -129070 -145718 -116514 -438739 203878 -158393 -91943 -106133 -38876 15497
15450 16427 224904 -17101 20928 -196960 -104791 -90218 9574 226666 -223404 98868 -37949
15438 -62132 6030 -522357 150204 9321 -76155 245100 26608 307837 -392738 32664 -384269
15426 142063 49610 4916 -282342 23979 -159152 -291891 60062 205517 429952 -57820 15224
15414 -43289 -128238 109880 -115625 -35296 144732 -361835 -89050 196500 159111 82762 100961
15403 100961 111506 -74968 23071 -52210 -136388 129332 235428 -31190 24514 106804 140553
15392 140553 -259751 326731 -253996 -61207 -172648 -160628 -209752 274606 -119504 71569
15381a61815k9228h1881D20252b30391c6004K096a2653G0739d7140m5844c5105
15369a17241r5606A71959f2139J4568m6123K5171A06295i278j57705e9698C43783
15357f6131l2307A23162Q6400q5055b78788F7435Q9998n9956K19452h1845j09055
15346a90900P6730j0998D9719B1656i3700B31866b39725C14707b34378A35903
15335A87356b40401e1189C21078B2735P9796J77017G8307L9220g6691B03155C2820
15323A03372a09160G5854L0175g0906A23766a88618A39514J55687a35293A65706
15312D14862j99082b1526G0736O0312b9335B99670j6861m2075F3612Q1632b81124
15300b9725A51450b4630H8594L02120j64635n2322F7545a99327A08817B9909h2554
$$ plain form
15381 -161815 -191043 -81881 420252 -230391 -36004 -33908 -12653 70739 -47140 -92984 -35105
15369 -117241 -212847 171959 -62139 -47571 -93694 -68523 106295 -9278 -166983 -59698 343783
15357 -66131 -98438 123162 209562 124507 -278788 67435 157433 97477 316929 -81845 -190900
15346 -190900 -114170 -125168 49719 21656 -93700 231866 -239725 314707 -234378 135903
15335 187356 -240401 -51189 321078 22735 102531 279548 78307 117527 -76691 203155 32820
15323 103372 -109160 75854 106029 -70906 123766 -188618 139514 295201 -135293 165706
15312 414862 215780 -21526 70736 131048 -29335 299670 282809 240734 63612 145244 -281124
15300 -29725 151450 -24630 88594 390714 226079 173757 67545 -199327 108817 29909 -82554
15288A609K00251P6478g6211D00761A51131J06831b05918f8410C06771D7187J5764
15277F2951K7273J72204A21835K25203a61552K0167B52481D0959I115i488q4158
15266i3646A63277c1766B84640A00977K29141b47388B24611O4787i1084a771k782
15255d553B53464a88233h2687A58541e7908C70349M07456R18335m08909j96465
15245A090766N66282F45610k92531A31281c8093A26448K9177d7146B42977J02225
15235C45202A19744d1388B40437H1763E491N779O7300P7036F5345k6832L34599
15224C73112D0078L18155F633K41309N9139a40149j46300A22955O0039k6615b8763
15212A95779b28975M7150B62173b03023B96489b18928l0192A70874H4597Q7219
$$ plain form
15288 1609 201860 278338 -76211 400761 151131 257962 -205918 -68410 306771 47187 62951
15277 62951 90224 262428 121835 347038 -161552 -141385 252481 40959 9115 -9488 -93646
15266 -93646 163277 -31766 284640 100977 330118 -247388 224611 289398 -91084 -1771 -4553
15255 -4553 253464 -188233 -82687 158541 -57908 370349 777805 1696140 1287231 1090766
15245 1090766 1657048 645610 353079 131281 -38093 126448 155625 -47146 242977 345202
15235 345202 119744 -41388 240437 81763 5491 11270 78570 155606 65345 38513 373112
15224 373112 40078 358233 6633 247942 307081 -140149 -286449 122955 182994 156379 -28763
15212 195779 -228975 -181825 262173 -203023 296489 -218928 -249120 170874 84597 171816
15202A71816d1740G7449k5981P3817a04558b3093j8773D7460K12660j12248K28106
15191C75978A7635c7252A82769b81361B09188J60063h8903k5677B62047a21757
15180i7877A58076N3326B1137A822P2569j2939l502P478h5356B55947D1483P3640
15168A15123J6453J01112i124n0939A71327i1588c0618G7691Q3438j9288Q0784
15157B22625Q9471c2301e241j48943C47872a8850C08691a04811B83364h9762A92410
15145a41133A04742L97371B30192A02422e97570A26501n9829L63818E2005L1729
15135H3734J18346l9323J8275h5856a876A48592J08677d00061a08218b4130B47515
15123H8143J30026N7155c7574o1229h370B5100d06640k0885A44798K0894a22550
$$ plain form
15202 171816 -41740 77449 51468 125285 -104558 -23093 -41866 47460 260120 147872 375978
15191 375978 17635 -37252 182769 -281361 209188 369251 -88903 -114580 262047 -121757
15180 -97877 158076 211402 21137 1822 74391 61452 57950 65428 -85356 255947 41483 115123
15168 115123 131576 232688 -9124 -60063 171327 -91588 -30618 77691 161129 141841 222625
15157 222625 312096 -32301 -5241 -154184 347872 -18850 308691 -104811 283364 -89762 192410
15145 -141133 104742 502113 230192 102422 -597570 126501 66672 430490 52005 83734
15135 83734 202080 162757 181032 -85856 -1876 148592 257269 -400061 -108218 -24130 247515
15123 88143 218169 275324 -37574 -98803 -8370 25100 -406640 -427525 144798 165692 -122550
15111H9282J0465g3484p9853H1409O6272g3163A22992J24503q113F9147N4715
15100A23862D5063R0020h393A28318J1073L2087n4860b70618A32612o0584a3970
15088A41711a4644B46644A08383c6253A30868L9538G1445A2702K12289G0560a334
15076B04409J34118j7422F874J20542l0096R9905R205J94765p4695j12127b0585
15064A12220h9065j66104E47872B05128j00989M5925C3087J62736H7206K43084
15054C30290J59392H4818j9866L54630F8228b9891B04403O6970r3719K11478l3329
15043C55803a31833C78281c2454D50854f6550C13365A15853K69362O8039A54617
15032C09088M4576j29838J25438q3909l3637q5555K29506o6752I6911O1599J72750
$$ plain form
15111 89282 99747 -73484 -153337 81409 147681 -73163 122992 247495 239382 69147 123862
15100 123862 45063 135083 -8393 128318 139391 171478 116618 -270618 132612 72028 -13970
15088 141711 -14644 246644 108383 -36253 130868 170406 71445 12702 224991 70560 -1334
15076 204409 338527 321105 6874 127416 97320 197225 206430 401195 326500 214373 -20585
15064 112220 -89065 -255169 547872 205128 104139 150064 33087 195823 87206 330290
15054 330290 489682 84818 64952 419582 68228 -29891 204403 271373 177654 389132 355803
15043 355803 -131833 378281 -32454 450854 -66550 313365 115853 385215 453254 154617
15032 309088 353664 223826 349264 265355 231718 146163 375669 308917 96911 158510 331260
15021C31260b0538C01065H8334C868L21917b1610B71723r1254J41547q2153b2449
15009A39407K29817j53180K03537I6535d4779A45212a06664B44034J8526C0409
14998E21729A66649J52576J41708k22191N1775C9920K03716m6667C8398L06401
14988C44799L298A42953o6150K52455j2177r7321A2229J4451J76076R2096A46535
14976D73732B24098K4237A04103m9475J92978n9533J78997A67457J65425H5931
14965A36956e8995C28343L6287j05985J03392G7495h881B92846J52020A82271
14954B82354K67530j05899j93270q9286C3155d8r9076A36498B6359J94066J00509
14943C20934J73283B32332I7731a0342B06612K10843A73769K64878o0762r6554
$$ plain form
15021 331260 -20538 301065 88334 3868 325785 -21610 271723 180469 322016 239863 -22449
15009 139407 369224 216044 419581 96535 -44779 145212 -106664 244034 262560 30409
14998 521729 166649 319225 460933 238742 290517 39920 243636 196969 38398 344799
14988 344799 348097 142953 76803 329258 317081 219760 12229 26680 202756 294852 146535
14976 473732 224098 248335 104103 54628 247606 188073 367070 167457 332882 85931
14965 136956 -58995 328343 364630 258645 362037 77495 -8881 292846 444866 182271
14954 282354 549884 443985 250715 161429 33155 -48 -99124 136498 26359 220425 320934
14943 320934 494217 232332 97731 -10342 206612 417455 173769 438647 377885 281331
14933B81331N8028r6848n5919K7290J00386J60345k17454a03866B27815J05943
14923C33758q852Q1287r4856A24532B3712L13114K70000k31600H1692Q9857J51694
14912C23243J39123o4738o2983J62616B42652H833L48757J13219A04335c7552
14901B65643K00556A99446L9233L9113N20703l92857j93227Q0325j4922J47611
14891D25425m8477j16258E0566M69160j60407J13097m9753J84486B63833N5426
14881C19259J59191m8595j18407j01426d9270D84477k00360K64572r9534J22736
14871E71891J967A55421L85818j30571Q5903j13142l8276K73808B28356K26472
14861D54828n459N2168J23888N633A79390L89434l1995j77875J15085k14742K01542
$$ plain form
14933 281331 339359 242511 186592 213882 314268 474613 257159 -103866 227815 333758
14923 333758 324906 406193 311337 124532 23712 336826 606826 375226 81692 171549 323243
14912 323243 462366 397628 334645 497261 242652 8833 357590 470809 104335 -37552
14901 265643 466199 199446 238679 277792 798495 405638 212411 292736 277814 425425
14891 425425 376948 260690 50566 519726 359319 472416 422663 607149 263833 319259
14881 319259 478450 429855 311448 210022 -49270 484477 284117 548689 449155 571891
14871 571891 573858 155421 541239 410668 496571 383429 345153 618961 228356 454828
14861 454828 449369 501537 625425 631058 179390 568824 536829 358954 474039 259297 460839
14850D60839j79465j5669J77051R0520j00928J67500B15210M04135j21327j65825
14840C32193L73368j09207R3935j80862j07383A95219K99543K06837B92334J37228
14830D29562j79610L96591L0515j28645l6666J17207B61758K20080K42597k18220
14820E06215K1834B12743K36328m8187j10866K38235k2968K51534J2548C75642
14809G58562l70662l2907M54451B81609K03159l1260L17818j97098P9792J4686
14799F68706J51345D00504M4618L51015j51489j96960j88585l7487M91938J45014
14789H58568l81109M90217k96612J17330k53270j10955L44137r6627K83152l70330
14779E84501n4059J90171j52167L27064l56154j17380N8520J84427B46386L28211
$$ plain form
14850 460839 281374 265705 442756 533276 432348 599848 215210 619345 498018 332193
14840 332193 705561 596354 690289 509427 402044 195219 494762 701599 292334 429562
14830 429562 249952 646543 677058 548413 511747 628954 261758 481838 724435 506215
14820 506215 528049 212743 449071 400884 290018 528253 505285 756819 769367 375642
14809 758562 387900 354993 809444 281609 484768 453508 771326 574228 654020 668706
14799 668706 820051 400504 445122 796137 644648 447688 259103 221616 713554 858568
14789 858568 477459 967676 671064 788394 535124 424169 768306 671679 954831 584501
14779 584501 530442 720613 568446 895510 539356 421976 480496 664923 246386 574597
14769E74597l3542j85117M22049m6193C01152L31594K31153k62847J33671k91355
14759D43368J12944k5674J31827j09069K20163J47685l34369r3075K9368J71114
14749F94282k5340l26917K42278k1094l8341K41057K88146l00912C52802J07844
14739D60646L31105k57399P3815L6782P5256o7720J08755K36915M70504o13520
14729H55139j56232J16458k35749L23312k38628M68167l78792L15251l02021p3218
14719F93687J07736j20904J50946J41638D29164M57357q5867J76105L4968m84233
14709E27494L44002n8416j55441K23272K4269N3398j42843Q3310k4426j76511
14699F98108L04153j56688L39595m26419N3531P0117l8716K35270m1924l90368
$$ plain form
14769 574597 541055 355938 777987 731794 301152 632746 863899 601052 734723 443368
14759 443368 556312 530638 662465 553396 773559 921244 586875 493800 523168 694282
14749 694282 668942 342025 584303 563209 524868 765925 1054071 753159 352802 460646
14739 460646 791751 534352 608167 644949 720205 652485 761240 998155 1468659 855139
14729 855139 698907 815365 579616 902928 664300 1132467 753675 1068926 766905 693687
14719 693687 801423 680519 831465 973103 429164 886521 800654 976759 1011727 527494
14709 527494 871496 813080 657639 880911 905180 958578 815735 899045 874619 698108
14699 698108 1002261 845573 1185168 758749 812280 882397 843681 1078951 1037027 646659
14689F46659M67306j36561J34224K79045o58408M25099j48953K76349r3835j21136
14679A069789N6901j14004Q2813P7357p4393L8764k65039K81026n5696N2796l46632
14668H03682M52393j35702K58847k65014J8997k78709J34735J89603j79082L05211
14658A304961l23051O20871n27166K34029r1593j97640K68867K92641o12182L59507
14648A329244j34590K9693o6036o7513K64531o6648J0931j53187n6857L81559
14638A471127k16216M95518n97380L38447M4928j06253M27450l40257k11444N1843
14628A357763J64769j68778Q6691K68922j6678K09493j39050l14905k27647N11889
14618A732469l01554J55783J85277m68504N07529j64092m9668J47126m9754O514
$$ plain form
14689 646659 1113965 977404 1111628 1390673 732265 1157364 1008411 1284760 1190925 1069789
14679 1069789 1126690 1012686 1095499 1172856 1098463 1137227 872188 1153214 1097518 1150314 803682
14668 803682 1256075 1120373 1379220 1114206 1133203 854494 989229 1178832 999750 1304961
14658 1304961 981910 1602781 1075615 1309644 1218051 1020411 1289278 1581919 969737 1329244
14648 1329244 1194654 1224347 1158311 1090798 1355329 1288681 1299612 1146425 1089568 1471127
14638 1471127 1254911 1750429 1153049 1491496 1536424 1430171 1857621 1517364 1305920 1357763
14628 1357763 1522532 1353754 1440445 1709367 1692689 1902182 1763132 1448227 1220580 1732469
14618 1732469 1430915 1586698 1771975 1303471 1811000 1646908 1597240 1744366 1694612 1701126
14608A701126j23620j08806k3773p1782O1883L48901J05369J5972k07683P6757
14598A774344J13736K1073j11354j16984J62964j09021L1151k8252k22913M05158
14588A919902Q7043M564m5550J15121j51075N95824o82579J25744L3940J41928
14578B144862L5570J26340k75305L35006Q8577J09137l49734j7833p6437L44507
14568B464690J11508k35674L19929l7404j18814J61932m5926Q8210Q8653N5743
14558B852847K52567J87957J43013L13458k79390P09579M48254J48487J198399
14549E975171K109528M133492Q367008J5305823J4034472k4238809I799151m396262
14541E402889j478518r54140l20197l03312l08192J6604K89033j09068J29084
$$ plain form
14608 1701126 1577506 1468700 1444927 1373145 1435028 1783929 1889298 1905270 1697587 1774344
14598 1774344 1888080 1909153 1797799 1680815 1843779 1734758 1765909 1737657 1514744 1919902
14588 1919902 2006945 2011509 1965959 2081080 1930005 2525829 1843250 1968994 2002934 2144862
14578 2144862 2180432 2306772 2031467 2366473 2455050 2564187 2214453 2196620 2120183 2464690
14568 2464690 2576198 2340524 2660453 2623049 2504235 2666167 2620241 2708451 2797104 2852847
14558 2852847 3105414 3293371 3436384 3749842 3470452 4180031 4628285 4776772 5975171
14549 5975171 8084699 12218191 20585199 35891022 49925494 25686685 9799151 5402889
14541 5402889 3924371 2970231 2650034 2346722 2038530 2055134 2344167 2235099 2364183
14532B364183k20930L23352r3593j06996K14504p8646j9133L19522k66992K63055
14522B698326k45825M87085j43974J57533R218j76443k78216M90175k81764K32513
14512B948628K68837j59973K35166n031j0795M829l65620J8979J99360Q1566o1533
14501C154413K12166M5795n7153L50429j40717n4599l8032M6710j1802N29188
14491D036398o48076K50867K13744j09367Q5796K03058k38641L5671J44842Q4382
14481D058674L8541j16157l9726K78956j85828M37257p4754J10534q2674j9724
14471D405099K39100L0908K39524j86607m1619N65274l25835l869l4713K8127
14461D915389l0301K30805K84972O2962p0654K11433l0336o4715n2987J86503
$$ plain form
14532 2364183 2143253 2466605 2373012 2266016 2480520 2401874 2382741 2702263 2435271 2698326
14522 2698326 2452501 2939586 2795612 2953145 2962363 2785920 2507704 2997879 2716115 2948628
14512 2948628 3217465 3057492 3292658 3287627 3276832 3281661 2916041 2935020 3134380 3215946 3154413
14501 3154413 3366579 3412374 3355221 3705650 3564933 3510334 3472302 3519012 3507210 4036398
14491 4036398 3388322 3639189 3852933 3743566 3829362 4032420 3793779 3829450 3974292 4058674
14481 4058674 4097215 3981058 3941332 4220288 4034460 4471717 4396963 4507497 4424823 4405099
14471 4405099 4644199 4675107 4914631 4728024 4686405 5251679 4925844 4921975 4887262 4915389
14461 4915389 4885088 5115893 5400865 5463827 5393173 5604606 5574270 5509555 5456568 5643071
14451E643071L46750j29388K9569O4465k0901m713N25663l08565m69057Q46237
14441F523131l5273L95540n15753L20466K221K38131K83015R7708j03654J47623
14431G353155l0653m0432L60875K07720l29542O57299j94098K30707l37662M79496
14421H356865K05476L08149o64760O34903J27338N8024L16375J59744n4134J98208
14411I646188p2379L05089J01408l5738P7329O11464J07769j45776M05399Q6561
14401A1087314J03494J06723P3645L14118K83835K91345J86876Q7361K29901N07804
14391A3272416k36094N59116N4046L13092R7761L37953N46326q5150J4107N95293
14381A5468866L69173K56960L63991N21094L71457k67210M61750N00006M98926
$$ plain form
14451 5643071 5989821 5860433 5890002 5954467 5933566 5928853 6454516 6145951 5676894 6523131
14441 6523131 6487858 6883398 6367645 6688111 6690332 6928463 7211478 7309186 7205532 7353155
14431 7353155 7322502 7282070 7642945 7850665 7521123 8178422 7984324 8215031 7877369 8356865
14421 8356865 8562341 8870490 8205730 8840633 8967971 9025995 9342370 9502114 9447980 9646188
14411 9646188 9573809 9878898 9980306 9944568 10021897 10633361 10741130 10595354 11000753 11087314
14401 11087314 11190808 11297531 11371176 11685294 11969129 12260474 12447350 12534711 12764612 13272416
14391 13272416 13036322 13595438 13649484 13962576 14060337 14398290 14944616 14859466 14873573 15468866
14381 15468866 15838039 16094999 16458990 16980084 17351541 17084331 17546081 18046087 18545013
14372A8545013K87669R7300K27692N86161M51262N65029K68897K80581N91634
14363B1901238O25381L01149M43241R77519j93876M01924J158456J53667M86859
14354B6255558Q54071P05043M78751J034052P27640L33549J033379O31997R52051
14345C3006091R00415R06666Q59838O93761J127207J105801Q33791J391623R92974
14336D1818167J446727R03541J426663J340114J431816J309095J752199J650141
14328E3078463J559382J925020J678173K105459K149847J929479K143768K631598
14320F9201189K069650K651355K977257K231791L454003L076034L296178L494037
14312I2451494L666272L779467L870463M730483M587004M471594N242071N636343
$$ plain form
14372 18545013 18832682 18929982 19157674 19743835 20195097 20760126 21029023 21309604 21901238
14363 21901238 22526619 22827768 23271009 24248528 24054652 24456576 25615032 25768699 26255558
14354 26255558 27109629 27814672 28293423 29327475 30055115 30388664 31422043 32054040 33006091
14345 33006091 33906506 34813172 35673010 36366771 37493978 38599779 39433570 40825193 41818167
14336 41818167 43264894 44168435 45595098 46935212 48367028 49676123 51428322 53078463
14328 53078463 54637845 56562865 58241038 60346497 62496344 64425823 66569591 69201189
14320 69201189 71270839 73922194 76899451 79131242 82585245 85661279 88957457 92451494
14312 92451494 96117766 99897233 103767696 108498179 113085183 117556777 122798848 128435191
14304A28435191N447580O100644O268924O662986P284030P606355P936260Q433363
14296A84175333Q960805R449528J0133085J0596152J1089630J1722021J2052814
14289B58179368J2415006J3258994J3609473J3930560J4659801J4622742J4883002
14282C55558946J4764618J5056273J4437339J4178081J3559270J2338825J1034437
14275D50927789R669899O966660L239101l7824j130809n36301P84609l933833
14267D65949291p129450q530643j0212943j0793600j1605268j3264646j4218744
14260C90193997j5400402j5829219j5874368j5611269j5256451j4405872j3726778
14253B84089638j3774048j3462424j2346527j1910290j1381221j0814278j0244567
$$ plain form
14304 128435191 133882771 139983415 146252339 152915325 160199355 167805710 175741970 184175333
14296 184175333 193136138 202585666 212718751 223314903 234404533 246126554 258179368
14289 258179368 270594374 283853368 297462841 311393401 326053202 340675944 355558946
14282 355558946 370323564 385379837 399817176 413995257 427554527 439893352 450927789
14275 450927789 460597688 467564348 470803449 470765625 469634816 469098515 469883124 465949291
14267 465949291 458819841 450289198 440076255 429282655 417677387 404412741 390193997
14260 390193997 374793595 358964376 343090008 327478739 312222288 297816416 284089638
14253 284089638 270315590 256853166 244506639 232596349 221215128 210400850 200156283
14246B00156283r728928q674605q551194p676889q104553o916757o781749o600835
14238A37120773n648027n581743n102223n554879m431210m704367m020991l686536
14230I8390797m206100l534244l538333l360166l060100k908986k802031k682860
14222G2297977k446879k195110k357875k226376k062595k210555k008052j546708
14214E5243827j640440j425841j321702j546918k030043j308763r61570p82904
14206D4225646r15422j918405j411392q73808j390367m14590o62422j124133j183053
14197C4332054p45897j185424n67075p13463p49918j152190m77131m06970p01051
14188B7632935q15405m67295j045968k33244o75968m92409m39229m65339m61176
$$ plain form
14246 200156283 190427355 181752750 173201556 165524667 157420114 150503357 143721608 137120773
14238 137120773 131472746 125891003 120788780 115233901 110802691 106098324 102077333 98390797
14230 98390797 94184697 90650453 87112120 83751954 80691854 77782868 74980837 72297977
14222 72297977 69851098 67655988 65298113 63071737 61009142 58798587 56790535 55243827
14214 55243827 53603387 52177546 50855844 49308926 47278883 45970120 45008550 44225646
14206 44225646 43310224 41391819 39980427 39106619 37716252 37301662 36639240 35515107 34332054
14197 34332054 33586157 32400733 31833658 31120195 30370277 29218087 28740956 28333986 27632935
14188 27632935 26817530 26350235 25304267 25071023 24395055 23902646 23463417 22998078 22536902
14179B2536902o14364l33486m64487n75650l84303l17751m29212o33268J85439
14170A8969820p57270j92946l23646m43097n22062Q4608o58416K59793n56334
14161A5860450l45860l37616j54700m39760m19948k21377J43549n88816k18005
14152A3277917o6428m11342k64289K44045k60519l62415k00379q0261r4460r2257
14142A1689612n20533j51854J53555p23292K54134j07620k67962N2556m42870
14133I935726J73487o3342n60143j78670J9466n02995n4160K29207j55868l67539
14123H475169K58918M7853m02856k84119J7021n0759k16715r1866j43479l6662
14113G572505L46140o50787J05718k62071p9356j36421K07752k18898p9947n7629
$$ plain form
14179 22536902 21922538 21589052 21124565 20548915 20164612 19846861 19417649 18784381 18969820
14170 18969820 18212550 18019604 17695958 17252861 16730799 16815407 16156991 16416784 15860450
14161 15860450 15514590 15176974 15022274 14582514 14162566 13941189 14084738 13495922 13277917
14152 13277917 13211489 12800147 12535858 12779903 12519384 12156969 11956590 11876329 11781869 11689612
14142 11689612 11169079 11017225 11170780 10447488 10701622 10594002 10326040 10378596 9935726
14133 9935726 10109213 10045871 9485728 9307058 9326524 8823529 8769369 8998576 8842708 8475169
14123 8475169 8734087 8781940 8379084 8094965 8111986 8061227 7844512 7752646 7609167 7572505
14113 7572505 7918645 7267858 7373576 7111505 7032149 6895728 7103480 6884582 6804635 6747006
14103F747006q9091J9948k64198J07416p8427j82083L10036n65356n7935J58843
14093F106159j92742j05450J15227j05188k28531K59449l66003k6605j02512k48440
14083E105364J06911j33838K00280l49859j53416J01784R0409K06513o63349q3909
14073D426890K56702p52l5436j10052J54967j68834p2161J36070m21852j07842
14063D057700M48484k71689m0089q5797J64144K70247p27400M40169j94386k9673
14053D031710j29392j51277K0723K14665k20103n0429j81306k008J91141q9586
14043C634138J14026m59127M61138l66955p0272J69723j06758q5897r0774j05604
14033C093638K74878j04370l61543J58869K45614j5174l58222M00628l80941J39725
$$ plain form
14103 6747006 6657915 6677863 6413665 6521081 6442654 6260571 6570607 6005251 5947316 6106159
14093 6106159 5913417 5807967 5923194 5818006 5589475 5848924 5482921 5456316 5353804 5105364
14083 5105364 5212275 5078437 5278717 4928858 4775442 4877226 4967635 5174148 4510799 4426890
14073 4426890 4683592 4682840 4647404 4537352 4692319 4523485 4451324 4587394 4165542 4057700
14063 4057700 4506184 4234495 4194406 4108609 4272753 4543000 3815600 4255769 4061383 4031710
14053 4031710 3902318 3751041 3771764 3986429 3766326 3715897 3534591 3532583 3723724 3634138
14043 3634138 3748164 3289037 3750175 3383220 3312948 3482671 3375913 3290016 3199242 3093638
14033 3093638 3368516 3264146 2902603 3061472 3307086 3291912 2933690 3334318 2953377 3093102
14023C093102j9374l12210J20621J1800l11797L47540J38839m81399K74950P4826
14013B936898j88573k61112J10737J76298j10376j48380l9749k17018N42510k57259
14003B543976j59241o401j66518Q2642R6325o5414k44698N2266J2221P5501R8632
13992B319291Q2222J78156O62269O46904L443586O278314J4567315K0086482j8834041
13983B9430498A4542758n357136k085639j882013p09244o01947j80236m22067
13975C304476M5215l70270J05452m03081M3340k24051K70988j39238k63179N9080
13965B428732j20945r778J81859k83326l1206r4624K25989O7680j77942k74402
13955A912037L94158k04007L9038P4629p8790j291r7382j75565M76142m35716
$$ plain form
14023 3093102 3073728 2761518 2882139 2893939 2582142 2929682 3068521 2587122 2862072 2936898
14013 2936898 2748325 2487213 2597950 2774248 2663872 2515492 2475743 2258725 2801235 2543976
14003 2543976 2384735 2378334 2211816 2294458 2390783 2325369 2080671 2132937 2145158 2220659 2319291
13992 2319291 2401513 2579669 3241938 3888842 7332428 13610742 28178057 48264539 29430498
13983 29430498 14542758 9185622 7099983 5217970 4508726 3906779 3726543 3304476
13975 3304476 3349691 2979421 3084873 2681792 2725132 2501081 2772069 2632831 2369652 2428732
13965 2428732 2307787 2298009 2479868 2196542 2165336 2070712 2296701 2364381 2186439 1912037
13955 1912037 2306195 2102188 2141226 2215855 2137065 2135774 2038392 1862827 2338969 1903253
13945A903253K77316j92900L1789L2004j20545L79165p02303J76939m3484N7124
13935A798358K15491r3837k01877Q6153Q0331q73j09808M20655m66685p9487R8114
13924A746535k86808M28728r7817n19918M83272j26695L715M03319j78609k94475
13914A561247j97479R6810L68428l69472M67231l72136K2147L2334j53140L48488
13904A804458k61027k75707j28103J54919K81220Q3360l06220J20788P5667l08492
13894A240863O3869l9944P305L4331L05737p1417N3550n68120j81739O57329j68685
13883A333079K00183J47318n15677K05855j68499j01551J67548K2382M0828l52103
13873I79363L50461l40056L34421k00196j36542L98798p4975m19626K53288p1856
$$ plain form
13945 1903253 2180569 1987669 2019458 2051462 1930917 2310082 1607779 1784718 1741234 1798358
13935 1798358 2013849 1920012 1718135 1804288 1884619 1883746 1773938 2194593 1727908 1648421 1746535
13924 1746535 1459727 1888455 1790638 1270720 1753992 1627297 1631012 2034331 1855722 1561247
13914 1561247 1363768 1460578 1829006 1459534 1926765 1554629 1576776 1609110 1455970 1804458
13904 1804458 1543431 1267724 1139621 1294540 1575760 1659120 1352900 1473688 1549355 1240863
13894 1240863 1304732 1264788 1272093 1306424 1612161 1540744 1594294 1026174 844435 1501764 1333079
13883 1333079 1533262 1680580 1164903 1370758 1202259 1100708 1268256 1290638 1331466 979363
13873 979363 1329824 989768 1324189 1123993 987451 1386249 1311274 891648 1144936 1073080
13863A073080r1547J22120K37068j75067j84627O188J88615J90032k65437k8457
13853A071968J09469j32027j18526J19919J05619p0516j70230L99377k88257P1086
13843A097882K19569m31811K45157n1491J45434m32226J66347P0050L11182k72903
13833A067190k83269J35876m3532R8205j944p8373j92087L2897K05598O3852k10595
13822G93818K53368k45303M00765k11312m5318K45477j86846j59004J35530J66365
13812A147540k32004l0417P3538n9271j35525P4940J40644m2115p1665k91541
13802E74124K54449J72448k04254j27476J08925Q9325p2791J42546l01040n4316
13792E81940J53041L35938m75766O04920m11668j52820o2951K74541C59107L96740
$$ plain form
13863 1073080 981533 1103653 1340721 1165654 981027 987215 1175830 1365862 1100425 1071968
13853 1071968 1181437 1049410 930884 1050803 1156422 1085906 915676 1315053 1026796 1097882
13843 1097882 1317451 885640 1130797 1079306 1224740 792514 958861 1028911 1340093 1067190
13833 1067190 783921 919797 876265 974470 972526 894153 702066 734963 940561 1004413 793818
13822 793818 1047186 801883 1202648 991336 946018 1191495 1004649 845645 981175 1147540
13812 1147540 915536 885119 958657 899386 763861 838801 979445 937330 865665 574124
13802 574124 828573 1001021 796767 669291 778216 867541 794750 937296 636256 581940
13792 581940 734981 1070919 595153 1200073 788405 635585 572634 847175 359107 755847
13782G55847L5260r1063J10299k5080j02323K72036k59140L9011J04007N1315
13772H90169n5733K50836n30645J83496Q5589k22121J73071R1582J67519l64007
13762F69756L72853l80763l8926K531J6251J06073J33941k85497k00072J80480
13752E76627l3643K61281k02995k30962L13916k24431L21370J66258k30385k14054
13742E02982L84049k4903l23424Q0160l7980P1231J56999k58890k6043j0273J57172
13731F71080m1976J88703k52118k64528Q02998C77713L97284k7093k51738K84522
13721G80688j55923l4077R9294o0745O3324k62754Q4464N03898l78358R6065l14166
13710D21710L70471j88634P8578J84320B36347L94934k24089L14925k19130K61058
$$ plain form
13782 755847 791107 700044 810343 785263 682940 954976 695836 734847 838854 890169
13772 890169 834436 1085272 554627 738123 823712 601591 774662 866244 1033763 669756
13762 669756 1042609 661846 622920 625451 641702 747775 881716 596219 396147 576627
13752 576627 542984 804265 601270 370308 684224 459793 781163 947421 717036 502982
13742 502982 887031 862128 538704 618864 580884 652115 809114 550224 524181 513908 671080
13731 671080 629104 817807 565689 301161 1104159 377713 774997 747904 496166 780688
13721 780688 624765 590688 689982 629237 692561 429807 514271 1018169 639811 735876 421710
13710 421710 792181 603547 682125 866445 236347 631281 407192 722117 502987 764045
13700G64045k84622j55649J05642L76741k07619j93048R9824J25583j79496k8748
13690D22653A92381L93617J03943j85295B06033J88126K30137j32715R3243B82164
13679H71011m19303J76483K1766j16994k28569K64954J77921A91973N6466K82508
13669E30947j30009q0212K93384B72965J90471k9697M30123B15732K48335J93508
13659F57575C07728J13102L29845J07715l08756k33536j55749K19031n1404M794
13649C32770M18615l31410j3711J99687j78968K83203k47276J03053k3380A44147
13638F60370q6224O9323j60870j54649K1574K68271k40748K0888J02927A67911
13627C11528M84350k84140j80674L7502N9445K5897l6514j76211J86364B08646
$$ plain form
13700 764045 479423 323774 429416 806157 598538 405490 505314 630897 451401 422653
13690 422653 192381 585998 689941 504646 206033 394159 624296 491581 584824 282164
13679 871011 451708 628191 649957 532963 304394 569348 747269 191973 248439 530947
13669 530947 400938 320726 614110 272965 463436 433739 863862 215732 464067 657575
13659 657575 307728 420830 750675 858390 549634 316098 160349 379380 327976 332770
13649 332770 751385 419975 406264 605951 426983 710186 462910 565963 542583 144147
13638 660370 574146 643469 482599 327950 349524 617795 377047 397935 500862 167911
13627 311528 795878 511738 331064 368566 428011 453908 417394 241183 427547 208646
13616C46996o0006N631H305L33441L1788j05175j9398K20927A84199L31617A2199
13604F03197k75817k828M36291l66271E4665B0236M87412R4655B04995L4929O41386
13593H81310k38367k80271m166l8002J33179O4735K7535j4722j36446m7657k1752
13582C25376N6630k4535J58520B06139J88942K28217k10048o5535K14498A51617
13571B31163R8680B8437R9271K61812A27692J17561Q0031A39803j74J58773L7342
13560C35744K24552I0399O28825G5904L86915K98649B30437J06952J18567Q7372
13550E43328k7337m2637r2457j27817J62646A23841M40304r8932A46502J48425
13540B94927q6523K17493r1675J69616K6150G9432R126P568K62629l2411j56487
$$ plain form
13616 346996 286990 292621 8305 341746 373534 268359 248961 469888 184199 515816 12199
13604 603197 327380 324552 760843 394572 54665 20236 507648 602303 204995 239924 881310
13593 881310 642943 362672 358506 320504 453683 518418 545953 531231 394785 347128 325376
13582 325376 382006 357471 515991 206139 395081 623298 413250 347715 562213 151617
13571 231163 329843 28437 127708 389520 127692 245253 325284 139803 139629 298402 335744
13560 335744 560296 90399 719224 75904 462819 761468 230437 337389 455956 543328
13550 543328 515991 473354 380897 253080 415726 123841 564145 465213 146502 294927
13540 294927 208404 425897 334222 503838 529988 79432 88558 96126 358755 326344 169857
13529A69857J30288P65L98471c8732J856B79093J22296j91802a69756D77789Q8907
13518E66696H7036Q4652P2435J29477Q1939J04153k3365k5680k23280a91312B00448
13506E18321j84998d4393k7793C60201J04119J36884B44490J61790H8506N29506
13496F18012B84740j36496K11624p4765J04497A46398K03136j40627G1509K58271
13486C29780j54049R4212j9712J66204o8406l6291L65098B24007L6065K1202L6861
13475C18135A38723L37512j62332K9290L6097G3266J73818O7449k0528j16797
13465A77208J52194j8588j4490H8927Q3582J33452i7791D83496C3091B824J88960
13454A91784K4750J21871A31274R3260J38251J92688k57196Q5217M3704J76535
$$ plain form
13529 169857 300145 300910 699381 -38732 -36876 279093 401389 209587 -169756 477789 566696
13518 566696 87036 171688 244123 373600 455539 559692 536327 510647 287367 -191312 200448
13506 518321 333323 -44393 -72186 360201 464320 601204 244490 406280 88506 618012
13496 618012 284740 148244 359868 285103 389600 146398 349534 208907 71509 329780
13486 329780 175731 269943 250231 416435 348029 311738 676836 224007 260072 281274 318135
13475 318135 138723 476235 313903 343193 379290 73266 247084 314533 294005 177208
13465 177208 329402 310814 296324 88927 172509 305961 -97791 483496 33091 2824 191784
13454 191784 216534 338405 131274 224534 362785 555473 298277 383494 427198 603733
13444F03733A9054a17367c5769B89590A5546K77739J14652K28905A78447Q075
13434A86522L08476p9648m6656j58764M7376j1384A18951k6691M80258H3844O6541
13423A50385J17173J67215j00222j63556J4484K422N31802C6006a19829B10315
13412A45042g7733a1727B63443l5172M135K7627K5685j0816K11724A01259J04738
13401B05997D0947N4672k6360J57476j03413O5529b4704B23201n7171l0567E0970
13389B45619r1871c8591A92431J60504A37914J16150k3351Q8150j07368F5993
13378B81275L5556A2895K13882e1492A05845L30750r9057A11511P6545R1524j01281
13367A78299C6402K97156m2366f0530A40610l6923M4619c0676C58560o9269A32952
$$ plain form
13444 603733 19054 -117367 -35769 289590 15546 293285 407937 636842 178447 186522
13434 186522 494998 415350 368694 209930 257306 245922 118951 92260 572518 83844 150385
13423 150385 267558 434773 334551 170995 185479 187901 719703 36006 -119829 210315
13412 145042 -77733 -11727 263443 228271 232406 260033 285718 274902 486626 101259 205997
13401 205997 40947 95619 69259 226735 123322 188851 -24704 223201 166030 135463 50970
13389 245619 153748 -38591 192431 352935 137914 254064 230713 318863 211495 65993
13378 281275 316831 12895 226777 -51492 105845 436595 337538 111511 188056 279580 178299
13367 178299 36402 333558 291192 -60530 140610 103687 148306 -30676 358560 289291 132952
13355C82508A81446E0022J36785a19644A49116L01831P7201a41672F822J93414
13345B00236f1204C46146r0817j16163L76430p9345J8900A69611J22245R7833
13335C89689r0914f8119C48762P9851F2994J16508O8784A04981K52071A20996
13324C36413l4378L36620B0723N8075K12584L67072a17737H2963c7504A03394
13313f7935B23006H191J21286k1200D9611K48927J5230m0302M3749j12162E0849
13301C72579J22513A32315a8825B54690F8901a78191B45570l4039J00039o3464
13291B48106i1267A90401r0359J88424k9493r4964k6454J72203A53545K5445o8193
13280A10797N1629b179F3424M32514j31249j36397r4109L8906c5394H1522K15806
$$ plain form
13355 382508 181446 50022 186807 -119644 149116 450947 528148 -141672 6822 200236
13345 200236 -61204 346146 255329 139166 515596 436251 455151 169611 291856 389689
13335 389689 298775 -68119 348762 428613 62994 179502 248286 104981 357052 120996
13324 336413 302035 638655 20723 78798 291382 658454 -117737 82963 -37504 103394
13313 -67935 223006 8191 129477 108277 49611 298538 313768 273466 317215 205053 50849
13301 372579 495092 132315 -18825 254690 68901 -178191 245570 211531 311570 248106
13291 248106 -91267 190401 100042 288466 258973 164009 137555 309758 153545 178990 110797
13280 110797 162426 -2179 63424 495938 364689 228292 134183 173089 -35394 81522 297328
13269B97328k3810I9785J09229J10371G7930M15424A84157o6847N5646K9506R2575
13258B95037A2682L16886G9490K7601L49285n6723f011j26112G9375K64255k8261
13247C15369a40123M3980A19791a96947R1532B46969k2041q8316k8863k4406a79242
13235D0029j9452b6299B9775f6950G9450P1782a43021i755A21635K18802i5251
13223B12367m0207K62379A40904l9400m3503f8271D7305M5354L32440f1753j03937
13212a65690H9619J35234j12312J27297J82256B7304P9751L314L7908a8954A90511
13200H8852A5197b11019C76327j26957A17614m9029M5215c8663B25735b23540
13189C28898j07324K17387j26174H4154J29501a2537C15077j13182L1130g5753
$$ plain form
13269 297328 273518 99785 209014 319385 77930 493354 184157 117310 172956 202462 295037
13258 295037 12682 329568 79490 107091 456376 399653 -6011 -132123 79375 343630 315369
13247 315369 -140123 -96143 119791 -196947 -105415 246969 224928 136612 107749 83343 -179242
13235 40029 20577 -26299 29775 -66950 79450 151232 -143021 -9755 121635 340437 -95251
13223 212367 172160 434539 140904 101504 58001 -68271 47305 92659 425099 -61753 -165690
13212 -165690 89619 224853 112541 239838 422094 27304 107055 110369 148277 -18954 190511
13200 88852 15197 -211019 376327 249370 117614 68585 113800 -38663 225735 -223540
13189 328898 221574 438961 312787 84154 213655 -12537 315077 201895 233025 -75753
13178A17241k1747m5839r941j4539f6581j38711C8488Q2655N7223J15522J65500
13167D59388j86807g7172k9994h141C86423j23222A9300L63473a23680B76552
13156A34782b06043E872K56896a08248m1703B15059G6581J90482r0539B79K9189
13145B9468R2470M2542a64513B2473L7437B3035N4221R0991l8236B6797K79073
13134C05870n6371q1829F8402C4054K94914D212J80915o9961K20163C3612c9976
13122C68551a22148A01592B8277H866J83540J18405H2761N6400e3884A90712A1857
13110B37923f7393B89577A30533L0461k3183O149P1812a81188k04654a90924n409
13099a96333A8848a32975p3301B841K9311f7978A76181h9360B44507P332i2597
$$ plain form
13178 117241 95494 49655 39714 25175 -66581 -205292 38488 121143 178366 293888 459388
13167 459388 272581 -77172 -107166 -8141 386423 263201 19300 382773 -123680 276552
13156 134782 -206043 5872 262768 -108248 -149951 215059 76581 267063 176524 279 29468
13145 29468 121938 164480 -164513 22473 59910 23035 77256 168247 130011 26797 305870
13134 305870 249499 167670 68402 34054 328968 4212 185127 115166 335329 33612 -39976
13122 368551 -122148 101592 28277 8866 192406 310811 82761 139161 -53884 190712 11857
13110 237923 -67393 289577 130533 160994 137811 143960 215772 -181188 -385842 -190924 -196333
13099 -196333 18848 -132975 -206276 2841 32152 -67978 176181 -89360 244507 251839 -92597
13087c5983B8703f9977j39024i63B3566J72099j007g3429A1022P0039K8864c0452
13074A33192D3994J41179i6695j37340E07522A20228J3200D7743g9793C15434
13063A44921k1086b10881H3756a08359A1903J88519n9115M1217E3317K5656L85142
13052D64115i7472B01679G4735K0792J71200D2246b14268A84505j9628F9333K82565
13041C51898A06254k6457d4554A32583C3254O230d0661B29287a43388A47034l0714
13030A16320J29523d3461I6753L89024A73071a98153e8475A88898p4551g2073
13019a49333E0298P4756L42893A92166O0734E4050I282a0887A51353p1958O0934
13008A40329J22881a1553C57141A07079L7037J11718L33575A09390Q866J95365
$$ plain form
13087 -35983 28703 -69977 -209001 -963 23566 195665 194658 -73429 11022 81061 109925 -30452
13074 133192 43994 185173 -96695 -234035 507522 120228 133428 47743 -79793 315434
13063 144921 123835 -210881 83756 -108359 11903 200422 141307 182524 53317 78973 464115
13052 464115 -97472 201679 74735 95527 266727 42246 -214268 184505 164877 69333 351898
13041 351898 106254 79797 -44554 132583 33254 39484 -40661 229287 -143388 147034 116320
13030 116320 245843 -43461 96753 485777 173071 -198153 -58475 188898 114347 -72073
13019 -149333 50298 125054 467947 192166 252900 54050 9282 -10887 151353 79395 140329
13008 140329 263210 -11553 357141 107079 144116 255834 589409 109390 118256 313621
12998C13621b1215C11638d3940C01335j50404b69845B6974K92015Q8480B3010
12987B81225a10994H1078i0378C63687A04045j3763G282J87J71241J45753l5836
12976B88627c5372A92123h3375b938F7916f999j03613E48936a0426k298k67940
12965b80664G9897K5354a87668D4391a12791B07467d5506q9195K9406k44867A1583
12953a86395A89501c7398E5506P712b07130O4681A8871a32164H4254J9919a92698
12941I0933g1628B15529n8165c0521D1127a12912B36528g4090B44672J8449B0427
12929a29931D92969c78252A4975c5765A51878b73098A06027b18652E1928c7109
12918a10103I250K54557m5109a89282B4019b6049q5782B02941e4320F6829K49016
$$ plain form
12998 313621 -21215 311638 -43940 301335 150931 -269845 26974 318989 407469 23010
12987 281225 -110994 81078 -90378 363687 104045 90282 7282 7469 178710 324463 288627
12976 288627 -35372 192123 -83375 -2938 67916 -6999 -110612 548936 -10426 -12724 -280664
12965 -280664 79897 105251 -187668 44391 -112791 207467 -45506 -134701 -105295 -350162 11583
12953 -186395 189501 -37398 55506 63218 -207130 -142449 18871 -132164 84254 104173 -192698
12941 90933 -71628 215529 157364 -30521 41127 -112912 236528 -74090 244672 263121 20427
12929 -129931 492969 -378252 14975 -35765 151878 -273098 106027 -218652 51928 -37109
12918 -110103 9250 263807 218698 -189282 24019 -26049 -111831 202941 -54320 66829 315845
12907C15845I7913g6009p6625E8046d5088k9029K1966B32843m8996n9577J47236
12896B71506r4909A3773b8920j32896A43858D590b12300B14871A7351R9353L22351
12885D39055J73060a73577H6177J05006I5096J25636o1014J52249A0795N1601
12875F2396i4422d1658J5119E33997E9001h907C07860b41388K2320C6605M96493
12864E33098A88273K33879d4019A10519j9016J7307N0685b50633i1388C46857
12853A78012q5901L4437J1623M263m2522f2649A0505K37125g5388C18276o9824
12842B48452n2830e686j60070L607I4506N0256b3336I4555J66208C4539L13538
12831C48077g3484j3354G8939a84263B35129C4706K09499b4434q9801a7532H5849
$$ plain form
12907 315845 97913 -76009 -152634 58046 -45088 -74117 -52151 232843 183847 124270 271506
12896 271506 176597 13773 -28920 -161816 143858 4590 -212300 214871 17351 116704 439055
12885 439055 612115 -173577 86177 191183 95096 220732 159718 311967 10795 62396
12875 62396 -94422 -41658 -26539 533997 59001 -8907 307860 -241388 -219068 36605 533098
12864 533098 188273 422152 -44019 110519 91503 108810 159495 -250633 -91388 346857
12853 178012 92111 126548 138171 142434 99912 -62649 10505 247630 -75388 318276 248452
12842 248452 195622 -5686 -165756 -162149 94506 144762 -23336 94555 260763 34539 348077
12831 348077 -73484 -86838 78939 -184263 235129 34706 244205 -24434 -114235 -17532 85849
12819A24996a79980d4495j75402j5570A60656n915a57618I2909C3209J05008d45718
12807A78494p98b51938A35614f948k12332G6522J41934J82869a82878D32Q0949
12796H1381g3005C94d9550B91751B4160j965M179O9837g0368j38649F5557P6366
12784A41923k5089h1119q2057L466o3237A68242c48662a06055C08056m934g0560
12772b21709C6728a73437D6193a40606A69632G3969M3611a38488A91046o5157
12762A25889l3306A7137M2754R7132p4797K01783L4398i0462E9118f6987H4550
12750i4696k24335c8728m3984r6401I3693c8562o6804A76228m9221K40787f4362
12738D17451B05626C6083a89296d4354B09223J47436E043Q4390K06290A35319
$$ plain form
12819 124996 -179980 -44495 -219897 -235467 160656 154741 -157618 92909 33209 138217 -445718
12807 178494 177696 -251938 135614 -6948 -219280 76522 218456 401325 -182878 432 81381
12796 81381 -73005 394 -49550 291751 24160 22195 26374 96211 -70368 -209017 65557 141923
12784 141923 116834 -81119 -163176 -159710 -222947 168242 -348662 -106055 308056 303122 -70560
12772 -221709 36728 -173437 46193 -140606 169632 73969 117580 -138488 191046 125889
12762 125889 92583 17137 59891 157023 82226 284009 318407 -90462 59118 -66987 84550
12750 -94696 -319031 -38728 -82712 -179113 93693 -38562 -105366 176228 127007 367794 -64362
12738 417451 205626 36083 -189296 -44354 209223 356659 5043 89433 295723 135319
12727B65813f462g28B78000j12580f5512k0457E9339P7414A3398b9111G9347J80377
12715B59724n9139C6852i0494I4759K30117G302L14494E1303a00405B54744K0435
12704B75179q8000a6939k75736D8508M43991a74351A0289J43965K86588A6170
12693D81063E5004k520a33551A15660D2658b40946N2683E2716a295B34498J37048
12682C71546I7320K89705G5917N1590l2388J28069P1219p3097N412h8295A06215
12670B37165a14137A43427b47219a05478A73171K30744a0969j90679C43907a72222
12659E9824a58677B616J7080M18777o9922C0696a76663B5152a52099A87088B2736
12647d3637A31378o4537c62088J27923B90794E3109K36314f3744B7298K52080
$$ plain form
12727 265813 -6462 -728 278000 165420 -65512 -85969 59339 136753 13398 -29111 79347 259724
12715 259724 200585 36852 -90494 94759 324876 7302 321796 51303 -100405 254744 275179
12704 275179 187179 -16939 -292675 48508 492499 -174351 10289 154254 440842 16170
12693 481063 55004 52484 -133551 115660 42658 -240946 -188263 52716 -1295 234498 371546
12682 371546 97320 387025 75917 127507 95119 223188 294407 221310 226722 -88295 106215
12670 237165 -114137 143427 -247219 -105478 173171 403915 -10969 -201648 343907 -172222
12659 59824 -158677 2616 19696 438473 368551 30696 -176663 25152 -152099 187088 22736
12647 -43637 131378 66841 -362088 -234165 290794 53109 289423 -63744 27298 279378
12637B79378j19087E8437e3545k65057A79758E1239L83123j04369A18432J0333
12627A28765C6640E834N18277B41646q1449P3661f8762C0211K81015h4955j52391
12616b37346B55025C1266K89550a70226A93916q5264e0696A18735L4756N913K29067
12605C88471e4346I0843a50200A37140L0154i4369K3868C22275j60921B6184b19530
12593a64909A94546n9793a10568k0296e610B80662a3176H4528a81890k0528B05299
12581A0443R6850a67132A43909a12981j28821a01194B49565G8175l3365J09803
12571A54613K30798H6204J51294a52208A703a5818j15512q8444Q0793O5913r0204
12560a63272A55461a53664A85087Q3216c6714j46824d556k9226k67497b8625B7639
$$ plain form
12637 279378 160291 58437 -53545 -318602 179758 51239 434362 329993 118432 128765
12627 128765 36640 5834 524111 241646 160197 233858 -68762 30211 311226 -84955 -237346
12616 -237346 255025 31266 320816 -170226 193916 108652 -50696 118735 153491 159404 388471
12605 388471 -54346 90843 -150200 137140 167294 -94369 -70501 322275 161354 26184 -219530
12593 -164909 194546 134753 -110568 -130864 -5610 280662 -13176 84528 -181890 -202418 205299
12581 10443 107293 -167132 143909 -112981 -241802 -101194 249565 78175 44810 154613
12571 154613 385411 86204 237498 -152208 1703 -15818 -131330 -219774 -138981 -73068 -163272
12560 -163272 155461 -153664 185087 268303 -36714 -183538 -4556 -33782 -301279 -28625 27639
12548c0013C37815a4980A35919K3521M2380K15208c7240I5282b16188B63694h1043
12536a02465a0201j16924J0981f009H0093Q534b15070B31649a90634m3407a10606
12524C6609P1512k4166A99a33000f2792m6348D1546K10981O2325j00618r0986
12513A23248m0565J76828D8362L6374j8732J63299A09046a09257j15411B6281
12502h4603D7328J6980a35005H6239J84361a70863A03225F785J60156a7999A79190
12490F5247J1457G283M5886h1433C61310A55983k1372L10192j17171G4195Q994
12479H3189A5289b4264j14247A10980B5117b25544N3582D9182M6534a21079J1563
12468a09516c5386F3345j7776a75190G0537c40478a9186j05440M9249A01390j8022
$$ plain form
12548 -30013 337815 -14980 135919 159440 201820 417028 -37240 95282 -216188 263694 -81043
12536 -102465 -10201 -127125 -116144 -6009 80093 88627 -215070 231649 -190634 -234041 -110606
12524 36609 108121 83955 199 -133000 -62792 -109140 41546 252527 314852 214234 123248
12513 123248 82683 259511 48362 84736 66004 229303 109046 -109257 -224668 26281
12502 -84603 47328 64308 -135005 86239 270600 -170863 103225 6785 166941 -17999 179190
12490 65247 76704 7283 53169 -81433 361310 155983 134611 444803 327632 74195 83189
12479 83189 15289 -24264 -138511 110980 25117 -225544 -171962 49182 95716 -121079 -109516
12468 -109516 -35386 63345 45569 -175190 70537 -340478 -19186 -124626 -75377 101390 83368
12457H3368c65963f2550j10839O496B696P3615N1450K17824c69720a9526A920
12445C25062f5892h263H9046c76814H6526K7875m5125M2690a68897g6602k04568
12434b81170D6762f9814D9054J33504p971i4863B47573K5551A22357L7000a03979
12422C16468j49799a78605Q1816D1961J4201J53170a37528N2388J5660q3640B0841
12410h2925n2805B65974b61804C746g3045m8257j64188A39612b13509l3924M1365
12399b06068P3352D7185d9429Q684k9707A92704E7773M2100D8710a63629C1161
12387D8574a21660e8235D2740d6982A7711a06888D2988I827L12431a19542j57853
12376b77395b4957q8495E3099B5350f3000o7949j18418a8462b827j28646e4345
$$ plain form
12457 83368 -365963 -62550 -173389 -166893 2696 76311 127761 345585 -369720 -19526 1920
12445 325062 -65892 -8263 89046 -376814 86526 114401 69276 111966 -168897 -76602 -281170
12434 -281170 46762 -69814 49054 182558 174587 -94863 247573 273124 122357 159357 -103979
12422 316468 166669 -178605 -96789 41961 56162 209332 -137528 -85140 -69480 -153120 20841
12410 -82925 -135730 265974 -261804 3746 -73045 -121302 -285490 139612 -213509 -247433 -206068
12399 -206068 -132716 47185 -49429 -40745 -70452 192704 57773 99873 48710 -163629 31161
12387 48574 -121660 -58235 42740 -46982 17711 -106888 42988 9827 322258 -119542 -277395
12376 -277395 -24957 -113452 53099 25350 -63000 -130949 -249367 -18462 -2827 -131473 -54345
12364G1677a51298B0174J51423a13043M3148I6994D1463J86013i9493n9392e6124
12352A7423b34317J04786N3676B27030h0537j02674C21198c3009k02566c1968
12341g0887A34018n5585a27917L4288A04807P5597c0394n47955a56446l9316G6446
12329a03153K9795g390j56991P4335J6668o1478r384B35537F324e3919n1301K8429
12317g6791k29663M9843B29432K38369A7884G804K16360g0303a852A89471a01548
12305i0091A41136D7097G838J21987a62013M1460m5950A34502b00273D54639a87263
12293a9725j04731Q603B17352p4187g1084A17687g401o0786q4472D22175j07527
12282C14648A25892b02624N2903B33708J09262d0989j60610d7321A21564K43013
$$ plain form
12364 71677 -151298 20174 171597 -113043 -69895 96994 41463 227476 -99493 -158885 -56124
12352 17423 -234317 -129531 -75855 227030 -80537 -183211 321198 -33009 -235575 -31968
12341 -70887 134018 78433 -127917 -93629 104807 180404 -30394 -578349 -156446 -195762 76446
12329 -103153 -73358 -7390 -164381 -90046 -73378 -134856 -144240 235537 6324 -53919 -105220 -76791
12317 -76791 -306454 -256611 229432 467801 17884 7804 224164 -70303 -1852 189471 -101548
12305 -90091 141136 47097 7838 129825 -162013 -120553 -166503 134502 -200273 454639 -187263
12293 -19725 -124456 -115853 217352 143165 -71084 117687 -7401 -68187 -152659 422175 314648
12282 314648 125892 -202624 -149721 233708 342970 -40989 -201599 -47321 121564 364577
12272C64577j43140E9017K03917h6417A66760b22881B3913J42350K25523j56078
12262B35708d1306a6876A28859k9481L39690B03328c3986A59726a2093j3352B00135
12250C8857R7188b45419B15278J21968A45579L6071a59639G2297c2499j9094E3766
12238E0718b46682A21060n5017a01443Q926B08770N9485c235D7063P5331L61503
12227D83897A52650M3458j943l1097K40348j46033M8044j37588k9421J0514f3554
12215B54436N031J56713d2173p603H1924K80668A19853K067J77311F1836J40738
12204B02574J32611o4002L2227a43353E35258A02753N6376p7743J30633O5322
12194B77341K17294A76380M6135K67565a09751B29988j4522a55070a0334o687
$$ plain form
12272 364577 221437 59017 262934 -86417 166760 -222881 23913 166263 391786 235708
12262 235708 -41306 -16876 128859 99378 439068 203328 -33986 159726 -12093 -25445 200135
12250 38857 136045 -245419 215278 337246 145579 181650 -159639 72297 -32499 -51593 53766
12238 50718 -246682 121060 66043 -101443 -92517 208770 268255 -3235 47063 122394 483897
12227 483897 152650 196108 194165 163068 403416 257383 305427 167839 138418 148932 -63554
12215 254436 259467 416180 -42173 -49776 81924 362592 119853 121920 299231 61836 202574
12204 202574 335185 271183 303410 -143353 535258 102753 159129 81386 212019 277341
12194 277341 494635 176380 222515 490080 -109751 229988 215466 -155070 -10334 -17021
12184a7021C3811J15954M15102D0296M6142h3419A31609a79395O1295A3719l0
12173A3689J07999c36413H3629L67023d4466B21439b5170B511J1907J23811a53216
12161H5163a16375B19260r9994I742J62233K26728C6467A7826J64911a40639A08956
12149B05791D6874K7775K31233A5098K6004J25883b6720B26066F8696Q5719a05101
12137C13635c5068A61187b03292A67821a2544k02661d9939H1832f2008n8756k04391
12126c25155e6468A6146K35509G7468O6658a22134A7668J97205b25410e7230E0943
12114H0196P6827b17506I4180j7669a23751N1174c3575l5830n1784B16388m39
12103B15949m5756K60009f172B58950n5357f1624C26895a38518j7991A29510b05047
$$ plain form
12184 -17021 33811 149765 564867 40296 86438 -83419 131609 -179395 -118100 13719 13689
12173 13689 121688 -336413 83629 450652 -44466 221439 -25170 2511 14418 138229 -153216
12161 85163 -116375 219260 119266 9742 171975 398703 36467 17826 182737 -140639 108956
12149 205791 46874 74649 305882 15098 41102 166985 -26720 226066 68696 154415 -105101
12137 313635 -35068 161187 -203292 167821 -12544 -215205 -49939 81832 -62008 -120764 -325155
12126 -325155 -56468 16146 251655 77468 144126 -122134 17668 214873 -225410 -57230 50943
12114 80196 157023 -217506 94180 76511 -123751 -72577 -33575 -69405 -121189 216388 215949
12103 215949 170193 430202 -6172 258950 203593 -61624 326895 -138518 -156509 129510 -205047
12091B28580b84971E3000J26468G1092J94688a2349B7908P2590A8273a33792N6723
12080g7069j18795I7307K70728c07381B52380j17972J57683c9527G8344k4863
12070E3481J36472F8179N5057a22594a4819c221k21079F9114J25822C4228L05874
12059C40102m1267n6035O06342P24357n07641A58318l0690f5488B04111b82380
12048b10343e7790K295b5071A0759L9762J307e8185B10912a76932I300J98436
12037B07736K3395G11P0003Q0041m4403k3685P7930b80729C274J20886d95627
12025a48647j25523A68637d40443a752j72045C26183C4191i4255A72049a75577
12014i5524F3307a63759B53353q7669A5233b238B61853C9090i1194J3012r3789
$$ plain form
12091 228580 -284971 53000 179468 71092 265780 -12349 27908 100498 18273 -133792 -77069
12080 -77069 -195864 97307 368035 -307381 252380 134408 292091 -39527 78344 53481
12070 53481 189953 68179 123236 -122594 -14819 -3221 -224300 69114 194936 34228 340102
12059 340102 298835 242800 849142 1573499 1065858 158318 127628 -65488 204111 -282380
12048 -210343 -57790 -55495 -25071 10759 50521 51828 -58185 210912 -176932 9300 207736
12037 207736 231131 711 70714 150755 106352 82667 160597 -280729 3274 124160 -495627
12025 -148647 -274170 168637 -440443 -1752 -173797 326183 34191 -94255 172049 -175577
12014 -95524 63307 -163759 253353 165684 15233 -2238 261853 39090 -91194 -78182 -171971
12003a71971H2840j8190a72256g4299A69417d8184G253a16488N7616p9380e2186
11991b11840O8606e9915A82677B0033J89206b13128i835A52187a24884C48233
11980F4128Q7930b99802P1498B00522o2235K7465M9860a17788d4918a4777j59231
11969a74008O5036j05354P1903H8649c30160a14631c9604D8565O6252e7084A0248
11957C61197E8019f8635l08992E58J69774h8063A04578j8392a84511B03324a93224
11945e5208A08268J43128E8529c03700i1490c9660A90619c4059A61621D3200a70680
11933B74755a32515A06771J06050j03691d8286j97517i2382r4486k8312E805J74368
11922A80173a35923E431a80775a8899A20454B0677B553a32942p9822b2122n8253
$$ plain form
12003 -171971 82840 64650 -172256 -74299 169417 -48184 7253 -116488 -58872 -138252 -52186
11991 -211840 -143234 -59915 182677 20033 209239 -213128 -9835 152187 -124884 348233
11980 64128 152058 -299802 -228304 200522 138287 165752 215612 -117788 -44918 -14777 -174008
11969 -174008 -108972 -214326 -142423 88649 -330160 -114631 -39604 48565 114817 -57084 10248
11957 361197 58019 -68635 -377627 558 170332 -88063 104578 86186 -184511 203324 -193224
11945 -55208 108268 251396 58529 -303700 -91490 -39660 190619 -34059 161621 43200 -170680
11933 274755 -132515 106771 212821 109130 -48286 -245803 -92382 -186868 -215180 5805 180173
11922 180173 -135923 5431 -180775 -18899 120454 20677 2553 -132942 -212764 -22122 -80375
11911h0375E12478A10448b96723B17855b94610c378C9669J47182b4098H7318b19185
11899D9353c810A89354D8346H960b03875A82166h3554B85568b73516g2389J6045
11888e6344A33146n8397J93571E3151a66321A24973a48569n6963K2211Q6021l09273
11877d06573c2613j04405C57527F1435K12032r3721K12238j37207b23407j3245
11867b36652B00541a63380K7597N9198F241a24270K4770p8167D9777a6072A30024
11855a33109k73268B64470E913L19932B2967c0189j569A19738a68067C1648L6454
11844F8102B1877h5544A3801h8051k5013D5885c08296h3701l32546J69662B95987
11832e33220b29333K4898K4458E9427K9015J37578a11347A55284o8555a03701
$$ plain form
11911 -80375 512478 110448 -296723 217855 -294610 -3378 39669 186851 -24098 87318 -219185
11899 49353 -3810 189354 48346 8960 -203875 182166 -83554 285568 -273516 -72389 -56344
11888 -56344 133146 74749 268320 53151 -166321 124973 -148569 -205532 -183321 -97300 -406573
11877 -406573 -32613 -137018 357527 61435 273467 179746 391984 254777 -223407 -236652
11867 -236652 200541 -163380 -135783 -76585 6241 -124270 -99500 -177667 49777 -16072 130024
11855 -133109 -406377 264470 5913 325845 22967 -30189 -31758 119738 -168067 31648 68102
11844 68102 21877 -85544 13801 -88051 -113064 45885 -308296 -83701 -416247 -246585 295987
11832 -533220 -229333 -204435 -179977 59427 88442 226020 -111347 155284 86729 -103701
11821g1684o0388B4394J21283I585J1905b73187B35422j17036a02943A07604c5335
11809A43374a29378k1919d484E4780a73412A97303d25882A02272g1015j31234
11799b02249P1804E0788a6063A1744c0917A6740J45128c4434k23989A19877m135
11788A15742o488b47123B55351H9120b38474b8411B01319r5637e106A84545c7300
11776h2041k0852j08244D4136b44023j86829e0726B01055c53846D4844Q6831c944
11764i2530j74233a30085F3929G750j162a80344p3489A75065M4895k0198I5480
11752i9158l2624K7783K9538j18182g6362n8267B46787a32000J9453k90937b7738
11740d3589j19882E7409P6157a11536b0888B13132c29505E1127K97778n6762D3269
$$ plain form
11821 -71684 -132072 24394 145677 9585 21490 -273187 235422 118386 -102943 107604 -35335
11809 143374 -129378 -151297 -4484 54780 -173412 197303 -425882 102272 -71015 -202249
11799 -202249 -130445 50788 -16063 11744 -30917 16740 161868 -34434 -258423 119877 115742
11788 115742 109254 -247123 255351 89120 -238474 -28411 201319 105682 -5106 184545 -37300
11776 -82041 -102893 -211137 44136 -244023 -430852 -50726 201055 -353846 44844 131675 -3944
11764 -92530 -266763 -130085 63929 7750 6588 -180344 -253833 175065 219960 199762 95480
11752 -99158 -131782 -103999 -74461 -192643 -76362 -134629 246787 -132000 -112547 -403484 -27738
11740 -43589 -163471 57409 133566 -111536 -20888 213132 -329505 51127 348905 292143 43269
11728A87217c65158e7490H249b59082A33072c6321C03985b8164E891M76549H2528
11716B80682a2468A47093J47397O3847e2354p3715b2244k79947h2618A01258L14456
11705D15714p4542A2165a82887A54902i8096A12195d493r4789d3196E1470P8303
11694A29773a13334H4846G840J64899a61854B30011J15701j55500k3153P7319
11684B44378p5006a713A8759J3790L14327A39951E417a42060E0404d0862j84396
11673b25258Q5531j08600m404e3717A64004c04512d8367A98849E8188K5483l7879
11662D5792a35154J0996A23533Q6391E1715i4851A84816b73798A25971P83F0310
11650B72632c62573e2982F3426b1777q1927l93366i2581k836j6835j5636K2457
$$ plain form
11728 187217 -365158 -57490 8249 -259082 133072 -36321 303985 -28164 5891 482440 82528
11716 280682 -12468 147093 294490 358337 -52354 -126069 -22244 -302191 -82618 101258 415714
11705 415714 341172 12165 -182887 154902 -98096 112195 -4493 -99282 -43196 51470 129773
11694 129773 -113334 84846 7840 172739 -161854 230011 345712 190212 167059 244378
11684 244378 169372 -1713 18759 32549 346876 139951 5417 -142060 50404 -40862 -225258
11673 -225258 -139727 -248327 -252731 -53717 164004 -304512 -48367 198849 58188 83671 45792
11662 45792 -135154 -124158 123533 209924 51715 -94851 184816 -273798 125971 126754 60310
11650 272632 -362573 -52982 63426 -21777 -103704 -497070 -92581 -95417 -112252 -127888 -105431
11639a05431E84671A13245a79644A38220a79828j0611C6510f9200H1524A3270
11628B19173a22320B10931H1069b40152I8747J21075b67717A11086C4133J17453
11618A51586K20024a0911H8269a46093H6270a19091H4685L1639J8480m0190a40205
11606a2639r8833h57E020K53988j23648K88037B02051n0202J47261a62610A570
11594a78590C58534A55617B7869i9122c5872A3995b53736A49441K73624d3654
11583B20295O4000A03281b1536B09823f9455G3409l3116Q1619b88H8454A0596
11571C07327a2741D77530A45345b36438J15604B58030m761a73128A06224M6738
11561A52962j6946b03661E6967J57452q0743B6218J79800l0100F2918J51977c005
$$ plain form
11639 -105431 584671 113245 -179644 138220 -179828 -190439 36510 -69200 81524 13270
11628 219173 -122320 210931 81069 -240152 98747 219822 -267717 111086 34133 151586
11618 151586 371610 -10911 88269 -146093 86270 -119091 84685 116324 134804 94614 -140205
11606 -12639 -111472 -857 5020 259008 135360 423397 202051 151849 299110 -162610 1570
11594 -178590 358534 155617 27869 -99122 -35872 13995 -253736 149441 423065 -43654
11583 220295 284295 103281 -21536 209823 -69455 73409 40293 121912 -288 88454 10596
11571 307327 -12741 477530 145345 -236438 -120834 258030 253269 -173128 106224 152962
11561 152962 136016 -203661 56967 214419 133676 26218 206018 175918 62918 214895 -3005
11549a20487A47094a03784A53196K2754f7015A89565a32176A15835b5797B22638
11538e0262A31228J11880B1668O086a30371A30162L31727B12378K2514J72181
11528D07073c631B55262r2992r957J11968h3519A66662M513D24a6028C68547b2513
11515I3661J94409A5387i3377A53788F1683J51281J09290e842E3989B5718L50649
11504C76367A76143p5253P2357b32100A53981D7099J69181q9298b9268C13060
11493B45194D3466M8908Q6437K09725B9145J67098k473Q5925j00850G2080P3862
11482A45942L70208K4645e075n1736A08652K62196j44376Q7396K04788A38233
11471A9104K95649A05460P4411b1200A72127N3320o6909a25446K8620M6658C6883
$$ plain form
11549 -120487 147094 -103784 153196 175950 -67015 189565 -132176 115835 -25797 222638
11538 -50262 131228 243108 21668 27754 -130371 130162 461889 212378 234892 407073
11528 407073 -3631 255262 162270 152313 264281 -83519 166662 171175 424 -16028 368547 -22513
11515 93661 288070 15387 -93377 153788 61683 212964 322254 -5842 53989 25718 376367
11504 376367 176143 100890 173247 -232100 153981 47099 216280 126982 -29268 313060
11493 245194 43466 92374 178811 388536 29145 196243 193770 279695 178845 72080 145942
11482 145942 516150 540795 -5075 -56811 108652 370848 226472 313868 518656 138233
11471 19104 314753 105460 179871 -21200 172127 225447 158538 -125446 -96826 -50168 36883
11459A85415a01019B42191F1013L33961i8412j14546H0181J09234R8793E3903
11448D60230H7926c1512A70747e9575D08307e5162D9647a07056A62684F3233J55207
11437B18440B1543J13184c5332A2080h6313D8005j5054d5040p4412F9535J33351
11426B02886b08681g8459b3861I5376g8668E362Q0488c10750A92970b40148a3225
11414C11748C8843J77827r9281m0092b15807K2207C3424b41364B97584b3108A61379
11402b36193A73010a43259n2046N1298B5697L19278i9974B39118r6832b55514
11391b00807r5753A92220a24048I6830d8946I5381b61459c1825k5675B18784c0146
11379A44406d9555j04323B80267G8112a88666F6286G423J72255o4510R028f9604
$$ plain form
11459 185415 -101019 242191 61013 394974 -98412 -212958 80181 189415 288208 53903
11448 460230 87926 -31512 170747 -59575 408307 -55162 49647 -107056 162684 63233 218440
11437 218440 21543 134727 -35332 12080 -86313 48005 32951 -45040 -119452 69535 202886
11426 202886 -208681 -78459 -23861 95376 -78668 5362 85850 -310750 192970 -240148 -13225
11414 311748 38843 216670 117389 77297 -215807 -193600 33424 -241364 297584 -23108 161379
11402 -236193 173010 -143259 -195305 -144007 25697 344975 -99974 239118 142286 -255514
11391 -200807 -296560 192220 -124048 96830 -48946 95381 -261459 -31825 -57500 218784 -30146
11379 144406 -49555 -153878 280267 78112 -188666 66286 7423 179678 115168 124196 -69604
11367d35479e5758F8094B1862a54967A20712i3317k59076a05895E4985J9770b61389
11355e128D95073c35957i4761l659A00353a32546c7556C27855A02223g0167C4944
11343a03100A8375e2091k02823A21479g5891A53029f1732A40229b19432Q6264
11333a33168B26783A2092N0603a55052g0446k05640H2058K55437E6638L4106a25919
11321D2827N7658K668n1004a92131m1665j6520g7065B9359J68229a46238E6618
11309a92184e5856A71858g0014c4215I4084d3161A05060M946F586b27096k8025
11298b55121A60802b34277c7359j46636p779J9931b1759G3588l5893i3509B59725
11286A02016P9377N9476h2511r9046d8865j32669m0472A47095d22830f5869j60950
$$ plain form
11367 -435479 -55758 68094 21862 -154967 120712 -93317 -352393 -105895 54985 74755 -261389
11355 -5128 495073 -335957 -94761 -98420 100353 -132546 -37556 327855 102223 -70167 34944
11343 -103100 18375 -52091 -254914 121479 -75891 153029 -61732 140229 -219432 -133168
11333 -133168 226783 12092 62695 -155052 -70446 -276086 82058 337495 56638 90744 -125919
11321 42827 100485 103153 52149 -192131 -233796 -250316 -77065 29359 197588 -146238 56618
11309 -192184 -55856 171858 -70014 -34215 94084 -43161 105060 110006 6586 -227096 -255121
11298 -255121 160802 -234277 -37359 -183995 -191774 -171843 -21759 73588 37695 -93509 259725
11286 102016 181393 240869 -82511 -181557 -48865 -181534 -222006 147095 -422830 -65869 -226819
11275b26819A54159c3944B74013p8180r4597a74311p2732F4687d1642A65608b5808
11263e2256A17807c82269A23563c47900a14900k51977J79617C66150r5115a82279
11252G0817b124D2484b42998C7593c38299a55154q1884E8622c56344b4295j95806
11241b20101g6713A85474I786K10022A07279a94918B13730N8211a77567f8083
11230g4844B24484c23425N1876O0451B10363d2528j96471c6339j84669G3359a93052
11218a7829E0771a8048o2448D1653d8586D8826k189c56299C1862a0988n9319j67291
11206b37598L7633I5655b21162C7125m78h1554j45479A32741D3341b14837C73664
11194C5751e221A11101L00353c7629H6259h3127M741G4147d48590b09678A54657
$$ plain form
11275 -226819 154159 -33944 274013 195833 101236 -174311 -247043 64687 -41642 165608 -25808
11263 -52256 117807 -382269 123563 -347900 -114900 -366877 -187260 366150 271035 -182279
11252 70817 -2124 42484 -242998 37593 -338299 -155154 -237038 58622 -356344 -24295 -220101
11241 -220101 -76713 185474 9786 219808 107279 -194918 213730 271941 -177567 -68083
11230 -74844 224484 -323425 -271549 -211098 210363 -42528 -238999 -36339 -221008 73359 -193052
11218 -17829 50771 -18048 -80496 41653 -48586 48826 46637 -356299 31862 -10988 -70307 -237598
11206 -237598 -199965 95655 -221162 37125 36647 -81554 -227033 132741 43341 -214837 373664
11194 35751 -5221 111101 411454 -37629 86259 -83127 -78386 74147 -448590 -209678 154657
11182a32888J2460B14179D3869a10420k13418a8661A69104K4158a88528H9877
11171b95198A00556c29460A49469d9781n8427n4273P2619r324L8532A60538m5008
11160A15530A6850c4706k33770b395I4389P7946h6381a5161A62193j5277b66962
11148b49583A4119J74959a99847P4532k45635C762K59377c8993F0398L1408b41990
11136C00317I7643a31561P264B64317c9308l4685B41273d0996l84C81574A4693
11124B804M6617m413J11214g0138H7787d1849A94665o6277a30462C8834J42053
11113A80887j5929H727K14697q7488A2696J47440p0909J77965e2465h45j32652
11102a33497C58136i7011F1775J21380J5572l1212M69951E6232K79014L7484A65305
$$ plain form
11182 -132888 -120428 214179 43869 -110420 -323838 -18661 169104 193262 -188528 89877
11171 -295198 100556 -329460 149469 -49781 -108208 -162481 -89862 -99186 -60654 160538 115530
11160 115530 16850 -34706 -268476 -2395 94389 172335 -86381 -15161 162193 146916 -266962
11148 -249583 14119 189078 -199847 -125315 -370950 3762 263139 -38993 60398 91806 -241990
11136 300317 97643 -131561 -124297 264317 -39308 -73993 241273 -40996 -41380 381574 14693
11124 2804 49421 45008 156222 -70138 87787 -41849 194665 128388 -130462 38834 180887
11113 180887 164958 8727 223424 135936 12696 160136 89227 267192 -52465 -845 -133497
11102 -133497 358136 -97011 61775 183155 198727 167515 637466 56232 335246 372730 165305
11090b19871C09775E9814J44814O4810L729J47155j66210f6757D66220j81167
11080B85053A14947K71242N3432j16523p601k7216j33519o916K28589J33856j52120
11069C58171G3357L55125k11084J51824o0358J90720J1659K02592O7340r5458
11059F85717j50315R897O0631K2344J45728K06210D61564K43479j04921J78054
11049G78176p0788l12910M42316k8983L90979k83358j37526J98862j51879p2598
11039G52291K83850k84857M38508D78321K34532j33974O1202J40016n6643j85541
11029E37913J61499j40851L51252j38557n8659K43753k14106k13941l0879O91675
11019A189099m36699k19909r8910L17434j04438K83189l39147o494J10179P5482
$$ plain form
11090 -219871 309775 59814 204628 269438 273167 420322 254112 -66757 466220 285053
11080 285053 114947 386189 439621 323098 315497 288281 154762 147846 376435 510291 358171
11069 358171 73357 428482 217398 369222 308864 499584 511243 713835 781175 685717
11059 685717 535402 545299 605930 628274 774002 980212 461564 705043 600122 778176
11049 778176 707388 394478 836794 807811 1198790 915432 777906 976768 824889 752291
11039 752291 1036141 751284 1189792 478321 712853 578879 640081 780097 723454 537913
11029 537913 699412 558561 909813 771256 712597 956350 742244 528303 497424 1189099
11019 1189099 752400 532491 433581 751015 646577 929766 590619 584125 694304 769786
11009G69786k5683l19459J72365P1533k39514M9991K09510Q2262j63175J75411
10999G83027k33630j29595K10787J73247J13580k4559q5470l7070J8326r6756
10989F91887J56207l4990L24395k12263J37409j06254K82104j94404J83814L3608
10979A261513Q0922L86212J34255J82973L27941N50414K51343P1997m3331Q7326
10969C291565J49049l28370k13419m7547o29185j09991K64181n10130m9485J07717
10959A924385Q6341J79166k92133K60462n83174K8829l09542l73169J84602l2268
10949A073499D12134j21486J85364m912j1516n0343q4090I8158J45297G8200B9755
10937I1317a6755B38209J76146n4511C798J57515F9502J19535b5032A27661c7697
$$ plain form
11009 769786 744103 424644 597009 668542 429028 479019 688529 770791 607616 783027
10999 783027 549397 419802 630589 803836 917416 892857 807387 770317 788643 691887
10989 691887 848094 813104 1137499 925236 1062645 956391 1238495 1044091 1227905 1261513
10979 1261513 1342435 1728647 1862902 2045875 2373816 2924230 3175573 3247570 3204239 3291565
10969 3291565 3440614 3112244 2898825 2851278 2222093 2112102 2376283 1866153 1816668 1924385
10959 1924385 2010726 2189892 1897759 2158221 1575047 1603876 1294334 921165 1105767 1073499
10949 1073499 412134 290648 476012 471100 459584 409241 325151 98158 243455 78200 29755
10937 91317 -16755 238209 414355 359844 3798 161313 69502 189037 -25032 127661 -37697
10925A4316a31820F2583R0816e0236j289a3328B53854j6061A09740a46689P584
10914a39105J0978D0626J41896h3164j71393A02171b25797A42518a40295G7259
10903F8600R9081o791F2728g417A30668J7767k4201b46840g6255o9358N4081m1356
10891a32888O0969F5592J25818b68266d3576q2993B51770c58766a29785j28726
10881b58511A29660c68847B42807j21341f9769I8422a8234q3541A60896p9605
10871H1291a66991G8927f6744I6964j4291a7953B02865G5445K17607j41905b39910
10859B23030O8588B1576a48079A65257o2058g1720A29484Q9846a20946B31771
10848b24947i9080j24911B78529f2444j10117E4349M2487C1119a0422q9630A7983
$$ plain form
10925 14316 -131820 62583 153399 -50236 -51525 -13328 253854 237793 109740 -146689 -139105
10914 -139105 -128127 40626 182522 -83164 -254557 102171 -225797 142518 -140295 77259
10903 68600 167681 160890 62728 -7417 130668 148435 124234 -246840 -76255 -145613 -91532 -132888
10891 -132888 -71919 65592 191410 -268266 -43576 -126569 251770 -358766 -129785 -258511
10881 -258511 129660 -368847 242807 121466 -69769 98422 -18234 -101775 160896 81291
10871 81291 -166991 78927 -66744 96964 82673 -17953 202865 75445 293052 151147 -239910
10859 223030 291618 21576 -148079 165257 103199 -71720 129484 219330 -120946 231771
10848 -224947 -99080 -223991 278529 -62444 -172561 54349 96836 31119 -10422 -100052 17983
10836C69003c05993B0739a95302C8017K43379d8979G7991a50942g2408E0034R6903
10825A46937a94556j93498B7465d9363D7052f8961j71375I818a41615A10029N6395
10814A66424a07170G478a48357H5274O3577b83034P2661Q6935B96042h7943q1336
10803a69279r1910e5906k46927A91149b00759g9191J1239B48663a19975N3755
10793f6220j13698a7124o8124j65242A69266i5086O08j39703C1592d8938I9728
10781B6231f9443B89097I5909k6840a64314f5222c0312B16676f3630H7659b493
10769A25215P7062a59741P5112k849j09298N6368O5662n9512r8909A50563A9630
10757G01181A08947c27602J04611H4429L0994h9689b605j074j8312k24958o6161
$$ plain form
10836 369003 -305993 20739 -195302 38017 281396 -48979 77991 -150942 -72408 50034 146937
10825 146937 -194556 -388054 27465 -49363 47052 -68961 -240336 9818 -141615 110029 166424
10814 166424 -107170 7478 -148357 85274 148851 -283034 -210373 -123438 296042 -87943 -169279
10803 -169279 -261189 -55906 -302833 191149 -200759 -79191 -67952 248663 -119975 -66220
10793 -66220 -179918 -17124 -85248 -250490 169266 -95086 -94478 -234181 31592 -48938 99728
10781 26231 -69443 289097 95909 69069 -164314 -65222 -30312 216676 -63630 87659 -2493
10769 125215 202277 -159741 -84629 -87478 -196776 -140408 -74746 -134258 -233167 150563 19630
10757 701181 108947 -327602 -222991 84429 115423 -89689 -2605 -3679 -21991 -246949 -313110
10746c13110O0080M9294G7870b20836j35033I0577B6800J71534r6748j7035L2635
10735A17186a22098D06591b6437G1625d8833m5630k4963j31056A12303b2674k3111
10724d5785a7645A6199g303C65825A4896d4309j62460o107h5697a931k76685B4170
10711b64377Q5546J4595i588E7793L71269A980c5603q079C0736J28341a77453
10699B6837i6065q6678R0936k96884l6290B90898j14913d9858A64390a00349A69690
10687a10620A0337a11403K744H8857m2480a32333A87846a7137k86397H0734a33189
10675b2763A21248a72917B19137h5001A40675b55239j83314J53122E7890J79201
10665B37091b24027A02953b7403A99228c5588k92229f4758A9891b95595b9550
$$ plain form
10746 -313110 -253030 -203736 77870 -220836 -355869 90577 26800 198334 101586 84551 117186
10735 117186 -122098 406591 -26437 71625 -48833 -94463 -119426 -250482 112303 -22674 -45785
10724 -45785 -17645 16199 -7303 365825 14896 -44309 -206769 -212876 -85697 -1931 -278616 24170
10711 -264377 -178831 -164236 -9588 57793 429062 1980 -35603 -43682 30736 159077 -177453
10699 26837 -96065 -182743 -91807 -388691 -424981 290898 175985 -49858 164390 -100349 169690
10687 -110620 10337 -111403 -108659 88857 46377 -132333 187846 -17137 -303534 80734 -133189
10675 -22763 121248 -172917 219137 -85001 140675 -255239 -438553 -285431 57890 237091
10665 237091 -224027 102953 -27403 199228 -35588 -327817 -64758 19891 -295595 -29550
10654A04267j3939O9912a76580q5626m6605I5575b29251P7602I9542a94960j9771
10643b14731D669P2785r658b21856B29014h8576m8829m5329e2149k03118C1040
10631A16242a67175d5211K0428l65454J20144C37186b29399B56592a29468A45605
10620f7817j09840P5198q0170B59466J3517d6605l66722a64078d2669k13975a25106
10608a80232A88853a79768e5698I10b3391A07149I589J36423a4089j57497k06607
10597c78193B9505a72018G1427a21358j62244d0071k917a2556A53948b10288O7965
10586a42323L9189q0309r8224L687g1422j03564n0719j47565F48439a33991C0190
10574A6743e373j63387L7506B79610D0348M0148d4057A77402m6279K02211b36576
$$ plain form
10654 104267 90328 160240 -176580 -262206 -308811 95575 -229251 -151649 99542 -194960 -214731
10643 -214731 4669 77454 67796 -221856 229014 -88576 -137405 -182734 -52149 -255267 31040
10631 116242 -167175 -45211 -24783 -390237 -270093 337186 -229399 256592 -129468 145605
10620 -67817 -177657 -102459 -182629 259466 272983 -46605 -413327 -164078 -42669 -256644 -125106
10608 -180232 188853 -179768 -55698 910 -23391 107149 9589 146012 -14089 -171586 -378193
10597 -378193 29505 -172018 71427 -121358 -283602 -40071 -42988 -12556 153948 -210288 -142323
10586 -142323 -103134 -183443 -281667 -277980 -71422 -174986 -225705 -373270 648439 -133991 30190
10574 16743 -5373 -168760 -131254 279610 40348 80496 -44057 177402 131123 333334 -236576
10562D5702a73992M5354m7624O2960l07631a14341p2365b6847C02104j47664a22701
10550A32306d09093a58289F805J97064L5082a17586N7428A97533c1964n7204A12829
10538h7121q9902A2448a20877k38043b3898j33668D14b73960I3665e0574G0743
10526a3009o1113r5370d8495k28223A46588l7679A4672J55173D9912K37556A17928
10514A51031C2330i0069j77246B56523C5054b13908J1907j26777B8560b73716
10503b93190B22935d1398l28262J66702G0992a43454c8293k06780g133B92599
10492D74c30246b6083B54476D0798h0923o5363A79341L7920K9742J17279K6894
10481C91176J23219J18537n4600B48624L4488n9295H1421g9799A03726c2850m1011
$$ plain form
10562 45702 -173992 -128638 -176262 -113302 -420933 -114341 -186706 -26847 302104 154440 -122701
10550 132306 -409093 -158289 6805 203869 238951 -117586 -60158 197533 -31964 -89168 112829
10538 -87121 -177023 12448 -120877 -358920 -23898 -157566 414 -273960 93665 -50574 70743
10526 -13009 -74122 -169492 -48495 -276718 146588 108909 14672 169845 49912 287468 117928
10514 151031 32330 -90069 -267315 256523 35054 -213908 -202001 -328778 28560 -273716
10503 -293190 222935 -41398 -369660 -202958 70992 -143454 -38293 -245073 -7133 292599
10492 474 -330246 -26083 254476 40798 -80923 -146286 179341 217261 247003 364282 391176
10481 391176 514395 632932 578332 248624 283112 223817 81421 -79799 103726 -32850 -73861
10470g3861A97425I4507g2391F3017P7547J4938d3543C51125A09787c60219d2005
10458c77523A97320K22755f6096G3672k1131a89278e2636j42626d0746k32315
10448b73061a6872j03915b8158j14363A03493f5788l7638D766K3651a97776l4670
10437b32446A71735b90077B07993P743b59574A07806a59568A54935a1695r5904
10427a07599j30550H7905A7793K15024c4564k33097o7480B33088f9401H0689g2714
10415B89203b14108A26082J45992c0950m2482l21627A29000Q3483a40663H1139
10404B1255a89513M0226N9474J3174A94845c22340J38495g9290c8014A90509O0698
10393B51207J3591H9640j6721L03657A70299K3141I4645j1231J60408L9087m5234
$$ plain form
10470 -73861 197425 94507 -72391 63017 140564 155502 -43543 351125 109787 -360219 -42005
10458 -377523 197320 420075 -66096 73672 52541 -189278 -52636 -195262 -40746 -273061
10448 -273061 -16872 -120787 -28158 -142521 103493 -65788 -103426 4766 28417 -197776 -232446
10437 -232446 171735 -290077 207993 215736 -259574 107806 -159568 154935 -11695 -107599
10427 -107599 -238149 87905 17793 232817 -34564 -267661 -335141 233088 -69401 80689 -72714
10415 289203 -214108 126082 272074 -30950 -73432 -395059 129000 212483 -140663 81139
10404 21255 -189513 -149287 -89813 -76639 194845 -322340 -183845 -79290 -38014 190509 251207
10393 251207 264798 89640 72919 376576 170299 193440 94645 83414 243822 282909 237675
10382B37675H5063O1504e0697B58702L484e3375A52449r273L32487A45068G0651
10370A83257R3772J16567N8576B02877K76552R8257N0478B66327h3180I6890K69388
10359C66278A46973L3773p788K57238o1181r256A70674K66791K74257o043j48932
10348E56747j25507K45950C28218J85702B41587J09212j14171J10433j10979R9108
10338C35190A50759o9658J94292f6540b298C39140q2701A21876D37J79330B1891
10326C95471a20687B39713K44829j26469j57727h5106D83404j17826A54276L33339
10316D87615R441j10897n0906q02d998A1166d5078r8477N7728k327a5245B61140
10303c7237B10243f3877o3564A81549b35036A77077p2469h2461l812r209k23925
$$ plain form
10382 237675 85063 146567 -50697 258702 262186 -53375 152449 143176 475663 145068 70651
10370 183257 277029 393596 452172 202877 479429 577686 628164 266327 -83180 96890 366278
10359 366278 146973 180746 172958 430196 369015 359759 170674 437465 711722 705679 556747
10348 556747 431240 677190 328218 513920 241587 350799 236628 347061 236082 335190
10338 335190 150759 81101 275393 -66540 -2298 339140 256439 121876 437 179767 21891
10326 395471 -120687 239713 484542 358073 200346 -85106 483404 365578 154276 487615
10316 487615 497056 386159 335253 334451 -4998 11166 -45078 -143555 -85827 -88154 -15245 261140
10303 -37237 210243 -63877 -127441 181549 -235036 177077 104608 -82461 -86273 -95482 -319407
10292c19407H6006a63891B21459c84980a60621P1863A5329d53892a60954A27850
10281B2807J24241a16732K2573i461F2003a11795A54998a38606L6060D644J56177
10270A60821a21341D1046B16d7338l64990F6034g9920l1444i902E06512I7771
10258A62248K24199k2041A33194P7740a97047B82254g484A39612f8477j45998
10248b14475f8169C16253h1668C68982A2200f4090A72498b76204A9653J34055
10238A53708c23058A17837b69565a26411a3426j15517E0846f0896H1197h7360
10227a50663m4473A0303c67525A75275g7829b6884B17091c1631B26268a18895
10216I4065Q8474b92348N1670I2203j6331a99398a7158k08195M0147M8007A15880
$$ plain form
10292 -319407 86006 -163891 221459 -384980 -160621 -88758 15329 -453892 -160954 127850
10281 22807 147048 -116732 -94159 -9461 62003 -111795 154998 -138606 -102546 4644 160821
10270 160821 -121341 41046 216 -47338 -412328 66034 -79920 -111364 -9902 506512 97771
10258 162248 386447 364406 133194 210934 -197047 282254 -7484 139612 -68477 -214475
10248 -214475 -68169 316253 -81668 368982 12200 -64090 172498 -276204 19653 153708
10238 153708 -323058 117837 -269565 -126411 -13426 -128943 50846 -60896 81197 -87360
10227 -150663 -195136 10303 -367525 175275 -77829 -26884 217091 -31631 226268 -118895
10216 94065 182539 -292348 -240678 92203 75872 -199398 -17158 -225353 -185206 -137199 115880
10204a4367G0916a95068M0698B48414h1196l01871a24741O1087B6559e559F5689
10192A28796C0470i8792M771b2836o4899k11208J9667b1717A67224c27687A63444
10180e5284l25019d1182a7758j11050A8796a29733K4742m5270A0818O6188a41313
10168E5464c13408e5818o2169p6107A55872M4195n9338p128m0610d6417j96705
10157b43122N7216j03187A36271b38715j83925H2997a66339A05938a44250c6173
10146h8103K0747k20585h2443B7016c9397Q251k29478O6438b0261C9449a45364
10134A0053g1699j14151A8698a76683A14280b97501f1923b0525m3431p3659j76128
10123c13743M6802d4769B5706J79792e9735j09863H4046c7377g059C7947a42144
$$ plain form
10204 -14367 70916 -195068 -154370 248414 -81196 -383067 -124741 -63654 26559 -5559 65689
10192 128796 30470 -98792 -94021 -22836 -87735 -298943 -279276 -21717 167224 -327687 163444
10180 -55284 -380303 -41182 -17758 -128808 18796 -129733 -104991 -150261 10818 77006 -141313
10168 55464 -313408 -55818 -117987 -194094 155872 200067 140729 133601 92991 -46417 -243122
10157 -243122 -185906 -289093 136271 -238715 -422640 82997 -166339 105938 -144250 -36173
10146 -88103 -67356 -287941 -82443 27016 -39397 -31146 -260624 -194186 -20261 39449 -145364
10134 10053 -71699 -185850 18698 -176683 114280 -297501 -61923 -20525 -63956 -137615 -313743
10123 -313743 -266941 -44769 25706 205498 -59735 -169598 84046 -37377 -7059 37947 -142144
10111a73285F3522N5463N6902q2243b70130j21245A92159D1529f2992m2167B1290
10099F2343c6074j00536q709c1938o1700K2385c1279n8902j7396k66626a11011
10087b25472l9559K7444O0253A21609n2573a25808F2322R6250f0233j16298n6596
10076b33127R8794A20602N5113f3096A15011c57464a20248j20831f0949o8294
10066a29243C6571K05023f9297L938m5677B64898a64021A24091O4752b99918J49888
10055a50030A74580b25377j58181A81563A1226g1050A02962J44159r5757a24623
10044c0672p7833c0923F6496a44866j98559P1047M8655B99785e4575o5997B19554
10032c04362o4342g8557L324n8776A59650a09679A46879a34433j6618F9464E952
$$ plain form
10111 -173285 63522 118985 175887 93644 -270130 -391375 192159 41529 -62992 -105159 21290
10099 62343 -36074 -136610 -145319 -31938 -93638 -71253 -31279 -90181 -107577 -374203 -111011
10087 -225472 -265031 -237587 -177334 121609 69036 -125808 62322 158572 -60233 -176531 -233127
10076 -233127 -134333 120602 175715 -63096 115011 -357464 -120248 -241079 -60949 -129243
10066 -129243 36571 241594 -69297 -65359 -111036 264898 -164021 124091 188843 -299918 -150030
10055 -150030 174580 -225377 -383558 181563 11226 -71050 102962 247121 151364 -124623
10044 -30672 -108505 -30923 66496 -144866 -343425 -272378 -223723 299785 -54575 -120572 219554
10032 -304362 -368704 -78557 -75233 -134009 159650 -109679 146879 -134433 -151051 69464 5952
10020B5160c81148a05640m2005f9991B23723g9962B00977b76821a4584l6312k63643
10009c14539A06066k0017h354l0629j03356l1689c4221B78493b99478a1158H489
9997c8888C75984p9689a39116K7375q4524k57281a69203k36103G5498C491M5357
9986D8848J45422a7125I3907e6136A79942a59682f468B68634b5008m2900A5825
9974g3782E0608a80437j49247A39733I074a28555A87416a25567N2770q7646I0789
9962b69747J11779b7619E7310e0233p8730k9674b0637A79702k5968e4336D1708
9950g3315A60732a35309A00931d33795B2198a00737j29259A10962c13370M9486
9940b63884P9817a1456j95883A9556g1568j99209r135P0235L6162f9289B3113
$$ plain form
10020 25160 -381148 -105640 -147645 -69991 223723 -79962 200977 -276821 -14584 -50896 -314539
10009 -314539 106066 86049 -8354 -38983 -142339 -174028 -34221 278493 -299478 -11158 8489
9997 -38888 375984 296295 -139116 -111741 -196265 -453546 -169203 -405306 75498 3491 48848
9986 48848 194270 -17125 93907 -56136 179942 -159682 -6468 268634 -25008 -67908 15825
9974 -73782 50608 -180437 -329684 139733 9074 -128555 187416 -125567 -72797 -160443 90789
9962 -269747 -157968 -27619 57310 -50233 -128963 -158637 -20637 179702 153734 -54336 41708
9950 -73315 160732 -135309 100931 -433795 22198 -100737 -229996 110962 -313370 -263884
9940 -263884 -184067 -11456 -207339 19556 -71568 -270777 -279912 -209677 -173515 -69289 23113
9928g6618K5875F5771d38448g9099L4371m3841j19701f9207B7289h6218K3334
9917f2884H3715N3539D4268K43586i3311q308K3456j22785C7516J11094a6331
9905H8514Q0704a77957f5640j89035Q0130a9998l27716A71176C777a53581A85043
9893a2855m2875F4010a77047c7553A73975a14774A18570R9112A1136d97383A30394
9881a9176M850C5722N2110k0776a91434H4262b38005C09366A12298i0331A21342
9869a4252j83344B56465c2686G5587l5395K9519b6875r7062M4382k90735C03062
9857b9985a774j04780I9254a47908K8600G7796e4866m05926b09351A54274B8275
9845E1467a90097H264b36338j38389B88136A06957b58907E672a27808C19138A15156
$$ plain form
9928 -76618 -50743 65771 -438448 -79099 -44728 -88569 -208270 -69207 27289 -86218 -62884
9917 -62884 83715 137254 44268 287854 -93311 -101619 -78163 -200948 37516 148610 -16331
9905 88514 169218 -177957 -65640 -254675 -174545 -19998 -347714 171176 3777 -153581 185043
9893 -12855 -55730 64010 -177047 -37553 173975 -114774 118570 217682 11136 -497383 130394
9881 -19176 -14326 35722 87832 67056 -191434 84262 -238005 309366 112298 -90331 121342
9869 -14252 -197596 256465 -32686 75587 40192 69711 -26875 -123937 -79555 -370290 303062
9857 -29985 -1774 -106554 99254 -147908 -119308 77796 -54866 -460792 -209351 154274 28275
9845 51467 -190097 8264 -236338 -374727 288136 106957 -258907 5672 -127808 319138 115156
9833F2241a73006P7966k59373E2487c9185q7316l7905C9961K0996a11240A31763
9821G3755f8329l48100a14586c8016G1449A1274g831l09376a54905R741d5658
9809F3068a60317J1300j13566A83489C4740a63785c3897C0725b03052C3967C649
9797a85626b8251l83052a6527m8417i471l59803A06717c7294p04279g5959B17877
9785c9716l2436B22166b23116C61020a81112n6456J05439C1343K84931A289c7874
9773a38493P613B440h6703A03814d94609g3656j06653j88594O2844D87752H0601
9761B5829N2386J53681F5786d609r5948q633l02026a65415B4911P921c16479e5066
9748c2145F8799A370a08726r2797A22876c4523o7245e0217R188G429a57370j42406
$$ plain form
9833 62241 -173006 -95040 -354413 52487 -39185 -126501 -164406 39961 60957 -111240 131763
9821 73755 -68329 -416429 -114586 -38016 71449 11274 -7831 -317207 -154905 -145164 -45658
9809 63068 -160317 -149017 -262583 183489 34740 -163785 -33897 30725 -203052 33967 3649
9797 -185626 -28251 -411303 -16527 -64944 -9471 -369274 106717 -37294 -741573 -75959 217877
9785 -39716 -72152 222166 -223116 361020 -181112 -237568 -132129 31343 316274 1289 -37874
9773 -138493 -130880 2440 -86703 103814 -494609 -73656 -180309 -368903 -306059 487752 80601
9761 25829 78215 231896 65786 -4609 -100557 -109190 -411216 -165415 24911 32832 -316479 -55066
9748 -32145 68799 1370 -108726 -201523 122876 -34523 -101768 -50217 -41029 7429 -157370 -299776
9736b99776A59825b67008b2411j18583e3581B42012a97437B3999M0623a29163
9725G0487a26574A45968g5248B63668a49225j57074l30577G6065d39250H2223
9714a26325A21945c97614H4035g5461j49430P8405A13683b5063E1232i5736d7686
9702f8004j30069B9574J38177a03227j09961A42573i8135C43986b49135D5077
9691c64092J65200j40307a58060l9958A289J10370a26137H7323a89670L4250k8470
9680a83890f8442j58852A33321n2346a66357M1666q0091i0917d537B1230J61216
9669A82446I0700b59074C7529K1951g8123p6466j64390H3179e991m5168G9077
9657a27679D0027c37872B04174D622d1163k3054E7146B5452c09188N5833e7740
$$ plain form
9736 -299776 159825 -267008 -22411 -140994 -53581 242012 -197437 23999 64622 -129163
9725 70487 -126574 145968 -75248 263668 -149225 -306299 -636876 76065 -439250 82223
9714 -126325 121945 -397614 84035 -75461 -224891 -146486 113683 -25063 51232 -95736 -47686
9702 -68004 -198073 29574 167751 -103227 -213188 142573 -98135 343986 -249135 45077
9691 -364092 -198892 -339199 -158060 -198018 1289 111659 -126137 87323 -189670 -155420 -183890
9680 -183890 -68442 -227294 133321 80975 -166357 -124691 -204782 -90917 -4537 21230 182446
9669 182446 90700 -259074 37529 59480 -78123 -154589 -318979 83179 -5991 -51159 79077
9657 -127679 40027 -337872 204174 4622 -41163 -64217 57146 25452 -309188 -253355 -57740
9645A5112j501a66452N3726j57370A84124g4554A94609c02119J36225A07128e1692
9633b46115l0498a29656n0461j11973B17930a45748l6568D9439P0554a68996p8537
9622b47533r6661f2315H880K50136J00661h3241L2356j46011K0364L0575A39289
9610c05452l5383a18201A55472b64354h7656l8181c9527k42326B20000e51894
9599A39741M1638b057D9154a66275Q0521r1152c5681j74154P3090j40508J06379
9588a70874B5216h8798A76404f2178j35310a0844j36901B1038M6389B7268K079
9577B9347j2795a93989A40675g759H4394B4344a89341g3423b9062A2373b98521
9565a77680H2258a76285A70606D5583a39399K5824A14617J1460Q8079b706A30059
$$ plain form
9645 15112 13611 -166452 -112726 -270096 184124 -74554 194609 -302119 -165894 107128 -51692
9633 -246115 -276613 -129656 -180117 -292090 217930 -145748 -182316 49439 119993 -168996 -247533
9622 -247533 -344194 -62315 8880 259016 359677 -83241 -50885 -196896 -176532 -145957 139289
9610 -305452 -340835 -118201 155472 -264354 -87656 -125837 -39527 -281853 220000 -551894
9599 139741 181379 -2057 49154 -166275 -85754 -176906 -35681 -209835 -136745 -277253 -170874
9588 -170874 25216 -88798 176404 -62178 -197488 -10844 -147745 21038 67427 27268 29347
9577 29347 16552 -193989 140675 -7759 84394 24344 -189341 -73423 -29062 12373 -298521
9565 -177680 82258 -176285 170606 45583 -139399 -113575 114617 126077 214156 -2706 130059
9553i205l0582J2807r217I6167K3866e31708K14778O8816f4974A71508L1427a86866
9540c148E3582b8815F900a9818p125E3244b66232a03587A03135L54822A95643
9528c848D8323c39618A23497c07480d1469K0278E1143A492J40242d91863B82781
9516a7821k7904k42057O6443A12325D2306a17005j87371H6172l4058h3120j61886
9505b45006i6997p8912j02519B03530a2150A9401a44654H012b70378J25693d4292
9493a94434D20120a27282M5093j65603d5560a8926P109B37887a16931L8217C788
9481A85161c46366g2354l60414C11640b4798F4630a9657A19185a86200j05812
9471b92012H6568m2184b43405Q8639e5025D2437b20098h5636A62591c42419A31512
$$ plain form
9553 -9205 -39787 -26980 -36197 96167 120033 -531708 -316930 -248114 -64974 171508 202935 -186866
9540 -3148 53582 -28815 6900 -19818 -26943 53244 -266232 -103587 103135 457957 195643
9528 -3848 48323 -339618 123497 -307480 -41469 -21191 51143 1492 141734 -491863 282781
9516 -17821 -45725 -287782 -221339 112325 42306 -117005 -304376 86172 52114 -83120 -245006
9505 -245006 -96997 -175909 -278428 203530 -12150 19401 -144654 8012 -270378 -144685 -44292
9493 -194434 420120 -127282 -82189 -247792 -45560 -18926 -11817 237887 -116931 -78714 3788
9481 185161 -346366 -72354 -432768 311640 -24798 64630 -19657 119185 -186200 -292012
9471 -292012 86568 44384 -243405 -154766 -55025 42437 -220098 -85636 162591 -342419 131512
9459b93280h2621o9980B09616D6030b22892j09966o4498g6776F8845a1943l43659
9448c55602e6148j3962G7984K6327b93245h8125E6625h8133b0000D00370e5208
9436a16524j26693i3959j02146j22505C82812b17759k6331d501B20122F954g4565
9424a67944F0618f5048m58135c9155n75877B54033J6799f3670j95728A33316a65501
9412A7467c45659e564j49057A67738M0490B4761b75474B2668i0501L5874l3926
9401h8553J030o985j35967l62266B36711a39946k61336J65888b6238B78570b8626
9389A69107c41969a45454A58814c21249i7091A54273a64691A37168n3158P8698
9379A62708b4031j1701D7993L094a94821H8022c04196J32573J1126q9614l5789
$$ plain form
9459 -293280 -82621 -152601 209616 46030 -222892 -332858 -397356 -76776 68845 -11943 -355602
9448 -355602 -56148 -70110 77984 104311 -293245 -88125 56625 -88133 -20000 400370 -55208
9436 -116524 -243217 -93959 -196105 -318610 382812 -217759 -244090 -4501 220122 6954 -74565
9424 -167944 60618 -65048 -523183 -39155 -615032 254033 270832 -63670 -259398 133316 -165501
9412 17467 -345659 -5564 -154621 167738 208228 24761 -275474 22668 -90501 -54627 -88553
9401 -88553 -87523 -94508 -230475 -592741 236711 -139946 -401282 -235394 -26238 278570 -28626
9389 169107 -341969 -145454 158814 -321249 -97091 154273 -164691 137168 84010 162708
9379 162708 -24031 -35732 47993 51087 -194821 88022 -304196 -171623 -160497 -250111 -285900
9368b85900J04127A2292a26211p5618M3829d4661I8121e1863l72642A13848b7298
9356b4870j69141j30945f7056E6185g1577j25841R4843n9811D0526b28823d9352
9344B02844b94997N7457f4542j02842P8965o2063A00655a57555O769d1732M923
9333c6809j63706l16119a50009L2309J2643A74885j2873m6931l1462B8397a558
9321b88043I652A432M820a93150q2188J34016A03321a02620l0569j25759O9540
9310a89408E1987j5437a70819Q3039d0278A41275d42795a51900F3460i9904j6784
9299a16688k4619l936O3138H0626a87160d9422j0855j95357N8797D41096c43531
9287B34046d30324J76100A6042e1509D2404K0972b7386m02085I862a30060A35376
$$ plain form
9368 -285900 -181773 12292 -126211 -201829 -158000 -44661 98121 -51863 -424505 113848 -27298
9356 -24870 -194011 -324956 -67056 56185 -71577 -197418 -102575 -162386 40526 -228823 -49352
9344 202844 -294997 -237540 -64542 -167384 -88419 -150482 100655 -157555 -150786 -41732 -36809
9333 -36809 -200515 -516634 -150009 -117700 -105057 174885 162012 115081 83619 28397 -1558
9321 -288043 9652 1432 6252 -193150 -275338 -141322 103321 -102620 -133189 -258948 -189408
9310 -189408 51987 36550 -170819 -87780 -40278 141275 -442795 -151900 63460 -99904 -116688
9299 -116688 -141307 -145243 -82105 80626 -187160 -49422 -60277 -255634 -196837 441096 -343531
9287 234046 -430324 -254224 16042 -51509 42404 63376 -27386 -429471 9862 -130060 135376
9275A47317J0682o442L3373d49495A43596a9404p1963k2518B72220a41745j39840
9264b81585L9836B98987j03873M8935c5457H5276a75379e2529A50824N4518C9119
9252I111J78005d48077b22126A95952f77303b45926h3833A22311k1930a40038
9241D3826a10322e988j78652G6894e653j3921j18614j25616b9945k79943A19505
9229a03473l91073K29667o7116F6631d3875p0441l1699B3438J74834m4991P6975
9218B30256A2775b8382j25583r2201C81756D9886K16973B0483g2935G3025a93231
9206h9995B6067a0107p4985F2571a95081M2293b7275j20203B20069a68262E4639
9194b89891O5706A699c9875q2375m8096n9230A50935r407h6739j59829E8766f8196
$$ plain form
9275 147317 157999 151557 184930 -449495 143596 -19404 -91367 -113885 272220 -141745 -281585
9264 -281585 -241749 298987 195114 244049 -35457 85276 -175379 -52529 150824 205342 39119
9252 9111 187116 -448077 -222126 195952 -677303 -245926 -83833 122311 100381 -140038
9241 43826 -110322 -5988 -184640 76894 -5653 -19574 -138188 -263804 -29945 -309888 119505
9229 -103473 -494546 -264879 -331995 66631 -43875 -114316 -146015 23438 198272 153281 230256
9218 230256 12775 -28382 -153965 -246166 381756 49886 266859 20483 -72935 73025 -193231
9206 -89995 26067 -10107 -85092 62571 -195081 -152788 -27275 -147478 220069 -168262 54639
9194 -289891 -224185 1699 -39875 -122250 -170346 -229576 150935 141528 -86739 -246568 58766 -68196
9181A91246D5706A079J2900b55959a02493E9912J47976h0699A30905E0706a2526
9169e5277A95827a23623p0808b2133j94445j17165k3992A18859G381f1160k94995
9158c56155n3291e4835a6500A51647i0792j82485f756k48104A76916p4882b40281
9146a83315b4247l7832j7268G1597Q0710a1636p9534j27282B69201a78727d1288
9134a38391c8340M325m67819a27097A05402b35844C21815a20197L7970I3476J28805
9123B22281c20402Q4125J14466F216R2992m8299O4519h3920A05292a42171A35939
9111b19764n4140i8382F9456a56591J3128B3856h2703B6549J37981k6556m0517
9100I7457g2531A7654a81550I8865J58002h381A34839j091d61698e2299G5895
$$ plain form
9181 191246 45706 1079 13979 -255959 -102493 59912 207888 -80699 130905 50706 -12526
9169 -55277 195827 -123623 -194431 -22133 -216578 -333743 -357735 118859 7381 -61160 -356155
9158 -356155 -409446 -54835 -16500 151647 -90792 -273277 -6756 -254860 176916 102034 -240281
9146 -183315 -24247 -62079 -79347 71597 152307 -11636 -91170 -218452 269201 -178727 -41288
9134 -138391 -38340 -34015 -501834 -127097 105402 -235844 321815 -120197 -82227 93476 222281
9123 222281 -320402 -236277 -121811 6216 99208 50909 115428 -83920 105292 -142171 135939
9111 -219764 -273904 -98382 69456 -156591 -143463 23856 -82703 26549 164530 137974 97457
9100 97457 -72531 17654 -181550 98865 256867 -8381 134839 133748 -461698 -52299 75895
9088e0470o5118k3846j86789O8713I0243c33623h9801l3855A9241e5328M999j96386
9076b46715b130A80944a14880k00915D3223e5062A48847b54450G5978P6992c57301
9064A56926b34890F3341b36591O0740F5888o462i6087r2231B99004E8634J08435
9053A67069a09511j72110A80544b85698a25068a2036E8031a15681C57964g2794
9042a29765o8727F4997a40073L6170Q316A12166d34424D9522B4721H168a06709
9030b34441R0808A2617J01904f1349I2846c17740P4241o028e4500A56518b43930
9018B11384a89274d7648H8136J2628d5728I7484c42506h8992n7482N8933L6433
9007e1108A25304n8773O6667l0292a08761b1393H8009J78047A28553g6395j16587
$$ plain form
9088 -50470 -115588 -139434 -326223 -257510 90243 -333623 -89801 -123656 19241 -55328 -50329 -246715
9076 -246715 -2130 180944 -114880 -315795 43223 -55062 148847 -254450 75978 152970 -357301
9064 156926 -234890 63341 -236591 -175851 65888 59426 -96087 -188318 299004 58634 167069
9053 167069 -109511 -281621 180544 -285698 -125068 -12036 58031 -115681 357964 -72794
9042 -129765 -198492 64997 -140073 -103903 -95587 112166 -434424 49522 24721 8168 -106709
9030 -234441 -143633 12617 114521 -61349 92846 -317740 -243499 -249527 -54500 156518 -243930
9018 211384 -189274 -47648 88136 100764 -45728 97484 -342506 -88992 -146474 -87541 -51108
9007 -51108 125304 66531 133198 102906 -108761 -21393 88009 266056 128553 -76395 -192982
8996a92982B16537a96016D9080i4926j07225R3197j60826B81511h0893l31913
8986d12806A01562B6636b62314a08447j87808c8343B90293E6855a76498A38992
8975c08801J2126J29970d6117I8049d1121B32208E3660J15934c2026m2052k3275
8964i7353G066O6685d49449a83534A13184D0775a8571l05056e5582k43054J45723
8953a52913B07403c40599a5644A30214e12538A07884j7147a55457j21261I6219
8942a20575R226K4933K6664B09845h0276L4231E9211J38625B0331J48603f3401
8930a961j55821D7739b0633B83043A00604M34430P88490J851440N638953k743008
8920F070909A073400n33453j02898r2854A1150K45199a70428f3131b2180m5371
$$ plain form
8996 -192982 216537 -196016 49080 -94926 -202151 -108954 -269780 281511 -80893 -412806
8986 -412806 101562 26636 -262314 -108447 -296255 -38343 290293 56855 -176498 138992
8975 -308801 -296675 -166705 -46117 98049 -41121 232208 53660 169594 -32026 -74078 -97353
8964 -97353 7066 73751 -449449 -183534 113184 40775 -18571 -323627 -55582 -298636 -152913
8953 -152913 207403 -340599 -15644 130214 -512538 107884 90737 -155457 -276718 96219
8942 -120575 -111349 -86416 -59752 209845 -80276 -46045 59211 197836 20331 168934 -63401
8930 -1961 -157782 47739 -20633 283043 100604 535034 1323524 3174964 8813917 6070909
8920 6070909 1073400 539947 437049 344195 11150 256349 -170428 -63131 -22180 -67551
8910f7551B7908j1873K70417D7260b79661i7672j32032C861R3311Q7194h5585
8898A64726p1698A6125b38741R011F6926a33804L3018j1999A01679b48863Q8062
8887a60801E1236i0493k086A34746a89141h36k8149n4538E2603c94515a43914
8875f698q4417a122o5177k12755B57257b10603j03215a15403K6195E6867a79592
$$ plain form
8910 -67551 27908 16035 286452 47260 -279661 -97672 -229704 3861 97172 184366 -85585
8898 164726 93028 16125 -238741 -229730 66926 -133804 -100786 -112785 101679 -248863 -160801
8887 -160801 51236 -90493 -92579 134746 -189141 -836 -28985 -83523 52603 -394515 -143914
8875 -6698 -91115 -1122 -66299 -279054 257257 -210603 -313818 -115403 -89208 56867 -179592
$$ [...]
##END NTUPLES=NMR SPECTRUM
##END=
