
##TITLE=AC1337_BRAAS10080_6642190_wx7HlNb2sU
##JCAMPDX= 6.0         $$ Bruker NMR JCAMP-DX V2.0
##DATA TYPE= NMR SPECTRUM
##DATA CLASS= NTUPLES
##ORIGIN= BRUKER
##OWNER= Administrator
$$ 1.72 TOPSPIN		Version 2.1
$$ 2012-08-08 16:29:29.703 -0500  Administrator@TOPSPIN
$$ Compression mode = diff/dup
##.OBSERVE FREQUENCY= 400.02188249412
##.OBSERVE NUCLEUS= ^1H
##.ACQUISITION MODE= SIMULTANEOUS (DQD)
##.ACQUISITION SCHEME= undefined
##.AVERAGES= 64
##.DIGITISER RES= 22
##SPECTROMETER/DATA SYSTEM= spect
##.PULSE SEQUENCE= noesygpps1d.comp
##.SOLVENT NAME= COFFEE_meoh
##.SHIFT REFERENCE= INTERNAL, COFFEE_meoh, 1, 14.96247
##AUDIT TRAIL= $$ (NUMBER, WHEN, WHO, WHERE, PROCESS, VERSION, WHAT)
$$ ##TITLE= Audit trail, TOPSPIN		Version 2.1
$$ ##JCAMPDX= 5.01
$$ ##ORIGIN= Bruker BioSpin GmbH
$$ ##OWNER= Administrator
$$ $$ C:\Bruker\TOPSPIN/data/COFFEE/nmr/AC1337_BRAAS10080_6642190_wx7HlNb2sU/12/pdata/1/auditp.txt
$$ ##AUDIT TRAIL=  $$ (NUMBER, WHEN, WHO, WHERE, PROCESS, VERSION, WHAT)
(   1,<2012-08-08 16:29:24.796 -0500>,<Administrator>,<TOPSPIN>,<go>,<TOPSPIN 2.1>,
      <created by zg
	started at 2012-08-08 16:17:54.609 -0500,
	POWCHK enabled, PULCHK disabled,
       configuration hash MD5:
       6B 1B 68 BB D9 2E 58 E2 7F 35 AD 54 07 DF 0E 41
       data hash MD5: 64K
       02 C6 41 53 08 4E 88 F7 9D E1 D4 FB 8B E0 CD 8B>)
(   2,<2012-08-08 16:29:27.687 -0500>,<Administrator>,<TOPSPIN>,<proc1d>,<TOPSPIN 2.1>,
      <Start of raw data processing
       efp LB = 0.3 FT_mod = 6 PKNL = 1 PHC0 = 0 PHC1 = 0 SI = 128K 
       data hash MD5: 128K
       73 D3 17 3A 6C A8 58 8D 33 AE 54 5A 31 1B 34 21>)
(   3,<2012-08-08 16:29:28.828 -0500>,<Administrator>,<TOPSPIN>,<proc1d>,<TOPSPIN 2.1>,
      <pk PHC0 = 0.368042 PHC1 = 0 
       data hash MD5: 128K
       05 4C 14 04 CA 53 7F 4E 84 B6 02 B4 04 7D A7 0A>)
(   4,<2012-08-08 16:29:29.375 -0500>,<Administrator>,<TOPSPIN>,<proc1d>,<TOPSPIN 2.1>,
      <abs ABSG = 1 
       data hash MD5: 128K
       02 BA 56 A4 59 31 90 16 EB B2 05 D3 41 B3 E5 22>)
(   5,<2012-08-08 16:29:29.437 -0500>,<Administrator>,<TOPSPIN>,<proc1d>,<TOPSPIN 2.1>,
      <abs ABSG = 2 
       data hash MD5: 128K
       61 E8 A1 4C EE 32 84 FF 74 34 7E 1C 38 C4 F6 30>)
(   6,<2012-08-08 16:29:29.500 -0500>,<Administrator>,<TOPSPIN>,<proc1d>,<TOPSPIN 2.1>,
      <abs ABSG = 3 
       data hash MD5: 128K
       9B 9E 49 2D D9 6E 96 21 D0 53 EB 47 26 2D 5A 7F>)
(   7,<2012-08-08 16:29:29.562 -0500>,<Administrator>,<TOPSPIN>,<proc1d>,<TOPSPIN 2.1>,
      <abs ABSG = 4 
       data hash MD5: 128K
       45 8D 90 3A BE 6E EB 1D 23 73 E8 82 70 15 AB 5B>)
(   8,<2012-08-08 16:29:29.609 -0500>,<Administrator>,<TOPSPIN>,<proc1d>,<TOPSPIN 2.1>,
      <abs ABSG = 5 
       data hash MD5: 128K
       FD 3C 2B 08 1F 26 25 42 A8 AC E5 75 4F 59 2F 6D>)
$$ ##END=
$$ 
$$ $$ hash MD5
$$ $$ 2B 1E 30 D8 57 FD B0 28 C1 38 B5 08 74 06 5E 0D
##$RELAX= 
##$RELAX= 
##$RELAX= 
##$RELAX= 
##$RELAX= 
##$RELAX= 
##$RELAX= 
##$RELAX= 
$$ Bruker specific parameters
$$ [...]
##$TP07= 0
##$TPNAME0= <>
##$TPNAME1= <>
##$TPNAME2= <>
##$TPNAME3= <>
##$TPNAME4= <>
##$TPNAME5= <>
##$TPNAME6= <>
##$TPNAME7= <>
##$TPOAL= (0..7)
0.5 0.5 0.5 0.5 0.5 0.5 0.5 0.5
##$TPOFFS= (0..7)
0 0 0 0 0 0 0 0
##$TUNHIN= 0
##$TUNHOUT= 0
##$TUNXOUT= 0
##$USERA1= <user>
##$USERA2= <user>
##$USERA3= <user>
##$USERA4= <user>
##$USERA5= <user>
##$V9= 5
##$VALIST= <valist>
##$VCLIST= <CCCCCCCCCCCCCCC>
##$VD= 0
##$VDLIST= <DDDDDDDDDDDDDDD>
##$VPLIST= <PPPPPPPPPPPPPPP>
##$VTLIST= <TTTTTTTTTTTTTTT>
##$WBST= 1024
##$WBSW= 4
##$XGAIN= (0..3)
0 0 0 0
##$XL= 0
##$YL= 0
##$YMAX_a= 18178387
##$YMIN_a= -11150829
##$ZGOPTNS= <>
##$ZL1= 120
##$ZL2= 120
##$ZL3= 120
##$ZL4= 120
##$ABSF1= 14.96247
##$ABSF2= -5.595712
##$ABSG= 5
##$ABSL= 3
##$ALPHA= 0
##$AQORDER= 0
##$ASSFAC= 0
##$ASSFACI= 0
##$ASSFACX= 0
##$ASSWID= 0
##$AUNMP= <proc_prof1d_extract.lims>
##$AXLEFT= 0
##$AXNAME= <>
##$AXNUC= <1H>
##$AXRIGHT= 0
##$AXTYPE= 0
##$AXUNIT= <>
##$AZFE= 0.1
##$AZFW= 0.1
##$BCFW= 0
##$BC_mod= 0
##$BYTORDP= 0
##$COROFFS= 0
##$CY= 15
##$DATMOD= 1
##$DC= 0
##$DFILT= <>
##$DTYPP= 0
##$F1P= 0
##$F2P= 0
##$FCOR= 0.5
##$FTSIZE= 131072
##$FT_mod= 6
##$GAMMA= 0
##$GB= 0
##$INTBC= 1
##$INTSCL= 1
##$ISEN= 128
##$LB= 0.3
##$LEV0= 0
##$LPBIN= 0
##$MAXI= 10000
##$MC2= 0
##$MEAN= 0
##$ME_mod= 0
##$MI= 0
##$NCOEF= 0
##$NC_proc= -3
##$NLEV= 6
##$NOISF1= 0
##$NOISF2= 0
##$NSP= 0
##$NTH_PI= 0
##$NZP= 0
##$OFFSET= 14.96247
##$PC= 1
##$PHC0= 0.368042
##$PHC1= 0
##$PH_mod= 1
##$PKNL= yes
##$PPARMOD= 0
##$PPDIAG= 0
##$PPIPTYP= 0
##$PPMPNUM= 2147483647
##$PPRESOL= 1
##$PSCAL= 4
##$PSIGN= 0
##$PYNMP= <proc.py>
##$REVERSE= no
##$SF= 400.02000904755
##$SI= 131072
##$SIGF1= 0
##$SIGF2= 0
##$SINO= 400
##$SIOLD= 131072
##$SPECTYP= <>
##$SREGLST= <1H.CDCl3>
##$SSB= 0
##$STSI= 131072
##$STSR= 0
##$SW_p= 8223.68421052631
##$SYMM= 0
##$S_DEV= 0
##$TDeff= 65536
##$TDoff= 0
##$TI= <>
##$TILT= no
##$TM1= 0
##$TM2= 0
##$TOPLEV= 0
##$USERP1= <user>
##$USERP2= <user>
##$USERP3= <user>
##$USERP4= <user>
##$USERP5= <user>
##$WDW= 1
##$XDIM= 131072
##$YMAX_p= 497432598
##$YMIN_p= -20829
##$CURPLOT= <Network HP LaserJet P1505>
##$CURPRIN= <$Network HP LaserJet P1505>
##$DFORMAT= <normdp>
##$LAYOUT= <+/1D_H.xwp>
##$LFORMAT= <normlp>
##$PFORMAT= <normpl>
##$SURQMSG= 1
$$ End of Bruker specific parameters
$$ ---------------------------------
##NTUPLES= NMR SPECTRUM
##VAR_NAME=  FREQUENCY,     SPECTRUM/REAL,   SPECTRUM/IMAG
##SYMBOL=    X,             R,               I
##VAR_TYPE=  INDEPENDENT,   DEPENDENT,       DEPENDENT
##VAR_FORM=  AFFN,          ASDF,            ASDF
##VAR_DIM=   131072,        131072,          131072
##UNITS=     HZ,            ARBITRARY UNITS, ARBITRARY UNITS
##FACTOR=    0.0627417313425164, 1,          1
##FIRST=     8223.62146879497, 631,          -128371
##LAST=      0,             4402,            -129358
##MIN=       0,             -20829,          0
##MAX=       8223.62146879497, 497432598,    0
$$ Real data points
##PAGE= N=1
##DATA TABLE= (X++(R..R)), XYDATA
$$ [...]
$$ plain form
60623 1433146 1459991 1486118 1510966 1535030 1559258 1584114 1609097 1633155 1655788 1677682 1699774
60612 1699774 1721664 1741541 1758086 1771774 1783789 1794184 1801813 1805718 1805831 1802660 1797098 1790310 1782872
60599 1782872 1774037 1762751 1749465 1736055 1723793 1712251 1700544 1688702 1677120 1665366 1652559
60588 1652559 1638827 1625695 1614782 1606446 1599835 1594034 1588922 1584821 1581488 1577836 1572881 1566730 1560331
60575 1560331 1554463 1549403 1545369 1542543 1540518 1538395 1535873 1533760 1532939 1533183 1533590 1534009 1535274 1537837 1540867
60560 1540867 1543314 1545491 1548825 1553908 1559629 1564772 1569961 1577180 1587534 1600427 1615217 1632868 1655400
60547 1655400 1684188 1719281 1759908 1804928 1852971 1902889 1954197 2006648 2059210 2109795 2156273
60536 2156273 2197784 2235010 2269113 2300240 2326965 2347237 2359818 2364646 2362160 2352889 2337752 2318188
$$ packed form
60623A433146K6845K6127K4848K4064K4228K4856K4983K4058K2633K1894K2092
60612A699774K1890J9877J6545J3688J2015J0395P629L905J13l171n562o788p438
60599A782872q835j1286j3286j3410j2262j1542j1707j1842j1582j1754j2807
60588A652559j3732j3132j0913q336o611n801n112m101l333l652m955o151o399
60575A560331n868n060m034k826k025k123k522k113q21K44M07M19J265K563L030
60560A540867K447K177L334N083N721N143N189P219J0354J2893J4790J7651K2532
60547A655400K8788L5093M0627M5020M8043M9918N1308N2451N2562N0585M6478
60536B156273M1511L7226L4103L1127K6725K0272J2581M828k486r271j5137j9564
$$ plain form
60524 2318188 2295794 2272325 2250061 2231340 2217135 2206623 2198603 2192926 2190215 2190868 2194994 2202834 2214583
60511 2214583 2230131 2249556 2273685 2303765 2341003 2386830 2443081 2511291 2592266 2686914 2796944
60500 2796944 2924152 3069594 3234292 3420211 3629576 3863517 4122015 4404495 4709165
60491 4709165 5031739 5365562 5702814 6035036 6353295 6649314 6916739 7150909 7348003
60482 7348003 7505276 7621219 7693899 7719442 7693669 7615175 7485636 7307863 7085903 6827558
60472 6827558 6544724 6249966 5953225 5661434 5378984 5107280 4845331 4592258 4348858
60463 4348858 4116376 3894971 3684287 3484468 3295689 3117535 2949746 2792714 2646371
60454 2646371 2509449 2380767 2260468 2149044 2046018 1950685 1863288 1784112 1712083 1645794
$$ packed form
60524B318188k2394k3469k2264j8721j4205j0512q020n677k711O53M126P840J1749
60511B214583J5548J9425K4129L0080L7238M5827N6251O8210Q0975R4648J10030
60500B796944J27208J45442J64698J85919K09365K33941K58498K82480L04670
60491D709165L22574L33823L37252L32222L18259K96019K67425K34170J97094
60482G348003J57273J15943P2680K5543k5773p8494j29539j77773k21960k58345
60472F827558k82834k94758k96741k91791k82450k71704k61949k53073k43400
60463D348858k32482k21405k10684j99819j88779j78154j67789j57032j46343
60454B646371j36922j28682j20299j11424j03026r5333q7397p9176p2029o6289
$$ plain form
60444 1645794 1585530 1532680 1487145 1446887 1410348 1377794 1349575 1324307 1299986 1276382 1255260
60433 1255260 1238322 1225637 1216020 1208096 1200723 1193180 1185686 1179414 1175149 1171963 1168125 1163522 1160225
60420 1160225 1160081 1162613 1166114 1169868 1174057 1178204 1181444 1184290 1188410 1194319 1200762 1206870 1213479 1221527
60406 1221527 1230435 1239044 1247143 1255023 1262464 1269369 1276788 1286082 1297287 1309243 1321145 1333162 1345641
60393 1345641 1358419 1370882 1382294 1392233 1401004 1409322 1417343 1424456 1430249 1434977 1438760 1441180 1442281
60380 1442281 1443017 1443784 1443307 1440145 1434885 1429690 1425903 1423072 1420155 1416722 1412994 1409660 1407773 1407984 1409674
60365 1409674 1411375 1412210 1412571 1413417 1415337 1418234 1421487 1424506 1427413 1431038 1435983 1442044 1448914 1456879 1466156
60350 1466156 1475888 1484537 1491196 1496108 1500283 1505170 1512155 1521344 1530973 1538935 1544974 1550708 1557547 1565417
$$ packed form
60444A645794o0264n2850m5535m0258l6539l2554k8219k5268k4321k3604k1122
60433A255260j6938j2685r617p924p373p543p494o272m265l186l838m603l297
60420A160225j44K532L501L754M189M147L240K846M120N909O443O108O609Q048
60406A221527Q908Q609Q099P880P441O905P419R294J1205J1956J1902J2017J2479
60393A345641J2778J2463J1412R939Q771Q318Q021P113N793M728L783K420J101
60380A442281P36P67m77l162n260n195l787k831k917l433l728l334j887K11J690
60365A409674J701Q35L61Q46J920K897L253L019K907L625M945O061O870P965R277
60350A466156R732Q649O659M912M175M887O985R189R629P962O039N734O839P870
$$ plain form
60336 1565417 1573501 1581265 1588421 1594745 1600534 1606825 1614561 1623727 1633636 1643866 1654461 1665165 1674901
60323 1674901 1682428 1687504 1691076 1694169 1696966 1699237 1701140 1702858 1703714 1702621 1699575 1695881 1692669 1689920
60309 1689920 1687177 1684422 1681884 1679690 1677938 1676359 1673877 1669633 1664674 1661220 1659648 1657774 1654101 1650207
60295 1650207 1648345 1648046 1647076 1644995 1643679 1644578 1647262 1650674 1654124 1656965 1658896 1660936 1664784 1670933 1678527
60280 1678527 1687085 1697026 1708268 1719807 1731195 1743279 1757002 1772528 1789981 1809975 1832889 1858502
60268 1858502 1886745 1917818 1951159 1985472 2020443 2057524 2098392 2143530 2192878 2246860 2305824
60257 2305824 2369279 2436758 2509011 2587525 2673222 2766272 2866730 2974581 3089490 3211243
60247 3211243 3340235 3476839 3620430 3769525 3922652 4078550 4235784 4392842 4548594
$$ packed form
60336A565417Q084P764P156O324N789O291P736R166R909J0230J0595J0704R736
60323A674901P527N076L572L093K797K271J903J718Q56j093l046l694l212k749
60309A689920k743k755k538k194j752j579k482m244m959l454j572j874l673l894
60295A650207j862k99r70k081j316Q99K684L412L450K841J931K040L848O149P594
60280A678527Q558R941J1242J1539J1388J2084J3723J5526J7453J9994K2914K5613
60268A858502K8243L1073L3341L4313L4971L7081M0868M5138M9348N3982N8964
60257B305824O3455O7479P2253P8514Q5697R3050J00458J07851J14909J21753
60247C211243J28992J36604J43591J49095J53127J55898J57234J57058J55752
$$ plain form
60238 4548594 4702053 4851603 4995027 5130500 5257250 5375031 5483101 5579940 5663936 5734291
60228 5734291 5791305 5835990 5869606 5893489 5908912 5916948 5918778 5916380 5912593 5910112 5910679 5915638 5926811
60215 5926811 5946192 5975018 6013866 6063468 6124593 6197133 6280222 6373404 6476846 6590032 6710918
60204 6710918 6836792 6965468 7095289 7224513 7351155 7473096 7588031 7693595 7787698 7868367
60194 7868367 7933242 7980049 8008070 8018681 8013921 7994861 7961819 7915832 7859266 7795083 7726008
60183 7726008 7654488 7582991 7513949 7449383 7390787 7339528 7297347 7266175 7247363 7241227 7247326 7264731
60171 7264731 7291840 7326626 7367648 7414422 7466122 7520314 7573763 7624306 7671199 7713823 7751028
60160 7751028 7781744 7805323 7821185 7829056 7829847 7825568 7818135 7808946 7799777 7793340 7792693 7800766 7820444
$$ packed form
60238D548594J53459J49550J43424J35473J26750J17781J08070R6839Q3996P0355
60228E734291N7014M4685L3616K3883J5423Q036J830k398l787k481N67M959J1173
60215E926811J9381K8826L8848M9602O1125P2540Q3089R3182J03442J13186J20886
60204F710918J25874J28676J29821J29224J26642J21941J14935J05564R4103Q0669
60194G868367O4875M6807K8021J0611m760j9060l3042m5987n6566o4183o9075
60183G726008p1520p1497o9042o4566n8596n1259m2181l1172j8812o136O099J7405
60171G264731K7109L4786M1022M6774N1700N4192N3449N0543M6893M2624L7205
60160G751028L0716K3579J5862P871P91m279p433r189r169o437o47Q073J9678
$$ plain form
60147 7820444 7854069 7902621 7966425 8047253 8148828 8274768 8426910 8606169 8813863 9051126
60137 9051126 9317789 9613019 9936613 10288501 10667131 11069306 11491593 11931063 12384583
60128 12384583 12848068 13316489 13784039 14244267 14690625 15117212 15518815 15890304 16226277
60119 16226277 16521240 16770033 16968558 17114631 17208089 17249694 17240167 17180692 17074107 16924946
60109 16924946 16738276 16518888 16271515 16001254 15713684 15414969 15111951 14811599 14520103
60100 14520103 14242572 13983531 13747157 13536817 13354669 13201896 13078889 12984913 12917982 12875642
60090 12875642 12855717 12855724 12871581 12897700 12928902 12961968 12994978 13025452 13049679 13063580 13063537 13046429
60078 13046429 13009720 12952124 12873970 12776627 12661467 12529181 12379740 12213347 12032001 11839809
$$ packed form
60147G820444L3625M8552O3804Q0828J01575J25940J52142J79259K07694K37263
60137I051126K66663K95230L23594L51888L78630M02175M22287M39470M53520
60128A2384583M63485M68421M67550M60228M46358M26587M01603L71489L35973
60119A6226277K94963K48793J98525J46073R3458M1605r527n9475j06585j49161
60109A6924946j86670k19388k47373k70261k87570k98715l03018l00352k91496
60100A4520103k77531k59041k36374k10340j82148j52773j23007r3976o6931m2340
60090A2875642j9925PJ5857K6119L1202L3066L3010L0474K4227J3901m3j7108
60078A3046429l6709n7596p8154r7343j15160j32286j49441j66393j81346j92192
$$ plain form
60068 11839809 11640836 11436845 11228393 11018202 10811779 10614004 10426680 10250536 10088112
60059 10088112 9942845 9816206 9707764 9617732 9547663 9498633 9470385 9462464 9474673 9505987 9554084
60048 9554084 9616118 9688993 9769023 9852692 9937775 10022322 10102494 10173093 10230564 10273893 10302117
60037 10302117 10312782 10303779 10275109 10227737 10162066 10078790 9980140 9869039 9747800 9618698 9484823
60026 9484823 9349234 9214094 9081743 8955735 8839436 8734335 8641117 8561762 8499029 8454260
60016 8454260 8427337 8418871 8430958 8465324 8521757 8598722 8694737 8808754 8939683 9085863 9244667
60005 9244667 9412533 9585473 9759304 9929403 10091157 10241442 10379069 10502794 10609112
59996 10609112 10692958 10750587 10781222 10786307 10768137 10729053 10670848 10594531 10501169 10393000 10273268
$$ packed form
60068A1839809j98973k03991k08452k10191k06423j97775j87324j76144j62424
60059A0088112j45267j26639j08442r0032p0069m9030k8248p921J2209L1314M8097
60048I554084O2034P2875Q0030Q3669Q5083Q4547Q0172P0599N7471M3329K8224
60037A0302117J0665r003k8670m7372o5671q3276r8650j11101j21239j29102j33875
60026I484823j35589j35140j32351j26008j16299j05101r3218p9355o2733m4769
60016H454260k6923q466J2087L4366N6433P6965R6015J14017J30929J46180J58804
60005I244667J67866J72940J73831J70099J61754J50285J37627J23725J06318
59996A0609112Q3846N7629L0635N085j8170l9084n8205p6317r3362j08169j19732
$$ plain form
59985 10273268 10145265 10012366 9878964 9750302 9630858 9523360 9429466 9350749 9288675 9244123
59975 9244123 9217281 9207709 9214341 9235945 9271952 9322452 9386900 9462948 9546925 9635547 9726964 9820182
59963 9820182 9913796 10005588 10093360 10175858 10252751 10323930 10389168 10448477 10502552 10552965 10602057
59952 10602057 10652473 10706517 10766229 10834533 10915965 11015412 11136157 11279957 11449286 11648641
59942 11648641 11883046 12155594 12466607 12814570 13197232 13612000 14055588 14523239 15008165
59933 15008165 15501759 15994179 16474709 16932495 17358097 17744230 18084180 18369930 18593322
59924 18593322 18749288 18836714 18855917 18806799 18690224 18509958 18272507 17986153 17660918 17308205
59914 17308205 16938780 16561083 16181785 15807215 15443725 15097567 14774922 14480963 14218031
$$ packed form
59985A0273268j28003j32899j33402j28662j19444j07498r3894p8717o2074m4552
59975I244123k6842r572O632K1604L6007N0500O4448P6048Q3977Q8622R1417R3218
59963I820182R3614R1792Q7772Q2498P6893P1179O5238N9309N4075N0413M9092
59952A0602057N0416N4044N9712O8304Q1432R9447J20745J43800J69329J99355
59942A1648641K34405K72548L11013L47963L82662M14768M43588M67651M84926
59933A5008165M93594M92420M80530M57786M25602L86133L39950K85750K23392
59924A8593322J55966Q7426J9203m9118j16575j80266k37451k86354l25235l52713
59914A7308205l69425l77697l79298l74570l63490l46158l22645k93959k62932
$$ plain form
59905 14218031 13985866 13784549 13616293 13483640 13387325 13327114 13303014 13313349 13352303 13411623
59895 13411623 13484843 13568397 13658658 13749617 13833789 13904196 13955157 13982134 13981186 13948175 13878948
59884 13878948 13771182 13625752 13445407 13232498 12989056 12718588 12426360 12117875 11798000
59875 11798000 11471311 11142042 10813750 10490050 10175392 9873701 9586193 9311733 9049462
59866 9049462 8800006 8564217 8342150 8133669 7938953 7757968 7590231 7435316 7292856
59857 7292856 7162120 7042494 6934350 6838318 6753662 6678428 6611269 6552037 6500407 6455120 6414913
59846 6414913 6379091 6346714 6316124 6285727 6254448 6221066 6183947 6141958 6095094 6043877 5988676
59835 5988676 5929837 5868066 5804641 5741662 5681837 5627240 5578341 5534894 5497457 5467263 5445007
$$ packed form
59905A4218031k32165k01317j68256j32653r6315o0211k4100J0335L8954N9320
59895A3411623P3220Q3554R0261R0959Q4172P0407N0961K6977r48l3011o9227
59884A3878948j07766j45430j80345k12909k43442k70468k92228l08485l19875
59875A1798000l26689l29269l28292l23700l14658l01691k87508k74460k62271
59866I049462k49456k35789k22067k08481j94716j80985j67737j54915j42460
59857G292856j30736j19626j08144r6032q4656p5234o7159n9232n1630m5287m0207
59846F414913l5822l2377l0590l0397l1279l3382l7119m1989m6864n1217n5201
59835E988676n8839o1771o3425o2979n9825n4597m8899m3447l7437l0194k2256
$$ plain form
59824 5445007 5430949 5426014 5431492 5447548 5473061 5506849 5547906 5594621 5645223 5699170 5756794 5817417
59812 5817417 5879173 5940862 6002563 6064104 6124321 6182088 6236618 6286466 6330031 6367767 6402345
59801 6402345 6435935 6468914 6502081 6538301 6580680 6630578 6688905 6758084 6841250 6940626 7058272
59790 7058272 7197422 7361275 7551172 7767796 8013629 8292068 8603751 8945153 9310688
59781 9310688 9694376 10088715 10483485 10867257 11230332 11566257 11871343 12143414 12380640
59772 12380640 12580366 12738043 12847002 12900096 12893071 12827465 12710655 12553336 12367213 12164213
59762 12164213 11955693 11750555 11553983 11368425 11195535 11036928 10893903 10767545 10659090
59753 10659090 10569637 10499655 10449356 10419611 10412135 10428837 10471244 10540360 10636820 10761384 10915558
$$ packed form
59824E445007j4058m935N478J6056K5513L3788M1057M6715N0602N3947N7624O0623
59812E817417O1756O1689O1701O1541O0217N7767N4530M9848M3565L7736L4578
59801F402345L3590L2979L3167L6220M2379M9898N8327O9179Q3166R9376J17646
59790G058272J39150J63853J89897K16624K45833K78439L11683L41402L65535
59781I310688L83688L94339L94770L83772L63075L35925L05086K72071K37226
59772A2380640J99726J57677J08959N3094p025o5606j16810j57319j86123k03000
59762A2164213k08520k05138j96572j85558j72890j58607j43025j26358j08455
59753A0659090q9453o9982n0299k9745p476J6702M2407O9116R6460J24564J54174
$$ plain form
59742 10915558 11101621 11321898 11578261 11872565 12207237 12585107 13008757 13480049 13999920
59733 13999920 14568274 15184049 15845302 16549002 17290899 18066137 18870091 19698453 20546877
59724 20546877 21411194 22287840 23173436 24064271 24957112 25850475 26744199 27637935 28531214
59715 28531214 29424953 30321465 31222540 32128721 33040542 33958376 34879570 35796797 36700556
59706 36700556 37582680 38436328 39253485 40024236 40738749 41389082 41969128 42473783 42898897
59697 42898897 43242351 43505688 43694832 43818763 43887511 43912313 43907671 43891708 43883359 43899673 43956057
59686 43956057 44067435 44247566 44507765 44857146 45303020 45849234 46494175 47231316 48050855
59677 48050855 48939007 49875789 50835437 51790098 52712874 53577968 54360156 55035962 55585538
$$ packed form
59742A0915558J86063K20277K56363K94304L34672L77870M23650M71292N19871
59733A3999920N68354O15775O61253P03700P41897P75238Q03954Q28362Q48424
59724B0546877Q64317Q76646Q85596Q90835Q92841Q93363Q93724Q93736Q93279
59715B8531214Q93739Q96512R01075R06181R11821R17834R21194R17227R03759
59706C6700556Q82124Q53648Q17157P70751P14513O50333N80046N04655M25114
59697D2898897L43454K63337J89144J23931O8748K4802m642j5963q349J6314N6384
59686D3956057J11378J80131K60199L49381M45874N46214O44941P37141Q19539
59677D8050855Q88152R36782R59648R54661R22776Q65094P82188O75806N49576
$$ plain form
59668 55585538 55993222 56246714 56336101 56253564 55994044 55556975 54948310 54181358 53275556 52253557
59658 52253557 51137916 49948670 48702411 47412357 46088662 44739239 43371406 41992884
59650 41992884 40610480 39227698 37844456 36459192 35070197 33675131 32271788 30861643
59642 30861643 29452548 28056978 26687952 25357023 24074520 22849017 21685614 20585496
59634 20585496 19547706 18571264 17655997 16802076 16008731 15273228 14591605 13960872 13379803
59625 13379803 12846895 12358452 11909833 11498039 11121630 10778368 10464483 10176539 9912659
59616 9912659 9671222 9449224 9242771 9048819 8865780 8692463 8526951 8366841 8210551
59607 8210551 8057860 7908728 7761967 7616085 7471422 7330335 7194777 7064768 6939854
$$ packed form
59668E5585538M07684K53492Q9387q2537k59520m37069o08665p66952r05802j021999
59658E2253557j115641j189246j246259j290054j323695j349423j367833j378522
59650D1992884j382404j382782j383242j385264j388995j395066j403343j410145
59642C0861643j409095j395570j369026j330929j282503j225503j163403j100118
59634B0585496j037790r76442r15267q53921p93345p35503o81623o30733n81069
59625A3379803n32908m88443m48619m11794l76409l43262l13885k87944k63880
59616I912659k41437k21998k06453j93952j83039j73317j65512j60110j56290
59607H210551j52691j49132j46761j45882j44663j41087j35558j30009j24914
$$ plain form
59598 6939854 6820877 6709235 6605333 6508989 6420678 6340955 6269094 6203785 6145174 6094981 6054508
59587 6054508 6023453 6000685 5985159 5975936 5972135 5973108 5978277 5987072 5999701 6017594 6042196 6073437
59575 6073437 6110070 6151196 6196666 6246564 6301490 6363104 6433142 6511997 6599488 6697053 6807962
59564 6807962 6935010 7078970 7239483 7416519 7610722 7823221 8055418 8308352 8582169
59555 8582169 8876767 9192672 9530337 9888749 10265852 10660276 11071277 11496649 11931999
59546 11931999 12372820 12816468 13261572 13706115 14146529 14578285 14997247 15401128 15789898
59537 15789898 16164366 16524519 16869784 17200390 17517291 17820814 18110603 18386846 18650150
59528 18650150 18899874 19133759 19349492 19545320 19718706 19865669 19981919 20063378 20105123 20101510
$$ packed form
59598F939854j18977j11642j03902r6344q8311p9723p1861o5309n8611n0193m0473
59587F054508l1055k2768j5526r223l801R73N169Q795J2629J7893K4602L1241
59575F073437L6633M1126M5470M9898N4926O1614P0038P8855Q7491R7565J10909
59564F807962J27048J43960J60513J77036J94203K12499K32197K52934K73817
59555H582169K94598L15905L37665L58412L77103L94424M11001M25372M35350
59546A1931999M40821M43648M45104M44543M40414M31756M18962M03881L88770
59537A5789898L74468L60153L45265L30606L16901L03523K89789K76243K63304
59528A8650150K49724K33885K15733J95828J73386J46963J16250Q1459M1745l613
$$ plain form
59518 20101510 20048526 19944893 19789997 19582156 19320341 19006485 18644573 18238349 17791712
59509 17791712 17310780 16803566 16277411 15738134 15191692 14644973 14104329 13574486 13059397
59500 13059397 12562926 12087792 11634691 11203602 10795677 10413053 10057099 9727785 9424812
59491 9424812 9148547 8899569 8678010 8483848 8317470 8179430 8069991 7989526 7939121 7919997
59481 7919997 7932330 7975432 8049197 8154355 8290852 8456953 8650666 8871140 9117420 9386370
59471 9386370 9672970 9972305 10279899 10590171 10896154 11191293 11470508 11729028 11961213
59462 11961213 12161270 12324426 12446736 12524432 12554495 12535954 12470289 12360645 12210770 12024299
59452 12024299 11804690 11555802 11282390 10989647 10682301 10364613 10041132 9716683 9395328
$$ packed form
59518B0101510n2984j03633j54896k07841k61815l13856l61912m06224m46637
59509A7791712m80932n07214n26155n39277n46442n46719n40644n29843n15089
59500A3059397m96471m75134m53101m31089m07925l82624l55954l29314l02973
59491I424812k76265k48978k21559j94162j66378j38040j09439q0465n0405j9124
59481G919997J2333M3102P3765J05158J36497J66101J93713K20474K46280K68950
59471I386370K86600K99335L07594L10272L05983K95139K79215K58520K32185
59462A1961213K00057J63156J22310P7696L0063j8541o5665j09644j49875j86471
59452A2024299k19609k48888k73412k92743l07346l17688l23481l24449l21355
$$ plain form
59443 9395328 9079821 8772086 8473538 8184763 7905789 7637334 7381407 7140220 6914691
59434 6914691 6704298 6508080 6325726 6158027 6006343 5871252 5751717 5646047 5553572 5474665
59424 5474665 5409181 5355903 5313808 5282897 5263203 5253677 5252632 5258702 5270942 5288719 5312156 5342118
59412 5342118 5379137 5422897 5473387 5531870 5599693 5676444 5760177 5849619 5945728 6051367 6170001
59401 6170001 6304402 6455908 6624875 6812305 7020890 7253978 7513716 7800802 8116136
59392 8116136 8462266 8843171 9263011 9724940 10230424 10779041 11368681 11995811 12655662
59383 12655662 13342699 14051487 14777134 15514749 16258718 17002862 17741031 18466984 19173767
59374 19173767 19853810 20499934 21105975 21666495 22176563 22632385 23031825 23373712 23656731
$$ packed form
59443I395328l15507l07735k98548k88775k78974k68455k55927k41187k25529
59434F914691k10393j96218j82354j67699j51684j35091j19535j05670r2475p8907
59424E474665o5484n3278m2095l0911j9694r526j045O070J2240J7777K3437K9962
59412E342118L7019M3760N0490N8483O7823P6751Q3733Q9442R6109J05639J18634
59401F170001J34401J51506J68967J87430K08585K33088K59738K87086L15334
59392H116136L46130L80905M19840M61929N05484N48617N89640O27130O59851
59383A2655662O87037P08788P25647P37615P43969P44144P38169P25953P06783
59374A9173767O80043O46124O06041N60520N10068M55822L99440L41887K83019
$$ plain form
59365 23656731 23879584 24042249 24146264 24193292 24184102 24119768 24003383 23839465 23631564 23381428
59355 23381428 23090666 22762205 22399772 22007134 21588677 21149734 20695131 20227679 19748733
59346 19748733 19259541 18761169 18253853 17737695 17213714 16683250 16146985 15605893 15062770
59337 15062770 14521361 13984314 13453682 12933238 12428244 11942391 11476627 11031457 10608589
59328 10608589 10209391 9833471 9480191 9150408 8845429 8565220 8308963 8076510 7867837
59319 7867837 7681581 7515642 7369124 7242483 7135811 7047977 6977700 6924682 6889463 6872477
59309 6872477 6873309 6890700 6923470 6971499 7035294 7114447 7207207 7311905 7427945 7554773 7690744
59298 7690744 7833870 7983002 8137214 8294450 8451972 8608219 8763435 8918328 9072621
$$ packed form
59365B3656731K22853J62665J04015M7028r190o4334j16385j63918k07901k50136
59355B3381428k90762l28461l62433l92638m18457m38943m54603m67452m78946
59346A9748733m89192m98372n07316n16158n23981n30464n36265n41092n43123
59337A5062770n41409n37047n30632n20444n04994m85853m65764m45170m22868
59328A0608589l99198l75920l53280l29783l04979k80209k56257k32453k08673
59319G867837j86256j65939j46518j26641j06672q7834p0277n3018l5219j6986
59309F872477Q32J7391L2770M8029O3795P9153R2760J04698J16040J26828J35971
59298G690744J43126J49132J54212J57236J57522J56247J55216J54893J54293
$$ plain form
59289 9072621 9224912 9373642 9518312 9659954 9800074 9939021 10076064 10211336 10346716
59280 10346716 10484012 10622952 10761699 10898451 11031413 11157877 11274790 11380146 11472706
59271 11472706 11550465 11610625 11651261 11672126 11673625 11655793 11618356 11561122 11484381 11389809 11281173
59260 11281173 11163584 11041882 10920098 10801897 10690416 10587695 10495281 10415503 10351141 10303768
59250 10303768 10273503 10260544 10265695 10288912 10328691 10383888 10455245 10544165 10650785 10774457 10915602
59239 10915602 11075775 11255979 11456262 11677285 11921137 12189804 12483227 12799344 13135380
59230 13135380 13488263 13854010 14227692 14604189 14978183 15342716 15688201 16003804 16280077
59221 16280077 16510093 16688314 16809246 16867680 16859834 16783925 16640042 16430064 16157671 15828070
$$ packed form
59289I072621J52291J48730J44670J41642J40120J38947J37043J35272J35380
59280A0346716J37296J38940J38747J36752J32962J26464J16913J05356R2560
59271A1472706P7759O0160M0636K0865J499j7832l7437n7234p6741r4572j08636
59260A1281173j17589j21702j21784j18201j11481j02721r2414p9778o4362m7373
59250A0303768l0265j2959N151K3217L9779N5197P1357Q8920J06620J23672J41145
59239A0915602J60173J80204K00283K21023K43852K68667K93423L16117L36036
59230A3135380L52883L65747L73682L76497L73994L64533L45485L15603K76273
59221A6280077K30016J78221J20932N8434p846p5909j43883k09978k72393l29601
$$ plain form
59211 15828070 15447628 15023728 14564533 14078410 13573514 13057901 12539418 12024783 11518611
59202 11518611 11023505 10540970 10072258 9618903 9183029 8766960 8372055 7998084 7644170
59193 7644170 7309952 6995201 6698630 6418279 6153440 5905354 5675495 5463737 5268652
59184 5268652 5088947 4923875 4772693 4634699 4509851 4398500 4300228 4213555 4137172 4070839
59174 4070839 4014504 3966926 3926125 3891281 3863345 3843435 3831257 3825815 3827277 3837134 3856284 3883624
59162 3883624 3917078 3955669 4000102 4051454 4109896 4174905 4246240 4324265 4409410 4501776 4601400
59151 4601400 4708492 4823185 4945323 5074822 5211915 5356621 5508254 5666039 5829849
59142 5829849 5999376 6172526 6345730 6516345 6683959 6848904 7010381 7166759 7316872
$$ packed form
59211A5828070l80442m23900m59195m86123n04896n15613n18483n14635n06172
59202A1518611m95106m82535m68712m53355m35874m16069l94905l73971l53914
59193G644170l34218l14751k96571k80351k64839k48086k29859k11758j95085
59184E268652j79705j65072j51182j37994j24848j11351r8272q6673p6383o6333
59174D070839n6335m7578m0801l4844k7936j9910j2178n442J462R857J9150K7340
59162C883624L3454L8591M4433N1352N8442O5009P1335P8025Q5145R2366R9624
59151D601400J07092J14693J22138J29499J37093J44706J51633J57785J63810
59142E829849J69527J73150J73204J70615J67614J64945J61477J56378J50113
$$ plain form
59133 7316872 7460118 7596036 7724946 7848568 7968696 8085368 8197530 8305755 8413519
59124 8413519 8525600 8645676 8775207 8913957 9061787 9220556 9393777 9583401 9787328
59115 9787328 10001290 10222698 10450954 10683952 10916038 11140075 11350286 11542635 11714017
59106 11714017 11862113 11985119 12080685 12145806 12178461 12178661 12147445 12085911 11996135 11882255 11749513
59095 11749513 11602462 11444673 11279632 11110878 10941095 10771400 10601616 10431354 10261083
59086 10261083 10091881 9923575 9753596 9578774 9398122 9212701 9022941 8827790 8626693
59077 8626693 8420511 8209691 7993271 7771011 7545176 7318879 7093544 6869236 6646568
59068 6646568 6426970 6211741 6001938 5798653 5602434 5413133 5231291 5058869 4897496
$$ packed form
59133G316872J43246J35918J28910J23622J20128J16672J12162J08225J07764
59124H413519J12081J20076J29531J38750J47830J58769J73221J89624K03927
59115I787328K13962K21408K28256K32998K32086K24037K10211J92349J71382
59106A1714017J48096J23006R5566O5121L2655K00l1216o1534q9776j13880j32742
59095A1749513j47051j57789j65041j68754j69783j69695j69784j70262j70271
59086A0261083j69202j68306j69979j74822j80652j85421j89760j95151k01097
59077H626693k06182k10820k16420k22260k25835k26297k25335k24308k22668
59068F646568k19598k15229k09803k03285j96219j89301j81842j72422j61373
$$ plain form
59059 4897496 4746604 4604239 4468993 4340185 4217125 4099591 3988402 3884313 3786982 3696209
59049 3696209 3613312 3539687 3474571 3415797 3362337 3314534 3272283 3234755 3201842 3174155 3151564
59038 3151564 3133363 3119941 3112471 3110461 3111249 3112731 3115280 3120135 3127045 3134488 3141466 3148113 3154932 3162219
59024 3162219 3170006 3177896 3184938 3190129 3193170 3194704 3195718 3196644 3197078 3196553 3195506 3195038 3195692 3197177 3199425
59009 3199425 3203070 3208291 3213942 3218640 3222255 3225692 3229597 3233871 3237946 3240948 3242121 3241689 3240722 3239637
58995 3239637 3237667 3234618 3232228 3232775 3236945 3243962 3252974 3263286 3274067 3285151 3297543 3312010 3327924
58982 3327924 3344779 3363928 3387170 3414199 3443208 3473557 3506085 3541216 3578689 3619151 3664007
58971 3664007 3713451 3766191 3821270 3878657 3938091 3999235 4063180 4131769 4204652 4278766 4351639
$$ packed form
59059D897496j50892j42365j35246j28808j23060j17534j11189j04089r7331r0773
59049C696209q2897p3625o5116n8774n3460m7803m2251l7528l2913k7687k2591
59038C151564j8201j3422p470k010P88J482K549M855O910P443O978O647O819P287
59024C162219P787P890P042N191L041J534J014R26M34n25j047m68O54J485K248
59009C199425L645N221N651M698L615L437L905M274M075L002J173m32r67j085
58995C239637j970l049k390N47M170P017R012J0312J0781J1084J2392J4467J5914
58982C327924J6855J9149K3242K7029K9009L0349L2528L5131L7473M0462M4856
58971C664007M9444N2740N5079N7387N9434O1144O3945O8589P2883P4114P2873
$$ plain form
58960 4351639 4423908 4497795 4574506 4654162 4737136 4824124 4915298 5010232 5108569 5210669 5318056
58949 5318056 5433096 5557433 5690838 5832679 5984372 6149030 6328421 6521724 6727822
58940 6727822 6947683 7183926 7439228 7715954 8016562 8343565 8699428 9086611 9507085
58931 9507085 9962015 10453060 10984077 11560224 12185008 12859347 13583752 14359757 15188187
58922 15188187 16066974 16991325 17954817 18949151 19963353 20984057 21996331 22984144 23931127
58913 23931127 24821893 25642490 26379733 27021171 27556155 27976080 28273335 28441387 28477003
58904 28477003 28381903 28161808 27824620 27380039 26839931 26217950 25528776 24787597 24009013
58895 24009013 23205350 22386183 21559644 20733379 19913781 19105387 18311985 17537847 16787059
$$ packed form
58960D351639P2269P3887P6711P9656Q2974Q6988R1174R4934R8337J02100J07387
58949E318056J15040J24337J33405J41841J51693J64658J79391J93303K06098
58940F727822K19861K36243K55302K76726L00608L27003L55863L87183M20474
58931I507085M54930M91045N31017N76147O24784O74339P24405P76005Q28430
58922A5188187Q78787R24351R63492R94334J014202J020704J012274R87813R46983
58913B3931127Q90766Q20597P37243O41438N34984M19925K97255J68052L5616
58904B8477003r5100k20095l37188m44581n40108o21981o89174p41179p78584
58895B4009013q03663q19167q26539q26265q19598q08394p93402p74138p50788
$$ plain form
58886 16787059 16061968 15363062 14690368 14044681 13427608 12840691 12284404 11758057 11260921
58877 11260921 10793080 10354566 9943968 9558880 9197767 8860627 8547889 8259596 7995497
58868 7995497 7754756 7535434 7335322 7153376 6989204 6841173 6706573 6584006 6474118
58859 6474118 6377490 6293287 6220742 6160386 6112604 6076195 6049766 6033837 6030277 6039974 6062055 6095157
58847 6095157 6138665 6192786 6257955 6334312 6421885 6521566 6635499 6765627 6912068 7074103
58837 7074103 7252615 7450004 7667509 7904456 8161070 8440506 8746929 9082767 9449095
58828 9449095 9847793 10281929 10754516 11268010 11824779 12427200 13077318 13776702 14526007
58819 14526007 15324145 16168170 17053732 17974340 18919760 19876574 20831268 21771688 22684627
$$ packed form
58886A6787059p25091o98906o72694o45687o17073n86917n56287n26347m97136
58877A1260921m67841m38514m10598l85088l61113l37140l12738k88293k64099
58868G995497k40741k19322k00112j81946j64172j48031j34600j22567j09888
58859F474118r6628q4203p2545o0356m7782l6409k6429j5929l560R697K2081L3102
58847F095157M3508N4121O5169P6357Q7573R9681J13933J30128J46441J62035
58837G074103J78512J97389K17505K36947K56614K79436L06423L35838L66328
58828I449095L98698M34136M72587N13494N56769O02421O50118O99384P49305
58819A4526007P98138Q44025Q85562R20608R45420R56814R54694R40420R12939
$$ plain form
58810 22684627 23553483 24360272 25089770 25730680 26273417 26708451 27027046 27222705 27291767
58801 27291767 27233687 27051340 26750820 26340561 25830544 25232219 24559069 23826674 23051016
58792 23051016 22245563 21420095 20582747 19742406 18907757 18084533 17275458 16483038 15710823
58783 15710823 14961745 14237037 13537501 12864472 12218951 11601341 11012762 10455163 9929185
58774 9929185 9433155 8964987 8523806 8108930 7718872 7352634 7010743 6693726 6400478
58765 6400478 6129147 5878598 5648017 5436227 5242582 5067372 4910123 4768483 4640097
58756 4640097 4524639 4422716 4333753 4256355 4189800 4133601 4086089 4044897 4008433 3975778 3945720
58745 3945720 3917101 3889556 3862737 3835302 3805904 3774666 3742500 3709359 3674160 3635899 3593861
$$ packed form
58810B2684627Q68856Q06789P29498O40910N42737M35034L18595J95659O9062
58801B7291767n8080j82347l00520m10259n10017n98325o73150p32395p75658
58792B3051016q05453q25468q37348q40341q34649q23224q09075p92420p72215
58783A5710823p49078p24708o99536o73029o45521o17610n88579n57599n25978
58774I929185m96030m68168m41181m14876l90058l66238l41891l17017k93248
58765F400478k71331k50549k30581k11790j93645j75210j57249j41640j28386
58756D640097j15458j01923q8963p7398o6555n6199m7512m1192l6464l2655l0058
58745C945720k8619k7545k6819k7435k9398l1238l2166l3141l5199l8261m2038
$$ plain form
58734 3593861 3547446 3497075 3444693 3392006 3338575 3282863 3224884 3166534 3109543 3054308 3000700
58723 3000700 2948811 2898553 2849287 2800212 2751031 2702381 2655578 2611349 2568756 2526287 2484142
58712 2484142 2444288 2407819 2373646 2340490 2308633 2278668 2250038 2222269 2196391 2173390 2152119
58701 2152119 2130500 2108271 2086924 2067400 2049320 2032185 2015859 1999972 1984146 1968796 1954694
58690 1954694 1941755 1929079 1916119 1903232 1891314 1881208 1872883 1864922 1855804 1846178 1838629 1834480
58678 1834480 1832154 1829681 1827354 1826636 1827811 1830292 1834118 1839443 1845479 1851472 1857794 1864580 1870421 1874175
58664 1874175 1876991 1880491 1883898 1885322 1885258 1886205 1888860 1891187 1891761 1892003 1894273 1899158 1905416 1911743 1918055
58649 1918055 1925606 1935914 1949264 1964606 1981457 2001116 2025213 2053928 2086717 2123939 2166439
$$ packed form
58734C593861m6415n0371n2382n2687n3431n5712n7979n8350n6991n5235n3608
58723C000700n1889n0258m9266m9075m9181m8650m6803m4229m2593m2469m2145
58712B484142l9854l6469l4173l3156l1857k9965k8630k7769k5878k3001k1271
58701B152119k1619k2229k1347j9524j8080j7135j6326j5887j5826j5350j4102
58690A954694j2939j2676j2960j2887j1918j0106q325p961r118r626p549m149
58678A834480k326k473k327p18J175K481L826N325O036N993O322O786N841L754
58664A874175K816L500L407J424o4R47K655K327N74K42K270M885O258O327O312
58649A918055P551J0308J3350J5342J6851J9659K4097K8715L2789L7222M2500
$$ plain form
58638 2166439 2214182 2266693 2324418 2388535 2459959 2539602 2628845 2728705 2839394 2961814 3098395
58627 3098395 3251136 3420024 3604934 3807716 4030361 4271951 4529343 4799801 5080769
58618 5080769 5368012 5656504 5942696 6223426 6493030 6744078 6971114 7171490 7342638
58609 7342638 7481027 7584186 7651564 7682734 7676565 7632860 7553603 7442429 7304208 7145086
58599 7145086 6971260 6787237 6596152 6401326 6205981 6011772 5819212 5629462 5444196
58590 5444196 5263977 5088316 4917200 4751206 4590597 4435937 4289216 4152605 4026331
58581 4026331 3909199 3800621 3700625 3608792 3525202 3451509 3388758 3334808 3286408 3243239 3207151
58570 3207151 3177800 3152061 3127829 3105353 3084272 3062253 3037597 3010944 2983377 2954742 2924538
$$ packed form
58638B166439M7743N2511N7725O4117P1424P9643Q9243R9860J10689J22420J36581
58627C098395J52741J68888J84910K02782K22645K41590K57392K70458K80968
58618E080769K87243K88492K86192K80730K69604K51048K27036K00376J71148
58609G342638J38389J03159O7378L1170o169m3705p9257j11174j38221j59122
58599G145086j73826j84023j91085j94826j95345j94209j92560j89750j85266
58590E444196j80219j75661j71116j65994j60609j54660j46721j36611j26274
58581D026331j17132j08578r9996r1833q3590p3693o2751n3950m8400m3169l6088
58570C207151k9351k5739k4232k2476k1081k2019k4656k6653k7567k8635l0204
$$ plain form
58559 2924538 2892633 2858327 2820347 2778466 2733873 2687796 2641161 2595400 2551806 2510206 2470102
58548 2470102 2432783 2400115 2371424 2343972 2316573 2290391 2266155 2243141 2221072 2200454 2180575
58537 2180575 2159712 2137842 2116818 2097405 2078502 2059635 2041607 2024139 2005500 1985247 1964808
58526 1964808 1944673 1923536 1901114 1879318 1859678 1841881 1825593 1811229 1798107 1784479 1770488
58515 1770488 1758518 1749496 1741427 1732850 1725143 1719813 1715931 1712049 1708692 1707274 1708202 1711432 1717198 1725067
58501 1725067 1733996 1744346 1757812 1774386 1791648 1808297 1825992 1846159 1867232 1886994 1905750
58490 1905750 1925098 1944985 1963785 1980311 1994360 2006294 2017086 2027705 2037708 2045684 2051445 2056100
58478 2056100 2059632 2060621 2058963 2056445 2053669 2048858 2041022 2032035 2024183 2017642 2011542 2005404 1998302 1988844
$$ packed form
58559B924538l1905l4306l7980m1881m4593m6077m6635m5761m3594m1600m0104
58548B470102l7319l2668k8691k7452k7399k6182k4236k3014k2069k0618j9879
58537B180575k0863k1870k1024j9413j8903j8867j8028j7468j8639k0253k0439
58526A964808k0135k1137k2422k1796j9640j7797j6288j4364j3122j3628j3991
58515A770488j1970r022q069q577p707n330l882l882l357j418R28L230N766P869
58501A725067Q929J0350J3466J6574J7262J6649J7695K0167K1073J9762J8756
58490A905750J9348J9887J8800J6526J4049J1934J0792J0619J0003P976N761M655
58478B056100L532R89j658k518k776m811p836q987p852o541o100o138p102r458
$$ plain form
58464 1988844 1977385 1966165 1955957 1944833 1931536 1917628 1904735 1892135 1878978 1866543 1856173
58453 1856173 1846969 1837677 1829141 1822894 1818836 1816038 1814256 1813116 1811679 1810418 1811656 1816251 1821824 1826159
58439 1826159 1830302 1836183 1843180 1849541 1855608 1862910 1871159 1878578 1884558 1889983 1895441 1900847 1906385 1912554
58425 1912554 1919746 1928509 1939339 1951665 1964360 1977789 1993753 2012727 2032945 2052852 2072500 2091865
58413 2091865 2110115 2127486 2145534 2164452 2182511 2199114 2215748 2232724 2247845 2259881 2270535
58402 2270535 2281280 2290962 2298443 2304804 2310942 2315765 2318988 2323049 2329815 2337818 2345111 2352436 2361066 2369906
58388 2369906 2377413 2384357 2392166 2400424 2408302 2416454 2425240 2433193 2439568 2446366 2455596 2466593 2478084
58375 2478084 2490557 2504350 2517914 2530488 2544138 2560696 2579033 2597776 2618142 2641370 2665775
$$ packed form
58464A988844j1459j1220j0208j1124j3297j3908j2893j2600j3157j2435j0370
58453A856173r204r292q536o247m058k798j782j140j437j261J238M595N573M335
58439A826159M143N881O997O361O067P302Q249P419N980N425N458N406N538O169
58425A912554P192Q763J0830J2326J2695J3429J5964J8974K0218J9907J9648J9365
58413B091865J8250J7371J8048J8918J8059J6603J6634J6976J5121J2036J0654
58402B270535J0745R682P481O361O138M823L223M061O766Q003P293P325Q630Q840
58388B369906P507O944P809Q258P878Q152Q786P953O375O798R230J0997J1491
58375B478084J2473J3793J3564J2574J3650J6558J8337J8743K0366K3228K4405
$$ plain form
58364 2665775 2689245 2712471 2737047 2762530 2787905 2813619 2839761 2864771 2888370 2912902 2939190
58353 2939190 2964184 2985734 3006526 3030060 3055721 3081106 3105967 3130309 3152076 3170899 3190988
58342 3190988 3215788 3242614 3267198 3290817 3317809 3348367 3379032 3408673 3438912 3469924 3500645
58331 3500645 3532185 3566615 3603225 3639879 3676979 3716308 3757330 3798347 3839811 3882778 3925946
58320 3925946 3968172 4011988 4060295 4111267 4160777 4208218 4255801 4304049 4352460 4402749 4456605
58309 4456605 4511728 4564747 4616685 4670992 4727576 4783429 4837899 4892837 4948781 5005504 5065021
58298 5065021 5129666 5198232 5267982 5338930 5412339 5487034 5561429 5637137 5716334 5797948 5880862
58287 5880862 5968064 6062720 6162810 6264820 6369886 6480855 6596239 6712961 6832351 6957214
$$ packed form
58364B665775K3470K3226K4576K5483K5375K5714K6142K5010K3599K4532K6288
58353B939190K4994K1550K0792K3534K5661K5385K4861K4342K1767J8823K0089
58342C190988K4800K6826K4584K3619K6992L0558L0665K9641L0239L1012L0721
58331C500645L1540L4430L6610L6654L7100L9329M1022M1017M1464M2967M3168
58320C925946M2226M3816M8307N0972M9510M7441M7583M8248M8411N0289N3856
58309D456605N5123N3019N1938N4307N6584N5853N4470N4938N5944N6723N9517
58298E065021O4645O8566O9750P0948P3409P4695P4395P5708P9197Q1614Q2914
58287E880862Q7202R4656J00090J02010J05066J10969J15384J16722J19390J24863
$$ plain form
58277 6957214 7085679 7214265 7344357 7478945 7615498 7749107 7880372 8013071 8146339
58268 8146339 8276589 8405095 8536057 8668957 8800483 8932203 9068500 9208528 9348201
58259 9348201 9488732 9635245 9788349 9945249 10107785 10281051 10465013 10655517 10852216
58250 10852216 11057473 11269280 11483983 11704415 11936418 12178981 12427015 12682080 12950561
58241 12950561 13232752 13523792 13824103 14138898 14468735 14810929 15168831 15549172 15951919
58232 15951919 16373473 16817699 17292202 17796282 18325253 18884252 19484240 20126665 20806637
58223 20806637 21529309 22307716 23146241 24042881 25006936 26057424 27205104 28454406 29823031
58214 29823031 31341230 33033186 34920705 37046457 39473138 42261401 45473664 49198762
$$ packed form
58277F957214J28465J28586J30092J34588J36553J33609J31265J32699J33268
58268H146339J30250J28506J30962J32900J31526J31720J36297J40028J39673
58259I348201J40531J46513J53104J56900J62536J73266J83962J90504J96699
58250A0852216K05257K11807K14703K20432K32003K42563K48034K55065K68481
58241A2950561K82191K91040L00311L14795L29837L42194L57902L80341M02747
58232A5951919M21554M44226M74503N04080N28971N58999N99988O42425O79972
58223B0806637P22672P78407Q38525Q96640R64055J050488J147680J249302J368625
58214B9823031J518199J691956J887519K125752K426681K788263L212263L725098
$$ plain form
58206 49198762 53542415 58589199 64406230 71095783 78822839 87798208 98282597 110618112
58198 110618112 125203219 142408685 162553120 185940100 212737797 242585420 274235144
58191 274235144 305713213 335063215 361140654 383840685 403662873 421088389 436285072
58184 436285072 449166286 459400781 466155662 467951015 463168194 451086348 432580269
58177 432580269 409812837 385230439 360727576 337413571 315738154 295657970 276841111
58170 276841111 258951121 241844696 225544301 210112023 195613184 182148196 169830688
58163 169830688 158724781 148830774 140099475 132401186 125490136 119066093 112911483 106972200
58155 106972200 101320680 96064443 91277881 86978465 83133651 79667182 76435119 73202940
$$ packed form
58206D9198762M343653N046784N817031O689553P727056Q975369J0484389J2335515
58198A10618112J4585107J7205466K0144435K3386980K6797697K9847623L1649724
58191B74235144L1478069K9350002K6077439K2700031J9822188J7425516J5196683
58184D36285072J2881214J0234495O754881J795353m782821j2081846j8506079
58177D32580269k2767432k4582398k4502863k3314005k1675417k0080184j8816859
58170B76841111j7889990j7106425j6300395j5432278j4498839j3464988j2317508
58163A69830688j1105907r894007q731299p698289o911050o424043o154610n939283
58155A06972200n651520n256237m786562m299416l844814l466469l232063l232179
$$ plain form
58147 73202940 69707348 65805807 61576857 57256394 53080492 49193385 45657587 42480603
58139 42480603 39617031 36988879 34534203 32229095 30063995 28024033 26100627 24300128
58131 24300128 22627942 21076750 19636454 18301147 17059573 15892584 14788031 13748209
58123 13748209 12777821 11875306 11040275 10278062 9590845 8972766 8417775 7923689 7485290
58114 7485290 7092356 6738088 6421631 6139772 5884523 5651242 5440744 5250849 5074182
58105 5074182 4906975 4752087 4610740 4478979 4354560 4239556 4133603 4032101 3933691 3842313
58095 3842313 3759385 3680917 3604618 3532803 3465947 3400195 3333682 3268668 3205346 3140358 3073703
58084 3073703 3010232 2951715 2894146 2835491 2779442 2728482 2679683 2630722 2584104 2541951 2502001
$$ packed form
58147G3202940l495592l901541m228950m320463m175902l887107l535798l176984
58139D2480603k863572k628152k454676k305108k165100k039962j923406j800499
58131B4300128j672186j551192j440296j335307j241574j166989j104553j039822
58123A3748209r70388r02515q35031p62213o87217o18079n54991m94086m38399
58114G485290l92934l54268l16457k81859k55249k33281k10498j89895j76667
58105E074182j67207j54888j41347j31761j24419j15004j05953j01502r8410r1378
58095C842313q2928p8468p6299p1815o6856o5752o6513o5014o3322o4988o6655
58084C073703o3471n8517n7569n8655n6049n0960m8799m8961m6618m2153l9950
$$ plain form
58073 2502001 2462168 2424142 2389365 2356046 2322958 2291760 2263116 2234972 2206896 2181512 2159384
58062 2159384 2137163 2113197 2090355 2070962 2053371 2035887 2019656 2005246 1990668 1975244 1961408
58051 1961408 1950264 1939257 1926481 1913522 1901964 1890934 1880072 1871129 1864579 1858397 1852125 1848341
58039 1848341 1848224 1849357 1849783 1850622 1852947 1855784 1858777 1863065 1868106 1871653 1874313 1879728 1888596 1896999 1902612
58024 1902612 1907912 1915007 1921967 1927041 1931986 1938084 1942914 1944479 1945008 1947398 1951037 1954139 1957139 1960934
58010 1960934 1964773 1968671 1974901 1984322 1994120 2001826 2008523 2015510 2021118 2023928 2026064 2029888 2034032 2035871
57996 2035871 2035453 2033787 2029621 2021384 2010478 1999566 1989229 1979065 1970197 1963678 1958020 1951214 1944070
57983 1944070 1939051 1936961 1936914 1938258 1940326 1941632 1941387 1940722 1940794 1941140 1941443 1943148 1947480 1953416 1959269 1964746
$$ packed form
58073B502001l9833l8026l4777l3319l3088l1198k8644k8144k8076k5384k2128
58062B159384k2221k3966k2842j9393j7591j7484j6231j4410j4578j5424j3836
58051A961408j1144j1007j2776j2959j1558j1030j0862q943o550o182o272l784
58039A848341j17J133M26Q39K325K837K993M288N041L547K660N415Q868Q403N613
58024A902612N300P095O960N074M945O098M830J565N29K390L639L102L000L795
58010A960934L839L898O230R421R798P706O697O987N608K810K136L824M144J839
57996B035871m18j666m166q237j0906j0912j0337j0164q868o519n658o806p144
57983A944070n019k090m7J344K068J306k45o65P2L46L03J705M332N936N853N477
$$ plain form
57967 1964746 1970025 1974694 1979141 1985030 1992881 2001232 2009595 2019677 2031833 2043033 2050821 2057062 2065191
57954 2065191 2075749 2087192 2099181 2112199 2125279 2136839 2146867 2156066 2163902 2169469 2173208 2175873
57942 2175873 2176856 2175200 2171134 2165207 2157313 2147914 2138382 2128604 2116189 2099858 2081694 2064174 2047000
57929 2047000 2028965 2010851 1994078 1978256 1962485 1947416 1933615 1919716 1904950 1891903 1883773
57918 1883773 1879994 1877441 1875108 1874770 1877614 1882895 1889746 1898126 1908092 1919821 1933885 1950042 1966451
57905 1966451 1981534 1995582 2009185 2021543 2032041 2041924 2052240 2061564 2068184 2073237 2079042 2085268
57893 2085268 2089522 2091155 2091795 2092334 2091910 2089938 2087059 2083858 2080378 2077070 2074827 2074107 2074963 2077484 2081230
57878 2081230 2085141 2089165 2094899 2103292 2112925 2122105 2131291 2141681 2152727 2163234 2173808 2185847 2198863
$$ packed form
57967A964746N279M669M447N889P851Q351Q363J0082J2156J1200P788O241Q129
57954B065191J0558J1443J1989J3018J3080J1560J0028R199P836N567L739K665
57942B175873R83j656m066n927p894r399r532r778j2415j6331j8164j7520j7174
57929B047000j8035j8114j6773j5822j5771j5069j3801j3899j4766j3047q130
57918A883773l779k553k333l38K844N281O851Q380R966J1729J4064J6157J6409
57905A966451J5083J4048J3603J2358J0498R883J0316R324O620N053N805O226
57893B085268M254J633O40N39m24j972k879l201l480l308k243p20Q56K521L746
57878B081230L911M024N734Q393R633R180R186J0390J1046J0507J0574J2039J3016
$$ plain form
57865 2198863 2211067 2222075 2232897 2243728 2253786 2262954 2271675 2279638 2286298 2292138 2297711 2302240 2305112
57852 2305112 2307840 2312283 2317575 2321264 2323094 2325129 2328245 2331024 2332490 2333700 2336005 2339412 2343205 2346865
57838 2346865 2350010 2352493 2354578 2356126 2356054 2353695 2350188 2347179 2344769 2342042 2338852 2335505 2331427 2325984
57824 2325984 2320081 2315183 2311231 2307247 2303425 2300828 2299570 2299152 2300018 2302736 2306167 2308518 2309879 2311739
57810 2311739 2314569 2318035 2323061 2331098 2341583 2352658 2364386 2378677 2395912 2414331 2433233 2454155
57798 2454155 2478007 2503328 2528354 2552856 2577064 2600688 2623961 2647922 2672667 2696744 2719169
57787 2719169 2740596 2761700 2781790 2799858 2815815 2829997 2842550 2853807 2864156 2873103 2879733 2884375
57775 2884375 2888511 2892707 2896099 2898303 2900233 2902495 2904528 2906005 2907636 2909887 2912384 2915362 2920267 2927885
$$ packed form
57865B198863J2204J1008J0822J0831J0058R168Q721P963O660N840N573M529K872
57852B305112K728M443N292L689J830K035L116K779J466J210K305L407L793L660
57838B346865L145K483K085J548p2k359l507l009k410k727l190l347m078n443
57824B325984n903m898l952l984l822k597j258m18Q66K718L431K351J361J860
57810B311739K830L466N026Q037J0485J1075J1728J4291J7235J8419J8902K0922
57798B454155K3852K5321K5026K4502K4208K3624K3273K3961K4745K4077K2425
57787B719169K1427K1104K0090J8068J5957J4182J2553J1257J0349Q947O630M642
57775B884375M136M196L392K204J930K262K033J477J631K251K497K978M905P618
$$ plain form
57761 2927885 2937193 2947075 2958087 2971441 2987204 3004593 3023306 3043535 3065123 3087480 3109978 3132065
57749 3132065 3153645 3175629 3199255 3224306 3248772 3271000 3291613 3312821 3336332 3362280 3389543
57738 3389543 3416582 3442410 3467247 3492154 3518042 3545277 3573894 3603563 3633634 3663974 3695538
57727 3695538 3729274 3764774 3800927 3837514 3874994 3913100 3951169 3989775 4030432 4073431 4117506
57716 4117506 4162068 4208380 4258011 4311287 4367777 4427168 4489258 4554262 4623621 4699287 4781603
57705 4781603 4868876 4959689 5054821 5156590 5267339 5389031 5523138 5670093 5829480 6001370
57695 6001370 6187043 6388206 6606157 6841650 7094595 7363689 7647072 7943137 8249476
57686 8249476 8561137 8871563 9175722 9471271 9756661 10029891 10289706 10536318 10769903
$$ packed form
57761B927885R308R882J1012J3354J5763J7389J8713K0229K1588K2357K2498K2087
57749C132065K1580K1984K3626K5051K4466K2228K0613K1208K3511K5948K7263
57738C389543K7039K5828K4837K4907K5888K7235K8617K9669L0071L0340L1564
57727C695538L3736L5500L6153L6587L7480L8106L8069L8606M0657M2999M4075
57716D117506M4562M6312M9631N3276N6490N9391O2090O5004O9359P5666Q2316
57705D781603Q7273R0813R5132J01769J10749J21692J34107J46955J59387J71890
57695F001370J85673K01163K17951K35493K52945K69094K83383K96065L06339
57686H249476L11661L10426L04159K95549K85390K73230K59815K46612K33585
$$ plain form
57677 10769903 10989217 11191922 11374576 11531403 11654707 11738310 11780658 11784734 11756259 11702340
57667 11702340 11629879 11543303 11443522 11328770 11195161 11036838 10848836 10632356 10396638 10154347
57657 10154347 9915635 9686837 9472371 9275096 9095271 8931274 8781736 8646174 8524177
57648 8524177 8415476 8320807 8241636 8178929 8132747 8102719 8088296 8089029 8105379 8138908 8191097
57637 8191097 8262345 8352524 8461804 8590431 8738562 8906831 9095853 9304099 9527116 9759832
57627 9759832 9998703 10240655 10481287 10715802 10940850 11153645 11349818 11524104 11673062
57618 11673062 11795524 11890400 11955634 11989400 11990937 11960173 11898149 11808293 11696086 11566991 11425470
57607 11425470 11275764 11121980 10966876 10811742 10658046 10508077 10363539 10224637 10091296
$$ packed form
57677A0769903K19314K02705J82654J56827J23304Q3603M2348M076k8475n3919
57667A1702340p2461q6576r9781j14752j33609j58323j88002k16480k35718k42291
57657A0154347k38712k28798k14466j97275j79825j63997j49538j35562j21997
57648H524177j08701r4669p9171o2707m6182l0028j4423P33J6350L3529N2189
57637H191097P1248R0179J09280J28627J48131J68269J89022K08246K23017K32716
57627I759832K38871K41952K40632K34515K25048K12795J96173J74286J48958
57618A1673062J22462R4876O5234L3766J537l0764o2024q9856j12207j29095j41521
57607A1425470j49706j53784j55104j55134j53696j49969j44538j38902j33341
$$ plain form
57598 10091296 9964206 9843942 9730126 9622559 9522485 9431455 9349248 9274019 9204627 9141991
57588 9141991 9087997 9043648 9008568 8981776 8962422 8949723 8942621 8940029 8941706 8948695 8962485 8983652
57576 8983652 9011375 9044100 9080354 9119181 9160512 9205207 9254153 9306993 9362129 9418304 9475815
57565 9475815 9535836 9598977 9664936 9733250 9803680 9875782 9948841 10022693 10098431 10177818 10261963
57554 10261963 10350765 10443690 10540800 10642698 10749614 10861003 10976374 11096352 11222666 11357044
57544 11357044 11500246 11652166 11812743 11982682 12163337 12355844 12560222 12775338 12999847
57535 12999847 13233090 13474805 13723893 13977778 14233124 14486849 14735977 14976841 15205341
57526 15205341 15418363 15614385 15792166 15949379 16083343 16192859 16278400 16340484 16378962 16394509
$$ packed form
57598A0091296j27090j20264j13816j07567j00074r1030q2207p5229o9392o2636
57588I141991n3994m4349l5080k6792j9354j2699p102k592J677O989J3790K1167
57576H983652K7723L2725L6254L8827M1331M4695M8946N2840N5136N6175N7511
57565I475815O0021O3141O5959O8314P0430P2102P3059P3852P5738P9387Q4145
57554A0261963Q8802R2925R7110J01898J06916J11389J15371J19978J26314J34378
57544A1357044J43202J51920J60577J69939J80655J92507K04378K15116K24509
57535A2999847K33243K41715K49088K53885K55346K53725K49128K40864K28500
57526A5205341K13022J96022J77781J57213J33964J09516Q5541O2084L8478J5547
$$ plain form
57516 16394509 16390130 16370522 16340313 16303239 16262256 16219465 16176067 16133101 16092057 16054253 16019965
57505 16019965 15989077 15962500 15942010 15928496 15921173 15918859 15921418 15929614 15944100 15965135 15993042 16028419
57493 16028419 16071778 16123073 16181609 16246594 16317976 16396712 16483975 16580223 16685282 16799254 16922980
57482 16922980 17057658 17204224 17363054 17534085 17717485 17914382 18126408 18354017 18595492
57473 18595492 18848051 19109348 19377092 19647790 19917176 20181939 20439862 20688119 20922610
57464 20922610 21139532 21336761 21513203 21667631 21798806 21906147 21989660 22049796 22088165 22108223
57454 22108223 22114749 22112609 22105996 22098220 22091656 22087942 22088287 22093215 22102194 22114429 22130396 22151851 22179767
57441 22179767 22212999 22249737 22289820 22334788 22385966 22443434 22506869 22576591 22653408 22737676 22828676
$$ packed form
57516A6394509m379j9608l0209l7074m0983m2791m3398m2966m1044l7804l4288
57505A6019965l0888k6577k0490j3514p323k314K559Q196J4486K1035K7907L5377
57493A6028419M3359N1295N8536O4985P1382P8736Q7263R6248J05059J13972J23726
57482A6922980J34678J46566J58830J71031J83400J96897K12026K27609K41475
57473A8595492K52559K61297K67744K70698K69386K64763K57923K48257K34491
57464B0922610K16922J97229J76442J54428J31175J07341Q3513O0136L8369K0058
57454B2108223O526k140o613p776o564l714L45M928Q979J2235J5967K1455K7916
57441B2179767L3232L6738M0083M4968N1178N7468O3435O9722P6817Q4268R1000
$$ plain form
57430 22828676 22924733 23024030 23125672 23230150 23338752 23452440 23571049 23693285 23817489 23942770
57420 23942770 24069423 24198093 24328681 24460624 24594135 24730341 24869910 25012275 25156688
57411 25156688 25303372 25453042 25605836 25761531 25920450 26083326 26250311 26420787 26594137
57402 26594137 26770124 26948554 27129109 27311675 27496325 27682782 27870101 28056882 28241652
57393 28241652 28423427 28602495 28780541 28959213 29138497 29317262 29495573 29675402 29858327
57384 29858327 30043278 30227564 30409653 30589771 30768094 30943972 31117391 31289811 31462469
57375 31462469 31634730 31805217 31973957 32142311 32311325 32481412 32653255 32827410 33002962
57366 33002962 33178128 33352567 33527668 33704068 33880463 34055743 34230765 34406689 34582774
$$ packed form
57430B2828676R6057R9297J01642J04478J08602J13688J18609J22236J24204J25281
57420B3942770J26653J28670J30588J31943J33511J36206J39569J42365J44413
57411B5156688J46684J49670J52794J55695J58919J62876J66985J70476J73350
57402B6594137J75987J78430J80555J82566J84650J86457J87319J86781J84770
57393B8241652J81775J79068J78046J78672J79284J78765J78311J79829J82925
57384B9858327J84951J84286J82089J80118J78323J75878J73419J72420J72658
57375C1462469J72261J70487J68740J68354J69014J70087J71843J74155J75552
57366C3002962J75166J74439J75101J76400J76395J75280J75022J75924J76085
$$ plain form
57357 34582774 34757448 34930913 35105129 35281580 35460387 35641360 35824588 36010089 36197965
57348 36197965 36388666 36581846 36775164 36965453 37151151 37332551 37509974 37683203 37852822
57339 37852822 38020676 38188551 38357385 38527847 38700323 38874065 39047724 39221307 39396475
57330 39396475 39574440 39754733 39936507 40119725 40304310 40489385 40674427 40860068 41046552
57321 41046552 41232087 41413859 41590072 41759951 41922330 42075632 42219111 42353036 42477672
57312 42477672 42593153 42700582 42802399 42901241 42998902 43096586 43195695 43297941 43404875 43517550
57302 43517550 43636673 43763059 43897968 44042876 44198744 44365270 44540692 44722248 44907141
57293 44907141 45093387 45279807 45465112 45647245 45823845 45993086 46153591 46303734 46441671
$$ packed form
57357C4582774J74674J73465J74216J76451J78807J80973J83228J85501J87876
57348C6197965J90701J93180J93318J90289J85698J81400J77423J73229J69619
57339C7852822J67854J67875J68834J70462J72476J73742J73659J73583J75168
57330C9396475J77965J80293J81774J83218J84585J85075J85042J85641J86484
57321D1046552J85535J81772J76213J69879J62379J53302J43479J33925J24636
57312D2477672J15481J07429J01817R8842R7661R7684R9109J02246J06934J12675
57302D3517550J19123J26386J34909J44908J55868J66526J75422J81556J84893
57293D4907141J86246J86420J85305J82133J76600J69241J60505J50143J37937
$$ plain form
57284 46441671 46566142 46676758 46773401 46855770 46923730 46977724 47018573 47047040 47063827 47070197 47068741
57273 47068741 47063512 47059030 47058892 47065354 47079916 47103595 47136545 47178306 47228756 47287949 47354589 47425767
57261 47425767 47499094 47574199 47651238 47728857 47804768 47877397 47945635 48007797 48062514 48110123 48151552
57250 48151552 48186181 48212501 48230614 48242224 48248189 48247780 48240272 48225387 48202055 48168914 48126571 48077478
57238 48077478 48022779 47960970 47890558 47812360 47728186 47638852 47544779 47447332 47348138 47247812 47146323
57227 47146323 47043785 46939786 46832702 46720933 46604591 46485161 46363717 46239971 46112754
57218 46112754 45981008 45844727 45705260 45564362 45422822 45280517 45137792 44995893 44855716
57209 44855716 44716815 44577926 44437912 44295994 44151622 44004196 43852383 43693911 43526803
$$ packed form
57284D6441671J24471J10616R6643Q2369O7960N3994M0849K8467J6787O370j456
57273D7068741n229m482j38O462J4562K3679L2950M1761N0450N9193O6640P1178
57261D7425767P3327P5105P7039P7619P5911P2629O8238O2162N4717M7609M1429
57250D8151552L4629K6320J8113J1610N965m09p508j4885k3332l3141m2343m9093
57238D8077478n4699o1809p0412p8198q4174q9334r4073r7447r9194j00326j01489
57227D7146323j02538j03999j07084j11769j16342j19430j21444j23746j27217
57218D6112754j31746j36281j39467j40898j41540j42305j42725j41899j40177
57209D4855716j38901j38889j40014j41918j44372j47426j51813j58472j67108
$$ plain form
57200 43526803 43350787 43166783 42975307 42776216 42569665 42356196 42136101 41909637 41677360
57191 41677360 41438927 41191957 40933410 40661728 40376195 40074879 39754915 39414345 39051707
57182 39051707 38664428 38250302 37810815 37350722 36874121 36383215 35881257 35374144 34868291
57173 34868291 34369223 33882998 33416590 32975430 32562161 32178668 31827538 31510495 31227044
57164 31227044 30975596 30754430 30560774 30390417 30239056 30102649 29975892 29851703 29722543
57155 29722543 29581041 29419497 29230690 29009484 28752269 28455596 28117786 27741573 27332311
57146 27332311 26893655 26427839 25940299 25440995 24941024 24451082 23983274 23550346 23161309
57137 23161309 22819823 22526579 22279495 22070843 21887818 21717181 21546713 21362493 21149498
$$ packed form
57200D3526803j76016j84004j91476j99091k06551k13469k20095k26464k32277
57191D1677360k38433k46970k58547k71682k85533l01316l19964l40570l62638
57182C9051707l87279m14126m39487m60093m76601m90906n01958n07113n05853
57173C4868291m99068m86225m66408m41160m13269l83493l51130l17043k83451
57164C1227044k51448k21166j93656j70357j51361j36407j26757j24189j29160
57155B9722543j41502j61544j88807k21206k57215k96673l37810l76213m09262
57146B7332311m38656m65816m87540m99304m99971m89942m67808m32928l89037
57137B3161309l41486k93244k47084k08652j83025j70637j70468j84220k12995
$$ plain form
57128 21149498 20896809 20599856 20258138 19875377 19462703 19037427 18617600 18220803 17866484
57119 17866484 17572430 17347078 17189682 17097591 17066967 17086519 17139015 17212122 17302987 17413438
57109 17413438 17550594 17734654 17997591 18371569 18886324 19577970 20488395 21652799 23099163
57100 23099163 24863419 26994116 29542181 32565106 36149099 40411694 45475446 51451676
57092 51451676 58443072 66522867 75694784 85902589 97072215 109038543 121320046
57085 121320046 132998531 142984379 150538777 155579541 158509871 159825169 159909961 159096259
57077 159096259 157732417 156095469 154255448 152072443 149341626 145949918 141922922 137362341
57069 137362341 132372869 127066695 121622242 116286420 111268295 106615050 102197681 97814675
$$ packed form
57128B1149498k52689k96953l41718l82761m12674m25276m19827l96797l54319
57119A7866484k94054k25352j57396r2091l0624J9552N2496P3107R0865J10451
57109A7413438J37156J84060K62937L73978N14755O91646R10425J164404J446364
57100B3099163J764256K130697K548065L022925L583993M262595N063752N976230
57092E1451676O991396Q079795R171917J0207805J1169626J1966328J2281503
57085A21320046J1678485R985848P554398N040764K930330J315298Q4792q13702
57077A59096259j363842j636948j840021k183005k730817l391708m026996m560581
57069A37362341m989472n306174n444453n335822n018125m653245m417369m383006
$$ plain form
57061 97814675 93311339 88637983 83852592 79092034 74513738 70224037 66236390 62480867
57053 62480867 58843020 55206911 51496439 47703177 43878972 40098317 36427033 32917749
57045 32917749 29615112 26553007 23751038 21218263 18954855 16946962 15167485 13588134
57037 13588134 12188036 10949541 9853072 8880667 8019444 7257460 6580628 5977342 5441807
57028 5441807 4969245 4551579 4180783 3852459 3562980 3306730 3079012 2878118 2701838
57019 2701838 2545457 2405781 2283680 2179951 2091987 2017022 1955602 1909583 1879817 1867842
57009 1867842 1876431 1906302 1955798 2025889 2121052 2241210 2375399 2506975 2623848 2722228 2803877
56998 2803877 2873401 2936493 2997134 3055564 3108266 3147373 3160102 3133716 3064878 2963060 2843390
$$ packed form
57061I7814675m503336m673356m785391m760558m578296m289701l987647l755523
57053F2480867l637847l636109l710472l793262l824205l780655l671284l509284
57045C2917749l302637l062105k801969k532775k263408k007893j779477j579351
57037A3588134j400098j238495j096469r72405q61223p61984o76832o03286n35535
57028E441807m72562m17666l70796l28324k89479k56250k27718k00894j76280
57019B701838j56381j39676j22101j03729q7964p4965o1420m6019k9766j1975
57009A867842Q589K9871M9496P0091R5163J20158J34189J31576J16873R8380Q1649
56998B803877O9524O3092O0641N8430N2702L9107J2729k6386o8838j01818j19670
$$ plain form
56987 2843390 2717909 2593652 2474156 2359116 2245027 2129671 2015139 1904881 1799604
56978 1799604 1697729 1597962 1499749 1403191 1310101 1223119 1142437 1065703 992439 925804 868302
56967 868302 818603 774763 737782 709304 688087 671468 658550 649545 643685 640165 639472 641598 644551
56954 644551 646745 649030 651953 652694 647465 635860 620529 603591 585690 567809 551792 539406 532153
56941 532153 531077 535505 543218 553188 566685 584235 603188 620273 635190 649639 663914 676571
56929 676571 686691 694573 700515 704074 703865 697179 681054 655110 622588 587786 553535 521547 493044
56916 493044 467600 443093 418325 394328 372000 350439 329061 309285 292219 276514 260523
56905 260523 245019 231829 221318 213167 207935 205656 204370 202477 201462 204194 211763 224032 241795
$$ packed form
56987B843390j25481j24257j19496j15040j14089j15356j14532j10258j05277
56978A799604j01875r9767r8213r6558r3090q6982q0682p6734p3264o6635n7502
56967H68302m9699m3840l6981k8478k1217j6619j2918r005n860l520o93K126K953
56954F44551K194K285K923P41n229j1605j5331j6938j7901j7881j6017j2386p253
56941E32153j076M428P713R970J3497J7550J8953J7085J4917J4449J4275J2657
56929F76571J0120P882N942L559k09o686j6125k5944l2522l4802l4251l1988k8503
56916D93044k5444k4507k4768k3997k2328k1561k1378j9776j7066j5705j5991
56905B60523j5504j3190j0511q151n232k279j286j893j015K732P569J2269J7763
$$ plain form
56892 241795 265677 293771 322890 351698 380585 409274 436812 463354 489779 515866 540535
56881 540535 563141 582723 596954 604242 606504 607892 611141 616990 626402 640881 660667 684871 713687
56868 713687 748837 791440 840597 893926 948437 1001331 1051390 1099532 1146986 1193289 1236828
56857 1236828 1276464 1311424 1340335 1361553 1373794 1375700 1366261 1347219 1323936 1302320 1285723 1275925
56845 1275925 1275303 1286007 1308249 1341659 1387136 1444941 1511706 1581653 1650389 1715810 1776549 1832186
56833 1832186 1884501 1935862 1986134 2032597 2071923 2100039 2111136 2100164 2067020 2016575 1955039
56822 1955039 1888322 1823050 1765623 1719189 1683446 1657728 1642534 1638158 1644070 1659802 1684080 1712673
56810 1712673 1739511 1761024 1777873 1792141 1804598 1815037 1823044 1827192 1824640 1812160 1786754 1745880
$$ packed form
56892B41795K3882K8094K9119K8808K8887K8689K7538K6542K6425K6087K4669
56881E40535K2606J9582J4231P288K262J388L249N849R412J4479J9786K4204K8816
56868G13687L5150M2603M9157N3329N4511N2894N0059M8142M7454M6303M3539
56857A236828L9636L4960K8911K1218J2241J906r439j9042k3283k1616j6597r798
56845A275925o22J0704K2242L3410M5477N7805O6765O9947O8736O5421O0739N5637
56833A832186N2315N1361N0272M6463L9326K8116J1097j0972l3144n0445o1536
56822A955039o6717o5272n7427m6434l5743k5718j5194m376N912J5732K4278K8593
56810A712673K6838K1513J6849J4268J2457J0439Q007M148k552j2480k5406m0874
$$ plain form
56798 1745880 1689431 1622143 1552102 1485820 1425734 1372436 1327125 1290809 1262819 1241609 1226378
56787 1226378 1217150 1213875 1215749 1220648 1225131 1226083 1222748 1216415 1208329 1198928 1188667 1177579 1163479
56774 1163479 1142228 1110870 1069979 1022799 973004 923326 875073 828395 783559 741860 704449
56763 704449 670525 637913 605353 573173 541994 512231 484730 460355 438724 418612 399648
56752 399648 382335 366502 351297 336863 324373 314021 304431 294488 284395 274552 264704 254793
56740 254793 245592 237906 231910 227445 224140 221253 218303 215789 214290 213152 211293 209002 207430 206524
56726 206524 205103 202975 201270 200528 200121 199771 199914 200206 199446 197655 196670 197939 200983 204537 207905 210581
56710 210581 211927 212044 211942 212228 212554 212812 213769 215908 218483 220308 220946 220942 221398 223199 225972 228167 229073
$$ packed form
56798A745880n6449o7288p0041o6282o0086n3298m5311l6316k7990k1210j5231
56787A226378r228l275J874M899M483R52l335o333q086r401j0261j1088j4100
56774A163479k1251l1358m0891m7180m9795m9678m8253m6678m4836m1699l7411
56763G04449l3924l2612l2560l2180l1179k9763k7501k4375k1631k0112j8964
56752C99648j7313j5833j5205j4434j2490j0352r590r943j0093r843r848r911
56740B54793r201p686n996m465l305k887k950k514j499j138j859k291j572r06
56726B06524j421k128j705p42m07l50J43K92p60j791r85J269L044L554L368K676
56710B10581J346J17j02K86L26K58R57K139K575J825O38mM56J801K773K195R06
$$ plain form
56693 229073 230093 232797 236421 238963 240184 241444 242861 242961 241334 239375 237932 236314 234218 232582
56679 232582 231729 230599 228644 226755 225459 223915 221596 219283 217513 215681 213658 212653 213278 214181 213765
56664 213765 212066 210018 208191 207258 208280 211175 213947 214626 213291 211399 210079 209838 210843 212581 214038
56649 214038 214879 215551 215771 214161 210106 204769 199492 194348 188972 183585 178202 172056 164928 158275 153871
56634 153871 151707 149864 146179 139928 132536 126521 122852 119646 114744 109123 105890 106073 107690 109255
56620 109255 111611 115437 119410 122252 124572 127168 129338 130435 131548 133971 137423 141217 145805 151477
56606 151477 156817 160237 162189 164311 167070 169578 171040 171273 170551 169973 171113 174296 178034 180977 183396
56591 183396 185978 188538 190962 194140 198683 203833 208825 214096 219953 225222 228724 231215 234521 239516
$$ packed form
56693B29073J020K704L624K542J221J260J417J00j627j959j443j618k096j636
56679B32582q53j130j955j889j296j544k319k313j770j832k023j005O25R03m16
56664B13765j699k048j827r33J022K895K772O79j335j892j320k41J005J738J457
56649B14038Q41O72K20j610m055n337n277n144n376n387n383o146p128o653m404
56634A53871k164j843l685o251p392o015l669l206m902n621l233J83J617J565
56620A09255K356L826L973K842K320K596K170J097J113K423L452L794M588N672
56606A51477N340L420J952K122K759K508J462K33p22n78J140L183L738K943K419
56591A83396K582K560K424L178M543N150M992N271N857N269L502K491L306M995
$$ plain form
56577 239516 245967 253482 261516 269276 276516 283638 290503 296493 302343 310104 320274 330827 340451 350808
56563 350808 363813 378381 391898 403561 414299 424665 434965 446343 459430 472439 482669
56552 482669 489443 493925 496718 497523 496792 495946 495950 496691 497248 495937 491123 483161 474400 466067 456654 444957
56536 444957 433046 423890 417166 409972 401005 391717 383671 376993 371338 366457 361793 357001 352628 348905
56522 348905 344548 338372 331315 325045 319217 312230 304162 296681 290334 284179 278153 273560 270768 268289
56508 268289 264799 260621 256649 252955 248952 244254 239245 235278 233851 234897 236585 237689 239136 242042
56494 242042 245293 246760 246163 245079 244755 245550 247923 252153 257372 262377 266993 271368 274704 276351 277417
56479 277417 279627 283247 287725 293412 300682 308228 314366 319384 324477 329211 332510 335539 340841 348716
$$ packed form
56577B39516O451P515Q034P760P240P122O865N990N850P761J0170J0553R624J0357
56563C50808J3005J4568J3517J1663J0738J0366J0300J1378J3087J3009J0230
56552D82669O774M482K793Q05p31q46MP41N57j311m814p962q761q333r413j1697
56536D44957j1911r156o724p194q967r288q046o678n655m881m664m792m373l723
56522C48905m357o176p057o270n828o987q068p481o347o155o026m593k792k479
56508B68289l490m178l972l694m003m698n009l967j427J046J688J104J447K906
56494B42042L251J467n97j084l24P95K373M230N219N005M616M375L336J647J066
56479B77417K210L620M478N687P270P546O138N018N093M734L299L029N302P875
$$ plain form
56465 348716 357027 364594 372317 380707 388779 395813 402036 407152 410292 411832 413387 415560 417529 419061
56451 419061 421005 423483 425503 426840 428441 430473 431684 431256 429857 428522 427691 427408 427149 425713 422749
56436 422749 419944 418946 418749 417229 414690 413262 413090 412032 409316 406595 404773 402502 398723 394195 389559
56421 389559 384127 377681 371413 366192 361790 358440 356947 356418 354220 349342 343788 339645 336933 335404
56407 335404 335927 338365 340192 339357 337105 336165 337269 339075 340440 341122 340992 340016 338674 337602 337373 338998
56391 338998 343434 349893 355951 360301 364382 370346 378410 387200 395825 404623 414326 425171 436467 446940
56377 446940 456144 465460 476638 489401 501782 512823 523339 533809 543287 551106 558181 565803 574233
56364 574233 583092 592115 601003 609503 617825 625924 632398 635474 635241 633551 631697 629690 627796 626907 626983
$$ packed form
56465C48716Q311P567P723Q390Q072P034O223N116L140J540J555K173J969J532
56451D19061J944K478K020J337J601K032J211m28j399j335q31k83k59j436k964
56436D22749k805r98j97j520k539j428j72j058k716k721j822k271l779m528m636
56421C89559n432o446o268n221m402l350j493n29k198m878n554m143k712j529
56407C35404N23K438J827q35k252r40J104J806J365O82j30r76j342j072k29J625
56391C38998M436O459O058M350M081N964Q064Q790Q625Q798R703J0845J1296J0473
56377D46940R204R316J1178J2763J2381J1041J0516J0470R478P819P075P622Q430
56364E74233Q859R023Q888Q500Q322Q099O474L076k33j690j854k007j894q89P6
$$ plain form
56349 626983 626751 625391 623233 620799 618700 618288 620478 623898 626282 627719 630321 634662 639056 642650 646541
56334 646541 651222 655687 659993 666085 674870 685001 695743 708423 723364 737757 748637 756365 763479
56321 763479 771585 780822 790977 801649 812413 823686 836041 848114 857156 862584 867018 872768 879313
56308 879313 885375 891238 897562 903870 909815 916270 923766 931471 938964 947241 956711 965996 973970 981164
56294 981164 988077 994273 1000450 1009052 1021028 1034136 1046367 1059038 1074542 1092951 1112975 1134576
56282 1134576 1158417 1184091 1211070 1240269 1272855 1308708 1347790 1391698 1441991 1498135 1558833
56271 1558833 1624441 1696585 1776429 1864592 1961546 2066874 2179443 2299470 2428969 2569159
56261 2569159 2719158 2878202 3046899 3224842 3409213 3597552 3789854 3986059 4183529
$$ packed form
56349F26983k32j360k158k434k099m12K190L420K384J437K602M341M394L594L891
56334F46541M681M465M306O092Q785J0131J0742J2680J4941J4393J0880P728P114
56321G63479Q106R237J0155J0672J0764J1273J2355J2073R042N428M434N750O545
56308H79313O062N863O324O308N945O455P496P705P493Q277R470R285P974P194
56294I81164O913O196O177Q602J1976J3108J2231J2671J5504J8409K0024K1601
56282A134576K3841K5674K6979K9199L2586L5853L9082M3908N0293N6144O0698
56271A558833O5608P2144P9844Q8163R6954J05328J12569J20027J29499J40190
56261B569159J49999J59044J68697J77943J84371J88339J92302J96205J97470
$$ plain form
56252 4183529 4379021 4571247 4759283 4940268 5110928 5269897 5416418 5548394 5663885
56243 5663885 5763213 5847552 5916813 5970664 6010059 6035856 6047518 6044940 6029816 6003419 5965008
56232 5965008 5914404 5853926 5785399 5707261 5617145 5515558 5404551 5284776 5156644 5022622
56222 5022622 4885320 4744607 4599328 4450568 4300532 4149629 3997528 3846111 3698682
56213 3698682 3557086 3421657 3292660 3169580 3050550 2934937 2825014 2722715 2626516 2534178
56203 2534178 2446698 2366559 2293744 2226688 2165626 2111530 2062785 2016262 1971116 1928812 1890389
56192 1890389 1856336 1827872 1805303 1786073 1767385 1749835 1735877 1726010 1719286 1716076 1717094 1720899
56180 1720899 1725406 1730744 1737703 1745033 1751746 1760452 1774460 1792671 1811324 1829807 1850610 1874090
$$ packed form
56252D183529J95492J92226J88036J80985J70660J58969J46521J31976J15491
56243E663885R9328Q4339O9261N3851L9395K5797J1662k578j5124k6397l8411
56232E965008n0604o0478o8527p8138r0116j01587j11007j19775j28132j34022
56222E022622j37302j40713j45279j48760j50036j50903j52101j51417j47429
56213C698682j41596j35429j28997j23080j19030j15613j09923j02299r6199r2338
56203B534178q7480q0139p2815o7056o1062n4096m8745m6523m5146m2304l8423
56192A890389l4053k8464k2569j9230j8688j7550j3958r867o724l210J018L805
56180A720899M507N338O959P330O713Q706J4008J8211J8653J8483K0803K3480
$$ plain form
56168 1874090 1897668 1920327 1943946 1969617 1995869 2021140 2045575 2070309 2097187 2128483 2164416
56157 2164416 2201800 2237812 2274084 2314474 2360381 2411590 2470046 2538610 2616992 2703177 2798583
56146 2798583 2907944 3034237 3177229 3336649 3512989 3705042 3909812 4124812 4347882
56137 4347882 4575834 4806785 5042986 5287645 5539317 5792500 6042448 6285467 6515602
56128 6515602 6725912 6913532 7080236 7228409 7359729 7476480 7579534 7664925 7725976 7758602
56118 7758602 7761714 7734244 7676441 7593355 7492504 7378172 7251250 7113013 6964468 6803434
56108 6803434 6627684 6440668 6249598 6058876 5870197 5687625 5516328 5356592 5204773
56099 5204773 5060191 4925595 4801168 4684144 4574535 4475088 4384967 4299427 4216731 4139905
$$ packed form
56168A874090K3578K2659K3619K5671K6252K5271K4435K4734K6878L1296L5933
56157B164416L7384L6012L6272M0390M5907N1209N8456O8564P8382Q6185R5406
56146B798583J09361J26293J42992J59420J76340J92053K04770K15000K23070
56137D347882K27952K30951K36201K44659K51672K53183K49948K43019K30135
56128F515602K10310J87620J66704J48173J31320J16751J03054Q5391O1051L2626
56118G758602L112k7470n7803q3086j00851j14332j26922j38237j48545j61034
56108F803434j75750j87016j91070j90722j88679j82572j71297j59736j51819
56099E204773j44582j34596j24427j17024j09609r9447r0121q5540q2696p6826
$$ plain form
56089 4139905 4070844 4008235 3952089 3904714 3866095 3833519 3806520 3786999 3774076 3764580 3759117 3761632
56077 3761632 3772166 3786155 3801786 3821784 3846806 3873565 3901098 3932542 3968749 4006130 4042724
56066 4042724 4080756 4121501 4163368 4206554 4253680 4304291 4354672 4404420 4457064 4513004 4568615
56055 4568615 4623803 4683347 4748684 4815404 4881158 4949130 5021181 5094452 5167544 5243423 5323592
56044 5323592 5405738 5489369 5577071 5668178 5758518 5848717 5945055 6049523 6156835 6264023 6374864
56033 6374864 6491649 6610984 6731459 6857184 6989651 7124181 7258666 7397815 7544513
56024 7544513 7695013 7847057 8004603 8169960 8339328 8510696 8687978 8872781 9060540
56015 9060540 9249528 9445108 9650363 9861349 10076308 10299971 10533530 10770320 11007437
$$ packed form
56089D139905o9061o2609n6146m7375l8619l2576k6999j9521j2923r496n463K515
56077C761632J0534J3989J5631J9998K5022K6759K7533L1444L6207L7381L6594
56066D042724L8032M0745M1867M3186M7126N0611N0381M9748N2644N5940N5611
56055D568615N5188N9544O5337O6720O5754O7972P2051P3271P3092P5879Q0169
56044E323592Q2146Q3631Q7702R1107R0340R0199R6338J04468J07312J07188J10841
56033F374864J16785J19335J20475J25725J32467J34530J34485J39149J46698
56024G544513J50500J52044J57546J65357J69368J71368J77282J84803J87759
56015I060540J88988J95580K05255K10986K14959K23663K33559K36790K37117
$$ plain form
56006 11007437 11251861 11509052 11775504 12048903 12334945 12636820 12948302 13264907 13592005
55997 13592005 13934647 14290052 14657757 15045979 15459522 15892503 16341626 16815303 17320968
55988 17320968 17855427 18416993 19014617 19655242 20335347 21055578 21830085 22670297 23574000
55979 23574000 24542572 25593891 26745324 28000574 29368519 30878955 32564580 34446021
55971 34446021 36553541 38946616 41694423 44858055 48513618 52769277 57731318 63475571
55963 63475571 70087309 77717424 86579259 96927192 109084856 123463314 140487313
55956 140487313 160515836 183876066 210870542 241481174 274851801 309096612 341853985
55949 341853985 371294831 396795019 418775714 437982626 454898792 469655562 482142855
$$ packed form
56006A1007437K44424K57191K66452K73399K86042L01875L11482L16605L27098
55997A3592005L42642L55405L67705L88222M13543M32981M49123M73677N05665
55988A7320968N34459N61566N97624O40625O80105P20231P74507Q40212R03703
55979B3574000R68572J051319J151433J255250J367945J510436J685625J881441
55971C4446021K107520K393075K747807L163632L655563M255659M962041N744253
55963F3475571O611738P630115Q861835J0347933J2157664J4378458J7023999
55956A40487313K0028523K3360230K6994476L0610632L3370627L4244811L2757373
55949C41853985K9440846K5500188K1980695J9206912J6916166J4756770J2487293
$$ plain form
55942 482142855 491837099 497432598 496951542 488705571 472485222 449911584 423652970 396271227
55934 396271227 369560878 344484499 321316894 299822905 279551118 260164669 241561809
55927 241561809 223757535 206765380 190613665 175377300 161121504 147838048 135459674
55920 135459674 123900045 113057894 102826834 93145285 84026202 75520238 67666906
55913 67666906 60490450 54009889 48223511 43096337 38580269 34632995 31204787 28225901
55905 28225901 25625827 23353892 21369095 19624948 18079393 16707710 15491834 14407139
55897 14407139 13431121 12553896 11767980 11057222 10406380 9811841 9272482 8779092 8322489
55888 8322489 7902605 7519780 7165930 6833658 6525317 6243637 5981925 5732951 5499358
$$ packed form
55942D82142855R694244N595499m81056q245971j6220349k2573638k6258614k7381743
55934C96271227k6710349k5076379k3167605k1493989k0271787j9386449j8602860
55927B41561809j7804274j6992155j6151715j5236365j4255796j3283456j2378374
55920A35459674j1559629j0842151j0231060r681549r119083q505964p853332
55913F7666906p176456o480561n786378n127174m516068l947274l428208k978886
55905B8225901k600074k271935j984797j744147j545555j371683j215876j084695
55897A4407139r76018q77225p85916p10758o50842n94539n39359m93390m56603
55888H322489m19884l82825l53850l32272l08341k81680k61712k48974k33593
$$ plain form
55879 5499358 5285814 5088412 4901155 4725719 4565384 4415754 4270692 4131870 4004102
55870 4004102 3886489 3775833 3673246 3579964 3491967 3405948 3325273 3253238 3186072 3119445 3056147
55859 3056147 3000143 2948491 2896371 2844946 2797214 2751199 2704290 2659411 2619734 2581812 2540747
55848 2540747 2497663 2455426 2411758 2363612 2313847 2266411 2219146 2168542 2117559 2071274 2028442
55837 2028442 1984746 1941134 1901427 1864466 1826101 1786865 1750580 1717006 1682489 1646602 1612178
55826 1612178 1579988 1548813 1519418 1493344 1469176 1444633 1420683 1399290 1379396 1359526 1341795
55815 1341795 1328618 1318064 1307316 1298019 1293135 1291170 1288825 1286765 1287253 1288444 1286781 1283002 1280062
55802 1280062 1276930 1270313 1261032 1252863 1246009 1237210 1225530 1212769 1198956 1182661 1165251 1149819
$$ packed form
55879E499358k13544j97402j87257j75436j60335j49630j45062j38822j27768
55870D004102j17613j10656j02587r3282q7997q6019q0675p2035o7166o6627o3298
55859C056147n6004n1652n2120n1425m7732m6015m6909m4879l9677l7922m1065
55848B540747m3084m2237m3668m8146m9765m7436m7265n0604n0983m6285m2832
55837B028442m3696m3612l9707l6961l8365l9236l6285l3574l4517l5887l4424
55826A612178l2190l1175k9395k6074k4168k4543k3950k1393j9894j9870j7731
55815A341795j3177j0554j0748r297m884j965k345k060M88J191j663l779k940
55802A280062l132o617r281q169o854q799j1680j2761j3813j6295j7410j5432
$$ plain form
55790 1149819 1136234 1121834 1106619 1093205 1082019 1070940 1059258 1047727 1035143 1019360 1001544
55779 1001544 985181 970783 955539 938261 920857 904573 888226 870572 851588 831290 809690
55768 809690 787684 765906 743716 721367 701424 685245 670031 652694 634785 619948 608140
55757 608140 596417 584034 572489 561492 549167 535791 523372 511935 499972 488100 478464 470787
55745 470787 462668 453617 445388 438497 431724 424889 419015 413987 408959 404590 401932 399842 396548 392946
55731 392946 391054 390068 387495 383438 380131 377751 374418 370010 366289 363434 359975 356034 353115 350854
55717 350854 347467 343428 341251 341574 342703 344051 346627 350065 352513 353716 355175 357341 359737 363557
55703 363557 370559 379341 386300 390545 394390 398750 401786 402685 403178 404384 405298 405350 405410 405534 404671 403427
$$ packed form
55790A149819j3585j4400j5215j3414j1186j1079j1682j1531j2584j5783j7816
55779A001544j6363j4398j5244j7278j7404j6284j6347j7654j8984k0298k1600
55768H09690k2006k1778k2190k2349j9943j6179j5214j7337j7909j4837j1808
55757F08140j1723j2383j1545j0997j2325j3376j2419j1437j1963j1872r636p677
55745D70787q119r051q229o891o773o835n874n028n028m369k658k090l294l602
55731C92946j892r86k573m057l307k380l333m408l721k855l459l941k919k261
55717C50854l387m039k177L23J129J348K576L438K448J203J459K166K396L820
55703C63557P002Q782O959M245L845M360L036Q99M93J206R14N2O0J24q63j244
$$ plain form
55687 403427 404136 407241 410435 412307 414112 416932 419785 421723 423546 426370 430438 435973 443225 451268
55673 451268 458745 465962 473986 481793 487019 489802 493068 498528 505151 511936 519223 526492 531969 535589
55659 535589 539748 545709 551563 554950 555689 554640 552101 548602 545462 543197 540637 536424 530275 522454
55645 522454 513278 503314 492768 480907 467516 454293 442822 431935 419426 405729 393071 381554
55633 381554 369315 356383 344842 334868 324119 311813 300068 290154 280612 270339 260539 252140
55621 252140 243968 235022 226243 218662 211942 205890 201229 197813 194280 190347 187156 184454 180078 173408
55607 173408 166825 162444 159842 158262 158411 160382 162129 161966 160764 160145 160235 160568 161259 161910 161262 159338
55591 159338 158002 158063 157818 155996 154167 154510 156900 159793 162368 164316 165188 165520 167028 170231 173432 175551
$$ packed form
55687D03427P09L105L194J872J805K820K853J938J823K824M068N535P252Q043
55673D51268P477P217Q024P807N226K783L266N460O623O785P287P269N477L620
55659E35589M159N961N854L387P39j049k539l499l140k265k560m213o149p821
55645E22454r176r964j0546j1861j3391j3223j1471j0887j2509j3697j2658j1517
55633C81554j2239j2932j1541r974j0749j2306j1745r914r542j0273r800q399
55621B52140q172q946q779p581o720o052m661l416l533l933l191k702m376o670
55607A73408o583m381k602j580J49J971J747j63j202o19R0L33O91O51o48j924
55591A59338j336O1k45j822j829L43K390K893K575J948Q72L32J508L203L201K119
$$ plain form
55575 175551 178214 183321 190067 196180 200972 205464 210546 216543 223758 232077 240658 248824 256430 262937
55561 262937 267524 270610 273514 275959 275822 272210 266749 260820 253817 245458 237396 230635 223461 214124
55547 214124 203933 195478 189182 183740 178791 174930 171939 169084 166619 165236 164420 162804 159765 155605
55533 155605 150829 146207 142753 140744 139567 139082 139778 140943 140562 138204 136168 136229 137030 136438 134743 133449
55517 133449 132415 130667 128967 128990 130406 131165 130597 130257 131601 134479 138013 141557 144585 146777 148427
55502 148427 150006 151349 151741 150601 147769 143702 139677 136934 135196 133044 130080 127457 125768 123991
55488 123991 121386 118839 117209 115758 113425 110297 106720 102402 97740 94406 93079 92047 89726 87037
55474 87037 85384 83718 79999 74621 69976 67175 65367 63916 63029 62360 61018 59133 57733 56930 55760
$$ packed form
55575A75551K663N107O746O113M792M492N082N997P215Q319Q581Q166P606O507
55561B62937M587L086K904K445j37l612n461n929p003q359q062o761p174r337
55547B14124j0191q455o296n442m949l861k991k855k465j383q16j616l039m160
55533A55605m776m622l454k009j177m85O96J165l81k358k036O1Q01n92j695j294
55517A33449j034j748j700K3J416P59n68l40J344K878L534L544L028K192J650
55502A48427J579J343L92j140k832m067m025k743j738k152k964k623j689j777
55488A23991k605k547j630j451k333l128l577m318m662l334j327j032k321k689
55474H7037j653j666l719n378m645k801j808j451q87o69j342j885j400q03j170
$$ plain form
55459 55760 53941 52408 51833 51741 51265 49930 47664 44833 42151 39897 37521 34638 31858 29877 28411
55444 28411 27018 26284 27052 28892 30452 30955 30441 29020 26951 25107 24435 25060 26532 28485 30425 31503
55428 31503 31259 30102 28531 26555 24352 22572 21378 20213 19183 19469 21575 24357 26698 28807 30868
55413 30868 31934 31573 31287 32650 35127 37272 38989 40881 42334 42274 41284 41229 42959 45700 48369 50375
55397 50375 51593 52535 53952 55497 55754 54332 52479 50677 47560 42985 40174 42265 47879 52542 53629
55382 53629 51615 47587 42464 38136 36353 36197 35076 32485 30528 30437 30777 29722 27293 24733 23102
55367 23102 22925 23950 24980 24984 24307 23811 23270 21998 20508 19863 19819 19347 18634 18718 19460 19758 19499 19288 18599
55348 18599 16453 13835 12975 14027 14893 14709 15068 17025 19278 20394 20772 21149 21028 19917 18597 17732
$$ packed form
55459E5760j819j533n75r2m76j335k266k831k682k254k376k883k780j981j466
55444B8411j393p34P68J840J560N03n14j421k069j844o72O25J472J953J940J078
55428C1503k44j157j571j976k203j780j194j165j030K86K106K782K341K109K061
55413C0868J066l61k86J363K477K145J717J892J453o0r90n5J730K741K669K006
55397E0375J218R42J417J545K57j422j853j802l117m575k811K091N614M663J087
55382E3629k014m028n123m328j783j56j121k591j957r1L40j055k429k560j631
55367B3102j77J025J030Mo77m96n41j272j490o45m4m72p13Q4P42K98k59k11o89
55348A8599k146k618q60J052Q66j84L59J957K253J116L78L77j21j111j320q65
$$ plain form
55332 17732 16516 14166 11803 11413 13386 16177 18129 18916 19364 20304 21546 22071 21512 20913 21251 21783 21105
55315 21105 19467 18578 19175 20310 21014 21116 20257 17832 14446 11933 11314 11930 13034 14863 17580 20474
55299 20474 22959 25198 27063 27520 25859 22796 19725 17525 16442 16331 16614 16603 16145 15486 14628 13558
55283 13558 12790 12610 12105 10291 8026 7264 8376 9791 10446 10966 12089 13645 15682 18919 23183 26728
55267 26728 27933 26731 23906 20339 17484 17036 19044 21433 22359 22219 22578 24073 26110 27760 28222 27097
55251 27097 24876 22606 20807 19411 18773 19502 21034 21702 20766 19215 18117 17451 17084 17425 18305 18523 17470
55234 17470 16111 15457 15133 14450 13881 14479 16553 19756 23553 26868 28264 27427 25751 24727 24653 25564 28104
55217 28104 32241 36158 37780 36912 34855 32678 30882 29909 29565 28567 26158 23880 24229 27477 31004 32083
$$ packed form
55332A7732j216k350k363l90J973K791J952P87M48R40J242N25n59n99L38N32o78
55315B1105j638q89N97J135P04J02q59k425l386k513o19O16J104J829K717K894
55299B0474K485K239J865M57j661l063l071k200j083j11K83j1m58o59q58j070
55283A3558p68j80n05j814k265p62J112J415O55N20J123J556K037L237M264L545
55267B6728J205j202k825l567k855m48K008K389R26j40L59J495K037J650M62j125
55251B7097k221k270j799j396o38P29J532O68r36j551j098o66l67L41Q80K18j053
55234A7470j359o54l24o83n69N98K074L203L797L315J396q37j676j024p4R11K540
55217B8104M137L917J622q68k057k177j796r73l44r98k409k278L49L248L527J079
$$ plain form
55201 32083 30470 28085 26905 27482 29005 30436 31625 33237 35568 37805 38808 38318 37008 35545 33969
55186 33969 31981 29654 27743 27038 27246 26975 25472 24027 24702 27743 31165 32956 32717 31062 28599 26033
55170 26033 24292 23888 24694 26643 29880 33907 37369 39135 39029 37299 34203 30453 27195 25119 24119
55155 24119 23945 24376 24758 24470 24016 24457 25520 25589 24067 22372 21908 22351 22701 22797 22786 22293 21317 21080 22663
55136 22663 25315 27165 27317 26441 25706 25842 26941 28610 30544 33104 36693 40485 42812 43176 42850 43050
55120 43050 43663 44297 45211 46349 46726 45924 45098 45249 45497 44486 42686 41768 42140 42559 42106 41296 41103 41812
55102 41812 42959 43885 44283 44575 45543 47355 49241 50342 50398 49631 48623 48409 49608 51188 51238 49496 47977
55085 47977 48577 51206 54807 58715 62096 63647 63264 62892 64240 66551 67935 68029 67981 68688 70537 74071
$$ packed form
55201C2083j613k385j180N77J523J431J189J612K331K237J003m90j310j463j576
55186C3969j988k327j911p05K08k71j503j445O75L041L422J791k39j655k463k566
55170B6033j741m04Q06J949L237M027L462J766j06j730l096l750l258k076j000
55155B4119j74M31L82k88m54M41J063O9j522j695m64M43L50R6j1m93r76k37J583
55136B2663K652J850J52q76p35J36J099J669J934K560L589L792K327L64l26K00
55120D3050O13O34R14J138L77q02q26J51K48j011j800r18L72M19m53q10j93P09
55102D1812J147R26L98K92R68J812J886J101N6p67j008k14J199J580N0j742j519
55085D7977O00K629L601L908L381J551l83l72J348K311J384R4m8P07J849L534
$$ plain form
55069 74071 79181 84081 86755 87269 87259 87385 86762 84895 82762 81656 81771 82149 81495 79274 76529 75244
55053 75244 76342 78794 81106 82774 83624 83024 81074 79532 79970 81604 82491 82276 82221 82953 83826 84312 84488
55036 84488 84258 83553 83189 84140 86037 87702 88947 90340 91369 90686 88454 86698 86721 87646 88179 88410 88863
55019 88863 88917 87506 85047 83611 84959 88712 92506 93992 92844 90790 89639 89561 89583 89255 89290 90747 93982
55002 93982 98123 101351 102105 100365 97358 94022 90603 87764 86554 86657 86234 84574 83494 84795 87762
54987 87762 90728 93624 96950 99499 99628 98121 97295 97736 98364 99406 102419 107206 111520 114537 118067
54972 118067 123369 129211 134361 139704 146312 153342 159763 166714 176197 188319 201573 215174 229460
54959 229460 244472 259779 275669 293176 312694 333414 354193 374311 393261 410434 425245
$$ packed form
55069G4071N110M900K674N14j0J26o23j867k133j106J15L78o54k221k745j285
55053G5244J098K452K312J668Q50o00j950j542M38J634Q87k15n5P32Q73M86J76
55036H4488k30p05l64R51J897J665J245J393J029o83k232j756K3R25N33K31M53
55019H8863N4j411k459j436J348L753L794J486j148k054j151p8K2l28L5J457L235
55002I3982M141L228P54j740l007l336l419k839j210J03m23j660j080J301K967
54987H7762K966K896L326K549J29j507q26M41O28J042L013M787M314L017L530
54972A18067N302N842N150N343O608P030O421O951R483J2122J3254J3601J4286
54959B29460J5012J5307J5890J7507J9518K0720K0779K0118J8950J7173J4811
$$ plain form
54948 425245 437372 446831 453887 458718 461102 460580 456915 450141 440330 427766 413267 397859 382189
54935 382189 366631 351662 337470 323565 309587 296267 284632 274545 265173 256767 250607 247015
54923 247015 244810 243155 242696 244338 248022 253324 260231 268667 278205 288975 301895 317140 333131
54910 333131 347959 361300 374105 386864 398985 409599 418291 425050 429814 431976 430394 424452 415213
54897 415213 404906 394963 385107 374406 362346 348599 332820 315544 298552 283520 270676 259374
54885 259374 249401 240917 233460 225984 217913 209539 201242 192836 183883 174471 165461 157947 152410 148408
54871 148408 145037 141562 137611 133194 128790 125031 121915 118698 114999 111565 109342 108238 107494 106839 106419
54856 106419 105958 104935 103359 101514 99312 96835 95025 94531 94269 92633 89943 88048 87484 86871 85437
$$ packed form
54948D25245J2127R459P056M831K384n22l665o774r811j2564j4499j5408j5670
54935C82189j5558j4969j4192j3905j3978j3320j1635j0087r372q406o160l592
54923B47015k205j655m59J642L684N302O907Q436R538J0770J2920J5245J5991
54910C33131J4828J3341J2805J2759J2121J0614Q692O759M764K162j582n942r239
54897D15213j0307r943r856j0701j2060j3747j5779j7276j6992j5032j2844j1302
54885B59374r973q484p457p476q071q374q297q406q953r412r010p514n537m002
54871A48408l371l475l951m417m404l759l116l217l699l434k223j104p44o55m20
54856A06419m61j023j576j845k202k477j810m94k62j636k690j895n64o13j434
$$ plain form
54841 85437 84302 84520 85457 86011 86139 86382 87145 89142 93080 97917 100779 99953 96955 94495 93396 92675
54825 92675 91697 90847 90776 92284 96260 102482 108991 114002 118004 122782 128801 134922 140396 145690 151289
54810 151289 157029 162977 169970 178858 189924 203313 219418 238445 259882 282497 304719 325215
54798 325215 343551 360288 376162 391313 405450 418357 429845 439468 446600 450606 450803 446833 439342
54785 439342 429665 418524 405809 392147 379600 369734 361624 352993 343010 332880 323867 316036 309114
54772 309114 303409 299263 296327 293961 292069 291157 291850 294703 300277 308943 320387 333505 347287 362058
54758 362058 379537 400964 425211 449433 471811 492971 514281 535409 554237 568881 579167
54747 579167 586246 591141 593554 591913 584854 572815 557811 541486 523952 504872 484949 465601
$$ packed form
54841H5437j135K18R37N54J28K43P63J997L938M837K862q26k998k460j099p21
54825I2675r78q50p1J508L976O222O509N011M002M778O019O121N474N294N599
54810A51289N740N948O993Q888J1066J3389J6105J9027K1437K2615K2222K0496
54798C25215J8336J6737J5874J5151J4137J2907J1488R623P132M006J97l970p491
54785D39342r677j1141j2715j3662j2547r866q110q631r983j0130r013p831o922
54772C09114n705m146k936k366j892r12O93K853N574Q666J1444J3118J3782J4771
54758C62058J7479K1427K4247K4222K2378K1160K1310K1128J8828J4644J0286
54747E79167P079M895K413j641p059j2039j5004j6325j7534j9080j9923j9348
$$ plain form
54735 465601 447479 429985 412122 393339 373708 353848 334733 317382 302602 290870 281915 274227
54723 274227 265544 254363 240972 226897 213683 202224 192796 185347 179816 176077 173287 169805 164721
54710 164721 159348 156018 155248 155282 154793 154600 155845 157732 158356 156985 154250 150682 146445 142344 139814 139604
54694 139604 141062 142716 143192 141989 140017 139123 140353 142887 145194 146794 148167 149378 149945 150059 150892
54679 150892 153364 157140 161182 164895 168462 172242 176076 179276 181338 182518 183503 184815 186960 190763
54665 190763 196600 203417 209648 215298 221902 230083 238561 246258 253993 262953 272685 281910 290430 298782
54651 298782 306831 314338 322436 332785 345299 358322 371204 385160 401107 417973 433909 448360
54639 448360 462073 475482 487802 497760 504901 509833 513065 513884 510977 504149 494645 483540 470704
$$ packed form
54735D65601j8122j7494j7863j8783j9631j9860j9115j7351j4780j1732q955p688
54723B74227q683j1181j3391j4075j3214j1459r428p449n531l739k790l482n084
54710A64721n373l330p70L4m89j93J245J887O24j371k735l568m237m101k530k10
54694A39604J458J654M76j203j972q94J230K534K307J600J373J211N67J14Q33
54679A50892K472L776M042L713L567L780L834L200K062J180R85J312K145L803
54665A90763N837O817O231N650O604Q181Q478P697P735Q960R732R225Q520Q352
54651B98782Q049P507Q098J0349J2514J3023J2882J3956J5947J6866J5936J4451
54639D48360J3713J3409J2320R958P141M932L232Q19k907o828r504j1105j2836
$$ plain form
54626 470704 455834 439574 422873 406118 389738 374778 361759 349616 336902 323581 310676
54615 310676 298723 287813 278641 272102 267895 264631 261224 257364 252969 248257 244026 240839 238253 235783
54601 235783 234032 233617 233465 231738 228190 224192 220651 217353 214199 211445 208730 205465 202178 199846 197887
54586 197887 194673 190306 186922 185565 184621 182206 178394 173981 168712 162232 155679 150757 147784 145704
54572 145704 143398 140108 135420 130078 126224 125516 127149 128711 128813 127986 127144 126236 124723 122708 121103
54557 121103 120734 121503 122603 123545 124683 126384 128065 128781 128721 129269 131412 134855 138946 143627 149042 154906
54541 154906 160873 167179 174337 182408 190814 198820 206133 213206 220823 229106 237262 244730 252084 259985
54527 259985 267673 273576 277150 278940 279048 277022 273411 269770 266493 262041 255209 247087 239884 234608
$$ packed form
54626D70704j4870j6260j6701j6755j6380j4960j3019j2143j2714j3321j2905
54615C10676j1953j0910r172o539m207l264l407l860m395m712m231l187k586k470
54601B35783j751m15j52j727l548l998l541l298l154k754k715l265l287k332j959
54586A97887l214m367l384j357r44k415l812m413n269o480o553m922k973k080
54572A45704k306l290m688n342l854p08J633J562J02q27q42r08j513k015j605
54557A21103l69P69J100R42J138J701J681P16o0N48K143L443M091M681N415N864
54541A54906N967O306P158Q071Q406Q006P313P073P617Q283Q156P468P354P901
54527B59985P688N903L574J790J08k026l611l641l277m452o832q122p203n276
$$ plain form
54513 234608 230690 227053 222777 217408 211412 205870 201210 196844 192404 188534 185901 184223 182735 180783
54499 180783 177575 172543 166703 162362 160402 158943 155954 152247 150430 151548 154253 156838 158528 158946
54485 158946 157902 156043 154565 153888 153427 152795 152435 152838 153866 155069 156131 156864 157275 157765 158749 159915
54469 159915 160222 158837 156071 153533 153225 155889 159938 162679 163039 162421 162436 162775 162266 161132 160601 160636 159691
54452 159691 157003 153794 151657 150737 150032 148674 146349 143193 140010 138140 138377 140061 141642 142088 141450
54437 141450 140261 138863 137495 136692 137056 138399 139521 139397 138477 138207 139181 140504 141233 141521 141790 141645 140687
54420 140687 139857 140689 143307 146187 148024 148971 149888 151208 152844 154584 156290 158176 160953 165123 170051
54405 170051 174385 177507 179912 182104 183989 185647 187808 191070 195306 200289 206106 212283 217322 220219
$$ packed form
54513B34608l918l637m276n369n996n542m660m366m440l870k633j678j488j952
54499A80783l208n032n840m341j960j459k989l707j817J118K705K585J690M18
54485A58946j044j859j478o77m61o32l60M03J028J203J062P33M11M90R84J166
54469A59915L07j385k766k538l08K664M049K741L60o18J5L39n09j134n31L5r45
54452A59691k688l209k137r20p05j358k325l156l183j870K37J684J581M46o38
54437A41450j189j398j368q03L64J343J122j24r20k70R74J323P29K88K69j45r58
54420A40687q30Q32K618K880J837R47R17J320J636J740J706J886K777M170M928
54405A70051M334L122K405K192J885J658K161L262M236M983N817O177N039K897
$$ plain form
54391 220219 222063 225020 229683 234417 237449 238786 239728 241146 242798 243950 244133 243380 242006 240156 237568
54376 237568 233988 229820 225938 222687 219461 215572 211110 206637 202477 198821 196114 194574 193604 192536
54362 192536 191758 192050 192678 191461 187388 182202 178468 176722 175495 173632 171477 170003 169812 171068 173565
54347 173565 176672 179852 183277 187501 192671 198547 204963 211433 216602 219172 219436 219066 219402 220721 222853
54332 222853 225183 226262 225091 223135 223292 226041 228286 227167 223571 220353 218265 215569 211065 205556
54318 205556 200260 195436 190875 186525 182247 177896 173889 170826 168405 165560 161816 157612 153122 147894
54304 147894 142126 137243 134320 132593 130500 127761 125507 124389 123524 121620 118556 115271 112441 109815
54290 109815 106976 104249 102505 102197 102916 103845 104346 104126 103220 101949 100666 99502 98595 98525 100066 103281
$$ packed form
54391B20219J844K957M663M734L032J337R42J418J652J152J83p53j374j850k588
54376B37568l580m168l882l251l226l889m462m473m160l656k707j540r70j068
54362A92536p78K92O28j217m073n186l734j746j227j863k155j474j91J256K497
54347A73565L107L180L425M224N170N876O416O470N169K570K64l70L36J319K132
54332B22853K330J079j171j956J57K749K245j119l596l218k088k696m504n509
54318B05556n296m824m561m350m278m351m007l063k421k845l744m204m490n228
54304A47894n768m883k923j727k093k739k254j118q65j904l064l285k830k626
54290A09815k839k727j744l08P19R29N01k20r06j271j283j164r07p0J541L215
$$ plain form
54274 103281 107171 110376 112044 112050 110840 109206 107771 106541 105349 104803 106042 109253 113117 116152 118009
54259 118009 118982 118923 117503 115143 112853 111262 110380 110085 110240 110536 110885 111855 114081 117198 119831 120659 119256
54242 119256 116186 112846 111004 111677 114201 116710 117694 116923 115089 112885 110500 107835 105183 103584 104052
54227 104052 106372 109146 111190 112274 112290 110761 107866 105083 103757 103569 103443 103476 104726 107334 110145 112237
54211 112237 113647 114489 114575 114327 114951 117070 119837 121995 123210 123885 124228 124042 123153 121571 119492 117439
54195 117439 116080 115634 115657 115696 115832 116227 116398 115392 112855 109639 107160 106217 106633 107925 109742 111329 111275
54178 111275 108882 105591 103797 103990 104358 103645 102853 103087 103263 101776 99502 98930 100532 102016 101470 99539
54162 99539 97966 97522 98032 99175 100435 101220 101636 102318 103071 102779 101238 100056 100995 104108 108052 111341
$$ packed form
54274A03281L890L205J668Oj210j634j435j230j192n46J239L211L864L035J857
54259A18009R73n9j420k360k290j591q82k95J55K96L49R70K226L117K633Q28j403
54242A19256l070l340j842O73K524K509R84p71j834k204k385k665k652j599M68
54227A04052K320K774K044J084J6j529k895k783j326j88j26L3J250K608K811K092
54211A12237J410Q42Q6k48O24K119K767K158J215O75L43j86q89j582k079k053
54195A17439j359m46K3L9J36L95J71j006k537l216k479r43M16J292J817J587n4
54178A11275k393l291j794J93L68p13p92K34J76j487k274n72J602J484n46j931
54162I9539j573m44N10J143J260P85M16O82P53k92j541j182R39L113L944L289
$$ plain form
54146 111341 112803 111932 109639 107809 107232 106800 105529 104336 104619 105950 106634 106122 105356 104844 103864 101885
54130 101885 99689 98557 98962 100332 101676 102367 102725 103754 105846 107918 108476 107345 105603 103962 102232
54115 102232 100464 99473 99665 100185 100045 99564 99904 101467 103555 105456 107067 108306 108769 108471 108376 109435 111226
54098 111226 112252 111684 110156 108553 106690 103842 100196 96942 94961 94247 94698 96567 99623 102557 104062
54083 104062 104283 104558 105743 107343 108383 108686 109071 110480 113031 115806 117521 117540 116389 115332 115374 116527
54067 116527 117909 118615 118618 118769 119728 121066 121816 121917 122480 124301 126598 127910 128065 128482 130306 132940 135029
54050 135029 136489 138601 142011 145498 147463 148099 149175 151776 155233 158514 161830 166438 173430 183073
54036 183073 194492 205486 213660 218845 223824 231452 241440 251099 258928 265984 273758 282404 291567 301457
$$ packed form
54146A11341J462q71k293j830n77m32j271j193K83J331O84n12p66n12r80j979
54130A01885k196j132M05J370J344O91L58J029K092K072N58j131j742j641j730
54115A02232j768r91J92N20j40m81L40J563K088J901J611J239M63k98r5J059J791
54098A11226J026n68j528j603j863k848l646l254j981p14M51J869L056K934J505
54083A04062K21K75J185J600J040L03L85J409K551K775J715J9j151j057M2J153
54067A16527J382P06LJ51R59J338P50J01N63J821K297J312J55M17J824K634K089
54050A35029J460K112L410L487J965O36J076K601L457L281L316M608O992R643
54036A83073J1419J0994Q174N185M979P628R988R659P829P056P774Q646R163R890
$$ plain form
54022 301457 312145 322737 332184 340267 347258 353468 359714 367088 375197 381596 384365 384652 385210 386858
54008 386858 387967 387383 386066 385304 384806 383521 381375 379053 376673 373730 370111 366208 362125 357574 352716
53993 352716 348307 344678 341047 336246 329874 322468 314857 307771 301901 297764 295300 293702 291780 288673
53979 288673 284477 280375 277711 276475 274989 271703 267085 262997 260308 258196 256093 255094 256541 259969
53965 259969 263442 265460 265746 264740 263474 263611 266238 270405 273805 275175 275320 275809 277548 280694 285000
53950 285000 289926 295096 300847 307654 315007 321757 327721 333850 340610 347241 353108 358704 364691 370800
53936 370800 376388 381318 385600 388858 390871 392108 393198 394482 396385 399318 402646 404846 405522 406294 408608
53921 408608 411598 413505 414529 416716 421226 427213 433531 440333 448614 458898 470527 481745 490713
$$ packed form
54022C01457J0688J0592R447Q083O991O210O246P374Q109O399K769K87N58J648
54008C86858J109n84j317p62m98j285k146k322k380k943l619l903m083m551m858
53993C52716m409l629l631m801o372p406p611p086n870m137k464j598j922l107
53979B88673m196m102k664j236j486l286m618m088k689k112k103r99J447L428
53965B59969L473K018K86j006j266J37K627M167L400J370J45M89J739L146M306
53950B85000M926N170N751O807P353O750N964O129O760O631N867N596N987O109
53936C70800N588M930M282L258K013J237J090J284J903K933L328K200O76P72K314
53921D08608K990J907J024K187M510N987O318O802Q281J0284J1629J1218Q968
$$ plain form
53908 490713 497245 503348 511151 520429 529068 535865 541693 547733 553662 558110 560249 560463 559950 559872 560445
53893 560445 560593 558832 554553 548192 540488 532216 524435 517989 512508 506544 498863 489129 477583 464979
53879 464979 452848 442701 434479 426597 417915 408969 400812 393475 386226 378704 371033 363221 355164 347023
53865 347023 339061 331274 323632 316532 310454 305236 300027 293952 286655 278376 269785 261627 254301 247776
53851 247776 241948 236851 232441 228477 224853 221747 219189 216749 213943 210775 207632 204779 202228 199946
53837 199946 197918 196151 194845 194362 194660 194924 194185 192345 190228 188536 187169 185755 184480 184016 184775 186556
53821 186556 188856 191159 192953 193890 194145 194362 195162 196952 200186 205104 210806 215336 217634 219085 222115
53806 222115 227344 233177 238289 243216 249008 255518 261990 268422 275280 282461 289697 297587 307008 317635
$$ packed form
53908D90713O532O103P803R278Q639O797N828O040N929M448K139K14n13p8N73
53893E60445J48j761m279o361p704q272p781o446n481n964p681r734j1546j2604
53879D64979j2131j0147q222p882q682q946q157p337p249p522p671p812q057q141
53865C47023p962p787p642p100o078n218n209o075p297q279q591q158p326o525
53851B47776n828n097m410l964l624l106k558k440k806l168l143k853k551k282
53837A99946k028j767j306m83K98K64p39j840k117j692j367j414j275m64P59J781
53821A86556K300K303J794R37K55K17Q00J790L234M918N702M530K298J451L030
53806B22115N229N833N112M927N792O510O472O432O858P181P236P890R421J0627
$$ plain form
53792 317635 328025 337132 344777 350766 354838 357806 361575 367245 373805 379333 383106 386005 389139 392646
53778 392646 395892 398492 400753 402808 403524 401195 395852 390128 386807 385886 385081 382964 380181 377540 374489
53763 374489 370291 365509 361324 358017 354980 351671 347846 343309 338245 333418 329311 325348 320641 315289
53749 315289 310299 306404 303554 301365 299431 297330 295011 293137 292444 292747 293099 292889 292241 291385 290408 289803
53733 289803 290505 292787 295589 297542 298437 299077 299756 299687 298350 296907 297419 300475 304152 305714 304195 300998
53717 300998 298278 297186 297594 298845 300437 302200 304067 305770 306933 307642 308550 310007 311372 311945 312458
53702 312458 314535 318336 321809 323070 322796 323237 325347 328110 330660 333694 338219 343870 349387 354320 359348
53687 359348 365001 371032 377346 384618 393072 401025 405929 407449 408690 413406 422091 431548 438293 441673
$$ packed form
53792C17635J0390R107P645N989M072K968L769N670O560N528L773K899L134L507
53778C92646L246K600K261K055P16k329n343n724l321r21q05k117k783k641l051
53763C74489m198m782m185l307l037l309l825m537n064m827m107l963m707n352
53749C15289m990l895k850k189j934k101k319j874o93L03L52k10o48q56r77o05
53733B89803P02K282K802J953Q95O40O79o9j337j443N12L056L677J562j519l197
53717C00998k720j092M08J251J592J763J867J703J163P09R08J457J365N73N13
53702C12458K077L801L473J261k74M41K110K763K550L034M525N651N517M933N028
53687C59348N653O031O314P272Q454P953M904J520J241M716Q685R457O745L380
$$ plain form
53673 441673 443535 445766 448800 452055 454947 457332 459380 461236 462826 464044 465021 465794 465708 463676 459437
53658 459437 454119 449083 444596 440338 436944 435974 437925 441028 442712 442093 440412 439099 438118 436576 434460
53643 434460 433000 433162 434337 434981 434386 433415 433490 435168 437771 440130 441541 442196 442824 443859 444971 445542
53627 445542 445563 445799 446954 448966 451309 453769 456573 459819 463218 466682 470917 476842 484144 490956 495691
53612 495691 499120 503801 511132 519793 527610 534205 540865 548362 556238 564297 573504 584701 597195 609309
53598 609309 620056 629862 639927 651157 663415 675564 686392 695615 703791 711385 718463 725204 731988
53585 731988 738812 745301 751505 757998 764935 771872 778909 787114 797068 807664 817125 824770 831073 836515
53571 836515 841225 845428 849419 853235 857008 861357 866727 872649 878417 884143 890271 896396 901716 906555
$$ packed form
53673D41673J862K231L034L255K892K385K048J856J590J218R77P73q6k032m239
53658D59437n318n036m487m258l394r70J951L103J684o19j681j313r81j542k116
53643D34460j460J62J175O44n95r71P5J678K603K359J411O55O28J035J112N71
53627D45542K1K36J155K012K343K460K804L246L399L464M235N925P302O812M735
53612D95691L429M681P331Q661P817O595O660P497P876Q059R207J1197J2494J2114
53598F09309J0747R806J0065J1230J2258J2149J0828R223Q176P594P078O741O784
53585G31988O824O489O204O493O937O937P037Q205R954J0596R461P645O303N442
53571H36515M710M203L991L816L773M349N370N922N768N726O128O125N320M839
$$ plain form
53557 906555 912121 918607 924812 930191 936014 943598 952239 959981 965991 971084 976157 981097 985405 988990
53543 988990 992037 994698 997365 1000798 1005484 1011137 1017286 1024124 1032084 1040642 1048291 1054181 1059229 1065094
53529 1065094 1072435 1080790 1089837 1099886 1111194 1123727 1137749 1153724 1171245 1188943 1206028 1223233
53517 1223233 1241613 1261150 1281367 1302676 1326017 1351433 1378136 1405953 1435720 1468027 1502276
53506 1502276 1537196 1571715 1605310 1638213 1671556 1706799 1744709 1785179 1827921 1872851 1919708
53495 1919708 1967867 2016710 2065813 2114786 2163448 2212152 2261334 2310624 2358910 2405445 2450579
53484 2450579 2495378 2540936 2587813 2635486 2682410 2727282 2770226 2812097 2852908 2892033 2929848
53473 2929848 2967844 3006646 3045044 3081496 3115547 3147253 3176472 3203577 3229783 3255543 3279296
$$ packed form
53557I06555N566O486O205N379N823P584Q641P742O010N093N073M940M308L585
53543I88990L047K661K667L433M686N653O149O838P960Q558P649N890N048N865
53529A065094P341Q355R047J0049J1308J2533J4022J5975J7521J7698J7085J7205
53517A223233J8380J9537K0217K1309K3341K5416K6703K7817K9767L2307L4249
53506A502276L4920L4519L3595L2903L3343L5243L7910M0470M2742M4930M6857
53495A919708M8159M8843M9103M8973M8662M8704M9182M9290M8286M6535M5134
53484B450579M4799M5558M6877M7673M6924M4872M2944M1871M0811L9125L7815
53473B929848L7996L8802L8398L6452L4051L1706K9219K7105K6206K5760K3753
$$ plain form
53462 3279296 3298968 3314157 3325855 3334571 3339997 3342119 3341502 3338585 3333698 3327408 3319662 3308854 3293146
53449 3293146 3272850 3250215 3226647 3201365 3173108 3141897 3108522 3073455 3037100 3000165 2962737
53438 2962737 2923609 2881660 2837837 2794946 2755215 2718300 2681753 2643398 2603446 2564296 2528032
53427 2528032 2494347 2461450 2428756 2397674 2369591 2344260 2320670 2298606 2278603 2261223 2247112
53416 2247112 2236900 2230054 2224617 2219422 2216026 2217087 2223031 2231835 2242116 2254735 2270762 2289435 2309300
53403 2309300 2330545 2355013 2384307 2418872 2458549 2502773 2550067 2598453 2647157 2697532 2751680
53392 2751680 2810304 2872434 2937207 3005139 3077181 3153048 3231409 3311682 3394641 3480828 3569290
53381 3569290 3658706 3749179 3841788 3936638 4032422 4127887 4222679 4316487 4408447 4497963 4585303
$$ packed form
53462C279296J9672J5189J1698Q716N426K122o17k917m887o290p746j0808j5708
53449C293146k0296k2635k3568k5282k8257l1211l3375l5067l6355l6935l7428
53438B962737l9128m1949m3823m2891l9731l6915l6547l8355l9952l9150l6264
53427B528032l3685l2897l2694l1082k8083k5331k3590k2064k0003j7380j4111
53416B247112j0212o846n437n195l396J061N944Q804J0281J2619J6027J8673J9865
53403B309300K1245K4468K9294L4565L9677M4224M7294M8386M8704N0375N4148
53392B751680N8624O2130O4773O7932P2042P5867P8361Q0273Q2959Q6187Q8462
53381C569290Q9416R0473R2609R4850R5784R5465R4792R3808R1960Q9516Q7340
$$ plain form
53370 4585303 4670729 4753591 4832908 4908346 4979898 5046931 5108342 5163582 5213048 5257422 5296862
53359 5296862 5330753 5358009 5377886 5390813 5398207 5401143 5399285 5391140 5375119 5350405 5317604 5278905
53347 5278905 5236823 5192006 5142698 5087043 5025496 4960196 4892407 4821656 4747342 4670104 4591257
53336 4591257 4511626 4431408 4350731 4269998 4189737 4110232 4031251 3952400 3874008 3797312 3723291
53325 3723291 3651687 3581785 3513752 3448410 3386040 3326448 3269999 3217285 3167603 3119185 3071515
53314 3071515 3026241 2984882 2946619 2909506 2873330 2840028 2811244 2786409 2763445 2740871 2719091
53303 2719091 2700016 2685565 2676325 2671460 2669705 2670009 2671356 2672815 2674373 2677236 2682674 2690782 2700898
53290 2700898 2712974 2727775 2745811 2766755 2790029 2815395 2842692 2871457 2901235 2932123 2964605
$$ packed form
53370D585303Q5426Q2862P9317P5438P1552O7033O1411N5240M9466M4374L9440
53359E296862L3891K7256J9877J2927P394K936j858q145j6021k4714l2801l8699
53347E278905m2082m4817m9308n5655o1547o5300o7789p0751p4314p7238p8847
53336D591257p9631q0218q0677q0733q0261p9505p8981p8851p8392p6696p4021
53325C723291p1604o9902o8033o5342o2370n9592n6449n2714m9682m8418m7670
53314C071515m5274m1359l8263l7113l6176l3302k8784k4835k2964k2574k1780
53303B719091j9075j4451r240m865j755L04J347J459J558K863N438Q108J0116
53290B700898J2076J4801J8036K0944K3274K5366K7297K8765K9778L0888L2482
$$ plain form
53279 2964605 2998743 3033658 3068140 3101931 3136167 3172118 3209418 3246002 3279974 3311148 3340532
53268 3340532 3368814 3395905 3421515 3445344 3466681 3484561 3498805 3510546 3521276 3531319 3539447
53257 3539447 3544103 3544945 3543034 3539426 3533811 3524951 3512413 3497287 3480735 3462218 3439798 3412280 3380729
53244 3380729 3347696 3315132 3283088 3250198 3215204 3177926 3138919 3098608 3057205 3015413 2974526
53233 2974526 2935392 2897530 2859798 2821808 2784178 2747367 2710874 2673960 2636856 2600752 2566527
53222 2566527 2533816 2501489 2468745 2435509 2401998 2368370 2334837 2301730 2269312 2237770 2207249
53211 2207249 2177316 2146412 2112802 2076642 2040331 2005995 1973208 1940063 1905861 1871468 1837393
53200 1837393 1803110 1768491 1734449 1701557 1669098 1636158 1602777 1569435 1536246 1503225 1470508
$$ packed form
53279B964605L4138L4915L4482L3791L4236L5951L7300L6584L3972L1174K9384
53268C340532K8282K7091K5610K3829K1337J7880J4244J1741J0730J0043Q128
53257C539447M656Q42j911l608n615q860j2538j5126j6552j8517k2420k7518l1551
53244C380729l3033l2564l2044l2890l4994l7278l9007m0311m1403m1792m0887
53233B974526l9134l7862l7732l7990l7630l6811l6493l6914l7104l6104l4225
53222B566527l2711l2327l2744l3236l3511l3628l3533l3107l2418l1542l0521
53211B207249k9933l0904l3610l6160l6311l4336l2787l3145l4202l4393l4075
53200A837393l4283l4619l4042l2892l2459l2940l3381l3342l3189l3021l2717
$$ plain form
53189 1470508 1437670 1403675 1368270 1332632 1297779 1263113 1227627 1192032 1158476 1128245 1100625
53178 1100625 1073997 1047366 1020807 994997 970395 946729 923493 900953 879969 860553 841514
53167 841514 822094 803006 785010 767413 749077 730182 711770 694168 677249 661762 648723
53156 648723 637469 625858 612716 599000 586275 575099 565191 556272 548341 541763 537133 534318 531769
53143 531769 527761 522399 517340 513422 509646 504781 498868 492697 486704 481059 476213 472790 471226 471664
53129 471664 473745 476508 479130 481671 484468 487008 488398 488767 489014 489154 488333 486712 485887 486753 488177 488518
53113 488518 487312 484770 480802 475509 469621 463445 456284 447909 439647 432733 426350 418722 409718 400944
53099 400944 393496 387002 380954 375676 371505 367962 364288 360210 355763 350863 345545 340394 336200 333032
$$ packed form
53189A470508l2838l3995l5405l5638l4853l4666l5486l5595l3556l0231k7620
53178A100625k6628k6631k6559k5810k4602k3666k3236k2540k0984j9416j9039
53167H41514j9420j9088j7996j7597j8336j8895j8412j7602j6919j5487j3039
53156F48723j1254j1611j3142j3716j2725j1176r908q919p931o578m630k815k549
53143E31769m008n362n059l918l776m865n913o171n993n645m846l423j564M38
53129D71664K081K763K622K541K797K540J390L69K47J40q21j621q25Q66J424L41
53113D88518j206k542l968n293n888o176p161q375q262o914o383p628r004q774
53099D00944p448o494o048n278m171l543l674m078m447m900n318n151m194l168
$$ plain form
53085 333032 329935 325878 321056 316818 314024 311934 309312 306234 303816 302309 300569 297619 293656 289237
53071 289237 284630 280476 277844 276800 275893 273928 271343 269070 267125 265410 264664 265181 265476 264026 261746
53056 261746 260889 261703 262108 260803 258797 257421 256595 255952 256127 257657 259623 260666 260852 261262 261970 261561 258961
53039 258961 255078 252104 251307 251846 252001 251478 251941 254937 259697 263652 264983 264002 262161 260586 259759 259742
53023 259742 260189 260603 260954 261616 262450 262507 261173 259196 257993 258107 258863 259475 259962 260820 262228 263981 266082
53006 266082 268910 272507 275973 278103 278702 278706 278801 278508 277224 275662 275468 277520 281311 285909 290768 295486
52990 295486 299669 303447 307526 312192 316661 319932 322094 324374 328005 333325 339819 346618 352920 358253
52976 358253 362641 366530 370370 374102 377127 379032 380346 382099 384333 385467 383750 379302 374273 370959
$$ packed form
53085C33032l097m057m822m238k794k090k622l078k418j507j740k950l963m419
53071B89237m607m154k632j044r07j965k585k273j945j715p46N17K95j450k280
53056B61746q57Q14M05j305k006j376q26o43J75J530J966J043J86M10P08m09k600
53039B58961l883k974p97N39J55n23M63K996M760L955J331r81j841j575q27j7
53023B59742M47M14L51O62Q34N7j334j977j203J14P56O12M87Q58J408J753K101
53006B66082K828L597L466K130N99MR5k93j284j562j94K052L791M598M859M718
52990B95486M183L778M079M666M469L271K162K280L631N320O494O799O302N333
52976C58253M388L889L840L732L025J905J314J753K234J134j717m448n029l314
$$ plain form
52962 370959 370076 370731 371503 371351 369989 367823 365561 363749 362591 361955 361424 360566 359454 358679 358525 358390 357538
52945 357538 356205 355357 355456 356126 357076 358627 360996 363612 365527 366293 366264 366243 366897 368220 369531 370229 370527
52928 370527 371107 372208 373519 374846 376244 377572 378664 379968 382162 385007 387442 389064 390524 391985
52914 391985 392262 390401 387314 384882 383966 384179 384994 385878 385839 384312 382536 382729 385504 389134 391681 392833
52898 392833 393201 392937 391916 390541 389454 388834 388698 389436 391228 393235 394211 393773 392412 390511 388222 386261
52882 386261 385789 387259 389963 392859 395129 396037 395290 393921 393811 395619 397912 399028 399193 400037 402566 406442
52866 406442 410785 414742 417581 419170 420327 421989 424235 426724 429599 432998 436166 438318 440134 443015
52852 443015 446913 450409 453061 456017 459814 463249 465260 466350 467028 466332 463388 459383 456310 454417 452386
$$ packed form
52962C70959q83O55P72j52j362k166k262j812j158o36n31q58j112p75j54j35q52
52945C57538j333q48R9O70R50J551K369K616J915P66k9k1O54J323J311O98K98
52928C70527N80J101J311J327J398J328J092J304K194K845K435J622J460J461
52914C91985K77j861l087k432r16K13Q15Q84l9j527j776J93K775L630K547J152
52898C92833L68k64j021j375j087o20j36P38J792K007R76m38j361j901k289j961
52882C86261m72J470K704K896K270R08p47j369j10J808K293J116J65Q44K529L876
52866D06442M343L957K839J589J157J662K246K489K875L399L168K152J816K881
52852D43015L898L496K652K956L797L435K011J090O78o96k944m005l073j893k031
$$ plain form
52837 452386 449580 446639 444162 442143 440567 439264 437299 433719 428939 424379 420854 418195 416020 413683
52823 413683 409905 404088 397855 393627 391524 389340 385868 382380 380151 378307 375288 371053 366499 361765
52809 361765 356554 351479 347672 345296 343473 341577 339735 338166 336695 334862 332153 328424 324495 321791
52795 321791 320736 319895 317392 312943 307961 303930 301318 299772 298627 297196 295184 292984 291308 290409 289678
52780 289678 287939 284277 279046 274014 270820 269162 267223 264071 260687 258234 256467 254691 253238 252730
52766 252730 252621 251874 250693 250072 249739 248108 244572 240402 236757 233055 228312 223259 219870 218977 219295 218905
52750 218905 217091 214516 212047 209836 207499 204901 202466 200623 199208 197598 195431 192964 190763 189323
52736 189323 189023 190086 192230 194367 194965 193197 189897 187109 186309 187068 187791 187655 187324 187737 188847 189977
$$ packed form
52837D52386k806k941k477k019j576j303j965l580m780m560l525k659k175k337
52823D13683l778n817o233m228k103k184l472l488k229j844l019m235m554m734
52809C61765n211n075l807k376j823j896j842j569j471j833k709l729l929k704
52795C21791j055q41k503m449m982m031k612j546j145j431k012k200j676q99p31
52780B89678j739l662n231n032l194j658j939l152l384k453j767j776j453n08
52766B52730j09p47j181o21l33j631l536m170l645l702m743n053l389q93L18l90
52750B18905j814k575k469k211k337k598k435j843j415j610k167k467k201j440
52736A89323l00J063K144K137N98j768l300k788q00P59P23j36l31M13J110J130
$$ plain form
52720 189977 190929 192177 194133 196643 199161 201140 202320 202830 202981 202959 202962 203563 205364 208148 210868 212765
52704 212765 214019 215135 216271 217477 218786 219608 218879 216534 214108 212972 212592 211458 209106 206027 202228
52689 202228 197449 192582 189238 187620 186282 184409 182941 182858 183535 183603 182428 180077 176801 173388 171131
52674 171131 170454 170230 169306 167974 166972 165897 163940 161688 160582 160640 160149 157984 155021 152842 152018 152149
52658 152149 152655 152839 151902 149759 147479 146206 145831 145263 143810 141785 139890 138474 137401 136262 134717
52643 134717 132876 131329 130598 130702 131417 132680 134362 135937 136917 137573 138674 140423 142136 143105 143404 143691
52627 143691 144707 147031 150727 154709 156954 156074 152738 149118 146904 146095 145592 144521 142932 141606 141399
52612 141399 142653 145022 147748 150034 151269 151341 150967 151295 152771 154521 155287 154828 154036 153881 154725 156493
$$ packed form
52720A89977R52J248J956K510K518J979J180N10J51k2LO01J801K784K720J897
52704B12765J254J116J136J206J309Q22p29k345k426j136l80j134k352l079l799
52689B02228m779m867l344j618j338j873j468q3O77O8j175k351l276l413k257
52674A71131o77k24r24j332j002j075j957k252j106N8m91k165k963k179q24J31
52658A52149N06J84r37k143k280j273l75n68j453k025j895j416j073j139j545
52643A34717j841j547p31J04P15J263J682J575R80O56J101J749J713R69K99K87
52627A43691J016K324L696L982K245q80l336l620k214q09n03j071j589j326k07
52612A41399J254K369K726K286J235P2l74L28J476J750P66m59p92j55Q44J768
$$ plain form
52596 156493 158913 161541 164065 166563 168991 170547 170240 168169 165421 162630 159545 156397 154649 155543 158568
52581 158568 162222 165888 169995 174628 178947 182086 183942 185060 186380 188992 193263 197981 201145 202056
52567 202056 202153 203409 206382 210215 213950 217149 219597 221390 223418 226950 232179 237634 241525 243454 244392
52552 244392 245274 246345 247756 249899 252767 255711 258425 261546 265508 269189 270687 269505 267172 265564
52538 265564 265310 265909 266666 267106 267068 266820 266800 266998 266968 266546 266137 266234 267142 269191 272409 275821 277945 278495 278875
52519 278875 280496 283241 286096 288508 290420 291600 291809 291341 290737 290268 290128 290548 291098 290502 288041 284763
52503 284763 282484 281857 282125 282280 281608 279519 275966 272016 269194 268190 268604 269615 270307 269932 268697 267846
52487 267846 268049 268319 267556 266531 266950 269023 271504 273941 277191 281578 286106 289708 291950 292431 291200
$$ packed form
52596A56493K420K628K524K498K428J556l07k071k748k791l085l148j748Q94L025
52581A58568L654L666M107M633M319L139J856J118J320K612M271M718L164R11
52567B02056R7J256K973L833L735L199K448J793K028L532N229N455L891J929R38
52552B44392Q82J071J411K143K868K944K714L121L962L681J498j182k333j608
52538B65564k54N99P57M40l8k48k0J98l0m22m09R7R08K049L218L412K124N50L80
52519B78875J621K745K855K412J912J180K09m68o04m69j40M20N50n96k461l278
52503B84763k279o27K68J55o72k089l553l950k822j004M14J011O92l75j235q51
52487B67846K03K70p63j025M19K073K481K437L250M387M528L602K242M81j231
$$ plain form
52472 291200 289984 291109 294580 297975 299970 302130 306118 310905 314267 315610 315678 314684 312567 310294 309052
52457 309052 308651 308383 308956 311776 316461 320926 324021 326499 329044 331004 331706 331694 331823 332067 332080 332136 332673
52440 332673 333353 333411 332778 332297 332940 335087 338318 341463 343128 342756 341376 340829 341940 343539 343716 342045
52424 342045 340153 339784 340769 341472 340825 338977 336068 331688 326100 320898 317424 315187 312763 309799 307146
52409 307146 305376 304259 303612 303586 304010 304267 304052 303566 302848 301573 299753 298132 297698 299011 301821 304839
52393 304839 306228 305224 303288 302795 304415 306559 307517 307287 307024 307634 309374 312043 314887 316926 318023
52378 318023 319210 321411 324434 327777 331751 336816 342193 346273 348417 349347 349670 349064 347509 346478 348013
52363 348013 352867 360220 368865 377893 386272 392867 397491 401456 406315 412223 418060 423074 427717 432729
$$ packed form
52472B91200j216J125L471L395J995K160L988M787L362J343O8r94k117k273j242
52457C09052m01k68N73K820M685M465L095K478K545J960P02j2J29K44J3N6N37
52440C32673O80N8o33m81O43K147L231L145J665l72j380n47J111J599J77j671
52424C42045j892l69R85P03o47j848k909m380n588n202l474k237k424k964k653
52409C07146j770j117o47k6M24K57k15m86p18j275j820j621m34J313K810L018
52393C04839J389j004j936m93J620K144R58k30k63O10J740K669K844K039J097
52378C18023J187K201L023L343L974N065N377M080K144R30L23o06j555j031J535
52363C48013M854P353Q645R028Q379O595M624L965M859N908N837N014M643N012
$$ plain form
52349 432729 437960 442548 446005 448805 452057 456790 463266 470693 477727 483551 488412 493016 497610 501851
52335 501851 505278 507666 509174 510492 512733 516892 523433 532307 542798 553154 561216 566345 570465 576304
52321 576304 584571 593533 601253 607453 613140 619416 627106 636687 647750 658958 669247 679020 689672
52308 689672 702085 716058 731139 747362 764893 783359 802071 820887 840464 861544 884349
52297 884349 908940 935737 964905 995328 1025159 1053861 1082989 1114265 1147366 1180483 1212707
52286 1212707 1244966 1278520 1313386 1348448 1382587 1415507 1447912 1480896 1514655 1547840 1578775
52275 1578775 1607428 1635450 1664162 1693155 1721034 1746812 1770241 1791450 1810839 1828929 1845872
52264 1845872 1861295 1874683 1885601 1893672 1899153 1903576 1908770 1914760 1919545 1921557 1921456 1920755 1919649 1917481
$$ packed form
52349D32729N231M588L457K800L252M733O476P427P034N824M861M604M594M241
52335E01851L427K388J508J318K241M159O541Q874J0491J0356Q062N129M120N839
52321E76304Q267Q962P720O200N687O276P690R581J1063J1208J0289R773J0652
52308F89672J2413J3973J5081J6223J7531J8466J8712J8816J9577K1080K2805
52297H84349K4591K6797K9168L0423K9831K8702K9128L1276L3101L3117L2224
52286A212707L2259L3554L4866L5062L4139L2920L2405L2984L3759L3185L0935
52275A578775K8653K8022K8712K8993K7879K5778K3429K1209J9389J8090J6943
52264A845872J5423J3388J0918Q071N481M423N194N990M785K012j01p01j106k168
$$ plain form
52250 1917481 1914799 1913541 1915123 1919381 1925472 1932913 1941628 1951813 1964036 1978739 1995388 2012586 2029254
52237 2029254 2045274 2060998 2076806 2093321 2111328 2131061 2151946 2173326 2195009 2216835 2238187
52226 2238187 2258422 2277500 2295689 2312765 2327949 2340733 2351455 2360832 2369011 2375308 2378983 2380106
52214 2380106 2379366 2377228 2373733 2369107 2363780 2357387 2348508 2336187 2321318 2305688 2290015 2273936 2257562
52201 2257562 2241577 2225510 2207453 2186457 2164295 2143768 2125788 2109129 2092631 2076392 2060808
52190 2060808 2045656 2030779 2017008 2005557 1996506 1988321 1979116 1968329 1957049 1946690 1937610 1929221
52178 1929221 1921136 1913577 1906623 1899830 1893150 1887617 1884225 1882252 1879538 1874753 1868781 1863447 1859219 1854772
52164 1854772 1848721 1841208 1833449 1826256 1819693 1814125 1810639 1809706 1809960 1809205 1806586 1802961 1799268 1795510 1791461
$$ packed form
52250A917481k682j258J582M258O091P441Q715J0185J2223J4703J6649J7198J6668
52237B029254J6020J5724J5808J6515J8007J9733K0885K1380K1683K1826K1352
52226B238187K0235J9078J8189J7076J5184J2784J0722R377Q179O297L675J123
52214B380106p40k138l495m626n327o393q879j2321j4869j5630j5673j6079j6374
52201B257562j5985j6067j8057k0996k2162k0527j7980j6659j6498j6239j5584
52190B060808j5152j4877j3771j1451r051q185r205j0787j1280j0359r080q389
52178A929221q085p559o954o793o680n533l392j973k714m785n972n334m228m447
52164A854772o051p513p759p193o563n568l486r33K54p55k619l625l693l758m049
$$ plain form
52149 1791461 1787139 1782004 1774870 1765571 1755855 1747507 1740253 1732704 1724734 1717330 1710443 1702789 1694083 1685759
52135 1685759 1678834 1672372 1664916 1656322 1647358 1638591 1630662 1624605 1620578 1616959 1612035 1606129 1600758 1596126
52121 1596126 1591018 1585206 1580323 1577823 1577247 1577213 1577259 1578081 1580574 1585195 1591717 1599087 1606081 1612614 1619939
52106 1619939 1629099 1639742 1651079 1663508 1678422 1696522 1717085 1739007 1762065 1787020 1814780
52095 1814780 1845477 1878123 1911255 1944116 1977081 2010661 2044475 2077781 2110793 2144693 2180199
52084 2180199 2216740 2253218 2288923 2323313 2355583 2385244 2412857 2439397 2464792 2487811 2507585
52073 2507585 2524645 2539943 2553340 2563754 2570600 2574369 2575737 2574920 2572213 2568356 2563592 2556888 2547057
52060 2547057 2534611 2521636 2509658 2498384 2486774 2474522 2461978 2449282 2436432 2424057 2413378
$$ packed form
52149A791461m322n135p134r299r716q348p254p549p970p404o887p654q706q324
52135A685759o925o462p456q594q964q767p929o057m027l619m924n906n371m632
52121A596126n108n812m883k500n76l4M6Q22K493M621O522P370O994O533P325
52106A619939R160J0643J1337J2429J4914J8100K0563K1922K3058K4955K7760
52095A814780L0697L2646L3132L2861L2965L3580L3814L3306L3012L3900L5506
52084B180199L6541L6478L5705L4390L2270K9661K7613K6540K5395K3019J9774
52073B507585J7060J5298J3397J0414O846L769J368q17k707l857m764o704r831
52060B547057j2446j2975j1978j1274j1610j2252j2544j2696j2850j2375j0679
$$ plain form
52049 2413378 2405260 2399427 2394427 2388311 2379982 2370493 2362684 2358862 2358890 2360983 2363971 2367946 2372946 2378212
52035 2378212 2383197 2388467 2394961 2402777 2411175 2419438 2427223 2434340 2440702 2446516 2452246 2458263 2464494 2470190
52021 2470190 2474109 2475317 2473924 2470739 2466230 2460351 2453396 2446101 2438360 2428650 2415525 2399194 2380794
52008 2380794 2360571 2337904 2312938 2286887 2260340 2232324 2201648 2168417 2133663 2098087 2061823
51997 2061823 2024917 1987163 1947860 1906599 1864369 1823118 1783988 1746390 1708839 1670227 1630156
51986 1630156 1588632 1545971 1502993 1460982 1421190 1384091 1348913 1314186 1279170 1244720 1212265
51975 1212265 1181964 1152419 1122438 1092513 1064157 1038187 1014206 991568 970137 950101 931504
51964 931504 914215 897964 882223 866341 850067 833763 817936 802809 788667 776266 766273 758112
$$ packed form
52049B413378q118n833n000o116q329r489p809l822K8K093K988L975N000N266
52035B378212M985N270O494P816Q398Q263P785P117O362N814N730O017O231N696
52021B470190L919J208j393l185m509n879o955p295p741r710j3125j6331j8400
52008B380794k0223k2667k4966k6051k6547k8016l0676l3231l4754l5576l6264
51997B061823l6906l7754l9303m1261m2230m1251l9130l7598l7551l8612m0071
51986A630156m1524m2661m2978m2011l9792l7099l5178l4727l5016l4450l2455
51975A212265l0301k9545k9981k9925k8356k5970k3981k2638k1431k0036j8597
51964I31504j7289j6251j5741j5882j6274j6304j5827j5127j4142j2401r993q161
$$ plain form
51952 758112 749968 740430 729971 720264 712122 704675 696743 688415 680759 674351 668714 663149 657514 652111
51938 652111 647359 643757 641612 640419 638856 635818 631358 626395 621743 617601 613677 609535 605079 600925
51924 600925 597957 596234 594719 592476 589620 586672 583563 580096 576850 574502 572505 569673 566170 563487
51910 563487 561985 559799 555204 549122 544115 541430 540194 539267 538612 538642 539170 539517 539188 538025 536050 533402
51894 533402 530356 527315 524793 523165 522137 520741 518373 515674 513825 513038 512387 511286 510451 511011 513095
51879 513095 515815 518380 520699 522876 524566 525168 524635 523864 524053 525563 527565 528978 529691 530670 532953 536772
51863 536772 541569 546504 550825 554066 556216 557855 560037 563800 569330 575461 580377 583329 585466 588501
51849 588501 592636 596408 598702 600255 602752 606808 611380 615019 617203 618438 619468 620705 622213 623907
$$ packed form
51952G58112q144r538j0459r707q142p447p932q328p656o408n637n565n635n403
51938F52111m752l602k145j193j563l038m460m963m652m142l924m142m456m154
51924F00925k968j723j515k243k856k948l109l467l246k348j997k832l503k683
51910E63487j502k186m595o082n007k685j236r27o55L0N28L47l29j163j975k648
51894E33402l046l041k522j628j028j396k368k699j849p87o51j101q35N60K084
51879E13095K720K565K319K177J690O02n33p71J89J510K002J413P13R79K283L819
51863E36772M797M935M321L241K150J639K182L763N530O131M916K952K137L035
51849E88501M135L772K294J553K497M056M572L639K184J235J030J237J508J694
$$ plain form
51835 623907 625634 627276 628996 631229 634116 636887 638273 637807 636477 635745 636143 637148 638142 638930 639450 639618
51819 639618 639603 639787 640287 640892 641561 642584 644069 645788 647740 650370 653797 657203 659555 660780 661736 663046
51803 663046 664340 664751 663859 662051 660215 659206 659483 660982 663179 665272 666442 666218 664744 662648 660581
51788 660581 658876 657587 656722 656341 656437 656709 656562 655640 654419 653910 654368 654585 653093 650058 647333 646417 646832
51771 646832 646802 645053 641569 637117 632757 629689 628793 630007 632470 635475 639016 643150 647188 650037 651453
51756 651453 652521 654483 657282 659686 660827 661052 661169 661496 662230 664220 668540 675278 683298 691177 697881
51741 697881 702801 705910 708015 710092 712169 713499 713940 714204 714374 713098 709102 702922 696329 690470 685450
51726 685450 681334 678506 676892 675668 674052 671911 669388 666373 662605 657960 652458 646270 639894 634026
$$ packed form
51835F23907J727J642J720K233K887K771J386m66j330p32L98J005R94P88N20J68
51819F39618j5J84N00O05O69J023J485J719J952K630L427L406K352J225R56J310
51803F63046J294M11q92j808j836j009K77J499K197K093J170k24j474k096k067
51788F60581j705j289q65l81R6K72j47r22j221n09M58K17j492l035k725r16M15
51771F46832l0j749l484m452m360l068q96J214K463L005L541M134M038K849J416
51756F51453J068J962K799K404J141K25J17L27P34J990M320O738Q020P879O704
51741F97881M920L109K105K077K077J330M41K64J70j276l996o180o593n859n020
51726F85450m116k828j614j224j616k141k523l015l768m645n502o188o376n868
$$ plain form
51712 634026 628981 624202 618588 611477 603435 596003 590367 586135 581536 574944 566190 556503 547556 540566
51698 540566 535789 532516 529812 527481 525960 525163 524025 521657 518473 515627 513730 512777 512884 514122 515619
51683 515619 515803 513985 511215 509263 508999 509991 511324 512494 513482 514242 514438 514111 514475 517317 523116 530259
51667 530259 536644 541656 546027 550347 554719 559594 565724 572972 579962 585233 588197 588928 587814 585714
51653 585714 583732 582316 580925 578781 575594 571430 566360 560359 553181 544512 534888 526225 520217 516048
51639 516048 510945 503547 495525 489097 484123 478931 473048 467525 462914 458511 453662 448461 442897 436576
51625 436576 429817 424017 420167 417686 415496 413800 413927 416494 420312 423313 424300 423788 423334 424105 425976
51610 425976 427907 429014 429108 428319 426716 424585 422816 422499 424005 426648 429371 431654 433753 436218 439380
$$ packed form
51712F34026n045m779n614p111q042p432n636m232m599o592q754r687q947o990
51698E40566m777l273k704k331j521p97j138k368l184k846j897r53J07J238J497
51683E15619J84j818k770j952k64R92J333J170R88P60J96l27L64K842N799P143
51667E30259O385N012M371M320M372M875O130P248O990N271K964P31j114k100
51653E85714j982j416j391k144l187m164n070o001p178q669r624q663o008m169
51639E16048n103p398q022o428m974n192n883n523m611m403m849n201n564o321
51625D36576o759n800l850k481k190j696J27K567L818L001R87n12m54P71J871
51610D25976J931J107R4p89j603k131j769l17J506K643K723K283K099K465L162
$$ plain form
51595 439380 443213 447469 451867 456344 461177 466660 472585 478288 483359 488044 492717 497429 502448 508761
51581 508761 517157 526809 535713 542802 548909 555385 562562 569989 577335 584229 589914 594006 597301 600880
51567 600880 604562 607096 607855 607594 607513 608239 609747 611537 612843 613302 613563 614597 616404 618150 619733 622337
51551 622337 627104 633962 642045 650484 658342 664682 669515 674068 679313 684688 689123 692886 697316 702839
51537 702839 708382 712990 717044 721227 724970 726899 726802 726396 727735 731033 734491 736311 736436 736056 735954 736057
51521 736057 736415 737446 738894 739578 738883 737685 736942 736146 734385 732277 731266 731135 729938 726713 722577 718377
51505 718377 712887 704692 694781 685625 678216 671510 664634 658134 652735 648110 643388 638141 632433 626497
51491 626497 620760 615739 611582 608039 604897 601966 598711 594673 590427 587229 585276 583128 579542 575292
$$ packed form
51595D39380L833M256M398M477M833N483N925N703N071M685M673M712N019O313
51581E08761Q396R652Q904P089O107O476P177P427P346O894N685M092L295L579
51567F00880L682K534P59k61q1P26J508J790J306M59K61J034J807J746J583K604
51551F22337M767O858Q083Q439P858O340M833M553N245N375M435L763M430N523
51537G02839N543M608M054M183L743J929r7m06J339L298L458J820J25l80j02J03
51521G36057L58J031J448O84o95j198p43p96j761k108j011j31j197l225m136m200
51505G18377n490q195r911r156p409o706o876o500n399m625m722n247n708n936
51491F26497n737n021m157l543l142k931l255m038m246l198j953k148l586m250
$$ plain form
51477 575292 572357 571646 572214 572549 572033 571238 571297 572929 575797 578950 582081 585848 590512 594889 597532 598724
51461 598724 600457 604488 611092 619513 628613 637011 643611 648517 652741 656696 659701 661357 662547 664331
51447 664331 666461 667866 668254 668286 668280 667655 665997 664054 663167 663873 665316 666020 665140 662946 660164 657028 653284
51430 653284 648935 644425 639750 633869 625638 615297 604661 595707 589109 584013 578949 572916 565856 558245
51416 558245 550419 542439 534419 526495 518406 509745 500946 493441 488240 484715 481441 477921 474847 472849
51402 472849 471801 471331 471375 472130 473969 477291 481793 486010 488415 489077 489377 489960 489960 488674 486960 486174 486252
51385 486252 485605 482617 476864 469416 462333 457147 453144 447777 439515 429696 420772 413413 406497 399284
51371 399284 392134 385244 378250 371272 364950 359063 352450 344866 337733 332314 328221 324506 321088 318028
$$ packed form
51477E75292k935p11N68L35n16p95N9J632K868L153L131L767M664M377K643J192
51461E98724J733M031O604Q421R100Q398O600M906M224L955L005J656J190J784
51447F64331K130J405L88L2oo25j658j943q87P06J443P04q80k194k782l136l744
51430F53284m349m510m675n881q231j0341j0636q954o598n096n064o033p060p611
51416E58245p826p980q020p924q089q661q799p505n201l525l274l520l074j998
51402D72849j048m70M4P55J839L322M502M217K405O62L00N83%j286j714p86P8
51385D86252o47k988n753p448p083n186m003n367q262r819q924p359o916p213
51371C99284p150o890o994o978o322n887o613p584p133n419m093l715l418l060
$$ plain form
51357 318028 314463 309681 304705 301319 299637 297979 295142 291610 288393 285836 283963 282952 282631 282207 281113
51342 281113 279687 278545 277638 276381 274508 272482 271228 271635 273983 277586 281188 283842 285336 285874 285775
51327 285775 285607 286085 287532 289651 292025 294634 297771 301663 306253 311185 316145 321482 328150 336431 344949
51312 344949 351880 357128 362250 368026 373297 376809 378990 380851 382088 381665 379883 378447 378397 378973 378679
51297 378679 376652 372912 368095 363146 358603 354023 348568 342138 335319 328448 321610 315511 311143 308190
51283 308190 304873 300063 294747 290645 288041 285862 283339 280588 277674 274177 269936 265621 262252 260462
51269 260462 260229 260871 261176 260049 257435 254449 252322 251293 250794 250498 250769 251917 253501 254836 256073 258217
51253 258217 261922 266642 271145 274513 276501 277479 278343 279861 281521 281638 279451 276611 275427 275868 275653
$$ packed form
51357C18028l565m782m976l386j682j658k837l532l217k557j873j011l21m24j094
51342B81113j426j142r07j257j873k026j254M07K348L603L602K654J494N38r9
51327B85775j68M78J447K119K374K609L137L892M590M932M960N337O668Q281Q518
51312C44949O931N248N122N776N271L512K181J861J237m23j782j436n0N76k94
51297C78679k027l740m817m949m543m580n455o430o819o871o838o099m368k953
51283C08190l317m810n316m102k604k179k523k751k914l497m241m315l369j790
51269B60462k33O42L05j127k614k986k127j029m99k96K71J148J584J335J237K144
51253B58217L705M720M503L368J988R78Q64J518J660J17k187k840j184M41k15
$$ plain form
51238 275653 273472 270643 269100 269099 269837 271118 273099 275182 276617 277749 279266 280386 279411 276361 273641
51223 273641 273363 275087 276974 278248 279393 280488 280758 279925 278885 278452 278161 277094 275562 275042 276316 278381
51207 278381 279629 279555 278731 277575 276104 274944 275470 278217 281677 283438 282490 279962 277755 276970 277585 278995
51191 278995 280469 281344 281294 280625 280248 281088 283192 285519 286921 287379 287851 288810 289414 288517 286208 283902 282946
51174 282946 283317 283649 282467 279652 276682 275095 274760 274273 273104 272389 273130 274607 275472 275549 275349 274456 271996
51157 271996 268644 266448 266176 266167 264582 261708 259156 257589 256382 255118 254363 254850 256607 259003 261251 262752
51141 262752 263244 262700 261119 258691 256157 254544 254183 254416 254648 255272 256948 259240 260821 261126 261217 262716
51125 262716 266229 271046 276002 280269 283495 285694 287179 288326 289143 289216 288430 287651 288162 290122 292074 292481
$$ packed form
51238B75653k181k829j543jP38J281J981K083J435J132J517J120r75l050k720
51223B73641k78J724J887J274J145J095K70q33j040m33k91j067j532n20J274K065
51207B78381J248p4q24j156j471j160N26K747L460J761r48k528k207p85O15J410
51191B78995J474Q75n0o69l77Q40K104K327J402M58M72R59O04q97k309k306r56
51174B82946L71L32j182k815k970j587l35m87j169p15P41J477Q65P7k00q93k460
51157B71996l352k196k72rj585k874k552j567j207j264p55M87J757K396K248J501
51141B62752M92n44j581k428k534j613l61K33K32O24J676K292J581L05R1J499
51125B62716L513M817M956M267L226K199J485J147Q17P3p86p79N11J960J952M07
$$ plain form
51109 292481 291452 290284 289582 288777 287566 286803 287295 288480 289106 288814 288309 288204 288506 289260 290890 293649 297209
51092 297209 301010 304625 307524 308927 308444 306854 305876 306881 309723 312832 314458 313925 311920 309920 309469
51077 309469 311556 315961 321117 325203 327710 329585 331678 333668 334958 336032 338012 341062 344053 345931
51063 345931 346715 346969 346914 346425 345501 344411 343618 343687 344949 347089 349460 352011 355484 360344 365914 371042
51047 371042 375365 379477 383942 388641 393147 397410 401834 406758 411789 415710 417364 416998 416530 418033 421838
51032 421838 426310 429414 430183 428937 426758 425033 424879 426402 428682 430943 433551 437278 441581 444441 444483
51017 444483 442921 442614 445067 448923 451855 453419 455394 459432 465300 471727 478274 485586 494188 503879
51003 503879 514209 524750 534751 543437 551102 559229 568919 579703 590566 601625 613913 627755
$$ packed form
51109B92481j029j168p02q05j211p63M92J185O26k92n05j05L02P54J630K759L560
51092B97209L801L615K899J403m83j590r78J005K842L109J626n33k005k000m51
51077C09469K087M405N156M086K507J875K093J990J290J074J980L050K991J878
51063C45931P84K54n5m89r24j090p93O9J262K140K371K551L473M860N570N128
51047C71042M323M112M465M699M506M263M424M924N031L921J654l66m68J503L805
51032D21838M472L104P69j246k179j725j54J523K280K261K608L727M303K860M2
51017D44483j562l07K453L856K932J564J975M038N868O427O547P312Q602R691
51003E03879J0330J0541J0001Q686P665Q127R690J0784J0863J1059J2288J3842
$$ plain form
50991 627755 642406 657309 672709 688856 705680 723863 745276 771330 801314 833339 866759
50980 866759 902796 942851 987133 1035248 1087314 1143786 1204591 1269138 1337295 1409902 1488019
50969 1488019 1571782 1660233 1752409 1848456 1949297 2055010 2163675 2272066 2377525 2479112
50959 2479112 2577137 2671851 2762602 2848058 2927171 2999802 3066106 3125242 3175304 3215115 3245807
50948 3245807 3269976 3289353 3303934 3313316 3317902 3318388 3314818 3306804 3294249 3277263 3255794 3230110
50936 3230110 3201421 3171107 3139123 3103775 3063301 3017065 2965004 2906751 2842183 2772572 2700169
50925 2700169 2626373 2550883 2473045 2393475 2313786 2235047 2157427 2081416 2008448 1939662 1874475
50914 1874475 1811169 1748868 1688343 1630922 1577224 1527247 1481165 1439527 1402812 1371019 1343467
$$ packed form
50991F27755J4651J4903J5400J6147J6824J8183K1413K6054K9984L2025L3420
50980H66759L6037M0055M4282M8115N2066N6472O0805O4547O8157P2607P8117
50969A488019Q3763Q8451R2176R6047J00841J05713J08665J08391J05459J01587
50959B479112R8025R4714R0751Q5456P9113P2631O6304N9136N0062L9811L0692
50948C245807K4169J9377J4581R382M586M86l570q014j2555j6986k1469k5684
50936C230110k8689l0314l1984l5348m0474m6236n2061n8253o4568o9611p2403
50925B700169p3796p5490p7838p9570p9689p8739p7620p6011p2968o8786o5187
50914A874475o3306o2301o0525n7421n3698m9977m6082m1638l6715l1793k7552
$$ plain form
50903 1343467 1318744 1295198 1272100 1250454 1232232 1218480 1208305 1199853 1192094 1185413 1180624 1177905
50891 1177905 1176878 1177310 1179250 1182545 1186742 1191682 1197878 1205953 1215833 1226742 1237953 1249369 1261445
50878 1261445 1274736 1289469 1305525 1322910 1342272 1364715 1391006 1421227 1455202 1492789 1533546
50867 1533546 1576747 1622391 1671906 1727228 1789451 1858906 1936164 2022110 2117223 2221861 2337288
50856 2337288 2465405 2607133 2761924 2929112 3108692 3300279 3502307 3713087 3931703
50847 3931703 4156844 4385365 4613201 4837488 5056824 5269667 5473555 5665914 5844690
50838 5844690 6007981 6153929 6281309 6389716 6479079 6549789 6603546 6643226 6671237 6688410
50828 6688410 6694884 6691526 6679862 6660942 6635018 6602239 6563068 6517877 6466548 6408535 6342903 6268218
$$ packed form
50903A343467k4723k3546k3098k1646j8222j3752j0175q452p759o681m789k719
50891A177905j027M32J940L295M197M940O196Q075R880J0909J1211J1416J2076
50878A261445J3291J4733J6056J7385J9362K2443K6291L0221L3975L7587M0757
50867A533546M3201M5644M9515N5322O2223O9455P7258Q5946R5113J04638J15427
50856B337288J28117J41728J54791J67188J79580J91587K02028K10780K18616
50847C931703K25141K28521K27836K24287K19336K12843K03888J92359J78776
50838E844690J63291J45948J27380J08407Q9363P0710N3757L9680K8011J7173
50828F688410O474l358j1664j8920k5924l2779l9171m5191n1329n8013o5632p4685
$$ plain form
50816 6268218 6182948 6086387 5978968 5861241 5732758 5592632 5441355 5281490 5116109 4946827
50806 4946827 4773887 4597958 4421208 4246486 4076009 3911059 3752473 3600946 3457064
50797 3457064 3321443 3194787 3077613 2969980 2871592 2782052 2700892 2627604 2561800 2503254
50787 2503254 2451715 2406863 2368382 2335693 2307543 2282317 2259054 2237875 2219201 2202883 2188163
50776 2188163 2174021 2159340 2143370 2126433 2109660 2093514 2077107 2059511 2041226 2023579 2007037
50765 2007037 1990901 1974429 1957530 1940506 1923905 1908538 1895013 1883380 1873857 1867543 1865463 1867124
50753 1867124 1871190 1877708 1888536 1905258 1927639 1954579 1985703 2021542 2062968 2111000 2166443 2229050
50741 2229050 2297658 2371806 2452661 2541704 2638994 2743366 2853796 2969655 3089962 3213450
$$ packed form
50816F268218q5270r6561j07419j17727j28483j40126j51277j59865j65381j69282
50806D946827j72940j75929j76750j74722j70477j64950j58586j51527j43882
50797C457064j35621j26656j17174j07633r8388q9540q1160p3288o5804n8546
50787B503254n1539m4852l8481l2689k8150k5226k3263k1179j8674j6318j4720
50776B188163j4142j4681j5970j6937j6773j6146j6407j7596j8285j7647j6542
50765B007037j6136j6472j6899j7024j6601j5367j3525j1633r523o314k080J661
50753A867124M066O518J0828J6722K2381K6940L1124L5839M1426M8032N5443O2607
50741B229050O8608P4148Q0855Q9043R7290J04372J10430J15859J20307J23488
$$ plain form
50731 3213450 3339462 3467981 3598342 3728249 3854308 3973503 4084251 4186210 4279012 4361110
50721 4361110 4430263 4485338 4527297 4557945 4577981 4586866 4584432 4572046 4551998 4526293 4496373 4463729
50709 4463729 4430088 4396534 4362509 4326198 4286323 4243343 4198464 4151753 4101867 4047493 3988059
50698 3988059 3922945 3851119 3772388 3688272 3600751 3510563 3417459 3321756 3224741 3127806 3032173
50687 3032173 2939481 2851636 2769712 2693511 2622563 2557137 2498076 2446043 2401257 2363751 2333627
50676 2333627 2311026 2295863 2287574 2285328 2288579 2297193 2310867 2328889 2350742 2376465 2405853 2437748
50664 2437748 2470887 2505140 2541008 2577920 2613923 2647295 2677859 2706637 2734935 2763881 2793928
50653 2793928 2824330 2853785 2882166 2911170 2942808 2977706 3015324 3055194 3097211 3141042 3186229
$$ packed form
50731C213450J26012J28519J30361J29907J26059J19195J10748J01959R2802Q2098
50721D361110O9153N5075M1959L0648K0036Q885k434j2386k0048k5705k9920l2644
50709D463729l3641l3554l4025l6311l9875m2980m4879m6711m9886n4374n9434
50698C988059o5114p1826p8731q4116q7521r0188r3104r5703r7015r6935r5633
50687C032173r2692q7845q1924p6201p0948o5426n9061n2033m4786l7506l0124
50676B333627k2601j5163q289k246L251Q614J3674J8022K1853K5723K9388L1895
50664B437748L3139L4253L5868L6912L6003L3372L0564K8778K8298K8946L0047
50653B793928L0402K9455K8381K9004L1638L4898L7618L9870M2017M3831M5187
$$ plain form
50642 3186229 3232940 3281939 3333447 3386396 3439147 3490803 3541528 3591470 3639656 3684398 3724861
50631 3724861 3761694 3795532 3825276 3848812 3865611 3877667 3887405 3895469 3901256 3904897 3907488 3909557
50619 3909557 3910413 3909433 3907291 3905547 3905369 3906827 3908956 3910200 3909250 3905960 3901253 3895756 3888569 3877690 3861570
50604 3861570 3839812 3812352 3778554 3737614 3689699 3635988 3577279 3512980 3442019 3364656 3282890
50593 3282890 3199005 3114223 3028877 2943302 2857976 2773169 2689161 2606818 2527438 2451844 2379961
50582 2379961 2311436 2246359 2185212 2128316 2075612 2026945 1982463 1942682 1908191 1879247 1855636
50571 1855636 1836853 1822335 1811634 1804663 1801811 1803559 1809884 1820397 1835117 1854425 1877824 1903551
50559 1903551 1930538 1960421 1996340 2039488 2087899 2138995 2192142 2247860 2305653 2364203 2423496
$$ packed form
50642C186229M6711M8999N1508N2949N2751N1656N0725M9942M8186M4742M0463
50631C724861L6833L3838K9744K3536J6799J2056R738Q064N787L641K591K069
50619C909557Q56r80k142j744j78J458K129J244r50l290m707n497p187j0879j6120
50604C861570k1758k7460l3798m0940m7915n3711n8709o4299p0961p7363q1766
50593C282890q3885q4782q5346q5575q5326q4807q4008q2343p9380p5594p1883
50582B379961o8525o5077o1147n6896n2704m8667m4482l9781l4491k8944k3611
50571A855636j8783j4518j0701o971k852J748O325J0513J4720J9308K3399K5727
50559A903551K6987K9883L5919M3148M8411N1096N3147N5718N7793N8550N9293
$$ plain form
50548 2423496 2485378 2551594 2622026 2695064 2768955 2842572 2915779 2989779 3066638 3147766 3232835
50537 3232835 3320479 3409890 3501499 3596458 3695876 3800452 3910364 4025395 4145262 4269718
50527 4269718 4398186 4529519 4662417 4795948 4929357 5061457 5190537 5314806 5432540
50518 5432540 5541690 5639771 5724558 5795065 5851842 5895950 5927293 5943871 5943221 5924976 5891820
50507 5891820 5847579 5794659 5733706 5665307 5591109 5513185 5433161 5352486 5273225 5198095 5129673
50496 5129673 5069529 5017869 4973991 4937200 4907000 4881987 4859013 4834558 4807072 4777019 4744343
50485 4744343 4706951 4662398 4610020 4550257 4482522 4405094 4317026 4219007 4112398 3998575 3879448
50474 3879448 3757485 3634604 3511561 3388795 3267292 3148317 3032984 2922324 2817075
$$ packed form
50548B423496O1882O6216P0432P3038P3891P3617P3207P4000P6859Q1128Q5069
50537C232835Q7644Q9411R1609R4959R9418J04576J09912J15031J19867J24456
50527D269718J28468J31333J32898J33531J33409J32100J29080J24269J17734
50518E432540J09150R8081Q4787P0507N6777M4108L1343J6578o50j8245l3156
50507E891820m4241n2920o0953o8399p4198p7924q0024q0675p9261p5130o8422
50496E129673o0144n1660m3878l6791l0200k5013k2974k4455k7486l0053l2676
50485D744343l7392m4553n2378n9763o7735p7428q8068r8019j06609j13823j19127
50474C879448j21963j22881j23043j22766j21503j18975j15333j10660j05249
$$ plain form
50465 2817075 2716903 2620642 2528058 2440815 2360875 2288234 2221065 2157954 2099233 2046172 1999663
50454 1999663 1959857 1926359 1898277 1874436 1853998 1836912 1823647 1814615 1809919 1809476 1813179 1820930
50442 1820930 1832584 1847979 1867058 1889827 1915967 1944518 1974356 2005144 2037446 2071689 2107452
50431 2107452 2144271 2182769 2224218 2268916 2315615 2362795 2410031 2457856 2506737 2556722 2607920
50420 2607920 2660818 2715831 2772679 2830462 2888491 2947080 3007418 3070596 3136749 3204991 3273893
50409 3273893 3341979 3408200 3472311 3534584 3594734 3651181 3701838 3745642 3782857 3813674 3836829
50398 3836829 3849917 3851047 3840155 3818778 3788647 3750396 3703589 3647899 3584024 3513558 3438441
50387 3438441 3360842 3282938 3206087 3130340 3055405 2982095 2912238 2847359 2788191 2735410 2689802
$$ packed form
50465B817075j00172r6261r2584q7243p9940p2641o7169o3111n8721n3061m6509
50454A999663l9806l3498k8082k3841k0438j7086j3265r032m696m43L703P751
50442A820930J1654J5395J9079K2769K6140K8551K9838L0788L2302L4243L5763
50431B107452L6819L8498M1449M4698M6699M7180M7236M7825M8881M9985N1198
50420B607920N2898N5013N6848N7783N8029N8589O0338O3178O6153O8242O8902
50409C273893O8086O6221O4111O2273O0150N6447N0657M3804L7215L0817K3155
50398C836829J3088J130j0892k1377l0131l8251m6807n5690o3875p0466p5117
50387C438441p7599p7904p6851p5747p4935p3310o9857o4879n9168n2781m5608
$$ plain form
50376 2689802 2651302 2618687 2590758 2567108 2547150 2529144 2511032 2491953 2472174 2451778 2430070
50365 2430070 2406050 2378793 2347540 2312229 2273969 2234222 2193378 2150686 2105811 2059850 2014360
50354 2014360 1969705 1924832 1878700 1831696 1785470 1741371 1699341 1658682 1619679 1583687 1551359
50343 1551359 1521598 1492930 1465391 1440164 1417706 1397231 1378053 1360531 1345501 1333507 1324849
50332 1324849 1319729 1317975 1318924 1321766 1325754 1330325 1335641 1342887 1353191 1366169 1380285 1394717 1409980
50319 1409980 1426638 1444610 1464224 1486653 1512251 1539315 1565692 1591207 1617430 1645289 1673940
50308 1673940 1701834 1727995 1752199 1774865 1796901 1818943 1840445 1860018 1876849 1891325 1904191
50297 1904191 1915655 1925496 1933417 1938875 1941076 1939770 1935901 1930817 1924582 1915510 1901920 1884311 1865125
$$ packed form
50376B689802l8500l2615k7929k3650j9958j8006j8112j9079j9779k0396k1708
50365B430070k4020k7257l1253l5311l8260l9747m0844m2692m4875m5961m5490
50354B014360m4655m4873m6132m7004m6226m4099m2030m0659l9003l5992l2328
50343A551359k9761k8668k7539k5227k2458k0475j9178j7522j5030j1994q658
50332A324849n120j754R49K842L988M571N316P246J0304J2978J4116J4432J5263
50319A409980J6658J7972J9614K2429K5598K7064K6377K5515K6223K7859K8651
50308A673940K7894K6161K4204K2666K2036K2042K1502J9573J6831J4476J2866
50297A904191J1464R841P921N458K201j306l869n084o235r072j3590j7609j9186
$$ plain form
50284 1865125 1846031 1826039 1803049 1776878 1749564 1722706 1695783 1667644 1638491 1609449 1581124
50273 1581124 1553600 1527221 1502147 1477670 1453304 1430241 1410371 1393786 1378579 1363297 1348402
50262 1348402 1335005 1323416 1313465 1305220 1298662 1293469 1289707 1288079 1288835 1291080 1293716 1296465 1299435 1302297
50248 1302297 1304687 1307008 1310113 1314349 1319299 1324174 1328048 1330178 1330640 1330341 1329880 1328723 1325909 1321347 1315977
50233 1315977 1310906 1306695 1303110 1299134 1293635 1286496 1278803 1271551 1264629 1257529 1250447 1244026 1238412 1233334
50219 1233334 1228834 1225186 1222324 1220039 1218476 1217739 1217271 1216512 1215976 1216813 1219332 1222775 1226520 1230520 1234516
50204 1234516 1237748 1239825 1241095 1241904 1242206 1242114 1241946 1241284 1238872 1234068 1227732 1221039 1214171 1206943 1200015
50189 1200015 1194204 1188782 1181740 1172063 1160760 1149207 1137418 1124818 1112070 1100877 1091807 1083376
$$ packed form
50284A865125j9094j9992k2990k6171k7314k6858k6923k8139k9153k9042k8325
50273A581124k7524k6379k5074k4477k4366k3063j9870j6585j5207j5282j4895
50262A348402j3397j1589r951q245o558n193l762j628P56K245K636K749K970K862
50248A302297K390K321L105M236M950M875L874K130M62k99m61j157k814m562n370
50233A315977n071m211l585l976n499p139p693p252o922p100p082o421n614n078
50219A233334m500l648k862k285j563p37m68p59n36Q37K519L443L745M000L996
50204A234516L232K077J270Q09L02r2j68o62k412m804o336o693o868p228o928
50189A200015n811n422p042r677j1303j1553j1789j2600j2748j1193r070q431
$$ plain form
50177 1083376 1073887 1063493 1053593 1044508 1034881 1023711 1012145 1002515 995931 991369 986941 981551 975371
50164 975371 969234 963757 958840 953916 948595 942882 936787 930133 922968 915613 907954 899364 889911 881031
50150 881031 873957 867868 860841 852621 845198 840201 836829 833038 827984 822472 817426 812848 808324 804039
50136 804039 800989 800056 800829 801650 801296 800379 800418 801757 803347 804650 806582 810262 815907 823374 832533 842322
50120 842322 850694 856757 862111 868786 876560 883789 890304 897709 906903 916953 926672 935759 943905 950203
50106 950203 954303 957180 960082 963505 967687 973119 979780 986751 993428 1000381 1008233 1016454 1024313 1032303
50092 1032303 1041369 1051175 1060568 1069560 1079388 1090407 1101465 1111995 1123407 1137352 1153399 1169664
50080 1169664 1185249 1200814 1216846 1232726 1248028 1263718 1281132 1300163 1319426 1338197 1357344
$$ packed form
50177A083376r489j0394r900r085r627j1170j1566r630o584m562m428n390o180
50164I75371o137n477m917m924n321n713o095o654p165p355p659q590r453q880
50150H81031p074o089p027q220p423m997l372l791n054n512n046m578m524m285
50136H04039l050r33P73Q21l54r17L9J339J590J303J932L680N645P467R159R789
50120H42322Q372O063N354O675P774P229O515P405R194J0050R719R087Q146O298
50106I50203M100K877K902L423M182N432O661O971O677O953P852Q221P859P990
50092A032303R066R806R393Q992R828J1019J1058J0530J1412J3945J6047J6265
50080A169664J5585J5565J6032J5880J5302J5690J7414J9031J9263J8771J9147
$$ plain form
50069 1357344 1378063 1400339 1423213 1446113 1469182 1492365 1514903 1536018 1555668 1574426 1593000
50058 1593000 1612102 1632307 1653508 1674630 1694336 1712017 1727983 1742914 1757534 1772610 1788628
50047 1788628 1805181 1820866 1834119 1844339 1852325 1859548 1866730 1873111 1877423 1879563 1880743 1881830 1882352
50034 1882352 1881811 1881360 1883144 1888188 1895878 1905496 1917292 1931882 1949599 1970824 1996301 2026686 2062282
50021 2062282 2103250 2149358 2199330 2251381 2304794 2360095 2417297 2475058 2532323 2589669 2647877
50010 2647877 2706000 2762097 2815264 2865500 2912022 2953250 2988454 3017977 3041703 3058631 3068283
49999 3068283 3071180 3067524 3056632 3038253 3013245 2982093 2943718 2896726 2841170 2778256 2708957 2633950
49987 2633950 2554565 2472844 2390655 2309313 2229812 2152761 2078233 2006103 1936467 1869421 1804896
$$ packed form
50069A357344K0719K2276K2874K2900K3069K3183K2538K1115J9650J8758J8574
50058A593000J9102K0205K1201K1122J9706J7681J5966J4931J4620J5076J6018
50047A788628J6553J5685J3253J0220P986P223P182O381M312K140J180J087N22
50034A882352n41m51J784N044P690R618J1796J4590J7717K1225K5477L0385L5596
50021B062282M0968M6108M9972N2051N3413N5301N7202N7761N7265N7346N8208
50010B647877N8123N6097N3167N0236M6522M1228L5204K9523K3726J6928R652
49999C068283K897l656j0892j8379k5008l1152l8375m6992n5556o2914o9299p5007
49987B633950p9385q1721q2189q1342p9501p7051p4528p2130o9636o7046o4525
$$ plain form
49976 1804896 1743239 1685581 1632838 1584382 1538426 1493891 1451503 1412869 1378702 1348092 1319477
$$ packed form
49976A804896o1657n7658n2743m8456m5956m4535m2388l8634l4167l0610k8615
$$ [...]
##END NTUPLES=NMR SPECTRUM
##END=
