
##TITLE=AC1338_BRAAS10081_6642355_dYPn9BTwYD
##JCAMPDX= 6.0         $$ Bruker NMR JCAMP-DX V2.0
##DATA TYPE= NMR SPECTRUM
##DATA CLASS= NTUPLES
##ORIGIN= BRUKER
##OWNER= Administrator
$$ 1.72 TOPSPIN		Version 2.1
$$ 2012-08-08 18:43:51.937 -0500  Administrator@TOPSPIN
$$ Compression mode = diff/dup
##.OBSERVE FREQUENCY= 400.02188249412
##.OBSERVE NUCLEUS= ^1H
##.ACQUISITION MODE= SIMULTANEOUS (DQD)
##.ACQUISITION SCHEME= undefined
##.AVERAGES= 8
##.DIGITISER RES= 22
##SPECTROMETER/DATA SYSTEM= spect
##.PULSE SEQUENCE= zg30
##.SOLVENT NAME= COFFEE_meoh
##.SHIFT REFERENCE= INTERNAL, COFFEE_meoh, 1, 14.98509
##AUDIT TRAIL= $$ (NUMBER, WHEN, WHO, WHERE, PROCESS, VERSION, WHAT)
$$ ##TITLE= Audit trail, TOPSPIN		Version 2.1
$$ ##JCAMPDX= 5.01
$$ ##ORIGIN= Bruker BioSpin GmbH
$$ ##OWNER= Administrator
$$ $$ C:\Bruker\TOPSPIN/data/COFFEE/nmr/AC1338_BRAAS10081_6642355_dYPn9BTwYD/10/pdata/1/auditp.txt
$$ ##AUDIT TRAIL=  $$ (NUMBER, WHEN, WHO, WHERE, PROCESS, VERSION, WHAT)
(   1,<2012-08-08 18:43:44.765 -0500>,<Administrator>,<TOPSPIN>,<go>,<TOPSPIN 2.1>,
      <created by zg
	started at 2012-08-08 18:42:38.218 -0500,
	POWCHK enabled, PULCHK disabled,
       configuration hash MD5:
       6B 1B 68 BB D9 2E 58 E2 7F 35 AD 54 07 DF 0E 41
       data hash MD5: 64K
       52 78 D4 38 77 BC 22 90 D1 9E 10 BF BC 69 BD B7>)
(   2,<2012-08-08 18:43:47.468 -0500>,<Administrator>,<TOPSPIN>,<proc1d>,<TOPSPIN 2.1>,
      <Start of raw data processing
       efp LB = 0 FT_mod = 6 PKNL = 1 PHC0 = 0 PHC1 = 0 SI = 32K 
       data hash MD5: 32K
       2F B1 55 F6 93 22 5D B8 3E DC B5 F6 44 65 0B FE>)
(   3,<2012-08-08 18:43:47.859 -0500>,<Administrator>,<TOPSPIN>,<proc1d>,<TOPSPIN 2.1>,
      <pk PHC0 = 175.6989 PHC1 = 0 
       data hash MD5: 32K
       30 85 0F 50 53 6D 46 84 D6 6E 39 2B B4 84 0F 00>)
(   4,<2012-08-08 18:43:47.937 -0500>,<Administrator>,<TOPSPIN>,<proc1d>,<TOPSPIN 2.1>,
      <abs ABSG = 1 
       data hash MD5: 32K
       D6 E7 23 7D 48 23 90 CE 40 88 6D 36 82 30 8E 09>)
(   5,<2012-08-08 18:43:47.968 -0500>,<Administrator>,<TOPSPIN>,<proc1d>,<TOPSPIN 2.1>,
      <abs ABSG = 2 
       data hash MD5: 32K
       23 18 DD 58 FF D0 B6 6B 85 14 48 25 DF 37 12 41>)
(   6,<2012-08-08 18:43:48.015 -0500>,<Administrator>,<TOPSPIN>,<proc1d>,<TOPSPIN 2.1>,
      <abs ABSG = 3 
       data hash MD5: 32K
       54 73 69 E4 EC 07 38 C3 21 6C BD C2 97 63 EA 5C>)
(   7,<2012-08-08 18:43:48.031 -0500>,<Administrator>,<TOPSPIN>,<proc1d>,<TOPSPIN 2.1>,
      <abs ABSG = 4 
       data hash MD5: 32K
       DB 99 1C 3D C1 4B 83 1C 46 D8 4B F7 CF 9D 5A 2F>)
(   8,<2012-08-08 18:43:48.062 -0500>,<Administrator>,<TOPSPIN>,<proc1d>,<TOPSPIN 2.1>,
      <abs ABSG = 5 
       data hash MD5: 32K
       92 89 0C B9 A3 F8 A0 3F 0C 9B AF C0 62 04 D6 37>)
$$ ##END=
$$ 
$$ $$ hash MD5
$$ $$ BF B7 49 CC E3 47 88 CC CF EB 03 19 34 40 BD 0E
##$RELAX= 
##$RELAX= 
##$RELAX= 
##$RELAX= 
##$RELAX= 
##$RELAX= 
##$RELAX= 
$$ Bruker specific parameters
$$ --------------------------
$$ [...]
##$TP= (0..7)
150 150 150 150 150 150 150 150
##$TP07= 0
##$TPNAME0= <>
##$TPNAME1= <>
##$TPNAME2= <>
##$TPNAME3= <>
##$TPNAME4= <>
##$TPNAME5= <>
##$TPNAME6= <>
##$TPNAME7= <>
##$TPOAL= (0..7)
0.5 0.5 0.5 0.5 0.5 0.5 0.5 0.5
##$TPOFFS= (0..7)
0 0 0 0 0 0 0 0
##$TUNHIN= 0
##$TUNHOUT= 0
##$TUNXOUT= 0
##$USERA1= <user>
##$USERA2= <user>
##$USERA3= <user>
##$USERA4= <user>
##$USERA5= <user>
##$V9= 5
##$VALIST= <valist>
##$VCLIST= <CCCCCCCCCCCCCCC>
##$VD= 0
##$VDLIST= <DDDDDDDDDDDDDDD>
##$VPLIST= <PPPPPPPPPPPPPPP>
##$VTLIST= <TTTTTTTTTTTTTTT>
##$WBST= 1024
##$WBSW= 4
##$XGAIN= (0..3)
0 0 0 0
##$XL= 0
##$YL= 0
##$YMAX_a= 467450
##$YMIN_a= -608474
##$ZGOPTNS= <>
##$ZL1= 120
##$ZL2= 120
##$ZL3= 120
##$ZL4= 120
##$ABSF1= 14.98509
##$ABSF2= -5.573092
##$ABSG= 5
##$ABSL= 3
##$ALPHA= 0
##$AQORDER= 0
##$ASSFAC= 0
##$ASSFACI= 0
##$ASSFACX= 0
##$ASSWID= 0
##$AUNMP= <proc_prof1d_extract_pilot.lims>
##$AXLEFT= 0
##$AXNAME= <>
##$AXNUC= <1H>
##$AXRIGHT= 0
##$AXTYPE= 0
##$AXUNIT= <>
##$AZFE= 0.1
##$AZFW= 0.1
##$BCFW= 0
##$BC_mod= 0
##$BYTORDP= 0
##$COROFFS= 0
##$CY= 15
##$DATMOD= 1
##$DC= 0
##$DFILT= <>
##$DTYPP= 0
##$F1P= 0
##$F2P= 0
##$FCOR= 0.5
##$FTSIZE= 32768
##$FT_mod= 6
##$GAMMA= 0
##$GB= 0
##$INTBC= 1
##$INTSCL= 1
##$ISEN= 128
##$LB= 0
##$LEV0= 0
##$LPBIN= 0
##$MAXI= 10000
##$MC2= 0
##$MEAN= 0
##$ME_mod= 0
##$MI= 0
##$NCOEF= 0
##$NC_proc= -8
##$NLEV= 6
##$NOISF1= 0
##$NOISF2= 0
##$NSP= 0
##$NTH_PI= 0
##$NZP= 0
##$OFFSET= 14.98509
##$PC= 1
##$PHC0= 175.6989
##$PHC1= 0
##$PH_mod= 1
##$PKNL= yes
##$PPARMOD= 0
##$PPDIAG= 0
##$PPIPTYP= 0
##$PPMPNUM= 2147483647
##$PPRESOL= 1
##$PSCAL= 4
##$PSIGN= 0
##$PYNMP= <proc.py>
##$REVERSE= no
##$SF= 400.02
##$SI= 32768
##$SIGF1= 0
##$SIGF2= 0
##$SINO= 400
##$SIOLD= 32768
##$SPECTYP= <>
##$SREGLST= <1H.CDCl3>
##$SSB= 0
##$STSI= 32768
##$STSR= 0
##$SW_p= 8223.68421052631
##$SYMM= 0
##$S_DEV= 0
##$TDeff= 65536
##$TDoff= 0
##$TI= <>
##$TILT= no
##$TM1= 0
##$TM2= 0
##$TOPLEV= 0
##$USERP1= <user>
##$USERP2= <user>
##$USERP3= <user>
##$USERP4= <user>
##$USERP5= <user>
##$WDW= 1
##$XDIM= 32768
##$YMAX_p= 453742119
##$YMIN_p= -649236
##$CURPLOT= <Network HP LaserJet P1505>
##$CURPRIN= <$Network HP LaserJet P1505>
##$DFORMAT= <normdp>
##$LAYOUT= <+/1D_H.xwp>
##$LFORMAT= <normlp>
##$PFORMAT= <normpl>
##$SURQMSG= 1
$$ End of Bruker specific parameters
$$ ---------------------------------
##NTUPLES= NMR SPECTRUM
##VAR_NAME=  FREQUENCY,     SPECTRUM/REAL,   SPECTRUM/IMAG
##SYMBOL=    X,             R,               I
##VAR_TYPE=  INDEPENDENT,   DEPENDENT,       DEPENDENT
##VAR_FORM=  AFFN,          ASDF,            ASDF
##VAR_DIM=   32768,         32768,           32768
##UNITS=     HZ,            ARBITRARY UNITS, ARBITRARY UNITS
##FACTOR=    0.250966925370066, 1,           1
##FIRST=     8223.43324360094, 25116,        2682
##LAST=      0,             113715,          49797
##MIN=       0,             -649236,         0
##MAX=       8223.43324360094, 453742119,    0
$$ Real data points
##PAGE= N=1
##DATA TABLE= (X++(R..R)), XYDATA
$$ [...]
19490d30893A1663b72724J01608n264e8356h065B05709g0939j42303A6782L1427
19479D8209Q5903c10083B0406M0926j0191b28522R3228k96437A02927a51049B86806
19467e408m42414C3626a34860f4638A7275c72583A49308b18723A89576E8789h2419
19455c06098B25763a07813k8910k98135a35562O3355a2582E7508c34641c62l41181
19444c41543a41590F6394g8021F035b62308J27587b2783C32133c72006I0110L4833
19433A24943a98980i3526o5219A49600b50856P6439A28494b3932j29400j40475
19423b93807f035p3677k60480A94073e0769j63922k17509A30621d572A8311L1356
19412D9667b62545h1736A1428a86053Q8584q9807h4156J0106m9565j47959d1257
$$ y = [-430893, 11663, -272724, -171116, -176380, -58356, -8065, 205709, -70939, -213242, 16782, 48209, 134112, -310083, 20406, 61332, 51141, -228522, -135294, -431731, 102927, -151049, 286806, -5408, -447822, 33626, -134860, -64638, 17275, -372583, 149308, -218723, 189576, 58789, -82419, -306098, 225763, -107813, -136723, -434858, -135562, -72207, -12582, 57508, -334641, -362, -341543, -141590, 66394, -78021, 6035, -262308, -134721, -22783, 332133, -372006, 90110, 124943, -198980, -93526, -158745, 149600, -250856, -174417, 128494, -23932, -153332, -293807, -6035, -79712, -340192, 194073, -50769, -214691, -432200, 130621, -4572, 18311, 49667, -262545, -81736, 11428, -186053, -97469, -187276, -84156, -74050, -123615, -271574, -41257]
19400C4490h4447A2455a677r2237E2676a33733k97765b0929m44245J59010B6250
19388d81410E4864d5861l6155k23568J24685n9889c3238B46770e9396j1708O619
19377f4485C9683b7016G4067A1133b77006A32243a85980A44480i4922j08773k00194
19366d03889Q8768d3569B58138a20027L6169d0011G8748a49273A34306f5201k44790
19355c09991A16545J5650n3738c12301a42543B08697c68611M4404a54549n6618
19345b11167l2531B47929b52990e2052K4786j32968g6791C68301i6479L5137A02073
19333a10058a4936k17339A89364p2239d26641a03608B6296a55064j091H8071b1930
19321b65794B82637a26359j00a6813F3669J17962b9594k72459a43625O4521b2766
$$ y = [34490, -84447, 12455, -1677, -93914, 52676, -133733, -431498, -20929, -465174, -306164, 26250, -481410, 54864, -45861, -82016, -305584, -180899, -240788, -33238, 246770, -59396, -71104, -64485, 39683, -27016, 74067, 11133, -277006, 132243, -185980, 144480, -94922, -203695, -403889, -315121, -43569, 258138, -120027, -83858, -40011, 78748, -149273, 134306, -65201, -309991, 116545, 132195, 78457, -312301, -142543, 208697, -368611, -324207, -154549, -211167, -243698, 247929, -252990, -52052, -27266, -160234, -76791, 368301, -96479, -61342, 102073, -110058, -14936, -232275, 189364, 117125, -426641, -103608, 26296, -155064, -156155, 88071, -21930, -265794, 282637, -126359, -126459, -16813, 63669, 181631, -29594, -302053, -143625, -79104, -22766]
19309H5738h0169A19430a13D7879d018A55375c72964a43820j66160i2369Q558
19298h3811j69683O4779k06819a14964L1090l2876n0343G4442J04986h6881j54967
19287b41848g6048A92856m5147n3252D4069c1705j14387A7330b3466D0769f7057
19275b48897A6093a00497k02945C49548D6173b93976A53513c31222j1982B74251
19264C2875a10263a093j54880D8428c001F0217b36365a9584A82789b49061B31825
19252b08659c137j93550k9241k45239j5143H923Q5905C1772l473a03517l0081
19241a33598c9763C05449b93396E99411a38013B45869a06218I02b48836L0514
19231b18322k8862A12858b8454k9437n9476j09061A63018a8699h557j70749n5957
$$ y = [85738, -80169, 119430, -113, 47879, -4018, 155375, -372964, -143820, -309980, -92369, -83811, -253494, -188715, -395534, -114964, -83874, -116750, -167093, 74442, 179428, -86881, -241848, -76048, 192856, 147709, 94457, 44069, -31705, -146092, 17330, -23466, 40769, -67057, -248897, 16093, -100497, -303442, 349548, 46173, -293976, 153513, -331222, -343204, 274251, 32875, -110263, -1093, -155973, 48428, -3001, 60217, -236365, -19584, 182789, -249061, 231825, -208659, -3137, -196687, -225928, -471167, -486310, 8923, 94828, 31772, 28299, -103517, -133598, -39763, 305449, -293396, 599411, -138013, 245869, -106218, 902, -248836, -218322, -247184, 112858, -28454, -57891, -117367, -226428, 163018, -18699, -8557, -179306, -235263]
19220b35263a02947K058B82120R2584C8053a17961G069J89240E1150k0972M5493
19209G5671J88075H2619b09084F0346c49101a09593c207C6609d98602b21805A51537
19197c6804c239m64492a16483b2808p1004q699q3134K0264k42438a88692l0888
19186b19580P7190B76000h3238k63086D0639j0903M23219a7796e011r1503B87113
19174e9047A05326J4181a22105k5311n0646B13756H1657c41103f897j09115M9008
19163f7004k38023m1357H4191P1946b37414Q8538C4165J80159a46712d4173m4781
19152h8954m4021A12190D9303J13367a93261A43475a28247K5877D106b73910B0467
19140I7148K6277b02918c3255j6887A97038a06610k17178a33859k6161C0238P0195
$$ y = [-235263, -102947, -100889, 282120, 374704, 38053, -117961, 7069, 196309, 51150, 30178, 75671, 263746, 82619, -209084, 60346, -349101, -109593, -3207, 36609, -498602, -221805, 151537, -36804, -3239, -467731, -116483, -22808, -93812, -102511, -185645, -165381, -407819, -188692, -219580, -142390, 276000, -83238, -346324, 40639, 29736, 452955, -17796, -5011, -96514, 287113, -59047, 105326, 119507, -122105, -147416, -198062, 213756, 81657, -341103, -6897, -116012, -67004, -305027, -346384, 84191, 156137, -237414, -148876, 34165, 214324, -146712, -44173, -88954, -132975, 112190, 49303, 162670, -193261, 143475, -128247, -102370, 4106, -273910, 20467, 97148, 123425, -202918, -33255, -50142, 197038, -106610, -323788, -133859, -160020, 30238, 100433]
19129A00433R9198D2515c59809a73042c2503A3192b49751A01789a23772j15681
19119b39453a04110l7049b0204j09790k28285A01577K7776d3265j63779M1385
19109a65659E895c2171B7025a15249A46079a41272a5492r9434A64483I126c4360
19097A40472E1580a74838m4065R7134N7264A8046R6458J12896m9196n1733G38
19085a26919B89098d8697k6862H152O0346a7939j92352p9840B20327b41406k8833
19074b70239R7320N9855d1226j16779B6643d1744n44k5111B8902K37473c35922
19062e52850D39955E2858J8533a66045A39990c8010r4410A16460k9824L103i199
19050d30140D8584a87982A17878B417e7544D16297I5673a01906A1574K7004a31390
$$ y = [100433, 199631, 42515, -359809, -173042, -32503, 13192, -249751, 101789, -123772, -239453, -104110, -141159, -20204, -129994, -358279, 101577, 129353, -43265, -207044, -165659, 5895, -32171, 27025, -115249, 146079, -141272, -15492, -114926, 164483, 9126, -34360, 140472, 51580, -174838, -218903, -121769, -64505, 18046, 114504, 227400, 178204, 126471, 738, -126919, 289098, -48697, -75559, 8152, 68498, -17939, -210291, -290131, 220327, -241406, -270239, -172919, -113064, -41226, -158005, 26643, -41744, -42288, -67399, 28902, 266375, -335922, -552850, 439955, 52858, 71391, -166045, 139990, -38010, -132420, 116460, 86636, 89739, -9199, -430140, 48584, -187982, 117878, 2417, -57544, 416297, 95673, -101906, 11574, 38578, -131390]
19038f352A15752m1369a89776A9030A831a60679A10932E049L59769A65186C1704
19026c17027D6318J75748a08977C8415J49639a52991j21675d1105q9132A01073
19015F1677d50852J80458f0393m0070o2777J4475M7083I5662f5571j84364K386
19004b47549G3798P9198k0263i6498m1907d8777B80503a34860B03887a19588j44188
18993b63776a532l46157J42978e4449k37404R8016Q7301d5318J3621A26234j093
18982A25141b27986B1059M7922a03260j40169a14028B9143c8106D2361M05402
18972D47763j23707K44302A91715J2531M0467r1384E20i1635r6922D0719a53826
18960A20149b59840A57779b7729k79475b6491j56569A62713J44918e44284J83969
$$ y = [-6352, 115752, 74383, -189776, 19030, 1831, -160679, 110932, 5049, 364818, 165186, 31704, -317027, 46318, 222066, -108977, 38415, 188054, -152991, -274666, -41105, -130237, 101073, 61677, -450852, -270394, -60393, -100463, -163240, -148765, -101682, 95662, -65571, -249935, -247549, 73798, 152996, 132733, -96498, -138405, -48777, 280503, -134860, 203887, -119588, -263776, -1532, -347689, -204711, -54449, -291853, -193837, -106536, -45318, -31697, 126234, 125141, -227986, 21059, 68981, -103260, -243429, -114028, 29143, -38106, 42361, 447763, 324056, 568358, 191715, 204246, 244713, 153329, 520, -91635, -188557, 40719, -153826, 120149, -259840, 157779, -27729, -307204, -26491, -183060, 162713, 307631, -544284, -360315]
18950c60315D1401e5339H4713a12793A5146a88472E0262d9413n9705k1936a3910
18938a13495F0779i9762L7192o8317J3279D1358J3721h6993A5605p014L4691a46142
18925a4936j88982a9276j83349f2994j64785c0112r1932l47691a25231N9309k2489
18914h8411B57779j26861a06889C15172j49142J59059R3115j73459i8030C15295
18903d198k16971A37093d82745a64788D28168b1811A2805Q9684J28771A14907
18892A06314a41843j15144K3511A29535b31045J10240D7065Q232J06650j4673
18882A47274K29567H780e002H6671c7268j31340K4836m5953j03961Q5553p9731
18871b87864i3967j99087H387b19499A2939b90267A55592a58905E14185I3241
$$ y = [-360315, 41401, -55339, 84713, -112793, 15146, -188472, 50262, -49413, -109118, -131054, -13910, -113495, 60779, -99762, -62570, -130887, -117608, 41358, 55079, -86993, 15605, 8591, 43282, -146142, -14936, -203918, -19276, -202625, -62994, -227779, -30112, -122044, -469735, -125231, -65922, -88411, 257779, 130918, -106889, 315172, 166030, 325089, 418204, 244745, -98030, 315295, -4198, -221169, 137093, -482745, -164788, 428168, -21811, 12805, 102489, 231260, 114907, 106314, -141843, -256987, -233476, 129535, -231045, -120805, 47065, 55297, 161947, 147274, 376841, 8780, -5002, 86671, -37268, -168608, -143772, -189725, -293686, -208133, -287864, -93967, -293054, 8387, -219499, 12939, -290267, 155592, -158905, 514185, 93241]
18860a13502b0370k29494A33828c8166m074A41259l2168K488a99415F6130a7489
18848B20846a16587B23730E9784a02123H1960M5305e6674j71827A48042d17032
18837D4028Q8830o6163c13701A63012C0573O0173d06372g1859k22648h971A39466
18825b1846A21346i8691B04950A02424c4272j0766A75215a72180A78502i0362
18814C23232A12270e3622B78462r7419b1436A31434K11783j57037M823K4597a4074
18802a74125D1003L352J1314c29464E6110a04985j90973p3565a33207J0437j28979
18791b51749K9691B08820g4593j3656A55868g425m9966l8391G4752J8296c52462
18779E8839k0312L2037d84181d6544A1864b15283J5034g210A4464L00922C4834
$$ y = [-113502, -20370, -249864, 133828, -38166, -42240, 141259, 109091, 111579, -199415, 66130, -17489, 220846, -116587, 223730, 59784, -102123, 81960, 127265, -56674, -228501, 148042, -417032, 44028, 132858, 66695, -313701, 163012, 30573, 90746, -406372, -71859, -294507, -8971, 139466, -21846, 121346, -98691, 204950, 102424, -34272, -45038, 175215, -172180, 178502, -90362, 323232, 112270, -53622, 278462, 181043, -21436, 131434, 343217, 186180, 191003, 215600, -14074, -174125, 41003, 44355, 55669, -329464, 56110, -104985, -295958, -369523, -133207, -122770, -251749, -222058, 208820, -74593, -88249, 155868, -7425, -57391, -95782, 74752, 93048, -352462, 58839, 38527, 70564, -484181, -46544, 11864, -215283, -200249, -7210, 14464, 315386, 34834]
18767a85070o6903F3585K9763P479d41717A98734e1411o2515a789B51395F3247
18755d7434k39803O5093k11913a44650k6798j84775a59512A480b70682a17680
18744a06793l9597j09846J08485g3836C4656m525a92666m5704j18689R1885A72730
18732c05388J27216F7301c67487a09110c1097k31073J5981I3735J04019b68775
18721G7366c39978A42407h9246C05803c0855B31756b5851B43647b39965a16520
18710i0386j13188j2595A68420a74301a0727l14668g5963j78469B15478a61394
18699a10531j53411D192K43191c59757R4463g3920m9477e1728D6396M3047a41214
18687H6003J01578A5245J63738a36179G0792i9680J1795r2081l9772A10555c08235
$$ y = [-185070, -251973, 63585, 93348, 100827, -441717, 198734, -51411, -113926, -1789, 251395, 63247, -47434, -287237, -222144, -434057, -144650, -171448, -356223, -159512, 1480, -270682, -117680, -106793, -146390, -256236, -147751, -73836, 34656, 30131, -192666, -238370, -357059, -265174, 172730, -305388, -178172, 67301, -367487, -109110, -31097, -262170, -246189, 93735, 197754, -268775, 77366, -339978, 142407, -89246, 305803, -30855, 231756, -25851, 243647, -239965, -116520, -90386, -203574, -216169, 168420, -174301, -10727, -325395, -75963, -254432, 215478, -161394, -110531, -263942, 4192, 247383, -359757, -265294, -73920, -123397, -51728, 46396, 89443, -141214, 86003, 187581, 15245, 178983, -136179, 70792, -99680, -87885, -179966, -219738, 110555, -308235]
18675A9002e2566A21789J4721a66380n4272C63133a42065j14930c3292k4869f198
18663a61640k15501E7751a19314a9796A46605c73109O5181a09854d8881B88644
18652b70869K0333Q6894e3144A57890o321c2021f046o5088k16860B22525E5420
18640B58333b98579O0644E0944d1197p1190F0766c45235A21380a43030A39964
18629a40928B7168i2336k08856l7245a08417k5100j3940B96422b4127F5155c178
18617B5059a65701o967f4475g753j50408j744h718j52867N2694j32237j62074
18606d03202Q6561b1376l50196a8564A87029A1045D554J0432d30774J66147j63087
18595d27714F9900L14628A14745f3914n3256A9464a20902I963a38788a0604A22829
$$ y = [19002, -52566, 121789, 136510, -166380, -220652, 363133, -142065, -256995, -33292, -58161, -6198, -161640, -377141, 57751, -119314, -19796, 146605, -373109, -307928, -109854, -48881, 288644, -270869, -250536, -163642, -53144, 157890, 151569, -32021, -6046, -71134, -287994, 222525, 55420, 258333, -298579, -237935, 50944, -41197, -112387, 60766, -345235, 121380, -143030, 139964, -140928, 27168, -92336, -301192, -338437, -108417, -133517, -147457, 296422, -24127, 65155, -3178, 25059, -165701, -172668, -64475, -7753, -158161, -159905, -8718, -161585, -108891, -241128, -403202, -316641, -21376, -371572, -18564, 187029, 11045, 4554, 14986, -430774, -264627, -427714, 69900, 384528, 114745, -63914, -117170, 19464, -120902, 9963, -138788, -10604, 122829]
18583H4911K06272d9601j53421I1597b5671C2749d60769a6149k57307c626A11665
18571f7723D55388o1552h0506D4919O3270l9624N6801b83701i3031p5993F9967
18559e8030A52981C1636a35455D2097N4251a29964G0791o324a60760B4979a80702
18547c99905I0362a2008A08680b70167b0690B2094e1206r2106B16756a45054n9454
18536b04508g4433A88785L7685a08422B1211a60066a1816r2816C5164g6675A60313
18524B4828Q9922k996J34527D1573R2322B1192o512J6457j1715a46625M1885k55813
18512c60553c198k85428C4845R673a94654A09295b21279A24160f0912j84035l6450
18501b81397C72953a48863C5477a35785k8937E0231L35857a80442j92114A28258
$$ y = [84911, 291183, -49601, -203022, 91597, -25671, 32749, -460769, -16149, -273456, -3626, 111665, -67723, 455388, 393836, -80506, 44919, 108189, 68565, 125366, -283701, -93031, -169024, 69967, -58030, 152981, 31636, -135455, 42097, 96348, -129964, 70791, 64467, -160760, 24979, -180702, -399905, 90362, -12008, 108680, -270167, -20690, 22094, -51206, -143312, 216756, -145054, -204508, -74433, 188785, 226470, -108422, 21211, -160066, -11816, -104632, 35164, -76675, 160313, 24828, 114750, 111754, 246281, 41573, 133895, 21192, 14680, 31137, 19422, -146625, -104740, -360553, -3198, -288626, 34845, 44518, -194654, 109295, -221279, 124160, -60912, -244947, -281397, 372953, -148863, 35477, -135785, -164722, 50231, 386088, -180442, -372556, 128258]
18490g8048N7B14856b80250A27581a25290B9088c48199F4258A8451c44061c0281
18478a01902d4542I5970b0742m9634n7245A34248q961n8610b64598f1160A16299
18466c0097A54748a67318A91275f9324m8866I2224a46485b2065k05488H7064d2317
18454h8972j30524i8857o6071P1961G8801a16227j21524A8007c0369l0499j2930
18443g3798c0914R005E2987c8959j19704B81876j17830h6783A67924e4460A1130
18431F9127f7963j87639D02922A41992M7238a81430C83832a34570A97548b16250
18420E4660A5999b00034L4104A67070J5847f1267A08909a5850k26501l4657e3013
18408c49116h9850j41165c5725j03592j25987G3134i3631C9048f1349q8827c9055
$$ y = [-78048, -77991, 214856, -280250, 127581, -125290, 29088, -348199, 64258, 18451, -344061, -30281, -101902, -44542, 95970, -20742, -70376, -127621, 134248, 125287, 66677, -264598, -61160, 116299, -30097, 154748, -167318, 191275, -69324, -118190, 92224, -146485, -22065, -227553, 87064, -42317, -88972, -219496, -98857, -164928, -92967, 78801, -116227, -237751, 18007, -30369, -60868, -73798, -30914, -21909, 52987, -38959, -158663, 281876, 164046, -86783, 167924, -54460, 11130, 69127, -67963, -255602, 402922, 141992, 189230, -181430, 383832, -134570, 197548, -216250, 54660, 15999, -200034, -165930, 167070, 182917, -61267, 108909, -15850, -242351, -277008, -53013, -349116, -89850, -231015, -35725, -139317, -265304, 73134, -93631, 39048, -61349, -150176, -39055]
18396B8586e174j3532B19101b54648C5898J28358b42583O6176A2292b68791M0233
18385b28558O7574g9787J161j2585D836a5486k49870K7560j29032a7027A48581
18373A78014a26949C4746b4233k65462B1012b42561J17004C17218b1320C15088
18362B10770h9309c1956F0554p645b00114A04119h9466c8094A69014B7425l055
18351B4370L06444A19830d9330k16108L7441f4973k14066N7614Q8125b4971l1277
18340e6248j8805B51652b65507A16263e27839a05680A98975e47158B34177a02770
18329c82090A07587d5736p537k46048h3345K7121A44364e6358k1900A9542b16369
18317G1614b01634A39346n4325a27504b0278j57678c132E9602b66073C0744a64437
$$ y = [28586, -5174, -18706, 219101, -254648, 35898, 164256, -242583, -176407, 12292, -268791, -228558, -160984, -79787, -78626, -91211, 4836, -15486, -265356, -237796, -366828, -17027, 148581, 178014, -126949, 34746, -24233, -289695, 21012, -242561, -125557, 317218, -21320, 315088, 210770, -89309, -31956, 60554, 52909, -200114, 104119, -89466, -38094, 169014, 27425, 24370, 330814, 119830, -49330, -265438, -227997, -64973, -279039, -221425, -133300, -24971, -56248, -75053, 251652, -265507, 116263, -527839, -105680, 198975, -547158, 234177, -102770, -382090, 107587, -45736, -53273, -299321, -83345, -56224, 144364, -56358, -78258, 19542, -216369, 71614, -201634, 139346, 85021, -127504, -20278, -177956, -3132, 59602, -266073, 30744, -164437]
18305A83366b46583i4123j7969B00014a25784H0107h3603L3053B63854a68461
18294F4352a25830A6682J00018c25127F2729a87824e3561p0154j10611A78529
18283g1616k57309e0890J3497J6749n0749G1666e5922j1612C54447i9152j08555
18272b07707B21799A3864i9665d736j8536B2397a4835B6148J95050g8586D971
18260e6541j63535E5704a65340A21265j9184J84252P2774b13019E5931a17976
18249d9213j12462j10080A12333b83258A06032E2316a57063B87651e3905G6410
18238a44186m4719o4429C1243e439k73209B8794N5111P814B548J65513b5727m7102
18226g2829j5353a8263n5631r9025b7828j11876K2841j36299A51280e32573D53165
$$ y = [183366, -246583, -94123, -112092, 200014, -125784, 80107, -83603, -50550, 263854, -168461, 64352, -125830, 16682, 116700, -325127, 62729, -187824, -53561, -123715, -234326, 178529, -71616, -328925, -50890, -37393, -20644, -71393, 71666, -55922, -67534, 354447, -99152, -207707, 221799, 13864, -99665, -4736, -23272, 22397, -14835, 26148, 221198, -78586, 4971, -56541, -220076, 55704, -165340, 121265, 102081, 286333, 359107, -213019, 55931, -117976, -49213, -161675, -271755, 112333, -283258, 106032, 52316, -157063, 287651, -53905, 76410, -144186, -188905, -253334, 31243, -5439, -278648, 28794, 83905, 91719, 2548, 168061, -25727, -72829, -88182, -18263, -73894, -172919, -27828, -139704, -116863, -253162, 151280, -532573, 453165]
18214A64530b8591B26369f6713b5092o842j9869k10830D0377J34649B1515c38715
18202a69578l6938A05037c52455J72720e4993E801J67750a64634C81817j54955
18192B26862B5136L7420c49483a45644B03909b13649A706d3602B7175k257M0393
18181F5311b04470j79832b7847A37573a46540D0288c2894e641B09771F6235A2548
18169A9262a32788H8485b89623J39673B45576A01218J4719i2829k81295C7305
18158B63a22430H4031b81930A0838a71587C4982a39478B26090D2171b0589r179
18147b9768E2417L8545b11884b0427A00852b27431F8575J62670a88258d5628j0886
18136e6514A15543O5248a69352j02367f5573G1408A8628a33248A28166E9194a39543
$$ y = [164530, -28591, 226369, -66713, -25092, -31934, -51803, -262633, 40377, 175026, 21515, -338715, -169578, -206516, 105037, -352455, -179735, -54993, 5801, 173551, -164634, 381817, 226862, 25136, 62556, -349483, -145644, 203909, -213649, 1706, -43602, 27175, 24918, 65311, -204470, -384302, -27847, 137573, -146540, 40288, -32894, -5641, 209771, 66235, 12548, 19262, -132788, 88485, -289623, -149950, 245576, 101218, 115937, -92829, -374124, 37305, 263, -122430, 84031, -281930, 10838, -171587, 34982, -139478, 226090, 42171, -20589, -29768, 52417, 90962, -211884, -20427, 100852, -227431, 68575, 231245, -188258, -45628, -56514, 115543, 180791, -169352, -271719, -65573, 71408, 18628, -133248, 128166, 59194, -139543]
18124c1209q4950d4028n2929k3259E3147L7127O3239B2624L3812J75600e2195
18112D3427a48653l9832Q6170q6123g0605a8944E1681d454A19064e1061j33981
18101a85042A77986i0498B07573H2940a99428j3422O3632f6185j06425O1980k9807
18090a40437A20694m4474a20976a0987H6089O1120c3581a6337D20771b08842c5731
18078A68361c18286a34989e4247k01604J14560e1338j23031l1903G8013a01856
18067a76229A6615J29319c5537j8748p3202a7851A53424c0111j08895M2602j61591
18056b57995g9895a4050j23153A38855J31089m0133a87410A02385b16561b505
18045c6961B56972P5662j30575F7373a90972c5025E0810a75311A4754R0093A0197
$$ y = [-31209, -116159, -44028, -96957, -120216, 53147, 90274, 153513, 22624, 56436, 232036, -52195, 43427, -148653, -188485, -102315, -188438, -70605, -18944, 51681, -4454, 119064, -51061, -185042, 177986, -90498, 207573, 82940, -199428, -212850, -149218, -66185, -172610, -110630, -140437, 120694, 76220, -120976, -10987, 86089, 147209, -33581, -16337, 420771, -208842, -35731, 168361, -318286, -134989, -54247, -255851, -141291, -51338, -174369, -206272, 78013, -101856, -176229, 16615, 145934, -35537, -54285, -127487, -17851, 153424, -30111, -139006, -96404, -257995, -79895, -14050, -137203, 138855, 269944, 229811, -187410, 102385, -216561, -2505, -36961, 256972, 332634, 202059, 67373, -190972, -35025, 50810, -175311, 14754, 104847, 10197]
18033b01837A89982c39355a45985N5326o3735P1237B7220a26225B75176D5660
18022a2403A21598c43802a45946F33c7597A46388a11200A10713j6867a01974A50335
18010B99506a15274j81647f013C36503a16145A33530J6756c33895A07333e1787
17999c55128d5052E329L85578A37513a17822A38944F8864J04204b9561j39601
17989a69162A2976d7140L68j08519f1621I2235l6203f2167o119l26561c5785j614
17977c7399l6982k3391J526I5674h7725C8087a1558j18079M1321j51625A03668
17965a62210B3053c6334o748G8402P4271k5678E5031I497L14791p5072G3668r226
17953F4442J79964a41706d417A41259f8037A18740l5379e2496c505l03339D5422
$$ y = [-201837, 189982, -339355, -145985, -90659, -154394, -83157, 27220, -126225, 275176, 45660, -12403, 121598, -343802, -145946, 633, -37597, 146388, -111200, 110713, 93846, -101974, 150335, 299506, -115274, -296921, -6013, 336503, -116145, 133530, 150286, -333895, 107333, -51787, -355128, -45052, 5329, 390907, 137513, -117822, 138944, 68864, 173068, -29561, -169162, 12976, -47140, -46772, -155291, -61621, 92235, 56032, -62167, -68286, -394847, -35785, -37399, -74381, -97772, -96246, 95674, -87725, 38087, -11558, -129637, -88316, -239941, 103668, -162210, 23053, -36334, -43082, 78402, 152673, 126995, 55031, 9497, 324288, 249216, 73668, 64442, 244406, -141706, -4417, 141259, -68037, 118740, 83361, -52496, -3505, -306844, 45422]
17941I5432m0503J04931C0359K46556c3690A54799c1907k08996A2268Q3356D7640
17929a6177k9887F6061a07665E0669M3997L16747A89009r4302i881D8265j1453
17918C6812g4850I2260A6285K96516A48388m0020b2285B14756H5508Q9445J82601
17907C57554d4083B6409a70927A56936Q3490a2925B6022h9633b0283A95335b04256
17895A11182i1268D7406P5570K96862a02810j7766C84507J3640I4074j5867J4782
17884I2989f5943B63601A11171J85123G6051a10080M8470p9391N9739C13914f2653
17872b38506F937L6558M06005A56978a8527r7109A06841A9351a50075B7695K58694
17861B86389A5849N5031a84762D6798j0816L7441a27349E7643a16397G1055h2980
$$ y = [95432, 54929, 159860, 30359, 276915, -33690, 154799, -31907, -240903, 12268, 95624, 47640, -16177, -46064, 66061, -107665, 50669, 94666, 411413, 189009, 94707, -9881, 48265, 36812, -74850, 92260, 16285, 312801, 148388, 108368, -22285, 214756, 85508, 174953, 357554, -44083, 26409, -170927, 156936, 240426, -12925, 26022, -89633, -20283, 195335, -204256, 111182, -91268, 47406, 122976, 419838, -102810, -120576, 384507, 398147, 94074, 78207, 92989, -65943, 263601, 111171, 296294, 76051, -110080, -61610, -141001, -81262, 313914, -62653, -238506, 6937, 43495, 449500, 156978, -18527, -115636, 106841, 19351, -150075, 27695, 286389, 15849, 70880, -184762, 46798, 35982, 73423, -127349, 57643, -116397, 71055, -82980]
17849b04245e3379B16998H8007a7179k41087J5003a09209A09017a54644A59233
17838g5601G2342g2903C67863b3878j6577D1260b3450A23323h5101A61185G0578
17826B21717c46782I833P8673a74724C7182E663b3484B19266n7482l7793e1716
17814C22642f6571i968H0525J45354a01957G3862b5895c500o795H2556Q4208M4197
17802B10961a27820C15024b6885B56486j857b48652J09905D3730J07259a84343
17791B25222b69268K7135P7976j5071I6957j5156a00030C89965a30849B65001
17780A09780n0893a03450B1968a06954H5393J98302C2416K0586K2207K2637a5231
17768A04773a50764A64496J48191j09282a45012A43842e8k39208A42669a37064
$$ y = [-204245, -53379, 216998, 88007, -17179, -258266, -243263, -109209, 109017, -154644, 159233, -75601, 72342, -72903, 367863, -23878, -40455, 41260, -23450, 123323, -85101, 161185, 70578, 221717, -346782, 9833, 88506, -174724, 37182, 5663, -23484, 219266, 161784, 123991, -51716, 322642, -66571, -9968, 80525, 225879, -101957, 73862, -25895, -3500, -10295, 82556, 166764, 210961, -127820, 315024, -26885, 256486, 254629, -248652, -138747, 43730, 150989, -184343, 225222, -269268, -242133, -164157, -179228, 96957, 81801, -100030, 389965, -130849, 265001, 109780, 58887, -103450, 21968, -106954, 85393, 283695, 32416, 53002, 75209, 97846, -15231, 104773, -150764, 164496, 312687, 203405, -145012, 143842, -58, -239266, 142669, -137064]
17757A20244L1896b08830H1430K32919C1784J36715a49889C92029H0345O0994
17747A41339b5157e989j3494C58628c8923D6921K42206I7428J09232E5638g6115
17735i1078j02877B41361H9655C3610L0973J31860K5196a04602k4500k01365J16931
17724b13536A89915l2048g0570j9316o6808D87804A20232a01574A88170b08903
17713A89359b44554A71367E6034J19573a9958B3285c40103A83385B42g9501G0389
17701d7145j50461B06168b21735C60965H0433c2945G3857K21018j22641K9701
17691B01935D6217c3124A31912J76239H9365h9218G9182J53825a75668A71592
17680D0170a01390I8262g8707r5998B56433J07467f0959G632M5905J3222K95852
$$ y = [120244, 152140, -208830, 81430, 314349, 31784, 168499, -149889, 392029, 80345, 141339, -25157, -5989, -19483, 358628, -38923, 46921, 289127, 97428, 206660, 55638, -76115, -91078, -193955, 241361, 89655, 33610, 64583, 196443, 221639, -104602, -129102, -330467, -213536, 189915, 157867, -70570, -89886, -156694, 487804, 120232, -101574, 188170, -208903, 189359, -244554, 171367, 56034, 175607, -19958, 23285, -340103, 183385, 242, -79501, 70389, -47145, -197606, 206168, -221735, 360965, 80433, -32945, 73857, 294875, 172234, 201935, 46217, -33124, 131912, 308151, 89365, -89218, 79182, 233007, -175668, 171592, 40170, -101390, 98262, -78707, -174705, 256433, 363900, -60959, 7632, 53537, 66759, 362611]
17669C62611G0031J42241B2437P4854j8046c7561B06216B7381a52367D2977f9744
17657a01045E1315J21779J52035A099L02889j46942n2960b73132C88701F8298
17646A76118M6482N1548F6960J16097P3324h4679A81098a90358I7240b37751f7897
17634a5834k7506N20D2290a70306l1027h2523H2866b20269h8664n4131B24950
17622b4357I5450k6585K54941A04817a80930E5685b8627C96889D3330K77058j17178
17611B03210a30871A13549J73963E736J36388m7743R6659l8522P4949d9032G1881
17599a8636l3700c163G8494J03108H3728L32918a52849B69507A14847J47687j0119
17588B52415j2022j15431l7886f1359A81054J78845j72956K0938a55935A74009
$$ y = [362611, 70031, 212272, 22437, 97291, 79245, -37561, 206216, 27381, -152367, 42977, -69744, -101045, 51315, 173094, 325129, 1099, 303988, 157046, 104086, -273132, 388701, 68298, 176118, 222600, 274148, 66960, 183057, 256381, -84679, 181098, -190358, 97240, -237751, -67897, -15834, -43340, -42820, 42290, -170306, -201333, -82523, 82866, -220269, -88664, -142795, 224950, -24357, 95450, 68865, 323806, 104817, -180930, 55685, -28627, 396889, 43330, 320388, 203210, -130871, 113549, 287512, 5736, 142124, 94381, 191040, 152518, 227467, -49032, 71881, -18636, -52336, -3163, 78494, 181602, 83728, 416646, -152849, 269507, 114847, 262534, 252415, 240393, 124962, 87076, -61359, 181054, 359899, 186943, 207881, -155935, 174009]
17577H8925K24541b51409C7871R0417J73086A30391k3926a03197r908C82026f8030
17565D58349p5471j46130J17647J2734f8303B1687K70644I2431R7773f1207B09957
17553D15727D8907a48423H6508J01873P8483q0167K13477I6962Q8774O1523j21409
17542A25850E5734J22924d6147C81993D808J18525E9003L79873j22820j57525
17532A58531L4046I6155k8682J95811M5586L61004J1626O3716L43782o4234R3653
17521A118417j83777C61322K6073n0129N0046q0136J96907B24185J37932L48820
17511G10937j97601K21635R5702k72148N29416j47033k65333j9215l00548J8188
17501C74000n0559A00770L55849A41225D4241K3030K44341h614C51023O3391j57536
$$ y = [88925, 313466, -251409, 37871, 128288, 301374, 130391, 106465, -103197, -113105, 382026, -68030, 458349, 382878, 236748, 354395, 367129, -68303, 21687, 292331, 92431, 190204, -61207, 209957, 415727, 48907, -148423, 86508, 188381, 266864, 186697, 400174, 96962, 185736, 247259, 125850, 55734, 178658, -46147, 381993, 4808, 123333, 59003, 438876, 316056, 158531, 192577, 96155, 67473, 263284, 308870, 669874, 681500, 745216, 1088998, 1024764, 1118417, 934640, 361322, 387395, 337266, 387312, 307176, 504083, 224185, 362117, 710937, 513336, 734971, 830673, 558525, 1087941, 940908, 675575, 656360, 355812, 374000, 323441, 100770, 456619, 141225, 44241, 67271, 311612, -8614, 351023, 414414, 256878]
17490B56878j02182p6338L48100J24359Q0312B53952o6995o7589M55440k01775
17480C73033j07292J38888j58835m7810J00811j17002K27525A2342f2140C55842
17469C58682A74460L01391A69222G5297e7816p8341H3513K48045A55402N9586
17459B14988L65045j45645j50447j14705J22119J30413A60873k4002i0809C91627
17448D12793A00684N7082J19068J64669j29625J31011j12665r340J85841B45837
17437D83502A98756l8447L23890k25342J81979k0002J28361A68184n1125Q4776
17427B01835J97449A36740J44304p919J81253c61052B99809K1069R3093J79694
17417E93665A61984K95734A63785l0266L80505I4762L17429k0887r7299p3548
$$ y = [256878, 154696, 78358, 426458, 550817, 631129, 253952, 186957, 119368, 574808, 373033, 265741, 404629, 245794, 197984, 298795, 181793, 409318, 12342, -62140, 355842, 358682, 174460, 475851, 169222, 75297, -57816, -136157, 83513, 331558, 155402, 214988, 580033, 434388, 283941, 169236, 291355, 421768, 160873, 136871, -90809, 391627, 412793, 100684, 157766, 276834, 441503, 311878, 442889, 330224, 320884, 506725, 245837, 483502, 198756, 160309, 484199, 258857, 440836, 420834, 549195, 168184, 117059, 201835, 399284, 136740, 281044, 273125, 454378, -361052, 299809, 320878, 413971, 593665, 161984, 457718, 163785, 133519, 514024, 94762, 412191, 391304, 294005, 220457]
17407B20457J42725g4006k1132C37635n0923Q3355A79565O9011j5471G0983J83865
17396B54848A04609J11503q9526K64815A51086G3157K30006j749D5476J91913
17386B37389q8291R4304k5945F671L01924J98636A05057R1949O5534B5243M02236
17375D27479K4111A12591k622J39875E9719K28968j35310K64658d7231C48104
17364B52604b993C61354j51552C5854J50498G8614J91814j0338F2759K61378A18129
17352f7980A97116n2782K39277K0841A37347J4850a877B50629L69645B07042L25677
17341E32719A57715P2621e539A57338J91205J2661J07567H1903e726C06522j38569
17330A67953K12674n0832A07914a811D25267j01491e3202E0067a76807E10533
$$ y = [220457, 363182, -74006, -95138, 337635, 286712, 370067, 179565, 248576, 233105, 70983, 254848, 104609, 216112, 126586, 391401, 151086, 73157, 303163, 301414, 45476, 237389, 149098, 243402, 217457, 6671, 308595, 507231, 105057, 197006, 262540, 25243, 427479, 451590, 112591, 109969, 249844, 59719, 288687, 153377, 418035, -47231, 348104, 252604, -2993, 361354, 209802, 35854, 186352, 78614, 270428, 260090, 62759, 324137, 118129, -67980, 197116, 144334, 383611, 404452, 137347, 152197, -1877, 250629, 620274, 207042, 532719, 157715, 230336, -5539, 157338, 348543, 361204, 468771, 81903, -5726, 306522, 167953, 380627, 329795, 107914, -1811, 425267, 323776, -53202, 50067, -176807, 510533]
17319C93301A34688K03283q8694K38173P9737B21457q125J49170q2981J12429
17309C91950A92639J88762j67500R2191J29144j83642j1837M8230r1754N5996
17299B52229o6169K58084G4398L02112L8882J62497B26749J54151p7898a56816
17288C76184L3190A36136L31572H7926L34153j78929N257r6356J47579m2752j6867
17277B40011J42062p8601J37088r5528M4381a59411A817K98404P494p7223K75011
17266E05503j5677E50K89521J40629j82507R5094a84146D4368N80222B50004M3146
17255B93150J17365J77152A93469L66901q6665E1141L28369A52026N6446n6648
17245A51824L87022J57347C39748J06710j38445o6535G6813K28087o3375A06528
$$ y = [393301, 134688, 337971, 249277, 487450, 567187, 221457, 213332, 362502, 279521, 391950, 192639, 381401, 213901, 306092, 435236, 251594, 239757, 287987, 196233, 252229, 186060, 444144, 74398, 376510, 415392, 577889, 226749, 380900, 303002, -156816, 376184, 409374, 136136, 467708, 87926, 422079, 243150, 248407, 152051, 299630, 256878, 240011, 382073, 303472, 440560, 345032, 389413, -159411, 1817, 300221, 307715, 230492, 505503, 489826, 550, 290071, 430700, 248193, 343287, -184146, 44368, 624590, 250004, 293150, 410515, 587667, 193469, 560370, 473705, 51141, 379510, 152026, 208472, 151824, 538846, 696193, 339748, 446458, 308013, 241478, 76813, 304900, 241525, 106528]
17234E83212B79733O8812A44048K20494p5861K41742j19178j9057j88157K17187
17224D21218m8720b2020D55770B6137N27665N8358I1792J87522o753n8627K68790
17213D82724n5457R1287r7973P463J02650k22009L55141B25144J03989J70873
17203E00006j99678J03822A27665K09110j2894J34875G1833N32143k30376K05129
17193E78729m4428A45048J97970P183M1273J66389P9351l06558K82100B84223
17182C24943L29543k55794A88921K41588J67123k18717Q211K89618k92478r7579
17172B86687J56435j6327A80887J56244N08127k80711P9437J42120l0164j24951
17162F30989j02725M5125P3213P7375k87161j05731L56920l21471L27762k58573
$$ y = [583212, 279733, 348545, 144048, 364542, 288681, 530423, 411245, 392188, 204031, 421218, 372498, -22020, 455770, 26137, 553802, 612160, 91792, 279314, 272561, 213934, 482724, 427267, 518554, 420581, 428044, 530694, 308685, 663826, 225144, 329133, 500006, 300328, 404150, 127665, 336775, 323881, 458756, 71833, 603976, 373600, 578729, 534301, 145048, 343018, 350201, 391474, 557863, 637214, 330656, 612756, 284223, 324943, 654486, 398692, 188921, 430509, 597632, 378915, 387126, 676744, 384266, 286687, 443122, 426795, 180887, 337131, 845258, 564547, 643984, 786104, 755940, 630989, 528264, 573389, 646602, 723977, 436816, 331085, 688005, 366534, 694296, 435723]
17152D35723J19913P2164J78405k03934k47097J42006J91772r4271k07756K47154
17142F34079j72561R4229m0520l148r7299j27891J08777j85118J59983K37272
17132F07803k33080K36037k84901P9924M58316k62265p6018J54814C19368J63761
17122D83129L78202C76273M46338l06357N4913J15399J0348B46324M05589j87546
17112D64367K57174k23727K94952j99045K93732l79244J1817p2338L02106j52368
17102E97426N9871N5946l53123L585Q3897K50049J82332J41563m87301P4752K80694
17091H89691k49291Q5795p4185j46950L295P7324J55239k32342R7119j10377K13482
17080G08800L06004l36187n9704Q5077J52989k41199K8173L85619k90189j48497
$$ y = [435723, 555636, 627800, 806205, 602271, 355174, 497180, 688952, 594681, 386925, 634079, 461518, 555747, 515227, 512079, 414780, 286889, 395666, 210548, 370531, 607803, 374723, 610760, 325859, 405783, 864099, 601834, 525816, 680630, 319368, 483129, 861331, 376273, 822611, 516254, 571167, 686566, 696914, 246324, 651913, 464367, 721541, 497814, 792766, 593721, 887453, 508209, 520026, 447688, 749794, 597426, 657297, 713243, 360120, 363705, 447602, 697651, 879983, 1021546, 534245, 608997, 889691, 640400, 726195, 652010, 505060, 508355, 585679, 740918, 508576, 605695, 495318, 708800, 1014804, 678617, 618913, 703990, 856979, 615780, 643953, 1029572, 739383, 590886]
17070E90886K95556k44628L85136D24716K52801R7481r3859O7096N1127C71361
17059E98883l8799l7986J1364J13167K93282p5130j30242K29516j33698o7661
17049G62696L02727k49827J50162j14391m3032K75642m31119L45822k0004o3381
17039I15295J72200k82111K65329m37780L46707K8354J47688j53249k74305J78442
17029I06570J05584q1305J07316K93078j81635k03357l4485m1631P7121J51412
17019A098668J79513k94472j7143K74912J6298j80869J33031J84555l96026J16935
17009A115402l4126J577R5642q8807J12288N0050K83127l35460R8327j92096L90341
16998A496265j20583K4760m25487J58012L0143j64914L34835l54809N39473j48170
$$ y = [590886, 886442, 641814, 1026950, 424716, 677517, 774998, 681139, 748235, 799362, 371361, 598883, 560084, 522098, 533462, 646629, 939911, 864781, 734539, 964055, 830357, 762696, 1065423, 815596, 965758, 851367, 808335, 1083977, 652858, 998680, 978676, 915295, 1087495, 805384, 1070713, 632933, 979640, 1007994, 1155682, 1002433, 728128, 906570, 1012154, 930849, 1038165, 1331243, 1149608, 946251, 911766, 870135, 947256, 1098668, 1278181, 983709, 966566, 1241478, 1257776, 1076907, 1209938, 1394493, 998467, 1115402, 1081276, 1082853, 1178495, 1089688, 1201976, 1252026, 1535153, 1199693, 1298020, 1105924, 1496265, 1375682, 1400442, 974955, 1132967, 1163110, 998196, 1333031, 978222, 1517695, 1369525]
16988A369525k25241J60901O0362J90623j69122j08888j28513N25121m97526K51938
16978A429180R3984q7166r3762J25109r6660J76051P8580j54927K19763L5491
16968A725643k50089j53714P6670K91931k28755K04940k95173R7549K01460q184
16958A662278j52791L32964l31074k7612M35424k68142j74011M32361O6696j23516
16948A852577j99058K46501J21840l13015N03400m43701L86204k77927j58264
16939A718557K29417Q9751j6780N731p9249K4227J08595L70867m51698j50304
16929A849114L58946L21J3514j81038L0984j06557K13426J06727n95917P67010
16919B456530m14022N34539k24513Q3742R9414o7553j86716M57443l9265q3164
$$ y = [1369525, 1144284, 1305185, 1365547, 1556170, 1387048, 1278160, 1149647, 1674768, 1177242, 1429180, 1523164, 1435998, 1342236, 1467345, 1370685, 1546736, 1625316, 1470389, 1690152, 1725643, 1475554, 1321840, 1398510, 1690441, 1461686, 1666626, 1371453, 1469002, 1670462, 1662278, 1509487, 1842451, 1511377, 1483765, 1919189, 1651047, 1477036, 1909397, 1976093, 1852577, 1653519, 1900020, 2021860, 1708845, 2212245, 1768544, 2154748, 1876821, 1718557, 1947974, 2037725, 2020945, 2026676, 1947427, 1971654, 2080249, 2451116, 1999418, 1849114, 2208060, 2208381, 2221895, 2040857, 2071841, 1965284, 2178710, 2285437, 1689520, 2456530, 2042508, 2577047, 2352534, 2436276, 2535690, 2468137, 2281421, 2738864, 2699599, 2616435]
16909B616435J72294j46993K05224J15459m38687K92122J02708j20215J06505
16900B904852k00659J14794M9830N2334K64773k06455K26879k54088K54908k43574
16890B963594K38196K19287j62706j68949K54513L15363j87138K77633m26584
16881C323209K08199J84917m68689L09874J69083M66215m04217l1273K64919M3713
16871D065950Q1432J1921L8861j12321j62681L96846j78384K76585q759J38713
16861D548163j98180J39308j2245J81613p5555M31567K50768o15987N30783j16575
16851E063660J53574L21146J40907N3879j42814J37756K59317J95214m23339N40546
16841F299846n1384r4806R0162J02446M00712j27553L29252K82595l73790m1929
$$ y = [2616435, 2788729, 2641736, 2846960, 2962419, 2523732, 2815854, 2918562, 2798347, 2904852, 2704193, 2818987, 2868817, 2921151, 3185924, 2979469, 3206348, 2952260, 3207168, 2963594, 3201790, 3421077, 3258371, 3089422, 3343935, 3659298, 3472160, 3749793, 3323209, 3531408, 3716325, 3247636, 3557510, 3726593, 4192808, 3788591, 3757318, 4022237, 4065950, 4147382, 4159303, 4198164, 4085843, 3923162, 4320008, 4141624, 4418209, 4409450, 4548163, 4349983, 4489291, 4477046, 4658659, 4583104, 5014671, 5265439, 4649452, 5180235, 5063660, 5217234, 5538380, 5679287, 5733166, 5590352, 5728108, 5987425, 6182639, 5759300, 6299846, 6248462, 6153656, 6243818, 6346264, 6746976, 6619423, 6948675, 7231270, 6857480, 6815551]
16831F815551N23535q2194N58847j60595L40242l49770M24167R6144N7343J75388
16821H398658o0920M49002O19628k99983L89474Q4771K29027K19417j10121L02832
16811A0221785L25383K00627J02825N07913p7669O6660N92881K77103J15660K59058
16801A2592226M50014M76033j94518M47950L30677L33468K74318M59493K37839
16792A5407500M82250L82841L66266J43776P46508J46656O26949L12068P51647
16783A9366461K82338N52224P37610M73824O30626N59535O92577Q75487L51378
16774B4522060Q82603Q39442P63492N04789P93036J085066M83157J721477N34768
16765C2129890N32539J449893J501222N84798J703783O65023J665505J339100
$$ y = [6815551, 7339086, 7256892, 7815739, 7655144, 7995386, 7645616, 8069783, 8165927, 8223270, 8398658, 8337738, 8786740, 9406368, 9106385, 9495859, 9580630, 9809657, 10029074, 9918953, 10221785, 10547168, 10747795, 10850620, 11358533, 11280864, 11347524, 11940405, 12217508, 12333168, 12592226, 13042240, 13518273, 13323755, 13771705, 14102382, 14435850, 14710168, 15169661, 15407500, 15889750, 16272591, 16638857, 16782633, 17529141, 17675797, 18302746, 18614814, 19366461, 19648799, 20201023, 20938633, 21412457, 22043083, 22602618, 23295195, 24170682, 24522060, 25404663, 26244105, 27007597, 27512386, 28305422, 29390488, 29873645, 31595122, 32129890, 32662429, 34112322, 35613544, 36198342, 37902125, 38567148, 40232653, 41571753]
16757D1571753J370706J112791J943866J343785J360948J821353K021480J732875
16749E4279557K071689J924787J858363K293694K083633K294171K322876K207361
16741G1336131K435365K304602K632833K364632K887108K299290K889952K590935
16733I1740848K518112K246199K356478K551046K191161K146266J587276J622275
16725A08959661J773333J084653J123287N33998J072617R1257P7610n67120k51457
16716A13897839j127206j063239j248916j297327k116381j965107j707786k563249
16708A00808628k354499k138290k603227k648992k633934k586646k804105k593080
16700H0445855k289727k687958k198212k523568k512358k584771k339987k312891
$$ y = [41571753, 42942459, 44055250, 45999116, 47342901, 48703849, 50525202, 52546682, 54279557, 56351246, 58276033, 60134396, 62428090, 64511723, 66805894, 69128770, 71336131, 73771496, 76076098, 78708931, 81073563, 83960671, 86259961, 89149913, 91740848, 94258960, 96505159, 98861637, 101412683, 103603844, 105750110, 107337386, 108959661, 110732994, 111817647, 112940934, 113474932, 114547549, 114638806, 114716416, 114149296, 113897839, 112770633, 111707394, 110458478, 109161151, 107044770, 105079663, 103371877, 100808628, 98454129, 96315839, 93712612, 91063620, 88429686, 85843040, 83038935, 80445855, 78156128, 75468170, 73269958, 70746390, 68234032, 65649261, 63309274, 60996383]
16692F0996383j788585j976760k210747j802494j889653j840736k052003j407261
16684D6028144j428085j659730j253884j259582j482067j468182r79021j622263
16676C4875330p32696j144679j291044q50058r26928r05165p64785j006732p99173
16667B6454070q98525p59644o69645q38787k89386p99124m82833q68895o28648
16658B0218583m64395l94238m87964k49654m90000n54170m83346p78377k57845
16649A6058594k56379p99550r1915m57714J41481n87175k22347m31817k29561
16640A3123617l70260j34188r71957K87585m36472j25157p404k71686l76419n4976
16630A0662683k98450l25353j34013j19900l77799l22690n0798o4102l94562J15000
$$ y = [60996383, 59207798, 57231038, 55020291, 53217797, 51328144, 49487408, 47435405, 46028144, 44600059, 42940329, 41686445, 40426863, 38944796, 37476614, 36497593, 34875330, 34142634, 32997955, 31706911, 30856853, 29929925, 29024760, 28259975, 27253243, 26454070, 25555545, 24795901, 24126256, 23287469, 22998083, 22198959, 21716126, 20847231, 20218583, 19754188, 19359950, 18871986, 18622332, 18132332, 17578162, 17094816, 16316439, 16058594, 15802215, 15002665, 14910750, 14453036, 14594517, 14007342, 13784995, 13353178, 13123617, 12753357, 12619169, 11647212, 11934797, 11498325, 11373168, 11365764, 11094078, 10717659, 10662683, 10364233, 10038880, 9904867, 9784967, 9407168, 9084478, 9033680, 8969578, 8575016, 8690016]
16620H690016m84988P7915k28808j23009j90374J94398n35725L4380l0068k71635
16610G132102J33283k74774m79449J58803j28793l81800l13971L67841m4768K49060
16600F417534m31794k84952j2084k26799K1613M960P4869k70907l06126J79466
16590E165780k12400K4240r7255k87334J58161j08011M6673o5030Q9118l96138
16580D317804j1052R6024q0682j05826j5183j91239L40877m78015k94181N9140
16570C637667l7612J3004L38056p9357J44460l75929q3863j84825q2982K23876
16560C512495j07835J33559l16285O8598k75814L70254j27811o8093L6543O1107
16550C286718m25712K39515j53717j49591R1102l73822J1904J94825O3744P6987
$$ y = [8690016, 8205028, 8282943, 8054135, 7931126, 7740752, 7935150, 7399425, 7433805, 7403737, 7132102, 7265385, 6990611, 6511162, 6669965, 6541172, 6159372, 5845401, 6213242, 6168474, 6417534, 5985740, 5700788, 5688704, 5461905, 5483518, 5488478, 5563347, 5292440, 4986314, 5165780, 4953380, 4977620, 4880365, 4593031, 4751192, 4643181, 4689854, 4624824, 4713942, 4317804, 4306752, 4402776, 4322094, 4216268, 4201085, 4009846, 4350723, 3872708, 3578527, 3637667, 3600055, 3613059, 3951115, 3871758, 4016218, 3640289, 3556426, 3371601, 3288619, 3512495, 3404660, 3538219, 3221934, 3290532, 3014718, 3384972, 3257161, 3189068, 3225611, 3286718, 2861006, 3100521, 2946804, 2797213, 2888315, 2514493, 2526397, 2721222, 2784966, 2861953]
16540B861953k28600j008k74780K82183j24621L7314L5593M7544l73429r5115
16530B167034K86120p7980K83907P5853o87409L01198k21338k27778J88934J64706
16520B253247k88108J19208J10643m1353j3603m41774L82813l8734j02979O5945
16510B005305q7377K09223j48382l35509J59649p3309P7492o1457N953j28767
16500A622821J09206K67029m23371K90036k89885J41601j40786J09265j17977
16491A567939J59287L6106N5781l50677O4836r29j12800K49425j09179j35676
16481A424113m7921K34968j18160J50014k48082l6908J75871k18683J75791J2573
16471A503576j09040J4285q8741r5325J13407l02989M57648M5008N806j89926
$$ y = [2861953, 2633353, 2632345, 2357565, 2639748, 2515127, 2552441, 2588034, 2635578, 2262149, 2167034, 2453154, 2375174, 2659081, 2734934, 2047525, 2348723, 2127385, 1899607, 2088541, 2253247, 1965139, 2084347, 2194990, 2153637, 2140034, 1698260, 2081073, 2042339, 1939360, 2005305, 1917928, 2127151, 1978769, 1643260, 1802909, 1729600, 1807092, 1745635, 1751588, 1622821, 1732027, 1999056, 1575685, 1865721, 1575836, 1717437, 1576651, 1685916, 1567939, 1727226, 1763332, 1819113, 1468436, 1533272, 1532343, 1419543, 1668968, 1559789, 1424113, 1376192, 1611160, 1493000, 1643014, 1394932, 1358024, 1533895, 1315212, 1491003, 1503576, 1394536, 1408821, 1320080, 1224755, 1338162, 1035173, 1492821, 1537829, 1543635, 1353709]
16461A353709k82926q7008L20915n5808J24926l11485J68176n4677k80232M85336
16451A380926M0854m99555K37048K52308l68538M20737l40131Q8504q7987k14
16441A123952j59392j17831L72870l57125J42443j6192r8102M6481p1154K15191
16431A081141j47131l0105K80539J59458k82088n21900L34511K29447r1572n4857
16421I57443L3009q8060n8380j88642K71484R7222j31443j77133K17040k51214
16411F81326Q113M5774J51475J33015k06196m0582j05982L76291j74431J18452
16401I87255l96789K84099R3900j34481j38516j9370M83884k66722j24835J06115
16391H74540k65458L78553C13463K36385K85041J35743l18598J92465n4539R9575
$$ y = [1353709, 1070783, 983775, 1304690, 1248882, 1373808, 1062323, 1230499, 1175822, 895590, 1380926, 1421780, 922225, 1159273, 1411581, 1043043, 1463780, 1123649, 1212153, 1124166, 1123952, 964560, 846729, 1219599, 862474, 1004917, 988725, 890623, 937104, 865950, 1081141, 934010, 903905, 1184444, 1343902, 1061814, 539914, 874425, 1103872, 1012300, 957443, 990452, 902392, 844012, 655370, 926854, 1024076, 892633, 715500, 932540, 681326, 689439, 735213, 886688, 1019703, 813507, 772925, 666943, 1043234, 868803, 987255, 590466, 874565, 968465, 833984, 695468, 676098, 1159982, 893260, 768425, 874540, 609082, 987635, 313463, 549848, 834889, 970632, 652034, 844499, 789960, 889535]
16381H89535P8824j21390k08355J52343B22075L09164J59169n0947M2998m4212
16371F38247K28811k91548p0497J23876K49150j56515k56774K93164k38419L92769
16361I12264k58863o1362N3633p8446k02751M18010o0378j11285K76770B92114
16350D11157J61610O4702r2240j93224J01851J43373A45200P63517C26246O068
16340C32314O49260C79073J92605K2026J34319C32944L40899J06162B56819L06690
16330E63509j62984A27157P28019C16824q8754K33196R7433B65330L28825J38087
16320G32242k07221j29889n3558K01377L2857A80985M49028j55741k8376J04360
16310E50256J33010k19180j72743K3687L7020M8174Q8607m6175J9368k19921J88053
$$ y = [889535, 968359, 846969, 638614, 790957, 222075, 531239, 690408, 639461, 682459, 638247, 867058, 575510, 505013, 628889, 878039, 721524, 464750, 757914, 519495, 912264, 653401, 592039, 645672, 567226, 364475, 782485, 722107, 610822, 887592, 292114, 411157, 572767, 637469, 545229, 352005, 453856, 597229, 145200, 908717, 326246, 332314, 981574, 379073, 571678, 593704, 728023, 332944, 673843, 780005, 256819, 563509, 400525, 127157, 855176, 316824, 228070, 461266, 558699, 265330, 594155, 732242, 525021, 395132, 341574, 542951, 575808, 180985, 630013, 474272, 445896, 550256, 683266, 464086, 291343, 315030, 352050, 400224, 488831, 442656, 462024, 242103, 430156]
16299D30156N5674A79360L41282B44723H6856K33307j26975J62483J47246j66815
16289C36102l4295q5086k8298M62542j20117o11B47022m414K22240r6418Q6414
16278D54844j33499J54048j01106Q5099j7461J3193j64322O2581J3051j55119
16268B11309J26528K43466k03655I4857R7754J92539A78468K34357k9636J26091
16258E09280j32856R7591M3082j04236O7453J1560j5049I8181R6407L537J85143
16247C83268J1488o659l0968J19169N0004j19489j52974c5851B58766K82350A52712
16235D89556G1018j8930J4883J68143E4141K51588k5689N7394A38189E0382b08231
16223C32813o3877K325D1691J24468o9174J31051H3065M72317k24628F5661J12909
$$ y = [430156, 485830, 179360, 520642, 244723, 86856, 320163, 193188, 355671, 502917, 336102, 301807, 216721, 188423, 650965, 530848, 530237, 247022, 242608, 464848, 368430, 454844, 321345, 475393, 374287, 459386, 441925, 455118, 290796, 353377, 366428, 211309, 337837, 581303, 377648, 94857, 192611, 385150, 178468, 412825, 383189, 509280, 376424, 474015, 517097, 412861, 480314, 491874, 476825, 98181, 194588, 198125, 383268, 394756, 388097, 357129, 476298, 526302, 406813, 253839, -35851, 258766, 541116, 152712, 489556, 71018, 52088, 66971, 235114, 54141, 305729, 280040, 337434, 138189, 50382, -208231, 332813, 268936, 271261, 41691, 166159, 96985, 228036, 83065, 555382, 330754, 65661, 178570]
16212A78570R5921m2254f7831B36879K08493A01248K37050A36836P1862C0970
16201D14762j57233H4584J89762o2999n4298L5066M01350B27310p1866J98682
16191C54126A30170D7623f8444C83762K57117A81130b8336f153B61481b68374
16180a8967j37938d3760B31243a69852C15127j22633N5093J65970A71846o0589
16170A11257K2981L52055b43806B41789b30442R1736B65093J79907B16257Q7098
16160C03355P9688C5374m26K80521j48714B8320c4194E90363j73846j48152o8305
16149B00060J09649B1852M8712B9780J26911P2472p9000l0853K9817a5742A41541
16137C02191r8266G3657K1192K32437a36174L3247C62802A18491J65989A272L36622
$$ y = [178570, 274491, 232237, -67831, 236879, 445372, 101248, 338298, 136836, 208698, 30970, 414762, 257529, 84584, 274346, 211347, 157049, 192115, 593465, 227310, 155444, 354126, 130170, 47623, -68444, 383762, 640879, 181130, -28336, -6153, 261481, -268374, -18967, -156905, -43760, 231243, -169852, 315127, 192494, 247587, 413557, 171846, 111257, 134238, 486293, -243806, 241789, -230442, -138706, 265093, 445000, 216257, 303355, 383043, 35374, 34948, 315469, 166755, 28320, -34194, 590363, 416517, 268365, 200060, 309709, 21852, 70564, 29780, 156691, 229163, 150163, 119310, 149127, -15742, 141541, 302191, 203925, 73657, 94849, 327286, -136174, -102927, 362802, 118491, 284480, 1272, 337894]
16126C37894h263D86432j71172F9057a43209A57453G181J98007J19086E6342a16285
16114C1321J89578H6286a44388E1326c4465A04994Q9750n7631K68178j84186I9399
16102C78525J11183K13088A61951C5989K52756b01892A56761D9531M35466E4723
16091d8194k3471B09245J96206a72118C3072h7513B86189n0846C7663L58273a4306
16079b06743P2024A40338c27188D40782E8768K34620D5446P3294L26534i5796
16068C06166L4145F7088J40202j5398q4608b67879G5293K2746C4419i0951A3842
16056B44612C8459a45954D82871b66777Q4448E0582K1855J89842L22179a55930
16045C02796a54046A38319M6493J15361E9118a47651C15172c45506e0348A10065
$$ y = [337894, -8263, 486432, 315260, 69057, -143209, 157453, 7181, 205188, 324274, 56342, -116285, 31321, 220899, 86286, -144388, 51326, -34465, 104994, 194744, 137113, 405291, 221105, 99399, 378525, 489708, 702796, 161951, 35989, 288745, -201892, 156761, 49531, 484997, 54723, -48194, -71665, 209245, 405451, -172118, 33072, -87513, 286189, 235343, 37663, 395936, -14306, -206743, -134719, 140338, -327188, 440782, 58768, 293388, 45446, 118740, 445274, -95796, 306166, 340311, 67088, 207290, 191892, 107284, -267879, 75293, 98039, 34419, -90951, 13842, 244612, 38459, -145954, 482871, -266777, -182329, 50582, 72437, 262279, 584458, -155930, 302796, -154046, 138319, 184812, 300173, 59118, -147651, 315172, -345506, -50348, 110065]
16034A8087K62997F2961J06608J33947a07475B36604h1158I6021K42556h1810
16023A18457K30960M7666A44522J10534J1641a35022f1825j5350B6062M914b91295
16011a25253L5997B40346p7224J71532A1603J25750I452J16300a10005b6043D7880
15999a70300A25033b6294A49731D8603P9532n7142R2177G8347L44510A55195j9362
15988A35833M60536M61979K56602J2950j99690J09522k95932M6891l79920B38069
15977a00247C98772J3565A30035m5936C0288J94620F4700i8664C3545a3466M555
15966h911F976a25357A0193J3747J29388J2436a0035p7640A01876c08146A15823
15954A05511O4291c34972I7173e6208J7098A07111J17733C6953a4398B75983b11391
$$ y = [18087, 281084, 62961, 169569, 303516, -107475, 236604, -81158, 96021, 338577, -81810, 118457, 349417, 397083, 144522, 255056, 266697, -135022, -61825, -77175, 26062, 30976, -291295, -125253, -89256, 240346, 163122, 334654, 11603, 137353, 9452, 125752, -110005, -26043, 47880, -170300, 125033, -26294, 149731, 48603, 128135, 70993, 163170, 78347, 422857, 155195, 135833, 596369, 1058348, 1314950, 1327900, 1128210, 1237732, 941800, 988691, 608771, 238069, -100247, 398772, 412337, 130035, 84099, 30288, 224908, 64700, -98664, 33545, -13466, -8911, 6976, -125357, 10193, 23940, 153328, 165764, -10035, -87675, 101876, -308146, 115823, 105511, 169802, -334972, 97173, -56208, -39110, 107111, 224844, 36953, -14398, 275983, -211391]
15942A35332F2590J26959G9939a73727k33984A81020p5627e1450B1626a1229k30632
15931b41861O1824G4055a83463F6268J8180J8267h5247n4248M0045o1532A91386
15919a73083E7252N2416g8718A5222J00208g874B03446b54887A98350I1715l9836
15908E1879f2885l86901A25234a07379j51975j349P2190f1228q2766B20531b1862
15896B10068a87102j21008O512O7638A92223b79257D1848d1448A66340g1093G511
15884E0548J03799C9605a28222j12292a02944j10230h2962A51426b00036A32035
15873A4045b56018c0434o5211l7780B10535b53315Q170B33036a29663c9844j18499
15862a58343D7933b8967g458k99421c1101P577k38008o7920L4085A22086F498
$$ y = [135332, 62590, 189549, 79939, -173727, -407711, 181020, 105393, -51450, 21626, -11229, -241861, -180037, 74055, -183463, 66268, 84448, 102715, -85247, -139495, -99450, -160982, 191386, -173083, 57252, 109668, -78718, 15222, 115430, -7874, 203446, -254887, 198350, 91715, 51879, -62885, -449786, 125234, -107379, -259354, -260703, -188513, -61228, -143994, 220531, -21862, 210068, -187102, -308110, -301598, -233960, 192223, -279257, 41848, -41448, 166340, -71093, 7511, 50548, 154347, 39605, -128222, -240514, -102944, -213174, -82962, 151426, -200036, 132035, 14045, -256018, -30434, -95645, -133425, 210535, -253315, -245145, 233036, -129663, -39844, -158343, 47933, -28967, -7458, -306879, -31101, -23524, -261532, -329452, -295367, 122086, 6498]
15850D08640E1405d4784k01199I1787K25322B4921M3546a27070A74265a08876
15839a98321e9976r2447L2090j16872C10694b30671L3450d7982h969A9068h9174
15827A12827i4978j44192k09865b04913G5266K15479a55720q8916h6222A13112
15816A2528I80c4848q2659A0899a4266H7693j1673e7056A50311b30153H784d2618
15803D6083K97937j48282p8201L6356i3964A12316d414m5688J9929B9062a04123
15791G6989d3427B12402O9125b27328a06279I0416C1925f5656F5930B8777b8823
15779a35266M4862j74895o249I0767a27467A93323J27085a10684C37978a30500
15768G5449g529B55487j07350J14996p7768a53403c3766G4213K2013D0480A7644
$$ y = [408640, 51405, -44784, -245983, 91787, 317109, 24921, 68467, -127070, 174265, -108876, -198321, -59976, -152423, -120333, -237205, 310694, -230671, -197221, -47982, -8969, 19068, -89174, 112827, -94978, -239170, -449035, -204913, 75266, 290745, -155720, -244636, -86222, 113112, 12528, 980, -34848, -117507, 10899, -14266, 87693, 76020, -57056, 150311, -230153, 8784, -42618, 46083, 344020, 195738, 117537, 153893, -93964, 112316, -4414, -50102, -30173, 29062, -104123, 76989, -43427, 212402, 281527, -227328, -106279, 90416, 31925, -65656, 65930, 28777, -28823, -135266, -90404, -265299, -271548, 90767, -127467, 193323, 320408, -110684, 337978, -130500, 75449, -7529, 255487, 148137, 263133, 185365, -153403, -33766, 74213, 96226, 40480, 17644]
15756A74397c1223B40944l003k0865f99k15529A96508P25H9959Q6898o3342k937
15744A10578b7093A9103H63O5223a61167l47021f2479B12920d45376g3132K7617
15733d5515A18794d66473B33770c45866B24862b51436J5001a16021c9730k30215
15723b69945A26509e9236j5501D70083a2251k2650B6855a37146F9502b10048b263
15711i2081B0573c7077A44288B1542M6040b08549r870A16291d5906p7045A40781
15699b11920f0458B80859a75703l51078K26765g494k89924D4567O5089K32676
15689C42332A67440k7837a67346N0232L4949A40918n4932B8435f7608A47324l5085
15678A12239J30960m6612g9121B40246I2312e5028A08177a612j87335B65150d277
$$ y = [174397, -31223, 240944, 237941, 217076, -699, -216228, 196508, 197233, 89959, 176857, 113515, 110578, -27093, 19103, 863, 66086, -161167, -508188, -62479, 212920, -445376, -73132, -45515, 118794, -466473, 233770, -345866, 224862, -251436, -236435, -116021, -39730, -269945, 126509, -59236, -74737, 470083, -12251, -34901, 26855, -137146, 69502, -210048, -2263, -92081, 20573, -37077, 144288, 21542, 67582, -208549, -218419, 116291, -45906, -122951, 140781, -211920, -60458, 280859, -175703, -526781, -300016, -7494, -297418, 44567, 109656, 342332, 167440, 139603, -167346, -117114, -82165, 140918, 85986, 28435, -67608, 147324, 112239, 243199, 196587, -79121, 240246, 92312, -55028, 108177, -1612, -188947, 265150, -4277]
15666B32755F930J06945b60173a2446p566j00657j78926F55b01449C8810b91176
15654f0797j14295O2067I8219c03323i646C38240j27025G7177c89541g6985L0257
15643d6728C53356a14536k227D9389I846a19759m9870m465A07615a00595E0410
15631B97414b27561l05012b1399l55379f3379h165j05278C14414d421A1453b4313
15619A92975Q6462a73232D392c58878a8812m2492D0667g1574j59379B8614b77481
15607B37381a18535j07594B9905K9880Q1271b51076J11513a0388A25776a45941
15596C5372a22792R842K866r6850r4641a15692N5294C1430M2278a5968m6167r0510
15584a52645O0769B70296A24045a3472k67326b5730l4634j78301A66460l9358
$$ y = [232755, 6930, 113875, -260173, -12446, -20012, -120669, -299595, 655, -201449, 38810, -291176, -60797, -175092, -113025, 98219, -303323, -9646, 338240, 211215, 77177, -389541, -76985, -46728, 353356, -114536, -116763, 49389, 9846, -119759, -169629, -174094, 107615, -100595, 50410, 297414, -227561, -532573, -21399, -376778, -63379, -8165, -113443, 314414, -4421, 11453, -24313, 192975, 279437, -173232, 4392, -358878, -18812, -61304, 40667, -71574, -230953, 28614, -277481, 237381, -118535, -226129, 29905, 59785, 141056, -251076, -139563, -10388, 125776, -145941, 35372, -122792, -112950, -110084, -206934, -301575, -115692, -60398, 31430, 73708, -15968, -62135, -152645, -91876, 270296, 124045, -13472, -280798, -25730, -60364, -238665, 166460, 127102]
15574A27102h3440j73612B65827G1554B4356c70389I0338a02752B0692O2804d167
15562H3497B7765K38434A3353e4270k45479a38919c7676k67145a10588q6867B40908
15550a76860d1543B45306c9657J8425B18590d1807j22442N8246B53482a98895
15539c6110B42997j00585a50499B13533i3543B80005I673g0114C69852g8626B23212
15527A3942L08857a4685C54138i1700a3793C72069h3427C8041M007f868B87984
15515G0863J7257J0528J27998e3349B12517N359J02550p0456j03591a16403A67930
15503A37242a81405G6982K84616D4670K12125f4709C65017N8557F0238K27405
15493B87643g4251A22087K23009r6620H0725g4563C88196A76840d0100j57685
$$ y = [127102, -83440, -257052, 265827, 71554, 24356, -370389, 90338, -102752, 20692, 83496, -4167, 83497, 27765, 266199, 13353, -54270, -299749, -138919, -37676, -304821, -110588, -197455, 240908, -176860, -41543, 245306, -39657, -21232, 218590, -41807, -164249, -106003, 253482, -198895, -36110, 242997, 142412, -150499, 213533, -93543, 280005, 9673, -70114, 369852, -78626, 223212, 13942, 322799, -14685, 354138, -91700, -13793, 372069, -83427, 38041, 42048, -6868, 287984, 70863, 88120, 98648, 226646, -53349, 212517, 217876, 320426, 249970, 146379, -116403, 167930, 137242, -181405, 76982, 361598, 44670, 256795, -64709, 365017, 423574, 60238, 287643, -74251, 122087, 345096, 248476, 80725, -74563, 388196, 176840, -40100, -197785]
15483a97785G5197P8353J65186a205C7232K9816a63843B52873J6386M2011K82213
15472E93483J86361B45534K92805A06208D6341c7930C04630D228a45027F7954
15461h025A8681K08784P8405B8875b87019g3336j86535d6605k04655D60789e9560
15449a38400A30130Q2317a39595H3476a63398A20228L48182k00074P09786J77378
15439A155500j50956k02414j9573A62401G194Q8364O6629m3155Q0108f8065K3455
15428d4610B7005J53957e8020A37722P1658c3553n0247b9087D41016C8389a50640
15416A72918J01844j07727b41119N0064q6438B64941c26754f9274F2850K6082
15406H8932J73608g1929H6306b40481A11821a32670a5762p8983j24188b2232B36226
$$ y = [-197785, 75197, 153550, 318736, -1205, 37232, 67048, -163843, 252873, 269259, 311270, 593483, 779844, 245534, 538339, 106208, 46341, -37930, 304630, 4228, -145027, 67954, -8025, 18681, 227465, 305870, 28875, -287019, -73336, -259871, -46605, -251260, 460789, -59560, -138400, 130130, 212447, -139595, 83476, -163398, 120228, 468410, 268336, 978122, 1155500, 1004544, 802130, 782557, 162401, 7194, 95558, 162187, 119032, 199140, -68065, -44610, 27005, 180962, -58020, 137722, 209380, -33553, -83800, -29087, 441016, 38389, -150640, 172918, 274762, 167035, -241119, -191055, -277493, 264941, -326754, -69274, 62850, 88932, 262540, -71929, 86306, -240481, 111821, -132670, -15762, -94745, -218933, -22232, 236226]
15394A32959a25910A9951K7805d3488A42998Q238a65272A33668n3416d9177A1128
15382c76669h7290C72432a89235D51879F5240N47190B15760f2233b150E23715
15371B13420l1608J95318i8862A87025i0358d244A71980b06784A53813J43216
15361B97029k2992c9712C66193j18956K5428o1481G9588J21204I9461J92939B5281
15349a76955B11635B3174J33031l1751R9534L92675d073C23395K62832e4512D07783
15337B35391G4350b56782A04589n0765a7873I4403d429A6380h0378C07008a18958
15325A49645d8502k62016a38818B62980q7981P1405l1250D1738M2776A3188K43252
15314B56440c8808D25541A62464K04185G9076M58440B5821F448L50287A68047
$$ y = [132959, -125910, 19951, 47756, -43488, 142998, 151236, -165272, 133668, 80252, -49177, 11128, -376669, -87290, 372432, -189235, 451879, 65240, 612430, 215760, -62233, -2150, 523715, 213420, 181812, 377130, -98862, 187025, -90358, -4244, 171980, -206784, 153813, 297029, 274037, -39712, 366193, 247237, 272665, 211184, 79588, 200792, 99461, 292400, 25281, -176955, 211635, 23174, 156205, 124454, 223988, 616663, -4073, 323395, 586227, -54512, 407783, 235391, 74350, -256782, 104589, 53824, -17873, 94403, -4429, 16380, -80378, 307008, -118958, 149645, -48502, -310518, -138818, 262980, 174999, 246404, 215154, 41738, 84514, 13188, 256440, -38808, 425541, 162464, 366649, 79076, 537516, 25821, 6448, 356735, 168047]
15303B28752b87529f618D2126K3099b37078a6059j52541D09703a71675C05035
15292B08726d2006C46156F4186g420k92577A51017j7064n8272O2651Q4460A00595
15280C5240a7468F7248j5884A6150a71431E7243a29408a7675m03A42743a39628
15268a23290A35114a1152j86159M9585D9937A4514c2034A21467l8957L6333L5833
15257A54676O3848h9204j52169C07492a86587A64430D7008a08393B18241H7779
15246G4891J498L28597j9900N38951P40063l65918J66311k5154n58608p2510B43039
15234A69105n7049k6238c23592J40177B4498J1127b31923B27309q8361J24231
15224B63179c3819j51209A95430a6328A03545j092m1486k1693A1516L27204C5950
$$ y = [228752, -287529, -6618, 42126, 65225, -237078, -16059, -168600, 409703, -171675, 305035, 208726, -42006, 346156, 64186, -7420, -299997, 151017, 133953, 75681, 138332, 222792, 100595, 35240, -17468, 67248, 51364, 16150, -171431, 57243, -129408, -17675, -18078, 142743, -139628, -123290, 135114, -11152, -197311, -147726, 49937, 14514, -32034, 121467, 82510, 118843, 154676, 218524, -89204, -241373, 307492, -186587, 164430, 47008, -108393, 218241, 87779, 74891, 76389, 404986, 385086, 924037, 1664100, 1298182, 1464493, 1439339, 880731, 808221, 243039, 169105, 112056, 85818, -323592, -183415, 24498, 35625, -231923, 227309, 138948, 263179, -33819, -185028, 195430, -16328, 103545, 102453, 60967, 39274, 11516, 338720, 35950]
15212c0745A81501m0775D6144c67754H1882j3537a8444G8522P4005f4304k715
15201f7019A76206a3721A86647n5251c44882a39582q6223B82118a52290B67902
15190B08891b935k68187B67369q8444O4904D323L01959A3166M1235J98280K446
15179B55127F3794d7707F750L9932c2425j92319D53579A12030J31910a6971C11611
15167A75457a35768A79416a25455A66051g1424K931D69470b10348g7796A14545
15156b52881B66728j11323J67110G2215J57771K29060a02817C05158L1077A57735
15145A46248a94520A90379k3945c1277C10639C9884J07660P7801A04684L15912
15135D20596q658f6953E6805a6408E1442j2605K58802f3598K6212J6448B55640
$$ y = [-30745, 181501, 140726, 46144, -367754, 81882, 68345, -18444, 78522, 152527, -64304, -67019, 176206, -13721, 186647, 131396, -344882, -139582, -225805, 282118, -152290, 267902, 208891, -2935, -271122, 267369, 178925, 243829, 4323, 306282, 13166, 54401, 252681, 255127, 63794, -47707, 6750, 46682, -32425, -224744, 453579, 112030, 243940, -16971, 311611, 175457, -135768, 179416, -125455, 166051, -71424, -68493, 469470, -210348, -77796, 114545, -252881, 266728, 155405, 322515, 72215, 229986, 459046, -102817, 305158, 336235, 157735, 146248, -194520, 190379, 166434, -31277, 310639, 39884, 147544, 225345, 104684, 420596, 411938, -66953, 56805, -16408, 51442, 38837, 297639, -63598, -37386, -20938, 255640]
15123A9135K7321L54764o4104Q6191m8729A83539n8119J43492m7457r1622n7756
15112G2077b80054A26697D1580M4099p172K56883j1990F6711J36360J18419A59367
15100B98715A2744c1692A69943k0861E2680n996J91588H480P1539b96686B79737
15088D0941J8526J27414k2774o2446A2991f6068A43955D4503a1482C95795F2350
15076C11867l5149J57821A43267P3536h0074A71883d4798B08785a41487N9309
15066h2178A38555a2522D06281j33636f2293F6028O7629n3600P7136K66992j85170
15055B39015K72567B45086p6389J12652G67M95295j77489r7609J84439j66578
15045B38825O9510L6613K95666k69932q9997P5840j23467H7460L53978A25272
$$ y = [19135, 46456, 401220, 337116, 423307, 374578, 183539, 125420, 268912, 221455, 129833, 72077, -280054, 126697, 41580, 85679, 78507, 335390, 323400, 66711, 203071, 321490, 159367, 298715, 12744, -31692, 169943, 149082, 52680, 46684, 238272, 8480, 80019, -296686, 279737, 40941, 59467, 186881, 164107, 101661, 12991, -66068, 143955, 44503, -11482, 395795, 62350, 311867, 276718, 434539, 143267, 216803, -80074, 171883, -44798, 208785, -141487, -82178, 138555, -12522, 406281, 272645, -62293, 66028, 133657, 80057, 157193, 424185, 239015, 511582, 245086, 168697, 281349, 767, 496062, 318573, 220964, 405403, 238825, 308335, 344948, 640614, 370682, 280685, 356525, 233058, 87460, 441438, 125272]
15034C21199j19151J73082L44109m2177j32915l202K33049M2785C14458K76289
15024E90747j75442j36040H0325L90604o4461K24115C12823J64046j95191J81772
15014D63450J40284o4023A37619J96400H6649M80603l5649q2986A46657p0450
15004G6207K35642A14517M6371G0062M06966J77477N529j92389j70105J4018K12328
14993E23886j33334K23257j96242K3712j53066M63944j78089J86496j51403K74707
14983H83868j78964J0299J3804L8206k23178j84350A32552L94593J39590k38248
14973D28487F6736N85973J38937C33875L63959l465k99495k4559p1451P791g3655
14961A69418K74896Q3886A47313J12733f3482D67669N5502P0112A98555H1609
$$ y = [321199, 202048, 375130, 719239, 677062, 544147, 540945, 773994, 816779, 314458, 590747, 415305, 279265, 80325, 470929, 406468, 630583, 312823, 476869, 281678, 463450, 603734, 539711, 137619, 334019, 86649, 567252, 531603, 448617, 146657, 76207, 311849, 114517, 160888, 70062, 477028, 654505, 660034, 467645, 297540, 311558, 523886, 390552, 613809, 417567, 441279, 288213, 752157, 574068, 760564, 609161, 883868, 704904, 715203, 729007, 767213, 544035, 359685, 132552, 527145, 666735, 428487, 66736, 652709, 791646, 333875, 697834, 694369, 394874, 370315, 298864, 306655, -73655, 169418, 444314, 528200, 147313, 260046, -63482, 467669, 523171, 593283, 198555, 81609]
14950E20890k31933J11997A59656J58601j4720L0991K82729J0299j40322r7206
14940C90028J46817R0584B96051K13807J98536l32839o5951J70541j22847M41664
14930G98962K59543m7878K71534N5306J04728J24525j54134M72151m41855O1958
14920A504840k017o3326L36036K54638J31295O0212o63276j62326k10808m16579
14910G68689j34999J31988M1322n8834j58677o2360N4803m6982j55093M3786n7118
14899C66525J39959m9811m0262A92088n5695R2980J89040j99064M24597L7087
14889F81033l06586J24458J70802j09891k25526M51837k01838K02442C29997M10569
14879G40566P5812L8434k54967K37364l68889N73829D30555J9823B15849K45853
$$ y = [520890, 288957, 400954, 159656, 318257, 303537, 334528, 617257, 627556, 487234, 390028, 536845, 627429, 296051, 509858, 708394, 375555, 309604, 480145, 357298, 798962, 1058505, 1010627, 1282161, 1337467, 1442195, 1566720, 1412586, 1884737, 1442882, 1504840, 1502823, 1439497, 1775533, 2030171, 2161466, 2221678, 1558402, 1396076, 1185268, 768689, 633690, 765678, 807000, 748166, 589489, 527129, 581932, 534950, 379857, 423643, 366525, 506484, 456673, 416411, 192088, 136393, 229373, 418413, 219349, 643946, 681033, 374447, 498905, 669707, 559816, 334290, 786127, 584289, 786731, 329997, 740566, 816378, 854812, 599845, 837209, 468320, 1042149, 430555, 450378, 215849, 461702]
14869D61702J65574l12317K08442j17672L68430R081l90490J87463J67097l09781
14859D37529q9790A24454J44413o95n3979j3162L76423j30938j74661J77927Q3232
14848E33014Q649n6962K30270o4814L0566P4532M16229l09371P8579O3576Q2933
14837A087201l01878j81120P0050l5931j03425P6940A67477M80628L35551m41641
14827E42015o4219J079B22236M21478C04539L50397j68434K14827L7272K40842
14817I79443j38403k08571K34084D28821L53064k14765j68455J83667n4378M57523
14807I85477j38177j11933J98822O5813J03278r9793k06167k72870n7169j85797
14797B81484L64540A29656J78435L84669q7772j52214N2527p6964L94235l25861
$$ y = [461702, 627276, 314959, 523401, 405729, 774159, 783240, 392750, 580213, 747310, 437529, 347739, 124454, 268867, 268172, 214193, 201031, 577454, 446516, 271855, 449782, 533014, 541663, 484701, 714971, 650157, 680723, 755255, 1171484, 862113, 940692, 1004268, 1087201, 785323, 604203, 674253, 638322, 534897, 611837, 167477, 648105, 983656, 542015, 477796, 478875, 222236, 643714, 304539, 654936, 486502, 701329, 738601, 979443, 841040, 632469, 866553, 428821, 781885, 567120, 398665, 582332, 527954, 985477, 847300, 735367, 934189, 1000002, 1103280, 1003487, 797320, 524450, 467281, 281484, 646024, 129656, 308091, 692760, 604988, 452774, 505301, 428337, 822572, 496711]
14787D96711K07789j45803I2613M95729J66393r9233O9511k75781L16842K59025
14777A025099D86540N99029l92458J3649K82974j56430o8538k16653K4646L84604
14767I57363D75519O6078O0708j28639J85581j23829J16859k70180Q9259J53530
14757F24886B96140N55212J39262D05761j17567M08344j14826N881p7104j68299
14747C42190L78367j63181L22814r20k67931O4500m0297l8153L34783j84821o3946
14736F83405J03339r555L6744N8185k36987K21940J17316O1589M07782L5078L59086
14725A837922l67221j74323R2485k17582k47333J39961K64233k58153j67297k51633
14715F51059k07918N83669m5962l0862l43488J54312L91945J15167l68022K57561
$$ y = [496711, 704500, 558697, 92613, 588342, 754735, 655502, 725013, 449232, 766074, 1025099, 486540, 1085569, 693111, 706760, 989734, 833304, 764766, 548113, 572759, 957363, 475519, 541597, 602305, 473666, 659247, 535418, 652277, 382097, 471356, 624886, 296140, 851352, 990614, 405761, 288194, 696538, 581712, 587593, 510489, 342190, 720557, 557376, 880190, 879270, 611339, 675839, 635542, 597389, 932172, 747351, 683405, 786744, 777189, 813933, 872118, 635131, 857071, 974387, 1035976, 1443758, 1478836, 1837922, 1470701, 1296378, 1388863, 1171281, 923948, 1063909, 1328142, 1069989, 902692, 651059, 443141, 1026810, 980848, 949986, 606498, 760810, 1152755, 1267922, 899900, 1157461]
14705A157461j04690k11764O86919q6479J13981r0133J04286j68389m7597n38395
14695H15200K44646j7572j83652Q9991D22110O39263k26667j1407M4804M7580
14685I15683o3392O6311l86534L88590l00393P78080m67026l40120L45765l31045
14675F05919K34805j74974L53087l48714P2603j3552J44162n9860K74502l31353
14665G56625K73296r3407m6541R557P1287N7370r6089K41326k08547N01893m07443
14654A059327M01564j09640l99503L31695k63714K8094l4478J7305J63230j68923
14644A024957J14209J14303n80457J72196M03122j37916R6256Q8211j01869q2924
14634A110088n4914K5778J07602l64314L39780J08433j88200J94906J19570J57303
$$ y = [1157461, 1052771, 841007, 1527926, 1441447, 1555428, 1465295, 1569581, 1401192, 1353595, 815200, 1059846, 1042274, 858622, 948613, 422110, 1061373, 834706, 823299, 868103, 915683, 852291, 918602, 532068, 920658, 620265, 1398345, 931319, 591199, 936964, 605919, 840724, 665750, 1018837, 670123, 742726, 729174, 873336, 813476, 1087978, 756625, 1029921, 936514, 889973, 899530, 970817, 1028187, 932098, 1173424, 964877, 1466770, 1059327, 1460891, 1351251, 951748, 1283443, 1019729, 1047823, 1013345, 1030650, 1193880, 1024957, 1139166, 1253469, 673012, 845208, 1248330, 1110414, 1206670, 1294881, 1193012, 1110088, 1055174, 1080952, 1188554, 824240, 1164020, 1272453, 1084253, 1279159, 1398729, 1556032]
14624A556032l03490m71282P09280l35515j16728M79877k50184j44926K9170L91448
14614A543682l63029J67255j80366K51010n8242O2517r198K04591k90189L18271
14604A646302o1333l23724Q4786K19307J76554m18567J85643O8551l4887K83591
14594A826223l0154k91091K34071N3131l58384L05112j66064K2291J26671M9065
14584A770871J3963O240j77560L17467j17927n30407N11232r4830l4308J34826
14574A799567M27269k13972k0992J4312N1249l5166J3365j38468M10570m24220
14564A883514J63974O09039j64816n0041L29584j00511K32609j11080Q2818N34758
14554C409848p57n31K75358J054121J071935K218071L341788O714496J5241745
$$ y = [1556032, 1252542, 781260, 1490540, 1155025, 1038297, 1518174, 1267990, 1123064, 1152234, 1543682, 1180653, 1347908, 1167542, 1418552, 1360310, 1422827, 1413629, 1618220, 1328031, 1646302, 1584969, 1261245, 1346031, 1565338, 1741892, 1323325, 1508968, 1577519, 1542632, 1826223, 1796069, 1504978, 1739049, 1792180, 1433796, 1738908, 1572844, 1595135, 1721806, 1770871, 1784834, 1791074, 1613514, 1930981, 1813054, 1282647, 1793879, 1699049, 1664741, 1799567, 2226836, 2012864, 1991872, 2006184, 2057433, 2022267, 2035632, 1897164, 2307734, 1883514, 2047488, 2656527, 2491711, 2441670, 2771254, 2670743, 2903352, 2792272, 2875090, 3409848, 3409091, 3408560, 3683918, 4738039, 5809974, 8028045, 11369833, 18084329, 33326074]
14545C3326074P11836j2044338p957106o761740l400134q93474N54294J151804
14537D687216j081045n58751m41201k89763m61570L10286p7563k60288J57564
14528A984885L48937m70073J06212P7040N8497J00132J52931j26192N1348J09700
14518B393417l7048N52756n65464J07615L9947K86821k70173R7347L38317l86423
14508B557112J47154J78441j35886n4744K90167j44798p5361L22630q9849p9934
14498B914932l6615R5138K48656o4696l5595J52341j05285p5967L06397j91270
14488C208036O9971O2393J65231J15437j61154k69759L7625N91401m09344L3294
14478C443131K99617J7145n5994K23956J69459j43437Q484K58837j91475j44077
$$ y = [33326074, 34037910, 21993572, 14036466, 7274726, 3874592, 2981118, 3535412, 4687216, 3606171, 3047420, 2606219, 2316456, 1854886, 2165172, 2087609, 1827321, 1984885, 2333822, 1863749, 1969961, 2047001, 2105498, 2205630, 2358561, 2232369, 2283717, 2393417, 2356369, 2909125, 2343661, 2451276, 2491223, 2778044, 2507871, 2605218, 2943535, 2557112, 2704266, 2882707, 2746821, 2692077, 2982244, 2837446, 2762085, 3084715, 2994866, 2914932, 2878317, 2973455, 3222111, 3157415, 3121820, 3274161, 3168876, 3092909, 3399306, 3208036, 3278007, 3340400, 3505631, 3621068, 3459914, 3190155, 3227780, 3819181, 3409837, 3443131, 3742748, 3759893, 3703899, 3927855, 4097314, 3953877, 3962361, 4221198, 4029723, 3885646]
14468C885646L33800p8620M39441k82671L68092r6085k08854J83956J54832j17652
14458D581885n7468q9145L89060J5918j62236J35772J35350J62925Q0259J6465
14448E208785P0086K32361o08553O85104l44630M21320J83653j24581K99869n24043
14438E499371O55670j76581k31794O3870L45820L4712M0737L15853K9587m8630
14428F528615M63799k65577R5460K75529K26904l9443L59309k5581J33494L72501
14418H125010K17985J53251j83630O166j693M7816K63593J31839J66407N3983
14408H980727K26124O893P4928L10915l0637L79117q3674P3531M67069J07174
14398A0512167k00132L36904K42226J46272K34052L25549K31L13898J59297j40413
$$ y = [3885646, 4219446, 4140826, 4580267, 4297596, 4665688, 4569603, 4360749, 4544705, 4699537, 4581885, 4524417, 4435272, 4824332, 4840250, 4678014, 4813786, 4949136, 5112061, 5192320, 5208785, 5278871, 5511232, 4902679, 5587783, 5243153, 5664473, 5848126, 5723545, 6023414, 5499371, 6155041, 5978460, 5746666, 5810536, 6156356, 6191068, 6231805, 6547658, 6577245, 6528615, 6992414, 6726837, 6822297, 7097826, 7324730, 7285287, 7644596, 7619015, 7752509, 8125010, 8342995, 8496246, 8312616, 8318782, 8317089, 8364905, 8628498, 8760337, 8926744, 8980727, 9206851, 9213744, 9288672, 9599587, 9568950, 9948067, 9864393, 9937924, 10404993, 10512167, 10312035, 10648939, 10891165, 11037437, 11271489, 11597038, 11597269, 11911167, 12070464, 11930051]
14388A1930051O95715j4041L09373L45397O1956L31403L30461M58811K55130J7289
14378A4721545J82923O7813P26173Q1621j451N43197J68075M64176O01771J01085
14368A7656928N51902K06667Q40733J08140J57385Q53741J73368M15354L62398
14359B1326616Q34618M58188L34847N05331P31474M28806P50133K26706R40358
14350B6537077Q52135M72055Q98619O43880N41297Q68773L58030R98592J047147
14341C3217605J016805R51201J128551R18089J110372Q84121J066504J488924
14333D1782172J252499J230322J393777J607202J674052J228884J711746J461841
14325E3342495J891874J888652J935035K070311K419589K235300K468122K587621
$$ y = [11930051, 12625766, 12611725, 12921098, 13266495, 13328451, 13659854, 13990315, 14449126, 14704256, 14721545, 14904468, 14972281, 15698454, 15780075, 15778624, 16321821, 16489896, 16954072, 17555843, 17656928, 18208830, 18415497, 19256230, 19364370, 19521755, 20375496, 20548864, 20964218, 21326616, 22161234, 22619422, 22954269, 23459600, 24191074, 24619880, 25370013, 25596719, 26537077, 27389212, 27861267, 28759886, 29403766, 29945063, 30813836, 31171866, 32170458, 33217605, 34234410, 35185611, 36314162, 37232251, 38342623, 39226744, 40293248, 41782172, 43034671, 44264993, 45658770, 47265972, 48940024, 50168908, 51880654, 53342495, 55234369, 57123021, 59058056, 61128367, 63547956, 65783256, 68251378, 70838999]
14317G0838999K613305K612014K758682L348388K761946L739201L312279L819382
14309I5804196M226420M254700M490312M732426M855025N848544N464165N821985
14301A35497773O266560O839316P288857P521945Q035765Q403838Q962534R485935
14293A98302523J0138515J0695970J0969473J1399801J2502517J2940523J3404352
14286B80353674J3516983J4437206J4887377J4938096J5098162J4905803J5147975
14279C83285276J4823826J3755930J3242366J1276938P331285L220230K754552
14272D49690403K246844J202454O02418n246222j2350372m049346L13233m132127
14264D28277285j1522320j3658959j4608176j5348069j5723868j5884443j6019889
$$ y = [70838999, 73452304, 76064318, 78823000, 82171388, 84933334, 88672535, 91984814, 95804196, 100030616, 104285316, 108775628, 113508054, 118363079, 124211623, 129675788, 135497773, 141764333, 148603649, 155892506, 163414451, 171450216, 179854054, 188816588, 198302523, 208441038, 219137008, 230106481, 241506282, 254008799, 266949322, 280353674, 293870657, 308307863, 323195240, 338133336, 353231498, 368137301, 383285276, 398109102, 411865032, 425107398, 436384336, 443715621, 446935851, 449690403, 451937247, 453139701, 453742119, 448495897, 436145525, 432096179, 432409412, 428277285, 416754965, 403096006, 388487830, 373139761, 357415893, 341531450, 325511561]
14257C25511561j5972776j5147708j4794373j4263961j3602268j2974953j2311162
14250B26444360j1687533j0530819r517709r770803r065836q515626q196945p474410
14242A51684679p218624o679276o405027n828886n783777n075865m860998m892505
14234A04939721m393002m502923l394619l763778l615364l205107k941160l401143
14226G5722625k985448k595727k616606j953905k631636k117396j909994j963409
14218E6948504j965759j813612k074657j474243j204745j355316j271311j536666
14210D4252195j482452j338895q13188j151901r17214r38465j270570j482160
14202C4857350o56775o88145n17603j130956p29990j111992j071693l00996o39519
$$ y = [325511561, 309538785, 294391077, 279596704, 265332743, 251730475, 238755522, 226444360, 214756827, 204226008, 194708299, 184937496, 175871660, 167356034, 159159089, 151684679, 144466055, 137786779, 131381752, 125552866, 119769089, 114693224, 109832226, 104939721, 100546719, 96043796, 92649177, 88885399, 85270035, 82064928, 79123768, 75722625, 72737177, 70141450, 67524844, 65570939, 62939303, 60821907, 58911913, 56948504, 54982745, 53169133, 51094476, 49620233, 48415488, 47060172, 45788861, 44252195, 42769743, 41430848, 40617660, 39465759, 38548545, 37610080, 36339510, 34857350, 34200575, 33512430, 32994827, 31863871, 31133881, 30021889, 28950196, 28649200, 28009681]
14193B8009681p98632m15879r51221m88385m87103o76633m02343p28215o10788
14184B2450482n79780j94373p79502o5355n07450m00715l86479o11149k96652
14175A8629027m43068m22307k23077j19733p15405j93080L3782k51013r56531
14166A5338595J5181q0440n14100k19723j89797l22024k59184l01215j44341l91511
14156A2931441j17774m00555k48546p7521l2116l09204N086l85933n8862l91581
14146A0914435Q7951k28819l95604r420l736k60338j20921k15787r9050k10696
14136I458015j57635j9135r2502k44047n5302m6491k93880j65079r9022j20321
14126H164601J19861l66397J31073l27746P8753k16029K2345o4584j11363j66442
$$ y = [28009681, 27211049, 26795170, 25843949, 25355564, 24868461, 24191828, 23789485, 23061270, 22450482, 21870702, 21676329, 20896827, 20831472, 20324022, 19923307, 19536828, 18925679, 18629027, 18185959, 17763652, 17540575, 17420842, 16705437, 16512357, 16546139, 16295126, 15338595, 15353776, 15273336, 14759236, 14539513, 14349716, 14027692, 13768508, 13467293, 13322952, 12931441, 12813667, 12413112, 12164566, 12087045, 12054929, 11745725, 11750811, 11364878, 11306016, 10914435, 11002386, 10773567, 10377963, 10368543, 10364807, 10104469, 9983548, 9767761, 9668711, 9458015, 9300380, 9281245, 9188743, 8944696, 8889394, 8842903, 8549023, 8383944, 8284922, 8164601, 8284462, 7918065, 8049138, 7721392, 7800145, 7584116, 7606461, 7541877, 7430514, 7264072]
14116G264072p1595j96627J56188p78577L53722Q4588l76357L62651o7569l89338
14106F341158J87712j29864l93166J56183k40459m6600j10167K64684j43463j74147
14096E711871j01358L62933n98427L59920m21650j26743L18648k52897k2466m45641
14086D784190J01615L12420k03134J40481l28316L84570j84450n06993N4510k36402
14076D318491J68316J77801k82775K62238m9990m76411K11734k7496k23223r2779
14066C985906K95587j90730K15666l31579M20465m28443R8110k28941K38294k14711
14056C859624J65898r8404j55706l64471N51285m62956J0878L348q7902R8268
14046C519862k53994J03331P494j06918J09673k70743Q255K69277k86520j59352
$$ y = [7264072, 7192477, 6995850, 7152038, 6373461, 6727183, 6811771, 6435414, 6798065, 6730496, 6341158, 6528870, 6399006, 6005840, 6162023, 5921564, 5874964, 5764797, 6029481, 5886018, 5711871, 5610513, 5973446, 5375019, 5734939, 5313289, 5186546, 5505194, 5252297, 5229831, 4784190, 4885805, 5198225, 4995091, 5135572, 4807256, 5191826, 5007376, 4500383, 4554893, 4318491, 4486807, 4664608, 4381833, 4644071, 4594081, 4117670, 4329404, 4301908, 4078685, 3985906, 4281493, 4090763, 4306429, 3974850, 4395315, 3966872, 4064982, 3836041, 4074335, 3859624, 4025522, 3927118, 3771412, 3406941, 3958226, 3495270, 3506148, 3509496, 3421594, 3519862, 3265868, 3369199, 3376693, 3269775, 3379448, 3108705, 3116960, 3386237, 3099717, 2940365]
14036B940365j5080K40196p5518K86135k36785j43034l3460J48893R9945m34845
14026B776812l20997M51300l23289J73720j3888k74807k11037N51595N7314k66418
14016B600305n6171Q8127k23345Q0438k36271P0094K55275j82722p0748L1775
14006B356757J11382k36087L05660m26923P2541M9095N0243l87683K48036q2687
13996B060334P7506J97894K9407k67115M22462R5012J122248Q82282K292426N220205
13986A2132661J3890484R049337r419648o966877p003180m742327j644939j055854
13978D239657n19091j12019o73711j39164K93323l74030p20j37816j34287p7914
13968B364228k64744J42580k06783L82102n1937n8109K49499m13222J29775l08763
$$ y = [2940365, 2925285, 3165481, 3089963, 3376098, 3139313, 2996279, 2962819, 3111712, 3211657, 2776812, 2455815, 2907115, 2583826, 2757546, 2743658, 2468851, 2257814, 2809409, 2866723, 2600305, 2544134, 2632261, 2408916, 2489354, 2253083, 2323177, 2578452, 2395730, 2324982, 2356757, 2468139, 2232052, 2537712, 2110789, 2183330, 2232425, 2282668, 1894985, 2143021, 2060334, 2137840, 2335734, 2365141, 2098026, 2520488, 2615500, 3737748, 4620030, 6912456, 12132661, 26023145, 35072482, 25652834, 18685957, 11682777, 6940450, 5295511, 4239657, 3720566, 3608547, 2934836, 2795672, 3088995, 2714965, 2714245, 2576429, 2442142, 2364228, 2099484, 2242064, 2035281, 2417383, 2365446, 2307337, 2556836, 2143614, 2273389, 1964626]
13958A964626O5443R2880l4707J16710l11452N7729J14734Q1558k9434l01891
13948A816196p9244L00239j73761j50933N11621m88868j4123L14649k75020j40545
13938A620211J58719k39698K18501n7219P1431j20388L03785l15961j15031L12515
13928A836865k74608J0905L7543m9617K91854l46185K46513m70000J66818j97174
13918A252914L07365L4919j72614n8601K8496J66014j57692k00775M7451M8783
13908A296260m2147J73276j55322j63927L77588j82243M19831k35655K56383m79040
13898A265004J30848L065P2805j67777J79821j88172J20080j7260j59176P3510
13888A312748K2816j35738n6522P6257K2789j05314l0502o1224Q6377j76774L42912
$$ y = [1964626, 2030069, 2122949, 2088242, 2204952, 1893500, 1951229, 2065963, 2147521, 2118087, 1816196, 1736952, 2037191, 1863430, 1712497, 2224118, 1735250, 1721127, 2035776, 1760756, 1620211, 1778930, 1539232, 1757733, 1700514, 1771945, 1651557, 1955342, 1639381, 1524350, 1836865, 1562257, 1573162, 1610705, 1561088, 1852942, 1506757, 1753270, 1283270, 1450088, 1252914, 1560279, 1595198, 1422584, 1363983, 1392479, 1558493, 1400801, 1200026, 1247477, 1296260, 1254113, 1427389, 1272067, 1108140, 1485728, 1303485, 1723316, 1487661, 1744044, 1265004, 1395852, 1398917, 1471722, 1303945, 1483766, 1295594, 1415674, 1398414, 1239238, 1312748, 1335564, 1199826, 1143304, 1219561, 1242350, 1137036, 1106534, 1045310, 1131687, 954913, 1297825]
13877A297825j91568n5424M15718j37834r936P0845k83283O0642J6212j23502
13867A059695J32553o9083O5260k27759M5598J29375j03864J84743j77284J18379
13857A157613j66885J07129q3188j43150K64916n1205K32954p8242j37940k46995
13847H55007P2899J0198K15496q0470k20434L95854l77080J51310k26835l20833
13837D75112N45249j06254J2743J28407j11510k84538J69657K51624m44979k17130
13827D18381L62459K70248j71217J29858L3383l46673N22449n39367K49959M6441
13817I75921j67865j23407L43415k04809j30312M8940J03853o5567L9074K86041
13807A105284l00663l0766l1593j83884P3919j28708M558k9807M35040l60220
$$ y = [1297825, 1106257, 1050833, 1466551, 1328717, 1318781, 1389626, 1106343, 1166985, 1183197, 1059695, 1192248, 1123165, 1188425, 960666, 1006264, 1135639, 1031775, 1216518, 1039234, 1157613, 990728, 1097857, 1014669, 871519, 1136435, 1085230, 1318184, 1239942, 1102002, 855007, 927906, 938104, 1153600, 1073130, 852696, 1248550, 871470, 1022780, 795945, 475112, 1020361, 914107, 926850, 1055257, 943747, 659209, 828866, 1080490, 635511, 418381, 780840, 1051088, 879871, 1009729, 1043112, 696439, 1218888, 679521, 929480, 975921, 808056, 684649, 1028064, 823255, 692943, 741883, 845736, 780169, 819243, 1105284, 804621, 773855, 742262, 558378, 632297, 503589, 508147, 478340, 913380, 553160]
13797E53160l7445M15112r6788K8257l72943J85022K90198j73480l01174N02542
13787I92461l73683J18826L3611k83657L57656J49282l599j63652k23588Q0166
13777F83823J50701k54365M7974j86179L64114q4492j51907P7838k93435M45344
13767G99416k40739K05273C34786M21774J52275l81850K0374N5287k11510J6102
13757D07238j69290N97249L3822l27204m3950K79949r8026M164J08095k75098
13747E16949K96063j18217j23464K6337L03273K8124q1679P8350D31921q5747
13737C46174K31166j71729L12164n5720j75577L10918l34241K71090l15090K69902
13727F89057n6750j15882J87030j01584L31072B33615M05512B18705M72771l20915
$$ y = [553160, 515715, 930827, 834039, 862296, 489353, 674375, 964573, 791093, 489919, 992461, 618778, 737604, 771215, 487558, 845214, 994496, 990897, 827245, 603657, 683823, 834524, 580159, 628133, 441954, 806068, 721576, 569669, 647507, 354072, 799416, 558677, 763950, 334786, 756560, 908835, 526985, 547359, 602646, 391136, 407238, 237948, 835197, 869019, 541815, 497865, 777814, 679788, 683952, 792047, 516949, 813012, 694795, 571331, 597668, 900941, 929065, 847386, 925736, 431921, 346174, 577340, 405611, 717775, 662055, 486478, 797396, 463155, 734245, 419155, 689057, 632307, 516425, 703455, 601871, 932943, 233615, 639127, 218705, 691476, 370561]
13717C70561k9890L03580j37165L64716j77806l30906J27342L27904k93694r9079
13707D25563l5003k0612M26000k1106A06563P82063C68468K56822J23909k63315
13697D85884K24613C24945K75599j51157J22903o2115J35221J76844D07459L24972
13687G32431C12173K84276o687m7503J857J41198j9470k13119O5988J97355l08634
13676D07434k0302j6633J98464F8443L65408K7180J11019N6481j53524Q4001j13796
13665D45212J7072J76879j69936A51793O2303J79698K00781B52097P3454N8734
13655C84285r4734M527k0979J94683J53737q2499B33451m0161M45697k6699o3947
13644E48341M5960B51824J15189J60970R1329j12391J65265j78432j35919O7394
$$ y = [370561, 340671, 644251, 507086, 871802, 693996, 363090, 490432, 818336, 524642, 425563, 390560, 369948, 795948, 774842, 106563, 888626, 368468, 625290, 749199, 485884, 710497, 324945, 600544, 449387, 572290, 510175, 645396, 822240, 407459, 732431, 312173, 596449, 589762, 542259, 544116, 685314, 665844, 452725, 518713, 716068, 407434, 387132, 370499, 568963, 68443, 433851, 461031, 572050, 628531, 475007, 559008, 445212, 462284, 639163, 469227, 151793, 214096, 393794, 594575, 252097, 325551, 384285, 289551, 294078, 273099, 467782, 621519, 539020, 233451, 193290, 638987, 612288, 548341, 594301, 251824, 367013, 527983, 619312, 506921, 672186, 493754, 357835, 425229]
13634D25229P4931j26914O0164n4319R0475j63949K12077J57599C10710o2451
13624B48259M48784G2003J07594J25418J99176J6489J924j90180J97609o6942
13614D63091C2592N35552k77825J32538j4073K00530B97990M95210C04811J74123
13604D78934R8273j73987j35054M06338j05720l6704j60192D3447M4102L64893
13594D52442k6151n9926A32438R5027M4168M06560H2605J69623M2977R3940J14825
13583E03970o4392A59380J18102O2022M68568B02415J9612N610f2442H1706L07089
13572C88795j9553r9640K6815Q8466j87269M7765J60956J69165k27250O1668j24455
13561B85463A39403J79499K18634k22255K4566L0344b1654D35283B01958K2446
$$ y = [425229, 500160, 373246, 433410, 379091, 469566, 305617, 517694, 675293, 310710, 248259, 697043, 72003, 179597, 305015, 504191, 520680, 522604, 332424, 530033, 463091, 32592, 568144, 290319, 422857, 408784, 609314, 297990, 793200, 304811, 478934, 577207, 403220, 268166, 674504, 568784, 532080, 371888, 43447, 87549, 452442, 426291, 366365, 132438, 227465, 271633, 678193, 82605, 252228, 295205, 389145, 503970, 439578, 159380, 277482, 339504, 808072, 202415, 222027, 227637, -62442, 81706, 388795, 369242, 269602, 296417, 384883, 197614, 245379, 406335, 575500, 348250, 409918, 285463, 139403, 318902, 537536, 315281, 339847, 370191, -21654, 435283, 201958, 224404]
13551B24404P878K07687j42842j25148G3975J20949G7331J63432K57080j82824
13541C15019B0395a9882G32632A43862C9276K25893p4675p5406K09880j62444
13531A62524M7458K90112B38500M3584N4321F5819K53173K20479k25937n8914
13521B54620k63N0485j02202K69805j86623P3351M3504j40124q5000J8162K06095
13510D01810M0618B09176q7154M26667J8840B39559B2125J27726Q007K92568r1613
13499C58813o9989A11977L1641J36986q5939K38593o9184j32675L2828J75810
13489D40037A33708K28592c9577B93743q6276L97529B02617M030b8086B78777
13478C94046j379C1655J48562K34915J1992I2701P2069J32458L1624n6627P7151
$$ y = [224404, 232282, 439969, 297127, 171979, 73975, 194924, 77331, 240763, 497843, 315019, 20395, -19882, 732632, 143862, 39276, 265169, 190494, 115088, 324968, 162524, 209982, 500094, 238500, 282084, 336405, 65819, 318992, 539471, 313534, 254620, 254357, 304842, 202640, 472445, 285822, 359173, 402677, 262553, 177553, 195715, 401810, 442428, 209176, 122022, 548689, 567529, 239559, 22125, 149851, 157858, 450426, 358813, 288824, 111977, 143618, 280604, 194665, 433258, 364074, 231399, 264227, 440037, 133708, 362300, -39577, 293743, 207467, 604996, 202617, 206647, -28086, 278777, 394046, 392667, 31655, 180217, 415132, 427124, 92701, 164770, 297228, 328852, 272225, 349376]
13467C49376l1576A52453L50814j55943p5379c553B18399A6472i531B15460k3236
13456A92224K58674A84091E2858K81594R0962c3931A25394F1890K47398o0078
13446B49210a6292A14943K09108j48496b67704Q4537D27950l0607f755D79606
13435C52567k6635j14749k9214N15746B14225h6444C13882I2474J97246o3618
13425B26102b99202D71955B04830J4238M45928B86900K3845A05333j1149f7863
13414B49399m6283A7881N24021m5378k09996o1085A04918h6474A57913K03328
13404C61241A33561K78262j38314A08122K23703J20214A63075M5880F6408a52495
13393B56856I6787a45739B02920E4255K68685k9576n1339A9771b0483j8776I7842
$$ y = [349376, 317800, 152453, 503267, 347324, 271945, -3553, 218399, 16472, -9531, 215460, 192224, 450898, 184091, 52858, 334452, 425414, -33931, 125394, 61890, 309288, 249210, -16292, 114943, 324051, 175555, -267704, -183167, 427950, 397343, -6755, 479606, 352567, 325932, 211183, 181969, 697715, 214225, -86444, 313882, 92474, 289720, 226102, -299202, 471955, 204830, 219068, 664996, 286900, 310745, 105333, 94184, -67863, 249399, 203116, 17881, 541902, 496524, 286528, 225443, 104918, -86474, 157913, 361241, 133561, 411823, 273509, 108122, 331825, 452039, 163075, 208955, 66408, -152495, 256856, 96787, -145739, 202920, 54255, 322940, 293364, 242025, 19771, -20483, -39259, 97842]
13381G0392K91752j25820C9185L21774j2136G0550J01279K49530G3831M45404
13371E19235E7093Q8953K95278A88161b37500H3635a87896B21035m0264L48922
13361E29693j73997o6848B4484j1825J51555P9749r6863L03467G6219K87365J970
13350C65554A31331F3294K80311J87592j07057J61808A66302M2245Q4269l0162
13340B62654j22815M15393A41241K69616l0439j2331r9690n3807J11236r3773
13330B32053L34831k01131R1039A09949J57375p7235p1680i3393A59886K98741
13320D58627B22572n7477K08208Q7869p0099J15029l1477A98427K12970D319a07061
13308F2330J83596p4111H3056K40849a61063F00830k07183J90369I0279O2645
$$ y = [70392, 362144, 236324, 39185, 360959, 348823, 70550, 171829, 421359, 73831, 519235, 57093, 146046, 441324, 188161, -237500, 83635, -187896, 221035, 180771, 529693, 355696, 288848, 24484, 12659, 164214, 243963, 147100, 450567, 76219, 363584, 365554, 131331, 63294, 343605, 531197, 424140, 585948, 166302, 208547, 292816, 262654, 139839, 555232, 141241, 410857, 380418, 368087, 268397, 214590, 325826, 232053, 566884, 365753, 456792, 109949, 267324, 190089, 118409, -93393, 159886, 458627, 222572, 165095, 373303, 461172, 391073, 506102, 474625, 198427, 411397, 4319, -107061, 62330, 245926, 171815, 83056, 323905, -161063, 600830, 393647, 584016, 90279, 152924]
13298A52924j7370k3692P0310K5091K65065A40726J59098a5454A24648J26176
13288B50824L188O7379D9613d6452C45965i2077j08559A45651I385N87225H082
13276C34026r7409H0012a36151B76411q7796N9721j20814J31915D6630i2747A36023
13264b01519B30992o4099h4233l3804B33401p1446K02734b1792A03906e400H6668
13252A14135l35a15799G6949D679J61270a22460M7188A35432n9546J14289i1167
13240B34216o5095E8301c4651A10526B0146e771C27995l9809k3874k5359j07846
13229A31107i0315d0144o0730k15013B39342J54986p5623C4057a27793p4266A14293
13217B10514B5962O3067Q252M9259N1288E7534b73997A010J9021g4777j58906
$$ y = [152924, 135554, 111862, 182172, 207263, 472328, 140726, 299824, -15454, 124648, 250824, 254012, 321391, 49613, -46452, 345965, -92077, -200636, 145651, 9385, 596610, 8082, 334026, 236617, 80012, -136151, 276411, 188615, 248336, 127522, 259437, 46630, -92747, 136023, -201519, 230992, 166893, -84233, -118037, 233401, 161955, 364689, -21792, 103906, -5400, 86668, 114135, 113800, -115799, 76949, 4679, 165949, -122460, -75272, 135432, 75886, 190175, -91167, 234216, 169121, 58301, -34651, 110526, 20146, -5771, 327995, 288186, 264312, 238953, 131107, -90315, -40144, -100874, -315887, 239342, 394328, 318705, 34057, -127793, -202059, 114293, 210514, 25962, 89029, 97281, 146540, 197828, 57534, -273997, 1010, 20031, -74777, -233683]
13206b33683k0285A8582O3381b01540Q7653L4003E4133F654a46075A96011I1787
13194a52520C33378d4147C23655P8608A03761p7K49359k867A13699p873J28844
13183B34670a95287f4594H136b02480f4526K7359H9128k2464h2843a3239j25763
13172a39002A74895p247i3134G9955b34159B3952p422B589K31529K59414c70034
13160A79985b70436a25322A23710J37489e1677A12200M6501b19254b7076E6158
13149B28116a85204P4291B08287j01793L77550B10733j02842l7650J26128C3741
13138b75499A87282b19106R9505C55148j76951A4258J63531o5548a45669A91110
13127A06807l9407L93529B18183l4325c6713k43874A11903L3683l2068J64760
$$ y = [-233683, -253968, 18582, 81963, -201540, -113887, -79884, 54133, 6654, -146075, 196011, 91787, -152520, 333378, -44147, 323655, 402263, 103761, 103684, 353043, 350176, 113699, 105826, 234670, -195287, -64594, 8136, -202480, -64526, -37167, 89128, 66664, -82843, -13239, -139002, 174895, 167648, -93134, 79955, -234159, 23952, 16530, 2589, 234118, 493532, -370034, 179985, -270436, -125322, 123710, 261199, -51677, 112200, 158701, -219254, -27076, 56158, 228116, -185204, -110913, 208287, 106494, 484044, 210733, 107891, 70241, 196369, 33741, -275499, 187282, -219106, -119601, 355148, 178197, 14258, 177789, 112241, -145669, 191110, 106807, 67400, 460929, 218183, 183858, -36713, -280587, 111903, 145586, 113518, 278278]
13117B78278A00502f5018B59355G810i3344A8768J82800N9716A07360A8473K542
13106B1015E228d9260C2749R8523D5022K43631a39433D3746a010j07376C62142
13094D07271g076D11060B3352Q8457a07496E0958i7343B79294A6254a22348C62277
13082A93674B272a96480a6346I8281b46796H9948k7067K37747A23286a03936M5263
13071e8673I8719N6841o8978K74572a32583F4727k2713J26180n5049c5412B30774
13059A09349i8411C76037D363J78059K53972A38261M4625J57108A48077M5547
13049A93624k9981R0861C8968J61539E3884j6329K5644b05304A08623c3933H8798
13037B63336h0634A4155R4489L80714k11888g6432B4091J18816N656J37375J2347
$$ y = [278278, 100502, -65018, 259355, 7810, -93344, 18768, 201568, 261284, 107360, 18473, 21015, 5228, -49260, 32749, 131272, 45022, 288653, -139433, 43746, -1010, -108386, 362142, 407271, -7076, 411060, 23352, 111809, -107496, 50958, -97343, 279294, 16254, -122348, 362277, 193674, 2272, -196480, -16346, 98281, -246796, 89948, 62881, 300628, 123286, -103936, -58673, 98719, 155560, 86582, 361154, -132583, 64727, 42014, 168194, 113145, -35412, 230774, 109349, -98411, 376037, 4363, 182422, 436394, 138261, 182886, 339994, 148077, 193624, 163643, 254504, 38968, 200507, 53884, 37555, 63199, -205304, 108623, -33933, 88798, 263336, -80634, 14155, 108644, 489358, 277470, -76432, 24091, 142907, 148563, 285938, 298285]
13026B98285j05753K3685H5216b12979H432g878l2524A08072a07184J0754c244
13014B96217l8258A01449M2952J94801A69254a36386O4511j70949F4221R151K50056
13003C23428A45985M0612b99936F0715b17663E4855J23084R6611A17325a82724
12992B6172a43729p1875A43300a60462b1243B15742a7663A57480b10427D8788
12981C96353D358a49372B19057C0336M00486A1245J5001A922M045a72226A05853
12969a48762d3585A0520K139J19154O964A3355a55103A65709k1729c7982p9184
12958a17166p5349b484A45281b0944o5982A22417M0229B1658J02939b14381a9078
12946D3628O4684K28358A54411a33500G4056b67073B00100n1813K2836L0836d6326
$$ y = [298285, 192532, 216217, 85216, -212979, 8432, -7878, -40402, 108072, -107184, -96430, -3244, 296217, 257959, 101449, 144401, 339202, 169254, -136386, -71875, -242824, 64221, 73372, 323428, 145985, 186597, -299936, 60715, -217663, 54855, 177939, 274550, 117325, -182724, 26172, -143729, -215604, 143300, -160462, -21243, 215742, -17663, 157480, -210427, 48788, 396353, 4358, -149372, 219057, 30336, 430822, 11245, 26246, 1922, 5967, -172226, 105853, -148762, -43585, 10520, 12659, 131813, 138777, 13355, -155103, 165709, 143980, -37982, -117166, -192515, -2484, 145281, -20944, -86926, 122417, 162646, 21658, 124597, -214381, -19078, 43628, 108312, 336670, 154411, -133500, 74056, -267073, 200100, 148287, 171123, 201959, -46326]
12934b11753Q5127B7940J2710m085h1335m215H1175K4987c2294C35724f955A994
12921c7855D7036b88420I9829J13447h00F0752P5799d1021A04142P5117F8818
12909a35089m5872I4399m5380a78881g5344B95408a4113G9609R463J99032a40796
12897f1769A65659b2158A81374e9231C94482j58475a1764A36908g8684D18095
12886B05619a25857q2890j26324A27827Q2780b34546O2615A81490B2158a58011
12875e4284A0131J29798E9660a4972G0820M7423d188C30207B9371b67811g7679
12863a7201j2821Q54A56793M3510I9319Q8680C1516a04029K5091A62890b6550
12851B19210e782j33062M9493l1652B07242d21390J03781e8774k3473r9001A97100
$$ y = [-211753, -126626, 27940, 40650, 36565, -81335, -85550, 81175, 106162, -32294, 335724, -6955, 1994, -37855, 47036, -288420, 99829, 213276, -800, 60752, 136551, -41021, 104142, 179259, 68818, -135089, -180961, 94399, 49019, -178881, -75344, 295408, -14113, 79609, 89072, 288104, -140796, -61769, 165659, -22158, 181374, -59231, 394482, 236007, -11764, 136908, -78684, 418095, 205619, -125857, -208747, -335071, 127827, 210607, -234546, -171931, 181490, 22158, -158011, -54284, 10131, 139929, 59660, -14972, 70820, 118243, -4188, 330207, 29371, -267811, -77679, -17201, -30022, -29168, 156793, 200303, 99319, 187999, 31516, -104029, -78938, 162890, -26550, 219210, -5782, -138844, -89351, -121003, 207242, -421390, -317609, -58774, -82247, -181248, 197100]
12839h0179L2023A20601J10361c14213f0166j81041D7429A33g5592l2774B22f8193
12826G7538b2828m1778j42570A28428g2902C50379A375L2445K66214D7647c317
12814A28928a74042A96309o6254b2908E1428a27950g000l29314a57041A54922
12803G6522A5421a88992c756I1498j779M5525h3064A46965e9319A62000a45224
12791E40641k50343a14551B400b3933H2548j8817B3527N676a41453e8434E4380
12779a11219G280J62370L8656A03424M0197R2512A00112d1536B45208i4441b9445
12767H4547J1915c137j71116o4757N8757j2728A20561J50143e2653E4818a49469
12755c75052F1885k9416a84938k7101g4277j204C14169a9399k30909f1450q3331
$$ y = [-80179, -48156, 120601, 230962, -314213, -60166, -241207, 47429, 133, -75592, -108366, 222, -68193, 77538, -22828, -64606, -207176, 128428, -72902, 350379, 1375, 33820, 300034, 47647, -3317, 128928, -174042, 196309, 130055, -22908, 51428, -127950, -7000, -336314, -157041, 154922, 76522, 15421, -188992, -3756, 91498, 89719, 135244, -83064, 146965, -59319, 162000, -145224, 540641, 290298, -114551, 2400, -23933, 82548, 63731, 23527, 29203, -141453, -58434, 54380, -111219, 7280, 169650, 208306, 103424, 143621, 236133, 100112, -41536, 245208, -94441, -29445, 84547, 96462, -3137, -174253, -239010, -180253, -192981, 120561, 270704, -52653, 54818, -149469, -375052, 61885, 32469, -184938, -212039, -74277, -75481, 314169, -19399, -250308, -61450, -144781]
12744a44781A01865b79816K7893D7984R1941o2841k6813L60246f6711Q237m5331
12733a03805c2467l23675A7512K82993j38194l5092E9625Q3292a30850j7335G5116
12721A07703K7275c54272B1002J96761J6529c98098A45805E188J91048l4392O881
12710A68725G0216L37568A69399a69439J587C21803J9346A47021d9500E966J98686
12699B04652b23913A55281D3241K28961a72108b2705m1432B95252a14520G2236
12688b07215B49166D4195c0332j37935j21496a4842H7125A8167P2114h1193n4327
12677a35520C28043c2104n3208A73759l0089d14605H0608L4137c0482Q667r5269
12666a17084N1411A77825h0420B8762a03249A95060c50317J65822A38574R7152
$$ y = [-144781, 101865, -279816, -251923, 47984, 139925, 77084, 50271, 410517, -66711, -58474, -103805, -32467, -356142, 17512, 300505, 162311, 127219, 59625, 142917, -130850, -148185, 75116, 107703, 134978, -354272, 21002, 217763, 234292, -398098, 145805, 5188, 196236, 161844, 168725, 70216, 407784, 169399, -169439, -167852, 321803, 341149, 147021, -49500, 5966, 204652, -223913, 155281, 43241, 272202, -172108, -22705, -64137, 295252, -114520, 72236, -207215, 249166, 44195, -30332, -168267, -289763, -14842, 87125, 18167, 90281, -81193, -135520, 328043, -32104, -85312, 173759, 143670, -414605, 80608, 114745, -30482, -21815, -117084, -65673, 177825, -80420, 28762, -103249, 195060, -350317, -184495, 138574, 235726]
12656B35726o9700e4833A61364K16566d5950B4716J17215o0609L7454b19232h3277
12644f0851k68032H8320L8899k3047j4716c8361r3126C05100b43855E6440N08
12633E6948K05639e4009G1616J44626G1364L1009D9913M81814k20309j01862l5134
12622A74422B6564R9690a2587D0101Q0715n4434b14695G659g0346A68241F7020
12610B35806e6247B01201a56388B25294D8888i7372A38479g105n7763B01503K04586
12599D06089B2804L87655A25238L2934a20269G198J11807b34303A55188L2511
12589A87699i0901A03816b970k60455L3750A4146c10377g7928C784a6439o1351
12578g7790B01967D4599a50780b5566k03331A82478G902K80276a5574G9717j7310
$$ y = [235726, 166026, -54833, 161364, 377930, -45950, 24716, 141931, 81322, 118776, -219232, -83277, -60851, -328883, 88320, 127219, 104172, 89456, -38361, -131487, 305100, -243855, 56440, 56948, 262587, -54009, 71616, 216242, 71364, 102373, 49913, 531727, 311418, 209556, 174422, 26564, 126254, -12587, 40101, 120816, 66382, -214695, 7659, -70346, 168241, 67020, 235806, -56247, 201201, -156388, 225294, 48888, -97372, 138479, -7105, -64868, 201503, 406089, 22804, 410459, 125238, 158172, -120269, 7198, 119005, -234303, 155188, 187699, -90901, 103816, -2970, -263425, -229675, 14146, -310377, -77928, 3784, -16439, -77790, 201967, 44599, -150780, -25566, -228897, 182478, 7902, 288178, -15574, 79717, 62407]
12567F2407L7740J74383J20018j86239B9661h8286H1055a50746C0316b81754d544
12555C2398a34654K507j11077B38741a31825A82198a15507e0834k11754j3307
12545b75895e9154O782A21772a17541J9601E5487h3601B38181i3863B2268R5509
12534A17777b38120H4517J32313m2032a34882I1358J7965b3927A71493f0035j70346
12523b30381P0353g2506E173J04493N0161b73420C35936b7159n6170D9806J48929
12512A98735P6914I9204k4983A4191b3946I3461d3621m5031F8798N7643D8227
12500A24598D68J7631b14859R6161I4469b01124N7063d2282K452q8482L6530I0584
12487B10050q4180C7837M1251K47075q898a25971M1722k18443A88998I0956K7003
$$ y = [62407, 100147, 274530, 394548, 208309, 29661, -88286, 81055, -150746, 30316, -281754, -4544, 32398, -134654, -132147, -243224, 238741, -131825, 182198, -115507, -50834, -262588, -275895, -59154, -52372, 121772, -117541, -97940, 55487, -83601, 238181, -93863, 22268, 117777, -238120, 84517, 216830, 174798, -134882, 91358, 109323, -23927, 171493, -60035, -230381, -160028, -72506, 5173, 109666, 159827, -273420, 335936, -27159, -83329, 49806, 198735, 275649, 99204, 74221, 14191, -23946, 93461, -43621, -88652, 68798, 126441, 48227, 124598, 468, 18099, -214859, -118698, 94469, -201124, -144061, -42282, -39830, -128312, -91782, 90584, 210050, 125870, 37837, 79088, 326163, 317265, -125971, -84249, -302692, 188998, 90956, 117959]
12476A17959l784a9l8103d731r0793B83824m7159b13635D32969A5022q05J27519
12464A41736a69690k2450A07368d4687F3176a99381N3432B4981a19542L3895b1639
12452a71235j06121j28842A19242c392A35494D7440L3016k7471a0691A99986a92631
12440A96709A8602e4952J3348B75648m6619b51361A3256a45257b1007r8803i206
12428a4056F8721C1780O4480b1379H40J57051N6805q6092d9063B07742q9125b11153
12415D9559R2109c44966a34100h301C27560c99066J89819A5612J76769a65077
12404B11642J2595C6677b35162B40590a62125A5128J58583a4090B1040f7874B36726
12392A87971d311A18820N9009H1892l4774j8799J14177M7778I0190O5472a07233
$$ y = [117959, 114175, -19, -38122, -4731, -95524, 283824, 236665, -213635, 432969, 15022, 14217, 141736, -169690, -192140, 107368, -44687, 63176, -199381, -145949, 24981, -119542, -85647, -21639, -171235, -277356, -406198, 119242, -3392, 135494, 47440, 80456, 52985, -10691, 199986, -192631, 196709, 18602, -54952, -41604, 275648, 229029, -251361, 13256, -145257, -21007, -119810, -9206, -14056, 68721, 31780, 96260, -21379, 840, 157891, 214696, 128604, -49063, 207742, 118617, -211153, 49559, 141668, -344966, -134100, -8301, 327560, -399066, -209247, 15612, 192381, -165077, 211642, 224237, 36677, -235162, 240590, -162125, 15128, 173711, -14090, 21040, -67874, 236726, 187971, -4311, 118820, 177829, 81892, 47118, 28319, 142496, 190274, 90190, 155662, -107233]
12380B84830j05688d0732j31299k8577d3384B02124a06009l7969I8644a4662A11759
12368A32812b10704d8062F3811O6763e7129A36202a46118j19756E2076J41624
12358A93700B85h2557a9211A2916J67296b56279E5542b29006I7516a53963H0398
12346F0807b16963i4712B02883I7074m8093c5043m00604i1562B2968R4381K01053
12335C18402a87093A62855B0903g6759l2847H2015K378a6164C11622G2502L53956
12324D26458H6297h0300B18137B7592K98685R2413j87321J02493j293J46565j51143
12313C27991A15854d1122C22793C3547L0109m559b0244C24048a48643A46986i6551
12301B22617l7761b88348A30299K42180c23816C1545d9673B8433M05215c06879
$$ y = [284830, 179142, -40732, -172031, -200608, -43384, 202124, -106009, -143978, 98644, -14662, 111759, 132812, -210704, -48062, 63811, 130574, -57129, 136202, -146118, -265874, 52076, 193700, 285, -82557, -19211, 12916, 180212, -256279, 55542, -229006, 97516, -153963, 80398, 60807, -216963, -94712, 202883, 97074, 48981, -35043, -435647, -91562, 22968, 117349, 318402, -187093, 162855, 20903, -76759, -109606, 82015, 84393, -16164, 311622, 72502, 426458, 86297, -80300, 218137, 27592, 326277, 418690, 231369, 333862, 332569, 479134, 327991, 115854, -41122, 322793, 33547, 63656, 59097, -20244, 324048, -148643, 146986, -96551, 222617, 184856, -288348, 130299, 372479, -323816, 31545, -49673, 28433, 433648, -306879]
12290E7423J33448N9549D3834K42974d1135l1103G4908N2653F1520Q2779J2381
12279A56680b84064B66597j19441L347K72597A22635R8001K7360K61105B16001
12268A10788l865O4110A8735J79122J4607d7353m0409A19426L7956k57k8165j0594
12256A18366L07697k11524J41947A53L47951j54477M7404j09373f9323B33670
12245A94810E3381b623A9493J7497O6765J91903a08884G7431l5416J78564J13954
12234C34533I2801J25156e8592B51572l835A16909a17002e7083H9468c553C65709
12222B12494l6235J14956p7050n5613K11777L79084I8599d9971A97146Q5872D1891
12210a36719G9019f3307A44165c2570B96859I6579o898N8959D16K86344A12352
$$ y = [57423, 190871, 250420, 43834, 286808, -41135, -72238, 74908, 127561, 61520, 144299, 156680, -284064, 266597, 147156, 150503, 423100, 122635, 220636, 247996, 509101, 216001, 110788, 106923, 171033, 18735, 197857, 212464, -47353, -87762, 119426, 157382, 157125, 128960, 118366, 426063, 214539, 356486, 153, 348104, 193627, 241031, 131658, -69323, 233670, 194810, 53381, -2623, 19493, 36990, 103755, 295658, -108884, 77431, 42015, 220579, 334533, 92801, 217957, -58592, 251572, 247737, 116909, -117002, -57083, 89468, -3553, 365709, 212494, 176259, 291215, 214165, 158552, 370329, 749413, 98599, -49971, 197146, 283018, 41891, -136719, 79019, -63307, 144165, -32570, 296859, 96579, 89681, 148640, 416, 286760, 112352]
12198A52872p0841a16513G4290K73483A63467k3191j3742O7092J36504r3115P4197
12187C11212j26179a14474M8331A27569Q871J3833a35267B76555k0740l3454b58801
12175B14087K8354m2780G0298K8042k408J54349J44036J75332B22147M22059a23676
12163C93589A07593K68730n2778J25124k00710J31725e9617A70499L5222O5968
12153B71689A5758J01718R7024a00104A09344c0769D6723K19829b6959C4877b67353
12141b83041C35356F6393b06380A22098N9169a01202B57086b26750f8719B07130
12130a58584B98587a5281A89125H2784N25409G8644C8626J33522n1045N8564R2122
12119B71789a67236A59473L50201I2471J65309g2519B22819a46096C20694A25233
$$ y = [152872, 82031, -116513, 74290, 347773, 163467, 140276, 126534, 193626, 330130, 237015, 311212, 185033, -114474, -66143, 127569, 136440, 150273, -135267, 276555, 255815, 222361, -258801, 214087, 242441, 199661, 70298, 98340, 95932, 250281, 394317, 569649, 222147, 644206, -123676, 393589, 107593, 376323, 323545, 448669, 247959, 379684, -59617, 170499, 205721, 271689, 15758, 117476, 214500, -100104, 109344, -30769, 46723, 266552, -26959, 34877, -267353, -283041, 335356, 66393, -206380, 122098, 181267, -101202, 257086, -226750, -68719, 207130, -158584, 298587, -15281, 189125, 82784, 608193, 78644, 38626, 172148, 121103, 179667, 271789, -167236, 159473, 509674, 92471, 257780, -72519, 222819, -146096, 320694, 125233]
12108I2282K54748H4203J55813q5625M734A551J07349l8227d3504k0563j31513
12097a95580R2819c6873A38846l6458b27822M3767A40376J6974K28863I1534J09581
12086B01115a87822C49098A1008J54802o7524K2151j7632h0562A43909L29581
12076D73490a67550A77049A3232d1487J489D34213A05006K13534f6423C58040
12065A50780K79451k15099g3487r2500B37165F7257a71161P5956L4585A29076
12054E4383g8858b9513A58465G5192C2707J63043a23346f0382C449J84021K58244
12043D45714b39808g4999j08883J5359A73249B5956J95559a94012C3611e6352
12032C6054R2153g2860A48220b90538A3722d2033C7076b4416n2598c6855Q240
$$ y = [92282, 347030, 84203, 240016, 154391, 159125, 1551, 108900, 70673, -43504, -64067, -195580, -102761, -36873, 138846, 102388, -227822, -184055, 140376, 157350, 386213, 91534, 201115, -187822, 349098, 11008, 165810, 98286, 120437, 102805, -80562, 143909, 473490, -167550, 177049, 13232, -41487, -39998, 434213, 105006, 318540, -66423, 358040, 150780, 430231, 215132, -73487, -165987, 237165, 67257, -171161, -95205, -60620, 129076, 54383, -78858, -29513, 158465, 75192, 32707, 195750, -123346, -60382, 3449, 187470, 445714, -239808, -74999, -183882, -168523, 173249, 25956, 221515, -194012, 33611, -56352, 36054, 128207, -72860, 148220, -290538, 13722, -42033, 37076, -24416, -77014, -36855, -28615]
12021b8615C62078H6404J95649D1526M9355A0680K47392C3159K14541P1734C9823
12009A64941f62A56989c21094F6564K24084F2243g6541A9182e5870A69171A3281
11997a93115E3879a46545j1271A44091G0574J19914P4863a77296I5892j2276O502
11986I0118O9707N0042e499G00150A78193f9688o3968c6763A1161K2912J53483
11975A87556b20316A3859c7160j10073m7902B44823I7051b21427C502J85207a76833
11963a37788A36986a58915F2828b21016F9788A7231a91746B79227j19865a03367
11952d0915l5563K8874D3870f5464a9062B12394a94420A84411c90537A72366b20008
11940A12263b5952B256L5052a77898B84149j09780g4278K5833A3060c9265C78943
$$ y = [-28615, 362078, 86404, 282053, 41526, 90881, 10680, 258072, 33159, 247700, 319434, 39823, 164941, -662, 156989, -321094, 66564, 290648, 62243, -76541, 19182, -55870, 169171, 13281, -193115, 53879, -146545, -157816, 144091, 70574, 190488, 265351, -177296, 95892, 83616, 90118, 159825, 209867, -5499, 700150, 178193, -69688, -133656, -36763, 11161, 34073, 187556, -220316, 13859, -37160, -147233, -195135, 244823, 97051, -221427, 3502, 188709, -176833, -137788, 136986, -158915, 62828, -221016, 69788, 17231, -191746, 279227, 159362, -103367, -40915, -76478, -47604, 43870, -65464, -19062, 212394, -194420, 184411, -390537, 172366, -220008, 112263, -25952, 2256, 37308, -177898, 284149, 174369, -74278, -48445, 13060, -39265, 378943]
11928i9600e509B16466E1975P8604K8550l773f9936A21957d6099I3139a69613
11916A23787E6950J19335J30611c9211I2299J25114a14737C28707i6356j6077
11906a12433H2668e8741b7096B17778J48045a19891l8818B18337a57511b1786
11895a97176A60115A3617O9179a00146j1929c5713R544k00313A56528e9694G6440
11883A00601a54734G3149b55361c6698B46922h9966L2268j76992P0418h1913b9025
11871i1647m83896A13506d4427F6097b42837h2955E7249a92378k88617C8137a36554
11859b54294O9592F7490K00188D8810e7962p2435A36649m1521A5805b88806A464
11847A03785F144J29239E4238A3540N1444b94212J3861i3564C02295K8938j8418
$$ y = [-99600, -5509, 216466, 51975, 130579, 159129, 155356, -69936, 121957, -46099, 93139, -169613, 123787, 56950, 176285, 306896, -39211, 92299, 217413, -114737, 328707, -96356, -112433, 82668, -58741, -27096, 217778, 365823, -119891, -158709, 218337, -157511, -21786, -197176, 160115, 13617, 82796, -100146, -112075, -35713, -26169, -226482, 156528, -59694, 76440, 100601, -154734, 73149, -255361, -36698, 246922, -89966, -57698, -234690, -164272, -81913, -29025, -91647, -575543, 113506, -44427, 66097, -242837, -82955, 57249, -192378, -480995, 38137, -136554, -254294, -184702, 67490, 267678, 48810, -57962, -130397, 136649, 95128, 15805, -288806, 1464, 103785, 6144, 135383, 54238, 13540, 64984, -294212, -280351, -93564, 302295, 331233, 312815]
11836C12815b31156N2009O1089C77881j43392a37137j1282N464L6578J0596E0998
11824B14687a32451A08703k1523d6000l202l5110k05214A15916b75377b1263j1067
11813c2330L644E2659a5591N390I7515D0236P896Q3915a90667N8721n1444A51790
11800F2998J36924n7286a26275j5990c301j78112H5667f0713q3318D07584a80217
11788A4129J39591a89853R1292H5811K51188H8505J45456a38952j30559H3529
11777A70696a79750J2907O0477N2738A15067B1085P7376K61589A3833a45865f0950
11765F4535g3941j63633F0816a27562o2973G6209n606a72125B3949L1328K815
11754E8092L4669c34961D0208a93280l2288B09941K33089j45519o7508a13452
$$ y = [312815, -231156, -179147, -118058, 377881, 234489, -137137, -148419, -142955, -106377, -95781, 50998, 214687, -132451, 108703, 87180, -46000, -49202, -84312, -289526, 115916, -275377, -21263, -32330, -28686, 52659, -15591, -10201, 97515, 40236, 48132, 132047, -190667, -131946, -183390, 151790, 62998, 199922, 142636, -126275, -142265, -3301, -181413, 85667, -60713, -144031, 407584, -180217, 14129, 153720, -189853, -98561, 85811, 336999, 88505, 233961, -138952, -269511, 83529, 170696, -179750, -166843, -106366, -53628, 115067, 21085, 98461, 360050, 13833, -145865, -60950, 64535, -73941, -237574, 60816, -127562, -190535, 76209, 70603, -172125, 23949, 55277, 58092, 92761, -334961, 40208, -193280, -225568, 209941, 443030, 297511, 230003, -113452]
11743A78406H5967n411a49482E3854L56455A85498c9233A93557D6076E441a35468
11731A40949a48738A52540c233i66k88078E72437c3625j6017j73220h3554r3663
11720a77217O1334l6749g4402C545b67985f4033H6207I731a0485l97160i6399
11708C24872A19047a73290N8856C13505c6773B44131D5536K7120C2159b61576
11697D59802F9889h0005C06289n5359m8926F6682i4080A12564Q1339i570A35471
11685d9561B86397C2682L31087a4842r8554A25944O5854O3155f9801K6851a6107
11673E5525K22114a19982m5403B28045f9496B52322j23060g5090C27926c37473
11662a52419b0709p9850A23591D5855K21106a39366k23157H0271N1941a90551
$$ y = [178406, 85967, 80556, -149482, 53854, 410309, 185498, -39233, 193557, 46076, 5441, -135468, 140949, -148738, 152540, -3233, -966, -289044, 572437, -33625, -49642, -222862, -83554, -177217, -115883, -152632, -74402, 3545, -267985, -64033, 86207, 9731, -10485, -407645, -96399, 324872, 119047, -173290, -114434, 313505, -36773, 244131, 45536, 72656, 32159, -261576, 459802, 69889, -80005, 306289, 250930, 202004, 66682, -94080, 112564, 193903, -9570, 135471, -49561, 286397, 32682, 363769, -14842, -113396, 125944, 191798, 254953, -69801, -42950, -16107, 55525, 277639, -119982, -165385, 228045, -69496, 252322, 129262, -75090, 327926, -337473, -152419, -20709, -100559, 123591, 45855, 266961, -139366, -362523, 80271, 132212, -190551]
11651C4249d86270d4598E828K69295C8889f0227A03444B1164O6261a052A56661
11639G5746g3449b2840r6057N3314B66104c12664N9424B20707P4540j37525a68091
11627b13973B68071A16298N4681K04574g5692c3076C9242M32156A20078f7414
11616i10p2589D8399O4971A3996b35236C17093b06818C2754A0311J97726g0372
11604B39189F913P1946J46353h3054A49777n6938D5436a53580A3584L92267A63688
11592A96821j9060e5576A6249b4538H599a41243m2188C14213j51961a84105C4074
11580h9210C91640b26253J4954f7611A60028l3032C5399C006J42816p716a17390
11568b2181F6562j3072K12870F6047g4257B10455a17778A13773m3219a93607b9762
$$ y = [34249, -486270, -44598, 5828, 275123, 38889, -60227, 103444, 21164, 87425, -1052, 156661, 75746, -73449, -22840, -118897, -65583, 266104, -312664, -253240, 220707, 295247, 157722, -168091, -213973, 268071, 116298, 170979, 375553, -75692, -33076, 39242, 471398, 120078, -67414, -910, -73499, 48399, 113370, 13996, -235236, 317093, -206818, 32754, 10311, 208037, -70372, 239189, 6913, 78859, 225212, -83054, 149777, 92839, 45436, -153580, 13584, 405851, 163688, 196821, 177761, -55576, 16249, -24538, 8599, -141243, -183431, 314213, 162252, -184105, 34074, -89210, 391640, -226253, -211299, -67611, 160028, 126996, 35399, 3006, 145822, 138106, -117390, -22181, 66562, 53490, 266360, 66047, -74257, 210455, -117778, 113773, 70554, -193607, -29762]
11556a78364A74630q3586J05217m8369a35880e656k07538n596C60802b15815A37976
11544C05543b44969P0970A62102G3749Q9760p3838P328m5057A6889R6082b37203
11532c74736A91901R2991l1411q3144e7659b4897l8394K3223j49744N0679O8210
11521g0923D0395Q0547J77965A7731J24082a12770A55552a79846a8147n6093A57589
11509A80425c2226C98216A79022F5153J75447G9320m172J51322B5721a11534B15666
11497d065C56827a544C86584J0945f3583l3015l8448A68591a49173L7542C90003
11485B35645J91588j15555A04398B6651b38220A43431K37064A58910Q510a63515
11474B00766k9945g1832B20231h0579c3959G9572K17777n6000c4449C37811a73322
$$ y = [-178364, 174630, 91044, 196261, 147892, -135880, -5656, -213194, -218790, 360802, -215815, 137976, 305543, -244969, -173999, 162102, 73749, 163509, 89671, 96999, 51942, 16889, 112971, -237203, -374736, 191901, 284892, 253481, 170337, -57659, -24897, -63291, -40068, -189812, -139133, -70923, 40395, 120942, 298907, 17731, 141813, -112770, 155552, -179846, -18147, -74240, 157589, 180425, -32226, 398216, 179022, 65153, 240600, 79320, 75148, 226470, 25721, -111534, 215666, -4065, 356827, -1544, 386584, 397529, -63583, -96598, -135046, 168591, -149173, -111631, 390003, 235645, 427233, 311678, 104398, 26651, -238220, 143431, 380495, 158910, 167420, -163515, 200766, 170821, -71832, 220231, -80579, -33959, 79572, 297349, 241349, -34449, 337811, -173322]
11462A19140J65842l587K16515g1897m4019A59085C5292a38604D3509K41421N1701
11451C36631a10099G0834J82812F3241c02017a01324A46922c34062J47526B39698
11440B92967a37070c4901D5400j2703M9069A0782K56279A12549b66086k0015H6999
11428G9163K97634I855a45021B00672l123b6767j24797A48843o8718G926K07194
11417B15120a644p8911j97879g7129A48965A7996a73886K7354F1498N6440a53512
11405A00407J51323c3888A1455J88680a80864K5409H9906b12451o5367D8726M2248
11394I0974P0758a17569p061M5429B9036J32988k7638D6557M0935c67076b8431
11382A01845g4944B24247n6633C0112o921J30839e0979l11662C0714J2726K13057
$$ y = [119140, 284982, 281395, 497910, -71897, -115916, 159085, 35292, -138604, 43509, 284930, 336631, -110099, 70834, 253646, 63241, -302017, -101324, 146922, -334062, -186536, 239698, 292967, -137070, -34901, 45400, 32697, 81766, 10782, 267061, 112549, -266086, -286101, 86999, 79163, 376797, 9855, -145021, 200672, 197549, -26767, -151564, 148843, 80125, 7926, 215120, -1644, -80555, -278434, -77129, 148965, 17996, -173886, -146532, 61498, 117938, -153512, 100407, 251730, -33888, 11455, 200135, -180864, -155455, 89906, -212451, -277818, 48726, 90974, 161732, -117569, -124630, -79201, 29036, 162024, 134386, 46557, 87492, -367076, -28431, 101845, -74944, 224247, 167614, 30112, 23191, 154030, -50979, -362641, 30714, 43440, 256497]
11371B56497d1259j51620E4512a82722C2386J35077b04239P2537j43139A91117
11360A77916c05077a18299C9448j6562a45653j7373M3911G5464j2258b31017B8632
11348B62819j14393a19556A72761a47464E84J71931G5431P5911e5117b2201a808
11336a08187J5144A13844a68136h0137j4830I4023G872a51295C8597c11208a43616
11324F2658c6964k03773C12825b09169A3891d1493C22681A18284a54187A594a53774
11312I1136d13202A46396c31927H7172K75494A0560b08133H2138b93685B7666
11301a15615o8189K196A52121b27998O1364O9871A00041p733B4362J60256E9387
11289B0230K49766i8632l83326a2305j61145A41659i4033Q459C5479L4391L3634
$$ y = [256497, -41259, -192879, 54512, -182722, 32386, 167463, -204239, -131702, -274841, 191117, 177916, -305077, -118299, 39448, 22886, -145653, -163026, -119115, 75464, 63206, -231017, 28632, 262819, 148426, -119556, 172761, -147464, 584, 172515, 75431, 151342, -55117, -22201, -1808, -108187, -93043, 113844, -168136, -80137, -94967, 94023, 7872, -151295, 38597, -311208, -143616, 62658, -36964, -240737, 312825, -209169, 13891, -41493, 322681, 118284, -154187, 1594, -153774, 91136, -413202, 146396, -331927, 87172, 362666, 10560, -208133, 82138, -293685, 27666, -115615, -183804, -181608, 152121, -227998, -166634, -96763, 100041, 92308, 24362, 184618, 59387, 20230, 269996, -98632, -481958, -12305, -173450, 141659, -94033, -85574, 35479, 69870, 103504]
11278A03504e0215F6294L9549a15584D0029a48384e7918m0994j78701g7940B4582
11266A45387J29666B323P242f4328E4545b16730d1730A29415g1403b404k64045
11255b66449E8418k0786f7276j85474K0688J15814J8158r9264L3332c9470p7202
11244a16672C21292b2585I6253a61807g8423l11329e4291k59280a30935k23503
11234c54438A6061J01415a16435A86836c35576B9139a74156A03709c29407P6144
11224b53263K5446k31952g5292B03553d8055j00447L7428a3969l5407j7300j76737
11213b43413k0598a13589K9010l8629e223I039b72904C5082c6806j18160D3757
11201I5434i6307m9197A27713i4995j59204D5948k0024J3889a49577C76556G9479
$$ y = [103504, -50215, 66294, 105843, -115584, 40029, -148384, -57918, -98912, -277613, -77940, 24582, 145387, 275053, 2323, 9565, -64328, 54545, -216730, -41730, 129415, -71403, -2404, -266449, 58418, 37632, -67276, -252750, -232062, -116248, -98090, -197354, -164022, -39470, -116672, 321292, -22585, 96253, -161807, -78423, -389752, -54291, -313571, -130935, -354438, 16061, 117476, -116435, 186836, -335576, 29139, -174156, 103709, -329407, -253263, -227817, -459769, -75292, 203553, -48055, -148502, -111074, -13969, -49376, -66676, -243413, -264011, -113589, -84579, -123208, -5223, 9039, -272904, 35082, -36806, -154966, 43757, 95434, -96307, -145504, 127713, -94995, -254199, 45948, 25924, 39813, -149577, 376556, 79479]
11189C18643e7579o1063A69628B9817c7849k86846o1993f2846B2186a39509D6881
11177a67726I6834C6470i4339l25734d9184o7987B12289g9476D3892c57168Q5881
11166b71287I0681b671k2444A36346M8790a31811A27227a18395A9441b62223j39658
11155d01881d7001B0491a48951c6333I612c26222J37218C5162j7224M6618c9323
11143c9647A20265a8397H8042a71889k87720I5378c24772a58642n4673a06042
11132h8213B1549a80348E7689k2803a43798B13872B6949J07081m0555L50099C9608
11120b01905G7948J68757c176k834D19446b8787l18091C42323b20291G3340h9220
11108c8281B5833A0316K8100L95344A99279K61939E9650L22325j25970R2952f9466
$$ y = [318643, -57579, -118642, 169628, 29817, -37849, -324695, -386688, -62846, 22186, -139509, 46881, -167726, 96834, 36470, -94339, -420073, -49184, -117171, 212289, -79476, 43892, -357168, -271287, 90681, -2671, -25115, 136346, 185136, -131811, 127227, -118395, 19441, -262223, -401881, -47001, 20491, -148951, -36333, 9612, -326222, -189004, 35162, 17938, 64556, -39323, -39647, 120265, -18397, 88042, -171889, -459609, 95378, -324772, -158642, -213315, -106042, -88213, 21549, -180348, 57689, 34886, -143798, 213872, 26949, 134030, 93475, 443574, 39608, -201905, 77948, 246705, -3176, -6010, 419446, -28787, -346878, 342323, -220291, 73340, -89220, -38281, 25833, 10316, 38416, 433760, 199279, 461218, 59650, 381975, 256005, 348957, -69466]
11096A85386J64383A50163J4930J25891o0007j912J5228J5910a21471D22571a36994
11084A04438M9607h0871c9515C09810o7061j15069Q1757l4740J53297n9102M6495
11073C15387q3163J84953J8700L1838j39088L5804m1362p7323N21974l82856A72078
11061A35095J15187L6173N4205K92940j62520O074J40123k80742O2513Q7348J17674
11050F04070j26030K82013J11182N5148J388j34029j83929r2519J35728J07017
11040G60039r7105K67414k59011Q5331C40949M58324L835l3510J71903j04605
11030H36896k55546R1210K9636j55231M6837Q2138J5901k6123k9884p8949J20087
11019F76972q428l18627J60849M1007q8670M26550N7102C88652j8025K89341J84046
$$ y = [185386, 349769, 150163, 165093, 290984, 230977, 229065, 244293, 260203, -121471, 422571, -136994, 104438, 154045, -80871, -39515, 309810, 242749, 127680, 209437, 174697, 327994, 268892, 315387, 232224, 417177, 435877, 467715, 328627, 364431, 323069, 245746, 767720, 384864, 172078, 135095, 250282, 286455, 340660, 633600, 471080, 477154, 617277, 336535, 399048, 486396, 604070, 478040, 760053, 871235, 926383, 927771, 793742, 609813, 517294, 653022, 760039, 662934, 930348, 671337, 756668, 340949, 799273, 803108, 769598, 941501, 836896, 581350, 672560, 702196, 546965, 593802, 675940, 691841, 665718, 635834, 556885, 676972, 668544, 349917, 510766, 551773, 463103, 889653, 946755, 388652, 370627, 659968, 844014]
11008H44014M902l34181L39022j95490l700J6872M9524k9449m2909j37707R90
10997E11888L3171j35940P1774j61904K10220O5577j24706K88182m8641P241l9538
10986F77324j85795M71375R2854J80782l85747O27429m94573L15748j61954k29482
10976I07961J78195M60342M1242L1079N9472M39532L56117j73752K21429J5539
10966B537156j84288K49116Q8593m01776J97054k28204l34034o632o7221j71967
10956A677797l774n8540j4295J94920r8267K0090l99116P1284n29282M15234n7487
10945A218564k90819k89934L8326k72289R4859f0908D83395A65675e9543B40014
10934E5743J08492l0554P8267K7020G3180f7516A24961M9763M16675A08885B057
$$ y = [844014, 848916, 514735, 853757, 658267, 654567, 671439, 720963, 691514, 648605, 510898, 511888, 545059, 409119, 480893, 318989, 529209, 594786, 470080, 758262, 709621, 716862, 677324, 491529, 962904, 1055758, 1236540, 850793, 1478222, 983649, 1299397, 1137443, 907961, 1086156, 1546498, 1587740, 1618819, 1678291, 2117823, 2473940, 2300188, 2521617, 2537156, 2352868, 2601984, 2690577, 2288801, 2485855, 2257651, 1923617, 1916985, 1849764, 1677797, 1674023, 1615483, 1601188, 1796108, 1697841, 1717931, 1318815, 1390099, 860817, 1276051, 1218564, 927745, 637811, 676137, 403848, 498707, -60908, 483395, 165675, -59543, 240014, 55743, 164235, 133681, 211948, 238968, 73180, -67516, 124961, 174724, 591399, 108885, 2057]
10922b97908J45553F4872a27198B81035a52851A93777B6574d0237q619I2186J61609
10911B53795b50436C76571k4078j8555b29141A64892e3214J4666F7496J78750
10901B46246a25273C2573J65989a76155A25454c8829b408r2517A15110J9168Q3491
10890B17769b13864B9092J60498c09125A43445b45451c4600j292C41978f6255
10879C8169b2642B8635J87643A00079L52030G531a4146k15285j47446J06844k9977
10868c00010b7106j59144e0794F3981a2298r4458l9343B44412a88447E2231a6165
10856d6523C64837f524n7963A29439a61389d6195j47040F6844i8565k62413J12980
10845b47998J18421p3670j2141H2567a33219B28441d1843F4322i2819D79591D4446
$$ y = [-297908, -152355, 64872, -127198, 281035, -152851, 193777, 26574, -40237, -48856, 92186, 253795, -250436, 376571, 352493, 333938, -229141, 164892, -53214, -38548, 67496, 246246, -125273, 32573, 198562, -176155, 125454, -38829, -2408, -94925, 115110, 134278, 217769, -213864, 29092, 189590, -309125, 143445, -245451, -34600, -35892, 341978, -66255, 38169, -22642, 28635, 216278, 100079, 452109, 7531, -14146, -229431, -376877, -270033, -300010, -27106, -186250, -50794, 63981, -12298, -106756, -146099, 244412, -188447, 52231, -16165, -46523, 364837, -6524, -64487, 129439, -161389, -46195, -193235, 66844, -98565, -360978, -247998, -129577, -203247, -215388, 82567, -133219, 228441, -41843, 64322, -92819, 479591, 44446]
10833a76323B2821r11K99620g094F3855l0665A0310J34125A4747d3963k53927
10822b97890F056b28163A52407E1525o407c78451a15292n5332B15625f3902j80141
10811b44043C81411b33971F6392A0684J00884C7152A8496m448e6363l58515J40839
10800b74039J10055M3959k06310A62718b12167L5372J6113f0015l88j71165N4465
10789a77103b8287l2202F3170B9082J82982f4966L1941G0445j2276a98287J588
10778a96699B60109b6070j72093m2331O3554G2745Q5944a91310K5515g5324j05206
10767a80530O2401F2507R6118c9985k4740B24875f1882o0706N4878k90645a140
10755F9556G722R2573l4763b61828a9298D6133c14517i3677k5216G0704a6437
$$ y = [-176323, 22821, 21910, 321530, -7094, 63855, 33190, 10310, 144435, 14747, -43963, -297890, 6056, -228163, 152407, 51525, 45118, -378451, -115292, -170624, 215625, -63902, -244043, 381411, -233971, 66392, 10684, 111568, 37152, 18496, 14048, -56363, -414878, -274039, -163984, -120025, -326335, 162718, -212167, -176795, -160682, -60015, -60403, -231568, -177103, -28287, -60489, 63170, 29082, 212064, -64966, -33025, 70445, 58169, -198287, -196699, 260109, -26070, -198163, -240494, -176940, 72745, 158689, -191310, -165795, -75324, -180530, -118129, 62507, 158625, -39985, -64725, 224875, -61882, -122588, -67710, -358355, -1140, 69556, 7722, 100295, 65532, -261828, -19298, 46133, -314517, -93677, -118893, 70704, -16437]
10743a20444H5526h9433l4053j37057a3672j88769c7493A38303e99655J98622
10733d01033A20326K5476C6163i2789r3000B30805d1079A22407J88572a49675
10722F7180a16445N7257j75285p727P3639a8100A1291g5274j54858C3327a61886
10710A49051D0504a66380L7012b7711j47547A67904a38232f5736I485K36666c65837
10698A13637a37988E2867A0707J12371n0215c13882j35648a12350K5443J5476
10688g1431j47074L5445e7266A68143l3296B2223b44257H5068a74125C8553a28378
10676a78806Q4423G730d60005D7154b48272A6293J75293a17541F2079L38395I5291
10664A59096a11471e2674k2921j38898J01621j6122K6893C0984J7546e40493C0430
$$ y = [-120444, 85526, -89433, -123486, -260543, -13672, -202441, -37493, 138303, -599655, -401033, 120326, 145802, 36163, -92789, -185789, 230805, -41079, 122407, 310979, -149675, 67180, -116445, -59188, -234473, -242200, -168561, -18100, 11291, -75274, -230132, 33327, -161886, 149051, 40504, -166380, -129368, -27711, -175258, 167904, -138232, -65736, 9485, 246151, -365837, 113637, -137988, 52867, 10707, 123078, 72863, -313882, -449530, -112350, -86907, -71431, -218505, -183060, -57266, 168143, 134847, 22223, -244257, 85068, -174125, 38553, -128378, -178806, -94383, 7730, -460005, 47154, -248272, 16293, 191586, -117541, 62079, 400474, 95291, 159096, -111471, -52674, -75595, -214493, -112872, -128994, -102101, 30984, 48530, -540493, 30430]
10652b70121C3583f6986J3447l6815A6974J57657q6233h4333B3792E989M2054
10641D8043a94611R4103K5620o8129a1479a362n5000j72324B0590J9429d8872
10629b9254A02598b8950o6731l8608F6145K04534b34062O1723A19463k4822m2787
10618E1854B3971a36787A27862a12823j07069N5090A1935J47044e8939B01075
10607g4823l898B70982E2763i5136G0463A1523J4450J29472B064J37015o5956
10596G3123b96177A28551I139a23659A92250B6157L39757b16878j12958A40970
10585H8120b95403J36271B3022a07623A9133B919a45878c1164A09798c04928J43998
10574a60930O293f1829k01201k3919a26795A97745l7921b70523A42454b20927
$$ y = [-270121, 33583, -66986, -53539, -90354, 16974, 174631, 88398, -84333, 23792, 5989, 48043, -194611, -100508, -74888, -143017, -11479, -1362, -56362, -228686, 20590, 40019, -48872, -29254, 102598, -28950, -95681, -134289, 66145, 270679, -234062, -172339, 119463, 94641, 51854, 23971, -136787, 127862, -112823, -219892, -164802, 11935, 158979, -58939, 201075, -74823, -78721, 270982, 52763, -95136, 70463, 11523, 25973, 155445, 2064, 139079, 73123, -296177, 128551, 9139, -123659, 192250, 26157, 365914, -216878, -329836, 140970, 88120, -295403, -159132, 23022, -107623, 19133, 2919, -145878, -31164, 109798, -304928, -160930, -154637, -61829, -263030, -286949, -126795, 197745, 159824, -270523, 142454, -220927]
10563B3259L6874i3545D14916A00215c97498a90734d4456m9203J4731r5705c540
10551A42723a2288j93734E816K81728O257J9811A45338m4444a50152H0590e0985
10539c60318A45696l1579g3123A18068a77203E3231d7557J5990l3321l75306B13607
10527I4632N1611b7319k25712r918B879K76891b31956K2503P3285L6365k1898
10516a21701N4723B0350K57901j1235h736D023a82617J9690j4759B92003c03906
10504c52398G621a63459m7922C29654a10260e3331a3196j20948I7597b41052A12196
10492A03650l5994a42855B22589e243k62672i8011c9216d317j61706L047b8615
10480b66273I0549c0972o6069B68773R627A08409f9677F22133B41880m8616j3463
$$ y = [23259, 60133, -93545, 414916, 100215, -397498, -190734, -44456, -93659, -78928, -174633, -3540, 142723, -12288, -206022, 5816, 287544, 293801, 313612, 145338, 100894, -150152, 80590, -50985, -360318, 145696, 114117, -73123, 118068, -177203, 53231, -47557, -31567, -64888, -440194, 213607, 94632, 146243, -27319, -253031, -262949, 2879, 279770, -231956, -209453, -136168, -99803, -121701, -66978, 20350, 278251, 267016, -8736, 4023, -182617, -162927, -177686, 292003, -303906, -352398, 7621, -163459, -211381, 329654, -110260, -53331, -13196, -134144, 97597, -241052, 112196, 103650, 67656, -142855, 222589, -5243, -267915, -98011, -39216, -4317, -166023, -162976, -28615, -266273, 90549, -30972, -97041, 268773, 278400, 108409, -69677, 622133, 241880, 193264, 179801]
10469A79801a29623E9469P5292J95282A21130c79463a36715B5114N0718J00884
10459A76716B6236A378e7503j76227B1389K55364f6435C23118A8389f4123J8772
10448d5351j61078A73340a65844e553H9764Q4744A9373a64751C62416b47493A95541
10436A29812b17680J6836K7005L5370D196b11824n1901L5558b0934r5665k4334
10425a40933K1041G6401j3847c02584K1755h1117A51941Q5202c55163L8147Q7653
10414b29363e6697j52547A6557J62507i7254A65559B0874b4204A79792c6895j17105
10403a54000A5838K7388a09942L5172B7888a01334F7358a29240a6222O626j79653
10392a89249g1306A23402N5474R8596A32175a29663A67537F7962J46919H86J8181
$$ y = [179801, -129623, 59469, 134761, 330043, 121130, -379463, -136715, 25114, 75832, 176716, 26236, 1378, -57503, -233730, 21389, 276753, -66435, 323118, 18389, -64123, -45351, -206429, 173340, -165844, -5553, 89764, 174508, 19373, -164751, 362416, -247493, 195541, 129812, -217680, -200844, -173839, -138469, 4196, -211824, -263725, -228167, -20934, -116599, -140933, -119892, 76401, 62554, -302584, -280829, -81117, 151941, 237143, -355163, -317016, -229363, -56697, -209244, 16557, 179064, -97254, 165559, 20874, -24204, 179792, -36895, -154000, 15838, 43226, -109942, -74770, 27888, -101334, 67358, -129240, -16222, -9596, -189249, -71306, 123402, 178876, 277472, 132175, -129663, 167537, 67962, 214881, 886, 19067]
10381A9067K12376n563C2250J44881P8390l3559M1240r9694a62812A33389L6134
10370A69523j891R2896k762o0691K54207L5666j79080j60J00350l3794L28219
10359G02483B57699F9864J46315e3223j0936C62749j17807J07257m6674J21004
10349D26529K6000A29196L44669j31115J21665j23825Q3944r6973J43833K15689
10339F87083l08698D6412b6527A80185J83837j25270F0174N7199Q2467Q9716A20498
10327D4838j3355b76820A32586g0956I1244a04961A8347J09519Q4750j8910E1849
10315F3829K11499I232Q1857a12089B03599b25165G6616Q7742K05783e6097j34642
10304a90739q9488A01862a97743B18292i8722j8573j45081m8563J44299C71146
$$ y = [19067, 231443, 225880, 32250, 177131, 255521, 221962, 263202, 163508, -162812, 133389, 169523, 167632, 260528, 257766, 197075, 451282, 486948, 307868, 307708, 408058, 374264, 702483, 257699, 69864, 216179, -53223, -64159, 362749, 244942, 352199, 305525, 426529, 452529, 129196, 473865, 342750, 464415, 340590, 424534, 327561, 471394, 687083, 378385, 46412, -26527, 180185, 364022, 238752, 60174, 117373, 199840, 289556, 120498, 44838, 31483, -276820, 132586, -70956, 91244, -104961, 18347, 127866, 212616, 193706, 51849, 63829, 275328, 9232, 91089, -112089, 203599, -225165, 76616, 164358, 370141, -56097, -190739, -280227, 101862, -197743, 218292, -98722, -117295, -262376, -310939, -166640, 371146]
10293I6504j7140a82330A42173m8462b49856K4636P9339H6268g0281o9676f2586
10281a53842C4347c2358j39221k59537R1014G5926b71608a11336M7291J6461C4054
10269c9104c2B0558c49476B9121a28017m3349g8014A25312J18345C5378K8001
10258F3379O8715c0679B03994K31823H334K65407A6470J58348K4066P5523g2195
10246h488A21641a42018c7302C35049C5512c06237J09972A39535l8771P7039b2286
10234C72216a81528b7353n2395C3656b50551q0936a09336A7189m869b45639C35547
10222f1629B65131h5857F7238J7501K951a62002I5864M7005g1897j6802k539C8533
10209A3082d3599l53021C2358J2735b09106b3339F7817a11243n5190a5396A71192
$$ y = [96504, 79364, -182330, 142173, 93711, -249856, -225220, -145881, 86268, -70281, -139957, -62586, -153842, 34347, -32358, -171579, -431116, -340102, 75926, -271608, -111336, -64045, -47584, 34054, -39104, -32, 20558, -349476, 29121, -128017, -171366, -78014, 125312, 243657, 35378, 63379, 132094, -30679, 203994, 435817, 8334, 273741, 16470, 174818, 198884, 274407, -72195, -8488, 121641, -142018, -37302, 335049, 35512, -306237, -196265, 139535, 100764, 177803, -22286, 372216, -181528, -27353, -79748, 33656, -250551, -331487, -109336, 17189, 12320, -245639, 335547, -61629, 265131, -85857, 67238, 84739, 87690, -162002, 95864, 142869, -71897, -88699, -91238, 38533, 13082, -43599, -396620, 32358, 45093, -209106, -23339, 67817, -111243, -166433, -15396, 171192]
10197c14914f8557c489B072e4637j02574k96168I4586a62981a562n8132E1926
10185B14420a28031e2670D9901J6667b18503j81941g7670m0842l8677j55123M028
10174c08284M1974J06601D9651c37992B5971c50456q4358a83228d5936B54604
10163A43183e5715D4122d2810p3977A48064a8250l43997g5166q7399r2436i7128
10151B37209c4114A0776K7989a24563o138j1665F6740A3674J23307g5110B46622
10139F6476a27808q4666C45050a60948K1009k62989b8831B40755b34785L0161
10129b04624N4105r584C6205K97655A4867a20097E9700A2875O0391a17566A13885
10117B4171a72389D6677c44605J64469L7681j7593n9262P7878A00527m217d4617
$$ y = [-314914, -68557, -3489, 2072, -54637, -157211, -453379, 94586, -162981, -1562, -59694, 51926, 214420, -128031, -52670, 49901, 66568, -218503, -400444, -77670, -118512, -157189, -312312, -308284, -266310, -159709, 49651, -337992, 25971, -350456, -434814, -183228, -45936, 254604, 143183, -55715, 44122, -42810, -116787, 148064, -18250, -362247, -75166, -162565, -255001, -97128, 237209, -34114, 10776, 38765, -124563, -130701, -142366, 66740, 13674, 136981, -75110, 246622, 66476, -127808, -212474, 345050, -160948, -139939, -402928, -28831, 240755, -234785, -204624, -150519, -160103, 36205, 333860, 14867, -120097, 59700, 12875, 73266, -117566, 113885, 24171, -172389, 46677, -344605, -180136, -142455, -160048, -219310, -141432, 100527, 96310, -44617]
10105a52044j18713F0708b0025k29517A03360f5261k34587A57684b50591A05439
10094a29912L878d5725b964l43570G9254b27669F6053a18822e3828B7412c7599
10082a04246n9021A38226c0691r8637A10810K6168a77376K2811k4570O2411K4935
10071i1789C19084f0838o4189G1586e9955E2796a21765j02163L2337P4819p5137
10060a91909M1711B89692m204A39803b51165A59678a74913p9672B10422b47406
10049b2799A86284a18058k18927d0052A511f04106a89250b102B0397a12848b4158
10037a74183q3787c7777C0142P382e49093a80922A17006C0334J99468a52720A69153
10025e6824j74798B23369B1875a93708j73809e161E180J33172n7721g3077A01477
$$ y = [-152044, -270757, 60708, -20025, -249542, 103360, -65261, -299848, 157684, -250591, 105439, -129912, -126034, -45725, -2964, -346534, 79254, -227669, 66053, -118822, -53828, 27412, -37599, -104246, -163267, 138226, -30691, -129328, 110810, 136978, -177376, -154565, -179135, -116724, -91789, 319084, -60838, -125027, 71586, -59955, 52796, -121765, -223928, -191591, -116772, -191909, -150198, 289692, 285488, 139803, -251165, 159678, -174913, -254585, 210422, -247406, -22799, 186284, -118058, -336985, -40052, 1511, -604106, -189250, -2102, 20397, -112848, -24158, -174183, -257970, -37777, 30142, 37524, -549093, -180922, 117006, 30334, 229802, -152720, 169153, -56824, -231622, 223369, 21875, -193708, -367517, -5161, 5180, 138352, 80631, -73077, 101477]
10013I972k693L6462Q2532M3282g4485l1178r1578P5660j0603a1703k77979h8050
10000A19610n9063L627a69079H3510N8814a04668A61769c32600i6055A63257a97762
9988d08079A7775J61926a39922p9354e1756N442k50080J14937P4923A55403f559
9976E3268b19983j22055a58609g9191k46472J28945J1366A82707O492B6937e2754
9964b26189j0455e9455j05401P7372l03188C8372i2642k44620c8486n572A59469
9952C01253a47697b7342j47054N1382E9903c36026A62088d1375B72709c04150
9941e0664a2201q3012K2081a6845B48640K8919C3502b72572d6221j22015m2354
9930b10590e7986j80131m6877j8108J37770j98350a80869c2782r6134b0015B42039
$$ y = [9972, 7279, 43741, 126273, 169555, -74485, -105663, -197241, -121581, -132184, -11703, -289682, -88050, 119610, 60547, 64174, -169079, 83510, 142324, -104668, 161769, -332600, -96055, 163257, -197762, -408079, 17775, 179701, -139922, -219276, -51756, -46314, -296394, -181457, -106534, 155403, -6559, 53268, -219983, -342038, -158609, -79191, -325663, -196718, -185352, 182707, 189199, 26937, -52754, -226189, -236644, -59455, -164856, -87484, -390672, 38372, -92642, -337262, -38486, -44058, 159469, 301253, -147697, -27342, -174396, -123014, 59903, -336026, 162088, -41375, 272709, -304150, -50664, -12201, -95213, -73132, -16845, 248640, 277559, 33502, -272572, -46221, -168236, -210590, -57986, -238117, -284994, -303102, -165332, -363682, -180869, -32782, -128916, -20015, 242039]
9918a8402l31350a61399e7294j13409e9684B405J76823j7889b19066J04024l44239
9907d59281b23314P0786I0558a65060l7091E4428c23217a09453j18719c0686j0469
9896d1155j51495j26867a08307L996j26357N5755K7186A56435E4233d67226a62910
9884C82789b76374A08908i587h38j7391j32028f3317a7264n4407a1835k18940
9873b30775B15005E6223j3907j2608d6467o7575q2339R4240k2582J1668j58672
9862b71727d2476j3853k04512j25777J10131M7511B25746a63929J576i982F3961
9850a590q0443A34362n2337b02865A18277a63028K2909K222c9368E3983N2859
9839A06842c44421r7544J70212d6702H1463a24445A51610J12644c69770a01381
$$ y = [-18402, -349752, -161399, -57294, -170703, -59684, 2405, 179228, 161339, -219066, -115042, -459281, -223314, -152528, 90558, -165060, -202151, 54428, -323217, -109453, -228172, -30686, -41155, -192650, -319517, -108307, -104311, -230668, -174913, -147727, 156435, 54233, -467226, -162910, 382789, -276374, 108908, -9587, -838, -18229, -150257, -63317, -17264, -71671, -11835, -230775, 215005, 56223, 42316, 29708, -46467, -114042, -196381, -102141, -124723, -113055, -271727, -42476, -56329, -260841, -386618, -276487, -228976, 225746, -163929, -162353, -9982, 63961, -1590, -82033, 134362, 82025, -202865, 118277, -163028, -140119, -137897, -39368, 53983, 106842, -344421, -441965, -271753, -46702, 81463, -124445, 151610, 264254, -369770, -101381]
9828a6466F605b43247R8185N8601M3211j30229j07546A86232a22640a016A0221
9816B65187a00032p5612A14513c97655a14290J1268q8247J666g3887o2088b3679
9804A83969b16210o1084g4531A31217n9544J4585m0744i8503K6924p9946I217
9792b16748q5824h8528j60511p9930A12242b9253C22446A12050c2092j25335k4346
9781a81773M0147p4918P5997C24273a2265F0939P5607e4429k57595K8618C409
9769H275a01802r3074O3494a1212o9851B15641I0990M8534b81948L2992o8713
9758c17669a2155A83976a40126J4063O1284r6966F5081B0194L2930i4896j69446
9747b64342k4721A64907A8615b20270C7227a23814e2988b0109n1466A50355a01809
$$ y = [-16466, 6605, -243247, -145062, -86461, -43250, -173479, -281025, 186232, -122640, -1016, 10221, 265187, -100032, -175644, 114513, -397655, -114290, -103022, -191269, -189603, -73887, -135975, -23679, 183969, -216210, -277294, -74531, 131217, 71673, 86258, 45514, -98503, -71579, -151525, 9217, -216748, -302572, -88528, -249039, -328969, 112242, -29253, 322446, 112050, -32092, -157427, -181773, -141626, -216544, -140547, 324273, -12265, 60939, 136546, -54429, -312024, -283406, 3409, 8275, -101802, -194876, -131382, -11212, -81063, 215641, 90990, 139524, -281948, -248956, -317669, -12155, 183976, -140126, -126063, -64779, -161745, 65081, 20194, 53124, -94896, -264342, -289063, 164907, 18615, -220270, 37227, -123814, -52988, -20109, -71575, 150355, -101809]
9735c20073G2003b84783A19613j8177b45801B31912B6719L7777R468B224J26353
9724A28577c22650o8078a60244H1885d2029j08701d8732r368K5644k58297B25691
9712a8747q1776I293c21181A70396a5650D7353a93771r425k1081n8149J28425
9701a54001J1625O1301B4693J34666a89257h4616B75109D5777a52312d5973A79593
9689a74970f5716G1841B0139L819N6756k3046b13937C1582f1983l00368a05028
9677c9366A61578c5552E011J48564b9761l13802d4216J0300A31147D0304c39029
9665D1752f8607k8869I2445b8679o9569c5074k03897j74475J19331M7854i8365
9653H2000a26198j3837E5439L1233C4777J07506d2944k68659j00928b0111n1673
$$ y = [-320073, 72003, -284783, 119613, 101436, -245801, 231912, 26719, 64496, 73964, 2224, 128577, -322650, -390728, -160244, 81885, -42029, -150730, -48732, -58100, -32456, -290753, 225691, -18747, -100523, 9293, -321181, 170396, -15650, 47353, -193771, -203196, -224277, -282426, -154001, -142376, -81075, 24693, 159359, -189257, -84616, 275109, 45777, -152312, -45973, 179593, -174970, -65716, 71841, 20139, 23958, 80714, 57668, -213937, 31582, -61983, -362351, -105028, -39366, 161578, -35552, 5011, 153575, -29761, -343563, -44216, -33916, 131147, 40304, -339029, 41752, -68607, -97476, 92445, -28679, -98248, -35074, -238971, -413446, -294115, -246261, -98365, 82000, -126198, -140035, 55439, 86672, 34777, 142283, -42944, -311603, -412531, -20111, -71784]
9642g1784P1k59402f9361B51599b34771M1874O0677F4717b22949B04150o9068
9631A35082b4533M253l34543H6080M5191m6646K38316n2415A22854b51084a0950
9619a00539d2747k13349g786l41733i4052o5544c7750j51643O5979j58746J14818
9608a67342k01383i2224C8144j0054p671D488J53143a34573j77076B85O7307b30841
9595a54127f1381j07099A75898b37844A98070a6631j90308A6725b0329B5095K60240
9584B85335a76279B3646Q755a56457J8956J4075d914B50535a11827r2455q5261
9573b89543g8180j17391J02d3591k3009E144i2381D2222e0741n8129k2600p9102
9561b10572e9446j67849g9519F4384i9682F5792b2956m453j13254j28685B11611
$$ y = [-71784, -71713, -331115, -69361, 251599, -234771, -192897, -132220, 64717, -222949, 204150, 135082, -24533, -20280, -354823, 86080, 131271, 84625, 322941, 270526, 122854, -251084, -10950, -100539, -42747, -256096, -7786, -349519, -94052, -159596, -37750, -189393, -123414, -282160, -167342, -368725, -92224, 38144, 28090, 20419, 4488, 157631, -134573, -311649, 285, 67592, -230841, -154127, -61381, -168480, 175898, -237844, 198070, -16631, -206939, 16725, -20329, 25095, 285335, -176279, 23646, 32401, -156457, -137501, -123426, -4914, 250535, -111827, -204282, -289543, -78180, -195571, -195469, -43591, -66600, 5144, -92381, 42222, -50741, -108870, -131470, -210572, -59446, -227295, -79519, 64384, -99682, 65792, -22956, -27409, -140663, -269348, 211611]
9549a24783q2652M0366G8772a71378O0221n8388A88257c7074o2781k33760B32130
9537A1071a00161I9408j489K83555A9442a0915A03138a88715Q7365p0375j6444
9526a88169k0992E2614a93604A31462a97644I3860J9453B8859L9878h7312k47457
9515c34769e6217Q544A27984d57400a26291p19M1076j79862A98017C3024a95757
9503i0916K9999B0517a94173A08742b45503a14024l11300g3858j12696r4691J0604
9492b70641b6451k40182a3667A219J43177B1440h0521I878g5009j20905N1106
9481a44808a8531n0132k45375J20310B7588d01408e4198C3730b55197p4966B03639
9469a72113c6586k16342Q8409E9696F105a56747a4536k9338j81615R0582O0759
$$ y = [-124783, -207435, -167069, 78772, -171378, -111157, -169545, 188257, -37074, -99855, -333615, 232130, 11071, -100161, 99408, 97919, 381474, 19442, -10915, 103138, -188715, -101350, -171725, -188169, -209161, 52614, -193604, 131462, -197644, 93860, 113313, 28859, 68737, -87312, -334769, -56217, -47673, 127984, -457400, -126291, -127010, -85934, -265796, 198017, 33024, -195757, -90916, -60917, 20517, -194173, 108742, -245503, -114024, -425324, -73858, -186554, -281245, -270641, -26451, -266633, -13667, 1219, 144396, 21440, -80521, 9878, -75009, -195914, -144808, -18531, -68663, -314038, -193728, 27588, -401408, -54198, 33730, -255197, -330163, 203639, -172113, -36586, -252928, -164519, 59696, 6105, -156747, -14536, -43874, -225489, -134907, -74148]
9458g4148A43996J6442K09779I9313a09669A67423k1990a31724O4282k5867B60254
9446A85081e3118j45864k0732J05186j94043a02213A89626c31299G0629a81661
9435B24329b43212Q4362j718F1729h9795A88741I2041f8343j50772G3662b54295
9423B5455h1525D9256Q2909o4370a62781K1182k1354Q290e3233a6957A31996l1487
9411A00509a82138B18587G4590b5856B1126g3590B28869A09446i36A14882a94128
9399A4265d18257g8797A6537e1895F5070a03639B21738a47188A47561K1658q654
9388A60565c16050B45088a02429b0596k27964B15699c1760q9201D1375a30044
9377b60149i9888p9647B17254G5649d9913k64411A81467c25355M8583j15228d7688
$$ y = [-74148, 143996, 160438, 370217, 99313, -109669, 167423, 145433, -131724, -67442, -93309, 260254, 185081, -53118, -198982, -219714, -114528, -308571, -102213, 189626, -331299, 70629, -181661, 224329, -243212, -158850, -160568, 61729, -89795, 188741, 92041, -68343, -219115, 73662, -254295, 25455, -81525, 49256, 132165, 67795, -162781, -141599, -162953, -154663, -53233, -16957, 131996, 100509, -182138, 218587, 74590, -25856, 21126, -73590, 228869, 109446, -936, 114882, -194128, 14265, -418257, -78797, 16537, -51895, 65070, -103639, 221738, -147188, 147561, 169219, 160565, -316050, 245088, -102429, -20596, -248560, 215699, -31760, -120961, 41375, -130044, -260149, -99888, -179535, 217254, 75649, -49913, -314324, 181467, -325355, -276772, -392000, -47688]
9365b65002C0726J22999k9106E4565j2776d9118B00042F1921L54978a2907C39276
9353b22927A68202C6141b18967C13706b31811C9928f5600D3317J48109b14579
9342h2832B35133a89226g3072j98123J28582F4233B2598a57518B78460d44872
9331d5363A16236b73746d2472j94905J6511D8563a32253j00752L362A5511a3257
9319C6852d0778J4965F3402a39232F2968h371l49003h9338r4445A93632i5290
9307a82874H3282b21792R8842j66578A90035b06626e2874j85552f855k14981j65412
9296c87248a54991B8639b33952I2414b64463d5619A29931h3915C75997a4077j10516
9285a24593o7974A9623R957d5153j16119E0214A0929M6992j2543o900a41500D8009
$$ y = [-265002, 30726, 153725, 124619, 54565, 41789, -49118, 200042, 61921, 416899, -12907, 339276, -222927, 168202, 36141, -218967, 313706, -231811, 39928, -65600, 43317, 191426, -214579, -82832, 235133, -189226, -73072, -271195, -142613, 64233, 22598, -157518, 278460, -444872, -45363, 116236, -273746, -42472, -237377, -220866, 48563, -132253, -233005, -229643, 15511, -13257, 36852, -40778, -25813, 63402, -139232, 62968, -8371, -357374, -89338, -183783, 193632, -95290, -182874, 83282, -221792, -122950, -289528, 190035, -206626, -52874, -238426, -6855, -221836, -387248, -154991, 28639, -233952, 92414, -264463, -45619, 129931, -83915, 375997, -14077, -124593, -192567, 19623, 29580, -45153, -161272, 50214, 10929, 57921, 45378, 38478, -141500, 48009]
9272A16654c18321A30961i2546r5989B0536c30004J25379Q3527c3383l6627H4846
9260c5059k2825j71926q4524A43800e204k71889b1183j5876k44083e9861j08357
9249a68218B79123d44491A36042a90082B42952a16569E8039i2446G9765C5285
9238A81299e3551B05141i1557E8228d557A4764P9512e63j91728c5194A7510R223
9226B6733c79705J52028p9761a01019j88506l59711b558q3045A29569b75486A82527
9214a5006j31301B8808a7976r2948A52028b316A04476D0661J23030d70287a35230
9202a53096C0361N9981c17110G8111d7349C09417b5000A39655J6222b33H0776
9190G0012a17512B6159J64881a6213m4280c028n6196p4554b5329A18275m4013
$$ y = [116654, -318321, 130961, -92546, -188535, 20536, -330004, -204625, -121098, -33383, -70010, 84846, -35059, -57884, -229810, -314334, 143800, -5204, -277093, -21183, -37059, -281142, -59861, -168218, 279123, -444491, 136042, -190082, 242952, -116569, 58039, -92446, 79765, 35285, 181299, -53551, 205141, -91557, 58228, -4557, 14764, 94276, -563, -192291, -35194, 17510, 26733, -379705, -227677, -307438, -101019, -289525, -649236, -2558, -85603, 129569, -275486, 182527, -15006, -146307, 28808, -17976, -110924, 152028, -2316, 104476, 40661, 163691, -470287, -135230, -153096, 30361, 90342, -317110, 78111, -47349, 309417, -25000, 139655, 155877, -233, 80776, 70012, -117512, 26159, 191040, -16213, -60493, -3028, -59224, -133778, -25329, 118275, 74262]
9179G4262c34806E9348a10528p490A0274b35522C6984Q9310Q0183a70830j3792
9168a84622A4504b26726b6259k31263J01295A22295a54506A61102a52301O403
9158a45898k7036m7369C24924C4387a90768l29006D808a56242A07581J76857D1504
9146a55967G9469e944l74905J87849M0610f9384j36438i3467F2883h6695C64100
9134A00159a15252L5324n1152N3412j8249H0528b21930c6954k7924l22773J30533
9123b57118J09067r8347A81684n1328k9938a64198A1419a3205F8735J22505b87739
9111I7768A3252d7826H2227b94415d249A2345a01351A664O534L7227K62107g5198
9098i2830j08932J6761Q6660J4594j24904B0556f388j25093A1956R0642J50315
$$ y = [74262, -334806, 59348, -110528, -118018, 10274, -235522, 36984, 126294, 206477, -170830, -184622, 14504, -226726, -26259, -257522, -156227, 122295, -154506, 161102, -152301, -145898, -172934, -220303, 324924, 34387, -190768, -519774, 4808, -156242, 107581, 284438, 41504, -155967, 79469, -5944, -380849, -193000, -152390, -69384, -205822, -93467, 62883, -86695, 364100, 100159, -115252, -79928, -131080, -77668, -95917, 80528, -221930, -36954, -64878, -387651, -257118, -148051, -246398, 181684, 130356, 100418, -164198, 11419, -13205, 68735, 191240, -287739, 97768, 13252, -47826, 82227, -294415, -4249, 12345, -101351, 1664, 8198, 45425, 307532, -75198, -92830, -201762, -185001, -98341, -83747, -208651, 20556, -6388, -131481, 11956, 102598, 252913]
9087B52913c8945H85b4092c848r4577n6770B1463a99872I8202k4791P30A196g0964
9073c35238B6803g6288E7803b818l25175H5186b08026j790a8066H4659a34869
9061c6897l28742c9296k1472q1801H7946j1977h9515o2515A95197b88199f8823
9049A98018a37508B38823A7194O872J80136a12819M7285J3967r1949m545O2263
9038h5798j56042e2902m90433K13525B006a52626j67469h2306o0285d7018G7470
9026a29813N7524k0425b1390k20261P7735N0404a2620A51527g7512r2472j0587
9015a80571F2119N6977a01128L460k56121O0507l7277g758H5086J08652b38402
9003a02614j73491F5229c5176o5796A59908a76456B67676a54462B84382H3198
$$ y = [252913, -38945, 885, -24092, -3848, -98425, -155195, 21463, -199872, 98202, 73411, 74141, 1196, -70964, -335238, 26803, -76288, 57803, -2818, -327993, 85186, -208026, -209816, -18066, 84659, -134869, -36897, -365639, -39296, -60768, -142569, 87946, 75969, -89515, -152030, 195197, -288199, -68823, 198018, -137508, 238823, 17194, 24066, 204202, -112819, -65534, -51567, -143516, -148061, -85798, -241840, -52902, -543335, -329810, 2006, -152626, -320095, -82306, -142591, -47018, 77470, -129813, -72289, -92714, -21390, -241651, -163916, -113512, -12620, 151527, -77512, -169984, -180571, 62119, 119096, -101128, -97668, -353789, -293282, -330559, -7758, 85086, 193738, -238402, -102614, -276105, 65229, -35176, -100972, 159908, -176456, 267676, -154462, 284382, 83198]
8992F7679b0019k56707h4659k93177A93722q2680d9761l34051N9822J03907B92173
8980i544j67235g0656O047q3235C0399K04821J95661A7274O053e18576A03963
8968b49709g037A81500N807H3867K75409A22528M479C827d1616k03723a9551p8684
8956i8235H133a53024f3280l3917k7169E3722i0888j74299J27974B0169K38639
8945B58808B02b26835A43468b92591J12057B09372C6753O7172f5686n6947A39341
8933a3137D4270a10533j70754A91179c14840B87247b4838l7875A18405D0641J29000
8922A69641K06628K10924J537881M2037p38288F30621k02036E3390h0979B78072
8911E2732A2142a33118a56F3243a15335j1569A03756a37844D7893a65759j1984
$$ y = [67679, -20019, -276726, -84659, -377836, 193722, 111042, -49761, -383812, -323990, -220083, 292173, -9544, -176779, -70656, -64609, -147844, 30399, 235220, 430881, 17274, 23327, -518576, 103963, -249709, -7037, 181500, 187307, 83867, 359276, 122528, 127007, 3827, -41616, -245339, -19551, -98235, 8133, -153024, -63280, -97197, -124366, 53722, -90888, -265187, -137213, 20169, 258808, 202, -226835, 143468, -292591, -180534, 209372, 36753, 103925, -65686, -122633, 139341, -13137, 44270, -110533, -281287, 191179, -314840, 287247, -24838, -62713, 118405, 40641, 169641, 376269, 587193, 2125074, 2167111, 1428823, 630621, 428585, 53390, -80979, 278072, 52732, 12142, -133118, -156, 63243, -115335, -126904, 103756, -137844, 47893, -165759, -177743]
8900a77743r8804B8283b44646e9264A54466a89563q2839q7716d2341A04451H975
8888A43863l0656f1803G1980g5021j80744J20404J0282L9800A02560c38580g5614
8876C8980b90233f0009H2566b264k24721a10505l7476A33861b14324A61032a4267
8864a39650A19078M3656i7608f693r2345a0376B7501c07749a52072L812D16234
8852d2441D7148Q8325c38938J29602N48N0159L6444A2939a20921A75247H5716
8840a97854H3661a34250q8852g6582K4132a8182j12210J8127L7879D0381A5737
$$ y = [-177743, -276547, 28283, -244646, -59264, 154466, -189563, -272402, -360118, -42341, 104451, 8975, 143863, 113207, -61803, 71980, -75021, -255765, -135361, -125079, -85279, 102560, -338580, -75614, 38980, -290233, -60009, 82566, -2264, -226985, -110505, -147981, 133861, -214324, 161032, -14267, -139650, 119078, 162734, -97608, -6693, -99038, -10376, 27501, -307749, -152072, -148260, 416234, -42441, 47148, 135473, -338938, -209336, -208788, -158629, -122185, 12939, -120921, 175247, 85716, -197854, 83661, -134250, -223102, -76582, -52450, -18182, -130392, -112265, -74386, 40381, 15737]
$$ [...]
##END NTUPLES=NMR SPECTRUM
##END=
