
##TITLE=AC1338_BRAAS10081_6642355_dYPn9BTwYD
##JCAMPDX= 6.0         $$ Bruker NMR JCAMP-DX V2.0
##DATA TYPE= NMR SPECTRUM
##DATA CLASS= NTUPLES
##ORIGIN= BRUKER
##OWNER= Administrator
$$ 1.72 TOPSPIN		Version 2.1
$$ 2012-08-08 18:56:56.312 -0500  Administrator@TOPSPIN
$$ Compression mode = diff/dup
##.OBSERVE FREQUENCY= 400.02188249412
##.OBSERVE NUCLEUS= ^1H
##.ACQUISITION MODE= SIMULTANEOUS (DQD)
##.ACQUISITION SCHEME= undefined
##.AVERAGES= 64
##.DIGITISER RES= 22
##SPECTROMETER/DATA SYSTEM= spect
##.PULSE SEQUENCE= noesygpps1d.comp
##.SOLVENT NAME= COFFEE_meoh
##.SHIFT REFERENCE= INTERNAL, COFFEE_meoh, 1, 14.96227
##AUDIT TRAIL= $$ (NUMBER, WHEN, WHO, WHERE, PROCESS, VERSION, WHAT)
$$ ##TITLE= Audit trail, TOPSPIN		Version 2.1
$$ ##JCAMPDX= 5.01
$$ ##ORIGIN= Bruker BioSpin GmbH
$$ ##OWNER= Administrator
$$ $$ C:\Bruker\TOPSPIN/data/COFFEE/nmr/AC1338_BRAAS10081_6642355_dYPn9BTwYD/12/pdata/1/auditp.txt
$$ ##AUDIT TRAIL=  $$ (NUMBER, WHEN, WHO, WHERE, PROCESS, VERSION, WHAT)
(   1,<2012-08-08 18:56:51.218 -0500>,<Administrator>,<TOPSPIN>,<go>,<TOPSPIN 2.1>,
      <created by zg
	started at 2012-08-08 18:45:20.734 -0500,
	POWCHK enabled, PULCHK disabled,
       configuration hash MD5:
       6B 1B 68 BB D9 2E 58 E2 7F 35 AD 54 07 DF 0E 41
       data hash MD5: 64K
       58 19 56 30 88 93 2F AF 84 1A B2 77 D3 AF 6D 0D>)
(   2,<2012-08-08 18:56:54.203 -0500>,<Administrator>,<TOPSPIN>,<proc1d>,<TOPSPIN 2.1>,
      <Start of raw data processing
       efp LB = 0.3 FT_mod = 6 PKNL = 1 PHC0 = 0 PHC1 = 0 SI = 128K 
       data hash MD5: 128K
       F8 06 D3 FC E4 61 20 A4 C1 71 BB 46 5E 9C A2 19>)
(   3,<2012-08-08 18:56:55.281 -0500>,<Administrator>,<TOPSPIN>,<proc1d>,<TOPSPIN 2.1>,
      <pk PHC0 = -2.235718 PHC1 = 0 
       data hash MD5: 128K
       C2 91 8F 9C 0E C1 B4 2B 3A 57 CF 8B 43 16 5D 35>)
(   4,<2012-08-08 18:56:55.953 -0500>,<Administrator>,<TOPSPIN>,<proc1d>,<TOPSPIN 2.1>,
      <abs ABSG = 1 
       data hash MD5: 128K
       0D A9 AC 14 F5 F0 D0 A8 94 57 47 44 C2 7E 3C 97>)
(   5,<2012-08-08 18:56:56.031 -0500>,<Administrator>,<TOPSPIN>,<proc1d>,<TOPSPIN 2.1>,
      <abs ABSG = 2 
       data hash MD5: 128K
       39 27 44 83 42 1C 53 B6 6F 62 D9 88 31 AC F7 43>)
(   6,<2012-08-08 18:56:56.078 -0500>,<Administrator>,<TOPSPIN>,<proc1d>,<TOPSPIN 2.1>,
      <abs ABSG = 3 
       data hash MD5: 128K
       A9 81 1B 3E A4 17 AE AE 3A 9B 83 96 E7 B9 D2 E2>)
(   7,<2012-08-08 18:56:56.156 -0500>,<Administrator>,<TOPSPIN>,<proc1d>,<TOPSPIN 2.1>,
      <abs ABSG = 4 
       data hash MD5: 128K
       33 0B 1E 3D BB 8E C8 09 6F 64 71 4C 1F E8 F9 D3>)
(   8,<2012-08-08 18:56:56.203 -0500>,<Administrator>,<TOPSPIN>,<proc1d>,<TOPSPIN 2.1>,
      <abs ABSG = 5 
       data hash MD5: 128K
       C0 64 BC 8D 0B FD 86 51 3E BD C3 4E 90 21 EF F0>)
$$ ##END=
$$ 
$$ $$ hash MD5
$$ $$ 9D 3A 44 9A E5 D3 B7 CC 65 40 CE F0 6A 3D 2D 47
##$RELAX= 
##$RELAX= 
##$RELAX= 
##$RELAX= 
##$RELAX= 
##$RELAX= 
##$RELAX= 
##$RELAX= 
$$ Bruker specific parameters
$$ [...]
##$TP07= 0
##$TPNAME0= <>
##$TPNAME1= <>
##$TPNAME2= <>
##$TPNAME3= <>
##$TPNAME4= <>
##$TPNAME5= <>
##$TPNAME6= <>
##$TPNAME7= <>
##$TPOAL= (0..7)
0.5 0.5 0.5 0.5 0.5 0.5 0.5 0.5
##$TPOFFS= (0..7)
0 0 0 0 0 0 0 0
##$TUNHIN= 0
##$TUNHOUT= 0
##$TUNXOUT= 0
##$USERA1= <user>
##$USERA2= <user>
##$USERA3= <user>
##$USERA4= <user>
##$USERA5= <user>
##$V9= 5
##$VALIST= <valist>
##$VCLIST= <CCCCCCCCCCCCCCC>
##$VD= 0
##$VDLIST= <DDDDDDDDDDDDDDD>
##$VPLIST= <PPPPPPPPPPPPPPP>
##$VTLIST= <TTTTTTTTTTTTTTT>
##$WBST= 1024
##$WBSW= 4
##$XGAIN= (0..3)
0 0 0 0
##$XL= 0
##$YL= 0
##$YMAX_a= 16099619
##$YMIN_a= -10198962
##$ZGOPTNS= <>
##$ZL1= 120
##$ZL2= 120
##$ZL3= 120
##$ZL4= 120
##$ABSF1= 14.96227
##$ABSF2= -5.595912
##$ABSG= 5
##$ABSL= 3
##$ALPHA= 0
##$AQORDER= 0
##$ASSFAC= 0
##$ASSFACI= 0
##$ASSFACX= 0
##$ASSWID= 0
##$AUNMP= <proc_prof1d_extract.lims>
##$AXLEFT= 0
##$AXNAME= <>
##$AXNUC= <1H>
##$AXRIGHT= 0
##$AXTYPE= 0
##$AXUNIT= <>
##$AZFE= 0.1
##$AZFW= 0.1
##$BCFW= 0
##$BC_mod= 0
##$BYTORDP= 0
##$COROFFS= 0
##$CY= 15
##$DATMOD= 1
##$DC= 0
##$DFILT= <>
##$DTYPP= 0
##$F1P= 0
##$F2P= 0
##$FCOR= 0.5
##$FTSIZE= 131072
##$FT_mod= 6
##$GAMMA= 0
##$GB= 0
##$INTBC= 1
##$INTSCL= 1
##$ISEN= 128
##$LB= 0.3
##$LEV0= 0
##$LPBIN= 0
##$MAXI= 10000
##$MC2= 0
##$MEAN= 0
##$ME_mod= 0
##$MI= 0
##$NCOEF= 0
##$NC_proc= -2
##$NLEV= 6
##$NOISF1= 0
##$NOISF2= 0
##$NSP= 0
##$NTH_PI= 0
##$NZP= 0
##$OFFSET= 14.96227
##$PC= 1
##$PHC0= -2.235718
##$PHC1= 0
##$PH_mod= 1
##$PKNL= yes
##$PPARMOD= 0
##$PPDIAG= 0
##$PPIPTYP= 0
##$PPMPNUM= 2147483647
##$PPRESOL= 1
##$PSCAL= 4
##$PSIGN= 0
##$PYNMP= <proc.py>
##$REVERSE= no
##$SF= 400.020009129408
##$SI= 131072
##$SIGF1= 0
##$SIGF2= 0
##$SINO= 400
##$SIOLD= 131072
##$SPECTYP= <>
##$SREGLST= <1H.CDCl3>
##$SSB= 0
##$STSI= 131072
##$STSR= 0
##$SW_p= 8223.68421052631
##$SYMM= 0
##$S_DEV= 0
##$TDeff= 65536
##$TDoff= 0
##$TI= <>
##$TILT= no
##$TM1= 0
##$TM2= 0
##$TOPLEV= 0
##$USERP1= <user>
##$USERP2= <user>
##$USERP3= <user>
##$USERP4= <user>
##$USERP5= <user>
##$WDW= 1
##$XDIM= 131072
##$YMAX_p= 344099873
##$YMIN_p= -12687
##$CURPLOT= <Network HP LaserJet P1505>
##$CURPRIN= <$Network HP LaserJet P1505>
##$DFORMAT= <normdp>
##$LAYOUT= <+/1D_H.xwp>
##$LFORMAT= <normlp>
##$PFORMAT= <normpl>
##$SURQMSG= 1
$$ End of Bruker specific parameters
$$ ---------------------------------
##NTUPLES= NMR SPECTRUM
##VAR_NAME=  FREQUENCY,     SPECTRUM/REAL,   SPECTRUM/IMAG
##SYMBOL=    X,             R,               I
##VAR_TYPE=  INDEPENDENT,   DEPENDENT,       DEPENDENT
##VAR_FORM=  AFFN,          ASDF,            ASDF
##VAR_DIM=   131072,        131072,          131072
##UNITS=     HZ,            ARBITRARY UNITS, ARBITRARY UNITS
##FACTOR=    0.0627417313425164, 1,          1
##FIRST=     8223.62146879497, 491,          -55075
##LAST=      0,             1741,            -56047
##MIN=       0,             -12687,          0
##MAX=       8223.62146879497, 344099873,    0
$$ Real data points
##PAGE= N=1
##DATA TABLE= (X++(R..R)), XYDATA
$$ [...]
$$ plain form
63258 360604 364224 366974 369533 372932 377296 381924 386349 390784 395599 400972 406959 413331 419433 424883
63244 424883 430381 437092 445228 454057 463314 473652 485377 497804 510479 524205 540007 557662
63232 557662 576079 594806 614360 635225 657224 679805 702382 724392 745553 766136 786623
63221 786623 807031 826911 846060 864916 884105 903790 923548 942807 961253 978713 994681
63210 994681 1008245 1018710 1026023 1030164 1030329 1025477 1015768 1002695 987432 969695 948751 925028 900094
63197 900094 875409 851793 829808 809818 791583 774457 758339 744136 733135 726118 723069 723394
63185 723394 726261 730936 737069 744738 754307 766217 780675 797303 815179 833470 851990 871016
63173 871016 890622 910411 929890 948942 967891 987151 1006739 1026053 1044152 1060299 1074162
$$ packed form
63258C60604L620K750K559L399M364M628M425M435M815N373N987O372O102N450
63244D24883N498O711Q136Q829R257J0338J1725J2427J2675J3726J5802J7655
63232E57662J8417J8727J9554K0865K1999K2581K2577K2010K1161K0583K0487
63221G86623K0408J9880J9149J8856J9189J9685J9758J9259J8446J7460J5968
63210I94681J3564J0465P313M141J65m852r709j3073j5263j7737k0944k3723k4934
63197I00094k4685k3616k1985j9990j8235j7126j6118j4203j1001p017l049L25
63185G23394K867M675O133P669R569J1910J4458J6628J7876J8291J8520J9026
63173H71016J9606J9789J9479J9052J8949J9260J9588J9314J8099J6147J3863
$$ plain form
63162 1074162 1085504 1093866 1098621 1099204 1095258 1086787 1074308 1058622 1040297 1019560 996828 973052
63150 973052 949274 926006 903275 881112 859690 839044 818945 799174 779816 761270 743976
63139 743976 728056 713208 699140 686165 675126 666527 659910 654281 649026 644202 640108 636868 634396
63126 634396 632459 630721 628957 627375 626569 627014 628607 630817 633265 635965 638941 641810 644126 646099 648579
63111 648579 652113 656360 660772 665499 671132 677749 684769 691742 698720 705789 712733 719320 725451 730858
63097 730858 735106 738164 740680 743414 746593 749926 752969 755384 757209 759015 761447 764417 767112 768931
63083 768931 770068 771024 772004 773119 774757 777353 780984 785456 790595 796332 802758 810150 818539 827207 835202
63068 835202 842584 850534 859879 870196 880914 892610 906435 922672 940722 960283 981761 1005576
$$ packed form
63162A074162J1342Q362M755N83l946q471j2479j5686j8325k0737k2732k3776
63150I73052k3778k3268k2731k2163k1422k0646k0099j9771j9358j8546j7294
63139G43976j5920j4848j4068j2975j1039q599o617n629n255m824m094l240k472
63126F34396j937j738j764j582q06M45J593K210K448K700K976K869K316J973K480
63111F48579L534M247M412M727N633O617P020O973O978P069O944O587O131N407
63097G30858M248L058K516K734L179L333L043K415J825J806K432K970K695J819
63083G68931J137R56R80J115J638K596L631M472N139N737O426P392Q389Q668P995
63068H35202P382P950R345J0317J0718J1696J3825J6237J8050J9561K1478K3815
$$ plain form
63056 1005576 1031793 1060445 1091570 1124824 1159675 1196155 1234976 1276726 1321246 1367763 1415292
63045 1415292 1462890 1510058 1557049 1604490 1652617 1701058 1749300 1797018 1843953 1889877 1934810
63034 1934810 1978977 2022425 2064934 2106231 2145931 2183101 2216157 2243457 2264021 2277675 2284582
63023 2284582 2284578 2276901 2260666 2235689 2202691 2162695 2116605 2065604 2011479 1956016 1900273 1844966
63011 1844966 1791390 1741358 1696194 1656326 1621913 1593349 1570893 1554276 1542991 1536869 1536217 1541462
62999 1541462 1552641 1569085 1589678 1613586 1640599 1670522 1702576 1735858 1770164 1805701 1842020
62988 1842020 1877946 1912743 1946629 1979825 2011603 2040705 2066211 2087459 2103455 2113041 2115587 2110977
62976 2110977 2098878 2078554 2049678 2013010 1969945 1921508 1868094 1810224 1749149 1686394 1622874
$$ packed form
63056A005576K6217K8652L1125L3254L4851L6480L8821M1750M4520M6517M7529
63045A415292M7598M7168M6991M7441M8127M8441M8242M7718M6935M5924M4933
63034A934810M4167M3448M2509M1297L9700L7170L3056K7300K0564J3654O907
63023B284582mp677j6235k4977l2998l9996m6090n1001n4125n5463n5743n5307
63011A844966n3576n0032m5164l9868l4413k8564k2456j6617j1285o122o52N245
62999A541462J1179J6444K0593K3908K7013K9923L2054L3282L4306L5537L6319
62988A842020L5926L4797L3886L3196L1778K9102K5506K1248J5996R586K546m610
62976B110977j2099k0324k8876l6668m3065m8437n3414n7870o1075o2755o3520
$$ plain form
62965 1622874 1558932 1495296 1433468 1374738 1319143 1266069 1215818 1169902 1129439 1093710 1060784
62954 1060784 1029426 999977 973483 950403 930366 912816 897412 883772 871243 859268 847851
62943 847851 837319 827664 818531 809945 802557 796761 791856 786586 780481 774263 768849 764300 759842 754664
62929 754664 748566 742010 735719 730152 725234 720563 715772 710707 705419 700161 695214 690434 685068 678375
62915 678375 670469 662296 654675 647613 640603 633371 626095 619131 612760 607174 602439 598305 594197 589673
62901 589673 584926 580664 577339 574674 572203 570091 568932 568698 568347 566746 563717 559877 555800 551706 547752
62886 547752 544135 540844 537609 534249 530946 528149 526186 524925 523859 522702 521858 521986 523029 524092 524478
62871 524478 524474 524832 525825 527135 528390 529437 530344 531460 533170 535213 536626 536940 537123 538651 541672 544755
$$ packed form
62965A622874o3942o3636o1828n8730n5595n3074n0251m5916m0463l5729l2926
62954A060784l1358k9449k6494k3080k0037j7550j5404j3640j2529j1975j1417
62943H47851j0532r655r133q586p388n796m905n270o105o218n414m549m458n178
62929G54664o098o556o291n567m918m671m791n065n288n258m947m780n366o693
62915F78375p906q173p621p062p010p232p276o964o371n586m735m134m108m524
62901E89673m747m262l325k665k471k112j159k34l51j601l029l840m077m094l954
62886E47752l617l291l235l360l303k797j963j261j066j157q44J28J043J063L86
62871E24478mL58R93J310J255J047R07J116J710K043J413L14J83J528L021L083
$$ plain form
62855 544755 546534 547067 547363 548081 548985 549479 549396 549246 549652 550538 551112 550791 549882 549116 548835 548990 549588 550645
62837 550645 551858 552859 553744 554908 556445 558044 559283 559595 558329 555477 552170 549768 548490 547549 546488
62822 546488 545563 544809 543604 541485 538749 535945 533311 530968 529166 527982 527116 526194 524966 523272 521340
62807 521340 520117 520627 522817 525639 528417 531452 535143 539336 543949 549474 556257 563941 572247 581760
62793 581760 593234 606511 620815 635863 652033 669675 688916 710007 733291 758847 786704
62782 786704 817331 851458 889369 930776 975376 1023180 1074352 1129073 1187522 1249652 1314929
62771 1314929 1382567 1451904 1522216 1592203 1660081 1724269 1783658 1837175 1883413 1920932 1948691
62760 1948691 1966001 1972206 1966737 1949548 1921344 1883318 1836766 1783013 1723534 1659769 1592733 1523133
$$ packed form
62855E44755J779N33K96P18R04M94q3j50M06Q86N74l21r09p66k81J55N98J057
62837E50645J213J001Q85J164J537J599J239L12j266k852l307k402j278r41j061
62822E46488r25p54j205k119k736k804k634k343j802j184q66r22j228j694j932
62807E21340j223N10K190K822K778L035L691M193M613N525O783P684Q306R513
62793E81760J1474J3277J4304J5048J6170J7642J9241K1091K3284K5556K7857
62782G86704L0627L4127L7911M1407M4600M7804N1172N4721N8449O2130O5277
62771A314929O7638O9337P0312O9987O7878O4188N9389N3517M6238L7519K7759
62760A948691J7310O205n469j7189k8204l8026m6552n3753n9479o3765o7036o9600
$$ plain form
62748 1523133 1452086 1381422 1312868 1247059 1183711 1122616 1064078 1008566 956512 908482 864903
62737 864903 825507 789548 756709 727192 700750 676339 653174 631561 612190 595133 580104
62726 580104 567223 556707 547999 540027 532367 525566 520232 516307 513366 511163 509701 509088 509573 511536
62712 511536 515262 520815 528121 537036 547370 559091 572541 588250 606502 627238 650390 676109
62700 676109 704622 736048 770401 807646 847732 890745 937097 987379 1041815 1099869 1160476
62689 1160476 1222621 1285537 1348326 1409578 1467554 1520711 1567863 1607852 1639368 1661277 1672978
62678 1672978 1674272 1665089 1645549 1616159 1577758 1531432 1478698 1421531 1361723 1300183 1237186 1173281
62666 1173281 1109673 1047764 988640 932973 881006 832557 787339 745319 706557 670807 637696
$$ packed form
62748A523133p1047p0664o8554o5809o3348o1095n8538n5512n2054m8030m3579
62737H64903l9396l5959l2839k9517k6442k4411k3165k1613j9371j7057j5029
62726E80104j2881j0516q708p972p660o801n334l925k941k203j462o13M85J963
62712E11536L726N553P306Q915J0334J1721J3450J5709J8252K0736K3152K5719
62700F76109K8513L1426L4353L7245M0086M3013M6352N0282N4436N8054O0607
62689A160476O2145O2916O2789O1252N7976N3157M7152L9989L1516K1909J1701
62678A672978J294r183j9540k9390l8401m6326n2734n7167n9808o1540o2997o3905
62666A173281o3608o1909n9124n5667n1967m8449m5218m2020l8762l5750l3111
$$ plain form
62655 637696 607230 579669 554892 532384 511861 493416 476961 462040 448323 435793 424291
62644 424291 413407 403024 393464 384887 377031 369776 363419 358046 353144 348167 343109 338231 333713 329864
62630 329864 327055 325015 322722 319586 316290 313890 312497 311473 310561 310024 309878 309773 309652 309956 311030 312800
62614 312800 315127 318052 321544 325281 328852 332150 335626 340205 346686 354998 364203 373425 382584 392117
62600 392117 402363 413545 426040 440246 456305 474250 494189 516121 539819 565211 592633
62589 592633 622394 654346 688146 723550 760028 796428 831543 864753 895624 923133 945920
62578 945920 963237 975171 981931 983393 979339 969803 955109 935840 912698 886217 856778 825070
62566 825070 792255 759431 727208 696038 666489 638782 612512 587399 563915 542563 522856
$$ packed form
62655F37696l0466k7561k4777k2508k0523j8445j6455j4921j3717j2530j1502
62644D24291j0884j0383r560q577p856p255o357n373m902m977n058m878m518l849
62630C29864k809k040k293l136l296k400j393j024r12n37j46j05j21L04J074J770
62614C12800K327K925L492L737L571L298L476M579O481Q312R205R222R159R533
62600C92117J0246J1182J2495J4206J6059J7945J9939K1932K3698K5392K7422
62589E92633K9761L1952L3800L5404L6478L6400L5115L3210L0871K7509K2787
62578I45920J7317J1934O760J462m054r536j4694j9269k3142k6481k9439l1708
62566H25070l2815l2824l2223l1170k9549k7707k6270k5113k3484k1352j9707
$$ plain form
62555 522856 503785 485137 467686 452159 438676 427055 416913 407409 397693 387826 378769 371262
62543 371262 365170 359895 354878 349607 343822 338042 333395 330574 329225 328611 328525 329291 331070 333519 336188
62528 336188 339108 342853 347886 353903 360165 366550 373822 382601 392561 403219 415043 429029 445341
62515 445341 463177 482024 502351 524824 549420 575614 603109 632129 663142 696367 731371
62504 731371 767112 802453 836516 868501 897554 923033 944498 961088 971449 974848 971910 963696
62492 963696 950516 932364 910002 884582 856553 825997 793973 762310 731922 702366 673261
62481 673261 645243 619227 595558 574174 554844 537003 520131 504541 490985 479363 468736
62470 468736 458853 450576 444374 439480 435161 431750 429611 428053 426292 424820 424718 426083 428087 430299
$$ packed form
62555E22856j9071j8648j7451j5527j3483j1621j0142r504r716r867r057p507
62543C71262o092n275n017n271n785n780m647k821j349o14q6P66J779K449K669
62528C36188K920L745N033O017O262O385P272Q779R960J0658J1824J3986J6312
62515D45341J7836J8847K0327K2473K4596K6194K7495K9020L1013L3225L5004
62504G31371L5741L5341L4063L1985K9053K5479K1465J6590J0361L399k938q214
62492I63696j3180j8152k2362k5420k8029l0556l2024l1663l0388k9556k9105
62481F73261k8018k6016k3669k1384j9330j7841j6872j5590j3556j1622j0627
62470D68736r883q277o202m894m319l411k139j558j761j472j02J365K004K212
$$ plain form
62456 430299 432946 436088 439441 442960 446882 451200 455759 460808 466773 473433 479868 485262 489349 492138
62442 492138 493696 494176 493581 491455 487284 481263 474284 467047 459488 451093 441565 431202 420874 411561
62428 411561 403588 396332 388967 381530 374978 370224 367375 365978 365707 366578 368595 371394 374425 377570 381450
62413 381450 386881 393953 401854 409701 417375 425451 434469 444427 454838 465179 475304 485388 495364
62400 495364 504575 512281 518381 523273 527026 529219 529650 528737 527013 524618 521461 517507 512758 507390 502040
62385 502040 497517 493991 490916 487952 485506 484175 484251 486039 490053 496436 504733 514726 527002 542174
62371 542174 560098 580452 603602 630117 659791 692015 726920 765335 807575 852938 900420
62360 900420 949274 998733 1047798 1095462 1140743 1182330 1218589 1248196 1270603 1285894 1294410 1296532
$$ packed form
62456D30299K647L142L353L519L922M318M559N049N965O660O435N394M087K789
62442D92138J558M80n95k126m171o021o979p237p559q395r528j0363j0328r313
62428D11561p973p256p365p437o552m754k849j397k71Q71K017K799L031L145L880
62413C81450N431P072P901P847P674Q076R018R958J0411J0341J0125J0084R976
62400D95364R211P706O100M892L753K193M31r13j724k395l157l954m749n368n350
62385E02040m523l526l075k964k446j331P6J788M014O383Q297R993J2276J5172
62371E42174J7924K0354K3150K6515K9674L2224L4905L8415M2240M5363M7482
62360I00420M8854M9459M9065M7664M5281M1587L6259K9607K2407J5291Q516K122
$$ plain form
62348 1296532 1292594 1282943 1268052 1248378 1223949 1194480 1160235 1122569 1083256 1043476 1003765 964611
62336 964611 926539 889805 854592 821475 791104 763391 737494 712769 689388 667964 648840
62325 648840 631912 616915 603866 593190 585196 579321 574336 569634 565891 563972 563582 563612 563399 562873
62311 562873 561744 559594 556796 554296 552156 549184 544440 538413 532188 526075 519659 512835 506128 500147
62297 500147 495127 490924 487150 483422 479754 476637 474589 473749 473993 475186 477190 479873 483323 487838 493539
62282 493539 500166 507420 515223 523526 532126 540881 549876 559192 568799 578964 590451 603896 619066
62269 619066 635081 651371 668197 686335 706569 729497 755439 784242 815295 848025 882478
62258 882478 919185 958224 998439 1037836 1074794 1108574 1138588 1163738 1183040 1196533 1204843 1207910
$$ packed form
62348A296532l938r651j4891j9674k4429k9469l4245l7666l9313l9780l9711l9154
62336I64611l8072l6734l5213l3117l0371k7713k5897k4725k3381k1424j9124
62325F48840j6928j4997j3049j0676p994n875m985m702l743j919l90L0k13n26
62311E62873j129k150k798k500k140k972m744o027o225o113o416o824o707n981
62297E00147n020m203l774l728l668l117k048q40K44J193K004K683L450M515N701
62282D93539O627P254P803Q303Q600Q755Q995R316R607J0165J1487J3445J5170
62269F19066J6015J6290J6826J8138K0234K2928K5942K8803L1053L2730L4453
62258H82478L6707L9039M0215L9397L6958L3780L0014K5150J9302J3493Q310L067
$$ plain form
62246 1207910 1204879 1195359 1180065 1159882 1134992 1105495 1072375 1037199 1001066 964411 927700 891764
62234 891764 857496 825615 796670 770794 747457 725930 706095 688474 673398 660550 649349
62223 649349 639343 630089 621166 612754 605899 601628 599733 598746 597218 594851 592362 590537 589679 589855 591262
62208 591262 594072 598031 602580 607492 613142 619954 627781 636150 645006 654775 665658 677289 689363
62195 689363 702250 716614 732575 749598 767181 785321 804265 824045 844335 864578 884162
62184 884162 902697 920149 936526 951392 964065 974541 984010 994078 1005481 1017828 1030609 1044182
62172 1044182 1059619 1077752 1098564 1121439 1145828 1171623 1198946 1227635 1256898 1285426 1311860
62161 1311860 1335272 1355301 1371891 1384928 1394190 1399602 1401345 1399591 1394306 1385542 1373773 1359664
$$ packed form
62246A207910l031r520j5294k0183k4890k9497l3120l5176l6133l6655l6711l5936
62234H91764l4268l1881k8945k5876k3337k1527j9835j7621j5076j2848j1201
62223F49349j0006r254q923q412o855m271j895r87j528k367k489j825q58J76J407
62208E91262K810L959M549M912N650O812P827Q369Q856R769J0883J1631J2074
62195F89363J2887J4364J5961J7023J7583J8140J8944J9780K0290K0243J9584
62184H84162J8535J7452J6377J4866J2673J0476R469J0068J1403J2347J2781J3573
62172A044182J5437J8133K0812K2875K4389K5795K7323K8689K9263K8528K6434
62161A311860K3412K0029J6590J3037R262N412J743j754n285q764j1769j4109
$$ plain form
62149 1359664 1343569 1325615 1306231 1286187 1266031 1245993 1226610 1208885 1193356 1179376 1165879
62138 1165879 1152663 1140503 1130120 1121552 1114337 1107881 1101681 1095750 1090862 1087901 1086934 1087302 1088586 1090958
62124 1090958 1094499 1098766 1103318 1108349 1114541 1122583 1132886 1145404 1159530 1174475 1189876 1205805
62112 1205805 1222201 1238837 1255970 1274428 1294684 1316235 1338341 1361054 1385127 1411028 1438430
62101 1438430 1466571 1495020 1524220 1555450 1589983 1628074 1668875 1711274 1754453 1797663 1840108
62090 1840108 1881545 1922646 1964405 2007324 2051403 2096544 2142584 2189137 2235685 2281642 2326166
62079 2326166 2368311 2407686 2444766 2480321 2514889 2548940 2583056 2617508 2652063 2686613 2721628
62068 2721628 2757547 2794134 2830922 2867939 2905376 2942752 2978990 3013195 3044960 3074220 3101336
$$ packed form
62149A359664j6095j7954j9384k0044k0156k0038j9383j7725j5529j3980j3497
62138A165879j3216j2160j0383q568p215o456o200n931m888k961r67L68J284K372
62124A090958L541M267M552N031O192Q042J0303J2518J4126J4945J5401J5929
62112A205805J6396J6636J7133J8458K0256K1551K2106K2713K4073K5901K7402
62101A438430K8141K8449K9200L1230L4533L8091M0801M2399M3179M3210M2445
62090A840108M1437M1101M1759M2919M4079M5141M6040M6553M6548M5957M4524
62079B326166M2145L9375L7080L5555L4568L4051L4116L4452L4555L4550L5015
62068B721628L5919L6587L6788L7017L7437L7376L6238L4205L1765K9260K7116
$$ plain form
62057 3101336 3127050 3151781 3175136 3196631 3216515 3235171 3252004 3265869 3276690 3285870 3294937 3304468
62045 3304468 3314418 3324756 3335368 3345847 3355835 3365387 3374814 3384399 3394271 3404265 3413815 3422318 3429628
62032 3429628 3436006 3441661 3446623 3450854 3453990 3455141 3453484 3449033 3442359 3433703 3423040 3410929 3398545
62019 3398545 3386647 3375114 3363569 3351832 3339640 3326756 3313744 3301994 3292555 3285393 3280155 3277070
62007 3277070 3276581 3278585 3282694 3288996 3298021 3309964 3324286 3340015 3356222 3372250 3387651 3401867
61995 3401867 3414051 3423441 3429856 3433462 3434189 3431871 3426969 3420438 3412672 3403232 3391889 3379247 3365897
61982 3365897 3351585 3335800 3318646 3300522 3281361 3260860 3239095 3216273 3192175 3166655 3140439
61971 3140439 3114593 3089148 3063036 3035546 3007195 2978941 2951059 2923169 2895010 2866893 2839538
$$ packed form
62057C101336K5714K4731K3355K1495J9884J8656J6833J3865J0821R180R067R531
62045C304468R950J0338J0612J0479R988R552R427R585R872R994R550Q503P310
62032C429628O378N655M962M231L136J151j657m451o674q656j0663j2111j2384
62019C398545j1898j1533j1545j1737j2192j2884j3012j1750r439p162n238l085
62007C277070m89K004M109O302R025J1943J4322J5729J6207J6028J5401J4216
61995C401867J2184R390O415L606P27k318m902o531p766r440j1343j2642j3350
61982C365897j4312j5785j7154j8124j9161k0501k1765k2822k4098k5520k6216
61971C140439k5846k5445k6112k7490k8351k8254k7882k7890k8159k8117k7355
$$ plain form
61960 2839538 2813538 2788784 2764391 2739527 2714354 2689947 2667298 2646756 2628331 2611948 2597247
61949 2597247 2583659 2571073 2560097 2551357 2544860 2540377 2538103 2538340 2540639 2543858 2547187 2550820 2555518
61936 2555518 2561875 2570169 2580589 2593274 2608181 2625078 2643603 2663293 2683887 2705818 2730204 2758074
61924 2758074 2789709 2825108 2864987 2910885 2964260 3025901 3096445 3177035 3269130 3373940 3492419
61913 3492419 3625690 3775120 3942045 4127809 4334215 4563735 4819204 5103459 5419381
61904 5419381 5770114 6158970 6588694 7060185 7571132 8114997 8680263 9249745 9800360
61895 9800360 10304483 10733332 11061366 11270030 11349936 11301267 11132513 10857959 10494830 10060923
61885 10060923 9573092 9046827 8496786 7937240 7381351 6839796 6320479 5829651 5372581
$$ packed form
61960B839538k6000k4754k4393k4864k5173k4407k2649k0542j8425j6383j4701
61949B597247j3588j2586j0976q740o497m483k274K37K299L219L329L633M698
61936B555518O357Q294J0420J2685J4907J6897J8525J9690K0594K1931K4386K7870
61924B758074L1635L5399L9879M5898N3375O1641P0544Q0590R2095J04810J18479
61913C492419J33271J49430J66925J85764K06406K29520K55469K84255L15922
61904E419381L50733L88856M29724M71491N10947N43865N65266N69482N50615
61895I800360N04123M28849L28034K08664P9906m8669j68754k74554l63129m33907
61885A0060923m87831n26265n50041n59546n55889n41555n19317m90828m57070
$$ plain form
61876 5372581 4952733 4570951 4226130 3916426 3639468 3392162 3171378 2974803 2800545
61867 2800545 2646207 2509180 2387663 2280510 2186167 2102668 2028757 1964007 1907642 1858176
61857 1858176 1814583 1776906 1745189 1718538 1695800 1676534 1660684 1647858 1637602 1629915 1624676 1620795
61845 1620795 1616646 1611409 1605534 1599945 1595157 1591067 1587123 1582701 1577632 1572557 1568595 1566638 1566885 1568828
61831 1568828 1571630 1574747 1578283 1582473 1586833 1590250 1592115 1592876 1593147 1592736 1591059 1588194 1584942 1581992 1579506
61816 1579506 1577545 1576487 1576928 1579376 1584084 1591031 1600101 1611450 1625630 1643323 1665032 1691090 1721689
61803 1721689 1756783 1796246 1840340 1889789 1945207 2006688 2074206 2148150 2229197 2317951 2415159
61792 2415159 2522110 2640376 2771153 2915142 3073168 3246698 3437767 3648536 3880895
$$ packed form
61876E372581m19848l81782l44821l09704k76958k47306k20784j96575j74258
61867B800545j54338j37027j21517j07153r4343q3499p3911o4750n6365m9466
61857A858176m3593l7677l1717k6651k2738j9266j5850j2826j0256p687n239l881
61845A620795m149n237n875n589m788m090l944m422n069n075l962j957K47J943
61831A568828K802L117L536M190M360L417J865P61K71m11j677k865l252k950k486
61816A579506j961j058M41K448M708O947R070J1349J4180J7693K1709K6058L0599
61803A721689L5094L9463M4094M9449N5418O1481O7518P3944Q1047Q8754R7208
61792B415159J06951J18266J30777J43989J58026J73530J91069K10769K32359
$$ plain form
61783 3880895 4136369 4416518 4723679 5061357 5433780 5845150 6299426 6800792 7354177
61774 7354177 7965254 8639738 9382315 10195727 11080019 12031117 13038273 14081357 15129794
61765 15129794 16143562 17075590 17875763 18497415 18905217 19080842 19023850 18748714 18280428
61756 18280428 17649876 16889364 16029654 15099492 14126395 13136434 12152691 11194078 10275495
61747 10275495 9408551 8601718 7859912 7184324 6573095 6022724 5529337 5088998 4697295
61738 4697295 4349175 4039472 3763469 3517073 3296902 3100368 2925290 2769165 2629175
61729 2629175 2503147 2390103 2289458 2199977 2119834 2047354 1981193 1920068 1862940 1809488 1759965
61718 1759965 1714487 1672644 1633754 1597246 1562870 1530826 1501643 1475676 1452664 1431841 1412376
$$ packed form
61783C880895K55474K80149L07161L37678L72423M11370M54276N01366N53385
61774G354177O11077O74484P42577Q13412Q84292R51098J007156J043084J048437
61765A5129794J013768R32028Q00173O21652M07802J75625n6992k75136m68286
61756A8280428o30552p60512q59710r30162r73097r89961r83743r58613r18583
61747A0275495q66944q06833p41806o75588o11229n50371m93387m40339l91703
61738D697295l48120l09703k76003k46396k20171j96534j75078j56125j39990
61729B629175j26028j13044j00645q9481q0143p2480o6161o1125n7128n3452m9523
61718A759965m5478m1843l8890l6508l4376l2044k9183k5967k3012k0823j9465
$$ plain form
61707 1412376 1393624 1375228 1357215 1339885 1323393 1307548 1292056 1276718 1261271 1245303 1228556
61696 1228556 1211163 1193526 1176186 1159762 1144515 1129892 1114997 1099695 1084679 1070238 1055754
61685 1055754 1040916 1026714 1014426 1004063 994596 985423 976769 968853 961519 954746 948823 943937 940100
61672 940100 937518 936406 936361 936426 935937 934981 933944 933041 932358 931969 931814 931662 931257 930454 929305 928171 927469 927049
61654 927049 926122 924149 921527 918995 916652 914075 911135 908137 905276 902516 899875 897346 894669 891705
61640 891705 888883 886676 884875 882998 881320 880694 881379 882854 884867 887903 892374 898023 904479 911779 919922
61625 919922 928379 936453 943866 950703 956963 962356 966418 968849 969886 970214 970116 968940 965928 961387 956343
61610 956343 951114 945075 937944 930472 923499 917047 910779 904637 898491 891734 883903 875421 867142 859389
$$ packed form
61707A412376j8752j8396j8013j7330j6492j5845j5492j5338j5447j5968j6747
61696A228556j7393j7637j7340j6424j5247j4623j4895j5302j5016j4441j4484
61685A055754j4838j4202j2288j0363r467r173q654p916p334o773n923m886l837
61672I40100k582j112m5O5m89r56j037r03o83l89j55j52m05q03j149j134p02m20
61654I27049r27j973k622k532k343k577k940k998k861k760k641k529k677k964
61640H91705k822k207j801j877j678o26O85J475K013L036M471N649O456P300Q143
61625I19922Q457Q074P413O837O260N393M062K431J037L28r8j176l012m541n044
61610I56343n229o039p131p472o973o452o268o142o146o757p831q482q279p753
$$ plain form
61596 859389 851892 844504 837453 830929 824814 818893 813127 807741 803154 799729 797532 796468 796709 798746
61582 798746 802853 808715 815783 823809 832926 843345 855178 868485 883393 900159 919045 940015
61570 940015 962661 986610 1011837 1038315 1065607 1093189 1121003 1149114 1176964 1203712 1229362
61559 1229362 1254810 1280479 1305590 1329167 1351156 1372044 1391873 1410296 1427283 1443111 1457711
61548 1457711 1470566 1481330 1490165 1497295 1502419 1504698 1503334 1498214 1489975 1479345 1466571 1451718 1435399
61535 1435399 1418746 1402580 1387063 1372280 1358682 1346660 1336086 1326598 1318077 1310602 1304374 1300031
61523 1300031 1298738 1301509 1308588 1319751 1334946 1354300 1377874 1405996 1439624 1479819 1526816 1580140
61511 1580140 1639691 1706217 1780623 1863353 1954825 2056032 2168193 2291902 2427086 2573944
$$ packed form
61596H59389p497p388p051o524o115n921n766n386m587l425k197j064K41K037
61582G98746M107N862P068Q026R117J0419J1833J3307J4908J6766J8886K0970
61570I40015K2646K3949K5227K6478K7292K7582K7814K8111K7850K6748K5650
61559A229362K5448K5669K5111K3577K1989K0888J9829J8423J6987J5828J4600
61548A457711J2855J0764Q835P130N124K279j364n120q239j0630j2774j4853j6319
61535A435399j6653j6166j5517j4783j3598j2022j0574r488q521p475o228m343
61523A300031j293K771P079J1163J5195J9354K3574K8122L3628M0195M6997N3324
61511A580140N9551O6526P4406Q2730R1472J01207J12161J23709J35184J46858
$$ plain form
61501 2573944 2733491 2906821 3093812 3292656 3500279 3712588 3924111 4127910 4316515
61492 4316515 4483244 4622810 4731185 4805630 4845059 4850261 4823603 4768460 4688623 4587869 4469923
61481 4469923 4338821 4199082 4055243 3911299 3770580 3635796 3508840 3390805 3282666
61472 3282666 3185782 3101337 3029466 2969456 2920668 2882761 2855175 2837122 2828133 2827959 2835825 2850459
61460 2850459 2871046 2897508 2929516 2965772 3004621 3044877 3085698 3126223 3165987 3205423 3245399
61449 3245399 3286241 3327513 3368674 3409671 3450872 3492557 3534501 3576131 3617134 3657783 3698464
61438 3698464 3739111 3779380 3818995 3857325 3892908 3924209 3950843 3973202 3990895 4002608 4007744
61427 4007744 4007114 4001360 3989682 3970983 3945675 3915390 3881406 3844220 3804462 3763383 3722476 3683216
$$ packed form
61501B573944J59547J73330J86991J98844K07623K12309K11523K03799J88605
61492D316515J66729J39566J08375P4445L9429N202k6658n5143p9837j00754j17946
61481D469923j31102j39739j43839j43944j40719j34784j26956j18035j08139
61472C282666r6884q4445p1871o0010m8788l7907k7586j8053q989j74P866J4634
61460B850459K0587K6462L2008L6256L8849M0256M0821M0525L9764L9436L9976
61449C245399M0842M1272M1161M0997M1201M1685M1944M1630M1003M0649M0681
61438C698464M0647M0269L9615L8330L5583L1301K6634K2359J7693J1713N136
61427D007744o30n754j1678j8699k5308l0285l3984l7186l9758m1079m0907l9260
$$ plain form
61415 3683216 3646909 3614163 3584652 3558017 3534909 3516488 3503039 3493700 3487484 3483884 3482418 3482208
61403 3482208 3482285 3481936 3480651 3478066 3473995 3468279 3460746 3451818 3443045 3436489 3433478 3434450 3440071 3451895 3471707
61388 3471707 3500705 3539724 3589897 3652696 3729427 3820959 3927853 4050570 4189664 4345798
61378 4345798 4519309 4709401 4913779 5129126 5351734 5577322 5800321 6013742 6210061
61369 6210061 6382346 6524873 6633428 6705774 6741810 6742800 6710173 6645271 6550148 6427914 6281867
61358 6281867 6114770 5929567 5730427 5522197 5308787 5092720 4876294 4662398 4453885
61349 4453885 4252760 4060377 3877972 3706599 3546893 3399286 3264237 3142018 3032568
61340 3032568 2935781 2851666 2780019 2720288 2671942 2634586 2607518 2589653 2580247 2579200 2586281 2600476
$$ packed form
61415C683216l6307l2746k9511k6635k3108j8421j3449r339o216l600j466k10
61403C482208P7l49j285k585m071n716p533q928q773o556l011R72N621J1824J9812
61388C471707K8998L9019N0173O2799P6731R1532J06894J22717J39094J56134
61378D345798J73511J90092K04378K15347K22608K25588K22999K13421J96319
61369F210061J72285J42527J08555P2346L6036R90l2627o4902r5123j22234j46047
61358F281867j67097j85203j99140k08230k13410k16067k16426k13896k08513
61349D453885k01125j92383j82405j71373j59706j47607j35049j22219j09450
61340C032568r6787q4115p1647n9731m8346l7356k7068j7865r406j047P081J4195
$$ plain form
61328 2600476 2620565 2645917 2676130 2710249 2747017 2785744 2826263 2868004 2909709 2950211 2989085
61317 2989085 3026404 3062167 3096170 3128230 3158361 3186588 3212573 3235560 3254890 3270465 3282347
61306 3282347 3290066 3292972 3291370 3286557 3279317 3268970 3254398 3235399 3212431 3185575 3154620 3119937
61294 3119937 3082467 3042895 3001489 2958701 2915275 2871738 2828334 2785501 2743943 2704222 2666754
61283 2666754 2632254 2601681 2575637 2554122 2536861 2523481 2513376 2505850 2500435 2496792 2494347 2492415
61271 2492415 2490660 2489021 2487217 2484722 2481268 2476984 2471967 2466115 2459406 2452038 2444310 2436803 2430694 2427453
61257 2427453 2428139 2433359 2443984 2461399 2486817 2520753 2563439 2615418 2677379 2749521 2831291 2921486
61245 2921486 3018270 3119130 3221069 3320882 3415067 3499411 3568927 3618655 3645004 3646592 3623936
$$ packed form
61328B600476K0089K5352L0213L4119L6768L8727M0519M1741M1705M0502L8874
61317B989085L7319L5763L4003L2060L0131K8227K5985K2987J9330J5575J1882
61306C282347P719K906j602m813p240j0347j4572j8999k2968k6856l0955l4683
61294C119937l7470l9572m1406m2788m3426m3537m3404m2833m1558l9721l7468
61283B666754l4500l0573k6044k1515j7261j3380j0105p526n415l643k445j932
61271B492415j755j639j804k495l454m284n017n852o709p368p728p507o109l241
61257B427453O86N220J0625J7415K5418L3936M2686N1979O1961P2142Q1770R0195
61245B921486R6784J00860J01939R9813R4185Q4344O9516M9728K6349J588k2656
$$ plain form
61234 3623936 3578508 3512256 3427837 3328770 3218855 3101408 2979070 2854137 2728865 2605506
61224 2605506 2486183 2372620 2265877 2166387 2074292 1989688 1912621 1843052 1780809 1725369 1675822
61213 1675822 1631484 1592548 1559712 1533051 1511691 1494718 1481953 1473698 1470189 1471508 1477527 1487585
61201 1487585 1500605 1515675 1532091 1548769 1564296 1577906 1589818 1600323 1609243 1616582 1622811 1627925
61189 1627925 1630974 1631252 1629252 1625689 1620347 1612757 1603313 1592684 1580669 1566722 1551118 1534488 1516638
61176 1516638 1497087 1476466 1456034 1435967 1415391 1394023 1372361 1350254 1326819 1302153 1277733
61165 1277733 1254580 1232265 1210278 1189076 1168996 1149328 1129488 1110236 1092629 1076337 1059969
61154 1059969 1042601 1024114 1004497 983805 962612 941544 920374 898344 875462 852828 831545
$$ packed form
61234C623936m5428o6252q4419r9067j09915j17447j22338j24933j25272j23359
61224B605506j19323j13563j06743r9490r2095q4604p7067o9569o2243n5440m9547
61213A675822m4338l8936l2836k6661k1360j6973j2765q255l509J319O019J0058
61201A487585J3020J5070J6416J6678J5527J3610J1912J0505Q920P339O229N114
61189A627925L049K78k000l563n342p590r444j0629j2015j3947j5604j6630j7850
61176A516638j9551k0621k0432k0067k0576k1368k1662k2107k3435k4666k4420
61165A277733k3153k2315k1987k1202k0080j9668j9840j9252j7607j6292j6368
61154A059969j7368j8487j9617k0692k1193k1068k1170k2030k2882k2634k1283
$$ plain form
61143 831545 811856 793580 776940 762487 750333 739823 730200 721461 714226 708719 704384 700852 698881
61130 698881 699554 702689 706905 711357 716599 723392 731414 739746 748126 757105 767254 778765 791586 805448
61116 805448 819858 834522 849682 865697 882365 898972 914947 930101 944217 956754 967102
61105 967102 974977 980456 983726 984950 984381 982412 979329 975022 969191 961837 953355 944088 934150 923891
61091 923891 914070 905118 896476 887130 876696 865580 854280 842996 831814 820806 809974 799434
61079 799434 789469 780049 770593 760744 751033 742130 733760 725286 717126 710528 705814 701961 698254 695327
61065 695327 693953 693702 693569 693324 693426 693964 694453 694579 694475 694327 694160 694073 694337 695122 696335 697792 699470 701583
61047 701583 704388 707827 711471 714927 718297 722120 726945 733115 740688 749284 758228 767227 776811 787747
$$ packed form
61143H31545j9689j8276j6640j4453j2154j0510r623q739p235n507m335l532j971
61130F98881O73L135M216M452N242O793Q022Q332Q380Q979J0149J1511J2821J3862
61116H05448J4410J4664J5160J6015J6668J6607J5975J5154J4116J2537J0348
61105I67102P875N479L270J224n69j969l083m307n831p354q482r267r938j0259
61091I23891r821q952q642r346j0434j1116j1300j1284j1182j1008j0832j0540
61079G99434r965r420r456r849r711q903q370q474q160o598m714l853l707k927
61065F95327j374k51j33k45J02N38M89J26j04j48j67q7K64P85J213J457J678K113
61047G01583K805L439L644L456L370L823M825O170P573Q596Q944Q999R584J0936
$$ plain form
61033 787747 800104 813239 826518 839729 852987 866695 881357 896957 912737 928070 943308
61022 943308 959240 976015 993240 1010837 1029069 1047968 1067500 1088088 1110200 1133599 1157856
61011 1157856 1183377 1211121 1241542 1274752 1311426 1352363 1397343 1445573 1497141 1552804 1612571
61000 1612571 1676103 1744663 1821192 1908220 2007186 2119980 2249335 2396945 2562670 2746269
60990 2746269 2948629 3170954 3414673 3683271 3982973 4321058 4705222 5145220 5653042
60981 5653042 6240665 6920584 7710719 8636895 9729171 11018309 12534082 14290814 16250413
60972 16250413 18287967 20205842 21808536 22990427 23771808 24266576 24621183 24968036 25396875
60963 25396875 25925390 26473236 26872271 26930722 26519790 25625825 24339641 22803267 21153909
$$ packed form
61033G87747J2357J3135J3279J3211J3258J3708J4662J5600J5780J5333J5238
61022I43308J5932J6775J7225J7597J8232J8899J9532K0588K2112K3399K4257
61011A157856K5521K7744L0421L3210L6674M0937M4980M8230N1568N5663N9767
61000A612571O3532O8560P6529Q7028R8966J12794J29355J47610J65725J83599
60990B746269K02360K22325K43719K68598K99702L38085L84164M39998N07822
60981E653042N87623O79919P90135R26176J092276J289138J515773J756732J959599
60972A6250413K037554J917875J602694J181891P81381M94768L54607L46853M28839
60963B5396875N28515N47846L99035N8451m10932q93965j286184j536374j649358
$$ plain form
60954 21153909 19489416 17859204 16276135 14739673 13255124 11838162 10508505 9284131
60946 9284131 8179909 7206045 6364632 5648486 5044146 4535610 4106375 3741199 3428020
60937 3428020 3157925 2923224 2716681 2532775 2368239 2220731 2087974 1968367 1861022
60928 1861022 1764414 1675960 1593533 1516536 1444874 1377693 1313798 1252763 1195017 1141237 1091906
60917 1091906 1047014 1005948 968041 933212 901555 872487 845196 819856 797436 778128 760908
60906 760908 744826 729822 716046 703316 691638 681395 672581 664574 657005 650206 644535 640000 636693
60893 636693 634789 633873 633175 632805 633815 636659 640460 644261 648053 652119 656311 660633 665643 671447 677034
60878 677034 681395 684743 687883 690947 693526 695548 697150 697981 697380 695110 691430 686723 681512 676453 671673
$$ packed form
60954B1153909j664493j630212j583069j536462j484549j416962j329657j224374
60946I284131j104222r73864q41413p16146o04340n08536m29235l65176l13179
60937C428020k70095k34701k06543j83906j64536j47508j32757j19607j07345
60928A861022r6608q8454q2427p6997p1662o7181o3895o1035n7746n3780m9331
60917A091906m4892m1066l7907l4829l1657k9068k7291k5340k2420j9308j7220
60906G60908j6082j5004j3776j2730j1678j0243q814q007p569o799n671m535l307
60893F36693j904r16o98l70J010K844L801L801L792M066M192M322N010N804N587
60878F77034M361L348L140L064K579K022J602Q31o01k270l680m707n211n059m780
$$ plain form
60863 671673 666449 660139 653277 647166 642520 638968 635774 632613 629695 627424 625910 624767 623691 623295
60849 623295 624830 628792 634350 640558 647642 656562 667667 680312 693486 706358 718470 729940 741325
60836 741325 752896 764285 775186 786004 797264 808630 819116 828154 835917 842670 848396 853119
60824 853119 857144 860728 863798 866199 868121 870170 872944 876396 879662 881759 882492 882410 881797 880090 876526
60809 876526 871041 864240 856700 848601 839873 830444 820273 809244 797043 783367 768527 753638 739724
60796 739724 726739 714029 701681 690670 681558 673872 667131 661689 658033 655889 654695 654475 655586
60783 655586 658028 661593 666291 671894 677407 681865 685592 689973 695915 703147 710950 718953 727046 735110
60769 735110 743134 751264 759517 767649 775425 782883 790257 797794 805609 813608 821565 829393 837235 845259
$$ packed form
60863F71673n224o310o862o111m646l552l194l161k918k271j514j143j076l96
60849F23295J535L962N558O208P084Q920J1105J2645J3174J2872J2112J1470J1385
60836G41325J1571J1389J0901J0818J1260J1366J0486R038P763O753N726M723
60824H53119M025L584L070K401J922K049K774L452L266K097P33q2o13j707l564
60809H76526n485o801p540q099q728r429j0171j1029j2201j3676j4840j4889j3914
60796G39724j2985j2710j2348j1011r112p686o741n442l656k144j194k20J111
60783F55586K442L565M698N603N513M458L727M381N942P232P803Q003Q093Q064
60769G35110Q024Q130Q253Q132P776P458P374P537P815P999P957P828P842Q024
$$ plain form
60755 845259 853565 862352 871748 881255 889810 896900 903331 910334 918033 925370 931454 936365 940515 943838
60741 943838 945966 946889 947026 946664 945549 943121 939144 934073 928630 922919 916162 907524 897111 885872
60727 885872 874664 863760 853211 843224 833944 825151 816421 807518 798425 789128 779631 770246 761556
60714 761556 753878 746857 739833 732571 725363 718456 711807 705569 700298 696196 692508 688296 683736 680004
60700 680004 677925 677406 678234 680589 684371 688719 692837 696899 701562 706848 712079 716692 720562 723540 725196
60685 725196 725116 723125 719204 713443 706112 697474 687527 676190 663756 650924 638298 626114 614533
60672 614533 603932 594672 586644 579307 572274 565777 560440 556650 554357 553391 553600 554508 555235 555190 554678 554419
60656 554419 554622 554976 555356 555903 556441 556554 556486 557362 560076 564269 568755 572661 575945 579068 582430 585936
$$ packed form
60755H45259Q306Q787R396R507Q555P090O431P003P699P337O084M911M150L323
60741I43838K128R23J37l62j115k428l977n071n443n711o757q638j0413j1239
60727H85872j1208j0904j0549r987r280q793q730q903r093r297r497r385q690
60714G61556p678p021p024p262p208o907o649o238n271m102l688m212m560l732
60700F80004k079n19Q28K355L782M348M118M062M663N286N231M613L870K978J656
60685G25196q0j991l921n761p331q638r947j1337j2434j2832j2626j2184j1581
60672F14533j0601r260q028p337p033o497n337l790k293r66K09R08P27m5n12k59
60656E54419K03L54L80N47N38J13o8Q76K714M193M486L906L284L123L362L506
$$ plain form
60640 585936 588959 590951 592209 593769 596517 600750 606538 613864 622205 630598 638578 646699 655866 666570
60626 666570 678925 692779 707381 721572 734928 748250 762390 776958 790803 803361 814867
60615 814867 825503 835045 843285 850190 855704 859838 862859 864984 866063 865884 864507 861820 857202 850333
60601 850333 842070 833740 825631 816968 807336 797319 787610 778277 769216 760741 753360 747368 742864 739741
60587 739741 737516 735603 734000 733247 733506 734183 734760 735480 736706 737922 737977 736261 733249 729864 726732 724153
60571 724153 722447 721935 722518 723466 723840 723269 722261 721677 721861 722345 722390 721733 720775 720066 719700 719309 718684 718245
60553 718245 718711 720436 723357 727507 733220 740765 750194 761669 775514 791726 809897 829925 852509
60540 852509 878581 908533 942290 979620 1019758 1060874 1100475 1136346 1166820 1190401 1205779
$$ packed form
60640E85936L023J992J258J560K748M233N788P326Q341Q393P980Q121R167J0704
60626F66570J2355J3854J4602J4191J3356J3322J4140J4568J3845J2558J1506
60615H14867J0636R542Q240O905N514M134L021K125J079j79j377k687m618o869
60601H50333q263q330q109q663r632j0017r709r333r061q475p381n992m504l123
60587G39741k225j913j603p53K59O77N77P20J226J216N5j716l012l385l132k579
60571G24153j706n12N83R48L74n71j008n84J84M84M5o57r58p09l66l91o25m39
60553G18245M66J725K921M150N713P545R429J1475J3845J6212J8171K0028K2584
60540H52509K6072K9952L3757L7330M0138M1116L9601L5871L0474K3581J5378
$$ plain form
60529 1205779 1212334 1210355 1200815 1185204 1165334 1142741 1118245 1092453 1066569 1042277 1020878 1003001
60517 1003001 989044 979305 973584 971229 971808 975381 982012 991393 1003126 1017033 1033156 1051789 1073608
60504 1073608 1099391 1129540 1164258 1204302 1251030 1305494 1367954 1438633 1518495 1608840 1710345
60493 1710345 1822984 1946812 2082458 2230770 2392204 2566753 2754513 2956182 3172335
60484 3172335 3401188 3636390 3867006 4079807 4261723 4400943 4487538 4514980 4481906 4392407
60474 4392407 4254507 4078133 3873547 3650228 3416134 3177669 2940166 2708229 2485718
60465 2485718 2275799 2081144 1903772 1744517 1602881 1477632 1367540 1271515 1188329 1116480
60455 1116480 1054238 999757 951381 908196 870115 837085 808240 782178 758007 735682 715314
$$ packed form
60529A205779O555j979r540j5611j9870k2593k4496k5792k5884k4292k1399j7877
60517A003001j3957r739n721k355N79L573O631R381J1733J3907J6123J8633K1819
60504A073608K5783L0149L4718M0044M6728N4464O2460P0679P9862R0345J01505
60493A710345J12639J23828J35646J48312J61434J74549J87760K01669K16153
60484C172335K28853K35202K30616K12801J81916J39220Q6595K7442l3074q9499
60474D392407j37900j76374k04586k23319k34094k38465k37503k31937k22511
60465B485718k09919j94655j77372j59255j41636j25249j10092r6025q3186p1849
60455A116480o2242n4481m8376m3185l8081l3030k8845k6062k4171k2325k0368
$$ plain form
60444 715314 696701 679748 664731 651680 639841 628277 616819 605962 596061 587138 579341 572954
60432 572954 567890 563690 560100 557223 554970 552846 550451 547849 545321 543119 541587 541091 541604 542648 543848
60417 543848 545311 547315 549941 553106 556643 560262 563739 567242 571082 575139 578961 582540 586424 590844
60403 590844 595254 599022 602145 605021 608031 611647 616419 622418 628994 635448 641597 647477 653017 658372
60389 658372 664039 670116 675831 680280 683350 685559 687376 689026 690422 690935 689768 687038 683870 680872
60375 680872 677307 672521 667392 663280 660067 656542 652445 648889 646726 645683 645236 645289 645677 645983 646238 647106
60359 647106 648999 651611 654536 657718 661088 664469 668069 672408 677454 682502 687206 692010 697164 702036
60345 702036 706004 709491 713439 718120 722994 727479 731245 733988 735568 736450 737497 739165 741183 743167
$$ packed form
60444G15314j8613j6953j5017j3051j1839j1564j1458j0857r901q923p797o387
60432E72954n064m200l590k877k253k124k395k602k528k202j532m96N13J044J200
60417E43848J463K004K626L165L537L619L477L503L840M057L822L579L884M420
60403E90844M410L768L123K876L010L616M772N999O576O454O149N880N540N355
60389F58372N667O077N715M449L070K209J817J650J396N13j167k730l168k998
60375F80872l565m786n129m112l213l525m097l556k163j043m47N3L88L06K55Q68
60359F47106J893K612K925L182L370L381L600M339N046N048M704M804N154M872
60345G02036L968L487L948M681M874M485L766K743J580Q82J047J668K018J984
$$ plain form
60331 743167 745268 747998 751546 755547 759651 764072 769251 775029 780553 785168 788965 792217 794643 795688
60317 795688 795247 793577 790752 786770 782125 777686 773915 770575 767208 763576 759702 755910 752778 750614
60303 750614 749022 747323 745246 742821 739932 736664 733861 732445 732118 731553 730059 728340 727359 727234 727581
60288 727581 728301 729427 730648 731523 732039 732678 734108 736937 741406 747109 753220 759148 764830 770518 776634
60273 776634 783761 792187 801411 810665 820009 830360 842325 855669 870160 886216 904289 924176
60261 924176 945393 967841 991694 1017100 1044455 1074581 1108144 1145058 1184829 1227266 1272616
60250 1272616 1321323 1374012 1431439 1494103 1562066 1635314 1713956 1797821 1886260 1978716 2075134
60239 2075134 2175307 2278052 2381424 2483618 2583312 2679366 2770616 2855911 2933985 3003306
$$ packed form
60331G43167K101K730L548M001M104M421N179N778N524M615L797L252K426J045
60317G95688m41j670k825l982m645m439l771l340l367l632l874l792l132k164
60303G50614j592j699k077k425k889l268k803j416l27n65j494j719r81j25L47
60288G27581P20J126J221Q75N16O39J430K829M469N703O111N928N682N688O116
60273G76634P127Q426R224R254R344J0351J1965J3344J4491J6056J8073J9887
60261I24176K1217K2448K3853K5406K7355L0126L3563L6914L9771M2437M5350
60250A272616M8707N2689N7427O2664O7963P3248P8642Q3865Q8439R2456R6418
60239B075134J00173J02745J03372J02194R9694R6054R1250Q5295P8074O9321
$$ plain form
60229 3003306 3062393 3110335 3146844 3171883 3185509 3188153 3180938 3165671 3144423 3118981 3090592 3060341
60217 3060341 3029698 3000578 2974903 2954311 2940181 2933594 2935234 2945655 2965716 2996437 3038354 3091304
60205 3091304 3154866 3228570 3311520 3402171 3498699 3599328 3702101 3804657 3904418 3998847 4085404
60194 4085404 4161595 4225353 4275389 4311146 4332495 4339368 4331439 4308323 4270434 4219552 4158198 4088513
60182 4088513 4012234 3931654 3850004 3770667 3696386 3629197 3570553 3521356 3482364 3454724 3439700
60171 3439700 3437794 3448570 3471387 3505714 3550546 3604024 3663787 3727252 3791451 3853310 3910461
60160 3910461 3961466 4005140 4040236 4065940 4082064 4088537 4085276 4072881 4053030 4027975 4000155 3972264
60148 3972264 3946895 3925797 3910195 3902162 3904809 3920674 3950606 3994741 4053816 4128978 4221123 4331271
$$ packed form
60229C003306N9087M7942L6509K5039J3626K644p215j5267k1248k5442k8389l0251
60217C060341l0643k9120k5675k0592j4130o587J640J0421K0061L0721M1917N2950
60205C091304O3562P3704Q2950R0651R6528J00629J02773J02556R9761R4429Q6557
60194D085404P6191O3758N0036L5757K1349O873p929k3116l7889n0882o1354o9685
60182D088513p6279q0580q1650p9337p4281o7189n8644m9197l8992k7640j5024
60171C439700j906J0776K2817L4327M4832N3478N9763O3465O4199O1859N7151
60160C910461N1005M3674L5096K5704J6124O473l261j2395j9851k5055k7820k7891
60148C972264k5369k1098j5602q033K647J5865K9932M4135N9075P5162R2145J10148
$$ plain form
60136 4331271 4461002 4611628 4783234 4975211 5187375 5419851 5672082 5942528 6229043
60127 6229043 6528964 6839018 7155583 7474736 7791725 8100998 8397425 8677060 8936137
60118 8936137 9169900 9373378 9543116 9677298 9774251 9831587 9846913 9818881 9747695 9635177
60108 9635177 9484487 9299564 9085004 8846563 8591073 8325136 8054180 7783335 7518714
60099 7518714 7266904 7033195 6820949 6632511 6470039 6335437 6230090 6154720 6109084 6091898
60089 6091898 6101392 6135718 6192364 6267531 6356633 6455074 6557856 6658949 6752196 6833074 6898986
60078 6898986 6947979 6978033 6987642 6976223 6943713 6890325 6816870 6724724 6615317 6490151 6351482
60067 6351482 6202504 6046680 5887234 5727151 5569026 5414806 5266230 5125641 4995761
$$ packed form
60136D331271J29731J50626J71606J91977K12164K32476K52231K70446K86515
60127F229043K99921L10054L16565L19153L16989L09273K96427K79635K59077
60118H936137K33763K03478J69738J34182R6953N7336J5326k8032p1186j12518
60108I635177j50690j84923k14560k38441k55490k65937k70956k70845k64621
60099G518714k51810k33709k12246j88438j62472j34602j05347p5370m5636j7186
60089F091898R494L4326N6646P5167Q9102R8441J02782J01093R3247Q0878O5912
60078F898986M8993L0054R609j1419l2510n3388p3455r2146j09407j25166j38669
60067F351482j48978j55824j59446j60083j58125j54220j48576j40589j29880
$$ plain form
60058 4995761 4878561 4774890 4685449 4611487 4554184 4513859 4490313 4483716 4494663 4523319 4568727
60047 4568727 4628952 4701732 4784960 4876524 4973860 5073870 5173304 5268917 5357130 5434019 5496124
60036 5496124 5541149 5567722 5574879 5562196 5530094 5479446 5411105 5326374 5227743 5118574 5002108
60025 5002108 4881196 4758804 4638140 4522252 4413850 4315237 4227810 4151854 4087541 4036100
60015 4036100 3999284 3977783 3971024 3978696 4001626 4040783 4096154 4167066 4253095 4354071 4469430
60004 4469430 4597913 4737546 4885418 5037483 5189007 5335396 5472751 5597886 5708018
59995 5708018 5800543 5873124 5924038 5952263 5957140 5938157 5895324 5829679 5743337 5639303 5521435
59984 5521435 5394269 5262416 5130050 5000868 4878022 4763855 4660223 4569452 4494339 4436638
$$ packed form
60058D995761j17200j03671q9441p3962n7303m0325k3546o597J0947K8656M5408
60047D568727O0225P2780Q3228R1564R7336J00010R9434R5613Q8213P6889O2105
60036E496124M5025K6573P157j2683l2102n0648o8341q4731r8631j09169j16466
60025E002108j20912j22392j20664j15888j08402r8613q7427p5956o4313n1441
60015D036100l6816k1501o759P672K2930L9157N5371P0912Q6029J00976J15359
60004D469430J28483J39633J47872J52065J51524J46389J37355J25135J10132
59995E708018R2525P2581N0914K8225M877j8983m2833o5645q6342j04034j17868
59984E521435j27166j31853j32366j29182j22846j14167j03632r0771p5113n7701
$$ plain form
59974 4436638 4396084 4371627 4363157 4371191 4395362 4434314 4486849 4551975 4627760 4711312 4800165 4892761
59962 4892761 4987260 5080856 5170769 5255178 5332753 5401956 5461416 5510522 5549237 5577812 5597167
59951 5597167 5609196 5616243 5620468 5623980 5629236 5639016 5656225 5683881 5724993 5782258 5858107 5955085
59939 5955085 6075832 6222602 6397089 6600620 6833978 7096947 7388473 7707150 8050685
59930 8050685 8414489 8791153 9171366 9544662 9899152 10221579 10498778 10719463 10875133
59921 10875133 10960443 10973603 10916288 10792839 10609612 10374850 10098172 9789364 9457774 9112819
59911 9112819 8764136 8420512 8088902 7774874 7483434 7218797 6983772 6780105 6609284
59902 6609284 6472411 6369402 6298940 6259383 6249536 6268706 6316264 6390956 6490210 6610121 6746276
$$ packed form
59974D436638m0554k4457q470Q034K4171L8952N2535O5126P5785Q3552Q8853R2596
59962D892761R4499R3596Q9913Q4409P7575O9203N9460M9106L8715K8575J9355
59951E597167J2029P047M225L512N256R780J7209K7656M1112N7265P5849R6978
59939E955085J20747J46770J74487K03531K33358K62969K91526L18677L43535
59930H050685L63804L76664L80213L73296L54490L22427K77199K20685J55670
59921A0875133Q5310J3160n7315j23449j83227k34762k76678l08808l31590l44955
59911I112819l48683l43624l31610l14028k91440k64637k35025k03667j70821
59902F609284j36873j03009p0462l9557r847J9170M7558P4692R9254J19911J36155
$$ plain form
59891 6746276 6894263 7049007 7203789 7350407 7480368 7585859 7660156 7698129 7696863 7655638
59881 7655638 7575136 7456748 7302670 7116460 6903229 6669111 6420375 6162862 5902073 5643350
59871 5643350 5391533 5150333 4922278 4709308 4513131 4335023 4175549 4034630 3911444
59862 3911444 3804115 3709891 3626075 3550818 3482967 3421474 3365214 3313204 3264723 3219358 3177226
59851 3177226 3139122 3106194 3079325 3058779 3044250 3035102 3030497 3029300 3029883 3030185 3028132 3021986 3010292
59838 3010292 2991829 2966102 2933813 2896505 2855701 2812562 2768205 2723813 2680362 2638703 2599984
59827 2599984 2565609 2536663 2513711 2497173 2487345 2483920 2486001 2492974 2505070 2522838 2546433 2575717
59815 2575717 2610727 2651583 2697990 2749008 2803138 2858437 2912799 2964427 3012084 3054874 3092028
$$ packed form
59891F746276J47987J54744J54782J46618J29961J05491P4297L7973j266m1225
59881G655638q0502j18388j54078j86210k13231k34118k48736k57513k60789k58723
59871E643350k51817k41200k28055k12970j96177j78108j59474j40919j23186
59862C911444j07329r4224q3816p5257o7851o1493n6260n2010m8481m5365m2132
59851C177226l8104l2928k6869k0546j4529r148m605j197N83L02k053o146j1694
59838C010292j8463k5727l2289l7308m0804m3139m4357m4392m3451m1659l8719
59827B599984l4375k8946k2952j6538r828l425K081O973J2096J7768K3595K9284
59815B575717L5010M0856M6407N1018N4130N5299N4362N1628M7657M2790L7154
$$ plain form
59804 3092028 3123050 3147942 3167169 3181456 3191696 3198927 3204406 3209787 3217019 3227760 3242950 3263282
59792 3263282 3289979 3324744 3369106 3424385 3492297 3574897 3673727 3789628 3923781 4078505 4256674
59781 4256674 4460636 4691810 4950654 5236110 5544612 5869099 6198060 6515108 6800396
59772 6800396 7034381 7202195 7296392 7317340 7271821 7170514 7025107 6846259 6643167 6424114
59762 6424114 6196900 5968807 5746436 5535492 5340504 5164723 5010357 4878823 4770743
59753 4770743 4685902 4623466 4582397 4561744 4560661 4578133 4612769 4663232 4729153 4811379 4910938
59742 4910938 5027963 5162013 5313137 5482027 5669255 5875162 6100701 6347796 6618631
59733 6618631 6915064 7238863 7591903 7975656 8390723 8837111 9314612 9822448 10358458
$$ packed form
59804C092028L1022K4892J9227J4287J0240P231N479N381P232J0741J5190K0332
59792C263282K6697L4765M4362N5279O7912Q2600R8830J15901J34153J54724J78169
59781D256674K03962K31174K58844K85456L08502L24487L28961L17048K85288
59772F800396K33985J67814R4197K0948m5519j01307j45407j78848k03092k19053
59762F424114k27214k28093k22371k10944j94988j75781j54366j31534j08080
59753D770743q4841o2436m1069k0653j083J7472L4636N0463O5921Q2226R9559
59742D910938J17025J34050J51124J68890J87228K05907K25539K47095K70835
59733F618631K96433L23799L53040L83753M15067M46388M77501N07836N36010
$$ plain form
59724 10358458 10918438 11495983 12083024 12670949 13251523 13817045 14360680 14877977 15368382
59715 15368382 15834769 16281567 16714012 17138932 17564656 17999089 18448102 18915763 19404851
59706 19404851 19915869 20445501 20986294 21527467 22055782 22556630 23015628 23419935 23758668
59697 23758668 24023358 24209256 24316434 24349457 24316246 24227340 24095385 23934201 23757852 23580442
59687 23580442 23416037 23277909 23177665 23125267 23129692 23199208 23341153 23561802 23866320 24258420
59677 24258420 24739795 25309548 25963531 26693560 27486694 28324414 29181504 30025464 30817950
59668 30817950 31518347 32087930 32493426 32710026 32723729 32532180 32143971 31577317 30858321
59659 30858321 30018001 29088536 28100594 27082434 26059375 25052603 24077978 23145075 22255824
$$ packed form
59724A0358458N59980N77545N87041N87925N80574N65522N43635N17297M90405
59715A5368382M66387M46798M32445M24920M25724M34433M49013M67661M89088
59706A9404851N11018N29632N40793N41173N28315N00848M58998M04307L38733
59697B3758668K64690J85898J07178L3023l3211q8906j31955j61184j76349j77410
59687B3580442j64405j38128j00244n2398M425O9516J41945K20649L04518L92100
59677B4258420M81375N69753O53983P30029P93134Q37720Q57090Q43960P92486
59668C0817950P00397N69583M05496K16600J3703j91549l88209n66654p18996
59659C0858321q40320r29465r87942j018160j023059j006772r74625r32903q89251
$$ plain form
59650 22255824 21403590 20575167 19755923 18934757 18105998 17269074 16427838 15589273 14761145
59641 14761145 13950105 13161705 12401105 11672797 10980063 10325458 9711494 9140159 8612143
59632 8612143 8127281 7685358 7285555 6925331 6600843 6308695 6046738 5813238 5605989
59623 5605989 5422425 5260172 5117252 4991999 4882796 4787701 4704428 4630819 4565143 4505754
59613 4505754 4450765 4398300 4346777 4294594 4239856 4180839 4116675 4047417 3973651 3896229 3816079
59602 3816079 3734054 3651123 3568566 3487511 3408268 3330859 3256320 3186705 3123511 3066847 3016488
59591 3016488 2972846 2936360 2906810 2883893 2867685 2857848 2853209 2853007 2857781 2868000 2882443 2899067
59579 2899067 2916997 2936534 2957593 2979438 3001843 3025365 3050389 3076887 3105286 3136660 3171864
$$ packed form
59650B2255824q52234q28423q19244q21166q28759q36924q41236q38565q28128
59641A4761145q11040p88400p60600p28308o92734o54605o13964n71335n28016
59632H612143m84862m41923l99803l60224l24488k92148k61957k33500k07249
59623E605989j83564j62253j42920j25253j09203r5095q3273p3609o5676n9389
59613D505754n4989n2465n1523n2183n4738n9017o4164o9258p3766p7422q0150
59602C816079q2025q2931q2557q1055p9243p7409p4539o9615o3194n6664n0359
59591C016488m3642l6486k9550k2917j6208r837m639k02M774J0219J4443J6624
59579B899067J7930J9537K1059K1845K2405K3522K5024K6498K8399L1374L5204
$$ plain form
59568 3171864 3211198 3255089 3304432 3360047 3422333 3491687 3568840 3654719 3750291 3856561 3974433
59557 3974433 4104635 4247904 4404930 4575905 4760599 4959297 5173086 5402594 5646752
59548 5646752 5903318 6170168 6445425 6726769 7011320 7295947 7577212 7851564 8116443
59539 8116443 8370694 8613023 8840419 9049015 9236360 9402205 9547580 9674246 9784793
59530 9784793 9882205 9969204 10048637 10124184 10199700 10277928 10360460 10448385 10541602 10637294 10729822
59519 10729822 10812054 10876203 10914143 10918615 10884591 10808843 10688563 10521774 10309096 10053823
59509 10053823 9760111 9432382 9076737 8701445 8315032 7924437 7535304 7153047 6782835
59500 6782835 6429036 6095074 5783362 5495162 5231067 4991755 4777634 4587747 4420070
$$ packed form
59568C171864L9334M3891M9343N5615O2286O9354P7153Q5879R5572J06270J17872
59557C974433J30202J43269J57026J70975J84694J98698K13789K29508K44158
59548E646752K56566K66850K75257K81344K84551K84627K81265K74352K64879
59539H116443K54251K42329K27396K08596J87345J65845J45375J26666J10547
59530I784793R7412Q6999P9433P5547P5516P8228Q2532Q7925R3217R5692R2528
59519A0729822Q2232O4149L7940M472l4024p5748j20280j66789k12678k55273
59509A0053823k93712l27729l55645l75292l86413l90595l89133l82257l70212
59500F782835l53799l33962l11712k88200k64095k39312k14121j89887j67677
$$ plain form
59491 4420070 4273241 4147173 4041608 3954984 3885391 3832059 3795248 3775079 3770942 3781849 3807080
59480 3807080 3846665 3901265 3971237 4055942 4154472 4267031 4394991 4539585 4701116 4879207
59470 4879207 5072776 5279546 5496393 5720433 5948978 6178050 6401580 6612358 6803191
59461 6803191 6967098 7097482 7189006 7238193 7243198 7203701 7121281 6999209 6841441 6652234
59451 6652234 6436841 6201741 5953528 5697770 5439070 5181583 4929033 4684490 4450394
59442 4450394 4228548 4020016 3825441 3645514 3480819 3331271 3196127 3074478 2965335
59433 2965335 2867556 2780386 2703832 2637865 2581532 2533725 2494366 2463626 2440173 2421686 2407221
59422 2407221 2397705 2393758 2394523 2399189 2408204 2422075 2440186 2461896 2487740 2518241 2552000 2586070
$$ packed form
59491D420070j46829j26068j05565q6624o9593n3332l6811k0169m137J0907K5231
59480C807080L9585N4600O9972Q4705R8530J12559J27960J44594J61531J78091
59470D879207J93569K06770K16847K24040K28545K29072K23530K10778J90833
59461F803191J63907J30384R1524M9187N005l9497q2420j22072j57768j89207
59451F652234k15393k35100k48213k55758k58700k57487k52550k44543k34096
59442D450394k21846k08532j94575j79927j64695j49548j35144j21649j09143
59433B965335r7779q7170p6554o5967n6333m7807l9359l0740k3453j8487j4465
59422B407221r516l947P65M666R015J3871J8111K1710K5844L0501L3759L4070
$$ plain form
59410 2586070 2618070 2647346 2674679 2701894 2731577 2766238 2807449 2855995 2912608 2978170 3053243
59399 3053243 3137580 3230001 3328982 3433969 3546371 3668946 3804346 3954826 4123060 4311970
59389 4311970 4523389 4757877 5016420 5301514 5616084 5962058 6340364 6751221 7193422
59380 7193422 7663664 8157053 8667612 9187784 9708214 10219142 10712126 11180393 11618426
59371 11618426 12022117 12389076 12718171 13008839 13261030 13475267 13652215 13792304 13895682
59362 13895682 13961898 13989305 13975377 13918002 13816242 13670169 13481306 13253835 12994500 12710625
59352 12710625 12408687 12094823 11775243 11454881 11136020 10818841 10502653 10186107 9867207
59343 9867207 9544366 9217287 8886336 8551726 8214052 7875063 7537158 7202629 6873986
$$ packed form
59410B586070L2000K9276K7333K7215K9683L4661M1211M8546N6613O5562P5073
59399C053243Q4337R2421R8981J04987J12402J22575J35400J50480J68234J88910
59389D311970K11419K34488K58543K85094L14570L45974L78306M10857M42201
59380G193422M70242M93389N10559N20172N20430N10928M92984M68267M38033
59371A1618426M03691L66959L29095K90668K52191K14237J76948J40089J03378
59362A3895682O6216K7407j3928n7375j01760j46073j88863k27471k59335k83875
59352A2710625l01938l13864l19580l20362l18861l17179l16188l16546l18900
59343I867207l22841l27079l30951l34610l37674l38989l37905l34529l28643
$$ plain form
59334 6873986 6554263 6246067 5950791 5669571 5404380 5157284 4929069 4719547 4528733
59325 4528733 4356718 4202808 4065893 3945520 3841646 3753432 3679205 3617599 3567963 3529787
59315 3529787 3502533 3485991 3479959 3483540 3495453 3515124 3542854 3578878 3622820 3674099 3732287 3796933
59303 3796933 3867398 3942843 4022072 4103469 4185465 4266941 4346827 4423506 4495049 4559957 4617459
59292 4617459 4667419 4710313 4746998 4778128 4804059 4825661 4844847 4863891 4884704 4909228 4939961
59281 4939961 4979245 5028186 5086833 5155174 5233342 5321060 5417499 5521451 5630958 5742642 5851743
59270 5851743 5952746 6039928 6108040 6153508 6175206 6173929 6151373 6109847 6052302 5981844 5901357
59259 5901357 5813986 5723529 5633608 5546667 5464476 5389416 5324471 5271813 5231843 5203660 5186098
$$ packed form
59334F873986l19723l08196k95276k81220k65191k47096k28215k09522j90814
59325D528733j72015j53910j36915j20373j03874q8214p4227o1606m9636l8176
59315C529787k7254j6542o032L581J1913J9671K7730L6024M3942N1279N8188O4646
59303C796933P0465P5445P9229Q1397Q1996Q1476P9886P6679P1543O4908N7502
59292D617459M9960M2894L6685L1130K5931K1602J9186J9044K0813K4524L0733
59281D939961L9284M8941N8647O8341P8168Q7718R6439J03952J09507J11684J09101
59270E851743J01003Q7182O8112M5468K1698j277k2556m1526n7545p0458q0487
59259E901357q7371r0457q9921q6941q2191p5060o4945n2658l9970k8183j7562
$$ plain form
59248 5186098 5178317 5179753 5189590 5206307 5228072 5253694 5282846 5315256 5350338 5388029 5429482 5476528
59236 5476528 5530959 5594754 5670401 5760392 5866853 5992187 6139476 6311527 6509720 6734103
59226 6734103 6983800 7256386 7547120 7849293 8154812 8453912 8735064 8986373 9197110
59217 9197110 9357700 9459358 9495314 9462501 9361396 9194647 8966897 8685547 8360257 8001159
59207 8001159 7617975 7220378 6817801 6418267 6027882 5651589 5293730 4957588 4644843
59198 4644843 4355820 4090194 3847609 3627918 3430800 3254960 3098021 2957476 2831458
59189 2831458 2718369 2616416 2524070 2440566 2365424 2297849 2237097 2182912 2134993 2092527 2054808
59178 2054808 2021765 1993225 1968299 1946338 1927873 1913725 1903719 1897268 1894617 1896318 1901934 1910512
$$ packed form
59248E186098p781J436R837J6717K1765K5622K9152L2410L5082L7691M1453M7046
59236E476528N4431O3795P5647Q9991J06461J25334J47289J72051J98193K24383
59226F734103K49697K72586K90734L02173L05519K99100K81152K51309K10737
59217I197110J60590J01658L5956l2813j01105j66749k27750k81350l25290l59098
59207H001159l83184l97597m02577l99534l90385l76293l57859l36142l12745
59198D644843k89023k65626k42585k19691j97118j75840j56939j40545j26018
59189B831458j13089j01953r2346q3504p5142o7575o0752n4185m7919m2466l7719
59178B054808l3043k8540k4926k1961j8465j4148j0006o451k651J701N616Q578
$$ plain form
59166 1910512 1922105 1937523 1956725 1978777 2003489 2031894 2064844 2102162 2143386 2188377 2236903
59155 2236903 2288538 2343362 2402070 2465170 2532647 2604517 2680971 2761796 2846238 2933529 3022952
59144 3022952 3113396 3203512 3292427 3379656 3464171 3544056 3617195 3681908 3737111 3782489 3818508
59133 3818508 3845735 3864263 3874360 3877492 3876116 3872618 3868968 3867059 3868540 3874529 3886275 3905918 3935808
59120 3935808 3977263 4030759 4097079 4177326 4271947 4380724 4503670 4641052 4792575 4957382
59110 4957382 5134683 5323340 5520785 5723105 5925999 6124575 6312440 6482425 6628665
59101 6628665 6747196 6834677 6888055 6906165 6890781 6845561 6774467 6681262 6569484 6442276 6302578
59090 6302578 6153516 5997847 5837014 5671527 5502337 5331053 5158769 4985748 4812428
$$ packed form
59166A910512J1593J5418J9202K2052K4712K8405L2950L7318M1224M4991M8526
59155B236903N1635N4824N8708O3100O7477P1870P6454Q0825Q4442Q7291Q9423
59144C022952R0444R0116Q8915Q7229Q4515P9885P3139O4713N5203M5378L6019
59133C818508K7227J8528J0097L132j376l498l650j909J481N989J1746J9643K9890
59120C935808M1455N3496O6320Q0247R4621J08777J22946J37382J51523J64807
59110D957382J77301J88657J97445K02320K02894J98576J87865J69985J46240
59101F628665J18531Q7481N3378J8110j5384m5220p1094r3205j11778j27208j39698
59090F302578j49062j55669j60833j65487j69190j71284j72284j73021j73320
$$ plain form
59081 4812428 4639777 4468358 4297988 4128696 3961227 3796308 3634266 3475696 3321663
59072 3321663 3172904 3029633 2892480 2762751 2641240 2527449 2420431 2319821 2225673 2137947
59062 2137947 2056602 1981699 1913047 1850189 1792899 1741143 1694406 1651643 1612148 1575893 1542870
59051 1542870 1512699 1485086 1459980 1437055 1415642 1395462 1376939 1360604 1346702 1335460 1327131
59040 1327131 1321568 1318185 1316410 1315754 1315630 1315784 1316796 1319501 1323954 1329719 1336968 1346436 1358276 1371810
59026 1371810 1386344 1401321 1415775 1428665 1439796 1449485 1457337 1462413 1464653 1464953 1463782 1460918 1456801
59013 1456801 1452818 1449851 1447594 1445780 1445026 1446027 1448822 1453175 1458679 1464223 1468473 1471292 1473661 1475840
58999 1475840 1476773 1475761 1473538 1471117 1468683 1466250 1464240 1462745 1461153 1459241 1457666 1456787 1456086 1455466 1456076
$$ packed form
59081D812428j72651j71419j70370j69292j67469j64919j62042j58570j54033
59072C321663j48759j43271j37153j29729j21511j13791j07018j00610r4148q7726
59062B137947q1345p4903o8652o2858n7290n1756m6737m2763l9495l6255l3023
59051A542870l0171k7613k5106k2925k1413k0180j8523j6335j3902j1242q329
59040A327131n563l383j775o56j24J54J012K705M453N765P249R468J1840J3534
59026A371810J4534J4977J4454J2890J1131R689P852N076K240L00j171k864m117
59013A456801l983k967k257j814p54J001K795M353N504N544M250K819K369K179
58999A475840R33j012k223k421k434k433k010j495j592j912j575q79p01o20O10
$$ plain form
58984 1456076 1458933 1463586 1469010 1475034 1482118 1490558 1500662 1512928 1527229 1542547 1558288 1575147
58972 1575147 1594026 1614905 1637499 1662082 1688774 1716854 1745757 1776085 1808673 1843290 1879175
58961 1879175 1916176 1954452 1993651 2033404 2074030 2115729 2157602 2198545 2238798 2279691 2322272
58950 2322272 2367159 2415365 2468089 2525716 2587999 2655223 2728391 2808217 2894722 2987930 3088395
58939 3088395 3196871 3313944 3440198 3576453 3723692 3882773 4054252 4238582 4436810
58930 4436810 4650877 4882822 5133829 5404719 5697313 6014370 6358056 6729348 7129248
58921 7129248 7559622 8022361 8518523 9048688 9613108 10210599 10837747 11489596 12160193
58912 12160193 12841485 13521961 14186800 14818856 15399430 15909529 16332107 16653709 16864466
$$ packed form
58984A456076K857M653N424O024P084Q440J0104J2266J4301J5318J5741J6859
58972A575147J8879K0879K2594K4583K6692K8080K8903L0328L2588L4617L5885
58961A879175L7001L8276L9199L9753M0626M1699M1873M0943M0253M0893M2581
58950B322272M4887M8206N2724N7627O2283O7224P3168P9826Q6505R3208J00465
58939C088395J08476J17073J26254J36255J47239J59081J71479J84330J98228
58930D436810K14067K31945K51007K70890K92594L17057L43686L71292L99900
58921G129248M30374M62739M96162N30165N64420N97491O27148O51849O70597
58912A2160193O81292O80476O64839O32056N80574N10099M22578L21602K10757
$$ plain form
58903 16864466 16957875 16931697 16788789 16536468 16185239 15747938 15238735 14671719 14060430 13418600
58893 13418600 12760110 12097361 11440334 10797682 10177605 9586662 9028404 8504211 8015078
58884 8015078 7561822 7144210 6760849 6409767 6088498 5794055 5523565 5274824 5046025
58875 5046025 4835503 4642077 4464904 4302560 4152958 4014633 3887286 3770549 3663135
58866 3663135 3563894 3472775 3389870 3314248 3244712 3181108 3124020 3073623 3029571 2991480 2958851
58855 2958851 2931039 2907924 2890077 2877773 2870545 2868257 2871794 2882018 2898844 2921969 2951637 2987894
58843 2987894 3030009 3077537 3131219 3192030 3260139 3335594 3419089 3511151 3611545 3720550 3839974
58832 3839974 3971742 4116213 4272952 4442400 4625639 4823321 5036166 5265985 5514961
$$ packed form
58903A6864466R3409k6178j42908k52321l51229m37301n09203n67016o11289o41830
58893A3418600o58490o62749o57027o42652o20077n90943n58258n24193m89133
58884H015078m53256m17612l83361l51082l21269k94443k70490k48741k28799
58875E046025k10522j93426j77173j62344j49602j38325j27347j16737j07414
58866C663135r9241r1119q2905p5622o9536o3604n7088n0397m4052l8091l2629
58855B958851k7812k3115j7847j2304p228k288L537J0224J6826K3125K9668L6257
58843B987894M2115M7528N3682O0811O8109P5455Q3495R2062J00394J09005J19424
58832C839974J31768J44471J56739J69448J83239J97682K12845K29819K48976
$$ plain form
58823 5514961 5784385 6075132 6388814 6727337 7092001 7484267 7906857 8362686 8852930
58814 8852930 9377049 9933925 10521430 11135021 11767771 12411282 13055199 13685986 14287390
58805 14287390 14842171 15332919 15742330 16054784 16258574 16346687 16316583 16170597 15916093 15563812
58795 15563812 15125788 14615122 14046513 13435188 12795074 12138668 11477880 10823551 10184232
58786 10184232 9566411 8975561 8415910 7889602 7397243 6939128 6515081 6123710 5762995
58777 5762995 5431321 5126978 4847287 4589497 4352071 4133898 3932787 3746135 3572649
58768 3572649 3412024 3263251 3124721 2995756 2876546 2766640 2664828 2570526 2484030 2405351
58758 2405351 2333885 2269207 2211185 2159430 2113495 2073355 2038761 2008552 1981666 1958381 1939435
$$ packed form
58823E514961K69424K90747L13682L38523L64664L92266M22590M55829M90244
58814H852930N24119N56876N87505O13591O32750O43511O43917O30787O01404
58805A4287390N54781M90748M09411L12454K03790Q8113l0104j45986k54504l52281
58795A5563812m38024n10666n68609o11325o40114o56406o60788o54329o39319
58786A0184232o17821n90850n59651n26308m92359m58115m24047l91371l60715
58777E762995l31674l04343k79691k57790k37426k18173k01111j86652j73486
58768C572649j60625j48773j38530j28965j19210j09906j01812r4302q6496p8679
58758B405351p1466o4678n8022n1755m5935m0140l4594l0209k6886k3285j8946
$$ plain form
58747 1939435 1924397 1912146 1902432 1895540 1890771 1886632 1882211 1877022 1869875 1859371 1845317 1828325 1808328
58734 1808328 1784921 1758708 1730733 1700866 1668424 1634187 1600050 1566754 1533647 1500618 1468445
58723 1468445 1437102 1405555 1373664 1342714 1313591 1285816 1258741 1232396 1206811 1181797 1157792
58712 1157792 1135785 1116111 1098275 1081990 1067259 1053481 1039745 1026053 1013040 1000577 987956
58701 987956 975441 964148 954275 944865 935441 926443 917926 909235 900255 891645 883644 875924 868768 863070
58687 863070 858896 855264 851448 847320 842441 836262 829337 822972 817548 812483 807805 804321 802224 801086
58673 801086 801173 803146 806319 808921 810304 811325 812471 813370 814359 816659 820494 824630 828188 831312 833810
58658 833810 834959 835124 835754 837160 837977 837444 836550 836370 836953 838566 842282 848522 856515 865951 877654 891875
$$ packed form
58747A939435j5038j2251r714o892m769m139m421n189p147j0504j4054j6992j9997
58734A808328k3407k6213k7975k9867l2442l4237l4137l3296l3107l3029l2173
58723A468445l1343l1547l1891l0950k9123k7775k7075k6345k5585k5014k4005
58712A157792k2007j9674j7836j6285j4731j3778j3736j3692j3013j2463j2621
58701I87956j2515j1293r873r410r424q998q517q691q980q610q001p720p156n698
58687H63070m174l632l816m128m879o179o925o365n424n065m678l484k097j138
58673H01086Q7J973L173K602J383J021J146Q99R89K300L835M136L558L124K498
58658H33810J149J65O30J406Q17n33q94j80N83J613L716O240P993R436J1703J4221
$$ plain form
58642 891875 907505 923809 941494 961324 983127 1006972 1033813 1064213 1097749 1134392 1174973
58631 1174973 1219614 1267346 1318170 1373992 1436611 1506271 1582982 1667661 1760924 1862363 1972194
58620 1972194 2092278 2224382 2368700 2525075 2694196 2876215 3069244 3270178 3475651
58611 3475651 3680892 3878785 4061412 4221838 4353737 4450974 4509275 4527802 4508161 4452845
58601 4452845 4365634 4252264 4118935 3970375 3810113 3641909 3469897 3297761 3128477 2964349
58591 2964349 2806791 2656765 2515743 2385283 2265423 2154752 2052663 1960251 1878303 1805763
58581 1805763 1741067 1683818 1634214 1591877 1556177 1526667 1502369 1481681 1463830 1449445 1438872
58570 1438872 1430927 1424133 1418175 1413335 1409476 1406407 1404279 1402700 1400194 1395112 1386414 1373320 1355396
$$ packed form
58642H91875J5630J6304J7685J9830K1803K3845K6841L0400L3536L6643M0581
58631A174973M4641M7732N0824N5822O2619O9660P6711Q4679R3263J01439J09831
58620A972194J20084J32104J44318J56375J69121J82019J93029K00934K05473
58611C475651K05241J97893J82627J60426J31899R7237N8301J8527j9641n5316
58601D452845q7211j13370j33329j48560j60262j68204j72012j72136j69284j64128
58591B964349j57558j50026j41022j30460j19860j10671j02089r2412q1948p2540
58581A805763o4696n7249m9604m2337l5700k9510k4298k0688j7851j4385j0573
58570A438872p945o794n958m840l859l069k128j579k506n082q698j3094j7924
$$ plain form
58557 1355396 1333422 1308961 1282586 1253817 1223119 1192436 1163157 1135132 1108332 1083722 1061612
58546 1061612 1040872 1020931 1003062 988457 976394 965442 955250 945985 937239 928635 920429 912586
58534 912586 904351 895517 886799 878103 867900 855377 841821 828812 816362 803849 791393 779190
58522 779190 766794 754236 742661 732866 724383 716772 710370 704953 699335 693295 688217 684738 681528
58509 681528 677658 674384 673118 673311 673873 675069 677403 680129 682547 685421 689608 694638 700196 707513 717539
58494 717539 729052 740301 751365 763329 776264 789621 803392 817309 830006 840474 849289 857085
58482 857085 863162 866938 869355 871327 872188 871186 869005 866220 861821 855064 847363 840449 833954 826555
58468 826555 818109 808887 798159 785550 772591 760923 750086 738865 727541 716950 706655 696063
$$ packed form
58557A355396k1974k4461k6375k8769l0698l0683k9279k8025k6800k4610k2110
58546A061612k0740j9941j7869j4605j2063j0952j0192r265q746q604q206p843
58534I12586q235q834q718q696j0203j2523j3556j3009j2450j2513j2456j2203
58522G79190j2396j2558j1575r795q483p611o402n417n618o040n078l479l210
58509F81528l870l274j266J93N62J196K334K726K418K874M187N030N558P317J0026
58494G17539J1513J1249J1064J1964J2935J3357J3771J3917J2697J0468Q815P796
58482H57085O077L776K417J972Q61j002k181k785m399o757p701o914o495p399
58468H26555q446r222j0728j2609j2959j1668j0837j1221j1324j0591j0295j0592
$$ plain form
58456 696063 686162 678135 671341 664534 658003 652669 648276 644276 641243 639544 637917 635290 632722 631654
58442 631654 631632 631738 632779 635865 640271 644886 650316 657189 663825 668169 670829 673691 676661 678374 679079
58427 679079 680199 681866 683342 685074 687945 691321 694148 697116 701456 706548 711063 715568 721610 729034
58413 729034 736497 743758 751307 758650 765155 771517 778237 783875 787060 788918 791089 792814 792542 791032
58399 791032 790004 789029 786653 783422 780780 778125 774008 769300 766145 764634 763408 762580 763099 764255 764889
58384 764889 766068 769406 773731 776646 778447 781128 784402 786296 786973 788393 790581 791784 792020 793147 795546
58369 795546 797982 800531 804592 810139 815808 821343 827256 832771 836980 841229 847351 854411 860308 865606
58355 865606 872444 880750 888954 897401 907262 917092 924436 930081 936680 943870 948899 951535 954177 957489
$$ packed form
58456F96063r901q027o794o807o531n334m393m000l033j699j627k627k568j068
58442F31654k2J06J041L086M406M615N430O873O636M344K660K862K970J713P05
58427F79079J120J667J476J732K871L376K827K968M340N092M515M505O042P424
58413G29034P463P261P549P343O505O362O720N638L185J858K171J725k72j510
58399G91032j028r75k376l231k642k655m117m708l155j511j226q28N19J156O34
58384G64889J179L338M325K915J801K681L274J894O77J420K188J203K36J127K399
58369G95546K436K549M061N547N669N535N913N515M209M249O122P060N897N298
58355H65606O838Q306Q204Q447R861R830P344N645O599P190N029K636K642L312
$$ plain form
58341 957489 960085 962221 965654 970046 973582 976915 982384 989657 996255 1002108 1009365 1018049 1026240 1034266
58327 1034266 1044215 1055541 1065744 1075229 1086821 1100506 1113463 1125356 1138693 1153798 1168385 1182449
58315 1182449 1198513 1216508 1233313 1248025 1262935 1278682 1293262 1306427 1320243 1334691 1347516
58304 1347516 1358986 1371896 1386339 1399535 1411423 1425203 1441657 1458103 1473774 1491014 1510352
58293 1510352 1529698 1549207 1571589 1596701 1621276 1644856 1670566 1699137 1727860 1756296 1787243
58282 1787243 1821086 1855127 1889566 1928117 1971576 2016832 2063251 2113678 2167967 2222054 2274684
58271 2274684 2328355 2382270 2431471 2474726 2516260 2557905 2596767 2632552 2669669 2709608 2748684
58260 2748684 2785928 2825986 2871494 2919772 2969679 3024442 3085066 3148281 3213626 3285129 3363554
$$ packed form
58341I57489K596K136L433M392L536L333N469P273O598N853P257Q684Q191Q026
58327A034266R949J1326J0203R485J1592J3685J2957J1893J3337J5105J4587J4064
58315A182449J6064J7995J6805J4712J4910J5747J4580J3165J3816J4448J2825
58304A347516J1470J2910J4443J3196J1888J3780J6454J6446J5671J7240J9338
58293A510352J9346J9509K2382K5112K4575K3580K5710K8571K8723K8436L0947
58282A787243L3843L4041L4439L8551M3459M5256M6419N0427N4289N4087N2630
58271B274684N3671N3915M9201M3255M1534M1645L8862L5785L7117L9939L9076
58260B748684L7244M0058M5508M8278M9907N4763O0624O3215O5345P1503P8425
$$ plain form
58249 3363554 3444734 3527890 3617491 3714531 3814592 3917049 4027139 4146153 4268946 4394152
58239 4394152 4527153 4669846 4817662 4970104 5133562 5309978 5493792 5684154 5888566
58230 5888566 6110061 6342934 6586101 6848079 7133293 7436451 7756517 8102904 8481473
58221 8481473 8888279 9324072 9800690 10325843 10896663 11516209 12200880 12963703 13807566
58212 13807566 14744301 15802990 17010227 18381626 19942854 21736899 23797097 26134301
58204 26134301 28763362 31717731 35023903 38691200 42749063 47271475 52351773 58092014
58196 58092014 64643455 72222399 81064769 91420152 103635920 118199607 135648244
58189 135648244 156465512 181011387 209210869 239858510 270098071 295924778 313723568
$$ packed form
58249C363554Q1180Q3156Q9601R7040J00061J02457J10090J19014J22793J25206
58239D394152J33001J42693J47816J52442J63458J76416J83814J90362K04412
58230E888566K21495K32873K43167K61978K85214L03158L20066L46387L78569
58221H481473M06806M35793M76618N25153N70820O19546O84671P62823Q43863
58212A3807566R36735J058689J207237J371399J561228J794045K060198K337204
58204B6134301K629061K954369L306172L667297M057863M522412N080298N740241
58196E8092014O551441P578944Q842370J0355383J2215768J4563687J7448637
58189A35648244K0817268K4545875K8199482L0647641L0239561K5826707J7798790
$$ plain form
58182 313723568 321758734 320540711 312064872 298719615 282499134 264651639 245716157
58175 245716157 225875462 205374506 184683056 164370591 144955569 126887109 110549047
58168 110549047 96185655 83844254 73430459 64797151 57764439 52113762 47634404
58161 47634404 44180218 41660237 39999252 39145055 39087402 39793223 41076060 42538901 43677756
58152 43677756 44078395 43564606 42214045 40260614 37963678 35518276 33030212 30535925
58144 30535925 28040238 25554216 23114897 20775523 18582676 16568685 14759241 13172360
58136 13172360 11806362 10639886 9648074 8810871 8105145 7501807 6977165 6518958 6117184
58127 6117184 5757858 5430413 5132517 4862234 4612862 4380065 4166299 3973022 3795394
$$ packed form
58182C13723568Q035166j218023q475839j3345257j6220481j7847495j8935482
58175B45716157j9840695k0500956k0691450k0312465j9415022j8068460j6338062
58168A10549047j4363392j2341401j0413795q633308p032712n650677m479358
58161D7634404l454186k519981j660985q54197n7653P05821J282837J462841J138855
58152D3677756M00639n13789j350561j953431k296936k445402k488064k494287
58144C0535925k495687k486022k439319k339374k192847k013991j809444j586881
58136A3172360j365998j166476r91812q37203p05726o03338n24642m58207m01774
58127F117184l59326l27445k97896k70283k49372k32797k13766j93277j77628
$$ plain form
58118 3795394 3629389 3477231 3340917 3216786 3101186 2995196 2898962 2807410 2716424 2627837
58108 2627837 2543986 2462918 2383225 2307954 2239100 2173421 2108070 2045418 1988128 1934477 1882651
58097 1882651 1834737 1792273 1752604 1713655 1677470 1645097 1612891 1578150 1543622 1512107 1481283
58086 1481283 1448321 1415090 1384114 1353565 1320988 1288176 1257685 1228163 1197611 1167868 1141346
58075 1141346 1116522 1090993 1065962 1043553 1022693 1001767 982436 966688 952862 938545 924730
58064 924730 913306 903096 892240 881857 873574 865933 856987 847953 840593 833481 824573 815035 806783
58051 806783 798599 788512 777817 768875 760927 751896 742505 734929 729020 723323 718245 714856 712203 709009
58037 709009 706388 705829 706240 706120 706765 710093 714985 719072 722465 726487 730341 732420 733471 735208 737072
$$ packed form
58118C795394j66005j52158j36314j24131j15600j05990r6234r1552r0986q8587
58108B627837q3851q1068p9693p5271o8854o5679o5351o2652n7290n3651n1826
58097A882651m7914m2464l9669l8949l6185l2373l2206l4741l4528l1515l0824
58086A481283l2962l3231l0976l0549l2577l2812l0491k9522l0552k9743k6522
58075A141346k4824k5529k5031k2409k0860k0926j9331j5748j3826j4317j3815
58064I24730j1424j0210j0856j0383q283p641q946r034p360p112q908r538q252
58051H06783q184j0087j0695q942p948r031r391p576n909n697n078l389k653l194
58037G09009k621n59M11j20O45L328M892M087L393M022L854K079J051J737J864
$$ plain form
58022 737072 737566 737442 738472 740218 741056 741159 741585 741670 740303 738538 737966 737678 735798 732910 731040 730341 729658
58005 729658 729300 730343 732121 733241 734186 736218 738656 739871 739942 739659 737953 733145 725817 717809 709366
57990 709366 700013 691140 684706 680068 674973 669075 663816 659600 655852 653203 652752 653656 654142 654436 656073
57975 656073 658790 660796 661770 662960 664575 665591 665955 666613 667515 667830 667867 668631 669846 670503 670987 672546 675174
57958 675174 678136 681928 687361 693280 697628 700373 703031 705736 707260 707581 707893 708249 707651 706364 705729
57943 705729 705653 704646 702381 699872 697042 692420 685558 677661 669476 660489 650500 640140 629551 618207
57929 618207 606206 594194 582011 569068 556028 544410 534488 525121 515664 506616 498539 491850 487408
57916 487408 485736 485856 486418 487609 490501 495073 500527 506974 514925 523634 531914 540158 549550 559618
$$ packed form
58022G37072M94j24J030J746Q38J03M26Q5j367j765n72k88j880k888j870o99o83
58005G29658l58J043J778J120R45K032K438J215P1k83j706m808p328q008q443
57990G09366r353q873o434m638n095n898n259m216l748k649m51R04M86K94J637
57975F56073K717K006R74J190J615J016L64O58R02L15L7P64J215O57M84J559K628
57958F75174K962L792N433N919M348K745K658K705J524L21L12L56n98j287o35
57943G05729p6j007k265k509k830m622o862p897q185q987r989j0360j0589j1344
57929F18207j2001j2012j2183j2943j3040j1618r922r367r457r048q077o689m442
57916D87408j672J20N62J191K892M572N454O447P951Q709Q280Q244R392J0068
$$ plain form
57902 559618 568608 575977 582484 588172 592371 595467 598470 600914 601319 599621 597042 593664 588434 581603
57888 581603 574874 568908 562765 556088 549686 543739 537577 531629 527462 525389 523955 522313 521261 521452
57874 521452 522431 523953 526547 530169 533865 537241 540811 544636 548204 551787 556197 560977 564636 566931
57860 566931 569043 571210 572171 571458 570315 569617 568637 566600 563868 560912 557614 554202 551449 549362 547042
57845 547042 544233 541583 539047 535730 531752 528622 527148 526489 525738 524878 523659 521233 517576 513712 509854
57830 509854 504858 498172 490739 483245 474999 465395 455127 445085 435345 425920 417247 409230 401110 392919
57816 392919 385793 380201 375237 370253 365816 362399 359604 357435 356879 358296 360547 362593 364762 367628
57802 367628 370996 374958 380682 389024 399273 410172 421236 432326 442955 452877 462412 471461 479161
$$ packed form
57902E59618Q990P369O507N688M199L096L003K444M05j698k579l378n230o831
57888E81603o729n966o143o677o402n947o162n948m167k073j434j642j052J91
57874E21452R79J522K594L622L696L376L570L825L568L583M410M780L659K295
57860E66931K112K167R61p13j143o98r80k037k732k956l298l412k753k087k320
57845E47042k809k650k536l317l978l130j474o59p51q60j219k426l657l864l858
57830E09854m996o686p433p494q246r604j0268j0042r740r425q673q017q120q191
57816C92919p126n592m964m984m437l417k795k169n56J417K251K046K169K866
57802C67628L368L962N724Q342J0249J0899J1064J1090J0629R922R535R049P700
$$ plain form
57789 479161 485247 490769 496720 502843 508393 513104 516738 518727 518987 518213 516815 514480 511182 507445 503131
57774 503131 497259 489716 481874 474805 468057 460964 453896 447383 441232 435416 430703 427499 425150 423261
57760 423261 422579 423618 425517 427259 429013 431290 433825 436312 439242 442942 446653 449596 452123 454823
57746 454823 457364 459190 460541 461819 462841 463670 465258 468109 471166 473200 474591 476639 479766 483491
57732 483491 487563 491985 496436 500749 505613 511900 519715 528800 539223 550874 562966 574967 587439
57719 587439 601099 615692 630690 646449 663604 681865 700458 719381 739316 760686 783627
57708 783627 808437 835234 863605 893428 925675 961588 1001455 1044913 1092012 1143287 1199247
57697 1199247 1260561 1328298 1403301 1485702 1575684 1674251 1782694 1901900 2032809 2176832
$$ packed form
57789D79161O086N522N951O123N550M711L634J989K60p74j398k335l298l737m314
57774E03131n872p543p842p069o748p093p068o513o151n816m713l204k349j889
57760D23261o82J039J899J742J754K277K535K487K930L700L711K943K527K700
57746D54823K541J826J351J278J022Q29J588K851L057K034J391K048L127L725
57732D83491M072M422M451M313M864O287P815R085J0423J1651J2092J2001J2472
57719E87439J3660J4593J4998J5759J7155J8261J8593J8923J9935K1370K2941
57708G83627K4810K6797K8371K9823L2247L5913L9867M3458M7099N1275N5960
57697A199247O1314O7737P5003Q2401Q9982R8567J08443J19206J30909J44023
$$ plain form
57687 2176832 2334971 2506930 2691636 2887836 3093308 3303968 3514471 3719128 3911650
57678 3911650 4084963 4232730 4351356 4440447 4502220 4541133 4563274 4574854 4580661 4582854 4578971
57667 4578971 4560134 4513347 4428406 4303607 4145061 3962046 3763865 3559081 3354536 3154225
57657 3154225 2960041 2773659 2597086 2432083 2280237 2143271 2022215 1916720 1826175 1750917
57647 1750917 1691110 1644991 1609698 1583615 1566696 1558738 1558696 1565694 1579511 1600046 1627354 1662167
57635 1662167 1705317 1756646 1815480 1882125 1957943 2044001 2140614 2248122 2367011 2497130 2637575
57624 2637575 2787360 2945243 3108635 3273198 3433366 3582614 3713643 3819528 3895136 3937340
57614 3937340 3944615 3917448 3858829 3773082 3663995 3534703 3388958 3231388 3066510 2898349
$$ packed form
57687B176832J58139J71959J84706J96200K05472K10660K10503K04657J92522
57678C911650J73313J47767J18626Q9091O1773L8913K2141J1580N807K193l883
57667D578971j8837m6787q4941j24799j58546j83015j98181k04784k04545k00311
57657C154225j94184j86382j76573j65003j51846j36966j21056j05495r0545p5258
57647A750917n9807m6119l5293k6083j6919p958m2O998J3817K0535K7308L4813
57635A662167M3150N1329N8834O6645P5818Q6058R6613J07508J18889J30119J40445
57624B637575J49785J57883J63392J64563J60168J49248J31029J05885P5608M2204
57614C937340P275k7167n8619q5747j09087j29292j45745j57570j64878j68161
$$ plain form
57604 2898349 2730834 2567505 2410713 2261887 2122434 1993437 1874633 1764854 1663618
57595 1663618 1571368 1488146 1413057 1345208 1284210 1229521 1180192 1135563 1095430 1059315 1026305
57584 1026305 995868 968182 943421 921318 901584 884165 868796 854753 841219 827695 814212
57573 814212 801516 790795 782657 776561 771680 767924 765499 764005 762939 762696 764042 766833 770320 774605
57559 774605 780622 788654 797966 808093 819450 832450 846954 862917 880724 900592 922364 946120
57547 946120 972302 1001079 1032339 1066461 1104370 1146679 1193511 1245235 1302472 1365225 1432989
57536 1432989 1506104 1586152 1674540 1771398 1876253 1988917 2109047 2235376 2365950 2498687
57526 2498687 2630922 2758547 2876080 2977690 3058206 3113718 3141910 3142220 3115805 3065297 2994250
$$ packed form
57604B898349j67515j63329j56792j48826j39453j28997j18804j09779j01236
57595A663618r2250q3222p5089o7849o0998n4689m9329m4629m0133l6115l3010
57584A026305l0437k7686k4761k2103j9734j7419j5369j4043j3534j3524j3483
57573H14212j2696j0721q138o096m881l756k425j494j066k43J346K791L487M285
57559G74605O017Q032R312J0127J1357J3000J4504J5963J7807J9868K1772K3756
57547I46120K6182K8777L1260L4122L7909M2309M6832N1724N7237O2753O7764
57536A432989P3115Q0048Q8388R6858J04855J12664J20130J26329J30574J32737
57526B498687J32235J27625J17533J01610Q0516N5512K8192L10k6415n0508p1047
$$ plain form
57515 2994250 2906358 2805023 2693492 2574945 2452163 2327558 2203869 2084347 1971606 1866585
57505 1866585 1769163 1679425 1597749 1524072 1457923 1399083 1347582 1303265 1265913 1235426 1211201
57494 1211201 1191721 1175664 1163130 1154975 1151358 1151885 1156756 1166511 1180762 1198408 1219134 1243636
57482 1243636 1272359 1305195 1342505 1385277 1434027 1488583 1549214 1616918 1692317 1775250 1865728
57471 1865728 1964262 2070802 2184261 2303412 2427196 2553520 2678451 2797068 2904399 2995243
57461 2995243 3064198 3106979 3121752 3109038 3070771 3009573 2928284 2829720 2717074 2594291 2465348
57450 2465348 2333176 2200064 2068982 1943363 1825298 1714931 1612031 1517243 1431284 1353799
57440 1353799 1283730 1220409 1163754 1113780 1070214 1032283 998739 968491 941289 917347 896446
$$ packed form
57515B994250q7892j01335j11531j18547j22782j24605j23689j19522j12741j05021
57505A866585r7422q9738q1676p3677o6149n8840n1501m4317l7352l0487k4225
57494A211201j9480j6057j2534q155l617N27M871R755J4251J7646K0726K4502
57482A243636K8723L2836L7310M2772M8750N4556O0631O7704P5399Q2933R0478
57471A865728R8534J06540J13459J19151J23784J26324J24931J18617J07331R0844
57461B995243O8955M2781J4773j2714l8267o1198q1289r8564j12646j22783j28943
57450B465348j32172j33112j31082j25619j18065j10367j02900r4788q5959p7485
57440A353799p0069o3321n6655m9974m3566l7931l3544l0248k7202k3942k0901
$$ plain form
57429 896446 878016 861887 848117 836135 825016 814628 805611 798195 792041 787245 784331 783040 782335
57416 782335 781878 782387 784173 786557 789179 792711 797525 802675 806922 810036 812578 815217 818666 823400 828926
57401 828926 834185 839057 844461 850651 856636 861867 867171 873126 878675 882457 884651 886487 888712 891404
57387 891404 894540 897693 899892 900763 901350 902960 905730 909045 912680 916647 920615 924381 928422 933127 938069
57372 938069 942819 947838 953690 959965 965992 972021 978702 985884 993084 1000755 1009950 1020826 1032421 1043768
57358 1043768 1054490 1064517 1074144 1084201 1095320 1107021 1118260 1128776 1139282 1150339 1161736
57347 1161736 1173004 1184078 1195371 1207486 1220779 1234983 1249475 1264071 1279195 1295131 1311620
57336 1311620 1328428 1345619 1362994 1379966 1396455 1413180 1430561 1448025 1465024 1482012 1499807
$$ packed form
57429H96446j8430j6129j3770j1982j1119j0388r017p416o154m796k914j291p05
57416G82335m57N09J786K384K622L532M814N150M247L114K542K639L449M734N526
57401H28926N259M872N404O190N985N231N304N955N549L782K194J836K225K692
57387H91404L136L153K199Q71N87J610K770L315L635L967L968L766M041M705M942
57372I38069M750N019N852O275O027O029O681P182P200P671R195J0876J1595J1347
57358A043768J0722J0027R627J0057J1119J1701J1239J0516J0506J1057J1397
57347A161736J1268J1074J1293J2115J3293J4204J4492J4596J5124J5936J6489
57336A311620J6808J7191J7375J6972J6489J6725J7381J7464J6999J6988J7795
$$ plain form
57325 1499807 1518648 1538536 1559746 1582238 1605208 1628027 1651016 1674494 1697718 1719769 1741041
57314 1741041 1762900 1786118 1810454 1835440 1860835 1886561 1912835 1940098 1968423 1997421 2027128
57303 2027128 2058291 2091282 2125537 2160650 2197159 2235467 2274927 2314838 2355464 2397163 2439545
57292 2439545 2482644 2527910 2576618 2628042 2680650 2734423 2790485 2848994 2909022 2970082 3032161
57281 3032161 3094437 3155628 3215472 3274261 3330863 3382822 3428735 3469172 3504961 3535885 3561515
57270 3561515 3582235 3598972 3612737 3624721 3636098 3647503 3659325 3672391 3687604 3705058 3724391
57259 3724391 3745792 3769601 3795115 3820963 3846680 3872733 3898982 3924339 3948203 3971155 3994005
57248 3994005 4017316 4042169 4070270 4102705 4139267 4179304 4222505 4268642 4317434 4369011 4423849
$$ packed form
57325A499807J8841J9888K1210K2492K2970K2819K2989K3478K3224K2051K1272
57314A741041K1859K3218K4336K4986K5395K5726K6274K7263K8325K8998K9707
57303B027128L1163L2991L4255L5113L6509L8308L9460L9911M0626M1699M2382
57292B439545M3099M5266M8708N1424N2608N3773N6062N8509O0028O1060O2079
57281C032161O2276O1191N9844N8789N6602N1959M5913M0437L5789L0924K5630
57270C561515K0720J6737J3765J1984J1377J1405J1822J3066J5213J7454J9333
57259C724391K1401K3809K5514K5848K5717K6053K6249K5357K3864K2952K2850
57248C994005K3311K4853K8101L2435L6562M0037M3201M6137M8792N1577N4838
$$ plain form
57237 4423849 4481881 4542225 4603930 4666430 4729144 4791240 4851965 4910755 4967165 5021209 5073551
57226 5073551 5124758 5174589 5222802 5270277 5318387 5367411 5416575 5465557 5514965 5565364 5616779
57215 5616779 5669223 5722837 5777522 5833227 5890502 5949871 6010820 6072251 6133782 6195684 6257805
57204 6257805 6319666 6381443 6443696 6506170 6567942 6628663 6688680 6748049 6806563 6864457 6921867
57193 6921867 6977741 7030555 7079905 7126113 7168583 7206215 7239387 7269817 7298340 7324520 7348612
57182 7348612 7372053 7395507 7418231 7440095 7462587 7486933 7512560 7538349 7564253 7590792 7617913
57171 7617913 7645030 7671409 7696028 7718058 7737890 7756703 7774612 7790199 7802104 7809863 7812963 7810529
57159 7810529 7802548 7790143 7773934 7753110 7726547 7693629 7653550 7605087 7547746 7482047 7408248
$$ packed form
57237D423849N8032O0344O1705O2500O2714O2096O0725N8790N6410N4044N2342
57226E073551N1207M9831M8213M7475M8110M9024M9164M8982M9408N0399N1415
57215E616779N2444N3614N4685N5705N7275N9369O0949O1431O1531O1902O2121
57204F257805O1861O1777O2253O2474O1772O0721O0017N9369N8514N7894N7410
57193F921867N5874N2814M9350M6208M2470L7632L3172L0430K8523K6180K4092
57182G348612K3441K3454K2724K1864K2492K4346K5627K5789K5904K6539K7121
57171G617913K7117K6379K4619K2030J9832J8813J7909J5587J1905P759L100k434
57159G810529p981j2405j6209k0824k6563l2918m0079m8463n7341o5699p3799
$$ plain form
57148 7408248 7326093 7236479 7142286 7046932 6953174 6863667 6781286 6708026 6644441 6590603 6546554
57137 6546554 6511483 6483677 6461666 6444118 6428290 6410066 6386273 6355908 6319054 6276246 6229476
57126 6229476 6182189 6137453 6097234 6063656 6039107 6024259 6017203 6015129 6015750 6017274 6019161 6023643 6034934
57113 6034934 6056416 6089940 6137571 6201729 6283477 6383406 6505127 6656087 6844836 7079863
57103 7079863 7370977 7728697 8162034 8680575 9300314 10045637 10946681 12039150 13366917
57094 13366917 14979864 16927726 19258745 22021011 25255008 28980982 33197096 37884738
57086 37884738 43000564 48464301 54180967 60091686 66174762 72346820 78343787 83723409
57078 83723409 88021209 90936205 92406871 92557060 91589556 89700486 87040502 83721440
$$ packed form
57148G408248q2155q9614r4193r5354r3758q9507q2381p3260o3585n3838m4049
57137F546554l5071k7806k2011j7548j5828j8224k3793l0365l6854m2808m6770
57126F229476m7287m4736m0219l3578k4549j4848p056k074O21J524J887M482J1291
57113F034934K1482L3524M7631O4158Q1748R9929J21721J50960J88749K35027
57103G079863K91114L57720M33337N18541O19739P45323R01044J092469J327767
57094A3366917J612947J947862K331019K762266L233997L725974M216114M687642
57086C7884738N115826N463737N716666N910719O083076O172058N996967N379622
57078H3723409M297800K914996J470666J50189r67504j889070k659984l319062
$$ plain form
57070 83721440 79850571 75557220 70985405 66264337 61489567 56727334 52028318 47438178
57062 47438178 43004657 38780756 34819698 31164658 27842619 24864760 22227828 19914749
57054 19914749 17898103 16146062 14625975 13305237 12153179 11143771 10255513 9469399
57046 9469399 8768962 8141741 7578308 7069706 6607439 6185334 5799069 5443879 5114676
57037 5114676 4808327 4523772 4259772 4014311 3786260 3575713 3382248 3204347 3040713
57028 3040713 2890771 2753732 2628504 2514613 2411933 2319416 2235408 2159320 2091691 2032483
57018 2032483 1980537 1934900 1895501 1862282 1834738 1812564 1796009 1785546 1781932 1786325 1799517 1821443
57006 1821443 1852536 1895116 1952353 2026678 2120744 2238445 2380744 2538236 2689569 2809788
$$ packed form
57070H3721440l870869m293351m571815m721068m774770m762233m699016m590140
57062D7438178m433521m223901l961058l655040l322039k977859k636932k313079
57054A9914749k016646j752041j520087j320738j152058j009408q88258p86114
57046I469399p00437o27221n63433n08602m62267m22105l86265l55190l29203
57037E114676l06349k84555k64000k45461k28051k10547j93465j77901j63634
57028C040713j49942j37039j25228j13891j02680r2517q4008p6088o7629n9208
57018B032483n1946m5637l9399l3219k7544k2174j6555j0463l614M393J3192K1926
57006A821443L1093M2580N7237P4325R4066J17701J42299J57492J51333J20219
$$ plain form
56996 2809788 2881587 2900353 2871925 2807663 2719906 2618333 2508330 2392362 2272635 2152316
56986 2152316 2034940 1923600 1820686 1727660 1644754 1571043 1504930 1444634 1388647 1336137 1286959
56975 1286959 1241145 1198461 1158555 1121349 1087027 1055663 1027052 1001062 978107 959094 944786
56964 944786 935234 929973 928604 931020 937174 947053 960758 978059 997605 1016915 1033290 1044566 1049259
56951 1049259 1046912 1038571 1026208 1011118 993377 973183 951999 931660 912858 895302 879077 865061
56939 865061 854071 846306 841730 840632 843785 852268 866919 887610 913051 941269 969804 995300
56927 995300 1013828 1022567 1021271 1011772 996334 976738 954274 929717 903360 875662 847766 820961
56915 820961 795788 772207 750404 730842 713621 698317 684519 672185 661480 652586 645525 639895
$$ packed form
56996B809788P1799J8766k8428o4262q7757j01573j10003j15968j19727j20319
56986B152316j17376j11340j02914r3026q2906p3711o6113o0296n5987n2510m9178
56975A286959m5814m2684l9906l7206l4322l1364k8611k5990k2955j9013j4308
56964I44786r552n261j369K416O154R879J3705J7301J9546J9310J6375J1276M693
56951A049259k347q341j2363j5090j7741k0194k1184k0339j8802j7556j6225j4016
56939H65061j0990p765m576j098L153Q483J4651K0691K5441K8218K8535K5496
56927I95300J8528Q739j296r499j5438j9596k2464k4557k6357k7698k7896k6805
56915H20961k5173k3581k1803j9562j7221j5304j3798j2334j0705q894p061n630
$$ plain form
56903 639895 634990 630489 626773 624253 622700 621689 621404 622451 625007 628680 633083 638121 643887 650844
56889 650844 660115 673045 690178 710794 733285 755692 775920 791931 802164 806091 804557 799440
56877 799440 792513 784496 775487 766230 758255 752609 749189 747759 748998 753938 762925 775897 793455 816964
56863 816964 847701 886422 933526 988820 1050609 1114949 1175787 1226248 1260875 1277728 1278740 1268012
56851 1268012 1249707 1226865 1201053 1172598 1141719 1109887 1079672 1053176 1031401 1015544 1007914
56840 1007914 1010801 1025061 1050645 1088068 1138740 1204278 1285705 1381828 1486639 1588625 1674357
56829 1674357 1733936 1763675 1765179 1743431 1705080 1656175 1600126 1538032 1470996 1401477 1332529
56818 1332529 1266776 1206501 1153902 1110748 1078193 1057229 1048916 1053958 1072468 1104423 1149881 1208027
$$ packed form
56903F39895m905m501l716k520j553j011k85J047K556L673M403N038N766O957
56889F50844R271J2930J7133K0616K2491K2407K0228J6011J0233L927j534n117
56877G99440o927q017r009r257p975n646l420j430J239M940Q987J2972J7558K3509
56863H16964L0737L8721M7104N5294O1789O4340O0838N0461L4627J6853J012j0728
56851A268012j8305k2842k5812k8455l0879l1832l0215k6496k1775j5857p630
56840A007914K887J4260K5584L7423N0672O5538Q1427R6123J04811J01986Q5732
56829A674357N9579K9739J504k1748l8351m8905n6049o2094o7036o9519o8948
56818A332529o5753o0275n2599m3154l2555k0964q313N042J8510L1955M5458N8146
$$ plain form
56806 1208027 1275408 1344792 1406089 1449668 1470262 1468424 1448491 1415406 1373150 1324724 1272190
56795 1272190 1216680 1159132 1101182 1044932 992156 944305 903015 869860 845600 830170 823366
56784 823366 825044 834872 852502 877704 909371 944103 976327 1000327 1012326 1011274 998544 976966
56772 976966 949512 918290 884509 848960 812262 774932 737676 701487 667240 635484 606783
56761 606783 581725 560236 541534 525279 512082 502174 494204 486371 478368 471262 465729 461351 457525
56748 457525 454070 450928 448055 445655 443835 442085 439800 437248 435264 434017 432786 430931 428455 425630
56734 425630 422721 420123 418152 416679 415373 414124 412797 410980 408616 406463 405165 404225 402788 401043
56720 401043 399797 398945 397590 395633 394026 393318 393013 392605 392235 392027 391722 391263 390943 390667 389863 388428 386987
$$ packed form
56806A208027O7381O9384O1297M3579K0594j838j9933l3085m2256m8426n2534
56795A272190n5510n7548n7950n6250n2776m7851m1290l3155k4260j5430o804
56784H23366J678R828J7630K5202L1667L4732L2224K4000J1999j052j2730k1578
56772I76966k7454l1222l3781l5549l6698l7330l7256l6189l4247l1756k8701
56761F06783k5058k1489j8702j6255j3197r908p970p833q003p106n533m378l826
56748D57525l455l142k873k400j820j750k285k552j984j247j231j855k476k825
56734D25630k909k598j971j473j306j249j327j817k364k153j298r40j437j745
56720D01043j246q52j355j957j607p08l05m08l70k08l05m59l20k76q04j435j441
$$ plain form
56703 386987 385910 384824 383414 382083 381456 381755 382848 384346 385509 385704 385136 384596 384451 384469 384593 385010 385373
56686 385373 384905 383637 382717 383028 384203 385381 386343 387431 388873 390679 392820 395071 396943 398054 398421
56671 398421 398267 397756 396957 395813 394233 392353 390470 388405 385408 381238 376872 373332 370256 366569 362328
56656 362328 358700 356224 354221 352059 349860 347669 345013 341816 338893 337052 336321 336375 337056 338125 339083
56641 339083 339627 339853 339830 339472 338931 338574 338525 338699 339164 339861 340139 339439 338311 337852 338103 338017 337086 336015 335607
56622 335607 335987 337198 339486 342601 345679 348228 350505 352688 354555 356268 358509 361447 364374 366733
56608 366733 368708 370451 371618 372124 372499 373022 373259 372911 372360 371910 371230 370042 368697 367583 366607 365682 365107
56591 365107 365025 364995 364512 363475 361985 360287 359091 359244 360783 362859 364700 366059 366773 366785 366675 367255 368447
$$ packed form
56703C86987j077j086j410j331o27K99J093J498J163J95n68n40j45J8J24M17L63
56686C85373m68j268r20L11J175J178R62J088J442J806K141K251J872J111L67
56671C98421j54n11p99j144j580j880j883k065k997m170m366l540l076l687m241
56656C62328l628k476k003k162k199k191k656l197k923j841p31N4O81J069R58
56641C39083N44K26k3l58n41l57m9J74M65O97K78p00j128m59K51q6r31j071m08
56622C35607L80J211K288L115L078K549K277K183J867J713K241K938K927K359
56608C66733J975J743J167N06L75N23K37l48n51m50o80j188j345j114r76r25n75
56591C65107q2l0m83j037j490j698j196J53J539K076J841J359P14J2j10N80J192
$$ plain form
56574 368447 369458 370123 371060 372446 373834 375383 377938 381578 385456 389551 395150 402828 411264 418972 426071
56559 426071 433385 440851 447853 454275 460159 465033 468606 471542 474647 477719 479963 481020 480964 479820 477722
56544 477722 475036 471773 467482 462175 456671 451441 445851 439175 431684 424187 417145 410813 405504 401113
56530 401113 397047 393128 389867 387371 384878 381902 378991 376699 374689 372465 370039 367188 363088 357617
56516 357617 352133 347965 344828 341604 338014 334604 331717 329371 327643 326361 324937 323130 321404 320022
56502 320022 318512 316621 314956 314039 313587 313382 313838 314930 315592 315130 314327 314174 314441 314514 314691 315434 316195 316248
56484 316248 316095 316827 318628 320971 323673 326729 329638 332001 334268 336931 339549 341565 343362 345434 347230
56469 347230 348034 348435 349648 351838 354300 356859 359865 363157 366208 369009 371768 374046 375287 375861 376557
$$ packed form
56574C68447J011O65R37J386J388J549K555L640L878M095N599P678Q436P708P099
56559D26071P314P466P002O422N884M874L573K936L105L072K244J057n6j144k098
56544D77722k686l263m291n307n504n230n590o676p491p497p042o332n309m391
56530D01113m066l919l261k496k493k976k911k292k010k224k426k851m100n471
56516C57617n484m168l137l224l590l410k887k346j728j282j424j807j726j382
56502C20022j510j891j665r17m52k05M56J092O62m62q03j53K67P3J77P43P61N3
56484C16248j53P32J801K343K702L056K909K363K267K663K618K016J797K072J796
56469C47230Q04M01J213K190K462K559L006L292L051K801K759K278J241N74O96
$$ plain form
56454 376557 377353 377657 377466 377253 377019 376401 375419 374309 372983 371556 370878 371586 373035 374135 374792 375489 375947
56437 375947 375325 373491 371100 368681 366447 364585 362914 360758 358021 355758 354674 353743 351442 347813 344143
56422 344143 341115 338472 336036 333773 331229 328083 325052 323114 322127 321203 320042 318861 317528 315930 314785
56407 314785 314812 315460 315663 315555 316267 318297 321239 324754 328577 331828 333633 334369 335233 336609 337775 338050
56391 338050 337403 336228 335274 335397 336579 337733 338235 338884 340430 342113 342890 343196 344031 345105 345518 345634 346613
56374 346613 348472 350251 351770 353682 356042 358358 360789 363788 366814 368855 369992 371005 371717 371315 370088
56359 370088 369292 369420 370054 371202 373223 375506 376809 376959 376877 377029 377235 377837 379450 381541 382689 382404 381510
56342 381510 380780 380417 380744 382086 384098 386337 389222 393250 397719 401659 405594 410830 417332 423814 429655
$$ packed form
56454C76557P96L04j91k13k34o18r82j110j326j427o78P08J449J100O57O97M58
56437C75947o22j834k391k419k234j862j671k156k737k263j084r31k301l629l670
56422C44143l028k643k436k263k544l146l031j938r87r24j161j181j333j598j145
56407C14785K7O48K03j08P12K030K942L515L823L251J805P36Q64J376J166K75
56391C38050o47j175r54J23J182J154N02O49J546J683P77L06Q35J074M13J16R79
56374C46613J859J779J519J912K360K316K431K999L026K041J137J013P12m02j227
56359C70088p96J28O34J148K021K283J303J50q2J52K06O02J613K091J148k85q94
56342C81510p30l63L27J342K012K239K885M028M469L940L935N236O502O482N841
$$ plain form
56327 429655 435208 440596 445817 451658 458803 466345 472829 478426 484331 490509 495994 501026 506700 512630
56313 512630 517166 519996 522459 525185 527508 529336 531444 533632 534684 534565 534706 535645 536269 535910 535373 535469
56297 535469 536193 537716 540400 543489 545579 546807 548894 552655 557268 562339 568749 576895 585909 595237
56283 595237 605422 616799 629001 642291 657763 675754 695488 716616 739655 764737 791592
56272 791592 820922 854055 891025 930804 973585 1020920 1073346 1129937 1190610 1256850 1329570
56261 1329570 1408283 1492988 1584940 1684806 1791702 1904661 2023295 2146470 2272011 2398270
56251 2398270 2524385 2648630 2768202 2880910 2985368 3079440 3160604 3228151 3282986 3324998
56241 3324998 3352919 3367100 3370039 3363584 3347949 3324047 3294225 3259721 3219703 3173781 3123257 3068946
$$ packed form
56327D29655N553N388N221N841P145P542O484N597N905O178N485N032N674N930
56313E12630M536K830K463K726K323J828K108K188J052j19J41R39O24l59n37R6
56297E35469P24J523K684L089K090J228K087L761M613N071O410Q146R014R328
56283E95237J0185J1377J2202J3290J5472J7991J9734K1128K3039K5082K6855
56272G91592K9330L3133L6970L9779M2781M7335N2426N6591O0673O6240P2720
56261A329570P8713Q4705R1952R9866J06896J12959J18634J23175J25541J26259
56251B398270J26115J24245J19572J12708J04458R4072Q1164O7547N4835M2012
56241C324998K7921J4181K939o455j5635k3902k9822l4504m0018m5922n0524n4311
$$ plain form
56229 3068946 3009933 2945520 2876368 2802820 2724201 2640714 2553938 2464540 2371640 2275362 2177851
56218 2177851 2080831 1984302 1888608 1795504 1706074 1619812 1536882 1459126 1387627 1321346 1259312
56207 1259312 1202096 1150081 1102381 1058577 1019387 984575 952390 922139 895062 871701 850752
56196 850752 831578 815249 801867 789519 777311 766833 759000 752051 744521 737738 733376 730766 728571
56183 728571 727062 726863 727445 728688 731968 737860 744632 750731 756866 764038 771565 778783 786652 795889 805381
56168 805381 814180 823136 832968 842675 851487 860396 870186 880067 889838 901142 914821 929269 943266
56155 943266 958245 975906 995767 1017039 1040780 1068208 1098952 1132945 1172084 1218092 1270720
56144 1270720 1329858 1397427 1475528 1564890 1666710 1783554 1916325 2062321 2217649 2378937
$$ packed form
56229C068946n9013o4413o9152p3548p8619q3487q6776q9398r2900r6278r7511
56218B177851r7020r6529r5694r3104q9430q6262q2930p7756p1499o6281o2034
56207A259312n7216n2015m7700m3804l9190l4812l2185l0251k7077k3361k0949
56196H50752j9174j6329j3382j2348j2208j0478p833o949p530o783m362k610k195
56183G28571j509j99N82J243L280N892O772O099O135P172P527P218P869R237R492
56168H05381Q799Q956R832R707Q812Q909R790R881R771J1304J3679J4448J3997
56155I43266J4979J7661J9861K1272K3741K7428L0744L3993L9139M6008N2628
56144A270720N9138O7569P8101Q9362J01820J16844J32771J45996J55328J61288
$$ plain form
56134 2378937 2541101 2696798 2840915 2973535 3096717 3210994 3316932 3416629 3510491 3594743
56124 3594743 3664725 3718479 3755244 3773656 3774428 3762112 3740934 3710704 3668923 3614048 3544115 3455422
56112 3455422 3346385 3220791 3084457 2940997 2793505 2647347 2507477 2375020 2249683
56103 2249683 2133372 2028256 1933481 1847165 1769681 1701908 1642208 1588274 1540110 1498352 1461649
56092 1461649 1428454 1399245 1374281 1351534 1329509 1309660 1293354 1279135 1265679 1254456 1246547
56081 1246547 1240018 1233524 1229245 1228879 1230076 1230333 1231083 1234227 1238197 1241391 1246051 1254447 1264538 1273686
56067 1273686 1283250 1295046 1306773 1315861 1324587 1336377 1350125 1363126 1376560 1392867 1410681 1427603
56055 1427603 1445165 1465726 1487276 1506634 1525065 1545426 1566543 1585847 1604780 1626081 1648499
$$ packed form
56134B378937J62164J55697J44117J32620J23182J14277J05938R9697R3862Q4252
56124C594743O9982N3754L6765J8412P72j2316k1178l0230m1781n4875o9933q8693
56112C455422j09037j25594j36334j43460j47492j46158j39870j32457j25337
56103B249683j16311j05116r4775q6316p7484o7773n9700n3934m8164m1758l6703
56092A461649l3195k9209k4964k2747k2025j9849j6306j4219j3456j1223p909
56081A246547o529o494m279l66J197K57P50L144L970L194M660Q396J0091R148
56067A273686R564J1796J1727R088Q726J1790J3748J3001J3434J6307J7814J6922
56055A427603J7562K0561K1550J9358J8431K0361K1117J9304J8933K1301K2418
$$ plain form
56044 1648499 1669731 1691755 1717624 1745766 1773075 1800765 1831543 1864117 1896291 1930247 1968712
56033 1968712 2009172 2048040 2087099 2129524 2173231 2214985 2257413 2304828 2355611 2405970 2457584
56022 2457584 2514028 2573305 2631783 2691840 2757525 2826346 2893754 2962110 3036474 3115219 3193829
56011 3193829 3274331 3361540 3453491 3545400 3639696 3742224 3851842 3963881 4080345 4206213
56001 4206213 4339112 4473554 4611933 4760342 4917247 5077806 5245441 5426956 5620120
55992 5620120 5818800 6026411 6250980 6491017 6740387 7003155 7288754 7596358 7919613
55983 7919613 8263120 8638067 9045301 9479761 9948047 10463943 11030443 11644994 12318872
55974 12318872 13071995 13912910 14845184 15889938 17080535 18439924 19986853 21758546
$$ packed form
56044A648499K1232K2024K5869K8142K7309K7690L0778L2574L2174L3956L8465
56033A968712M0460L8868L9059M2425M3707M1754M2428M7415N0783N0359N1614
56022B457584N6444N9277N8478O0057O5685O8821O7408O8356P4364P8745P8610
56011C193829Q0502Q7209R1951R1909R4296J02528J09618J12039J16464J25868
56001D206213J32899J34442J38379J48409J56905J60559J67635J81515J93164
55992E620120J98680K07611K24569K40037K49370K62768K85599L07604L23255
55983G919613L43507L74947M07234M34460M68286N15896N66500O14551O73878
55974A2318872P53123Q40915R32274J044754J190597J359389J546929J771693
$$ plain form
55966 21758546 23799626 26132053 28763322 31719040 35037475 38739846 42844477 47410427
55958 47410427 52536127 58327968 64917684 72504713 81332933 91640993 103708666 117956035
55950 117956035 134927674 155173426 179170123 207161917 238605802 271413665 301861130
55943 301861130 325731569 340049176 344099873 339164350 327512728 311460833 292796019
55936 292796019 272560967 251204753 228995522 206351576 183851415 162071887 141515759
55929 141515759 122626356 105739560 90993076 78330930 67597298 58593675 51078151
55922 51078151 44790816 39510903 35069267 31314211 28104349 25336382 22945327 20871667
55914 20871667 19053071 17446880 16031590 14781836 13664178 12658073 11757823 10951499
$$ packed form
55966B1758546K041080K332427K631269K955718L318435L702371M104631M565950
55958D7410427N125700N791841O589716P587029Q828220J0308060J2067673J4247369
55950A17956035J6971639K0245752K3996697K7991794L1443885L2807863L0447465
55943C01861130K3870439J4317607M050697m935523j1651622j6051895j8664814
55936B92796019k0235052k1356214k2209231k2643946k2500161k1779528k0556128
55929A41515759j8889403j6886796j4746484j2662146j0733632r003623p515524
55922E1078151o287335n279913m441636l755056l209862k767967k391055k073660
55914B0871667j818596j606191j415290j249754j117658j006105r00250q06324
$$ plain form
55906 10951499 10218219 9547392 8940607 8392708 7889243 7423821 7000117 6615105 6257082
55897 6257082 5921770 5614338 5333848 5070859 4822014 4592451 4382194 4184006 3996097
55888 3996097 3823551 3665764 3515421 3371252 3239195 3119585 3005546 2895488 2795096
55879 2795096 2705257 2619639 2536032 2458841 2388596 2319946 2251995 2190091 2135272 2082060 2028566
55868 2028566 1978905 1933680 1887896 1840495 1796623 1758203 1721248 1684631 1652684 1626843 1603139
55857 1603139 1580112 1560899 1545205 1527329 1504594 1480285 1456218 1429882 1400901 1372865 1346600
55846 1346600 1318731 1288809 1260811 1235752 1209904 1182223 1156443 1133826 1110748 1085654 1061665
55835 1061665 1040161 1018315 995110 973396 953907 933638 912190 893326 878094 862687 845356
$$ packed form
55906A0951499p33280o70827o06785n47899n03465m65422m23704l85012l58023
55897F257082l35312l07432k80490k62989k48845k29563k10257j98188j87909
55888C996097j72546j57787j50343j44169j32057j19610j14039j10058j00392
55879B795096q9839q5618q3607p7191p0245o8650o7951o1904n4819n3212n3494
55868B028566m9661m5225m5784m7401m3872l8420l6955l6617l1947k5841k3704
55857A603139k3027j9213j5694j7876k2735k4309k4067k6336k8981k8036k6265
55846A346600k7869k9922k7998k5059k5848k7681k5780k2617k3078k5094k3989
55835A061665k1504k1846k3205k1714j9489k0269k1448j8864j5232j5407j7331
$$ plain form
55824 845356 829182 815700 801968 786540 772340 760949 749753 737406 726582 718681 711202 702996
55812 702996 696785 693742 690790 686149 682648 682632 684231 685351 686909 689474 691051 690786 690747 691620 690734 686594
55796 686594 681305 676377 670268 662182 654068 646734 638090 627414 617239 608909 600381 590528 581482 574599
55782 574599 568212 561570 556727 554149 550556 543672 535300 527316 518490 507768 496835 486773 475830
55769 475830 463100 450951 441264 432569 423263 414317 406371 397625 387139 377007 368778 360860 351872
55756 351872 343429 337020 331119 323855 315856 308251 300656 293161 287334 283209 278314 271690 265785 262254
55742 262254 259197 254844 250702 248502 247098 245058 243472 243552 244124 243963 244012 244948 245304 244393 244238 246033 247402
55725 247402 245878 242631 240044 238038 235398 232512 230061 227124 223044 219228 216804 214582 211557 209265
$$ packed form
55824H45356j6174j3482j3732j5428j4200j1391j1196j2347j0824p901p479q206
55812G02996o211l043k952m641l501j6J599J120J558K565J577k65l9Q73q86m140
55796F86594n289m928o109q086q114p334q644j0676j0175q330q528r853r046o883
55782E74599o387o642m843k578l593o884q372p984q826j0722j0933j0062j0943
55769D75830j2730j2149r687q695r306q946p946q746j0486j0132q229p918q988
55756C51872q443o409n901p264p999p605p595p495n827m125m895o624n905l531
55742B62254l057m353m142k200j404k040j586Q0N72j61M9R36L56r11j55J795J369
55725B47402j524l247k587k006k640k886k451k937m080l816k424k222l025k292
$$ plain form
55711 209265 209344 210913 212572 214914 218787 223225 227318 232117 238541 245372 251263 256489 260861 262550 261207
55696 261207 259739 260536 262325 263054 263297 264188 264570 263183 261412 260877 260389 258285 255792 254949 254972 253886 252295
55679 252295 252397 254424 256900 259369 262271 265205 267743 270832 275126 279161 281416 282736 284520 286157
55665 286157 286734 287646 290717 294996 298156 299888 301392 302696 303158 303545 304960 306587 307012 306873 307756 309322
55649 309322 309930 309238 307777 304875 299516 292617 286046 279931 273093 265500 258135 251057 243741 236698 230732
55634 230732 225200 219003 212601 207091 201988 195926 188923 182064 175611 169257 163520 159021 155117 150987
55620 150987 147237 144648 142320 138955 135069 131988 129603 127118 125096 124617 125186 125499 125519 125824 125803 124628
55604 124628 123171 122764 122757 121511 119134 117098 115781 114611 113982 114733 116126 116607 116245 116342 116976 117086 116703
$$ packed form
55711B09265P9J569J659K342L873M438M093M799O424O831N891N226M372J689j343
55696B61207j468P97J789P29K43Q91L82j387j771n35m88k104k493q43K3j086j591
55679B52295J02K027K476K469K902K934K538L089M294M035K255J320J784J637
55665B86157N77R12L071M279L160J732J504J304M62L87J415J627M25j39Q83J566
55649C09322O08o92j461k902n359o899o571o115o838p593p365p078p316p043n966
55634B30732n532o197o402n510n103o062p003o859o453o354n737m499l904m130
55620A50987l750k589k328l365l886l081k385k485k022m79N69L13K0L05k1j175
55604A24628j457m07pj246k377k036j317j170o29P51J393M81l62R7O34J10l83
$$ plain form
55587 116703 116911 117698 117816 116798 115395 114102 112869 112018 111850 111693 110915 110417 111429 113375 114683 115212
55571 115212 116040 117382 118702 120496 123905 128694 133464 137729 142032 146200 149290 151190 152599 153418 152785
55556 152785 150630 147820 144815 141551 138400 135911 133903 132041 130859 130883 131344 131140 130453 129988 129378 128001
55540 128001 126650 126640 127819 129173 130740 133150 135879 137904 139621 142278 145891 149492 152942 156661 160086
55525 160086 162282 163660 165191 166467 166477 165811 165932 166609 166172 164139 161541 158858 155668 152134 148807 145112
55509 145112 140040 134221 129273 125228 120631 115087 109655 104740 99717 94631 90220 86189 81549 76656
55495 76656 72837 69971 66671 62969 60457 59463 58423 56608 55215 55033 55143 54781 54628 55317 56300 57076
55479 57076 58038 59363 60418 60934 61525 62478 63279 63715 64213 64811 65051 65092 65518 65906 65100 63108 61214 60023
$$ packed form
55587A16703K08P87J18j018j403j293j233q51j68j57p78m98J012J946J308N29
55571A15212Q28J342J320J794L409M789M770M265M303M168L090J900J409Q19o33
55556A52785k155k810l005l264l151k489k008j862j182K4M61k04o87m65o10j377
55540A28001j351j0J179J354J567K410K729K025J717K657L613L601L450L719L425
55525A60086K196J378J531J276J0o66J21O77m37k033k598k683l190l534l327l695
55509A45112n072n819m948m045m597n544n432m915n023n086m411m031m640m893
55495G6656l819k866l300l702k512r94j040j815j393j82J10l62j53O89R83P76
55479E7076R62J325J055N16N91R53Q01M36M98N98K40M1M26L88q06j992j894j191
$$ plain form
55461 60023 58982 58036 57984 58731 58854 57541 55581 54001 53049 52839 53471 54186 53842 52628 51885 51957 51763 50820
55443 50820 50065 50162 50582 50924 51698 53172 54771 56153 57594 58912 59324 58837 58437 58533 58512 58176 58173 58626 58774
55424 58774 58403 58282 58766 59330 59822 60736 61934 62583 62725 63394 64785 65904 66423 67201 68403 68842 67975 66975
55406 66975 67017 67850 68809 69792 70502 70120 68594 67098 66479 66390 66472 67015 67844 67945 66925 65562 64280 62396
55388 62396 59607 56866 55006 53759 52809 52524 52885 52982 52386 51799 51618 51118 49895 48846 48775 49122 48892 47874
55370 47874 46243 44079 41942 40762 40432 39638 37780 35878 34845 34111 32783 31026 29402 27984 26979
55355 26979 27186 28862 31034 32736 34034 35213 35998 36359 37056 38559 40288 41605 42661 43626 44038 43643
55339 43643 43026 42807 42952 43263 43716 44038 43888 43560 43431 42870 41198 39651 40378 43215 45566 46053 46101 47010
$$ packed form
55461F0023j041r46n2P47J23j313j960j580r52k10O32P15l44j214p43P2j94r43
55443E0820p55R7M20L42P74J474J599J382J441J318M12m87m00R6k1l36lM53J48
55424E8774l71j21M84N64M92R14J198O49J42O69J391J119N19P78J202M39q67j000
55406F6975M2Q33R59R83P10l82j526j496o19q9Q2N43Q29J01j020j363j282j884
55388F2396k789k741j860j247r50k85L61R7n96n87j81n00j223j049p1L47k30j018
55370D7874j631k164k137j180l30p94j858j902j033p34j328j757j624j418j005
55355B6979K07J676K172J702J298J179P85L61O97J503J729J317J056R65M12l95
55339D3643o17k19J45L11M53L22j50l28j29n61j672j547P27K837K351M87M8R09
$$ plain form
55321 47010 47823 47418 46613 46510 46545 45923 45452 46139 47256 47598 47514 47985 48744 48947 48832 49067 49294 48874 48284
55302 48284 48323 48697 48806 49095 50181 51472 52144 52688 53971 55487 56087 55806 55421 54813 53375 51574 50529
55285 50529 50344 50299 50363 51085 52252 53029 53240 53313 53186 52507 51668 51439 51700 51632 51029 50435 50173 50155 50404 50841
55265 50841 50866 50080 49132 48925 49280 49285 48647 47821 47100 46466 46050 45939 45808 45373 44852 44386 43643 42627 42190 42900
55245 42900 44095 44889 45413 46156 46888 47237 47579 48226 48488 47739 46750 46652 47157 47144 46506 46078 46057 45857 45301 44720
55225 44720 44020 42862 41597 40977 41051 41293 41651 42506 43849 45358 46959 48419 48826 47539 45362 43751
55209 43751 43147 43016 43103 43561 44198 44687 45252 46129 46712 46282 45253 44634 44621 44792 45293 46547 48094 48999 49279
55190 49279 49735 50468 50707 50046 48763 47092 45264 44119 44483 45940 47251 47931 48436 48990 49356 49643 50124
$$ packed form
55321D7010Q13m05q05j03L5o22m71O87J117L42q4M71P59K03j15K35K27m20n90
55302D8284L9L74J09K89J086J291O72N44J283J516O00k81l85o08j438j801j045
55285E0529j85m5O4P22J167P77K11P3j27o79q39k29K61o8o03n94k62j8K49M37
55265E0841K5p86r48k07L55No38q26p21o34m16j11j31m35n21m66p43j016m37P10
55245D2900J195P94N24P43P32L49L42O47K62p49r89r8N05j3o38m28k1k00n56n81
55225D4720p00j158j265o20P4K42L58Q55J343J509J601J460M07j287k177j611
55209D3751o04j31Q7M58O37M89N65Q77N83m30j029o19j3J71N01J254J547R05K80
55190D9279M56P33K39o61j283j671j828j145L64J457J311O80N05N54L66K87M81
$$ plain form
55173 50124 50259 49084 46723 44478 43231 42715 42419 42250 42116 41709 40968 40156 39459 39131 39748 41552 43753
55156 43753 45309 46162 46879 47365 47006 45900 44926 44632 44962 45893 47381 48846 49720 50386 51532 52767 53001
55139 53001 52132 51192 50826 50763 50827 51318 52182 52863 53243 53844 54919 56134 57256 58336 59180 59477 59481 59760 60283
55120 60283 60571 60597 60683 60642 60090 59444 59565 60353 60785 60383 59603 58754 57614 56240 55144 54499 54110 54189 55142
55101 55142 56594 57697 58490 59812 61714 63103 63194 62338 61240 60426 60582 62168 64375 65602 65392 64908
55085 64908 65165 65907 66599 67359 68339 69131 69477 69748 70187 70453 70360 70294 70442 70364 69825 69317 69278 69439 69427 69395 69611
55064 69611 70020 70572 71457 72633 73595 73888 73442 72355 70894 69697 69241 69049 68208 66743 65644 65436 65622
55047 65622 65756 66122 67016 68185 69342 70477 71393 71701 71523 71459 71622 71592 71455 71896 72945 73615 73288 72560
$$ packed form
55173E0124J35j175k361k245j247n16k96j69j34m07p41q12o97l28O17J804K201
55156D3753J556Q53P17M86l59j106r74k94L30R31J488J465Q74O66J146J235K34
55139E3001q69r40l66o3O4M91Q64O81L80O01J075J215J122J080Q44K97MK79N23
55120F0283K88K6Q6m1n52o46J21P88M32m02p80q49j140j374j096o45l89P9R53
55101E5142J452J103P93J322J902J389R1q56j098q14J56J586K207J227k10m84
55085F4908K57P42O92P60R80P92L46K71M39K66r3o6J48p8n39n08l9J61j2l2K16
55064F9611M09N52Q85J176R62K93m46j087j461j197m56j92q41j465j099k08J86
55047F5622J34L66Q94J169J157J135R16L08j78o4J63l0j37M41J049O70l27p28
$$ plain form
55029 72560 72266 72520 73156 74225 75514 76428 76887 77577 78814 80010 80734 81340 81890 81466 79540 77273 76414
55012 76414 77277 78634 79251 78797 77590 76245 75390 75063 74448 72733 70143 67720 66177 65281 64287 62800
54996 62800 61259 60627 61348 62729 63725 64227 65017 66486 68090 69195 69764 70101 70545 71609 73632 76017
54980 76017 77506 77569 76944 76621 76944 77890 79462 81452 83507 85785 88840 92593 96178 99124 101902 104948
54964 104948 108102 111521 116203 122755 130398 138020 145618 153916 163118 172956 183607 195612 208976
54951 208976 223037 237098 250629 262902 273051 280567 285372 287407 286420 282204 274980 265621 255401
54938 255401 245151 234584 222846 209814 196434 183754 172186 161843 152993 145781 139957 135164
54926 135164 131145 127556 124083 121031 119311 119534 121353 123878 126372 128547 130696 133662 138245 144546
$$ packed form
55029G2560k94K54O36J069J289R14M59O90J237J196P24O06N50m24j926k267q59
55012G6414Q63J357O17m54j207j345q55l27o15j715k590k423j543q96r94j487
54996F2800j541o32P21J381R96N02P90J469J604J105N69L37M44J064K023K385
54980G6017J489O3o25l23L23R46J572J990K055K278L055L753L585K946K778L046
54964A04948L154L419M682O552P643P622P598Q298R202R838J0651J2005J3364
54951B08976J4061J4061J3531J2273J0149P516M805K035r87m216p224r359j0220
54938B55401j0250j0567j1738j3032j3380j2680j1568j0343q850p212n824m793
54926A35164m019l589l473l052j720K23J819K525K494K175K149K966M583O301
$$ plain form
54912 144546 152247 161412 172385 184977 198480 212427 226559 240067 251796 261237 268370 272479
54900 272479 272387 268202 261661 254170 245511 235032 223013 210167 196766 183189 170529 159731 150638
54887 150638 142601 135439 129147 123272 117416 111841 106961 102713 99074 96521 95214 94268 92655 90430
54873 90430 88275 86304 84189 82119 80780 80429 80672 80996 81049 80567 79554 78413 77439 76386 74832 72704
54857 72704 70158 67344 64676 62884 62359 62722 63383 64104 64726 64853 64290 63379 62541 61843 61299 61048 60952 60600
54839 60600 60072 60027 60647 61223 61262 61265 61801 62552 62964 63199 63708 64438 65215 66331 67964 69547 70471 70985 71607
54820 71607 72167 72263 72266 73029 74860 77554 81075 85367 89769 93448 96331 98970 101710 104703 108484 113708
54804 113708 120336 127715 135455 143752 153001 163550 175696 189394 204131 219344 234675 249427
$$ packed form
54912A44546P701R165J0973J2592J3503J3947J4132J3508J1729R441P133M109
54900B72479r2m185o541p491q659j0479j2019j2846j3401j3577j2660j0798r093
54887A50638q037p162o292n875n856n575m880m248l639k553j307r46j613k225
54873I0430k155j971k115k070j339l51K43L24N3m82j013j141r74j053j554k128
54857G2704k546k814k668j792n25L63O61P21O22J27n63r11q38o98n44k51r6l52
54839F0600n28m5O20N76L9LN36P51M12K35N09P30P77J116J633J583R24N14O22
54820G1607N60R6LP63J831K694L521M292M402L679K883K639K740K993L781N224
54804A13708O628P379P740Q297R249J0549J2146J3698J4737J5213J5331J4752
$$ plain form
54792 249427 262246 271948 278369 281883 282409 279498 273214 264433 254394 244152 234177 224181 213718
54779 213718 203154 193552 185408 178240 171672 166089 161768 158315 155529 153876 153358 152975 152269 152436 154723
54764 154723 158533 162483 166640 172258 179699 188179 197405 208034 220401 234113 249110 266035 285131
54751 285131 305588 326157 345745 363266 377617 387952 393656 394233 389821 381543 370654 357554
54739 357554 342241 325357 307915 290302 272482 254981 238722 223990 210414 197863 186494
54728 186494 176075 166177 156956 148941 142097 135930 130345 125551 121343 117350 113838 111247 109139 106684
54714 106684 104043 102131 101047 99982 98732 98016 97989 97675 96324 94354 92568 91389 91203 92357 94312
54699 94312 95777 96298 96839 98142 99388 99320 98090 97078 97160 97855 98106 97381 96070 95080 95051 95842 96872 97854
$$ packed form
54792B49427J2819R702O421L514N26k911o284q781j0039j0242r975r996j0463
54779B13718j0564r602q144p168o568n583m321l453k786j653n18l83p06J67K287
54764A54723L810L950M157N618P441Q480R226J0629J2367J3712J4997J6925J9096
54751B85131K0457K0569J9588J7521J4351J0335N704N77m412q278j0889j3100
54739C57554j5313j6884j7442j7613j7820j7501j6259j4732j3576j2551j1369
54728A86494j0419r898r221q015o844o167n585m794m208l993l512k591k108k455
54714A06684k641j912j084j065j250p16k7l14j351j970j786j179j86J154J955
54699I4312J465N21N41J303J246o8j230j012Q2O95K51p25j311r90k9P91J030R82
$$ plain form
54681 97854 98943 100258 101654 102952 104024 104778 105480 106905 109559 112819 115477 117159 118637 120794 123859
54666 123859 127599 131594 135293 138426 141442 145001 149108 153365 157883 163038 168391 172822 176007 178927
54652 178927 182595 187056 191944 197299 203413 210381 218204 226928 236454 246671 257940 270956 285919
54639 285919 302144 318515 333879 347162 357754 365776 371311 373484 371092 364203 354258 342460 328925
54626 328925 313637 297303 280802 264515 248686 233886 220669 209146 199057 189866 180801 171575
54614 171575 163225 157416 154556 153258 151911 150075 148102 146265 144771 143878 143391 142610 141298 140165 139828
54599 139828 139798 139114 137549 135599 133586 131376 128854 126153 123369 120334 116794 112815 109000 106084 104143
54584 104143 102483 100620 98937 97868 96913 95373 93664 92790 92636 92069 90871 90225 90815 91661 91544 90560
$$ packed form
54681I7854J089J315J396J298J072P54P02J425K654L260K658J682J478K157L065
54666A23859L740L995L699L133L016L559M107M257M518N155N353M431L185K920
54652A78927L668M461M888N355O114O968P823Q724R526J0217J1269J3016J4963
54639B85919J6225J6371J5364J3283J0592Q022N535K173k392o889r945j1798j3535
54626C28925j5288j6334j6501j6287j5829j4800j3217j1523j0089r191r065r226
54614A71575q350n809k860j298j347j836j973j837j494q93m87p81j312j133l37
54599A39828l0o84j565j950k013k210k522k701k784l035l540l979l815k916j941
54584A04143j660j863j683j069r55j540j709q74j54n67j198o46N90Q46j17r84
$$ plain form
54568 90560 89464 88373 87070 85934 85641 86243 87285 88488 89685 90431 90365 89771 89274 89132 89228 89525 90174
54551 90174 91303 92956 94989 96902 98105 98547 98730 99136 100134 102380 106447 111823 117065 121349 125211
54536 125211 129452 134191 139461 145860 153780 162562 171151 179172 186749 193708 199600 204166 207196 208311
54522 208311 207391 204929 201490 197202 192150 186724 181087 174886 168042 161255 155060 148950 142223 135287
54508 135287 129233 124420 120320 116561 113268 110450 107910 105867 104956 105301 106012 105845 104250 101783 99654
54493 99654 98753 98929 99282 99207 98813 98316 97647 96988 97075 98333 100114 101398 101960 102266 102479 102291 101669 101145 101175
54474 101175 101602 101888 101718 101333 101325 101997 102957 103563 103724 103878 104205 104427 104485 104732 105190 105312 104871 104468 104628 105001
54454 105001 104945 104310 103096 100952 97808 94542 92267 91205 90906 91202 92216 93730 95260 96571 97447 97285
$$ packed form
54568I0560j096j091j303j136k93O02J042J203J197P46o6n94m97j42R6K97O49
54551I0174J129J653K033J913J203M42J83M06R98K246M067N376N242M284L862
54536A25211M241M739N270O399P920Q782Q589Q021P577O959N892M566L030J115
54522B08311r20k462l439m288n052n426n637o201o844o787o195o110o727o936
54508A35287o054m813m100l759l293k818k540k043r11L45P11j67j595k467k129
54493I9654r01J76L53p5l94m97o69o59Q7J258J781J284N62L06K13j88o22n24L0
54474A01175M27K86j70l85qO72R60O06J61J54L27K22N8K47M58J22m41m03J60L73
54454A05001n6o35j214k144l144l266k275j062k99K96J014J514J530J311Q76j62
$$ plain form
54438 97285 95713 93470 91889 91453 91525 91458 91303 91346 91534 91541 91035 89853 88245 86916 86415 86517 86555 86333 86332 87014
54418 87014 88239 89397 89920 89736 89367 89498 90336 91576 92980 94609 96371 97883 99066 100411 102366 104930
54402 104930 108099 112097 116720 120977 123980 125760 126875 127815 129239 132005 136133 140380 143635 146218
54388 146218 148963 151643 153291 153645 153151 151885 149619 146747 144100 141897 139846 138071 136837 135468 132832
54373 132832 129031 125485 123069 121232 119179 116866 114492 112083 110035 109125 109358 109686 109412 109073 109361 110007
54357 110007 110445 110831 111463 111751 110810 108858 107178 106702 107318 108558 110209 112115 113937 115495 117012 118772
54341 118772 120743 122764 124958 127676 130990 134500 137742 140545 142755 143842 143355 141816 140572 140387 140577
54326 140577 139913 137994 135260 132054 128396 124511 120873 117644 114630 111809 109372 107184 104763 101970
$$ packed form
54438I7285j572k243j581m36P2o7j55M3J88Pn06j182j608j329n01J02L8k22jO82
54418H7014J225J158N23j84l69J31Q38J240J404J629J762J512J183J345J955K564
54402A04930L169L998M623M257L003J780J115R40J424K766M128M247L255K583
54388A46218K745K680J648L54m94j266k266k872k647k203k051j775j234j369k636
54373A32832l801l546k416j837k053k313k374k409k048r10K33L28k74l39K88O46
54357A10007M38L86O32K88r41j952j680m76O16J240J651J906J822J558J517J760
54341A18772J971K021K194K718L314L510L242K803K210J087m87j539j244j85J90
54326A40577o64j919k734l206l658l885l638l229l014k821k437k188k421k793
$$ plain form
54312 101970 99259 97070 95372 93917 92537 91045 89250 87267 85485 84026 82580 80947 79442 78502
54298 78502 78125 77915 77529 76902 76142 75370 74629 73922 73371 73237 73597 74072 74045 73198 71770 70422 69841 70255 71185
54279 71185 71914 72296 72792 73559 74042 73831 73335 73105 72954 72465 71916 71864 72062 71757 71026 70885 71957 73831 75866
54260 75866 77759 79166 79599 79173 78685 78508 78037 76741 75140 74157 73962 74145 74669 75916 77837 79696 80730
54243 80730 80735 79929 78611 77082 75692 74789 74577 75029 75877 76702 77027 76400 74673 72346 70493 69980 70735 71922
54225 71922 72753 72963 72655 72097 71607 71336 71119 70758 70369 70177 70067 69741 69286 69192 69732 70685 71651 72295 72270 71304
54205 71304 69594 67859 66901 67191 68733 71024 73160 74346 74436 73860 73121 72555 72398 72724 73381 74240 75298
54188 75298 76261 76354 75082 72993 71134 69939 69228 69037 69657 70864 71922 72487 72814 72897 72195 70525 68570
$$ packed form
54312A01970k711k189j698j455j380j492j795j983j782j459j446j633j505r40
54298G8502l77k10l86o27p60p72p41p07n51j34L60M75k7q47j428j348n81M14R30
54279G1185P29L82M96P67M83k11m96k30j51m89n49n2J98l05p31j41J072J874K035
54260G5866J893J407M33m26m88j77m71j296j601r83j95J83N24J247J921J859J034
54243H0730Nq06j318j529j390r03k12M52Q48Q25L25o27j727k327j853n13P55J187
54225G1922Q31K10l08n58m90k71k17l61l89j92j10l26m55r4N40R53R66O44k5r66
54205G1304j710j735r58K90J542K291K136J186R0n76p39n66j57L26O57Q59J058
54188G5298R63R3j272k089j859j195p11j91O20J207J058N65L27Q3p02j670j955
$$ plain form
54171 68570 67056 65972 64986 64213 64092 64763 65937 67219 68286 68948 69216 69232 69150 69289 70178 71939 73691
54154 73691 74221 73405 72408 72283 72917 73585 73936 74023 73816 73227 72410 71705 71350 71385 71682 72012 72302 72746 73318 73312
54134 73312 72021 69888 68335 68173 68798 69260 69482 70003 71007 72132 72940 73179 72862 72366 72223 72519 72772
54117 72772 72628 72256 71831 71105 69854 68428 67434 67067 67085 67206 67300 67394 67726 68574 69834 70996 71655 71767 71410
54098 71410 70702 70056 69986 70455 70877 70913 70795 70670 70266 69516 68897 68777 68971 69269 69813 70549 71008 71091 71400 72160
54078 72160 72533 71744 70311 69334 69110 69366 70350 72457 74976 76418 76269 75474 74999 74818 74565 74275 74072 73853
54060 73853 73751 74355 76008 78313 80772 83420 86356 88990 90405 90417 89810 89526 89956 91008 92458 94068
54044 94068 95635 97154 98858 100914 103111 105048 106658 108382 110701 113739 117435 121870 127039 132493
$$ packed form
54171F8570j514j084r86p73j21O71J174J282J067O62K68J6q2J39Q89J761J752
54154G3691N30q16r97j25O34O68L51Q7k07n89q17p05l55L5K97L30K90M44N72o
54134G3312j291k133j553j62O25M62K22N21J004J125Q08K39l17m96j43K96K53
54117G2772j44l72m25p26j251j426r94l67J8J21R4R4L32Q48J260J162O59J12l57
54098G1410p08o46p0M69M22L6j18j25m04p50o19j20J94K98N44P36M59Q3L09P60
54078G2160L73p89j433r77k24K56R84K107K519J442j49p95m75j81k53k90k03k19
54060G3853j02O04J653K305K459K648K936K634J415J2o07k84M30J052J450J610
54044I4068J567J519J704K056K197J937J610J724K319L038L696M435N169N454
$$ plain form
54030 132493 137653 142516 147604 153144 158726 163898 168705 173446 178316 183507 189224 195269 201010 206083
54016 206083 210776 215354 219440 222537 224797 226668 228044 228482 228066 227368 226472 224733 221731 217946 214259
54001 214259 211112 208394 205779 202939 199652 195950 192030 187918 183420 178505 173514 168844 164639 160932
53987 160932 157877 155552 153667 151725 149499 147184 145068 143173 141274 139218 137163 135547 134757 134787 135227
53972 135227 135661 136066 136717 137694 138742 139689 140789 142329 144048 145326 145934 146233 146580 147061 147920 149695 152430
53955 152430 155253 157283 158700 160327 162352 164104 165023 165246 165239 165409 166179 167917 170679 174386 179173 185023
53939 185023 191129 196302 200146 203246 206116 208627 210619 212326 213853 214922 215501 216044 216660 216633 215341
53924 215341 213205 211245 210135 210114 211367 213820 216934 220279 224099 228807 234157 239437 244341 249147 254153
$$ packed form
54030A32493N160M863N088N540N582N172M807M741M870N191N717O045N741N073
54016B06083M693M578M086L097K260J871J376M38m16o98q96j739l002l785l687
54001B14259l147k718k615k840l287l702l920m112m498m915m991m670m205l707
53987A60932l055k325j885j942k226k315k116j895j899k056k055j616p90L0M40
53972A35227M34M05O51R77J048R47J100J540J719J278O08K99L47M81Q59J775K735
53955A52430K823K030J417J627K025J752R19K23pJ70P70J738K762L707M787N850
53939A85023O106N173L844L100K870K511J992J707J527J069N79N43O16k7j292
53924B15341k136j960j110k1J253K453L114L345L820M708N350N280M904M806N006
$$ plain form
53909 254153 259341 264539 269634 274665 279883 285469 291066 295925 299675 302566 304798 306242 307086 308108
53895 308108 309709 311228 311800 311424 310552 309092 306523 302617 297356 290574 282568 274676 268232 263007 257615
53880 257615 251370 244801 238360 231795 225158 219369 215075 211567 207480 202229 196244 190139 184229 178745
53866 178745 173974 169996 166498 163006 159322 155719 152642 150151 147774 144985 141740 138440 135528 133241
53852 133241 131487 129794 127652 125218 123380 122801 123116 123381 123019 121928 120057 117576 115321 114298 114561
53837 114561 115065 114795 113657 112191 110862 109830 109107 108723 108786 109398 110381 111267 111770 112103 112571 113070 113338 113449
53819 113449 113592 113541 112905 111855 111092 111082 111783 113097 115016 117308 119541 121585 123717 126133 128703 131237
53803 131237 133596 135586 137239 139196 142270 146503 151168 155861 160992 166883 172918 178111 182257 186031
$$ packed form
53909B54153N188N198N095N031N218N586N597M859L750K891K232J444Q44J022
53895C08108J601J519N72l76q72j460k569l906n261o782q006p892o444n225n392
53880B57615o245o569o441o565o637n789m294l508m087n251n985o105n910n484
53866A78745m771l978l498l492l684l603l077k491k377k789l245l300k912k287
53852A33241j754j693k142k434j838n79L15K65l62j091j871k481k255j023K63
53837A14561N04k70j138j466j329j032p23l84O3O12R83Q86N03L33M68M99K68J11
53819A13449J43n1o36j050p63j0P01J314J919K292K233K044K132K416K570K534
53803A31237K359J990J653J957L074M233M665M693N131N891O035N193M146L774
$$ plain form
53789 186031 190013 194050 197630 200675 203752 207477 211832 216206 220082 223360 225884 227087 226599 225027
53775 225027 223567 222795 222217 221004 218847 216028 213070 210415 208197 206203 204217 202308 200557 198644 196083
53760 196083 192833 189335 185995 183006 180548 178673 176969 174858 172305 169820 167651 165429 162754 159742
53746 159742 156859 154551 153231 153152 154031 155069 155663 155946 156421 157212 157898 157987 157426 156728 156645 157611 159432 161463
53728 161463 163036 163671 163165 161728 159932 158259 156739 155203 153694 152347 151065 149656 148194 146935 145999
53713 145999 145454 145508 146235 147284 148285 149406 151040 153065 154910 156324 157579 158933 160418 162107 164114
53698 164114 166238 168093 169661 171318 173321 175640 178193 180817 183145 185076 187275 190516 194584 198518
53684 198518 201988 205597 209699 213707 217001 219776 222513 225118 227170 228623 229775 230757 231469 231874 232115
$$ packed form
53789A86031L982M037L580L045L077L725M355M374L876L278K524J203m88j572
53775B25027j460p72n78j213k157k819k958k655k218j994j986j909j751j913k561
53760A96083l250l498l340k989k458j875j704k111k553k485k169k222k675l012
53746A59742k883k308j320p9Q79J038N94K83M75P91O86Q9n61o98q3R66J821K031
53728A61463J573O35n06j437j796j673j520j536j509j347j282j409j462j259r36
53713A45999n45N4P27J049J001J121J634K025J845J414J255J354J485J689K007
53698A64114K124J855J568J657K003K319K553K624K328J931K199L241M068L934
53684A98518L470L609M102M008L294K775K737K605K052J453J152R82P12M05K41
$$ plain form
53669 232115 232410 232964 233767 234432 234544 234194 233829 233521 232811 231349 229283 226911 224405 222032 220178 218937
53653 218937 218024 217257 216730 216373 215826 214914 213869 212903 212009 211281 210970 211028 211025 210719 210288 209873 209398 208947 208819
53634 208819 209009 209242 209686 210975 213139 215231 216488 217331 218635 220450 222012 222746 222761 222557 222662 223402 224702
53617 224702 226235 227861 229736 231960 234462 237256 240340 243357 245971 248626 252159 256503 260703 264519
53603 264519 268986 274754 280879 286139 290761 295771 301257 306381 310770 314754 318426 321593 324705 328746
53589 328746 333906 339186 343640 347392 351157 355310 359727 364156 368401 372393 376272 380241 384278 388105
53575 388105 391427 394087 396096 397726 399388 401237 403063 404789 406772 409282 411974 414297 416212 418108
53561 418108 420194 422386 424605 426751 428586 430117 431968 434808 438467 442081 445056 447418 449346 450914
$$ packed form
53669B32115K95N54Q03O65J12l50l65l08p10j462k066k372k506k373j854j241
53653B18937r13p67n27l57n47r12j045r66q94p28l11N8ll06m31m15m75m51j28
53634B08819J90K33M44J289K164K092J257Q43J304J815J562P34J5k04J05P40J300
53617B24702J533J626J875K224K502K794L084L017K614K655L533M344M200L816
53603B64519M467N768O125N260M622N010N486N124M389L984L672L167L112M041
53589C28746N160N280M454L752L765M153M417M429M245L992L879L969M037L827
53575C88105L322K660K009J630J662J849J826J726J983K510K692K323J915J896
53561D18108K086K192K219K146J835J531J851K840L659L614K975K362J928J568
$$ plain form
53547 450914 452336 453905 455503 456616 457022 457191 457915 459701 462480 465581 468066 469443 470087 470724 471591 472523
53531 472523 473674 475608 478589 482309 486494 491341 497125 503732 510792 518058 525416 532782 540250 548196
53517 548196 557013 566741 577083 587754 598818 610690 623807 638230 653569 669321 685213 701195
53505 701195 717374 734170 752367 772659 795035 818757 842931 867025 891022 915311 940377
53494 940377 966378 992953 1019573 1046039 1072540 1099295 1126282 1153251 1179822 1205578 1230283
53483 1230283 1254109 1277625 1301520 1326231 1351689 1377393 1402795 1427573 1451497 1474276 1495829
53472 1495829 1516576 1537029 1557042 1575857 1592982 1608679 1623453 1637388 1650114 1661155 1670270
53461 1670270 1677780 1684538 1691081 1696743 1700157 1700766 1699228 1696192 1691436 1684523 1675570 1664820 1652104 1637359
$$ packed form
53547D50914J422J569J598J113M06J69P24J786K779L101K485J377O44O37Q67R32
53531D72523J151J934K981L720M185M847N784O607P060P266P358P366P468P946
53517E48196Q817R728J0342J0671J1064J1872J3117J4423J5339J5752J5892J5982
53505G01195J6179J6796J8197K0292K2376K3722K4174K4094K3997K4289K5066
53494I40377K6001K6575K6620K6466K6501K6755K6987K6969K6571K5756K4705
53483A230283K3826K3516K3895K4711K5458K5704K5402K4778K3924K2779K1553
53472A495829K0747K0453K0013J8815J7125J5697J4774J3935J2726J1041R115
53461A670270P510O758O543N662L414O09j538l036m756o913q953j0750j2716j4745
$$ plain form
53447 1637359 1621247 1604582 1587542 1569959 1551858 1533073 1512886 1490813 1467418 1443584 1419322
53436 1419322 1394204 1368673 1343947 1320611 1298163 1275986 1254046 1232517 1211518 1191369 1172498
53425 1172498 1154928 1138376 1122942 1109062 1096727 1085335 1074555 1064837 1056836 1050766 1046507 1043907
53413 1043907 1042759 1042793 1043896 1046173 1049786 1054983 1062188 1071676 1083215 1096374 1111107 1127626 1145845
53400 1145845 1165468 1186509 1209198 1233418 1258855 1285717 1314664 1345878 1378818 1413077 1448909
53389 1448909 1486643 1526065 1566696 1608342 1651193 1695597 1741884 1790119 1839983 1891135 1943554
53378 1943554 1997129 2051141 2104764 2158040 2211651 2265603 2318852 2370505 2420739 2470092 2518368
53367 2518368 2564566 2607581 2646679 2681653 2712795 2740441 2764401 2784175 2799800 2811955 2821031
$$ packed form
53447A637359j6112j6665j7040j7583j8101j8785k0187k2073k3395k3834k4262
53436A419322k5118k5531k4726k3336k2448k2177k1940k1529k0999k0149j8871
53425A172498j7570j6552j5434j3880j2335j1392j0780r718q001o070m259k600
53413A043907j148L4J103K277L613N197P205R488J1539J3159J4733J6519J8219
53400A145845J9623K1041K2689K4220K5437K6862K8947L1214L2940L4259L5832
53389A448909L7734L9422M0631M1646M2851M4404M6287M8235M9864N1152N2419
53378A943554N3575N4012N3623N3276N3611N3952N3249N1653N0234M9353M8276
53367B518368M6198M3015L9098L4974L1142K7646K3960J9774J5625J2155R076
$$ plain form
53356 2821031 2826595 2828117 2825743 2820027 2811257 2799425 2784431 2765914 2743241 2716126 2685101 2650985
53344 2650985 2614090 2574239 2531451 2486259 2439470 2391855 2343953 2295965 2247933 2200146 2153113
53333 2153113 2107012 2061383 2015727 1970183 1925411 1881893 1839627 1798420 1758217 1719137 1681341
53322 1681341 1644945 1610034 1576782 1545514 1516578 1490135 1466065 1443928 1423017 1402734 1383225
53311 1383225 1365358 1349685 1335641 1322213 1309240 1297500 1287549 1279135 1271844 1265756 1261204 1258366
53299 1258366 1257318 1258053 1260180 1262985 1266125 1269961 1275011 1281345 1288719 1297013 1306355 1317017 1329266 1343045
53285 1343045 1357783 1372862 1388317 1404682 1422184 1440688 1460455 1482194 1505969 1530667 1554994
53274 1554994 1578573 1601604 1623967 1645212 1665096 1683556 1700317 1715142 1728400 1740948 1753350
$$ packed form
53356B821031N564J522k374n716q770j1832j4994j8517k2673k7115l1025l4116
53344B650985l6895l9851m2788m5192m6789m7615m7902m7988m8032m7787m7033
53333B153113m6101m5629m5656m5544m4772m3518m2266m1207m0203l9080l7796
53322A681341l6396l4911l3252l1268k8936k6443k4070k2137k0911k0283j9509
53311A383225j7867j5673j4044j3428j2973j1740r951q414p291o088m552k838
53299A258366j048P35K127K805L140L836N050O334P374Q294R342J0662J2249J3779
53285A343045J4738J5079J5455J6365J7502J8504J9767K1739K3775K4698K4327
53274A554994K3579K3031K2363K1245J9884J8460J6761J4825J3258J2548J2402
$$ plain form
53263 1753350 1765427 1776470 1785720 1792775 1797750 1801022 1802693 1802492 1800164 1795687 1789041 1780202 1769548
53250 1769548 1757735 1744907 1730456 1713985 1696106 1677830 1659442 1640477 1620570 1599783 1578219
53239 1578219 1555836 1532661 1508902 1484840 1460756 1436849 1413019 1389012 1365069 1342123 1320956
53228 1320956 1301358 1282570 1264335 1246933 1230195 1213182 1195148 1176420 1158044 1140737 1124462
53217 1124462 1108934 1094224 1080643 1068089 1055804 1042937 1029305 1015351 1001400 987267 972596
53206 972596 957257 941281 924747 907939 891364 875353 859826 844509 829188 813729 798199
53195 798199 783019 768517 754152 738748 721883 704536 687820 671578 654887 637673 620946
53184 620946 605384 590434 575151 559433 544027 529527 515742 502055 488222 474660 461944
$$ packed form
53263A753350J2077J1043R250P055M975L272J671k01k328m477o646q839j0654
53250A769548j1813j2828j4451j6471j7879j8276j8388j8965j9907k0787k1564
53239A578219k2383k3175k3759k4062k4084k3907k3830k4007k3943k2946k1167
53228A320956j9598j8788j8235j7402j6738j7013j8034j8728j8376j7307j6275
53217A124462j5528j4710j3581j2554j2285j2867j3632j3954j3951j4133j4671
53206I72596j5339j5976j6534j6808j6575j6011j5527j5317j5321j5459j5530
53195G98199j5180j4502j4365j5404j6865j7347j6716j6242j6691j7214j6727
53184F20946j5562j4950j5283j5718j5406j4500j3785j3687j3833j3562j2716
$$ plain form
53173 461944 450180 439122 428764 419391 410943 402754 394201 385199 375828 365965 355803 346306 338436
53160 338436 332013 325907 319333 312394 305507 298924 292948 287890 283572 279403 275232 271625 268950 266680
53146 266680 264128 261485 259485 258234 257075 255643 254324 253381 252244 250220 247545 245168 243618 242676 242106
53131 242106 242054 242523 243066 243389 243814 244732 245944 247009 247926 248927 249865 250437 250933 252085 254138 256594 258884
53114 258884 260758 261921 261917 260646 258545 256032 253144 249832 246230 242488 238727 235214 232058 228660 224110
53099 224110 218417 212763 208187 204537 201025 197248 193217 188927 184493 180402 177130 174696 172877 171576
53085 171576 170593 169454 167877 166152 164679 163412 162070 160552 158864 157012 155308 154275 153830 153060 151329
53070 151329 149230 147858 147553 147901 148526 149182 149361 148585 146975 145046 143187 141853 141824 143453 145857 147673
$$ packed form
53173D61944j1764j1058j0358r373q448q189q553r002r371r863j0162r497p870
53160C38436o423o106o574o939o887o583n976n058m318m169m171l607k675k270
53146B66680k552k643k000j251j159j432j319r43j137k024k675k377j550r42n70
53131B42106n2M69N43L23M25R18J212J065R17J001R38N72M96J152K053K456K290
53114B58884J874J163mj271k101k513k888l312l602l742l761l513l156l398m550
53099B24110n693n654m576l650l512l777m031m290m434m091l272k434j819j301
53085A71576r83j139j577j725j473j267j342j518j688j852j704j033m45p70j731
53070A51329k099j372l05L48O25O56J79p76j610j929j859j334k9J629K404J816
$$ plain form
53054 147673 148524 149084 149839 150618 151234 151740 151942 151428 150303 149221 148495 147736 146586 145293 144326 143841 143702
53037 143702 143662 143441 143011 142820 143324 144302 145064 145333 145452 145692 145885 145776 145257 144226 142726 141314 140722 141066
53019 141066 141800 142446 142861 142809 141999 140652 139389 138420 137481 136774 137139 138886 141120 142761 143674 144328 144805
53002 144805 144783 144175 143214 142072 140865 139905 139564 139917 140772 141906 143103 144161 145122 146219 147356 147944 147610
52985 147610 146889 146799 147818 149655 151942 154709 158096 161943 165943 170034 174319 178539 181944 184065 185585
52970 185585 187984 191997 196697 200466 202652 203868 204830 205574 205849 205664 205112 204072 202405 200264 197990
52955 197990 195858 194036 192563 191272 189959 188737 187992 187874 188086 188252 188237 188015 187500 186655 185545 184214
52939 184214 182789 181660 181227 181317 181201 180360 178986 177641 176775 176683 177479 178801 179827 179915 179117 177952 176905
$$ packed form
53054A47673Q51N60P55P79O16N06K02n14j125j082p26p59j150j293r67m85j39
53037A43702m0k21m30j91N04R78P62K69J19K40J93j09n19j031j500j412n92L44
53019A41066P34O46M15n2q10j347j263r69r39p07L65J747K234J641R13O54M77
53002A44805k2o08r61j142j207r60l41L53Q55J134J197J058R61J097J137N88l34
52985A47610p21r0J019J837K287K767L387L847M000M091M285M220L405K121J520
52970A85585K399M013M700L769K186J216R62P44K75j85n52j040j667k141k274
52955A97990k132j822j473j291j313j222p45j18K12J66j5k22n15q45j110j331
52939A84214j425j129m33R0j16q41j374j345q66r2P96J322J026Q8p98j165j047
$$ plain form
52922 176905 176279 176232 176643 177099 177225 176979 176587 176352 176546 177250 178247 179291 180481 182016 183587 184498 184506 184116
52904 184116 183863 183741 183569 183450 183532 183722 183964 184528 185630 187072 188551 190027 191519 192861 194008 195222
52888 195222 196549 197491 197653 197405 197327 197262 196606 195376 194305 193822 193604 193330 193298 193971 195289 196775 198119 199437
52870 199437 201081 203339 206120 208812 210636 211343 211407 211463 211722 212109 212696 213683 214944 215997 216587 217098 218172
52853 218172 220002 222260 224668 227376 230564 233899 236685 238575 239945 241519 243673 246062 247859 248433
52839 248433 247868 246746 245309 243093 239626 235359 231513 228931 227337 225701 223192 219772 216184 213335
52825 213335 211487 210049 208372 206600 205370 204757 204049 202638 200584 198135 195281 192122 189276 187411 186521
52810 186521 185965 185109 183690 181776 179659 177664 175856 174071 172369 171149 170526 169937 168730 167016 165493
$$ packed form
52922A76905o26m7M11M56J26k46l92k35J94P04R97J044J190J535J571R11Ql90
52904A84116k53j22j72j19Q2J90K42N64J102J442J479J476J492J342J147J214
52888A95222J327R42J62k48p8o5o56j230j071m83k18k74l2O73J318J486J344J318
52870A99437J644K258K781K692J824P07O4N6K59L87N87R87J261J053N90N11J074
52853B18172J830K258K408K708L188L335K786J890J370J574K154K389J797N74
52839B48433n65j122j437k216l467m267l846k582j594j636k509l420l588k849
52825B13335j848j438j677j772j230o13p08j411k054k449k854l159k846j865q90
52810A86521n56q56j419j914k117j995j808j785j702j220o23n89j207j714j523
$$ plain form
52795 165493 164546 163901 163169 162237 161011 159264 157064 155110 154160 154134 154176 153714 153065 152644 151992 150272 147677
52778 147677 145521 144600 144204 143298 142006 141012 140025 138039 135079 132450 131007 130214 129410 128958 129421 130397 131008
52761 131008 131026 130646 129611 127524 124864 122746 121593 120763 119647 118494 117856 117670 117240 115975 114051 112345
52745 112345 111638 111706 111379 109735 107091 104589 103008 102301 102060 101985 101956 102062 102605 103783 105347 106762 107658
52728 107658 107932 107590 106823 106110 105919 106321 107109 108060 108789 108615 107187 105134 103604 103106 103202 103361 103585 104145
52710 104145 105156 106540 108046 109159 109467 109333 109786 111442 113781 115770 116985 117804 118664 119541 120127 120265
52694 120265 120029 119518 118715 117563 116129 114643 113379 112557 112230 112082 111324 109204 105854 102453 100244 99452
52678 99452 99315 98989 98136 96837 95354 93996 92880 91797 90572 89492 89026 89068 88893 88020 86834 86071 85867
$$ packed form
52795A65493r47o45p32r32j226j747k200j954r50k6M2m62o49m21o52j720k595
52778A47677k156r21l96r06j292r94r87j986k960k629j443p93q04m52M63R76O11
52761A31008J8l80j035k087k660k118j153q30j116j153o38j86m30j265j924j706
52745A12345p07O8l27j644k644k502j581p07k41p5k9J06N43J178J564J415Q96
52728A07658K74l42p67p13j91M02P88R51P29j74j428k053j530m98R6J59K24N60
52710A04145J011J384J506J113L08j34M53J656K339J989J215Q19Q60Q77N86J38
52694A20265k36n11q03j152j434j486j264q22l27j48p58k120l350l401k209p92
52678I9452j37l26q53j299j483j358j116j083j225j080m66M2j75q73j186p63k04
$$ plain form
52661 85867 85649 84841 83507 82242 81588 81654 82259 83251 84484 85507 85622 84499 82636 80961 80002 79616 79414
52644 79414 79241 79196 79381 79686 79813 79633 79528 80165 81730 83554 84758 85103 84953 84645 84331 84342 85148 86784
52626 86784 88543 89436 88889 87134 85152 84129 84483 85419 85732 85137 84374 84008 83683 82832 81678 81087 81638
52609 81638 83244 85494 87963 90234 92013 93317 94359 95213 95719 95722 95236 94415 93514 92873 92721 92909 92997 92743
52591 92743 92455 92774 94099 96200 98333 99686 99898 99286 98604 98459 98865 99422 99903 100558 101732 103290 104582
52574 104582 105037 104715 104273 104508 105878 108294 111233 114103 116583 118667 120421 121825 122838 123539 124139 124905
52558 124905 126022 127466 129011 130433 131674 132756 133695 134624 135872 137623 139577 141238 142517 143716 144901
52543 144901 145691 145836 145652 145629 145842 146036 146141 146450 147276 148591 149973 150918 151297 151526 152111 153026 153686 153552
$$ packed form
52661H5867k18q08j334j265o54O6O05R92J233J023J15j123j863j675r59l86k02
52644G9414j73m5J85L05J27j80j05O37J565J824J204L45j50l08l14J1Q06J636
52626H6784J759Q93n47j755j982j023L54R36L13n95p63l66l25q51j154n91N51
52609H1638J606K250K469K271J779J304J042Q54N06Lm86q21r01o41j52J88Q8k54
52591I2743k88L19J325K101K133J353K12o12o82j45M06N57M81O55J174J558J292
52574A04582M55l22m42K35J370K416K939K870K480K084J754J404J013P01O00P66
52558A24905J117J444J545J422J241J082R39R29J248J751J954J661J279J199J185
52543A44901P90J45j84k3K13J94J05L09Q26J315J382R45L79K29N85R15O60j34
$$ plain form
52525 153552 152567 151095 149741 149173 149690 150799 151573 151671 151696 152463 154137 156187 157883 158707 158650 158175 157683 157051
52507 157051 156092 155303 155372 155940 155802 154613 153503 153425 153768 153374 152147 150733 149252 147467 145828 145163 145431
52490 145431 145788 145945 146481 147705 149116 150243 151250 152370 153408 154135 154662 155160 155635 156221 157219 158589
52474 158589 159809 160461 160686 160905 161406 162287 163431 164466 165056 165303 165576 165972 166355 166834 167713 168923 170004
52457 170004 170703 171116 171231 170876 170264 170028 170471 171197 171667 171727 171429 170818 170169 170018 170649 171720 172666 173256 173719
52438 173719 174495 175839 177433 178498 178640 178439 178780 179730 180582 180928 181015 181039 180790 180129 179239 178242 177103 175981
52420 175981 175056 173981 172201 169967 168212 167267 166500 165479 164579 164019 163277 162099 161233 161346 161864 161762 160963
52403 160963 160103 159381 158618 158122 158438 159279 159669 159330 159133 159896 161309 162362 162493 162011 161603 161665 162133 162827
$$ packed form
52525A53552r85j472j354n68N17J109P74R8K5P67J674K050J696Q24n7m75m92o32
52507A57051r59p89O9N68j38j189j110p8L43l94j227j414j481j785j639o65K68
52490A45431L57J57N36J224J411J127J007J120J038P27N27M98M75N86R98J370
52474A58589J220O52K25K19N01Q81J144J035N90K47K73L96L83M79Q79J210J081
52457A70004O99M13J15l55o12k36M43P26M70O0k98o11o49j51O31J071R46N90M63
52438A73719P76J344J594J065J42k01L41R50Q52L46Q7K4k49o61q90r97j139j122
52420A75981r25j075j780k234j755r45p67j021r00n60p42j178q66J13N18j02p99
52403A60963q60p22p63m96L16Q41L90l39j97P63J413J053J31m82m08O2M68O94
$$ plain form
52385 162827 163810 165139 166380 166884 166688 166679 167490 168697 169556 170123 171073 172660 174459 176056 177449 178797 180221
52368 180221 181879 183874 186033 188094 190084 192284 194849 197655 200507 203311 206090 208943 211862 214588
52354 214588 216907 219106 221769 225028 228452 231804 235327 238994 242167 244512 246715 249589 252975 256208
52340 256208 259286 262695 266265 269065 270525 271048 271436 272257 273737 275772 277984 280188 282685 285707 288794
52325 288794 291343 293541 296094 299128 302179 305216 308819 313125 317453 321320 325186 329763 335159 341080
52311 341080 347397 354043 360744 367302 373953 381085 388813 397146 406311 416563 427727 439181 450360
52298 450360 461282 472682 485514 500010 515268 530078 544142 558139 572685 587831 603642
52287 603642 620579 638849 657805 676506 694636 712497 730300 747837 764748 780817 796121
$$ packed form
52385A62827R83J329J241N04j96rQ11J207Q59N67R50J587J799J597J393J348J424
52368A80221J658J995K159K061J990K200K565K806K852K804K779K853K919K726
52354B14588K319K199K663L259L424L352L523L667L173K345K203K874L386L233
52340B56208L078L409L570K800J460N23L88Q21J480K035K212K204K497L022L087
52325B88794K549K198K553L034L051L037L603M306M328L867L866M577N396N921
52311C41080O317O646O701O558O651P132P728Q333R165J0252J1164J1454J1179
52298D50360J0922J1400J2832J4496J5258J4810J4064J3997J4546J5146J5811
52287F03642J6937J8270J8956J8701J8130J7861J7803J7537J6911J6069J5304
$$ plain form
52276 796121 811117 826365 841763 856203 868431 878323 887041 895851 905039 913950 921736 927847 932117
52263 932117 934767 936361 937452 938155 938259 937809 937329 937213 937203 936867 936444 936626 937419 937931 937654 937327 937972 939515
52245 939515 941099 942525 944551 947770 951999 956967 962909 970115 978369 987274 996792 1007137 1018368 1030307
52231 1030307 1042658 1054962 1066712 1077726 1088208 1098327 1108011 1117272 1126334 1135125 1142988 1149297
52219 1149297 1154152 1158027 1160898 1162192 1161652 1159860 1157761 1155814 1153745 1150996 1147313 1142894 1137990 1132480
52205 1132480 1125982 1118369 1109932 1101015 1091787 1082485 1073514 1065056 1056795 1048417 1040226 1032897 1026644 1020992
52191 1020992 1015434 1010005 1005100 1000953 997511 994643 992273 990340 988757 987415 986142 984711 982946 980867
52177 980867 978682 976573 974535 972453 970350 968447 966911 965564 963919 961557 958493 955230 952443 950495
$$ packed form
52276G96121J4996J5248J5398J4440J2228R892Q718Q810R188Q911P786O111M270
52263I32117K650J594J091P03J04m50m80j16j0l36m23J82P93N12k77l27O45J543
52245I39515J584J426K026L219M229M968N942P206Q254Q905R518J0345J1231J1939
52231A030307J2351J2304J1750J1014J0482J0119R684R261R062Q791P863O309
52219A149297M855L875K871J294n40j792k099j947k069k749l683m419m904n510
52205A132480o498p613q437q917r228r302q971q458q261q378q191p329o253n652
52191A020992n558n429m905m147l442k868k370j933j583j342j273j431j765k079
52177I80867k185k109k038k082k103j903j536j347j645k362l064l263k787j948
$$ plain form
52163 950495 949103 947584 945558 943365 941605 940271 938588 935839 932186 928505 925502 923088 920608 917502
52149 917502 913715 909588 905500 901637 897993 894431 890670 886350 881301 875830 870591 866061 862078 857954
$$ packed form
52163I50495j392j519k026k193j760j334j683k749l653l681l003k414k480l106
52149I17502l787m127m088l863l644l562l761m320n049n471n239m530l983m124
$$ [...]
##END NTUPLES=NMR SPECTRUM
##END=
