
##TITLE=AC1339_BRAAS10082_6666314_TWnfNiZzeE
##JCAMPDX= 6.0         $$ Bruker NMR JCAMP-DX V2.0
##DATA TYPE= NMR SPECTRUM
##DATA CLASS= NTUPLES
##ORIGIN= BRUKER
##OWNER= Administrator
$$ 1.72 TOPSPIN		Version 2.1
$$ 2012-08-13 18:02:55.218 -0500  Administrator@TOPSPIN
$$ Compression mode = diff/dup
##.OBSERVE FREQUENCY= 400.02188249412
##.OBSERVE NUCLEUS= ^1H
##.ACQUISITION MODE= SIMULTANEOUS (DQD)
##.ACQUISITION SCHEME= undefined
##.AVERAGES= 8
##.DIGITISER RES= 22
##SPECTROMETER/DATA SYSTEM= spect
##.PULSE SEQUENCE= zg30
##.SOLVENT NAME= COFFEE_meoh
##.SHIFT REFERENCE= INTERNAL, COFFEE_meoh, 1, 14.98509
##AUDIT TRAIL= $$ (NUMBER, WHEN, WHO, WHERE, PROCESS, VERSION, WHAT)
$$ ##TITLE= Audit trail, TOPSPIN		Version 2.1
$$ ##JCAMPDX= 5.01
$$ ##ORIGIN= Bruker BioSpin GmbH
$$ ##OWNER= Administrator
$$ $$ C:\Bruker\TOPSPIN/data/COFFEE/nmr/AC1339_BRAAS10082_6666314_TWnfNiZzeE/10/pdata/1/auditp.txt
$$ ##AUDIT TRAIL=  $$ (NUMBER, WHEN, WHO, WHERE, PROCESS, VERSION, WHAT)
(   1,<2012-08-13 18:02:46.343 -0500>,<Administrator>,<TOPSPIN>,<go>,<TOPSPIN 2.1>,
      <created by zg
	started at 2012-08-13 18:01:39.687 -0500,
	POWCHK enabled, PULCHK disabled,
       configuration hash MD5:
       6B 1B 68 BB D9 2E 58 E2 7F 35 AD 54 07 DF 0E 41
       data hash MD5: 64K
       37 03 CD 4E 6C 52 46 CF 5C AE DA F7 67 3C A1 A0>)
(   2,<2012-08-13 18:02:50.359 -0500>,<Administrator>,<TOPSPIN>,<proc1d>,<TOPSPIN 2.1>,
      <Start of raw data processing
       efp LB = 0 FT_mod = 6 PKNL = 1 PHC0 = 0 PHC1 = 0 SI = 32K 
       data hash MD5: 32K
       58 21 E3 67 42 F8 AC E6 EC A3 D4 41 C1 82 4F C1>)
(   3,<2012-08-13 18:02:50.703 -0500>,<Administrator>,<TOPSPIN>,<proc1d>,<TOPSPIN 2.1>,
      <pk PHC0 = 181.7139 PHC1 = 0 
       data hash MD5: 32K
       54 17 DC 3E B9 82 17 CB 63 11 CE 7C 4F 6C 1C A8>)
(   4,<2012-08-13 18:02:50.906 -0500>,<Administrator>,<TOPSPIN>,<proc1d>,<TOPSPIN 2.1>,
      <abs ABSG = 1 
       data hash MD5: 32K
       5C 77 D9 3C B8 F8 9C 0D AC C8 3D A6 36 DE AC 73>)
(   5,<2012-08-13 18:02:51.296 -0500>,<Administrator>,<TOPSPIN>,<proc1d>,<TOPSPIN 2.1>,
      <abs ABSG = 2 
       data hash MD5: 32K
       19 44 7A 37 3B F5 26 AA 78 E3 EA C8 88 D1 25 17>)
(   6,<2012-08-13 18:02:51.343 -0500>,<Administrator>,<TOPSPIN>,<proc1d>,<TOPSPIN 2.1>,
      <abs ABSG = 3 
       data hash MD5: 32K
       60 FE 36 05 A6 E4 5D C1 24 78 C4 07 0A F1 BA CE>)
(   7,<2012-08-13 18:02:51.375 -0500>,<Administrator>,<TOPSPIN>,<proc1d>,<TOPSPIN 2.1>,
      <abs ABSG = 4 
       data hash MD5: 32K
       0B 02 69 E8 EE 8A 24 44 99 DB 27 EB 47 4E 73 05>)
(   8,<2012-08-13 18:02:51.406 -0500>,<Administrator>,<TOPSPIN>,<proc1d>,<TOPSPIN 2.1>,
      <abs ABSG = 5 
       data hash MD5: 32K
       B0 32 2E C1 29 EA 4D 33 2F D7 4B D6 47 52 70 CD>)
$$ ##END=
$$ 
$$ $$ hash MD5
$$ $$ 64 36 CD C4 AB 48 46 86 BE 30 0E D9 D4 2F CE B6
##$RELAX= 
##$RELAX= 
##$RELAX= 
##$RELAX= 
##$RELAX= 
##$RELAX= 
##$RELAX= 
$$ Bruker specific parameters
$$ --------------------------
$$ [...]
150 150 150 150 150 150 150 150
##$TP07= 0
##$TPNAME0= <>
##$TPNAME1= <>
##$TPNAME2= <>
##$TPNAME3= <>
##$TPNAME4= <>
##$TPNAME5= <>
##$TPNAME6= <>
##$TPNAME7= <>
##$TPOAL= (0..7)
0.5 0.5 0.5 0.5 0.5 0.5 0.5 0.5
##$TPOFFS= (0..7)
0 0 0 0 0 0 0 0
##$TUNHIN= 0
##$TUNHOUT= 0
##$TUNXOUT= 0
##$USERA1= <user>
##$USERA2= <user>
##$USERA3= <user>
##$USERA4= <user>
##$USERA5= <user>
##$V9= 5
##$VALIST= <valist>
##$VCLIST= <CCCCCCCCCCCCCCC>
##$VD= 0
##$VDLIST= <DDDDDDDDDDDDDDD>
##$VPLIST= <PPPPPPPPPPPPPPP>
##$VTLIST= <TTTTTTTTTTTTTTT>
##$WBST= 1024
##$WBSW= 4
##$XGAIN= (0..3)
0 0 0 0
##$XL= 0
##$YL= 0
##$YMAX_a= 469711
##$YMIN_a= -608970
##$ZGOPTNS= <>
##$ZL1= 120
##$ZL2= 120
##$ZL3= 120
##$ZL4= 120
##$ABSF1= 14.98509
##$ABSF2= -5.573092
##$ABSG= 5
##$ABSL= 3
##$ALPHA= 0
##$AQORDER= 0
##$ASSFAC= 0
##$ASSFACI= 0
##$ASSFACX= 0
##$ASSWID= 0
##$AUNMP= <proc_prof1d_extract_pilot.lims>
##$AXLEFT= 0
##$AXNAME= <>
##$AXNUC= <1H>
##$AXRIGHT= 0
##$AXTYPE= 0
##$AXUNIT= <>
##$AZFE= 0.1
##$AZFW= 0.1
##$BCFW= 0
##$BC_mod= 0
##$BYTORDP= 0
##$COROFFS= 0
##$CY= 15
##$DATMOD= 1
##$DC= 0
##$DFILT= <>
##$DTYPP= 0
##$F1P= 0
##$F2P= 0
##$FCOR= 0.5
##$FTSIZE= 32768
##$FT_mod= 6
##$GAMMA= 0
##$GB= 0
##$INTBC= 1
##$INTSCL= 1
##$ISEN= 128
##$LB= 0
##$LEV0= 0
##$LPBIN= 0
##$MAXI= 10000
##$MC2= 0
##$MEAN= 0
##$ME_mod= 0
##$MI= 0
##$NCOEF= 0
##$NC_proc= -8
##$NLEV= 6
##$NOISF1= 0
##$NOISF2= 0
##$NSP= 0
##$NTH_PI= 0
##$NZP= 0
##$OFFSET= 14.98509
##$PC= 1
##$PHC0= 181.7139
##$PHC1= 0
##$PH_mod= 1
##$PKNL= yes
##$PPARMOD= 0
##$PPDIAG= 0
##$PPIPTYP= 0
##$PPMPNUM= 2147483647
##$PPRESOL= 1
##$PSCAL= 4
##$PSIGN= 0
##$PYNMP= <proc.py>
##$REVERSE= no
##$SF= 400.02
##$SI= 32768
##$SIGF1= 0
##$SIGF2= 0
##$SINO= 400
##$SIOLD= 32768
##$SPECTYP= <>
##$SREGLST= <1H.CDCl3>
##$SSB= 0
##$STSI= 32768
##$STSR= 0
##$SW_p= 8223.68421052631
##$SYMM= 0
##$S_DEV= 0
##$TDeff= 65536
##$TDoff= 0
##$TI= <>
##$TILT= no
##$TM1= 0
##$TM2= 0
##$TOPLEV= 0
##$USERP1= <user>
##$USERP2= <user>
##$USERP3= <user>
##$USERP4= <user>
##$USERP5= <user>
##$WDW= 1
##$XDIM= 32768
##$YMAX_p= 477903719
##$YMIN_p= -705562
##$CURPLOT= <Network HP LaserJet P1505>
##$CURPRIN= <$Network HP LaserJet P1505>
##$DFORMAT= <normdp>
##$LAYOUT= <+/1D_H.xwp>
##$LFORMAT= <normlp>
##$PFORMAT= <normpl>
##$SURQMSG= 1
$$ End of Bruker specific parameters
$$ ---------------------------------
##NTUPLES= NMR SPECTRUM
##VAR_NAME=  FREQUENCY,     SPECTRUM/REAL,   SPECTRUM/IMAG
##SYMBOL=    X,             R,               I
##VAR_TYPE=  INDEPENDENT,   DEPENDENT,       DEPENDENT
##VAR_FORM=  AFFN,          ASDF,            ASDF
##VAR_DIM=   32768,         32768,           32768
##UNITS=     HZ,            ARBITRARY UNITS, ARBITRARY UNITS
##FACTOR=    0.250966925370066, 1,           1
##FIRST=     8223.43324360094, -109229,      -161497
##LAST=      0,             34589,           -80173
##MIN=       0,             -705562,         0
##MAX=       8223.43324360094, 477903719,    0
$$ Real data points
##PAGE= N=1
##DATA TABLE= (X++(R..R)), XYDATA
$$ [...]
19482C1227a72472m3750j29669i7530k53814B39459e5273G9978e133k41815i483
$$ 31227 -172472 -216222 -345891 -97530 -351344 239459 -55273 79978 -5133 -246948 -9483
19470a66438n603B837b18807A33839l3252P9574c0956A26531c68620B77206j20015
$$ -166438 -172041 2837 -218807 133839 100587 180161 -30956 126531 -368620 277206 157191
19459A57191o539B1417J10206c3696j2730k04138b7373p4872d5751A69262c07444
$$ 157191 150652 21417 131623 -33696 -46426 -250564 -27373 -102245 -45751 169262 -307444
19447G5826e890q3401k18633a01576J5766j98429A70345d22254e9996k7564B34687
$$ 75826 -5890 -89291 -307924 -101576 -85810 -284239 170345 -422254 -59996 -87560 234687
19435G9857c15382I7638P0000a68791o938C41183b24902C99b87366J09143N329
$$ 79857 -315382 97638 167638 -168791 -175729 341183 -224902 399 -287366 -178223 -172894
19424a72894c9484D7754J11931b97106a13358J190F4459K0115a60274j40961B22605
$$ -172894 -39484 47754 159685 -297106 -113358 -112168 64459 84574 -160274 -301235 222605
19412A23358a01668H8129h0073j28377N3786C1066a57373j5346k4682a042B6773
$$ 123358 -101668 88129 -80073 -208450 -154664 31066 -157373 -172719 -197401 -1042 26773
19400d6315H8950c37300d2635j3597l59145F7617b39688A97223a41781b0781l59784
$$ -46315 88950 -337300 -42635 -56232 -415377 67617 -239688 197223 -141781 -20781 -380565
19389c80565B33189e6991m6337C5316a21542q6345D2802J25866i4972a9075p0568
$$ -380565 233189 -56991 -103328 35316 -121542 -207887 42802 168668 -94972 -19075 -89643
19378h9643A14889j1731a54193M6666d9421k06021j41753J22940a7291A34481
$$ -89643 114889 103158 -154193 -107527 -49421 -255442 -397195 -274255 -17291 134481
19367g6321j30787j06902J29752L5399I02b4340l6842h345G6967J0615L836b69939
$$ -76321 -207108 -314010 -184258 -148859 902 -24340 -61182 -8345 76967 87582 91418 -269939
19354b21181J7518O7330C4623M5917b31817b2192k00408A65715h9965j78578p2379
$$ -221181 -203663 -136333 34623 80540 -231817 -22192 -222600 165715 -89965 -268543 -340922
19343c40922a49636A23439d63403b1587B1034b177p1897l11482i0363A88169a3935
$$ -340922 -149636 123439 -463403 -21587 21034 -2177 -74074 -385556 -90363 188169 -13935
19331F2296i6E7734J03115E6842K33259A35512a71739P4017J9088m1100j925j01352
$$ 62296 -96 57734 160849 56842 290101 135512 -171739 -97722 -78634 -119734 -121659 -223011
19319b23011I7457R3860c08057A67667c7387j16767j96398a30942m4600O1773
$$ -223011 97457 191317 -308057 167667 -37387 -154154 -350552 -130942 -175542 -113769
19309a13769C5721N7800C8132f6293c2432j84285d5327O678I162b57063F620b01412
$$ -113769 35721 93521 38132 -66293 -32432 -216717 -45327 -38649 9162 -257063 6620 -201412
19296f7601k70524a18229N3023B6088a84398A91012b72227J19355b0188p5228
$$ -67601 -338125 -118229 -65206 26088 -184398 191012 -272227 -152872 -20188 -95416
19286i5416a9322l0165j91202F3778b34805A05896i8453b7869l3173A97951e4232
$$ -95416 -19322 -49487 -240689 63778 -234805 105896 -98453 -27869 -61042 197951 -54232
19274c39048C6671a51748C24177C3790c38324c9028A39825i8210K3780l129n3418
$$ -339048 36671 -151748 324177 33790 -338324 -39028 139825 -98210 -74430 -77559 -130977
19263a30977C3470K04756d15307a1529A02207J7910D3372c49686j29531b31257
$$ -130977 33470 238226 -415307 -11529 102207 120117 43372 -349686 -479217 -231257
19252b20920P8091B34230a13813N5895B20626D9230b31962c4287E3831g9315r1928
$$ -220920 -142829 234230 -113813 -57918 220626 49230 -231962 -34287 53831 -79315 -171243
19241a71243L221B29642b31979j76357A27875j1015E75b82634B3275J36130b17579
$$ -171243 -168022 229642 -231979 -408336 127875 116860 575 -282634 23275 159405 -217579
19229b32438B58345a51307d8909q0897G8228b05077p9808e0200k30085O8945h2637
$$ -232438 258345 -151307 -48909 -129806 78228 -205077 -284885 -50200 -280285 -211340 -82637
19217b53849l5475A23606b21737L8107P943H5548K7541g1622j23470i6904j4559
$$ -253849 -289324 123606 -221737 -183630 -175687 85548 113089 -71622 -195092 -96904 -111463
19206a11463r3130j82741A68571a38330c0270l35385J64708d3455a6309j52064
$$ -111463 -204593 -387334 168571 -138330 -30270 -365655 -200947 -43455 -16309 -168373
19196a68373a9352G5411Q1888d9607A13035J2799b42149R306J01033L8937k65048
$$ -168373 -19352 75411 157299 -49607 113035 125834 -242149 -232843 -131810 -92873 -357921
19185c57921B3546J28095h3379j95880D2556J66034H1074M3288a77330b207E2051
$$ -357921 23546 151641 -83379 -279259 42556 208590 81074 124362 -177330 -2207 52051
19173f4650r4142P9322E3891a87455B30142H490Q5575m0774L1451J54474g2594
$$ -64650 -158792 -79470 53891 -187455 230142 8490 94065 53291 84742 239216 -72594
19161C98999A41477h4720L8012j19893A25344f5395k53030M1820a10046K7330
$$ 398999 141477 -84720 -46708 -166601 125344 -65395 -318425 -276605 -110046 -82716
19151h2716C479M18040g3017K4300B9770c14294a47082j7076A08752j7993i1528
$$ -82716 3479 421519 -73017 -48717 29770 -314294 -147082 -164158 108752 90759 -91528
19139c70935C9110J07774a17889j1983F5078a47813B03274B528O8127L19880A80067
$$ -370935 39110 146884 -117889 -129872 65078 -147813 203274 2528 70655 390535 180067
19127G3199L5854f55355B46939F1187a77194A76933b54845B4144b27230i5056
$$ 73199 109053 -655355 246939 61187 -177194 176933 -254845 24144 -227230 -95056
19116c20342a226j39635A41374N5553h6344j59953C6686b53636g6337B37397c0220
$$ -320342 -1226 -140861 141374 196927 -86344 -246297 36686 -253636 -76337 237397 -30220
19104B74062J6820G8988J35344b5570k26314c0262r1231A22476b21043A10243
$$ 274062 290882 78988 214332 -25570 -251884 -30262 -121493 122476 -221043 110243
19093b47700j6595b4881D9813a6864n0240p8040c2184G0905c9316J3179j83239
$$ -247700 -264295 -24881 49813 -16864 -67104 -145144 -32184 70905 -39316 -26137 -209376
19082b09376I8340a80679j93156J21040O9731j28657d6211k87882A36421g558
$$ -209376 98340 -180679 -373835 -252795 -183064 -311721 -46211 -334093 136421 -7558
19071A05549b93155P9588A78001a33100n7875A25421L4542e3269A3633c37818
$$ 105549 -293155 -213567 178001 -133100 -190975 125421 159963 -53269 13633 -337818
19060A20466d4534n0424L4227D2479a21661B5722K57726b64421B67134i8317J0536
$$ 120466 -44534 -94958 -60731 42479 -121661 25722 283448 -264421 267134 -98317 -87781
19049h7781J7553j8441I2794N3334E0834b52029f9594j01538B75799a00860j05530
$$ -87781 -70228 -88669 92794 146128 50834 -252029 -69594 -171132 275799 -100860 -206390
19038b06390L5173M8931D0478g1702o5402B17241f0171o1305j67713B28061b19468
$$ -206390 -171217 -122286 40478 -71702 -137104 217241 -60171 -121476 -289189 228061 -219468
19026b35328Q8370B23094c17925A22733d707B2694a04726I1270J74415h9730p1144
$$ -235328 -146958 223094 -317925 122733 -4707 22694 -104726 91270 265685 -89730 -160874
19015a60874p5419A840L2316K38087a36185A42083b29051F538L3878a52440j01664
$$ -160874 -236293 1840 34156 272243 -136185 142083 -229051 6538 40416 -152440 -254104
19004b54104A1669b27889d4786J7337k201G346a99289p3459B03395b8347r519
$$ -254104 11669 -227889 -44786 -27449 -29650 7346 -199289 -272748 203395 -28347 -37866
18993c7866D5047A4934K08423b4408j13756A74417g680k36172f8156q5460O8585
$$ -37866 45047 14934 223357 -24408 -138164 174417 -7680 -243852 -68156 -153616 -85031
18982h5031D7393a60609f3344m3688D0856J9798B59h34H7631J92373a21728D82264
$$ -85031 47393 -160609 -63344 -107032 40856 60654 259 -834 87631 280004 -121728 482264
18969E58301B41143o6051a57507J929A09528d181m74848A31561d8677O354k41615
$$ 558301 241143 175092 -157507 -155578 109528 -4181 -479029 131561 -48677 -42323 -283938
18958b83938E0348N7407a2285C20477b16251B59141B2187a53538N0381k0080G4488
$$ -283938 50348 107755 -12285 320477 -216251 259141 22187 -153538 -103157 -123237 74488
18946a52922K2376H1918Q7060h280k13664N4261A64284g4049A24061K11809a73711
$$ -152922 -130546 81918 168978 -8280 -221944 -167683 164284 -74049 124061 335870 -173711
18934g127m9403j00525A1522J6066N0711K50354a73749e5838j27147P2789o9638
$$ -7127 -56530 -157055 11522 27588 78299 328653 -173749 -55838 -182985 -110196 -179834
18923a79834I9802a70096C8081J46512a48883E2069J61893c24479f6519A26197
$$ -179834 99802 -170096 38081 184593 -148883 52069 213962 -324479 -66519 126197
18912a40762L4608C1772J59071J00467O1802J55235P0791C2456d2595j32463M2732
$$ -140762 -106154 31772 190843 291310 353112 508347 579138 32456 -42595 -175058 -132326
18901a32326a6696p2741c6931j80730f8954j15206B9455d3459j79042C15446j10902
$$ -132326 -16696 -89437 -36931 -217661 -68954 -184160 29455 -43459 -222501 315446 204544
18890B04544r2750N5007i7657k4641n2557B20625a61337B9133b95614e5095k77610
$$ 204544 111794 166801 -97657 -122298 -174855 220625 -161337 29133 -295614 -55095 -332705
18879c32705e7714n8784M8897n2637N0357k04745A73692b0439A05473a28599M7337
$$ -332705 -57714 -116498 -67601 -120238 -69881 -274626 173692 -20439 105473 -128599 -81262
18868h1262F7542g0116K1856m47526a10616B37112H8341a9105j76134L6163p1417
$$ -81262 67542 -70116 -48260 -495786 -110616 237112 88341 -19105 -195239 -159076 -230493
18857b30493A4187J3854e2886k70754A32907c31248A37732F379a04900j31833
$$ -230493 14187 28041 -52886 -323640 132907 -331248 137732 6379 -104900 -236733
18847b36733B2309b20608n0929r816f3446j05451P0340A98884a80670B75382A24466
$$ -236733 22309 -220608 -271537 -281353 -63446 -168897 -98557 198884 -180670 275382 124466
18835B13591G1740a02D9184i3393d1394E9083c43852B60738a12618E1583J2477
$$ 213591 71740 -102 49184 -93393 -41394 59083 -343852 260738 -112618 51583 64060
18824F4060P1956d6479n8997j04101a03185H2653c3542A4053Q1399b7954n2523
$$ 64060 136016 -46479 -105476 -209577 -103185 82653 -33542 14053 95452 -27954 -80477
18813h0477a6305G9828Q4107a72554C51721A18723e112B08822l5889P5241E7307
$$ -80477 -16305 79828 163935 -172554 351721 118723 -5112 208822 172933 248174 57307
18801c799n9947j51558d610j96966j1188E54407a91829A81020b5j09584k48334
$$ -3799 -63746 -215304 -4610 -201576 -212764 554407 -191829 181020 -25 -109609 -357943
18790c57943n1534l2322A0214K62381R216a36654e0784k11532B33521J21524d29036
$$ -357943 -409477 -441799 10214 272595 281811 -136654 -50784 -262316 233521 355045 -429036
18778b7671l022K009j39714B6066a39699B31732B8346R2504a79327K2520A24920
$$ -27671 -30693 -28684 -168398 26066 -139699 231732 28346 120850 -179327 -156807 124920
18766B99652a86120g0246J1882m8581d1985I5685b12790R7183p0777F2482b20973
$$ 299652 -186120 -70246 -58364 -106945 -41985 95685 -212790 -115607 -186384 62482 -220973
18754d8659E6386a83478p7562E5767a46738H5173k0766N8687a05397A58842D5802
$$ -48659 56386 -183478 -261040 55767 -146738 85173 64407 123094 -105397 158842 45802
18742C44801A07486a41206A13504a34939d3471c13j34713k57148h3627K0908k16227
$$ 344801 107486 -141206 113504 -134939 -43471 -313 -135026 -392174 -83627 -62719 -278946
18731b78946k8065I1211a28094b811n4485j54699a04996L5109G3892M9515j6435
$$ -278946 -307011 91211 -128094 -2811 -57296 -211995 -104996 -69887 73892 123407 106972
18720A06972m0889e3256j72891N2626J3763l10093b11538c6926k10340J5159E8227
$$ 106972 66083 -53256 -226147 -173521 -159758 -469851 -211538 -36926 -247266 -232107 58227
18708e0321l4743l8220j18956D29948h3890M1937j84686d9039G2991g0341b8410
$$ -50321 -85064 -123284 -242240 429948 -83890 -41953 -226639 -49039 72991 -70341 -28410
18696B7598K8822j6283d9953R759F4856q51K5958c18173a08782n2732G2767h2689
$$ 27598 56420 40137 -49953 -40194 64856 64005 89963 -318173 -108782 -161514 72767 -82689
18683B46371b7407j9987k7770G8163a65777A01912b74072C0954K9270c40147D25343
$$ 246371 -27407 -47394 -75164 78163 -165777 101912 -274072 30954 60224 -340147 425343
18671A22217a68222C40018f4811j9912j7437m1555j51980J23046B74016b57572
$$ 122217 -168222 340018 -64811 -84723 -102160 -143715 -295695 -172649 274016 -257572
18660B40870j17266q494c86322a05813K5165p1906A7632a89700p7991A26864a19254
$$ 240870 123604 115110 -386322 -105813 -80648 -152554 17632 -189700 -267691 126864 -119254
18648f54j8068G4608h3498F551b06438k0093b9968j42094A11557i8059m3286j64409
$$ -654 -18722 74608 -83498 6551 -206438 -226531 -29968 -172062 111557 -98059 -141345 -305754
18636c05754M2642A648Q9839e98636C6669h150j4733k7524J3475k99691g2257
$$ -305754 -263112 1648 91487 -598636 36669 -8150 -22883 -50407 -36932 -336623 -72257
18624a54166K5313k64143a64793P2489n9372c2437o1412q9457a0285B4292M4051
$$ -154166 -128853 -392996 -164793 -92304 -151676 -32437 -93849 -183306 -10285 24292 68343
18613F8343a52810B89225D5869a34615A09112g3809A17493i6429d55I2991c0444
$$ 68343 -152810 289225 45869 -134615 109112 -73809 117493 -96429 -455 92991 -30444
18601d7921M717m5873K4567j69765P9388B42095f2351D37670A10982P7757a50815
$$ -47921 -43204 -89077 -64510 -234275 -154887 242095 -62351 437670 110982 188739 -150815
18589G3095a55477A70241a48374p3986b3249C9463c83922a57724f8396I636K00456
$$ 73095 -155477 170241 -148374 -222360 -23249 39463 -383922 -157724 -68396 9636 210092
18578B10092b71297E4822K16586j11290c16213A96530b64453q8753a2564B5899
$$ 210092 -271297 54822 271408 160118 -316213 196530 -264453 -353206 -12564 25899
18567a59928a4507j52767b2927k22888B22406c62805A0521b96077A25869b19390
$$ -159928 -14507 -167274 -22927 -245815 222406 -362805 10521 -296077 125869 -219390
18556b24692j9659H0625K3746L1267a19829k52379g0967J6699p1525A39457n3469
$$ -224692 -244351 80625 104371 135638 -119829 -372208 -70967 -54268 -125793 139457 85988
18545H5988c2626H2538a18795B41130b22640R3907L5274A2480b30267h6606m73921
$$ 85988 -32626 82538 -118795 241130 -222640 -128733 -93459 12480 -230267 -86606 -560527
18534e60527b60443R7049A43356J78571h3956l6972C8062K9533b23552A27668
$$ -560527 -260443 -163394 143356 321927 -83956 -120928 38062 67595 -223552 127668
18523f0748D1859N2203a83484g999O70j46395j07964A07405e3026K2676k02467
$$ -60748 41859 94062 -183484 -7999 -7329 -153724 -261688 107405 -53026 -30350 -232817
18512b32817H8615D3804c54874J0702O8092a27943A51571d93475A33124a87803
$$ -232817 88615 43804 -354874 -344172 -276080 -127943 151571 -493475 133124 -187803
18501e107l56650l827a56841b4286c712l06149g62j08295g47k39012A82462O1609
$$ -5107 -361757 -365584 -156841 -24286 -3712 -309861 -762 -109057 -747 -239759 182462 244071
18489B44071J31218F1629J69848c7122j4159c861j72931K0464g922E9872b17391
$$ 244071 375289 61629 231477 -37122 -51281 -3861 -176792 -156328 -7922 59872 -217391
18477f174j40209P0738J5539A65929b94618A236L3731B557b5846n59746d4279
$$ -6174 -146383 -75645 -60106 165929 -294618 1236 34967 2557 -25846 -585592 -44279
18465C37209b91870C8358J71672a65562O6808m1749M1229A76661p9776K3072c54602
$$ 337209 -291870 38358 210030 -165562 -98754 -140503 -99274 176661 96885 119957 -354602
18453A03138d00118D3685a70152A8226q554K05853c35451J03597M9125D9942A8518
$$ 103138 -400118 43685 -170152 18226 9672 215525 -335451 -231854 -182729 49942 18518
18441A02537J79690a81400O3710l6692C05536A17490a62421L9863L4613m2518
$$ 102537 282227 -181400 -117690 -154382 305536 117490 -162421 -122558 -87945 -130463
18431a30463G5559B2804c5457l55969a2091E2388b71877B95154h5942o5857G9364
$$ -130463 75559 22804 -35457 -391426 -12091 52388 -271877 295154 -85942 -151799 79364
18419b50698a17164e025m568j64082D440a81714A32343a20542L577A3564a06645
$$ -250698 -117164 -5025 -9593 -173675 4440 -181714 132343 -120542 -116965 13564 -106645
18407A70727b25886D6280b828k77314H0125K40620g8519L3842A48932o1079k3735
$$ 170727 -225886 46280 -2828 -280142 80125 320745 -78519 -44677 148932 87853 64118
18396F4118a03812E6034c7358j92595n0487d8039m0062A27146C0613P8359b00136
$$ 64118 -103812 56034 -37358 -229953 -280440 -48039 -88101 127146 30613 108972 -200136
18384a41165A7360a05912j42076F2694Q8512K9911C111f2509F0435a86905b887
$$ -141165 17360 -105912 -247988 62694 151206 181117 3111 -62509 60435 -186905 -2887
18372H0361R3262E9636a451l40038g9915k48224C34478a53602A52689J33203r2904
$$ 80361 173623 59636 -1451 -341489 -79915 -328139 334478 -153602 152689 285892 192988
18361A92988L77110A9150j796R5928a36920N6782A27893E5955a13278B58244j9582
$$ 192988 570098 19150 17354 113282 -136920 -80138 127893 55955 -113278 258244 238662
18350B38662j8304E5050a30323I4489L75485A7826O8327c59980D8018a39120A35846
$$ 238662 220358 55050 -130323 94489 469974 17826 86153 -359980 48018 -139120 135846
18338a11204r7795D09045c81050d1533p7480l49571K14598I8711m6117b02952
$$ -111204 -208999 409045 -381050 -41533 -119013 -468584 -253986 98711 52594 -202952
18327a8990H3168b23093B41240d46627I9497J57461i0196A34576i9955a427j16208
$$ -18990 83168 -223093 241240 -446627 99497 256958 -90196 134576 -99955 -1427 -117635
18316a17635N8720A02709m7498d51880B24625o1081c11822B9817K14479a11257
$$ -117635 -58915 102709 55211 -451880 224625 163544 -311822 29817 244296 -111257
18305B77454B0584b07839R904A52985d3661a3981G4190a84952h1275j84360B94945
$$ 277454 20584 -207839 -197935 152985 -43661 -13981 74190 -184952 -81275 -265635 294945
18293F3085J34727Q2103g5885j32674C11174a20809B85734E9605b3421k9194j12377
$$ 63085 197812 279915 -75885 -208559 311174 -120809 285734 59605 -23421 -52615 -164992
18282a64992O6202G9179a48847c6076n5376A69598c06547G6758c13042A22141
$$ -164992 -98790 79179 -148847 -36076 -91452 169598 -306547 76758 -313042 122141
18271a2592D2917L0866f5852C2270b26298H3028k946N8823e9178k54534A85371
$$ -12592 42917 73783 -65852 32270 -226298 83028 80082 138905 -59178 -313712 185371
18259b7593G8715J25662N4964h1735A43225b81385h3845I5768i5915b6744B02308
$$ -27593 78715 204377 259341 -81735 143225 -281385 -83845 95768 -95915 -26744 202308
18247C3662M82828a18414J5226I8076Q5179a79811j44915a0760B0907a6872B77232
$$ 33662 516490 -118414 -103188 98076 183255 -179811 -324726 -10760 20907 -16872 277232
18235b7843k80403E65811e4785j57562A16064J11645p7371F8126c89362E8129
$$ -27843 -308246 565811 -54785 -212347 116064 227709 150338 68126 -389362 58129
18224I7398b73059i653E2422a85698D31885a01739k1818M1754l32265c5661A06657
$$ 97398 -273059 -9653 52422 -185698 431885 -101739 -123557 -81803 -414068 -35661 106657
18212a82673b7023A74009a05368A85923a68893A86715b22564M456J03444C2757
$$ -182673 -27023 174009 -105368 185923 -168893 186715 -222564 -218108 -114664 32757
18201A13287A1695a75286l13415a90600r3524B9984M0959K18326A2679a44428
$$ 113287 11695 -175286 -488701 -190600 -284124 29984 70943 289269 12679 -144428
18190a02639q7358P4261b5681D6478P9583n4061l3657J18938a8428F1266d2440
$$ -102639 -189997 -115736 -25681 46478 126061 72000 38343 157281 -18428 61266 -42440
18178F4200a04220c01G0261b30028f9242B06398O3683a8296k5557j7375A02080
$$ 64200 -104220 -301 70261 -230028 -69242 206398 270081 -18296 -43853 -61228 102080
18166A75435b26941k4871g3582j35967B006J19198g3730j87259A9263b270k02429
$$ 175435 -226941 -251812 -73582 -209549 2006 121204 -73730 -260989 19263 -2270 -204699
18155b04699j1826B4171d5125A98851g8079j74513A51285b63349D2638b23973
$$ -204699 -216525 24171 -45125 198851 -78079 -252592 151285 -263349 42638 -223973
18144e8550J7056B39651A9156b30837a14768E2751e0679j47430I0146J93050A3583
$$ -58550 -41494 239651 19156 -230837 -114768 52751 -50679 -198109 90146 283196 13583
18132I2758i3301K8264I9475a19351c4025j16315A19616a47987J5674C0002M3739
$$ 92758 -93301 -65037 99475 -119351 -34025 -150340 119616 -147987 -132313 30002 73741
18121G3741g3694A68433J31982a19893A71326q2043J05251e0648A13707J65992
$$ 73741 -73694 168433 300415 -119893 171326 89283 194534 -50648 113707 279699
18111B79699r0029n2085J26514G5168K6841A220a62970o0971h0864j03556j38908
$$ 279699 189670 137585 264099 75168 102009 1220 -162970 -223941 -80864 -184420 -323328
18100c23328J47831I7057d3133J424D5206b46812A03346J47132E6147b18775R4113
$$ -323328 -175497 97057 -43133 -41709 45206 -246812 103346 250478 56147 -218775 -124662
18089a24662A66732g3215a8011k31858B47400o857d22738A85381g7674C06108
$$ -124662 166732 -73215 -18011 -249869 247400 240543 -422738 185381 -77674 306108
18078B83543n2705D2238J92420d5611m4418B91602a0352n7180D64419A24139h6236
$$ 283543 230838 42238 234658 -45611 -90029 291602 -10352 -67532 464419 124139 -86236
18066b06494m8859R2364f0059j29609a5984m7221h749m7059j17245c8495B10796
$$ -206494 -255353 -162989 -60059 -189668 -15984 -63205 -8749 -55808 -173053 -38495 210796
18054h2575B64516F3965a1373l65859I0892F462g2901n1335A16544b00406Q8477
$$ -82575 264516 63965 -11373 -377232 90892 6462 -72901 -124236 116544 -200406 -111929
18043a11929k68217G2330d32108a4406j34724q4278B00674b3346n650j69014f662
$$ -111929 -380146 72330 -432108 -14406 -149130 -233408 200674 -23346 -28996 -198010 -6662
18031E5457b79102A33098N4309a9426j83023Q6154G7936L6903a66576a4408A86574
$$ 55457 -279102 133098 187407 -19426 -202449 -116295 77936 114839 -166576 -14408 186574
18019a68073A01335a29578f1128B07467a63347B6841a85145P1981d6104m1721
$$ -168073 101335 -129578 -61128 207467 -163347 26841 -185145 -113164 -46104 -87825
18009h7825b1522I492b0118n035A63886F8285a60168k2058B51249b17653g4481
$$ -87825 -21522 9492 -20118 -25153 163886 68285 -160168 -182226 251249 -217653 -74481
17997g5527A08144k63i0080A42444a11635A16166O0100o4765a10986B0966b935
$$ -75527 108144 107881 -90080 142444 -111635 116166 176266 111501 -110986 20966 -2935
17985C08953a76191k9876E3123j9226J67057a80187A58754l866p1091b99382a34415
$$ 308953 -176191 -206067 53123 33897 200954 -180187 158754 154888 83797 -299382 -134415
17973b01119A70259o8642j2441b57339A30468a62242F9826O1384a62338g356C42776
$$ -201119 170259 101617 89176 -257339 130468 -162242 69826 131210 -162338 -7356 342776
17961C0614c11696J13987H1856Q0458e0259A10647b44982a08907Q629n8123k17696
$$ 30614 -311696 -197709 81856 162314 -50259 110647 -244982 -108907 -100278 -158401 -376097
17950c76097A36958d53815C2271b86988G9473l0739A532a0257I0384J92696j32286
$$ -376097 136958 -453815 32271 -286988 79473 48734 1532 -10257 90384 283080 150794
17939A50794B8956b5067B41396a5622l1170B0063N7641J63889F9583K8869a61978
$$ 150794 28956 -25067 241396 -15622 -46792 20063 77704 241593 69583 98452 -161978
17927A53394c5023A30467G319c0548D7903h1644L8741A88027b64839f3277l41567
$$ 153394 -35023 130467 7319 -30548 47903 -81644 -42903 188027 -264839 -63277 -404844
17916d04844h3946A26828J1476a6957o3782l6147j7692k6785a8387A97439k0848
$$ -404844 -83946 126828 138304 -16957 -80739 -116886 -134578 -161363 -18387 197439 176591
17905A76591a18941a254n03962c6206m5470A05889B1115a05114C48633j57446
$$ 176591 -118941 -1254 -505216 -36206 -81676 105889 21115 -105114 348633 191187
17895A91187B4588d6405k4446A22071b21407C75713b28549N9700P4319B2328a38627
$$ 191187 24588 -46405 -70851 122071 -221407 375713 -228549 -168849 -94530 22328 -138627
17883B17663d6236I7339A2224J67112g3986D1744b80352J2299m2442a03999D64214
$$ 217663 -46236 97339 12224 179336 -73986 41744 -280352 -268053 -310495 -103999 464214
17871H7118J22823G3813h8935a3135B29829c9191A442K36713b00301E3147b99307
$$ 87118 209941 73813 -88935 -13135 229829 -39191 1442 238155 -200301 53147 -299307
17859a6219l71981a44781B7123c3955C04699a41493O4365E7928J1479k1587g2157
$$ -16219 -388200 -144781 27123 -33955 304699 -141493 -77128 57928 69407 47820 -72157
17847D15497F8380N37577B7940J37402F2776l462L7782J1259c25974P56R5594
$$ 415497 68380 605957 27940 165342 62776 59314 97096 108355 -325974 -325218 -229624
17836b29624Q8457j27658d1077C7835j825K40305P6358b8872B75584a64781f4987
$$ -229624 -141167 -268825 -41077 37835 36010 276315 352673 -28872 275584 -164781 -64987
17824A65690f8977j25665A0133L40596b77557C9061A1295g7676k06119p604B18645
$$ 165690 -68977 -194642 10133 350729 -277557 39061 11295 -77676 -283795 -291399 218645
17812A10189a78952E5535K31631A15230J34716j5785N9790a99464g3373n3000
$$ 110189 -178952 55535 287166 115230 249946 234161 293951 -199464 -73373 -126373
17802a26373d2102c057H9239b39308k332j2308E0582k682a93016D33489A96368
$$ -126373 -42102 -3057 89239 -239308 -241640 -253948 50582 47900 -193016 433489 196368
17790C9856b53628f413B79671R3083f2620o5638b154B7348b37724A94723o2500
$$ 39856 -253628 -6413 279671 372754 -62620 -128258 -2154 27348 -237724 194723 132223
17779A32223L7353d08739O1177A42609m8575a8421l27737a20901A41685B2312
$$ 132223 169576 -408739 -347562 142609 94034 -18421 -346158 -120901 141685 22312
17768f9250C1665J30739a10410l6907K7475p2071c0263D24230I7279J9149J16395
$$ -69250 31665 162404 -110410 -147317 -119842 -191913 -30263 424230 97279 116428 232823
17757B32823D3710c6357g403F4662K8403C5259N5105f2901k02368a30118A85974
$$ 232823 43710 -36357 -7403 64662 93065 35259 90364 -62901 -265269 -130118 185974
17745B4031b08517C22969A43105J38236A337K81662A03261a682A26368M6773g4251
$$ 24031 -208517 322969 143105 281341 1337 282999 103261 -1682 126368 173141 -74251
17733f64A06508k4058M3659f534G7706j090L80606B01472c2103A48567b12231
$$ -664 106508 82450 126109 -6534 77706 76616 457222 201472 -32103 148567 -212231
17721I3636b48859B67075a01882C21943j18323n907H6013M097b28784B81578j01690
$$ 93636 -248859 267075 -101882 321943 203620 197713 86013 90110 -228784 281578 179888
17710A79888e1166f619B09512m0391c1906C04735a2367H2641L1605J64453b36143
$$ 179888 -51166 -6619 209512 169121 -31906 304735 -12367 82641 114246 278699 -236143
17698A30997a22516E42862b12545b8213C59188G3303J42702H0264i0979K8746
$$ 130997 -122516 542862 -212545 -28213 359188 73303 216005 80264 -90979 -62233
17688f2233G279a25788I6826a69538F045d5495a0601j70667B04742j7416a76008
$$ -62233 7279 -125788 96826 -169538 6045 -45495 -10601 -181268 204742 187326 -176008
17676A33743N4646a28989j28066A76991o8993J75291n0058I1203K28681D2567
$$ 133743 188389 -128989 -257055 176991 107998 283289 233231 91203 319884 42567
17665b4027k92431R2438a4532k8452G4542e70k64832A25661n0034K8457K5577
$$ -24027 -316458 -224020 -14532 -42984 74542 -570 -265402 125661 75627 104084 129661
17654A29661i7971c51A66666n0472b4224B35238G9791N4363a79526a2741j2653
$$ 129661 -97971 -351 166666 116194 -24224 235238 79791 134154 -179526 -12741 -25394
17643b5394B18766D9823M199J85857a92087B89500H6067B7977L05761E7692h7995
$$ -25394 218766 49823 54022 239879 -192087 289500 86067 27977 333738 57692 -87995
17631c0638P755A55094J27680m7787i0413F7222b991j9036j2986H035P0776J64592
$$ -30638 -22883 155094 282774 234987 -90413 67222 -2991 -22027 -35013 8035 78811 243403
17619B43403E119J29065B6364f3745B8806J8477a08245A19525P280A340J90267
$$ 243403 5119 134184 26364 -63745 28806 47283 -108245 119525 126805 1340 191607
17608A91607a74401G4220K37964g1401B73835l9803J0914O2969A6224J59296i5420
$$ 191607 -174401 74220 312184 -71401 273835 234032 244946 307915 16224 175520 -95420
17596a65359A58239D3560N9865J2006i6517B85582A12549A6872c5B65586h2174
$$ -165359 158239 43560 103425 115431 -96517 285582 112549 16872 -35 265586 -82174
17584A47932c9860A81116p2206K18548b18499P1173C8973j3938M09891e0427k73735
$$ 147932 -39860 181116 108910 327458 -218499 -147326 38973 25035 434926 -50427 -324162
17573c24162D25640j135I4102L61264F1409B0835N9649K92724C3906L48921I4723
$$ -324162 425640 424505 94102 455366 61409 20835 80484 373208 33906 382827 94723
17561A55444J46900A30117g521E9982K27354m9432J19973A37720j0322C4323N106
$$ 155444 302344 130117 -7521 59982 287336 237904 357877 137720 127398 34323 39429
17550C9429i5598B19186K24555j94463o3616K63464e1394C29846j21375l1461
$$ 39429 -95598 219186 443741 249278 185662 449126 -51394 329846 208471 177010
17540A77010m0576k842b6481D43664A31972J0273g7899I1076J37599M52362A10190
$$ 177010 136434 133592 -26481 443664 131972 142245 -77899 91076 228675 681037 110190
17528D38369j47727R646K42937L07811N187Q4875j5981B38114K82084B29114P9281
$$ 438369 290642 300288 543225 851036 856223 941098 925117 238114 520198 229114 308395
17517C08395R6238j33340J13399K02051k30047K36067O5520J07780n6944M09192
$$ 308395 404633 271293 384692 586743 356696 592763 658283 766063 709119 1118311
17507A118311j67414l14345J18124k60417k08224r6917J21738j49144K75060K80882
$$ 1118311 950897 636552 754676 494259 286035 189118 310856 161712 436772 717654
17497G17654k59430D0185J84224J40479A44082j1222K75027A5650L18984n9669
$$ 717654 458224 40185 224409 364888 144082 132860 407887 15650 334634 274965
17487B74965c4791E76172J07777J32312B77063I9522J20865d5422C59892o3128
$$ 274965 -34791 576172 683949 816261 277063 99522 220387 -45422 359892 296764
17477B96764O3317A23357a03313D49834j94166K36087A76555R2298j10503i2292
$$ 296764 360081 123357 -103313 449834 255668 491755 176555 268853 158350 -92292
17466C55438l6235f4559F5069L88350k09323a9530A73959a1642B61167C0257J49032
$$ 355438 319203 -64559 65069 453419 244096 -19530 173959 -11642 261167 30257 179289
17455A79289P704o6753L56727a02470A4138K98954J12176j30367J20684n7716
$$ 179289 186993 120240 476967 -102470 14138 313092 425268 294901 415585 357869
17445C57869a3191C66815M60510B86183E7368M57908B21076a4484D43593B07134
$$ 357869 -13191 366815 827325 286183 57368 515276 221076 -14484 443593 207134
17434C42185L7150j06039O4815k7168j36626F4755J29274K21469I7408K98867
$$ 342185 379335 273296 338111 310943 174317 64755 194029 415498 97408 396275
17424C96275A59865N95150B65690Q2657M8073j36784m7999O6493j30834N0203
$$ 396275 159865 755015 265690 348347 396420 259636 211637 278130 147296 197499
17414A97499K64778k12873K61410j56433J46574j54896j46115K03247o6322J71598
$$ 197499 462277 249404 510814 354381 500955 346059 199944 403191 336869 508467
17404E08467A23491e1277B15252N6053p751J53466J35893q2055j85589A28712
$$ 508467 123491 -51277 215252 271305 263554 417020 552913 470858 285269 128712
17393D61708j05428A33052P141J54559I2889b02180D22437K058j13538A27923
$$ 461708 356280 133052 140193 294752 92889 -202180 422437 424495 310957 127923
17382d7572D14619c34899I3073r84a44684E15952H1681K3982r927B2387K57607
$$ -47572 414619 -334899 93073 92089 -144684 515952 81681 105663 95736 22387 279994
17371B79994A02752R1455C3771Q2186C824L01942K83577A26573L13221k17270
$$ 279994 102752 194207 33771 115957 3824 305766 589343 126573 439794 222524
17361B22524J61067j40765J12502G3057P9653c7241B22882B1140J20954J08409
$$ 222524 383591 242826 355328 73057 152710 -37241 222882 21140 142094 250503
17351B50503k369B0135P0848K62644A24289M33301A46475O3065o2236Q9496o3657
$$ 250503 248134 20135 90983 353627 124289 557590 146475 209540 147304 236800 173143
17340A73143N1467O5459J02576j24988j25888K37548A59119M2974J34939N8874
$$ 173143 224610 290069 392645 267657 141769 379317 159119 202093 337032 395906
17330C95906K1619j86325J37917J35202A04945K8779K02945M6302j14932a39501
$$ 395906 417525 231200 369117 504319 104945 133724 336669 382971 268039 -139501
17319E62822a40259H7162M08569K9514f0201A51668O9114Q5395J48810k00849
$$ 562822 -140259 87162 495731 525245 -60201 151668 220782 306177 454987 254138
17309B54138j22947n5553L1149L6817J8583N2844d7040B37637J2431A22580L01380
$$ 254138 131191 75638 106787 143604 162187 215031 -47040 237637 250068 122580 423960
17298D23960c1990A83041K48860J18085A92716M66823A59281J44575b72106B69564
$$ 423960 -31990 183041 431901 549986 192716 659539 159281 303856 -272106 269564
17287A85214O4064J09219p5334E0433K22676K08679A56892F1176O1209J60761
$$ 185214 249278 358497 283163 50433 273109 481788 156892 61176 122385 283146
17277B83146l8822o8422l930M92814B23958L566N7351J21124k0799C9812L50479
$$ 283146 244324 175902 171972 664786 223958 227524 284875 405999 385200 39812 390291
17266C90291o3486q0751J21599N1018j09616R327f4365E00808j64422K10207B23769
$$ 390291 326805 246054 367653 418671 309055 318382 -64365 500808 336386 546593 223769
17254B28232b75934C07704A44474M63358G2395O70770A60394K25197A33277K32498
$$ 228232 -275934 307704 144474 607832 72395 743165 160394 385591 133277 365775
17244C65775R4009J32421B54677F9901J89023p9489k4356J36629J1636j30875
$$ 365775 459784 592205 254677 69901 258924 179435 155079 291708 303344 172469
17234A72469P0257L66537F4352L27476M8819d2759D92970j41267p9170J46651
$$ 172469 242726 609263 64352 391828 440647 -42759 492970 351703 272533 419184
17224D19184E7753L10661q1955A33972J14299K74798r8951K01556j82201k00126
$$ 419184 57753 368414 286459 133972 248271 523069 424118 625674 443473 243347
17214B43347J21962P217L3804r6759K50887A94014J8387J49667j54211K67516
$$ 243347 365309 372526 406330 309571 560458 194014 212401 362068 207857 475373
17204D75373q6483j76238P5318b1739k9990B47885P0769n4162r463M5635J02052
$$ 475373 388890 212652 287970 -21739 -51729 247885 318654 264492 255029 300664 402716
17193D02716G634K85265J04658n1816A68667L37726l6056j57933l3259J31847
$$ 402716 7634 292899 397557 345741 168667 506393 470337 312404 279145 410992
17183D10992M1284L0457m7815J06418k30740R1478q5226J48863A68624N73420
$$ 410992 452276 482733 434918 541336 310596 402074 316848 465711 168624 742044
17173G42044k86149R1748k71585j04304q0490J75830j31810M56656j91657L9293
$$ 742044 455895 547643 276058 171754 91264 267094 135284 591940 400283 439576
17163D39576k7149N5845O943m6609p669j4750J19912Q5140j00289K12186p3338
$$ 439576 412427 468272 475215 428606 420937 406187 526099 611239 510950 723136 649798
17152F49798k08722p3910k9127k6312J31792L62744n5770B60494O2576M50454
$$ 649798 441076 367166 338039 311727 443519 806263 750493 260494 323070 773524
17142G73524j49386k5077K25447B82081L60198j81536O544J36243j62134A92559
$$ 773524 624138 599061 824508 282081 642279 460743 467287 603530 441396 192559
17131D85466R6356R1753C24389J17744j29501M3473m0020n4214M64228k32821
$$ 485466 581822 673575 324389 442133 312632 356105 316085 261871 726099 493278
17121D93278M74255j84479j28002K6116B49163K12781N5850K37002R396j55505
$$ 493278 967533 783054 655052 681168 249163 461944 517794 754796 764192 608687
17111F08687J5756k10962m6691K38789J94224j30668L01665j78579B01678N27260
$$ 608687 624443 413481 366790 605579 799803 669135 970800 792221 201678 728938
17101G28938J84034j71766A18908L14074Q8177J70352o795m0232Q5339q2092j74469
$$ 728938 912972 741206 118908 432982 521159 691511 684716 644484 729823 647731 473262
17090D73262K69043J09908l16626J13232J80248j85445J84562k67525L77682l86263
$$ 473262 742305 852213 535587 648819 829067 643622 828184 560659 938341 552078
17080E52078J04039P2090k86235l8032k1398K98254j15402L12865j45802k24876
$$ 552078 656117 728207 441972 403940 382542 680796 565394 878259 732457 507581
17070E07581J25128j18441J95463J2932k45405J99945K63570j18549m8451K50318
$$ 507581 632709 514268 709731 722663 477258 677203 940773 822224 773773 1024091
17060A024091k35450l15597J46581J40766j34178J45711r8228j23739J30939Q2002
$$ 1024091 788641 473044 619625 760391 626213 771924 673696 549957 680896 762898
17050G62898j34303P2636L76325Q3272D41371O87123k22109k26776M81357l73745
$$ 762898 628595 701231 1077556 1160828 441371 1128494 906385 679609 1160966 787221
17040G87221K53283l70925K24301k00447j6284K57758p8944J85435j86620Q6796
$$ 787221 1040504 669579 893880 693433 677149 934907 855963 1041398 854778 941574
17030I41574j6966M57028E74812K91207K3363k77318K18727M57299j02974j56238
$$ 941574 924608 1381636 574812 866019 889382 612064 830791 1288090 1185116 1028878
17020A028878j17202j71074M08638l02466J90911j69390L66636m17984L64506
$$ 1028878 911676 740602 1149240 846774 1037685 868295 1234931 816947 1181453
17011A181453j68980K48177E07129L20382M34658k60887J48268l40423K63739
$$ 1181453 1012473 1260650 507129 827511 1262169 1001282 1149550 809127 1072866
17002A072866J6956J27176n5771m3973o6734P3173K73981l85985J49710k7351
$$ 1072866 1089822 1216998 1161227 1117254 1050520 1123693 1397674 1011689 1161399 1134048
16992A134048r8227K13862j89351J8741L94609j3922l50843r8813L33734k64021
$$ 1134048 1035821 1249683 1060332 1079073 1473682 1459760 1108917 1010104 1343838 1079817
16982A079817j07318K84199k56011J10861J15048r9162q755K24460L9711n5874
$$ 1079817 972499 1256698 1000687 1111548 1226596 1127434 1118679 1343139 1382850 1326976
16972A326976O765o4073L5188j21102J52609L30478j63623k85398L85307j86688
$$ 1326976 1333741 1269668 1304856 1183754 1336363 1666841 1503218 1217820 1603127 1416439
16962A416439L8515J28146j53194J15215l57018K06801O1316K87974K16475l82510
$$ 1416439 1454954 1583100 1429906 1545121 1188103 1394904 1456220 1744194 1960669 1578159
16952A578159j05398k68583L48546K42876k42833q9613L19197r2020K1795K43594
$$ 1578159 1472761 1204178 1552724 1795600 1552767 1463154 1782351 1690331 1712126 1955720
16942A955720j65170j91243K82757n05246K39346K37702m8148L16369k77048k13130
$$ 1955720 1790550 1599307 1882064 1376818 1616164 1853866 1805718 2122087 1845039 1631909
16932A631909L64078j19242k1199j7742J08984M0205R0427j47673M8204K74534
$$ 1631909 1995987 1876745 1855546 1837804 1946788 1986993 2077420 1929747 1977951 2252485
16922B252485k51665J76622l93964J78343j10275J63964J81858k48670L9024O25791
$$ 2252485 2000820 2177442 1783478 1961821 1851546 2015510 2197368 1948698 1987722 2613513
16912B613513l89495o5733N8359K00836j51017K31038L8080J92080l32386j24741
$$ 2613513 2224018 2158285 2216644 2417480 2266463 2497501 2535581 2727661 2395275 2270534
16902B270534K60609p8608L60853j2575k34946K66830j47488l1757o2396L8056
$$ 2270534 2531143 2452535 2813388 2800813 2565867 2832697 2685209 2653452 2591056 2629112
16892B629112L74394j41214J70004l05566J48856J83848J5322j98935L3864K47046
$$ 2629112 3003506 2862292 3032296 2726730 2875586 3059434 3074756 2875821 2909685 3156731
16882C156731J18304k05628P3111N5849l5452K94421p5141l7544r4802L76525
$$ 3156731 3275035 3069407 3142518 3198367 3162915 3457336 3382195 3344651 3249849 3626374
16872C626374l05479o2644L50086K3006j6843J64222R5385K68227j62491J65882
$$ 3626374 3320895 3258251 3608337 3631343 3614500 3778722 3874107 4142334 3979843 4145725
16862D145725j075k36269K59480j74579M58625k99043J94557N15488m75049M94852
$$ 4145725 4144650 3908381 4167861 3993282 4451907 4152864 4347421 4862909 4387860 4882712
16852D882712l70920L39493O1749K52691j87393n2531K81241k7099L42686k42287
$$ 4882712 4511792 4851285 4913034 5165725 4978332 4925801 5207042 5179943 5522629 5280342
16842E280342J06942K14702J3859k979K25130J40466J38583K92587l95978L35460
$$ 5280342 5387284 5601986 5615845 5612866 5837996 5978462 6117045 6409632 6013654 6349114
16832F349114p5175L62331K6095k3979j81507L00546K94690j01088L16352L90866
$$ 6349114 6273939 6636270 6662365 6638386 6456879 6757425 7052115 6951027 7267379 7658245
16822G658245k00888K5544K84864L10824k42247M86132j10099N27703j69223N61168
$$ 7658245 7457357 7482901 7767765 8078589 7836342 8322474 8212375 8740078 8570855 9132023
16812I132023j79604L39792J36631K88641J24469L47334L25303k11231L96656
$$ 9132023 8952419 9292211 9428842 9717483 9841952 10189286 10514589 10303358 10700014
16803A0700014N22331j61361K39895J27470O12656J47098L30028P44393k78448
$$ 10700014 11222345 11060984 11300879 11428349 12041005 12188103 12518131 13262524 12984076
16794A2984076M00434O89505j3184L43666O53660n8851O96406M22922K23670L88443
$$ 12984076 13384510 14074015 14060831 14404497 15058157 14999306 15695712 16118634 16342304 16730747
16784A6730747M66832Q20856L55404Q10556L77715J86302P66318J84862N33175
$$ 16730747 17197579 18018435 18373839 19184395 19562110 19748412 20514730 20699592 21232767
16775B1232767Q46722J035438K78019Q82246Q51573N73957J041085Q48863R74414
$$ 21232767 22079489 23114927 23392946 24275192 25126765 25700722 26741807 27590670 28565084
16766B8565084P38789J115869Q61110J088267J213489Q39845J297098J376644
$$ 28565084 29303873 30419742 31280852 32369119 33582608 34422453 35719551 37096195
16758C7096195J096889J533905J551477J374370J894157J281977J810853J660972
$$ 37096195 38193084 39726989 41278466 42652836 44546993 45828970 47639823 49300795
16750D9300795K498472J358170K096127K273382K432676K077107K069555K768199
$$ 49300795 51799267 53157437 55253564 57526946 59959622 62036729 64106284 66874483
16742F6874483K664755K382620K890606K745837K595935K985655L016988L188708
$$ 66874483 69539238 71921858 74812464 77558301 80154236 83139891 86156879 89345587
16734H9345587K479180L224584L014960L159913K509187K481476K676957K459735
$$ 89345587 91824767 95049351 98064311 101224224 103733411 106214887 108891844 111351579
16726A11351579K351103J726032J754900J497031R18642P73488O28693J4376m02388
$$ 111351579 113702682 115428714 117183614 118680645 119599287 120372775 121001468 121015844 120613456
16717A20613456o25938j237691q63100j914156j508545k323342k484898k431705
$$ 120613456 119987518 118749827 117886727 115972571 114464026 112140684 109655786 107224081
16709A07224081k701131k617249k798847l270751l051664k899406k638760l095545
$$ 107224081 104522950 101905701 99106854 95836103 92784439 89885033 87246273 84150728
16701H4150728l634425k630152k946034k438304k832420k790074k787705k037847
$$ 84150728 80516303 77886151 74940117 72501813 69669393 66879319 64091614 62053767
16693F2053767k468510k408273k044838j989169k046795j837731j830158j676358
$$ 62053767 59585257 57176984 55132146 53142977 51096182 49258451 47428293 45751935
16685D5751935k122551j503242j697587j080563j631379j032612j370731j395570
$$ 45751935 43629384 42126142 40428555 39347992 37716613 36684001 35313270 33917700
16677C3917700j325472p83149p33061j843367n94940r69603q08992o67738r87020
$$ 33917700 32592228 31809079 31076018 29232651 28637711 27668108 26859116 26191378 25204358
16668B5204358j095975m95819r42729l20761j142053l12426m23076j206303l95327
$$ 25204358 24108383 23612564 22669835 22349074 21207021 20894595 20471519 19265216 18869889
16659A8869889m92467k50576m50797m76471j35690j001844n88638P9136p24199
$$ 18869889 18377422 18126846 17676049 17199578 17063888 16062044 15473406 15552542 14828343
16650A4828343m11456m31535m61336J19441p71181m3786j43227n15941O0998l96263
$$ 14828343 14416887 13985352 13524016 13643457 12872276 12828490 12685263 12169322 12230320 11834057
16640A1834057l84549l49831k89710j22293j90056k17924m64143m61205k07325
$$ 11834057 11449508 11099677 10809967 10687674 10497618 10279694 9815551 9354346 9147021
16631I147021l0378L5506l09682k15396l07769k23724J13743k89212k1082j28006
$$ 9147021 9116643 9152149 8842467 8627071 8319302 8095578 8209321 7920109 7899027 7771021
16621G771021j71275k27484k10657K24840J10698q37921J81636j55974n40637
$$ 7771021 7599746 7372262 7161605 7386445 7497143 6659222 6840858 6684884 6144247
16612F144247K77109J94045k82212l87352J29651l58142M5692j6826K0369m92986
$$ 6144247 6421356 6615401 6333189 5945837 6075488 5717346 5763038 5746212 5766581 5273595
16602E273595r9394L14492j88690j2201m77040L70347r0525j51719j75574r9757
$$ 5273595 5174201 5488693 5300003 5287802 4810762 5181109 5090584 4938865 4763291 4663534
16592D663534m8419k14636L68087l71976L982j80158N9514j37263q8936k83284
$$ 4663534 4615115 4400479 4768566 4396590 4400572 4220414 4279928 4142665 4053729 3770445
16582C770445M74228l85345k7195p2867K7961l25134K29424k24360R8443q7612
$$ 3770445 4244673 3859328 3832133 3759266 3787227 3462093 3691517 3467157 3565600 3477988
16572C477988l02351J80807J87114m86394K73432l09101m4763L44773o1381l6185
$$ 3477988 3175637 3356444 3543558 3057164 3330596 3021495 2976732 3321505 3260124 3223939
16562C223939k72502j32666J4239n8466R0619k07517L1111j78554J64123j17192
$$ 3223939 2951437 2818771 2833010 2774544 2865163 2657646 2688757 2510203 2674326 2557134
16552B557134K90593j06827j5576m36995L08176l13776J93697k04450R8593J66859
$$ 2557134 2847727 2740900 2725324 2288329 2596505 2282729 2476426 2271976 2370569 2537428
16542B537428l28599J58981Q103l53779M27724L61310p51028J20929l7714J49729
$$ 2537428 2208829 2367810 2375913 2022134 2449858 2811168 2060140 2181069 2143355 2293084
16532B293084k83548K53497n77804M8379L80936m02724K97827r7631K00723k75799
$$ 2293084 2009536 2263033 1685229 1733608 2114544 1711820 2009647 1912016 2112739 1836940
16522A836940j34687K05872p9232K3409J95050n16325J90077n289j11500k22422
$$ 1836940 1702253 1908125 1828893 1852302 2047352 1531027 1721104 1715815 1604315 1381893
16512A381893N76057l47264J93728p6330O1839m09469O5433L22652l86074Q3096
$$ 1381893 1957950 1610686 1804414 1728084 1789923 1380454 1445887 1768539 1382465 1465561
16502A465561J07007m5316q7359k41649K55665m9533L4396o0312K14441j92410
$$ 1465561 1572568 1527252 1439893 1198244 1453909 1404376 1438772 1378460 1592901 1400491
16492A400491p4032j83487j04116K68341P6634P5895k01537m3262Q4270L88307
$$ 1400491 1326459 1142972 1038856 1307197 1383831 1459726 1258189 1214927 1299197 1687504
16482A687504m68780K77300j32468m52588J04448K94536l46964M66223n98977
$$ 1687504 1218724 1496024 1363556 910968 1015416 1309952 962988 1429211 830234
16473H30234L81239K7415J72486n87647R1835J21430K76339L1629j95084K15940
$$ 830234 1211473 1238888 1411374 823727 915562 1036992 1313331 1344960 1149876 1365816
16463A365816n00086K97612o4782j37317M1019j06371K6004j79533M38259l93237
$$ 1365816 865730 1163342 1098560 961243 1002262 895891 921895 742362 1180621 787384
16453G87384m0609K85358k7389Q3672k21329O5392L6111M10j15681l823K69902
$$ 787384 746775 1032133 1004744 1088416 867087 932479 968590 969000 853319 849496 1119398
16442A119398k57639J187M6063M9263j980k90081J45596r160J02263j62759L11733
$$ 1119398 861759 862946 909009 958272 956292 666211 811807 802647 904910 742151 1053884
16431A053884D68598M90883j85214L2313J3235j93503J17203M05937D99487K88682
$$ 1053884 468598 959481 774267 806580 819815 626312 743515 1149452 499487 788169
16421G88169J47041p0984j1474m155N575j28981o8888K18071k00956K53757k89209
$$ 788169 935210 864226 852752 848597 854172 725191 656303 874374 673418 927175 637966
16410F37966M2562k9490l16818N64562l48921j3631K19506k91737L95728j11989
$$ 637966 680528 651038 334220 898782 549861 536230 755736 463999 859727 747738
16400G47738J8173R0201k86954J05896k40838J6094M8563N8466K09789k79547
$$ 747738 765911 856112 569158 675054 434216 450310 498873 557339 767128 487581
16390D87581K7760j37165O8521P7797j25888K83646j51039Q0619Q7152k7105L38228
$$ 487581 515341 378176 446697 524494 398606 682252 531213 611832 698984 671879 1010107
16379A010107C41573M09113J98873l45643J54462q6868k40662J39129j3712k62304
$$ 1010107 341573 750686 949559 603916 758378 671510 430848 569977 556265 293961
16369B93961A19797J29028O33047l36021l5529R2972j30389K92546j59752j12969
$$ 293961 119797 248825 881872 545851 510322 603294 472905 765451 605699 492730
16359D92730j51700J21626L5534M9040k50625j39677N69856K9178k59496O3828
$$ 492730 341030 462656 498190 547230 296605 156928 726784 755962 496466 560294
16349E60294k07923J07639R9529j23285Q1585A97485O2148O4608K32732J50388
$$ 560294 352371 460010 559539 436254 517839 197485 259633 324241 556973 707361
16339G07361E244L49866m3846A12454L34225N7282j95959J57642j86641j14160
$$ 707361 5244 355110 311264 112454 446679 503961 308002 465644 279003 164843
16329A64843M67440m3466j32476j34233J49212B30011K62483K00531B2124K82096
$$ 164843 632283 588817 456341 322108 471320 230011 492494 693025 22124 304220
16319C04220O1338n1189L3508r4901K61501j84101L29775j58036K22648k73884
$$ 304220 365558 314369 347877 252976 514477 330376 660151 502115 724763 450879
16309D50879j73355Q9272j47498K06370P7206j24262j50590l4849N293P535K14814
$$ 450879 277524 366796 219298 425668 502874 378612 228022 193173 198466 206001 420815
16298D20815k4609J34284B36466M21251j51560D5912N3227L26574j90674J48328
$$ 420815 396206 530490 236466 657717 506157 45912 99139 425713 235039 383367
16288C83367K25889j91637J13687k41278N971o1801J24533j78606J47045A61654
$$ 383367 609256 417619 531306 290028 295999 234198 358731 180125 327170 161654
16277C94683Q4346A60594P1128L13337n3512M4053B08778j0211P083J7058j2715
$$ 394683 479029 160594 231722 545059 491547 535600 208778 198567 205650 222708 209993
16266B09993J22253M9188A40730K75126r2556i3574B40246l77I3338L07275A71323
$$ 209993 332246 381434 140730 415856 323300 -93574 240246 239869 93338 400613 171323
16254B65859j26635N2858M9672O9205E8937K83873j53515K98417B29492G1457
$$ 265859 139224 192082 241754 310959 58937 342810 189295 487712 229492 71457
16243A24301h9197D54359j15632j41911C7570J63653F6872L60136H1338C1239
$$ 124301 -89197 454359 338727 196816 37570 201223 66872 427008 81338 31239
16232B17711L3171F0519N63380j57750A87273B8175K22067A18830J93988j18866
$$ 217711 250882 60519 623899 466149 187273 28175 250242 118830 312818 193952
16222A93952r5082p248Q7900N9323H8021a4261D4860P0998K9960J6311p5048m181
$$ 193952 98870 91622 179522 238845 88021 -14261 44860 115858 145818 162129 87081 82900
16210H2900A1990L36830M3870N9795A01676L74730b7384C55027I3131J42490a00029
$$ 82900 11990 348820 392690 452485 101676 476406 -27384 355027 93131 235621 -100029
16198A4197O7947P769K70020H1974f5590C8901J70401a48131e334A59224b9888
$$ 14197 82144 89913 359933 81974 -65590 38901 209302 -148131 -5334 159224 -29888
16186c8120C15573A35277a8088C94090f0532D6524J05371O9164K6794m2775O597
$$ -38120 315573 135277 -18088 394090 -60532 46524 151895 221059 247853 205078 211675
16175B11675J16852M0755o6672b3023n8152A48660l9132M07077A17157g32B12162
$$ 211675 328527 369282 302610 -23023 -81175 148660 109528 516605 117157 -732 212162
16163d6488B61845E9008M20006k27215d21946C77834j77062A9343N0639M20113
$$ -46488 261845 59008 479014 251799 -421946 377834 200772 19343 69982 490095
16153D90095i374D7021a86908A25313g8161j66951A22686D2664a52883C04202
$$ 490095 -9374 47021 -186908 125313 -78161 -245112 122686 42664 -152883 304202
16142D4710J25972L7450a12844j69219a27435A30527a05936B34037a70702D71897
$$ 44710 170682 208132 -112844 -282063 -127435 130527 -105936 234037 -170702 471897
16131C9352j406N3767b62807A01652b87816C37344e4949o9874A47649L6353K17060
$$ 39352 37946 91713 -262807 101652 -287816 337344 -54949 -124823 147649 184002 401062
16120D01062j31266f1493E1505K06840a24866j32225A07934J61620B4191P6384
$$ 401062 269796 -61493 51505 258345 -124866 -257091 107934 269554 24191 100575
16110A00575L33503f1064j68066A53390J94872c36800e3462D35782A87984A935
$$ 100575 434078 -61064 -229130 153390 348262 -336800 -53462 435782 187984 1935
16099A26103J34476l8216r0803d8633C20133A53091I403J77075a47198A77803
$$ 126103 260579 222363 131560 -48633 320133 153091 9403 186478 -147198 177803
16088D135K43112q3994b30426H7743c26486a12716E7965a39493A49023Q0180I265
$$ 4135 247247 163253 -230426 87743 -326486 -112716 57965 -139493 149023 229203 9265
16076B30194l6150L8571K3523f8033k882A6121a67891E333e5099A70119c7601
$$ 230194 194044 232615 256138 -68033 -70915 16121 -167891 5333 -55099 170119 -37601
16064g6635B70156M4440A8135a60459j2524i804H4087c3992j26459O2474A17673
$$ -76635 270156 314596 18135 -160459 -172983 -9804 84087 -33992 -160451 -97977 117673
16052A17442N806L1386L9381O45K30897A24597b58572B1017J17887m0860B4593
$$ 117442 123248 154634 194015 194660 425557 124597 -258572 21017 138904 98044 24593
16040B12346P9641D0799N6572J1845H648K57000o8499g5901c5030M863M869j11460
$$ 212346 291987 40799 97371 109216 8648 265648 197149 -75901 -35030 -30167 -25298 -136758
16028a36758A62495l6504O3012L3134C8498b0563C41231e5898A59481c42960A85092
$$ -136758 162495 125991 189003 222137 38498 -20563 341231 -55898 159481 -342960 185092
16016a07041F9475J66793b1901l29183A44234D2512O1618d2409j43079C09867
$$ -107041 69475 236268 -21901 -351084 144234 42512 104130 -42409 -185488 309867
16005C51937c52338f9129E38087I7672l1333b68801A92746m812e6454k657B965
$$ 351937 -352338 -69129 538087 97672 66339 -268801 192746 187934 -56454 -59111 2965
15993C08719j51498Q5634p3586b50897B64982Q3693A31199Q90379j90633K91765
$$ 308719 157221 242855 169269 -250897 264982 348675 131199 1021578 830945 1122710
15983A122710J47437r7518E17134r4503A99645j6554h8228j60537c1543i445k0707
$$ 1122710 1270147 1172629 517134 422631 199645 183091 -88228 -248765 -31543 -9445 -30152
15972c0152G1384K54288j15383A7235b2573H604A775a92094M736c3931a4155C7862
$$ -30152 71384 325672 210289 17235 -22573 8604 1775 -192094 -187358 -33931 -14155 37862
15959a80553e7645I0987m4700R8499F3328a16623H6721J51824a26448A47154b97784
$$ -180553 -57645 90987 46287 144786 63328 -116623 86721 238545 -126448 147154 -297784
15947b27230d1059j53726A39088c35920I3519e3671A45152c2032k16661R9253
$$ -227230 -41059 -194785 139088 -335920 93519 -53671 145152 -32032 -248693 -149440
15937a49440D5171f7525A03482b82394A02754a57540A9263b66441R1707A21398
$$ -149440 45171 -67525 103482 -282394 102754 -157540 19263 -266441 -174734 121398
15926A33128h3755A69106O7768b08572M7287C2759Q0096Q860e4226k10941A89619
$$ 133128 -83755 169106 236874 -208572 -161285 32759 112855 121715 -54226 -265167 189619
15914a24122b5925l3087B05360d56189i5206A74205K6642H6885J14369b35149
$$ -124122 -25925 -59012 205360 -456189 -95206 174205 200847 86885 201254 -235149
15903A29464A1690a10716G4937e43166b61955B46984c634A57023N9421a37031
$$ 129464 11690 -110716 74937 -543166 -261955 246984 -3634 157023 216444 -137031
15892f3374A44013D3833a81309a0435j21849C69186c5683E9053c66456H30J78669
$$ -63374 144013 43833 -181309 -10435 -132284 369186 -35683 59053 -366456 830 179499
15881A79499a25843L8516D281K3604h0852G8241b43529Q8939d0829j15943f5345
$$ 179499 -125843 -87327 4281 27885 -80852 78241 -243529 -154590 -40829 -156772 -65345
15869B6821a57989H3851b09716q3001a13060j16732l2498H2271b27017h0397j62098
$$ 26821 -157989 83851 -209716 -292717 -113060 -229792 -262290 82271 -227017 -80397 -242495
15858b42495P6359c5792A7208b02515j13130A49868k5970d5813B10653h3467J2021
$$ -242495 -166136 -35792 17208 -202515 -315645 149868 123898 -45813 210653 -83467 -71446
15847g1446q9720B02137b78218B47520F7547b65490A49187p3707A3912K043J93622
$$ -71446 -161166 202137 -278218 247520 67547 -265490 149187 75480 13912 15955 209577
15836B09577r4844b9160B35731a52663j37447A10249K9181J40068a52001j14523
$$ 209577 114733 -29160 235731 -152663 -290110 110249 139430 279498 -152001 -266524
15826b66524C4805a42628A44971f632K291B4288L37597r0662f7233A89408A8695
$$ -266524 34805 -142628 144971 -6632 -4341 24288 361885 271223 -67233 189408 18695
15814a17628A74084D8205i5608A30878g6653B0960a33600p000B11994b28169k57204
$$ -117628 174084 48205 -95608 130878 -76653 20960 -133600 -140600 211994 -228169 -485373
15803d85373J54674A03030c40267H3278c8473A60950a35231j22532b472A40421
$$ -485373 -330699 103030 -340267 83278 -38473 160950 -135231 -257763 -2472 140421
15792b6573E5583a31573j59959a28925D74815g2297j48260M3388b0854j55972
$$ -26573 55583 -131573 -291532 -128925 474815 -72297 -220557 -177169 -20854 -176826
15782a76826N4644a0463j21795q0427A38045a6782g181k59609a24858D4957J45890
$$ -176826 -122182 -10463 -132258 -212685 138045 -16782 -7181 -266790 -124858 44957 190847
15771A90847n4360a97625E467f6983j2734j5950A57699h8637j6332A27316M447
$$ 190847 136487 -197625 5467 -66983 -79717 -95667 157699 -88637 -104969 127316 131763
15760A31763K70377a9043A13982E0678a44216C97292d5126a2731A11392l7788
$$ 131763 402140 -19043 113982 50678 -144216 397292 -45126 -12731 111392 73604
15750G3604k0613L4581J30868G8258R0465D7008N1592a01323D30132A40134b87319
$$ 73604 52991 87572 218440 78258 168723 47008 98600 -101323 430132 140134 -287319
15738f4012o1938j59614a5141B54339A9076b21335A8458b08104B22300a54473
$$ -64012 -125950 -285564 -15141 254339 19076 -221335 18458 -208104 222300 -154473
15727B2208K14878d12235A46028f0760A2388J43544a623k09429j03121a30067
$$ 22208 237086 -412235 146028 -60760 12388 155932 -1623 -211052 -314173 -130067
15716a91322l06195A33730a93117h5095k76276A7986K27324R0228C7596P95K0548
$$ -191322 -497517 133730 -193117 -85095 -361371 17986 245310 335538 37596 38391 58939
15705E8939c60475k7374i928l37707a46580L4743C45068b33062a7248k75663i2277
$$ 58939 -360475 -387849 -9928 -347635 -146580 -111837 345068 -233062 -17248 -292911 -92277
15693a40314b72k14840I4310L6998P70K7443p8901d24810B14799j5174I6703b33064
$$ -140314 -272 -215112 94310 131308 132078 159521 80620 -424810 214799 199625 96703 -233064
15680B60696A28355c05632G4700A2405c16942J38811A2487J2670a31137J2658
$$ 260696 128355 -305632 74700 12405 -316942 -178131 12487 25157 -131137 -118479
15670a18479K2614G2261d1921E3048O4868L4426G4881b60162N8338j40985O4833
$$ -118479 -95865 72261 -41921 53048 117916 152342 74881 -260162 -201824 -342809 -277976
15659b77976C0817a32226A29260b11862j23875B39293c13207C26977E0995a07487
$$ -277976 30817 -132226 129260 -211862 -335737 239293 -313207 326977 50995 -107487
15648c34993b36j83945A03553J4162a82747f5569h772H2018a0663k02617P5250
$$ -334993 -236 -184181 103553 117715 -182747 -65569 -8772 82018 -10663 -213280 -138030
15637a38030q2071A0197b70454a00946C5813b67430K8672D6216g635j94868F0337
$$ -138030 -220101 10197 -270454 -100946 35813 -267430 -238758 46216 -7635 -202503 60337
15625A10565J15703j4417I5474J75591a18069D493K27024c4026J174A5517h9533
$$ 110565 226268 211851 95474 271065 -118069 4493 231517 -34026 -32852 15517 -89533
15613b86339A5363a57911j38810A7129J08415a51374j58667c3018i489J098A42754
$$ -286339 15363 -157911 -296721 17129 125544 -151374 -310041 -33018 -9489 -8391 142754
15601a75F8277K57416h6826r8263A6442a5467C2884b4789A195L0028M02395a50121
$$ -175 68277 325693 -86826 -185089 16442 -15467 32884 -24789 1195 31223 433618 -150121
15588b32497k31148J60724G6216K5671k6823J81674b6554j11189n5303L6704o7306
$$ -232497 -463645 -302921 76216 101887 75064 256738 -26554 -137743 -193046 -156342 -223648
15577b23648o7645C53100j02656H2154a68267A51992E2941K1715e766o5065a4145
$$ -223648 -291293 353100 250444 82154 -168267 151992 52941 74656 -5766 -70831 -14145
15565a91112C2941e3869A23710F1167e7240j4892a9591A57919b40134C008J12860
$$ -191112 32941 -53869 123710 61167 -57240 -72132 -19591 157919 -240134 3008 115868
15554A15868a34549p258C4594a49169c3368C1093j3406J05674P947a70853k30846
$$ 115868 -134549 -141807 34594 -149169 -33368 31093 17687 123361 131308 -170853 -401699
15543d01699J67978M6747j62942a30519M2553A38356a06616D56550A37151b8587
$$ -401699 -233721 -186974 -349916 -130519 -87966 138356 -106616 456550 137151 -28587
15532b00322E179L8226J19259O2762D850K40702G9391b8297D1160a72910A59488
$$ -200322 5179 43405 162664 225426 4850 245552 79391 -28297 41160 -172910 159488
15520G4409a91532A09086a7480B24440O9071B28K91582o3766l4967M3740e7202
$$ 74409 -191532 109086 -17480 224440 293511 228 291810 228044 193077 236817 -57202
15508a20585B88981j16786K49938E732N3040a9784H7562J58530M2995l1929o4068
$$ -120585 288981 172195 422133 5732 58772 -19784 87562 246092 289087 257158 193090
15497A93090J31370M8364E9335a03946D69371D3301d6861J9616A14250J91454
$$ 193090 324460 372824 59335 -103946 469371 43301 -46861 -27245 114250 305704
15487C05704A11886A8757c734A58842D3986L0934K10910c03298A80397p0031f1572
$$ 305704 111886 18757 -3734 158842 43986 74920 285830 -303298 180397 110366 -61572
15475A05594K02850J727J24257M43622j63090B80466L3861e9546B53128b81939
$$ 105594 308444 310171 434428 878050 714960 280466 314327 -59546 253128 -281939
15464a28247b8362A89520N6434C6202L9243a49823r8103C78485i3983a3156A71554
$$ -128247 -28362 189520 245954 36202 75445 -149823 -247926 378485 -93983 -13156 171554
15452A42871K6593C0040L9980J17455N3204A11376C8195f2324A3631N43649Q944
$$ 142871 169464 30040 70020 187475 240679 111376 38195 -62324 13631 557280 566224
15441E66224K15241L99871r8616k96825O7294A94190J20525e4423q9808O7186
$$ 566224 781465 1181336 1082720 785895 853189 194190 314715 -54423 -144231 -77045
15431g7045A08734B4734a14528A7497Q09d7509A76781l4201J20263J49516k5639
$$ -77045 108734 24734 -114528 17497 18306 -47509 176781 142580 262843 412359 386720
15420C86720f8893j84031j01069h0557c914B8520b72835O7467A78931p4823O8092
$$ 386720 -68893 -252924 -353993 -80557 -3914 28520 -272835 -205368 178931 104108 172200
15409A72200k1910K2012o8116B6869K29855F9888h6461q5831b6375A2608K6478
$$ 172200 150290 172302 104186 26869 256724 69888 -86461 -172292 -26375 12608 39086
15398C9086J34077d01552a61787L3557N0858q3922A47142e4479i617B62796E8039
$$ 39086 173163 -401552 -161787 -128230 -77372 -161294 147142 -54479 -9617 262796 58039
15386c57338A24102J3900e9430b7264j00396q419m367N7153A70065B2251Q9459
$$ -357338 124102 138002 -59430 -27264 -127660 -136079 -140446 -83293 170065 22251 111710
15375A11710j520J89368D9568M80004h715C49998H5586C4163J18418A9790K87927
$$ 111710 110190 299558 49568 529572 -8715 349998 85586 34163 152581 19790 307717
15364C07717A9476a53506B1259J42724Q4105G7184h1294B43610R8088m4385c4449
$$ 307717 19476 -153506 21259 163983 248088 77184 -81294 243610 341698 297313 -34449
15352A8513J43287a4109o0555D04849j4032J2421A02247J70395K02106B23674
$$ 18513 161800 -14109 -74664 404849 390817 403238 102247 272642 474748 223674
15341C35225G0403J90N0814L29402A98397c44293d991k8928B37013d7205C12926
$$ 335225 70403 70593 121407 450809 198397 -344293 -4991 -33919 237013 -47205 312926
15329B07912a45712F8189a49216C21759q7672J46991j11134O5846i0535B25746
$$ 207912 -145712 68189 -149216 321759 234087 381078 269944 335790 -90535 225746
15318c892j10813F992O5752a87678I300d31051B15223j2053K14008A72964K20977
$$ -3892 -114705 6992 72744 -187678 9300 -431051 215223 203170 417178 172964 393941
15307C93941i540C14242b90845d071E3984P9384a15448L0890d1094A88036a51058
$$ 393941 -9540 314242 -290845 -4071 53984 133368 -115448 -84558 -41094 188036 -151058
15295h734A94693p8581a12905B80824B7485a05326k3079j19933a11005k35986
$$ -8734 194693 116112 -112905 280824 27485 -105326 -128405 -248338 -111005 -346991
15285c46991A47564D629b7362A18905c86484g618G3464c17753c6566C7514a73108
$$ -346991 147564 4629 -27362 118905 -386484 -7618 73464 -317753 -36566 37514 -173108
15273h9864p6742A72887A585b46894h2226N656E5030J7657b61651b3225a0166
$$ -89864 -166606 172887 1585 -246894 -82226 -76570 55030 72687 -261651 -23225 -10166
15261c1029E2676b77929B02719L9739F6525a58946B26645c47995C67123b44593
$$ -31029 52676 -277929 202719 242458 66525 -158946 226645 -347995 367123 -244593
15250i9419F9645a48846B94741o7694J4713O3720N6087L51813N68348J014239
$$ -99419 69645 -148846 294741 227047 241760 305480 361567 713380 1281728 2295967
15240B295967H96193J094906p64978E10173B06328G2404a70836B00029n9646c72201
$$ 2295967 896193 1991099 1226121 510173 206328 72404 -170836 200029 140383 -372201
15229B6261b47357R3537A10646L25811I3921e1203B79435e24877H235h7430H3281
$$ 26261 -247357 -153820 110646 436457 93921 -51203 279435 -524877 8235 -87430 83281
15217B34229J87928A53675j0040B8925a2688B97744f6911B61395d0412p9026K1182
$$ 234229 422157 153675 143635 28925 -12688 297744 -66911 261395 -40412 -119438 -98256
15206i8256A86002F6781Q9542J42863h1400B72352j09019m9446f6550D0450b17004
$$ -98256 186002 66781 156323 299186 -81400 272352 163333 113887 -66550 40450 -217004
15194F1613J15973h4054A68674b03752N5635B60589A20404d4954A24259N2107
$$ 61613 177586 -84054 168674 -203752 -148117 260589 120404 -44954 124259 176366
15184A76366D2149J20779b1611A0579c59960F5168J28271b83761B30258p0494
$$ 176366 42149 162928 -21611 10579 -359960 65168 193439 -283761 230258 159764
15174A59764b3687j60806B43824j14756M5437q6478g3348A17681i8096H1496j5319
$$ 159764 -23687 -184493 243824 129068 174505 88027 -73348 117681 -98096 81496 66177
15163F6177L31458r2064A02652J90494d4594M032f771C86397h252k43728g6058
$$ 66177 397635 305571 102652 293146 -44594 -40562 -6771 386397 -8252 -251980 -76058
15151A5089L9414J15257H4366d6137q1588b5029B355N7152L09606j60114q3097
$$ 15089 54503 169760 84366 -46137 -127725 -25029 2355 59507 369113 208999 125902
15140A25902R4116a08090C42447j26288a85113O5588e1557B63644j12a23864F5318
$$ 125902 220018 -108090 342447 216159 -185113 -119525 -51557 263644 263532 -123864 65318
15128B71659M689f0671D2286h1060K4664j76855C44319J7882H0701M0388l1066
$$ 271659 276348 -60671 42286 -81060 -56396 -233251 344319 362201 80701 121089 90023
15117I0023J63928C5574e5748C11745H3490Q364l7g075D59K72141C4828n376d547
$$ 90023 253951 35574 -55748 311745 83490 91854 91817 -7075 459 272600 34828 29452 -4547
15103D0491a78707H8977J49119g8794C93472a61247h0138a1008C0842J53533M0541
$$ 40491 -178707 88977 238096 -78794 393472 -161247 -80138 -11008 30842 184375 224916
15092B24916h326B00235o8280K9941J96620b8498G5690P5214P845J12031J54661
$$ 224916 -8326 200235 131955 161896 358516 -28498 75690 150904 158749 270780 425441
15081D25441j58535J09429n7875P3622J7692j17157H8220J0237K304Q2047R308
$$ 425441 266906 376335 318460 392082 409774 292617 88220 98457 100761 182808 192116
15070A92116j014G5254J8210K7796j1591M4414L37493j89166f3247B91110K53478
$$ 192116 191102 75254 93464 121260 109669 154083 491576 302410 -63247 291110 544588
15059E44588A35378K22457J3173K8443A28159L78641r9231r3756n0209j18425
$$ 544588 135378 357835 371008 399451 128159 506800 407569 313813 263604 145179
15049A45179J48593o9611J73153o6698K21679A77645K30004k03642J19275N5953
$$ 145179 293772 224161 397314 330616 552295 177645 407649 204007 323282 379235
15039C79235K55550A84552J21410k7969g0761C31646N751j59165N64865l46688
$$ 379235 634785 184552 305962 277993 -70761 331646 337397 178232 743097 396409
15029C96409R9430j68834M86453l56110J95922j60583i6328E21946K39243B05828
$$ 396409 495839 327005 813458 457348 653270 492687 -96328 521946 761189 205828
15018E82881J046j54313j93741L27787k25606n9153K82435A0181M27691A84597
$$ 582881 583927 429614 235873 563660 338054 278901 561336 10181 437872 184597
15007C41596n783j18238P6492A29955a67915C23857J97604j21159J5308K89350
$$ 341596 335813 217575 294067 129955 -167915 323857 521461 400302 415610 704960
14997G04960n1388l00352L6997j88040o2708k0605J6387M53524H9620M38033B48093
$$ 704960 653572 353220 390217 202177 139469 118864 135251 588775 89620 527653 248093
14985A37129K67935P0176K83120L9347k45232J21762J38849C29441k0736m1295
$$ 137129 405064 475240 758360 797707 552475 674237 813086 329441 308705 267410
14975B67410K06948r2747J59830j91959J01551J4291j55888B9337h436F93270
$$ 267410 474358 381611 541441 349482 451033 465324 309436 29337 -8436 693270
14964B16575J41907j49018j7154J66659j19630N8766A30953Q0317J23117Q2753
$$ 216575 358482 209464 192310 358969 239339 298105 130953 211270 334387 417140
14954D17140j90724L1100J69904k0728J16649G4537N50127G8044N897L22390J70174
$$ 417140 226416 257516 427420 406692 523341 74537 624664 78044 83941 406331 576505
14943E76505j71907N85432m86084j36132A13548J04762L95361j85375j72310j4840
$$ 576505 404598 990030 503946 367814 113548 218310 613671 428296 255986 241146
14933B41146K25176J92318j74891J12137M77143P3702j96448K98094k14645P43278
$$ 241146 466322 658640 483749 595886 1073029 1146731 950283 1248377 1033732 1777010
14923A777010m28469L04859m41342J91926R7980Q6749J11759L96593n7923l71453
$$ 1777010 1348541 1653400 1212058 1403984 1501964 1588713 1700472 2097065 2039142 1667689
14913A667689m60434j32799Q859k77968C51562K05710j01673m5927A37691M63517
$$ 1667689 1207255 1074456 1083315 805347 351562 557272 455599 409672 137691 601208
14903F01208A37899N28463l04516J69259K58526B66302l9886m4604L04419L9420
$$ 601208 137899 666362 361846 531105 789631 266302 226416 181812 486231 525651
14893E25651j57079J00397K20197j26712k18270N40623l41195J5314N3466P5805
$$ 525651 368572 468969 689166 562454 344184 884807 543612 558926 612392 688197
14883F88197J93201Q2740P8966k45174r8943K39543C55891L73448r3699B34353
$$ 688197 881398 964138 1043104 797930 698987 938530 355891 729339 635640 234353
14872F01968E2347M88588k5935k54177K34858l6035j95470M05237p1457n4831
$$ 601968 52347 540935 515000 260823 495681 459646 264176 669413 597956 543125
14862E43125n1401r2944R2268a9297E45516j13064n4582J76564K03585H9596M78319
$$ 543125 491724 398780 491048 -19297 545516 432452 377870 554434 758019 89596 567915
14851E67915B04411K39964Q9964k05986L68861C38016M07570J92977l08156J11550
$$ 567915 204411 444375 534339 328353 697214 338016 745586 938563 630407 741957
14841G41957K44386J78772J18483l80457J52581r2724k34929r3030q2278j05088
$$ 741957 986343 1165115 1283598 903141 1055722 962998 728069 635039 552761 447673
14831D47673j6184N764O0798j03604J27840o3761K9295j45985L08382A04427L32628
$$ 447673 431489 437253 498051 394447 522287 458526 487821 341836 650218 104427 437055
14820D37055J9388j06582L00649M32034D32131K78708j0705k99277M50522k87306
$$ 437055 456443 349861 650510 1082544 432131 710839 700134 400857 851379 564073
14810E64073Q5128J15796j31499A30788M53982J82609j03428k548M09472l14657
$$ 564073 649201 764997 633498 130788 584770 767379 663951 661403 1070875 756218
14800G56218j07733j59523R9987J5803J12769j76327B69750L22545K19497j72803
$$ 756218 648485 488962 588949 604752 717521 541194 269750 592295 811792 638989
14790F38989j03450n9075J39546j3928Q7786O2523k9579m8595k8039j36323J22715
$$ 638989 535539 476464 616010 602082 689868 752391 722812 674217 646178 509855 632570
14779F32570k38117N34315D47455P22454j25377j75348J20301m42012Q1112k6185
$$ 632570 394453 928768 447455 1169909 1044532 869184 989485 547473 628585 602400
14769F02400O5129j28623R0755j49408B32209J85730l1643j27508Q0576K59715
$$ 602400 667529 538906 629661 480253 232209 417939 386296 258788 339364 599079
14759E99079k16430N0563K57677J60982l24499p8297L57881C61625J34128j26325
$$ 599079 382649 433212 690889 851871 527372 449075 806956 361625 495753 369428
14749C69428M13428J23055L4653D00895M44531k37704J61655K720M0378k94823
$$ 369428 782856 905911 940564 400895 845426 607722 769377 772097 812475 517652
14739E17652J53012J48836j58484k74256K90953J53648j35605M45177m20501P2966
$$ 517652 670664 819500 661016 386760 677713 831361 695756 1140933 720432 793398
14729G93398L61293J72040j42781O84940r6099k45066j86315k78592m11950q8936
$$ 793398 1154691 1326731 1183950 1868890 1772791 1527725 1341410 1062818 650868 561932
14719E61932O4897K23316k45997M42051k44349n2551j49568O3833K97109k5452
$$ 561932 626829 850145 604148 1046199 801850 749299 599731 663564 960673 935221
14709I35221l06154R1018L31896o0777j01220K47885J54288J06012M64550p3357
$$ 935221 629067 720085 1051981 991204 889984 1137869 1292157 1398169 1862719 1789362
14699A789362K0385l79774j03648l47860K88275n27275J18959j57533J65454J86562
$$ 1789362 1809747 1429973 1326325 978465 1266740 739465 858424 700891 866345 1052907
14689A052907j26762l41098K50440K02504D84378J48508j7449N10728r1562j25889
$$ 1052907 926145 585047 835487 1037991 484378 632886 615437 1126165 1034603 908714
14679I08714J3048k82985M52692l22880J17983k19071Q3158M040J33020J44697
$$ 908714 921762 638777 1091469 768589 886572 667501 750659 754699 887719 1032416
14669A032416m20163K96685J12145L0420R2219K89775E16667J21288J06949n6664
$$ 1032416 612253 908938 1021083 1051503 1143722 1433497 516667 637955 744904 688240
14659F88240J99787K14292m08426L63564k53526J54205K25049l419M085l0659
$$ 688240 888027 1102319 693893 1057457 803931 958136 1183185 1179766 1183851 1153192
14649A153192j18460o5154k0265L02196l49958Q0549N6845O7471j6840J26584
$$ 1153192 1034732 969578 949313 1251509 901551 982100 1038945 1106416 1089576 1216160
14639A216160l28623L84211k77646J26493J2309R9406m31548K90379j52984J62663
$$ 1216160 887537 1271748 994102 1120595 1132904 1232310 800762 1091141 938157 1100820
14629A100820j64135M08370j49866j67655J96242n8805M3047j94258O3105J17465
$$ 1100820 936685 1345055 1195189 1027534 1223776 1164971 1208018 1013760 1076865 1194330
14619A194330J79115l11642L06100m6376J35764n19284L27749K34020l40580J80179
$$ 1194330 1373445 1061803 1367903 1321527 1457291 938007 1265756 1499776 1159196 1339375
14609A339375J85898k53549k1557R7646l70143K20315P5198L54598l7128k81769
$$ 1339375 1525273 1271724 1250167 1347813 977670 1197985 1273183 1627781 1590653 1308884
14599A308884J51132j45914J86015k60706J81967j15680r9492K40082j00582J39661
$$ 1308884 1460016 1314102 1500117 1239411 1421378 1305698 1206206 1446288 1345706 1485367
14589A485367K28284j56205r582l59463N68506j54067L83315m23366K38981l98912
$$ 1485367 1713651 1557446 1547864 1188401 1756907 1602840 1986155 1562789 1801770 1402858
14579A402858L34680L46264o94654M15929J03272K9878n6814k49597K63633l4748
$$ 1402858 1737538 2083802 1389148 1805077 1908349 1938227 1881413 1631816 1895449 1860701
14569A860701O2993J4236J4701Q4280J62229m11404J19283M21299q5604L06258
$$ 1860701 1923694 1937930 1952631 2036911 2199140 1787736 1907019 2328318 2242714 2548972
14559B548972k04115L22686K9493J10174N0576m62145Q48923K31007O99552P79261
$$ 2548972 2344857 2667543 2697036 2807210 2857786 2395641 3244564 3475571 4175123 4954384
14549D954384J675383L161055P618019K2006047Q603929A6795561E727905k634312
$$ 4954384 6629767 9790822 17408841 39414888 48018817 16795561 5727905 3093593
14541C093593l64956q02094J80047J084337K554507k724525r44393k16075l87097
$$ 3093593 2728637 1926543 2106590 3190927 5745434 3020909 2076516 1860441 1473344
14532A473344O33485j32951P8269j59108j29858j21948N11470l88208L63351j72109
$$ 1473344 2106829 1973878 2052147 1893039 1763181 1641233 2152703 1764495 2127846 1955737
14522A955737J33733J01997o11031N42985L95439J620l27105J31133K7965j31854
$$ 1955737 2089470 2191467 1580436 2123421 2518860 2520480 2193375 2324508 2352473 2220619
14512B220619N1912L62808l47053M7227L73799N1455j81559O0811j86760L43230
$$ 2220619 2272531 2635339 2288286 2335513 2709312 2760767 2579208 2640019 2453259 2796489
14502B796489l09928L0257m4107J24763K64010j30239N156M91002k02513O9189
$$ 2796489 2486561 2516818 2472711 2597474 2861484 2731245 2736401 3227403 3024890 3094079
14492C094079j90414J05879L89392j27956k95307Q6841L17230j60507R7428J19447
$$ 3094079 2903665 3009544 3398936 3270980 2975673 3062514 3379744 3219237 3316665 3436112
14482C436112m34356J82127J20209J80520M3780l58722M93939j64901p515L61575
$$ 3436112 3001756 3183883 3304092 3484612 3528392 3169670 3663609 3498708 3491193 3852768
14472C852768j98383L7788k49178N00217m31130J93081N48628m74014K28392j37960
$$ 3852768 3654385 3692173 3442995 3943212 3512082 3705163 4253791 3779777 4008169 3870209
14462C870209J05083R2273K26032l35858L15221j88484J11824K92607k63418K375
$$ 3870209 3975292 4067565 4293597 3957739 4272960 4084476 4196300 4488907 4225489 4227864
14452D227864O28543r4145o3603p5525L07986n3665J0008J42280k17419K77960
$$ 4227864 4856407 4762262 4698659 4623134 4931120 4877455 4887463 5029743 4812324 5090284
14442E090284J52423j41545M3902J53058M67700P324k76500J97261N1749J63227
$$ 5090284 5242707 5101162 5145064 5298122 5765822 5773146 5496646 5693907 5745656 5908883
14432E908883J39252J53718k77075J75523J96227j89769J66248o6654L65278K75481
$$ 5908883 6048135 6201853 5924778 6100301 6296528 6106759 6273007 6206353 6571631 6847112
14422F847112k52195L9508P81184Q6561K17910k40886L20537J39231m73742J56890
$$ 6847112 6594917 6634425 7415609 7502170 7720080 7479194 7799731 7938962 7465220 7622110
14412G622110n6292J20902J13026J82500J21683J83814J97214K46447J93039J11650
$$ 7622110 7565818 7686720 7799746 7982246 8103929 8287743 8484957 8731404 8924443 9036093
14402I036093J93994l9478p6203J89231J88883K32173j62319J39818O04295k26116
$$ 9036093 9230087 9190609 9114406 9303637 9492520 9724693 9562374 9702192 10306487 10080371
14392A0080371J98819L78151K8104J94193K10214J56075K26697L19583R8994K94322
$$ 10080371 10279190 10657341 10685445 10879638 11089852 11245927 11472624 11792207 11891201 12185523
14382A2185523J79633M56194K82493q6151L23995L72694j71563M38253j45474
$$ 12185523 12365156 12821350 13103843 13017692 13341687 13714381 13542818 13981071 13835597
14373A3835597P92085J23686J63330M90285Q6678O64718M92716J95018M29583
$$ 13835597 14627682 14751368 14914698 15404983 15491661 16156379 16649095 16844113 17273696
14364A7273696N7420N64278P85627j45725Q5974Q67344J17P70227M68017J54700
$$ 17273696 17331116 17895394 18681021 18535296 18621270 19488614 19488731 20258958 20726975 20881675
14354B0881675O49193Q81121k74705R74266L95246R28104O63798N97719N16413
$$ 20881675 21530868 22411989 22137284 23111550 23506796 24434900 25098698 25696417 26212830
14345B6212830O19015P00973Q05526Q40861P58775Q87622P20329Q85670M64765
$$ 26212830 26831845 27532818 28338344 29179205 29937980 30825602 31545931 32431601 32896366
14336C2896366J148254J370586R38352J360653R53409R31432J561216J253772
$$ 32896366 34044620 35415206 36353558 37714211 38667620 39599052 41160268 42414040
14328D2414040J157027J317724J979057Q14715K164731J846982J659774K193166
$$ 42414040 43571067 44888791 46867848 47682563 49847294 51694276 53354050 55547216
14320E5547216J900601K344930J983294K582144K087922K524504K576165K777320
$$ 55547216 57447817 59792747 61776041 64358185 66446107 68970611 71546776 74324096
14312G4324096L151156K992271M023923L434845L733775M249258M327190M301253
$$ 74324096 77475252 80467523 84491446 87926291 91660066 95909324 100236514 104537767
14304A04537767M802417N544775N274898O104980N927264O892678O844564Q394110
$$ 104537767 109340184 114884959 120159857 126264837 132192101 139084779 145929343 154323453
14296A54323453P704756Q716855R248426J0013211J0436607J1118941J1601907
$$ 154323453 162028209 170745064 179993490 190006701 200443308 211562249 223164156
14289B23164156J2776062J3281727J3593575J4663779J5447313J5940414J6445406
$$ 223164156 235940218 249221945 262815520 277479299 292926612 308867026 325312432
14282C25312432J6700573J7183315J7171757J7063557J6251712J5455476J4411886
$$ 325312432 342013005 359196320 376368077 393431634 409683346 425138822 439550708
14275D39550708J3193744J0633146N824259M364238K927262J410362l57091k611478
$$ 439550708 452744452 463377598 469201857 473566095 476493357 477903719 477546628 474935150
14267D74935150m788809q510548j0792597j2710481j4899940j6001065j7092328
$$ 474935150 470146341 461635793 450843196 438132715 423232775 407231710 390139382
14260C90139382j7476953j7555321j7333716j7496111j6284562j6272257j5276521
$$ 390139382 372662429 355107108 337773392 320277281 303992719 287720462 272443941
14253B72443941j4895353j4027307j3337278j2641221j1760721r389484r508042
$$ 272443941 257548588 243521281 230184003 217542782 205782061 196392577 186884535
14246A86884535j0742488r280785p620040q574524p388820p014365o600679o236601
$$ 186884535 176142047 166861262 159241222 150666698 143277878 136263513 129662834 123426233
14238A23426233n120720n680567n419159m791311m373515m439916l721084l245311
$$ 123426233 118305513 112624946 107205787 102414476 98040961 93601045 89879961 86634650
14230H6634650l738360l640047l292429k906238k974474k561109k803149k152462
$$ 86634650 82896290 79256243 75963814 73057576 70083102 67521993 64718844 62566382
14222F2566382k407527j961708j764634j966248j850814j781463k010789j553652
$$ 62566382 60158855 58197147 56432513 54466265 52615451 50833988 48823199 47269547
14214D7269547j057182j475949j179474j547832j439177j234549j115672l32749
$$ 47269547 46212365 44736416 43556942 42009110 40569933 39335384 38219712 37886963
14206C7886963j032388j579310j143580r56004r48892p55208q7613j380285q36568
$$ 37886963 36854575 35275265 34131685 33175681 32226789 31471581 31383968 30003683 29167115
14197B9167115j200035m88695n76577m98237o78192q49193j97283r13893n19810
$$ 29167115 27967080 27478385 26901808 26403571 25725379 24876186 24678903 23765010 23245200
14188B3245200n63778m31963o16102k37386j081241l7858j19329j045841m38573
$$ 23245200 22681422 22249459 21633357 21395971 20314730 20276872 20157543 19111702 18673129
14179A8673129P8118o44941l87572n18303m32571j28502m21677k68835j48652
$$ 18673129 18751247 18106306 17718734 17200431 16767860 16639358 16217681 15948846 15800194
14170A5800194k50006m12877l97590q61216L61493j65113k11789o04879N3430
$$ 15800194 15550188 15137311 14739721 13878505 14239998 14074885 13863096 13258217 13311647
14161A3311647k15555k84610j91387j02076l84928l74203O6756l95201p2121q4694
$$ 13311647 13096092 12811482 12620095 12518019 12133091 11758888 11825644 11430443 11358322 11273628
14151A1273628l65422l17145r717k01129j87247O2050k67803k28164p363k33016
$$ 11273628 10908206 10591061 10581344 10380215 10192968 10255018 9987215 9759051 9751688 9518672
14141I518672o1755j88693k85179n1124o2840k19725j03786j585k43407r8045
$$ 9518672 9456917 9268224 8983045 8931921 8869081 8649356 8545570 8543985 8300578 8202533
14131H202533M9186l84366n4497Q4013J44516r90084l594j20446M02598l30107
$$ 8202533 8251719 7867353 7812856 7896869 8041385 7051301 7047707 6927261 7329859 6999752
14121F999752J08313l07390Q3535k29762Q8718k59288J32022p3644k68997O090
$$ 6999752 7108065 6800675 6884210 6654448 6743166 6483878 6615900 6542256 6273259 6279349
14111F279349j36461k02933K98739k60720m2988l24021o3754N0583j81536o3479
$$ 6279349 6142888 5939955 6238694 5977974 5934986 5610965 5547211 5597794 5416258 5352779
14101E352779R7875m89140j34924K84860J2941Q788j7993k87260N4164k17477
$$ 5352779 5450654 4961514 4826590 5111450 5124391 5133179 5115186 4827926 4882090 4664613
14091D664613R446K856j8478O3316r2231r2843k28558R7897J7862j21485j48380
$$ 4664613 4674059 4676915 4658437 4721753 4629522 4536679 4308121 4406018 4423880 4302395 4154015
14080D154015k63588N57410k88265j60957J94502j32127k1249j91655K49106m00300
$$ 4154015 3890427 4447837 4159572 3998615 4193117 4060990 4039741 3848086 4097192 3696892
14070C696892P4809J89362k55660j40254L78252k51167l17436M16366l17123K05253
$$ 3696892 3771701 3961063 3705403 3565149 3943401 3692234 3374798 3791164 3474041 3679294
14060C679294J61194n07582L52121k73379J88617j61385L17006P3494o16180J22058
$$ 3679294 3840488 3332906 3685027 3411648 3600265 3438880 3755886 3829380 3213200 3335258
14050C335258O1216j67183k54092K91182l49322K59496n12075O6975M23880Q9277
$$ 3335258 3396474 3229291 2975199 3266381 2917059 3176555 2664480 2731455 3155335 3244612
14040C244612m60377k01624K10363j51007J76201j74943R3223L58533l12617Q0632
$$ 3244612 2784235 2582611 2792974 2641967 2818168 2643225 2736448 3094981 2782364 2862996
14030B862996o7842j18056L2000J913l9925o7857j7812q9404j27635l01264M37301
$$ 2862996 2795154 2677098 2709098 2711011 2671086 2603229 2585417 2496013 2368378 2067114 2504415
14019B504415L2401M4442j42508k87930M2131L8685j27247j6620j66637J28546
$$ 2504415 2536816 2581258 2438750 2150820 2192951 2231636 2104389 2087769 1921132 2049678
14009B049678k22441M96814p5984n4613l06456K62503j68658k81950M8414O4297
$$ 2049678 1827237 2324051 2248067 2193454 1886998 2149501 1980843 1698893 1747307 1811604
13999A811604R5441n8106r0864J61051j5377N5544k16964J11064K9054O24857
$$ 1811604 1907045 1848939 1758075 1919126 1903749 1959293 1742329 1853393 1882447 2507304
13989B507304J141744K226832M726516J9088099K2703549B4824821A0920491m302024
$$ 2507304 3649048 5875880 10602396 29690495 52394044 24824821 10920491 6618467
13981F618467j586945r44371o61574m01825j19165M1365l10289K47502k04599
$$ 6618467 5031522 4087151 3425577 3023752 2904587 2945952 2635663 2883165 2678566
13972B678566j47353k71490L09303o98960L53650j69651l348J10449j06360l88599
$$ 2678566 2531213 2259723 2569026 1870066 2223716 2054065 2050717 2161166 2054806 1666207
13962A666207J95775n5480J42661r7289N0356O3003k41928j73636M75836l8936
$$ 1666207 1861982 1806502 1949163 1851874 1902230 1965233 1723305 1549669 2025505 1986569
13952A986569m04175k7301J39841k343n5946J74662l38579J81354l2367J52777
$$ 1986569 1582394 1555093 1694934 1692591 1636645 1811307 1472728 1654082 1621715 1774492
13942A774492l98214Q6628j39153K08910l30582N10974K0187k57581k55918J54861
$$ 1774492 1376278 1462906 1323753 1532663 1202081 1713055 1733242 1475661 1219743 1374604
13932A374604J03477p0888K2575M03105m43302P1784J63914m26345o3476R2235
$$ 1374604 1478081 1407193 1429768 1832873 1389571 1461355 1625269 1198924 1135448 1227683
13922A227683N20013n08313M3000J2051p0934k6414J41610j18475j19948J73990
$$ 1227683 1747696 1239383 1282383 1294434 1223500 1197086 1338696 1220221 1100273 1274263
13912A274263R3632l89194J16819k09963N4842L15075k21235M171M9672p0677
$$ 1274263 1367895 978701 1095520 885557 940399 1255474 1034239 1038410 1088082 1017405
13902A017405L93729J03078l62829J6295M8394j43938J6914K45720m19704N03497
$$ 1017405 1411134 1514212 1151383 1167678 1216072 1072134 1089048 1334768 915064 1418561
13892A418561k42608k8235o7079m02999L03723L19963k27139j71376J51356p0138
$$ 1418561 1175953 1147718 1080639 677640 981363 1301326 1074187 902811 1054167 984029
13882I84029j10406N03875k16303k14028L23728k24769L77495n38401K87548l54993
$$ 984029 873623 1377498 1161195 947167 1270895 1046126 1423621 885220 1172768 817775
13872H17775q6588J89673j80633J03856J57907O6581L2837j55990M12785l05363
$$ 817775 731187 920860 740227 844083 1001990 1068571 1101408 945418 1358203 1052840
13862A052840j73318L9136J76417o3722j28708L18085l74648J75386m42892K13921
$$ 1052840 879522 918658 1095075 1031353 902645 1220730 846082 1021468 578576 792497
13852G92497R5992C88450P07221j70974k81736K00691k369K42453l53879J75925
$$ 792497 888489 388450 1095671 924697 642961 843652 841283 1083736 729857 905782
13842I05782k87087K52189j45593J09588L87600n06553K11275L1518J00348m43134
$$ 905782 618695 870884 725291 834879 1222479 715926 927201 958719 1059067 615933
13832F15933L54261l17758J77425j659j86959Q7231M09101m91862L1702j10725
$$ 615933 970194 652436 829861 828202 641243 728474 1137575 645713 677415 566690
13822E66690J26260j09281K18151l25281M57741j20932M51198F13234j0734M58456
$$ 566690 692950 583669 801820 476539 934280 813348 1264546 613234 602500 1060956
13812A060956k22177l27883j52021K31161R6993K04060j28247M23656m01485K02497
$$ 1060956 838779 510896 358875 590036 687029 891089 762842 1186498 785013 987510
13802I87510j93587k13229j12599J36252R7284k40206L04644n2725B94411M97313
$$ 987510 793923 580694 468095 604347 701631 461425 766069 713344 294411 791724
13792G91724j40869q7085L02504k2392o1003l14367K71430M4847j39541m9299
$$ 791724 650855 563770 866274 843882 782879 468512 739942 784789 645248 595949
13782E95949K79163l18199L31294K8669l42033L41080l75590J19298k88566K14656
$$ 595949 875112 556913 888207 916876 574843 915923 540333 659631 371065 585721
13772E85721N4324J26762L8618l41378J19732L6494Q0908M5094l0317p8199r6174
$$ 585721 640045 766807 805425 464047 583779 620273 701181 746275 715958 637759 541585
13761E41585K37187o790j94337j99213j0039Q4856K57856l06305L72318k94821
$$ 541585 778772 771982 577645 378432 368393 453249 711105 404800 777118 482297
13751D82297k9204J02677j84862N01461k30439k36924j94825L83924J41317C55945
$$ 482297 453093 555770 370908 872369 641930 405006 210181 594105 735422 355945
13740E67820k01728L79413j81259J3580m85k25955J54979k40568K2831K55072
$$ 567820 366092 745505 564246 577826 577341 351386 506365 265797 288628 543700
13730E43700J38652j64432n0224J92759k19389j03868K45926k196A13588M14367
$$ 543700 682352 517920 467696 660455 441066 337198 583124 580928 113588 527955
13720E27955k0107J21070k86893O2977K92914j49349o9653r8277k3980M2652j12839
$$ 527955 507848 628918 342025 405002 697916 548567 478914 380637 356657 399309 286470
13709B86470l2790M49721j94173m3340K10524k06532j21587K51911J6044B38826
$$ 286470 253680 703401 509228 465888 676412 469880 348293 600204 616248 238826
13698E17509O6993j34634J81363j03219A82711L63255j5352r692r6821P3661J52968
$$ 517509 584502 449868 631231 528012 182711 545966 530614 520922 424101 497762 650730
13687F50730j80619K27701C42624K55790l4432O660q7997k37030M3902R1856A81975
$$ 650730 470111 697812 342624 598414 563982 570642 482645 245615 289517 381373 181975
13675D86598m4741r6201J12673M5424o6233j49521M5228J16456R9315A82489M06199
$$ 486598 441857 345656 458329 503753 437520 287999 333227 449683 548998 182489 588688
13664E88688j70785J03098L44928B3673J93867L69966B92012K0486J47191J74203
$$ 588688 417903 521001 865929 23673 217540 587506 292012 312498 459689 633892
13654F33892p7955A70186K34273J7486j46732p2491K68719k19205O7859a450B37118
$$ 633892 555937 170186 404459 421945 275213 202722 471441 252236 320095 -1450 237118
13642E38979j35203p4586k772q103L47018k80954k7587m7030j8768K13677c6901
$$ 538979 403776 329190 326418 318315 665333 384379 356792 309762 290994 504671 -36901
13630A6776L30198P9375e8657G76958A25462J1858J54849j41783J67445j51119
$$ 16776 346974 426349 -58657 776958 125462 137320 292169 150386 317831 166712
13620A66712J76353p9799J87363j91196J49191j49911K40621k05423A21306J73839
$$ 166712 343065 263266 450629 259433 408624 258713 499334 293911 121306 295145
13610B95145J34572J51144A90266K31864P5862B8451K25000E0327K54391L0396
$$ 295145 429717 580861 190266 422130 497992 28451 253451 50327 304718 335114
13600C35114K59480a3684B61825n5394J65454M0467j01840q1797K67786Q6438
$$ 335114 594594 -13684 261825 206431 371885 412352 310512 228715 496501 582939
13590E82939j03533k05589r8837q6728M06034k37143q8899J90761M0992j68766
$$ 582939 479406 273817 174980 88252 494286 257143 168244 359005 399997 231231
13580B31231L93859B36977f7877E20557j14697A77135C1565L84678J33182A04952
$$ 231231 625090 236977 -67877 520557 405860 177135 31565 416243 549425 104952
13569B09466L15203j11443A54691J55253A8084K40549R2856A24612K22479j31156
$$ 209466 524669 413226 154691 309944 18084 258633 351489 124612 347091 215935
13559B15935J56760O9334q8822K8689j34231J50196j71458r7401L72361B18507
$$ 215935 372695 442029 353207 381896 247665 397861 226403 129002 501363 218507
13548C63887A01128a4119j18888a4003C70131r7037A16853L1627a19964D25066
$$ 363887 101128 -14119 -133007 -14003 370131 273094 116853 148480 -119964 425066
13537A72826M30429B34882K43562r2648J78423B33411p8624D7481K82968A52698
$$ 172826 603255 234882 478444 385796 564219 233411 154787 47481 330449 152698
13526B53931a57318F2150R6498O4147M4581n5567A00420D1589K38592K82687B6637
$$ 253931 -157318 62150 158648 222795 267376 211809 100420 41589 280181 562868 26637
13514a6501C56720A69420J33809J21230H9178L15875j36498j0109a01330B98162
$$ -16501 356720 169420 303229 424459 89178 405053 268555 258446 -101330 298162
13503a3428e012A16716l9258L85225j78160J60718K379n0298j79993J16215G6628
$$ -13428 -5012 116716 77458 462683 284523 445241 447620 397322 217329 333544 76628
13491F2285j9683j4396b907A82510Q6190J60314j25821Q4118P8162B17283K58914
$$ 62285 42602 28206 -2907 182510 268700 429014 303193 387311 465473 217283 476197
13480D76197B03993m5150J5719M6750A3851K54921A08761J1989K22355A08496
$$ 476197 203993 158843 174562 221312 13851 268772 108761 120750 343105 108496
13469C32733l2595f7859D6565J48096J07440O9581j28102J6208R7548A06962J9517
$$ 332733 300138 -67859 46565 194661 302101 371682 243580 259788 357336 106962 126479
13458A26479J35629A01598J68263C2685Q12Q2929a25878E9896k8555M7003K35988
$$ 126479 262108 101598 269861 32685 33497 116426 -125878 59896 31341 78344 314332
13447C14332R2640A12808Q9442N8840e46B20171i0882C52051A67478J83264e280
$$ 314332 406972 112808 202250 261090 -546 220171 -90882 352051 167478 350742 -5280
13435A9215J37164j0130K9299c7761B28297r3170K25673A67484j8984L13040b10522
$$ 19215 156379 146249 175548 -37761 228297 135127 360800 167484 148500 461540 -210522
13423C17175J42950A16896b15408M5474A8443P2420c7441B68730A03243a0033
$$ 317175 460125 116896 -215408 -169934 18443 90863 -37441 268730 103243 -10033
13412G8970K70515c1239H958M15412D7083L9293J33417b72205A59543k1686D9995
$$ 78970 349485 -31239 8958 424370 47083 86376 219793 -272205 159543 137857 49995
13400D6672K81484p4121e4625E37791k51007j28082C4999a39090L2462C77351
$$ 46672 328156 254035 -54625 537791 286784 158702 34999 -139090 -106628 377351
13389D8357b9225B45768j3735a43442D3376P757B256O97150A07717K55698a4237
$$ 48357 -29225 245768 232033 -143442 43376 51133 2256 699406 107717 363415 -14237
13377A90943a15493C05649M5184J05940A75541P8898b776B23648d6847j12186
$$ 190943 -115493 305649 350833 456773 175541 254439 -2776 223648 -46847 -159033
13367a59033D39985A31628L94004k41663J87427I3962J36272L56004i150C55267
$$ -159033 439985 131628 525632 283969 471396 93962 230234 586238 -9150 355267
13356C86485j74721H620L00913n333L8019A44740O3402K13892p4544h164C24253
$$ 386485 211764 8620 309533 304200 342219 144740 208142 422034 347490 -8164 324253
13344C93687j40507M4078o4768j2076J57344j39863A08271K52103j41501K77166
$$ 393687 253180 297258 232490 220414 377758 237895 108271 360374 218873 496039
13334D96039B28545A12860c4798B24544L69242j96596g6195C55940a41093B9109
$$ 496039 228545 112860 -34798 224544 593786 397190 -76195 355940 -141093 29109
13323E14358j59312j69758F971g4399B02940j9022B827J31868L66216A66983Q7648
$$ 514358 355046 185288 6971 -74399 202940 183918 2827 134695 500911 166983 254631
13312B54631K55771I0059R6416K55969j41948A23277h7893C38494o5083k2166
$$ 254631 510402 90059 186475 442444 300496 123277 -87893 338494 273411 251245
13302B51245J09634p2613C2248e1598H7923a7171l5509D4872K38963C8501K935
$$ 251245 360879 288266 32248 -51598 87923 -17171 -52680 44872 283835 38501 41436
13291D1436a1207B3654R8748i9078A54107E0347J42119b31647F2724j0316b47170
$$ 41436 -11207 23654 122402 -99078 154107 50347 192466 -231647 62724 52408 -247170
13279a3493m7729A67401J21533L4624B296J48746a878r4355B05681f6896B66125
$$ -13493 -61222 167401 288934 323558 2296 151042 -1878 -96233 205681 -66896 266125
13267d5259G1074M8546n2391O0381a13840D3911L73027I835L45684a22556d2935
$$ -45259 71074 119620 67229 127610 -113840 43911 416938 9835 355519 -122556 -42935
13255f953D9433a85737A54619c80642A77918o7020J93937D0483L37061A32678
$$ -6953 49433 -185737 154619 -380642 177918 110898 304835 40483 377544 132678
13244f0419A87803n7081a45377j5896B9538a85424A12342C437K43208A14132B9754
$$ -60419 187803 130722 -145377 -161273 29538 -185424 112342 3437 246645 114132 29754
13232B70563m7587b10667B9262K02464B0827a21267E999a78801B56904A3600K43809
$$ 270563 222976 -210667 29262 231726 20827 -121267 5999 -178801 256904 13600 257409
13221B57409H7079J98466a68984B12094K377a26331C6884b32320a04370A55797
$$ 257409 87079 285545 -168984 212094 214471 -126331 36884 -232320 -104370 155797
13210c4580F8882K6681l6352J07210c6035A94835g6184k595j02465e2177C49967
$$ -34580 68882 95563 59211 166421 -36035 194835 -76184 -78779 -181244 -52177 349967
13198C8700J27675I864J59250F8613M7001l3872A269L52906f8428A41269b26715
$$ 38700 166375 9864 169114 68613 115614 81742 1269 354175 -68428 141269 -226715
13186g8184j80802k5172a14559b8395G1012J23983m0194a08273A28327A5386J08512
$$ -78184 -258986 -284158 -114559 -28395 71012 194995 154801 -108273 128327 15386 123898
13175A23898C1664J2609E239f8388r835o4612b5923k91984a06421b832B40153
$$ 123898 31664 44273 5239 -68388 -78223 -142835 -25923 -317907 -106421 -2832 240153
13163b3989h902B00574M2711A8990i882A60566a8752e597j54005j76184g8245
$$ -23989 -8902 200574 243285 18990 -9882 160566 -18752 -5597 -159602 -335786 -78245
13151b23384b1625B15709C8528a2735j10342A3188L40744a53531I7958a26156
$$ -223384 -21625 215709 38528 -12735 -123077 13188 353932 -153531 97958 -126156
13140I1603j0704J06540l6481k2836g6639A30892i796p4821A23106i5507A49655
$$ 91603 80899 187439 150958 128122 -76639 130892 -9796 -84617 123106 -95507 149655
13128B40219e2501E8896J03089b8321l00445i6507G0073J33255n5665a42719A66677
$$ 240219 -52501 58896 161985 -28321 -328766 -96507 70073 203328 147663 -142719 166677
13116G1499b494A24491n280j0008R9061l5951Q7061E9720a87528B17776J49987
$$ 71499 -2494 124491 119211 109203 208264 172313 259374 59720 -187528 217776 367763
13105C67763r1680i6233k2493H3450b54642b2352G1192d1115a8790A59696N6793
$$ 367763 276083 -96233 -118726 83450 -254642 -22352 71192 -41115 -18790 159696 216489
13094B16489j9046c1630A42456o8996B6287h3749G9176j7838K23091d4994B36118
$$ 216489 197443 -31630 142456 73460 26287 -83749 79176 61338 284429 -44994 236118
13082A3406c0332l42175c0411C03764C5150L59N7650D4217J1874M46291A62620
$$ 13406 -30332 -372507 -30411 303764 35150 35509 93159 44217 56091 502382 162620
13070b4474j54013P3612D2147L69349K1215b11731g7938A73943a7707B93863A07148
$$ -24474 -178487 -104875 42147 411496 432711 -211731 -77938 173943 -17707 293863 107148
13058e8801j2865I5523R5094B9793K13467d0127K256j25725L7063a5062A2446
$$ -58801 -71666 95523 190617 29793 243260 -40127 -37871 -163596 -126533 -15062 12446
13046c1091E4437Q6861P1747d2375B52910b17347N1758l27351c0656k5813b5437
$$ -31091 54437 141298 213045 -42375 252910 -217347 -165589 -492940 -30656 -56469 -25437
13034a6716A98110k2526j514J58928A0017J63741C5254J85018c01293H567K56668
$$ -16716 198110 175584 174070 332998 10017 173758 35254 220272 -301293 8567 265235
13023B65235g3873B61435A3333K07973l3713g2703A57016B1565Q9113C4034K33486
$$ 265235 -73873 261435 13333 221306 187593 -72703 157016 21565 110678 34034 267520
13012B67520l2668b1273A77780C4765a6307B22452a09822A94132B9350b01363
$$ 267520 234852 -21273 177780 34765 -16307 222452 -109822 194132 29350 -201363
13001A93341J51565e5714D07605c5424F726J53084b34942H7568a71832h1197A12892
$$ 193341 344906 -55714 407605 -35424 6726 159810 -234942 87568 -171832 -81197 112892
12989F5405g5812A71030l9793A8402K758J93464q7713h1054c0024A7024b7345
$$ 65405 -75812 171030 131237 18402 21160 214624 126911 -81054 -30024 17024 -27345
12977b55241R4165B33620h623A36448j4876j9354L136M883J95874j18471J7444
$$ -255241 -161076 233620 -8623 136448 121572 102218 105354 110237 306111 187640 205084
12966B05084a83910a2258C035a99155C00792h2977F4068b04212e9529A10410b17602
$$ 205084 -183910 -12258 3035 -199155 300792 -82977 64068 -204212 -59529 110410 -217602
12954c4037j93051G0396K92058j23918b33423P8775A57815M9265a98799g2603
$$ -34037 -227088 70396 362454 238536 -233423 -154648 157815 207080 -198799 -72603
12943H2383a37439j54843E2513J01336L4929I3706O253b9335I142c52240B7772
$$ 82383 -137439 -292282 52513 153849 188778 93706 99959 -29335 9142 -352240 27772
12931C56570i01n2294C57068i361A7056c6627l0329j06751K1343A78272R115b8598
$$ 356570 -901 -53195 357068 -9361 17056 -36627 -66956 -173707 -152364 178272 187387 -28598
12918a18801F2493a41588o1058B71814A0961a63558C4891P3283O896N0493i77
$$ -118801 62493 -141588 -202646 271814 10961 -163558 34891 108174 115070 165563 -977
12906d6574E2018k4402d46501a1465E9874i3945A40336d74527a85226A08688g0837
$$ -46574 52018 27616 -446501 -11465 59874 -93945 140336 -474527 -185226 108688 -70837
12894B00892D4793J70908p1523a72944K6923A12701a4052p7401M2896D403R0798
$$ 200892 44793 215701 144178 -172944 -146021 112701 -14052 -91453 -48557 4403 95201
12883I5201b25103C01659b52048i0211D7554Q2282f6603A10792a07064F0425J88074
$$ 95201 -225103 301659 -252048 -90211 47554 129836 -66603 110792 -107064 60425 248499
12872B48499j23320a64348B39025O6609n8552J42811b03926C4392h0204p5449
$$ 248499 125179 -164348 239025 305634 247082 389893 -203926 34392 -80204 -155653
12862a55653A25336N6268q5363j3686A4583b74994a00708M3094a9836I7084N2414
$$ -155653 125336 181604 96241 82555 14583 -274994 -100708 -57614 -19836 97084 149498
12851A49498B3340a31810j16484A16185a38625B4990N0434M8292j6960c83794
$$ 149498 23340 -131810 -248294 116185 -138625 24990 75424 123716 106756 -383794
12840B81399i0398j31763L4687k0089C3846c8545F6238k944g7251I7792D0816
$$ 281399 -90398 -222161 -187474 -207563 33846 -38545 66238 63294 -77251 97792 40816
12828C1002N572a39841L3703r8385A12917j9655l703b39033G3859J12441m7719
$$ 31002 36574 -139841 -106138 -204523 112917 93262 89559 -239033 73859 186300 138581
12817A38581g5685A16516a04033A9018J8773K62810r1465H6226a78820C58959
$$ 138581 -75685 116516 -104033 19018 37791 300601 209136 86226 -178820 358959
12806A66869e4296f139j21076B3827a63209J3376A9785J51584f8256J0969E4155
$$ 166869 -54296 -6139 -127215 23827 -163209 -149833 19785 171369 -68256 -57287 54155
12794b21282I343K58150c58216E20146A8309J39761i5150o7976L7913B30795h6545
$$ -221282 9343 267493 -358216 520146 18309 158070 -95150 -163126 -125213 230795 -86545
12782a63001f8237q6776F9300K80344a95993d4886C7088c1089E77e4192j40491
$$ -163001 -68237 -155013 69300 349644 -195993 -44886 37088 -31089 577 -54192 -194683
12771a94683D4844d3392j5460D8842d53558b19291o4160A47152K33385g7789o9825
$$ -194683 44844 -43392 -58852 48842 -453558 -219291 -283451 147152 380537 -77789 -147614
12760a47614f6669q8884E5171A6736L08693A37447a33644l5779A21744a25741
$$ -147614 -66669 -155553 55171 16736 325429 137447 -133644 -169423 121744 -125741
12749a22771A4156O99J44532J56734a03332M7937A41216a25366A5933a50759C4188
$$ -122771 14156 14855 159387 316121 -103332 -55395 141216 -125366 15933 -150759 34188
12737i597C5506M7142R9609a11967A78284a06223A70238a05877A19506R518J273
$$ -9597 35506 82648 182257 -111967 178284 -106223 170238 -105877 119506 129024 130297
12726A30297b60371b1754p5840I6102N7303J36353B0056L1918B4324g258r2901
$$ 130297 -260371 -21754 -97594 96102 153405 289758 20056 51974 24324 -7258 -100159
12715a00159M1809j40866C49081d0780A26745F1628b67329i2593B59932c776p4704
$$ -100159 -58350 -199216 349081 -40780 126745 61628 -267329 -92593 259932 -3776 -78480
12704g8480L1980k39200F3025d8826B1868a23176j515m2192j43939G4290h9812
$$ -78480 -46500 -285700 63025 -48826 21868 -123176 -124691 -166883 -310822 74290 -89812
12692A00374m048M6240a20416K5130B39819e71501A36659M4506h1891A83428B8505
$$ 100374 96326 142566 -120416 -95286 239819 -571501 136659 181165 -81891 183428 28505
12680A29461N7169Q5403P6844E7272a71020F7839J06772a42120A88308e3501n080
$$ 129461 186630 272033 348877 57272 -171020 67839 174611 -142120 188308 -53501 -58581
12669e8581j021A3167a21512B08546g7011j00489K4243D13079B01358N1533d25434
$$ -58581 -59602 13167 -121512 208546 -77011 -177500 -153257 413079 201358 252891 -425434
12657g1405G2022a22565L7776L1A27311j043O0887A5520h3288B21689b86769A03335
$$ -71405 72022 -122565 -84789 -84758 127311 126268 187155 15520 -83288 221689 -286769 103335
12644B9224a15287m3278A39953e5031A28654a5601j70997P2524C6541f0170A92660
$$ 29224 -115287 -158565 139953 -55031 128654 -15601 -186598 -114074 36541 -60170 192660
12632D9062M6492k9964J70360J14993q5037c8896A19777b51293f0709B78549j21266
$$ 49062 95554 65590 235950 350943 265906 -38896 119777 -251293 -60709 278549 157283
12621A57283q19D51L4749M9557g1526F8734j4174J46856E7863a44341j40363C08389
$$ 157283 156464 451 35200 84757 -71526 68734 54560 201416 57863 -144341 -284704 308389
12608a94714A12189a80190A00181l6001p307d6396j54350A36479J60142f1085
$$ -194714 112189 -180190 100181 64180 56873 -46396 -200746 136479 296621 -61085
12597H7355J04664H7816c54663H0853J93563A01113N5297b15086P1579q2641B36268
$$ 87355 192019 87816 -354663 80853 274416 101113 156410 -215086 -143507 -226148 236268
12585A18444B5874J73442e6490B7469K1914L6502G456a49700A3988K37710p7042
$$ 118444 25874 199316 -56490 27469 49383 85885 7456 -149700 13988 251698 174656
12574A74656h5222i468j98851C2149N3120L05140E8676a95950E6670f0902k06928
$$ 174656 -85222 -9468 -208319 32149 85269 390409 58676 -195950 56670 -60902 -267830
12563b67830i7324D0304b0320A40587b37344A18065J08540a54486A96870b09892
$$ -267830 -97324 40304 -20320 140587 -237344 118065 226605 -154486 196870 -209892
12552H0489b6738C03895j05495a86564m79472a39133C6200O3789g1299j34165
$$ 80489 -26738 303895 198400 -186564 -666036 -139133 36200 99989 -71299 -205464
12542b05464j18106D0958J5435K64280j7627a00779A35585c60015D8529g3905
$$ -205464 -323570 40958 56393 320673 303046 -100779 135585 -360015 48529 -73905
12531d87336a4829j07526A40367c3208A06348a42589A04503K7237b45017H7750
$$ -487336 -14829 -122355 140367 -33208 106348 -142589 104503 131740 -245017 87750
12520b15086A93396n8211a49929m0229I7560K3553L9604g3525j43839N1277l2384
$$ -215086 193396 135185 -149929 -190158 97560 121113 160717 -73525 -217364 -166087 -198471
12509a98471c4535B30262h7541B52523a88820H7925R03J73430J6615a1032j21266
$$ -198471 -34535 230262 -87541 252523 -188820 87925 88828 262258 278873 -11032 -132298
12498a32298B34031R170L5937a99458F3394k3302K12808D8114d41266b9418g939
$$ -132298 234031 243201 279138 -199458 63394 40092 252900 48114 -441266 -29418 -7939
12486A0670J7875b2957l5573r2375C88674c3339D0806b22784A45753P7984F329
$$ 10670 28545 -22957 -58530 -150905 388674 -33339 40806 -222784 145753 223737 6329
12474F6541p284k3939g9488B6789J08223K16358A13987N579A953c9988A57245
$$ 66541 59257 35318 -79488 26789 135012 351370 113987 119566 1953 -39988 157245
12462A67696J86257E6511c02578R99d7866A25739A0010M3743c5185l1258r8588
$$ 167696 353953 56511 -302578 -301579 -47866 125739 10010 53753 -35185 -66443 -165031
12451a65031B969b38975D9161J46678F3836M02155b31525b0327j50808C5153e045
$$ -165031 2969 -238975 49161 195839 63836 465991 -231525 -20327 -171135 35153 -5045
12439B28549b27185Q9516F3921R2123A7756K2314g0384A05384b24457G9907b8262
$$ 228549 -227185 -137669 63921 156044 17756 40070 -70384 105384 -224457 79907 -28262
12427A61515a88103A26134c22695O5429A50786k9748B0098R8284d36872c3689
$$ 161515 -188103 126134 -322695 -257266 150786 121038 20098 118382 -436872 -33689
12416B19823H8675a92951a2001A32820b04518B466a60098M4272C32548A46151
$$ 219823 88675 -192951 -12001 132820 -204518 2466 -160098 -115826 332548 146151
12405b35634B27100b4144A60254a12478a6824F906a86757m2107D22434A97743
$$ -235634 227100 -24144 160254 -112478 -16824 6906 -186757 -228864 422434 197743
12394b2677k9415j71973C10280b85764C27886C5141K24150E7114a35302Q040L7244
$$ -22677 -52092 -224065 310280 -285764 327886 35141 259291 57114 -135302 -127262 -90018
12383i0018p6624P2983o444A56348F7219a36155J7865I6941i664k42051B69918
$$ -90018 -166642 -93659 -100103 156348 67219 -136155 -118290 96941 -9664 -251715 269918
12371I1892g6645N2j06312j62372e2174F8116b44342J7742I2351A8728c91371
$$ 91892 -76645 -76593 -182905 -345277 -52174 68116 -244342 -226600 92351 18728 -391371
12359b34925D2548a65995J5258b2135j70734L8323B53982a45721k8631B30690
$$ -234925 42548 -165995 -150737 -22135 -192869 -154546 253982 -145721 -174352 230690
12348a45773I2845a25104D6977L27006a0109j1459j44257A38411c74957A06787
$$ -145773 92845 -125104 46977 373983 -10109 -21568 -165825 138411 -374957 106787
12337C46067a34447M6325F9598J32689n5672b54501B46006r6677Q2761a43232
$$ 346067 -134447 -88122 69598 202287 146615 -254501 246006 149329 232090 -143232
12326A76697J00742j09947d6905G6998J16679l149B8733L10293b6721I5573J38911
$$ 176697 277439 167492 -46905 76998 193677 190528 28733 339026 -26721 95573 234484
12315B34484A02008a2560A94780j3205a29163p7530C17623f5874c0961B59633
$$ 234484 102008 -12560 194780 181575 -129163 -206693 317623 -65874 -30961 259633
12304h0471A51683p2951K57218E5653k6366K34774b80851A50942k002m4271B3712
$$ -80471 151683 78732 335950 55653 29287 264061 -280851 150942 148940 104669 23712
12292B34674A9667J92440n3931G1155a38037n3193b3600j60209A23657m5234g6273
$$ 234674 19667 212107 158176 71155 -138037 -191230 -23600 -183809 123657 78423 -76273
12280a06244C12833A1544J85766j1678P90e2477C7974J87380r6722a11956C52271
$$ -106244 312833 11544 197310 185632 186422 -52477 37974 225354 128632 -111956 352271
12268a3458C22522o2571m2762K64418B885K31497O5866n9257r3233c69028F4167
$$ -13458 322522 259951 217189 481607 2885 234382 300248 240991 147758 -369028 64167
12256e49774D2608J33083J32464G1793l3J36287J77362A66241m0008E9172e8944
$$ -549774 42608 175691 308155 71793 71760 208047 385409 166241 126233 59172 -58944
12244A04368c03090R3398a1953B06346A4605K03900a21739A26304a05532A29811
$$ 104368 -303090 -209692 -11953 206346 14605 218505 -121739 126304 -105532 129811
12233A72273O9049a18800A18050B8438K36885D8388O6212n1228a43398F13874
$$ 172273 241322 -118800 118050 28438 265323 48388 114600 63372 -143398 613874
12222B10366L2461k6035G9007L41475k08290L9629j25557k6824K55012B6645J16162
$$ 210366 242827 216792 79007 420482 212192 251821 126264 99440 354452 26645 142807
12211A42807F2702h2492L1794B55804b56914I7516a58615c3290A17505e3537A11750
$$ 142807 62702 -82492 -50698 255804 -256914 97516 -158615 -33290 117505 -53537 111750
12199C03360d2615j8867C65266q3895b4040A64891m1892j6843L76125A96550B3761
$$ 303360 -42615 -61482 365266 281371 -24040 164891 122999 106156 482281 196550 23761
12187A37075E3694M16886A7201K89031j16727R6700m718I5818J4052m1853L7900
$$ 137075 53694 470580 17201 306232 189505 286205 281487 95818 109870 68017 105917
12176A05917L524J28660B9161M57318B30852M6619F6680O2198L47562D1058L38771
$$ 105917 109441 238101 29161 486479 230852 277471 66680 128878 476440 41058 379829
12165C79829o4482q9569b2878A89635o7406J90611p0477j02098d0065E6407K08188
$$ 379829 315347 225778 -22878 189635 122229 312840 242363 140265 -40065 56407 264595
12154B64595F8632f5067B19098q5662N3811o1073D8553O0010J95697G6428i1491
$$ 264595 68632 -65067 219098 133436 187247 126174 48553 108563 304260 76428 -91491
12142b43257P9749j82743H6421Q5702E718K19889G8447d1799B06448r4050j9268
$$ -243257 -163508 -346251 86421 172123 5718 225607 78447 -41799 206448 112398 93130
12131I3130L3892h3371A25704g2044d40C08325j16545N2236C2291K33675A30687
$$ 93130 127022 -83371 125704 -72044 -440 308325 191780 244016 32291 265966 130687
12119B49588B9395J11153J67117a7867m5855m3526A92373G5993K65739A06569
$$ 249588 29395 140548 307665 -17867 -63722 -107248 192373 75993 341732 106569
12108a6152B57381o5117o8578K73200j05186p3797O9741C2374M1613R0084h6455
$$ -16152 257381 192264 123686 396886 291700 217903 287644 32374 73987 164071 -86455
12096G3851M3702a23281B57236I709M23996D1298g7751I4254K80509G0042d546
$$ 73851 117553 -123281 257236 9709 433705 41298 -77751 94254 374763 70042 -4546
12084C66572A23761h1020A52657o8214k1151N7800c8623j91705A94707C3477j3873
$$ 366572 123761 -81020 152657 84443 63292 121092 -38623 -230328 194707 33477 19604
12073A9604L96618j87177R5860A03328d5461A26833M4110j1602d729B25600A2363
$$ 19604 416222 229045 324905 103328 -45461 126833 170943 159341 -4729 225600 12363
12061a69945F4186N1034C0923a29107D7391e9728K6735H3855L7555i6146A81414
$$ -169945 64186 115220 30923 -129107 47391 -59728 -32993 83855 121410 -96146 181414
12049i5995K9389j61786C6914h2669l45661A53303K0939d2256j03003N852O8733
$$ -95995 -66606 -228392 36914 -82669 -428330 153303 174242 -42256 -145259 -139407 -70674
12038g0674K9732O973H6142K5333D3096Q2671D8909d15492f1811K3852A99681
$$ -70674 -40942 -33969 86142 111475 43096 125767 48909 -415492 -61811 -37959 199681
12026C27721c2627I2956c1502C9446e3201I7678O1058J13957q4562N7404J21768
$$ 327721 -32627 92956 -31502 39446 -53201 97678 158736 272693 188131 245535 367303
12015C67303d02535a2044k92701c7968A70968a27274B82891i3004E27737e41372
$$ 367303 -402535 -12044 -304745 -37968 170968 -127274 282891 -93004 527737 -541372
12004G7163J48126J684a1627K43k8472C40882b65762A34543k0771a16266K6125
$$ 77163 225289 226973 -11627 -11384 -39856 340882 -265762 134543 113772 -116266 -90141
11993i0141l38434B47328I9210K3870b22p4023n1878K9712B51179a78583Q299
$$ -90141 -428575 247328 99210 123080 -222 -74245 -126123 -96411 251179 -178583 -170284
11982a70284j99388a57489l9071I819b41903A23387l3865a93185e6047A14842
$$ -170284 -369672 -157489 -196560 9819 -241903 123387 89522 -193185 -56047 114842
11971A18999a3764j60757M375F2288b50109A48829B3774a94338h7352H1017J28133
$$ 118999 -13764 -174521 -170146 62288 -250109 148829 23774 -194338 -87352 81017 209150
11960B09150b38406C286b15600l1145h1342A49852n4554a53725L8411G0958a04800
$$ 209150 -238406 3286 -215600 -246745 -81342 149852 95298 -153725 -115314 70958 -104800
11948f8957a4708m3149C5715j4617i5930A29724J2460a1995l59348i6405A94824
$$ -68957 -14708 -57857 35715 21098 -95930 129724 142184 -11995 -371343 -96405 194824
11936a4808A73410L3326e9839A17017K2409J18772a04030A31536j0579b32225
$$ -14808 173410 206736 -59839 117017 139426 258198 -104030 131536 120957 -232225
11925b40600A12715b00157J8650L8913J6924N2328k52081d5809B25615G8248J05423
$$ -240600 112715 -200157 -181507 -142594 -125670 -73342 -325423 -45809 225615 78248 183671
11914A83671d74872J75267A62697A5153J41906d41784A55568A922J50496d5874
$$ 183671 -474872 -299605 162697 15153 157059 -441784 155568 1922 152418 -45874
11903C5793j7397K11031n0846K6253b21281C6296J10979e5986j78344n6010A96937
$$ 35793 18396 229427 178581 204834 -221281 36296 147275 -55986 -234330 -290340 196937
11891c72671a75320g1923B41628o2114c3798H7550h8235m94273a47003c3975H8899
$$ -372671 -175320 -71923 241628 179514 -33798 87550 -88235 -582508 -147003 -33975 88899
11879d2057j69765N8024d5426l82336B27062a21000C9824K23524e8205B63683
$$ -42057 -211822 -153798 -45426 -427762 227062 -121000 39824 263348 -58205 263683
11868C9973c8832j94038J00468k40058b5157j20870n6809L2788d8608I6121b21984
$$ 39973 -38832 -232870 -132402 -372460 -25157 -146027 -202836 -170048 -48608 96121 -221984
11856A28446k3869P0537F8620i8400j75909Q8277D2300e1483E76c3728H3133g1119
$$ 128446 104577 175114 68620 -98400 -274309 -186032 42300 -51483 576 -33728 83133 -71119
11843e6337k40768M9827i8976B53718a20681e035l95942i2278p97L4641B05918
$$ -56337 -297105 -247278 -98976 253718 -120681 -5035 -400977 -92278 -93075 -58434 205918
11831d98137a56991g7024b6423g389D27812a68834e0565m097H21d74701A18827
$$ -498137 -156991 -77024 -26423 -7389 427812 -168834 -50565 -54662 821 -474701 118827
11819a81189o5662R8687m22946B73656a11770K0689D0762j5297b24886D3255i6028
$$ -181189 -246851 -148164 -571110 273656 -111770 -91081 40762 25465 -224886 43255 -96028
11807G246J87334c19522I6426a16991c134j24967l32711a30752E296e3549B5291
$$ 7246 194580 -319522 96426 -116991 -3134 -128101 -460812 -130752 5296 -53549 25291
11795B2526a11121A92604a70592d5474E9781J51853F3535d2450a1781C310J84848
$$ 22526 -111121 192604 -170592 -45474 59781 211634 63535 -42450 -11781 3310 188158
11784A88158b89901e0952k67288G373J36297D7645N1870a01201j33898A60879
$$ 188158 -289901 -50952 -318240 7373 143670 47645 99515 -101201 -235099 160879
11773B72754D2037J3243c22492B54933q6330H2491b67082g0349j26653l46515
$$ 272754 42037 55280 -322492 254933 168603 82491 -267082 -70349 -197002 -543517
11763e43517B10706e2884A3527J78203q9678D7186K42739K7994C3208b53604A22393
$$ -543517 210706 -52884 13527 191730 102052 47186 289925 317919 33208 -253604 122393
11751A09001d89656A28961c9221A34127e8088B4893e8325A15360N4627L2728H8252
$$ 109001 -489656 128961 -39221 134127 -58088 24893 -58325 115360 169987 202715 88252
11739B99788l3422B6469b21505A40896J42067C1604a89131b9767C38386I4362
$$ 299788 266366 26469 -221505 140896 282963 31604 -189131 -29767 338386 94362
11728b3170l02756J56247L7382l2867b7552l16254J49232H7763a30970O2229J1959
$$ -23170 -325926 -169679 -132297 -165164 -27552 -343806 -194574 87763 -130970 -68741 -56782
11717e6782A5603i9495E1112b8082B79319a46711k5882Q5366m175a9646F9682
$$ -56782 15603 -99495 51112 -28082 279319 -146711 -172593 -87227 -91402 -19646 69682
11705A64748b44627B61150i3221j56768B26497o1894a044A63734Q9473C802a35178
$$ 164748 -244627 261150 -93221 -249989 226497 164603 -1044 163734 253207 3802 -135178
11693C52935A01160K61815A69192b5709k3343j72470G0443f7304G4874K77414
$$ 352935 101160 362975 169192 -25709 -49052 -221522 70443 -67304 74874 352288
11683C52288A45003j4632g4543E5261R880l1192R5042i2988j11588I7958j6472
$$ 352288 145003 130371 -74543 55261 65141 33949 128991 -92988 -204576 97958 81486
11672H1486d24782a1820m56110J32986A11934L4362e7968l0195k25496A06237
$$ 81486 -424782 -11820 -467930 -334944 111934 146296 -57968 -88163 -313659 106237
11661a06392I8876J92447a16775A29008L20799b76162A06245J51534B9415b95353
$$ -106392 98876 291323 -116775 129008 449807 -276162 106245 257779 29415 -295353
11650B79585j32054R6738a58165H8922A5685a83565o7065i5852J1686j5883A23438
$$ 279585 147531 244269 -158165 88922 15685 -183565 -250630 -95852 -84166 -100049 123438
11638B10097I8729e20905A33726K17985j00512J40858A69382o0005J78285c42418
$$ 210097 98729 -520905 133726 351711 251199 392057 169382 109377 287662 -342418
11627G4565b22437C60987F9734K070R9853a96324B00087I3213e8011l8606A62745
$$ 74565 -222437 360987 69734 71804 171657 -196324 200087 93213 -58011 -96617 162745
11615A33778q605g3081A11590c52754Q4839j24051i0921A0798c40028f16A97519
$$ 133778 125173 -73081 111590 -352754 -267915 -391966 -90921 10798 -340028 -616 197519
11603b85878A08460c86769a9441B34877a51570G5567a6395l9478A61045i4564
$$ -285878 108460 -386769 -19441 234877 -151570 75567 -16395 -55873 161045 -94564
11592C6509E366J31620D8346K13957n7429I7977m6688f8821A16220k6377J25897
$$ 36509 5366 136986 48346 262303 204874 97977 51289 -68821 116220 89843 215740
11581B15740K95585B9949e5423i141j2564B80532g0076a8217A03069Q9831b1945
$$ 215740 511325 29949 -55423 -9141 -21705 280532 -70076 -18217 103069 192900 -21945
11569b16528E6001K01524a5084L291C20980q4072p2874G0630e8662k28414Q1359
$$ -216528 56001 257525 -15084 -11793 320980 236908 164034 70630 -58662 -287076 -205717
11558b05717q257C67830h0845K5390B76686A12307d9498m4969E24431G1413a6510
$$ -205717 -213974 367830 -80845 -55455 276686 112307 -49498 -94467 524431 71413 -16510
11546A60416M2316M7528e6319J3555A88603C5962L49460J04832A48134k4710M3128
$$ 160416 202732 250260 -56319 -42764 188603 35962 385422 490254 148134 123424 166552
11535A66552q2664M3909P0094d2493r8689a5722B2404c560C62062B942c79085
$$ 166552 83888 127797 197891 -42493 -141182 -15722 22404 -3560 362062 2942 -379085
11523F0379J48407j6008n4829K44810B9893J13979J57967a89213O8027A1689b84049
$$ 60379 208786 192778 137949 382759 29893 143872 301839 -189213 -121186 11689 -284049
11511e0862A7759a35141D37179b13216B77593H4658A0386K95731g4100R457B90472
$$ -50862 17759 -135141 437179 -213216 277593 84658 10386 306117 -74100 -64643 290472
11499D68157F8740K26314f1939B71666d4630A70719d8398I0348a74871B80861
$$ 468157 68740 295054 -61939 271666 -44630 170719 -48398 90348 -174871 280861
11488B20678g6287J5603j2756C51569e7349A1466J12224c9474p1603K6675C58172
$$ 220678 -76287 -60684 -73440 351569 -57349 11466 123690 -39474 -111077 -84402 358172
11476A84449a19056e2981o0457D4837I022K30645A17416m4893M3290K15044q4213
$$ 184449 -119056 -52981 -113438 44837 9022 239667 117416 72523 115813 330857 246644
11465B46644c8221G5043e4524C02492J26431B2839N13667A02957J01277M0563
$$ 246644 -38221 75043 -54524 302492 428923 22839 536506 102957 204234 244797
11455B44797j20510E1580M1011M3152a72579K2187C47863c3616A92420l3026a68112
$$ 244797 124287 51580 92591 135743 -172579 -150392 347863 -33616 192420 159394 -168112
11443a39064L7534M8869A28342k1765K51362D002i5775A0316c80341H3078J77531
$$ -139064 -101530 -52661 128342 106577 357939 4002 -95775 10316 -380341 83078 260609
11432B60609G8320a65967j73443E8191b04778C17110d66381F8304R821J4670N4719
$$ 260609 78320 -165967 -339410 58191 -204778 317110 -466381 68304 78125 92795 147514
11421A47514j9022d6043I2199L23454d9607G0244G396K18586q6701a94622B03282
$$ 147514 128492 -46043 92199 415653 -49607 70244 7396 225982 139281 -194622 203282
11409b8j84711e7683E8584q167d500q7801H7744L34900j35702G3444J45024a71751
$$ -28 -184739 -57683 58584 50417 -4500 -92301 87744 422644 286942 73444 218468 -171751
11396A77285j182l0128K04528a04801B25194c81081A87537o4230i8585j43770
$$ 177285 176103 145975 350503 -104801 225194 -381081 187537 123307 -98585 -242355
11386b42355N3078B57110E0419A0384R1704g024j94324F1339b51868M0321b0995
$$ -242355 -189277 257110 50419 10384 102088 -7024 -201348 61339 -251868 -211547 -20995
11374D06691b70607A89385q3230J65231d85928b40300C6420a77729Q6084C43114
$$ 406691 -270607 189385 106155 271386 -485928 -240300 36420 -177729 -91645 343114
11363H1765f5943j52202c5432J6154k5653j37030k5764B06045C8743N6068b28457
$$ 81765 -65943 -218145 -35432 -19278 -44931 -181961 -207725 206045 38743 94811 -228457
11351c548D44489d0088A54725F1175i2598A31528a11064q1110A09931c36051B86092
$$ -3548 444489 -40088 154725 61175 -92598 131528 -111064 -192174 109931 -336051 286092
11339A72083K45980a42656e3458j0573j23684R957A6775a21655o1732c8108q2803
$$ 172083 418063 -142656 -53458 -64031 -187715 -177758 16775 -121655 -183387 -38108 -120911
11328a20911A53959B3116J4562a83773k1037C8910A170a42778j06564B04528N2339
$$ -120911 153959 23116 37678 -183773 -204810 38910 1170 -142778 -249342 204528 256867
11317B56867a81469P3492B9996P2825b28849a10786I6956j0067d58657c2001j84486
$$ 256867 -181469 -107977 29996 102821 -228849 -110786 96956 86889 -458657 -32001 -216487
11306b16487c0563H0031a29940H8527b39502c6222k7972B39477C268J65774K7417
$$ -216487 -30563 80031 -129940 88527 -239502 -36222 -64194 239477 3268 169042 196459
11295A96459R0732j3853f7987j98416h266k2939H2748A6350h8135A5990c1833
$$ 196459 287191 273338 -67987 -266403 -8266 -31205 82748 16350 -88135 15990 -31833
11283f071k7075H0023p331a46351c2047k53800e7940F754a88403k34957J78975
$$ -6071 -33146 80023 72692 -146351 -32047 -285847 -57940 6754 -188403 -423360 -244385
11272b44385C9283a12371j86881b8191m9639j60789e0960A17951i5342m57160
$$ -244385 39283 -112371 -299252 -28191 -77830 -238619 -50960 117951 -95342 -552502
11262e52502A31956J02017f383j34763N3036E3885b35434a17330A55595H025a28268
$$ -552502 131956 233973 -6383 -141146 -88110 53885 -235434 -117330 155595 8025 -128268
11250a22971N6720B23284e38457d2351k85294F4645h7855d1644k31298A67484
$$ -122971 -66251 223284 -538457 -42351 -327645 64645 -87855 -41644 -272942 167484
11239F3405P1689D6631c34706A58517p3580b85037a34325q299d2194h842E0181
$$ 63405 135094 46631 -334706 158517 84937 -285037 -134325 -142624 -42194 -8842 50181
11227c04535f9627m5280e4080q3876F5598J02098g1762D9669b710C4460a72306
$$ -304535 -69627 -114907 -54080 -137956 65598 167696 -71762 49669 -2710 34460 -172306
11215A24856n5687a66018C2199a01622i724j67866E1834a32402F617c42846A83361
$$ 124856 69169 -166018 32199 -101622 -9724 -177590 51834 -132402 6617 -342846 183361
11203b17343n6247b4268C20276c70100J41082h7003A20127a13304j6072H9427
$$ -217343 -273590 -24268 320276 -370100 -229018 -87003 120127 -113304 -129376 89427
11192i0536A859a70188p6924A67247d6605N353G4947b59558N8039N8196C48986
$$ -90536 1859 -170188 -247112 167247 -46605 -41252 74947 -259558 -201519 -143323 348986
11180h2831p5301j89179a57723B3932b8347E8913b66337J31901b0963q7813j2527
$$ -82831 -158132 -347311 -157723 23932 -28347 58913 -266337 -134436 -20963 -108776 -121303
11169a21303A2718i0721p6718C1013a50278B18759a23854M5730L4220I1330N2055
$$ -121303 12718 -90721 -167439 31013 -150278 218759 -123854 -78124 -43904 91330 143385
11158A43385d6957B1563h0239A85268e542k90625g0826j60384a06377A66834f8099
$$ 143385 -46957 21563 -80239 185268 -5542 -296167 -70826 -231210 -106377 166834 -68099
11146a24838B44732h7895k48463J66770A16296B848J35095F7065a23539j34307
$$ -124838 244732 -87895 -336358 -169588 116296 2848 137943 67065 -123539 -257846
11136b57846E9583a96838B9909c4480j22243f8487A22373A1927h8220B19414M4380
$$ -257846 59583 -196838 29909 -34480 -156723 -68487 122373 11927 -88220 219414 263794
11125B63794a03989C58215a88683e6921C04566g0025j24605F9673O5350J44660
$$ 263794 -103989 358215 -188683 -56921 304566 -70025 -194630 69673 135023 279683
11115B79683b39351q0978B54522b5281k58771F1481P5498J19368D9568d4895A52736
$$ 279683 -239351 -320329 254522 -25281 -284052 61481 136979 256347 49568 -44895 152736
11103A93740P4571m7854m2191b8266B70376G5656n405K28309H2737k0787A5807
$$ 193740 268311 220457 178266 -28266 270376 75656 70251 298560 82737 61950 15807
11091g9491D5116f412o5534B17435b25047E8746j9912K4207J12520E8984L30112
$$ -79491 45116 -6412 -71946 217435 -225047 58746 38834 63041 175561 58984 389096
11080C89096j50235K07711j87490j12997L04037k07086K17183j78233n5934A7064
$$ 389096 238861 446572 259082 146085 450122 243036 460219 281986 226052 17064
11069B34783J64128B6310a1876H6933K98395J2562A97293R9456L19336k38924
$$ 234783 398911 26310 -11876 86933 385328 397890 197293 296749 616085 377161
11059C77161j62754L37191j74784N399J15285K65250B73043N37071q2263n5450
$$ 377161 214407 551598 376814 382213 497498 762748 273043 810114 727851 672401
11049F72401o8621N9182j11314N3301J51877p5119J44755l26344j7868l1759J58691
$$ 672401 603780 662962 551648 604949 756826 681707 826462 500118 482250 450491 609182
11038F09182J05531p5173K49234l02748L27317j26827r4025J73285j25174k74805
$$ 609182 714713 639540 888774 586026 913343 786516 692491 865776 740602 465797
11028D65797J57116K76616m31189N54647j98750l8394K33864D74355L04611k51900
$$ 465797 622913 899529 468340 1022987 824237 785843 1019707 474355 778966 527066
11018E27066j53370K66786J21101C19574J77809j35452Q5986Q8542B52919L29328
$$ 527066 373696 640482 761583 319574 497383 361931 447917 536459 252919 582247
11008E82247j32407j08783L13153j70696r8939K85564j28439k24468N12287C91236
$$ 582247 449840 341057 654210 483514 384575 670139 541700 317232 829519 391236
10997F61571j27016M49997l63093o2460J07712j61056J31444k03978o7700K11381
$$ 661571 534555 984552 621459 558999 666711 505655 637099 433121 365421 576802
10987E76802J50345Q072m5304j1038j14597L17998j23017J25759K59046k99074
$$ 576802 727147 735219 689915 678877 564280 882278 759261 885020 1144066 844992
10977H44992M8992J02142J46525L76781m6421M72507L44771J01224p2928L71059
$$ 844992 893984 996126 1142651 1519432 1473011 1945518 2290289 2391513 2318585 2689644
10967B689644j05734n5199J64983m84373l7686k53124J19481l49188k28693M8452
$$ 2689644 2583910 2528711 2693694 2209321 2171635 1918511 2037992 1688804 1460111 1508563
10957A508563N6981m3444K90912j63605L79413j03781O2008m29388m07453j70801
$$ 1508563 1565544 1522100 1813012 1649407 2028820 1925039 1987047 1557659 1150206 979405
10947I79405l0745k39748r1118l4740q7963j70648O68N849J27821k21129M3433
$$ 979405 948660 708912 617794 583054 495091 324443 325111 330960 458781 237652 281085
10936B81085o4712r3634n5432a7773j58770I0583J52561O858C6929J08013b3407
$$ 281085 216373 122739 67307 -17773 -176543 90583 243144 250002 36929 144942 -23407
10924B26505a78226A62818a52068n1315A11711L5534a3258D3491c02124B72594
$$ 226505 -178226 162818 -152068 -203383 111711 147245 -13258 43491 -302124 272594
10913c2863n2972A40514f42774d6985C3470O278Q788i5555n5143B08775a02228
$$ -32863 -85835 140514 -642774 -46985 33470 39748 48536 -95555 -150698 208775 -102228
10901a22144A35126b1199Q833j20683f4389J9694J3680D11292A5977J12275J01341
$$ -122144 135126 -21199 -12366 -133049 -64389 -44695 -31015 411292 15977 128252 229593
10890B29593D8984J27391b37528L3160N7510m5100H8378g1868B04735c35892G6043
$$ 229593 48984 176375 -237528 -204368 -146858 -191958 88378 -71868 204735 -335892 76043
10878d00327a41315N1435j30025g4879n4987e7008C5921K0460a56492M6455L0361
$$ -400327 -141315 -89880 -219905 -74879 -129866 -57008 35921 56381 -156492 -110037 -79676
10867g9676D6992a97070P4249A32489d6216m9662q3344h6056E1620E128J69304
$$ -79676 46992 -197070 -122821 132489 -46216 -95878 -179222 -86056 51620 5128 174432
10856A74432J1727a41355A5494K99170H2799d58009e1265A9869d49199a2595j50752
$$ 174432 186159 -141355 15494 314664 82799 -458009 -51265 19869 -449199 -12595 -163347
10845a63347G2435C3184P6707N2682a43306j41227e979p4069b5174I7881i3005
$$ -163347 72435 33184 109891 162573 -143306 -284533 -5979 -80048 -25174 97881 -93005
10833f559j66940j12761J38634I7005b34866a2118B0140e9694l51663G8705a0673
$$ -6559 -173499 -286260 -147626 97005 -234866 -12118 20140 -59694 -411357 78705 -10673
10821E863J56579o6202a21280B0703Q3614a89750A51197a34266E9451a7789j97880
$$ 5863 162442 96240 -121280 20703 104317 -189750 151197 -134266 59451 -17789 -215669
10810b15669A94191q4837d82488a61821l52048b29493I1699l0771e7959a8859
$$ -215669 194191 109354 -482488 -161821 -513869 -229493 91699 60928 -57959 -18859
10799A51269B4560J06739C5063o920a686A08329b79442d5516G0200i2112j32200
$$ 151269 24560 131299 35063 28143 -1686 108329 -279442 -45516 70200 -92112 -224312
10788b24312h0807C05355h3276C94473A56329a19769j05847A77763g7123A30272
$$ -224312 -80807 305355 -83276 394473 156329 -119769 -225616 177763 -77123 130272
10777b44288N8959A88840a04213D3858K70487H1737b1013B09705a2515q4926A26865
$$ -244288 -185329 188840 -104213 43858 314345 81737 -21013 209705 -12515 -97441 126865
10765a09836A36139c57237J17090B81438O8555c6949A72665a51502B7259g5425
$$ -109836 136139 -357237 -240147 281438 349993 -36949 172665 -151502 27259 -75425
10754c0380j29825d3826C2222P432c64032J05762D549b58956L8984Q8999B56122
$$ -30380 -160205 -43826 32222 39654 -364032 -258270 4549 -258956 -219972 -130973 256122
10742c12297G8433l3658a59769k77867d9767A01626b49768K3371G1288b3410k27242
$$ -312297 78433 44775 -159769 -437636 -49767 101626 -249768 -226397 71288 -23410 -250652
10731b50652h0132K312j21354m2304B51530A10771b76188A471J36536a73841H0864
$$ -250652 -80132 -77820 -199174 -241478 251530 110771 -276188 1471 138007 -173841 80864
10719b74538h7148A2678a09365j38852I0329e5726B8106a88533B9322Q5990b02860
$$ -274538 -87148 12678 -109365 -248217 90329 -55726 28106 -188533 29322 115312 -202860
10707A9622a27067C16588e6645k04827g2549H3689C82b74424E0640b38301r3921
$$ 19622 -127067 316588 -56645 -261472 -72549 83689 382 -274424 50640 -238301 -332222
10696c32222h1974A69575o1242J24066d46684a28681b6879j67797j62032A46184
$$ -332222 -81974 169575 108333 232399 -446684 -128681 -26879 -194676 -356708 146184
10685G6049b48951A24170a73415o856I9305d33770b02564b8152D6473b04037k4565
$$ 76049 -248951 124170 -173415 -180271 99305 -433770 -202564 -28152 46473 -204037 -228602
10674b28602J8389P4453a3645p9008A9950J0380a60217L6139B70892h7540G2935
$$ -228602 -210213 -135760 -13645 -92653 19950 30330 -160217 -124078 270892 -87540 72935
10662a27153B83657A32288g2630A9102J23685M5660B9272R17f5118n67594d7912
$$ -127153 283657 132288 -72630 19102 142787 188447 29272 30189 -65118 -632712 -47912
10650d6490j80987A53165d2577j71432C31210j22506h1443j09132b6525A07460
$$ -46490 -227477 153165 -42577 -214009 331210 208704 -81443 -190575 -26525 107460
10639a66417A11756D0540p308a25933k67803a61214g3061K9504l19025J01899
$$ -166417 111756 40540 33232 -125933 -393736 -161214 -73061 -43557 -362582 -260683
10629b60683i3336k0674r1920h8562C7130c6421O525k07462I8730a2168H9317
$$ -260683 -93336 -114010 -205930 -88562 37130 -36421 -29896 -237358 98730 -12168 89317
10617D1641K9124L24489A90053c95719h3072A67081b05922M4071K1882A46577
$$ 41641 70765 395254 190053 -395719 -83072 167081 -205922 -161851 -139969 146577
10606d58306a69773A43445a52613J8502e4301C2793a46557B1830L196c35084a36216
$$ -458306 -169773 143445 -152613 -134111 -54301 32793 -146557 21830 25026 -335084 -136216
10594b71690J33635F0797i234l48840b2760D4424f4784j19343j9808c6622A7815
$$ -271690 -138055 60797 -9234 -358074 -22760 44424 -64784 -184127 -203935 -36622 17815
10582b60251C10031c18806b2165H5124a54816j01472A2653b11512g4498J234C0574
$$ -260251 310031 -318806 -22165 85124 -154816 -256288 12653 -211512 -74498 -73264 30574
10570A80530P4051a28751p9812B24766c0621a2825k99884C0910J82719b14733
$$ 180530 254581 -128751 -208563 224766 -30621 -12825 -312709 30910 213629 -214733
10559a35190A18962a61387A35064c8796B03331h3761A18383f7483C9553K02527
$$ -135190 118962 -161387 135064 -38796 203331 -83761 118383 -67483 39553 242080
10549B42080a5830A03908a32370J3299A42422o3819c0211j78206A11042b65929
$$ 242080 -15830 103908 -132370 -119071 142422 78603 -30211 -208417 111042 -265929
10538a20791M7907B3301e98340e6695l98490D09412c6354j01301A23243b30139
$$ -120791 -72884 23301 -598340 -56695 -455185 409412 -36354 -137655 123243 -230139
10527c6253L874k08168O403A90117B1113R729R9352h3748q5940K6472j12950A95878
$$ -36253 -32379 -240547 -234144 190117 21113 30842 130194 -83748 -169688 -143216 -256166 195878
10514a6307r9778k78048A72719a74383C46182d1984F4858J00739G045J27082d1577
$$ -16307 -116085 -394133 172719 -174383 346182 -41984 64858 165597 7045 134127 -41577
10502h6030l238E7389A4346i4306B60574c2860D10445A42151C8441d72156C64761
$$ -86030 -89268 57389 14346 -94306 260574 -32860 410445 142151 38441 -472156 364761
10490a05397l5692N6544C8359a60384B27814i32j7444G2441J54494o1135J40540
$$ -105397 -141089 -84545 38359 -160384 227814 -932 -18376 72441 226935 165800 306340
10479C06340l6154C2705M07831I1379N75506o9173p2981B39466A18719f8611A21153
$$ 306340 270186 32705 440536 91379 666885 597712 524731 239466 118719 -68611 121153
10467D26290b2310B74284H6117k6301c13100d9872j32532A23752a06210N2767
$$ 426290 -22310 274284 86117 59816 -313100 -49872 -182404 123752 -106210 -53443
10457e3443k44687O4556f6818e50n0539j53179K7373d4654P556n8728A07721i4602
$$ -53443 -298130 -233574 -66818 -550 -51089 -204268 -176895 -44654 -37098 -95826 107721 -94602
10444C2808G980d62016A79901a48868C751J1709Q0376m512d3224k03850e1844
$$ 32808 7980 -462016 179901 -148868 3751 15460 95836 91324 -43224 -247074 -51844
10432E3134J81338H3875c45899d4940j93962i1056l03419a2579B39720a18227
$$ 53134 234472 83875 -345899 -44940 -238902 -91056 -394475 -12579 239720 -118227
10421a96366r6425c0427p841k95455b5601A4310c61588J57896D9567J09385A3503
$$ -196366 -292791 -30427 -38268 -333723 -25601 14310 -361588 -203692 49567 158952 13503
10409c01937G6379a82003m2500A32965e7580A66015d05942A00172a06758A68236
$$ -301937 76379 -182003 -224503 132965 -57580 166015 -405942 100172 -106758 168236
10398a18568j00534p5400G1704J07296o6733a14785A24701c5923A33552Q3046
$$ -118568 -219102 -294502 71704 179000 112267 -114785 124701 -35923 133552 216598
10388B16598I9000C2555K35437A20911O1900J49748B0071K35387K47289A42556
$$ 216598 99000 32555 267992 120911 182811 332559 20071 255458 502747 142556
10377B3496a60314D23201c93020C18405D3238L05469F8660J27782h6617C83897
$$ 23496 -160314 423201 -393020 318405 43238 348707 68660 196442 -86617 383897
10366B95003R0839C0556O15969o4248j99573A19740K12258j28018j1572a7627
$$ 295003 385842 30556 646525 582277 382704 119740 331998 203980 192408 -17627
10355B96669a70942A25713M4951K20719A00408K88500m1895J51201j7629J8973
$$ 296669 -170942 125713 170664 391383 100408 388908 347013 498214 480585 499558
10345D99558B04096D809N478L44023L9876N1305A08857B4161J03514K0114B7930
$$ 499558 204096 4809 10287 354310 394186 445491 108857 24161 127675 147789 27930
10333D19832H1039B8302K92792N2243b06015h8789b048A77143D2540a7268A19461
$$ 419832 81039 28302 321094 373337 -206015 -88789 -2048 177143 42540 -17268 119461
10321B56753d13A06300J92358O8066A73254a62252A75429q5449a00897B57994
$$ 256753 -413 106300 298658 366724 173254 -162252 175429 89980 -100897 257994
10310a08761I7731J065a59521o42e4015j72007i3215c0929A4531N2750f2898C27052
$$ -108761 97731 98796 -159521 -160163 -54015 -226022 -93215 -30929 14531 67281 -62898 327052
10297C2431d54067A31747b65150a32273G2051e5836j02117C11067o8071a11889
$$ 32431 -454067 131747 -265150 -132273 72051 -55836 -157953 311067 242996 -111889
10286D0308a39075m9999D67585A08778A6312K3790c90016B2578L8612b91849O4793
$$ 40308 -139075 -189074 467585 108778 16312 40102 -390016 22578 61190 -291849 -227056
10275b27056b3092A43470a04026m8226j05685G7976L1155f12685g9581L4641Q217
$$ -227056 -23092 143470 -104026 -152252 -257937 77976 109131 -612685 -79581 -44940 -36723
10264c6723l13202G8961a52105A33501g739j70258H874c27755H2505L62456G8835
$$ -36723 -349925 78961 -152105 133501 -7739 -177997 8874 -327755 82505 444961 78835
10252B69880K72876k59012A34415m9834K53086q6243b91482J15115C75495a20964
$$ 269880 542756 283744 134415 84581 337667 251424 -291482 -176367 375495 -120964
10241A88134c02468g1109k37436a47448A48185b33559g0633C0135i3882A99963
$$ 188134 -302468 -71109 -308545 -147448 148185 -233559 -70633 30135 -93882 199963
10230A8412a79956L1844d374p9926A88017l5146f63581a16723k48179G5295a47305
$$ 18412 -179956 -148112 -4374 -84300 188017 152871 -663581 -116723 -364902 75295 -147305
10218B04691a48243m6369G9986J9868c7120C59843j33011a50843e9146k9170j66638
$$ 204691 -148243 -194612 79986 99854 -37120 359843 226832 -150843 -59146 -88316 -254954
10207b54954P9567g9231A82094o4735a90583A88498n2926c4062j36441L7052d4227
$$ -254954 -175387 -79231 182094 117359 -190583 188498 135572 -34062 -170503 -133451 -44227
10195A50434a44381l47324F8826g2756B50733a14503d3283d752A13524J4538n4236
$$ 150434 -144381 -491705 68826 -72756 250733 -114503 -43283 -4752 113524 128062 73826
10184G3826K0957d4743j78577P8157H313a94106e8725j5458k9768j74953J7790
$$ 73826 94783 -44743 -223320 -145163 8313 -194106 -58725 -74183 -103951 -278904 -261114
10173b61114d5659A66357d16880J41831R7548G0857J42533a08530n2485A68481
$$ -261114 -45659 166357 -416880 -275049 -177501 70857 213390 -108530 -161015 168481
10162b67924I4437b98571A15383d3840B77728a47537j01336K0711e8203K5914
$$ -267924 94437 -298571 115383 -43840 277728 -147537 -248873 -228162 -58203 -32289
10152c2289D3763p145M0930a33005A32261a13122p6949B93974a68273O5095C005
$$ -32289 43763 36618 77548 -133005 132261 -113122 -190071 293974 -168273 -103178 3005
10140G1833b66332J01654C7712a71360C5948M9080d0707A02202b42435E2205a73255
$$ 71833 -266332 -164678 37712 -171360 35948 85028 -40707 102202 -242435 52205 -173255
10128a12768A34690a70843n5930O8866L8509E9591Q5635b77990A80257a74162
$$ -112768 134690 -170843 -226773 -157907 -119398 59591 145226 -277990 180257 -174162
10117D436a29135j4425B46330b13328A88139J59360A5923c82725J75048A60965
$$ 4436 -129135 -143560 246330 -213328 188139 347499 15923 -382725 -207677 160965
10106c15019C2433p215P5346d48728B9167a90038O4351B4306b61166j18060A25589
$$ -315019 32433 25218 100564 -448728 29167 -190038 -125687 24306 -261166 -379226 125589
10094a0819A25182K45840c10697D34369r8691b65822I2436a59028A04489c05448
$$ -10819 125182 371022 -310697 434369 335678 -265822 92436 -159028 104489 -305448
10083A16097a37048o6763L1110I9524a64338D5414i0412A02774K3617i8772c1765
$$ 116097 -137048 -203811 -172701 99524 -164338 45414 -90412 102774 126391 -98772 -31765
10071a16434j6525j56946R8307A1113K44792c09165j39203H5165b55365g1471
$$ -116434 -132959 -289905 -191598 11113 255905 -309165 -448368 85165 -255365 -71471
10060e6497C3089d130j17326j90914A57197b60515f7166A32633n2463J99850f1753
$$ -56497 33089 -4130 -121456 -312370 157197 -260515 -67166 132633 80170 280020 -61753
10048a40569A76852a33371k7438B64381a74535Q3731a0148C39295G3465a43009
$$ -140569 176852 -133371 -160809 264381 -174535 -90804 -10148 339295 73465 -143009
10037b83401A34863e3670o0013c9371j31573d2480C0351d89723b07626l8115h1480
$$ -283401 134863 -53670 -113683 -39371 -170944 -42480 30351 -489723 -207626 -245741 -81480
10025g4502j53436I3551c4765p0866J402A60664F7321a3828k354l42684d7780
$$ -74502 -227938 93551 -34765 -105631 -104229 160664 67321 -13828 -16182 -358866 -47780
10013b13966A84935a29820H0654a18732m6264l8140n8406b9550r8478K1443I4652
$$ -213966 184935 -129820 80654 -118732 -164996 -203136 -261542 -29550 -128028 -106585 94652
10001a13765A58166b01978h9996l5789M8478C56449B7162e26160a77441G872a38659
$$ -113765 158166 -201978 -89996 -125785 -77307 356449 27162 -526160 -177441 7872 -138659
9989b08635B8176c92259J95719k3550Q8939A61444A9243J04293i5210p5339C37846
$$ -208635 28176 -392259 -196540 -220090 -131151 161444 19243 123536 -95210 -170549 337846
9977c28815J24403j45268H2589K46973a31665F3600Q3060k3508B8421a9634l94384
$$ -328815 -204412 -349680 82589 329562 -131665 63600 146660 123152 28421 -19634 -414018
9966d14018A76900o6986D8548a0642A13520c67619a08520j72652r2623A24046
$$ -414018 176900 109914 48548 -10642 113520 -367619 -108520 -281172 -373795 124046
9955B04255a76105C271a59028m9978f5333k10803h2945l8515k34019E6675i7736
$$ 204255 -176105 3271 -159028 -209006 -65333 -276136 -82945 -121460 -355479 56675 -97736
9943A5568a77183n5138P2121A16927b32185J13134B60782a05946A40074b2481
$$ 15568 -177183 -232321 -160200 116927 -232185 -119051 260782 -105946 140074 -22481
9932a25811n3295A58791b15327f7990C9429L9708h7237A0715J33972d4432l710
$$ -125811 -179106 158791 -215327 -67990 39429 79137 -87237 10715 144687 -44432 -48142
9921d8142p6831A32381b856o6823H294c3073O004C35646d52874d4325B15945b88212
$$ -48142 -124973 132381 -2856 -69679 8294 -33073 -27069 335646 -452874 -44325 215945 -288212
9908D2588h1929j32286B10545A6079d9272j49468i4449F6776g7599A37747C2549
$$ 42588 -81929 -214215 210545 16079 -49272 -198740 -94449 66776 -77599 137747 32549
9896B87518b3164d624n7031k21386k10755i9402k72327i9856p3148J0798f8532
$$ 287518 -23164 -4624 -61655 -283041 -493796 -99402 -371729 -99856 -173004 -162206 -68532
9884c86624i6810I2289A1694a45412P0831r3976d1634D2288a16015c9529D54560
$$ -386624 -96810 92289 11694 -145412 -74581 -168557 -41634 42288 -116015 -39529 454560
9872E1093h4798D7250M721R49J44231H4358M7315m42M8800q4589b45004N9489
$$ 51093 -84798 47250 51971 52920 197151 84358 131673 131231 180031 95442 -245004 -185515
9860a85515O0913H7795b09096A9514a29116M3072A21452i0036E4390A5570O809
$$ -185515 -124602 87795 -209096 19514 -129116 -86044 121452 -90036 54390 15570 22379
9849B2379e4292l54152i9565k7484j22164f0766C73918a40149b3862o1648K8092
$$ 22379 -54292 -408444 -99565 -127049 -249213 -60766 373918 -140149 -23862 -85510 -57418
9838e7418A17156b25964A58698a13113H7171g9296m5078C4893b64645R7049g4640
$$ -57418 117156 -225964 158698 -113113 87171 -79296 -124374 34893 -264645 -167596 -74640
9826F6743a62994H0376M7017g05562b70043g850A64245a64395l1766f8637k03450
$$ 66743 -162994 80376 127393 -705562 -270043 -7850 164245 -164395 -196161 -68637 -272087
9815b72087R1870j13435H943a32970F6712i9497j31591j32505A09617E2792O0361
$$ -272087 -180217 -293652 8943 -132970 66712 -99497 -231088 -363593 109617 52792 113153
9804A13153a06540M7777j52949j00798a33158c8175D4729K70070h9417G9307g4371
$$ 113153 -106540 -58763 -211712 -312510 -133158 -38175 44729 314799 -89417 79307 -74371
9792A00358a84762k21405a73208d2246C47026e5793j79797f6247C18i5559L6648
$$ 100358 -184762 -406167 -173208 -42246 347026 -55793 -235590 -66247 318 -95559 -58911
9781e8911P839k32610f3107B8259D247J30761b380k10775Q560j06852f2777J0362
$$ -58911 -51072 -283682 -63107 28259 4247 135008 -2380 -213155 -204595 -311447 -62777 -52415
9769e2415a6807k89688P4377j54467B32761d5598B37036b70506J33211C6580b33223
$$ -52415 -16807 -306495 -232118 -386585 232761 -45598 237036 -270506 -137295 36580 -233223
9757c17032J27077J2823F6938M4186a08832k72861c8782l29251a8104k02893g8159
$$ -317032 -189955 -177132 66938 111124 -108832 -381693 -38782 -368033 -18104 -220997 -78159
9745A14966l2468h7519d1918q9456A02944a95168A71660a47889K5846B24732a74004
$$ 114966 82498 -87519 -41918 -131374 102944 -195168 171660 -147889 -122043 224732 -174004
9733B50247p3177b32689j49229A41219e2124m49145a46821A09927b59098D1697
$$ 250247 177070 -232689 -381918 141219 -52124 -501269 -146821 109927 -259098 41697
9722d80072J72059c602G2820b22553J00542I7879i4236o1818I3622O3337F7858
$$ -480072 -308013 -3602 72820 -222553 -122011 97879 -94236 -156054 93622 156959 67858
9710a46471F7716J01757d3259j37286D41157F0329b10173d8761l9888k0370N0525
$$ -146471 67716 169473 -43259 -180545 441157 60329 -210173 -48761 -88649 -109019 -58494
9699e8494A80665C6564a64609B61026c05272C69931c1052B64768a77147A61168
$$ -58494 180665 36564 -164609 261026 -305272 369931 -31052 264768 -177147 161168
9688B03451c04843a43513l3340K4943c7927A67604e0539B51951G7141a56963A70260
$$ 203451 -304843 -143513 -176853 -151910 -37927 167604 -50539 251951 77141 -156963 170260
9676d7237j60769p175A87299a33645H6402J57407a57900n9681j01116O5583a09365
$$ -47237 -208006 -215181 187299 -133645 86402 243809 -157900 -217581 -318697 -253114 -109365
9664b84033j1363J29249e6662B0068b40119I1154N8040b3263A32320B9015b61901
$$ -284033 -295396 -166147 -56662 20068 -240119 91154 149194 -23263 132320 29015 -261901
9652b73000A25193D651c27717B43180a63731g8957B8108a3544D0731b58028A53337
$$ -273000 125193 4651 -327717 243180 -163731 -78957 28108 -13544 40731 -258028 153337
9640c65956a53328A08252a70704k19111a59350A99662a31212A1909c42900a42535
$$ -365956 -153328 108252 -170704 -389815 -159350 199662 -131212 11909 -342900 -142535
9629a09387j69804A54029J00567A0894N821P6943J02451d4300j17053e6271L20
$$ -109387 -279191 154029 254596 10894 16715 93658 196109 -44300 -161353 -56271 -55951
9618e5951B85765a81167b0557l22355D5426M828a92670C14334B9479b23268k04622
$$ -55951 285765 -181167 -20557 -342912 45426 50254 -192670 314334 29479 -223268 -427890
9607d27890a36299k11702F5663d0670H8929a91554l19056a4285l33416g4263F5910
$$ -427890 -136299 -348001 65663 -40670 88929 -191554 -510610 -14285 -347701 -74263 65910
9595B62050k7618a69536c6403k04278d1334k4899A28175d1589G8911B642J05152
$$ 262050 234432 -169536 -36403 -240681 -41334 -66233 128175 -41589 78911 2642 107794
9584A07794M0237g0527I4938c9339j78888A97469a29018k8879N4301A02554Q7578
$$ 107794 148031 -70527 94938 -39339 -218227 197469 -129018 -157897 -103596 102554 190132
9573A90132a15438B3517b6329C1394a94058h6317m2119A0447b93729n0079g1140
$$ 190132 -115438 23517 -26329 31394 -194058 -86317 -128436 10447 -293729 -343808 -71140
9561A12494J655B9072b56897h7174n9286k12550B9583M8047J05653e0393j2830
$$ 112494 114149 29072 -256897 -87174 -146460 -359010 29583 77630 183283 -50393 -63223
9550f3223k8756B38954A7153c14244e7586b3322j95490h358o8298o7286B27162
$$ -63223 -91979 238954 17153 -314244 -57586 -23322 -218812 -8358 -76656 -143942 227162
9538a19186j81397J17806j19331A06704a17214A00925a39882E7541j3779b79039
$$ -119186 -300583 -182777 -302108 106704 -117214 100925 -139882 57541 43762 -279039
9527G6355J35781f1394k7630d1803k78813c1673B94759q0180c45293a48389B01618
$$ 76355 212136 -61394 -89024 -41803 -320616 -31673 294759 214579 -345293 -148389 201618
9515e05009G8929c89175A59853e7183a4283j54621d3665l29978i0867L5416a0536
$$ -505009 78929 -389175 159853 -57183 -14283 -168904 -43665 -373643 -90867 -55451 -10536
9503A61379E7409b90546D2834R3466n9638L4058a37284I111i9017L4196A475P7351
$$ 161379 57409 -290546 42834 136300 76662 110720 -137284 9111 -99017 -64821 1475 78826
9491G8826d07449A98547n7775o1934b4118l48318A90578R1764A03879a45357D8663
$$ 78826 -407449 198547 140772 78838 -24118 -372436 190578 282342 103879 -145357 48663
9479d9242J3033r3167A14872a86195F8333K1942B1343f6039R994j60937R2960
$$ -49242 -36209 -129376 114872 -186195 68333 90275 21343 -66039 -56045 -216982 -124022
9468a24022A55769a84074E4373f8383k84856I535L57381a44807c252A99971f5021
$$ -124022 155769 -184074 54373 -68383 -353239 9535 366916 -144807 -3252 199971 -65021
9456c9380l95637a93352k65221a08273B2533a68138A11903c9345q2667k79B2015
$$ -39380 -435017 -193352 -458573 -108273 22533 -168138 111903 -39345 -122012 -122291 22015
9444a58620j7716P2763N89j23985a9768n6760l6489K841G3901R3861a81693A00776
$$ -158620 -176336 -103573 -102984 -226969 -19768 -76528 -113017 -110176 73901 167762 -181693 100776
9431a46455E0964b98986n7361B38263j11534b2151j94174i8952m16706K56616
$$ -146455 50964 -298986 -356347 238263 126729 -22151 -216325 -98952 -515658 -259042
9421b59042A5003g5306A72977d41979A909b48395A54255b24838r6116A90628d3051
$$ -259042 15003 -75306 172977 -441979 1909 -248395 154255 -224838 -320954 190628 -43051
9409a06225M0777q0074D1117a21891m1226A04513m2837A9907i0400K16A21411
$$ -106225 -65448 -145522 41117 -121891 -163117 104513 61676 19907 -90400 -90184 121411
9397A76899a18449d0682m3296A91730a46574o7854d3840I0571L9902a64613b8307
$$ 176899 -118449 -40682 -83978 191730 -146574 -214428 -43840 90571 130473 -164613 -28307
9385A08815c27153A43754l2379a37164J3746j9516A51126M0651c0354n845j79757
$$ 108815 -327153 143754 111375 -137164 -123418 -142934 151126 191777 -30354 -36199 -215956
9374b15956J00920m2916m7577j17072J49524b3922A00546M7497o2838a44289j45274
$$ -215956 -115036 -157952 -205529 -322601 -173077 -23922 100546 148043 85205 -144289 -289563
9363b89563h9211B13424a90502D4411L995a48521H8102b73437c5428q9480A9724
$$ -289563 -89211 213424 -190502 44411 48406 -148521 88102 -273437 -35428 -124908 19724
9351c68398g3094j64801G4294P1580m0657e1259F4988a51616g267q011j59710
$$ -368398 -73094 -237895 74294 145874 105217 -51259 64988 -151616 -7267 -15278 -174988
9340a74988n6991h4558j72623F3713f1792j194m0817K9402k4477j8890b4942j55668
$$ -174988 -231979 -84558 -257181 63713 -61792 -62986 -103803 -74401 -98878 -117768 -24942 -180610
9328a80610A87894d91084A51097b43152Q3063m9675R6594d1532n0101c209A5891
$$ -180610 187894 -491084 151097 -243152 -160089 -209764 -113170 -41532 -91633 -3209 15891
9316E0767a48765q6831A83333f5855n3020g369j6959O536j64428B97426a40707
$$ 50767 -148765 -235596 183333 -65855 -118875 -7369 -24328 -17792 -182220 297426 -140707
9304b18165M2911d9314B8348b35934j1584a11044m4893B06285r5803J8158a87571
$$ -218165 -175254 -49314 28348 -235934 -247518 -111044 -155937 206285 110482 128640 -187571
9292c05364A6250b10168Q3073J0800B66467f1423l0643e014r9054A8925Q6473
$$ -305364 16250 -210168 -127095 -116295 266467 -61423 -92066 -5014 -104068 18925 105398
9281A05398i3113M2184l56080a77584D5498a95401j12683C3970a3284j77288J2861
$$ 105398 -93113 -50929 -407009 -177584 45498 -195401 -308084 33970 -13284 -190572 -177711
9270a77711g8122H14J9355L2107f447j38369D07074f548j48945k1529P8450l6219
$$ -177711 -78122 814 20169 52276 -6447 -144816 407074 -6548 -155493 -177022 -98572 -134791
9258a34791M2476c6305l8582k91549a32997H9164e1820F5018a05762j5382A14680
$$ -134791 -92315 -36305 -74887 -366436 -132997 89164 -51820 65018 -105762 -121144 114680
9246f6305B96755C9218d40266B8342O362J42211b58413C9181J56239c1906j12206
$$ -66305 296755 39218 -440266 28342 34704 176915 -258413 39181 195420 -31906 -144112
9235a44112B9087a62481j04035a31572A19104d13694J83788h4357o8291I2000
$$ -144112 29087 -162481 -266516 -131572 119104 -413694 -229906 -84357 -152648 92000
9224i2528A42509f7784j84959A49517B9952J55093L2109a94522o2277C59593f0969
$$ -92528 142509 -67784 -252743 149517 29952 185045 217154 -194522 -256799 359593 -60969
9212b16262L8499j79278a00609j48179M7475C1462f4840k05295N864A70542a0996
$$ -216262 -177763 -357041 -100609 -248788 -201313 31462 -64840 -270135 -264271 170542 -10996
9200a43182A52025A9149b3161k82260p9173A84728b1426B63095c47587A33050
$$ -143182 152025 19149 -23161 -305421 -384594 184728 -21426 263095 -347587 133050
9189C0947a68975k5728g6725b4286B03337l0285i3299A114c55466B38733a0354
$$ 30947 -168975 -194703 -76725 -24286 203337 173052 -93299 1114 -355466 238733 -10354
9177a22092o5693j2845A85924G685d8644j78913h5229A53362c0151j35166j1099
$$ -122092 -187785 -200630 185924 7685 -48644 -227557 -85229 153362 -30151 -165317 -176416
9166a76416r154f7590k97506a33773k46304a49157j20449c3239j9775K6342j9458
$$ -176416 -185570 -67590 -365096 -133773 -380077 -149157 -269606 -33239 -53014 -26672 -46130
9155d6130e826A28305A3098a23058A74734F7998a25411A93097b59886g5628C15495
$$ -46130 -5826 128305 13098 -123058 174734 67998 -125411 193097 -259886 -75628 315495
9143E9764d6343E2933d6904D7641c84952E6226A6335b9518j30957e6641A15095
$$ 59764 -46343 52933 -46904 47641 -384952 56226 16335 -29518 -160475 -56641 115095
9131d9667l82854B9989a34015E0300a0779l6070j15717n5810B32875f8688l1172
$$ -49667 -432521 29989 -134015 50300 -10779 -46849 -162566 -218376 232875 -68688 -99860
9120i9860I2946C0840A811a18665j02404r9163B56499c29872L3098g738A88149
$$ -99860 92946 30840 1811 -118665 -221069 -320232 256499 -329872 -296774 -7738 188149
9108b5544F3571b19656A93569m608a16693M7096l7289C30562a01696A44126j6189
$$ -25544 63571 -219656 193569 188961 -116693 -69597 -106886 330562 -101696 144126 127937
9097A27937I143h8044d550A3281a12597A01598k1819a26141j07817D5190a63287
$$ 127937 9143 -88044 -4550 13281 -112597 101598 79779 -126141 -233958 45190 -163287
9085b96487E008g1037j37599O0893e5052j03765p779B77039c6677A2298c65033
$$ -296487 5008 -71037 -208636 -147743 -55052 -158817 -166596 277039 -36677 12298 -365033
9073A06868a81358h5968K3962C20641g3019E60a23191M9248m1710r697A74197
$$ 106868 -181358 -85968 -62006 320641 -73019 560 -123191 -73943 -115653 -125350 174197
9061A46500a947E3659b21204o1232c08A41399C4297f7241A51952h4487j02325
$$ 146500 -1947 53659 -221204 -282436 -308 141399 34297 -67241 151952 -84487 -186812
9050a86812L8042K5722b7118B40193f9189D2879b8489j667l15602D1596J72098
$$ -186812 -148770 -123048 -27118 240193 -69189 42879 -28489 -30156 -345758 41596 213694
9039B13694a38853K8921B54567E2141f0428k1153A4290b20045B50474a02271j84780
$$ 213694 -138853 -109932 254567 52141 -60428 -81581 14290 -220045 250474 -102271 -287051
9028b87051p0324E1071a13110F004K71407D8545a01504E6536b06398f0742J0599
$$ -287051 -357375 51071 -113110 6004 277411 48545 -101504 56536 -206398 -60742 -50143
9017e0143j08505j54662a46562b6635C70673E2535b71876h9710I4573a33284B65799
$$ -50143 -158648 -313310 -146562 -26635 370673 52535 -271876 -89710 94573 -133284 265799
9005f7820p8855a7945A2624K12170C7443J17895R184F8597a33290A24170a93779
$$ -67820 -146675 -17945 12624 224794 37443 155338 164522 68597 -133290 124170 -193779
8993g6598B168J03887Q1580b2496k25178l39872a99604l00479a97035B1921J74391
$$ -76598 2168 106055 187635 -22496 -247674 -587546 -199604 -500083 -197035 21921 196312
8982A96312b25305A36206a22687p0859A93244c25288A42597b81128A68111a68359
$$ 196312 -225305 136206 -122687 -193546 193244 -325288 142597 -281128 168111 -168359
8971a79096C53572A05456Q2720J23427A47121a77947L0538q9357A94231a13727
$$ -179096 353572 105456 188176 311603 147121 -177947 -147409 -236766 194231 -113727
8960A78475d91389B80815j01183e3555j55690H0507b04419f1309k01217j07688
$$ 178475 -491389 280815 179632 -53555 -209245 80507 -204419 -61309 -262526 -370214
8950c70214I4632a49890L8920j68760d6845b3303k25246B68105A25922c84788
$$ -370214 94632 -149890 -110970 -279730 -46845 -23303 -248549 268105 125922 -384788
8939B75495d39570g5846J2074j49376g8245A51524a46983E11976A28883K08854
$$ 275495 -439570 -75846 -63772 -213148 -78245 151524 -146983 511976 128883 337737
8929C37737a2025C92843a05872B62594J33458j63225J66587M17780P76865N396004
$$ 337737 -12025 392843 -105872 262594 396052 232827 399414 817194 1594059 6990063
8919F990063J1962779D273553A030537D10958J54446j52196i1297d1211F6658
$$ 6990063 18952842 4273553 1030537 410958 565404 413208 -91297 -41211 66658
8909A11921j8703R5962C3752K92217q8894p1612p6084M3560f9109B5502a70423
$$ 111921 93218 189180 33752 325969 237075 165463 89379 132939 -69109 25502 -170423
8897D5034e9036I3431L1650i1336L1583j96515c7886A44708L8105l125c49129
$$ 45034 -59036 93431 125081 -91336 -59753 -256268 -37886 144708 182813 179688 -349129
8885a12998c1920m67687i22k48195a06675p6641j05111a7804A53595p5378g8824
$$ -112998 -31920 -499607 -922 -249117 -106675 -183316 -288427 -17804 153595 78217 -78824
8873D5970b43978A32059d13790A10030a87722G9950a20193A05425b44323j1966
$$ 45970 -243978 132059 -413790 110030 -187722 79950 -120193 105425 -244323 -256289
8863b56289C7436R5890m9646b80170F9179c47130C7238K12412B9263Q4575D2494
$$ -256289 37436 133326 83680 -280170 69179 -347130 37238 249650 29263 113838 42494
8851a90272A299c12624J11864A1417J1533a79257Q3665B21253a1370l28916o080
$$ -190272 1299 -312624 -200760 11417 22950 -179257 -95592 221253 -11370 -340286 -346366
8840c46366c4104j28487c055I2990e33367g361j20285A63681E5354M4659i6045
$$ -346366 -34104 -162591 -3055 92990 -533367 -7361 -127646 163681 55354 100013 -96045
$$ [...]
##END NTUPLES=NMR SPECTRUM
##END=
