
##TITLE=AC1339_BRAAS10082_6666314_TWnfNiZzeE
##JCAMPDX= 6.0         $$ Bruker NMR JCAMP-DX V2.0
##DATA TYPE= NMR SPECTRUM
##DATA CLASS= NTUPLES
##ORIGIN= BRUKER
##OWNER= Administrator
$$ 1.72 TOPSPIN		Version 2.1
$$ 2012-08-13 18:15:59.296 -0500  Administrator@TOPSPIN
$$ Compression mode = diff/dup
##.OBSERVE FREQUENCY= 400.02188249412
##.OBSERVE NUCLEUS= ^1H
##.ACQUISITION MODE= SIMULTANEOUS (DQD)
##.ACQUISITION SCHEME= undefined
##.AVERAGES= 64
##.DIGITISER RES= 22
##SPECTROMETER/DATA SYSTEM= spect
##.PULSE SEQUENCE= noesygpps1d.comp
##.SOLVENT NAME= COFFEE_meoh
##.SHIFT REFERENCE= INTERNAL, COFFEE_meoh, 1, 14.96233
##AUDIT TRAIL= $$ (NUMBER, WHEN, WHO, WHERE, PROCESS, VERSION, WHAT)
$$ ##TITLE= Audit trail, TOPSPIN		Version 2.1
$$ ##JCAMPDX= 5.01
$$ ##ORIGIN= Bruker BioSpin GmbH
$$ ##OWNER= Administrator
$$ $$ C:\Bruker\TOPSPIN/data/COFFEE/nmr/AC1339_BRAAS10082_6666314_TWnfNiZzeE/12/pdata/1/auditp.txt
$$ ##AUDIT TRAIL=  $$ (NUMBER, WHEN, WHO, WHERE, PROCESS, VERSION, WHAT)
(   1,<2012-08-13 18:15:53.734 -0500>,<Administrator>,<TOPSPIN>,<go>,<TOPSPIN 2.1>,
      <created by zg
	started at 2012-08-13 18:04:23.453 -0500,
	POWCHK enabled, PULCHK disabled,
       configuration hash MD5:
       6B 1B 68 BB D9 2E 58 E2 7F 35 AD 54 07 DF 0E 41
       data hash MD5: 64K
       D4 99 47 D4 95 6E FF 62 9F F8 42 60 8C D5 78 7E>)
(   2,<2012-08-13 18:15:56.750 -0500>,<Administrator>,<TOPSPIN>,<proc1d>,<TOPSPIN 2.1>,
      <Start of raw data processing
       efp LB = 0.3 FT_mod = 6 PKNL = 1 PHC0 = 0 PHC1 = 0 SI = 128K 
       data hash MD5: 128K
       0C BE 9F 1A 01 5F 40 09 24 3D FF 34 5C BE 05 82>)
(   3,<2012-08-13 18:15:58.156 -0500>,<Administrator>,<TOPSPIN>,<proc1d>,<TOPSPIN 2.1>,
      <pk PHC0 = 4.685669 PHC1 = 0 
       data hash MD5: 128K
       EC 5C 5E 4C B8 C8 5A 01 B8 5C 6F 63 AD 7D 01 88>)
(   4,<2012-08-13 18:15:58.968 -0500>,<Administrator>,<TOPSPIN>,<proc1d>,<TOPSPIN 2.1>,
      <abs ABSG = 1 
       data hash MD5: 128K
       E2 10 19 01 AE 0E 38 0D C7 CF 7D 3E F5 D9 1E 1C>)
(   5,<2012-08-13 18:15:59.046 -0500>,<Administrator>,<TOPSPIN>,<proc1d>,<TOPSPIN 2.1>,
      <abs ABSG = 2 
       data hash MD5: 128K
       80 7D E0 EF 52 E0 E0 F5 41 3D EE 31 6B 8F F5 9A>)
(   6,<2012-08-13 18:15:59.093 -0500>,<Administrator>,<TOPSPIN>,<proc1d>,<TOPSPIN 2.1>,
      <abs ABSG = 3 
       data hash MD5: 128K
       02 A4 49 9D 15 6A 1E 05 D7 D0 08 6A B7 FB B6 21>)
(   7,<2012-08-13 18:15:59.140 -0500>,<Administrator>,<TOPSPIN>,<proc1d>,<TOPSPIN 2.1>,
      <abs ABSG = 4 
       data hash MD5: 128K
       6E 1B FA DE FB 95 40 69 F2 2D 47 93 72 06 4B 5D>)
(   8,<2012-08-13 18:15:59.203 -0500>,<Administrator>,<TOPSPIN>,<proc1d>,<TOPSPIN 2.1>,
      <abs ABSG = 5 
       data hash MD5: 128K
       9E 01 18 59 BA 7C A2 A5 98 57 D8 31 FF FC 5A B8>)
$$ ##END=
$$ 
$$ $$ hash MD5
$$ $$ 70 6E 37 2C 81 25 1D 8F 52 FA 2F BE 23 7E 9B ED
##$RELAX= 
##$RELAX= 
##$RELAX= 
##$RELAX= 
##$RELAX= 
##$RELAX= 
##$RELAX= 
##$RELAX= 
$$ Bruker specific parameters
$$ [...]
150 150 150 150 150 150 150 150
##$TP07= 0
##$TPNAME0= <>
##$TPNAME1= <>
##$TPNAME2= <>
##$TPNAME3= <>
##$TPNAME4= <>
##$TPNAME5= <>
##$TPNAME6= <>
##$TPNAME7= <>
##$TPOAL= (0..7)
0.5 0.5 0.5 0.5 0.5 0.5 0.5 0.5
##$TPOFFS= (0..7)
0 0 0 0 0 0 0 0
##$TUNHIN= 0
##$TUNHOUT= 0
##$TUNXOUT= 0
##$USERA1= <user>
##$USERA2= <user>
##$USERA3= <user>
##$USERA4= <user>
##$USERA5= <user>
##$V9= 5
##$VALIST= <valist>
##$VCLIST= <CCCCCCCCCCCCCCC>
##$VD= 0
##$VDLIST= <DDDDDDDDDDDDDDD>
##$VPLIST= <PPPPPPPPPPPPPPP>
##$VTLIST= <TTTTTTTTTTTTTTT>
##$WBST= 1024
##$WBSW= 4
##$XGAIN= (0..3)
0 0 0 0
##$XL= 0
##$YL= 0
##$YMAX_a= 16497297
##$YMIN_a= -9438428
##$ZGOPTNS= <>
##$ZL1= 120
##$ZL2= 120
##$ZL3= 120
##$ZL4= 120
##$ABSF1= 14.96233
##$ABSF2= -5.595852
##$ABSG= 5
##$ABSL= 3
##$ALPHA= 0
##$AQORDER= 0
##$ASSFAC= 0
##$ASSFACI= 0
##$ASSFACX= 0
##$ASSWID= 0
##$AUNMP= <proc_prof1d_extract.lims>
##$AXLEFT= 0
##$AXNAME= <>
##$AXNUC= <1H>
##$AXRIGHT= 0
##$AXTYPE= 0
##$AXUNIT= <>
##$AZFE= 0.1
##$AZFW= 0.1
##$BCFW= 0
##$BC_mod= 0
##$BYTORDP= 0
##$COROFFS= 0
##$CY= 15
##$DATMOD= 1
##$DC= 0
##$DFILT= <>
##$DTYPP= 0
##$F1P= 0
##$F2P= 0
##$FCOR= 0.5
##$FTSIZE= 131072
##$FT_mod= 6
##$GAMMA= 0
##$GB= 0
##$INTBC= 1
##$INTSCL= 1
##$ISEN= 128
##$LB= 0.3
##$LEV0= 0
##$LPBIN= 0
##$MAXI= 10000
##$MC2= 0
##$MEAN= 0
##$ME_mod= 0
##$MI= 0
##$NCOEF= 0
##$NC_proc= -2
##$NLEV= 6
##$NOISF1= 0
##$NOISF2= 0
##$NSP= 0
##$NTH_PI= 0
##$NZP= 0
##$OFFSET= 14.96233
##$PC= 1
##$PHC0= 4.685669
##$PHC1= 0
##$PH_mod= 1
##$PKNL= yes
##$PPARMOD= 0
##$PPDIAG= 0
##$PPIPTYP= 0
##$PPMPNUM= 2147483647
##$PPRESOL= 1
##$PSCAL= 4
##$PSIGN= 0
##$PYNMP= <proc.py>
##$REVERSE= no
##$SF= 400.020009103429
##$SI= 131072
##$SIGF1= 0
##$SIGF2= 0
##$SINO= 400
##$SIOLD= 131072
##$SPECTYP= <>
##$SREGLST= <1H.CDCl3>
##$SSB= 0
##$STSI= 131072
##$STSR= 0
##$SW_p= 8223.68421052631
##$SYMM= 0
##$S_DEV= 0
##$TDeff= 65536
##$TDoff= 0
##$TI= <>
##$TILT= no
##$TM1= 0
##$TM2= 0
##$TOPLEV= 0
##$USERP1= <user>
##$USERP2= <user>
##$USERP3= <user>
##$USERP4= <user>
##$USERP5= <user>
##$WDW= 1
##$XDIM= 131072
##$YMAX_p= 461818298
##$YMIN_p= -11821
##$CURPLOT= <Network HP LaserJet P1505>
##$CURPRIN= <$Network HP LaserJet P1505>
##$DFORMAT= <normdp>
##$LAYOUT= <+/1D_H.xwp>
##$LFORMAT= <normlp>
##$PFORMAT= <normpl>
##$SURQMSG= 1
$$ End of Bruker specific parameters
$$ ---------------------------------
##NTUPLES= NMR SPECTRUM
##VAR_NAME=  FREQUENCY,     SPECTRUM/REAL,   SPECTRUM/IMAG
##SYMBOL=    X,             R,               I
##VAR_TYPE=  INDEPENDENT,   DEPENDENT,       DEPENDENT
##VAR_FORM=  AFFN,          ASDF,            ASDF
##VAR_DIM=   131072,        131072,          131072
##UNITS=     HZ,            ARBITRARY UNITS, ARBITRARY UNITS
##FACTOR=    0.0627417313425164, 1,          1
##FIRST=     8223.62146879497, -10,          -61291
##LAST=      0,             1569,            -62294
##MIN=       0,             -11821,          0
##MAX=       8223.62146879497, 461818298,    0
$$ Real data points
##PAGE= N=1
##DATA TABLE= (X++(R..R)), XYDATA
$$ [...]
60989B109172J32837J48144J62621J77928J96691K21745K55364K98321L50283
60980D053106M12024M86644N78423O92574Q37842J027361J275298J595327K000268
60971A2958867K482232K963241L262123L153834K523876J496395L98446m28989
60963B8810025q07050p43516l45357K37864P92729J045043P77714r507j065723
60954B8692222k037841k676022k926707k876284k644052k322966j976390j647106
60946I584854j357537j112142r07683p40568o06006m96969m07911l37159k83899
60937C334980k45022k16292j94508j77083j61495j46742j33722j22842j12607
60928A824667j01638r0480q0135p0510o1821n5864n3931n4480n4765n3834n2233
$$ plain form
60989 2109172 2242009 2390153 2552774 2730702 2927393 3149138 3404502 3702823 4053106
60980 4053106 4465130 4951774 5530197 6222771 7060613 8087974 9363272 10958599 12958867
60971 12958867 15441099 18404340 21666463 24820297 27344173 28840568 29239014 28810025
60963 28810025 28002975 27259459 26914102 27151966 27944695 28989738 29767452 29757945 28692222
60954 28692222 26654381 23978359 21051652 18175368 15531316 13208350 11231960 9584854
60946 9584854 8227317 7115175 6207492 5466924 4860918 4363949 3956038 3618879 3334980
60937 3334980 3089958 2873666 2679158 2502075 2340580 2193838 2060116 1937274 1824667
60928 1824667 1723029 1632549 1552414 1481904 1420083 1364219 1310288 1255808 1201043 1147209 1094976
60917A094976m9770m5727m0745l6393l3002k9749k6655k4625k3425k1561j8540
60906G44784j5665j3992j2950j1578r917q517p560p096p325q011q323p747o594
60893F19509n243l584j582L22J829L230M802O191O841O709O253N939N905N863
60879F62984N351M287L153K273J241l44j953k726k828l268m422n617o258o459
60865F45414o460o328o389p027p767p496n932m097k929k271j580q44k21M84J479
60850E88036K628L844N266O739P824Q662J0084J2434J4967J6904J8257J9165J9197
60837G34007J8009J6052J3940J1786R765Q597Q616Q990Q740P971P188O015L772
60824H63448J007q18j110o30j24L88Q61Q12J10o79j186j867l195m848o261p566
$$ plain form
60917 1094976 1045206 999479 958734 922341 889339 859590 832935 808310 784885 763324 744784
60906 744784 729119 715127 702177 690599 680682 672165 664605 657509 650184 642173 633850 626103 619509
60893 619509 614266 610682 609100 609422 611251 614481 619283 625474 632315 639024 645277 651216 657121 662984
60879 662984 668335 672622 675775 678048 679289 678945 676992 674266 671438 668170 663748 658131 651873 645414
60865 645414 638954 632626 626237 619210 611443 603947 598015 593918 590989 588718 587138 586294 586073 586557 588036
60850 588036 590664 594508 599774 606513 614337 622999 633083 645517 660484 677388 695645 714810 734007
60837 734007 752016 768068 782008 793794 803559 812156 820772 829762 838502 846473 853661 859676 863448
60824 863448 864455 863637 862527 861897 861773 862161 863022 863834 863944 863265 862079 860212 857017 852169 845908 838342
60808H38342r249j1175j2583j3111j3236j3512j3863j3960j3833j3656j3111j1726
60796F85327r847q590q417q410p506n929m621l621k111K0J747K434K782L689M986
60781F41933N953O550P265Q124Q629Q658Q644Q830Q859Q308P441P083P814R265
60767G53356J0336J0269R397Q583Q129P694P255P353Q156Q892Q730P782O805O231
60753H68968N951N756N528N153M613M079L687L398L239L355L556L149J636o02
60739I21466k654l988m818n657o725p705q076p868p961r184j1115j2403j2382
60726H20930j1717j1182j0569r373p945p178p291p566p286o412n348m441l785
60713G20837l358l213l481m102m746n233n779o414o428n185l237j770r82n9J204
$$ plain form
60808 838342 829093 817918 805335 792224 778988 765476 751613 737653 723820 710164 697053 685327
60796 685327 675480 666890 658473 650063 642557 636628 632007 628386 626275 626295 628042 630476 633258 636947 641933
60781 641933 647886 654436 661701 669825 678454 687112 695756 704586 713445 721753 729194 736277 744091 753356
60767 753356 763692 773961 783358 791941 800070 807764 815019 822372 830528 839420 848150 855932 862737 868968
60753 868968 874919 880675 886203 891356 895969 900048 903735 907133 910372 913727 917283 920432 922068 921466
60739 921466 918812 914824 910006 904349 897624 889919 881843 873975 866014 856830 845715 833312 820930
60726 820930 809213 798031 787462 778089 770144 762966 755675 748109 740823 734411 729063 724622 720837
60713 720837 717479 714266 710785 706683 701937 696704 690925 684511 678083 672898 669661 667891 666909 666850 668054
60698F68054K050K398L410N620P643P860O512N032L955K698R17j172l474o013
60684G05490q353r975j1073j2148j3047j3244j2836j2391j1968j1170j0038r037
60672E70210q219p206n962m828l826k680j458m98K02Q43J194Q70J52k06N0N95
60656E39233J192J722J742R23p3j32Q68J952K481K826L446M169M631M745M500
60641E74225L804K807J893J352J416K451M435O473P592P944Q430R264R897J0306
60627F52289J1231J2864J4349J4988J5095J5252J5455J5428J5114J4427J3092
60616H09584J1174R174P306N220K712J77j932l560m746n435n851o437p165p510
60602H02711p265o784o242n470m816n230o933q759r466r168q726q267p130n061
$$ plain form
60698 668054 670104 672502 675912 681532 689175 697035 703547 708579 712534 715232 716149 714977 711503 705490
60684 705490 697137 687162 676089 663941 650894 637650 624814 612423 600455 589285 579247 570210
60672 570210 561991 554785 548823 543995 540169 537489 536031 535533 535735 536578 537772 538642 538794 538588 538638 539233
60656 539233 540425 542147 543889 544812 544739 544607 545475 547427 549908 552734 556180 560349 564980 569725 574225
60641 574225 578029 580836 582729 584081 585497 587948 592383 598856 606448 614392 622822 632086 641983 652289
60627 652289 663520 676384 690733 705721 720816 736068 751523 766951 782065 796492 809584
60616 809584 820758 829932 837238 842458 845170 845347 843415 839855 835109 829674 823823 817386 810221 802711
60602 802711 795446 788662 782420 776950 772134 766904 759971 751212 741746 732578 723852 715585 708455 703394
60588G03394k733j002n4O28J669L142M431M849M318L238J900M38p81j398j683
60573G20356k241l033l332k815j998j447j168r58p52m23Q0K68m22j552j936j294
60557F97333p13j122k105k784k939k692j880m45J188K752M519O562Q454J0282
60543G16410J3033J7143K1576K5304K8972L3897M0128M6641N2845N8384O1781
60532A116114O0899N4962M4935L1782J5680k570k0539l5376m5506n0829n1883
60521A117669m9395m4220l7241k9425k1880j5419r952m825N5L941O311P621Q712
60508I31952R800J0496J0598J0528J1124J3110J6651K1291K6491L2326L9444M8332
60496A182143N8831P0465Q2986R6498J11157J26811J42753J57923J71676J84577
$$ plain form
60588 703394 700661 699659 699605 700233 701902 705044 709475 714324 718642 721880 723780 724218 723437 722039 720356
60573 720356 718115 715082 711750 708935 706937 705490 704322 703364 702612 702189 702269 702537 702115 700563 698627 697333
60557 697333 696620 695498 693393 690609 687670 684978 683098 682653 683841 686593 691112 697674 706128 716410
60543 716410 729443 746586 768162 793466 822438 856335 896463 943104 995949 1054333 1116114
60532 1116114 1177013 1231975 1276910 1308692 1324372 1321802 1301263 1265887 1220381 1169552 1117669
60521 1117669 1068274 1024054 986813 957388 935508 920089 910137 905312 905367 909308 915619 923240 931952
60508 931952 941752 952248 962846 973374 984498 997608 1014259 1035550 1062041 1094367 1133811 1182143
60496 1182143 1240974 1311439 1394425 1490923 1602080 1728891 1871644 2029567 2201243 2385820
60486B385820J98300K14725K35128K59642K86189L09078L19268L07548K68857
60477D784555K04123J18512J8835q6840j88146k73302l33020l64179l69740l55690
60467C155108l28463k94279k58709k25368j95263j67991j43423j21997j03981
60458A315634q9182p7266o7843o0275n3855m8164m3037l8273l3711k9425k5546
60447G49057k2071j9116j7084j6090j5416j4132j2264j0757j0231j0216r851q883
60435E82946p727o808o237n932n758n555n190m665m107l625l188k647j930j212
60421E18365p63n63k09O07J678K498K891L163L603M068M157L777L324L270L573
60406E53439L634L003K064J777K626L984M728M442L823L906M994O482P576P998
$$ plain form
60486 2385820 2584120 2798845 3033973 3293615 3579804 3888882 4208150 4515698 4784555
60477 4784555 4988678 5107190 5126025 5039185 4851039 4577737 4244717 3880538 3510798 3155108
60467 3155108 2826645 2532366 2273657 2048289 1853026 1685035 1541612 1419615 1315634
60458 1315634 1226452 1149186 1081343 1021068 967213 919049 876012 837739 804028 774603 749057
60447 749057 726986 707870 690786 674696 659280 645148 632884 622127 611896 601680 591829 582946
60435 582946 575219 568411 562174 556242 550484 544929 539739 535074 530967 527342 524154 521507 519577 518365
60421 518365 517602 517039 516830 517437 519115 521613 524504 527667 531270 535338 539495 543272 546596 549866 553439
60406 553439 557073 560076 562140 563917 566543 570527 575255 579697 583520 587426 592420 598902 606478 614476
60392F14476P943P617P100O558O151N732M974L987L331L135K607J003j322l306
60378F69986m511n316n974o186n789n156m633m110l418k703k124j525p97j31K43
60363F17856L69M30O22J203K232L159L279K731K482K990L542L426L083L435M497
60348F55336N415N768O038O717P526P753P078N902M931M444L966K819J009o83
60334G24019j553j575j096m13J66L22K48P32K333M612O553P522P518O804N690
60319G61882M473L167J458p36k873m291m981n485o163o814o908o033m280k424
60305G19992j416j504k057k468k781l236l635l658l404l125k734k021j138m26
60291F86389O8N24R69J336J623J709J329O12K31N41J063J332J743K835M167M829
$$ plain form
60392 614476 622419 630036 637136 643694 649845 655577 660551 664538 667869 671004 673611 674614 673292 669986
60378 669986 665475 660159 654185 647999 642210 637054 632421 628311 624893 622190 620066 618541 617744 617613 617856
60363 617856 618225 618655 619277 620480 622712 625871 629150 631881 634363 637353 640895 644321 647404 650839 655336
60348 655336 660751 666519 672557 679274 686800 694553 701631 707533 712464 716908 720874 723693 724702 724019
60334 724019 722466 720891 719795 719382 719548 719870 720118 720850 723183 727795 734348 741870 749388 756192 761882
60319 761882 766355 769522 770980 770244 767371 763080 758099 752614 746451 739637 732729 726696 722416 719992
60305 719992 718576 717072 715015 712547 709766 706530 702895 699237 695833 692708 689974 687953 686815 686389
60291 686389 686457 686981 687950 689286 690909 692618 693947 694559 694790 695331 696394 697726 699469 702304 706471 711300
60275G11300M812M960N625O336O863P627Q804R839J0307J0572J1230J2377J3820
60262H24472J5493J7317J8980K0316K1610K3221K5142K7205K9522L2386L5905
60251A091569L9904M4139M8490N3097N8363O4529P1213P7621Q3477Q9427R6244
60240A818073J03762J10881J16516J20231J21884J21100J17432J10988J02554
60231B843421R2883Q2046O9672N5747M0866K5714J0702l755j6953k8249l7593
60220C134501m5317n1383n5060n5469n2398m6531l8921l0289k0801j0405Q64J2955
60208B741746K5874L9452N3134O6362P9065R1540J03845J15465J25355J32125
60198C573963J34569J32457J26608J17732J05570Q9821P1455N2110L2414J1926
$$ plain form
60275 711300 716112 721072 726697 733033 739896 747523 756327 766166 776473 787045 798275 810652 824472
60262 824472 839965 857282 876262 896578 918188 941409 966551 993756 1023278 1055664 1091569
60251 1091569 1131473 1175612 1224102 1277199 1335562 1400091 1471304 1548925 1632402 1721829 1818073
60240 1818073 1921835 2032716 2149232 2269463 2391347 2512447 2629879 2740867 2843421
60231 2843421 2936304 3018350 3088022 3143769 3184635 3210349 3221051 3217296 3200343 3172094 3134501
60220 3134501 3089184 3037801 2982741 2927272 2874874 2828343 2789422 2759133 2738332 2727927 2728791 2741746
60208 2741746 2767620 2807072 2860206 2926568 3005633 3097173 3201018 3316483 3441838 3573963
60198 3573963 3708532 3840989 3967597 4085329 4190899 4280720 4352175 4404285 4436699 4448625
60188D448625r224k9874m9185o7257q3828r7527j07103j12457j13821j10868j03562
60177C563919r3108q1038o7849n3329l7678k1433m779J2113K8483M3556N7342
60166C346199P0019Q0768Q8102R1130Q9895Q4745P6159O4900N1618L6530K0089
60155D100154L551j1818k5646l7800m7402n3411n5807n5176n1439m4093l3462
60144C687651k0557n887J0595K8434M6752O5419Q5100J06018J27705J50072J73792
60133D455094J99304K26300K54296K82788L10597L36003L57947L76356L90882
60124G189567L99996M01806L95352L80811L58887L30222K95212K54253K08181
60115A0214287J58226J05255M9510q391o6756j23831j78940k31539k79482l19419
$$ plain form
60188 4448625 4439401 4409527 4360342 4293085 4209257 4111730 4004627 3892170 3778349 3667481 3563919
60177 3563919 3470811 3389773 3321924 3268595 3230917 3209484 3204705 3216818 3245301 3288857 3346199
60166 3346199 3416218 3496986 3585088 3676218 3766113 3850858 3927017 3991917 4043535 4080065 4100154
60155 4100154 4103705 4091887 4066241 4028441 3981039 3927628 3871821 3816645 3765206 3721113 3687651
60144 3687651 3667094 3661207 3671802 3700236 3746988 3812407 3897507 4003525 4131230 4281302 4455094
60133 4455094 4654398 4880698 5134994 5417782 5728379 6064382 6422329 6798685 7189567
60124 7189567 7589563 7991369 8386721 8767532 9126419 9456641 9751853 10006106 10214287
60115 10214287 10372513 10477768 10527278 10518887 10452131 10328300 10149360 9917821 9638339 9318920
60105I318920l48887l67130l74088l69952l55929l34222l06810k74895k39649
60096F347358k02532j64624j26353q8062n0209j3126K2566N5381Q3831J07711
60086E971941J27485J42363J50247J49769J41221J25466J03335P6560M7881J9408
60076G055676q244l4828n9563q1852j01913j20070j36246j50431j62653j72215
60066F027661j78104j80514j80689j78815j73509j64143j52157j39074j24646
60057D556010j08168r0413p2744n5256l7199j8584O1J8934L8503N8202P6844R4126
60045D460316J10357J24914J36111J42726J44606J41629J33116J18631R8857P5454
60035E686717N0192K4104k823l0818n9008q5375j08396j28012j44355j56337j62475
$$ plain form
60105 9318920 8970033 8602903 8228815 7858863 7502934 7168712 6861902 6587007 6347358
60096 6347358 6144826 5980202 5853849 5765787 5715578 5702452 5725018 5780399 5864230 5971941
60086 5971941 6099426 6241789 6392036 6541805 6683026 6808492 6911827 6988387 7036268 7055676
60076 7055676 7047432 7012604 6953041 6871189 6769276 6649206 6512960 6362529 6199876 6027661
60066 6027661 5849557 5669043 5488354 5309539 5136030 4971887 4819730 4680656 4556010
60057 4556010 4447842 4357429 4284685 4229429 4192230 4173646 4173707 4192641 4231144 4289346 4366190 4460316
60045 4460316 4570673 4695587 4831698 4974424 5119030 5260659 5393775 5512406 5611263 5686717
60035 5686717 5736909 5761013 5758190 5727372 5668364 5582989 5474593 5346581 5202226 5045889 4883414
60024D883414j62680j58250j50382j39633j26616j12188r6792q0409o3305m6275
60014C746884k9954j4296J243J7293L4242N2001P0252Q9076J08897J29473J49403
60003D354514J67126J81875J93091J99400J99074J91421J77098J57286J33100
59994E953985J05631P5887M4607J2517j9411n0301p9778j07592j32956j54521
59984E648068j70826j80576j82988j78299j67726j52677j34300j13850r2650p1297
59974D202879m9570k7593o372J3377L2150N0603O8255Q4016R7419J08410J16560
59963D690134J21468J23472J23037J19741J12837J02537Q9858P5539N9978M3921
59953E662522K8229J3305l07j1245j8314k1788k2476j9733j1878J417J8641L8711
$$ plain form
60024 4883414 4720734 4562484 4412102 4272469 4145853 4033665 3936873 3856464 3793159 3746884
60014 3746884 3716930 3702634 3703877 3721170 3755412 3807413 3877665 3966741 4075638 4205111 4354514
60003 4354514 4521640 4703515 4896606 5096006 5295080 5486501 5663599 5820885 5953985
59994 5953985 6059616 6135503 6180110 6192627 6173216 6122915 6043137 5935545 5802589 5648068
59984 5648068 5477242 5296666 5113678 4935379 4767653 4614976 4480676 4366826 4274176 4202879
59974 4202879 4153309 4125716 4119344 4132721 4164871 4215474 4283729 4367745 4465164 4573574 4690134
59963 4690134 4811602 4935074 5058111 5177852 5290689 5393226 5483084 5558623 5618601 5662522
59953 5662522 5690751 5704056 5703749 5692504 5674190 5652402 5629926 5610193 5598315 5599732 5618373 5657084
59941E657084O2305R0291J22030J56133J92201K30826K72199L15255L58047L98491
59931G854862M34646M64334M84542M91522M81849M53183M04006L33588K43411
59922A1645943J38497K6346q5608j91157k84752l61462m18242m54590m71824m72334
59912I070817m59413m36573m06427l70732l31602k91695k52707k14473j76108
59903F131087j37626r9865o3400k8071O574M0707P3965J05633J35223J62724J87798
59892F514749K08782K23093K28692K24520K09562J82402J42408R1107L2109l0190
59882H027234r1876j50172k03200k48983k84961l09162l21948l25807l23128l14702
59872E453295l00625k81884k60357k37650k14526j91269j68230j45987j25101
$$ plain form
59941 5657084 5719389 5809680 5931710 6087843 6280044 6510870 6783069 7098324 7456371 7854862
59931 7854862 8289508 8753842 9238384 9729906 10211755 10664938 11068944 11402532 11645943
59922 11645943 11784440 11810786 11725178 11534021 11249269 10887807 10469565 10014975 9543151 9070817
59912 9070817 8611404 8174831 7768404 7397672 7066070 6774375 6521668 6307195 6131087
59903 6131087 5993461 5893596 5830196 5802125 5808699 5849406 5923371 6029004 6164227 6326951 6514749
59892 6514749 6723531 6946624 7175316 7399836 7609398 7791800 7934208 8025315 8057424 8027234
59882 8027234 7935358 7785186 7581986 7333003 7048042 6738880 6416932 6091125 5767997 5453295
59872 5453295 5152670 4870786 4610429 4372779 4158253 3966984 3798754 3652767 3527666
59863C527666j05719q7531p0397n4938m2079l2157k4972k0643j9626k1652k5251
59852C022701k8666l0778l1042k9170k5174j9345j1926l269N579J3079J8188K0554
59840B900731J9579J4271M562p964k1343l4571m6950n6822o2298o3175o1190n8152
59828B526678n4508m9825m3863l6725k8590j9801j0972k569N445J3056J9416K3299
59816B341041K4716K5753K9182L6105M5172N4202O1972O8127P1917P2011O7723
59805B897921N9853M9985L9308K8283J7166O444l110j0620j5490j7703j7656j5641
59793C018740j1715o064Q51Q737J7814K8448M0653N4167O8905Q5032J02768J22469
59781C530805J44851J70873K01190K35938K74881L17425L62090M05775M43201
$$ plain form
59863 3527666 3421947 3334416 3264019 3209081 3167002 3134845 3109873 3089230 3069604 3047952 3022701
59852 3022701 2994035 2963257 2932215 2903045 2877871 2858526 2846600 2843331 2848910 2861989 2880177 2900731
59840 2900731 2920310 2934581 2939143 2931179 2909836 2875265 2828315 2771493 2709195 2646020 2584830 2526678
59828 2526678 2472170 2422345 2378482 2341757 2313167 2293366 2282394 2279825 2285270 2298326 2317742 2341041
59816 2341041 2365757 2391510 2420692 2456797 2501969 2556171 2618143 2686270 2758187 2830198 2897921
59805 2897921 2957774 3007759 3047067 3075350 3092516 3098960 3095850 3085230 3069740 3052037 3034381 3018740
59793 3018740 3007025 3000961 3001812 3010549 3028363 3056811 3097464 3151631 3220536 3305568 3408336 3530805
59781 3530805 3675656 3846529 4047719 4283657 4558538 4875963 5238053 5643828 6087029
59772F087029M66564M65786M30662L55297K42593J05187l8339j69362k73762l44141
59762G327514l80272l87716l74500l47709l12456k72984k33214j95768j61348
59753D661547j29784j01298p6256n4335l4599j6321P22J6556L1328M5501N9883
59742D402944P5083R0841J06446J22004J38547J56553J75189J93817K13439K35757
59732E910620K61222K89092L19031L51639L87396M26031M66964N09509N52445
59723I473949N93868O31559O62873O84372O92413O84604O60721O22570N73783
59714A5280712N19817M67380M23013L91883L77224L80246M00252M34950M80603
59705A9156080N31987N82830O26856O58258O71244O60193O21346N54324M61887
$$ plain form
59772 6087029 6553593 7019379 7450041 7805338 8047931 8153118 8114779 7945417 7671655 7327514
59762 7327514 6947242 6559526 6185026 5837317 5524861 5251877 5018663 4822895 4661547
59753 4661547 4531763 4430465 4354209 4299874 4265275 4248954 4249676 4266232 4297560 4343061 4402944
59742 4402944 4478027 4568868 4675314 4797318 4935865 5092418 5267607 5461424 5674863 5910620
59732 5910620 6171842 6460934 6779965 7131604 7519000 7945031 8411995 8921504 9473949
59723 9473949 10067817 10699376 11362249 12046621 12739034 13423638 14084359 14706929 15280712
59714 15280712 15800529 16267909 16690922 17082805 17460029 17840275 18240527 18675477 19156080
59705 19156080 19688067 20270897 20897753 21556011 22227255 22887448 23508794 24063118 24525005
59696B4525005L48961K22446R0942l6791j53331k52353l28148l76955l98623l95761
59686B3245392l71394l28271k69755j99514j20057l2704O1015J59503K62701L71959
59676B2778875M87515O07202P28024Q47406R61701J064083J144642J192045J194732
59667C1006225J141880J025223Q41374N93804K94329l6801l73712o90038r63418
59658C2838866j177761j324320j402233j417397j379582j300101j191144j065281
59650B2581047r34312q09157p01356o23450n86133n93758o41539p15722p96810
59641A6178810q65411r08378r21284r06179q68150q13731p50184o83696o17852
59632H843945n54399m94970m41127l93246l50509l12200k78206k48246k21357
$$ plain form
59696 24525005 24873966 25096412 25187354 25150563 24997232 24744879 24416731 24039776 23641153 23245392
59686 23245392 22873998 22545727 22275972 22076458 21956401 21923697 21984712 22144215 22406916 22778875
59676 22778875 23266390 23873592 24601616 25449022 26410723 27474806 28619448 29811493 31006225
59667 31006225 32148105 33173328 34014702 34608506 34902835 34866034 34492322 33802284 32838866
59658 32838866 31661105 30336785 28934552 27517155 26137573 24837472 23646328 22581047
59650 22581047 21646735 20837578 20136222 19512772 18926639 18332881 17691342 16975620 16178810
59641 16178810 15313399 14405021 13483737 12577558 11709408 10895677 10145493 9461797 8843945
59632 8843945 8289546 7794576 7353449 6960203 6609694 6297494 6019288 5771042 5549685
59623E549685j96485j73209j51697j32174j14476r8112q2835o9050n7363m7800
59613D426484m0005l4178l1125l1151l3670l8202m5048n4318o4899p5014q3546
59602C895328r0246r5076r7882r8605r7355r4322q9779q3974p6968o8884o0333
59591B941904n2100m4296l6442k8437k0738j3492o280Q44P010J1681J5373J8730
59579B793757K1594K3598K4910K5761K5838K4861K3197K1362J9589J8425J9015
59568C041907K1886K6190L0931L6365M3230N1263N9581O8087P7327Q7257R7312
59557C641336J07683J19416J33156J48597J65184J82624K00685K19236K38362
59548E156279K57704K75811K90990L02825L11824L17617L18548L13441L02868
$$ plain form
59623 5549685 5353200 5179991 5028294 4896120 4781644 4683532 4600697 4531647 4474284 4426484
59613 4426484 4386479 4352301 4321176 4290025 4256355 4218153 4173105 4118787 4053888 3978874 3895328
59602 3895328 3805082 3710006 3612124 3513519 3416164 3321842 3232063 3148089 3071121 3002237 2941904
59591 2941904 2889804 2845508 2809066 2780629 2759891 2746399 2740119 2740963 2747973 2759654 2775027 2793757
59579 2793757 2815351 2838949 2863859 2889620 2915458 2940319 2963516 2984878 3004467 3022892 3041907
59568 3041907 3063793 3089983 3120914 3157279 3200509 3251772 3311353 3379440 3456767 3544024 3641336
59557 3641336 3749019 3868435 4001591 4150188 4315372 4497996 4698681 4917917 5156279
59548 5156279 5413983 5689794 5980784 6283609 6595433 6913050 7231598 7545039 7847907
59539G847907K88220K70499K50657K30216K10241J89750J66171J38070J07288
59530I699019P8225N5035L9577L1618L0406L5561M6756O3221Q3749J06712J29524
59519A0399403J48255J58342J56067J39622J09066O5603J0958n2606j21941j93090
59509A0819679k62072l25513l80434m23989m54170m70805m75282m69235m53955
59500G104224m31013m02640l71139l38296l05407k73328k42384k12848j85482
59491D341687j60992j38980j18336r8820q1296o6106n2201l8350k4214r728N582
59480C558246K1841L8186N3767O8845Q4264J00470J17640J36094J55751J75800
59470D510904J95640K15480K35277K53775K69453K81627K89492K90683K82131
$$ plain form
59539 7847907 8136127 8406626 8657283 8887499 9097740 9287490 9453661 9591731 9699019
59530 9699019 9777244 9832279 9871856 9903474 9933880 9969441 10016197 10079418 10163167 10269879 10399403
59519 10399403 10547658 10706000 10862067 11001689 11110755 11176358 11187316 11134710 11012769 10819679
59509 10819679 10557607 10232094 9851660 9427671 8973501 8502696 8027414 7558179 7104224
59500 7104224 6673211 6270571 5899432 5561136 5255729 4982401 4740017 4527169 4341687
59491 4341687 4180695 4041715 3923379 3824559 3743263 3677157 3624956 3586606 3562392 3552664 3558246
59480 3558246 3580087 3618273 3672040 3740885 3825149 3925619 4043259 4179353 4335104 4510904
59470 4510904 4706544 4922024 5157301 5411076 5680529 5962156 6251648 6542331 6824462
59461F824462K62168K30903J89063J37696P8970J6025m8070j10535j68350k18609
59451G193723k59545k90495l11020l21034l21795l15710l04841k90225k72681
59442D506377k53444k33710k14155j95173j77045j59842j43597j28699j15587
59433B885125j03982r2900q1574p0148n9396n0136m2716l6671l0875k4411j7376
59422B274940j0582m640L84M653Q266J1277J3748J5911J8361K1855K6765L2898
59410B413836L9503M4794M5838M0473L0151J9839J4213J4425J9013K6654L6980
59399B745719M9656O4055P9344R3638J03818J07842J07457J07561J12721J24861
59389C696672J43529J67016J93336K21422K51840K85694L23020L63013M05211
$$ plain form
59461 6824462 7086630 7317533 7506596 7644292 7723262 7739287 7691217 7580682 7412332 7193723
59451 7193723 6934178 6643683 6332663 6011629 5689834 5374124 5069283 4779058 4506377
59442 4506377 4252933 4019223 3805068 3609895 3432850 3273008 3129411 3000712 2885125
59433 2885125 2781143 2688243 2606669 2536521 2477125 2426989 2384273 2347602 2316727 2292316 2274940
59422 2274940 2264358 2259718 2260102 2264755 2273021 2284298 2298046 2313957 2332318 2354173 2380938 2413836
59410 2413836 2453339 2498133 2543971 2584444 2614595 2634434 2648647 2663072 2682085 2708739 2745719
59399 2745719 2795375 2859430 2938774 3032412 3136230 3244072 3351529 3459090 3571811 3696672
59389 3696672 3840201 4007217 4200553 4421975 4673815 4959509 5282529 5645542 6050753
59380F050753M49233M93449N35032N71190N99264O15915O17821O03677N74720
59371A1111054N33457M82979M27303L70777L16434K65841K20460J81713J49234
59362A4059252J20304R1691O1173K6988j2720n8854j10391j65139k20663k73757
59352A3517884l19855l54279l74393l80533l75416l63074l47859l33506l22819
59343A0346150l17827l19561l27438l39405l53127l66688l78098l84915l85095
59334G173996l78092l64876l47082l26335l04028k81138k58107k34946k11649
59325D467743j88627j66782j46886j28805j11711r5268q0089o6748n4891m3818
59315C384118l3341k3422j3562l472O127J4399K1850K9800L8533M6991N4439O1364
$$ plain form
59380 6050753 6499986 6993435 7528467 8099657 8698921 9314836 9932657 10536334 11111054
59371 11111054 11644511 12127490 12554793 12925570 13242004 13507845 13728305 13910018 14059252
59362 14059252 14179556 14271247 14332420 14359408 14346688 14287834 14177443 14012304 13791641 13517884
59352 13517884 13198029 12843750 12469357 12088824 11713408 11350334 11002475 10668969 10346150
59343 10346150 10028323 9708762 9381324 9041919 8688792 8322104 7944006 7559091 7173996
59334 7173996 6795904 6431028 6083946 5757611 5453583 5172445 4914338 4679392 4467743
59325 4467743 4279116 4112334 3965448 3836643 3724932 3629664 3549575 3482827 3427936 3384118
59315 3384118 3350777 3327355 3313793 3310321 3316448 3330847 3352697 3382497 3421030 3468021 3522460 3583824
59303C583824O8466P5575Q1894Q6730Q9731R0821R0016Q7096Q1669P3922O4909
59292D474653N5513M5553L4715K3941J4913Q480M469K803L739P209J3012K1537
59280D710537L3216M7317O2332P7534R3085J08681J23195J35604J45197J50858
59270E687556J51358J46161J34662J14717Q3979M3500j214m3479p9053j06510
59260F131677j25745j37191j41653j39925j32855j21855j08581r3841p7594o0241
59250D992196m2989k6846j2282PR243J5759K0786K4542K5848K4247K1301J9028
59238E070840J8128J8571K0865K5785L3614M4616N9654P9518J04019J32376J63999
59227E771985J98516K35448K74148L13343L50545L82500M06275M18985M16643
$$ plain form
59303 3583824 3652290 3727865 3809759 3896489 3986220 4077041 4167057 4254153 4335822 4409744 4474653
59292 4474653 4530166 4575719 4610434 4634375 4649288 4657768 4662237 4665040 4668779 4675988 4689000 4710537
59280 4710537 4743753 4791070 4853402 4930936 5024021 5132702 5255897 5391501 5536698 5687556
59270 5687556 5838914 5985075 6119737 6234454 6318433 6361933 6360719 6317240 6238187 6131677
59260 6131677 6005932 5868741 5727088 5587163 5454308 5332453 5223872 5130031 5052437 4992196
59250 4992196 4949207 4922361 4910079 4910086 4919329 4935088 4955874 4980416 5006264 5030511 5051812 5070840
59238 5070840 5088968 5107539 5128404 5154189 5187803 5232419 5292073 5371591 5475610 5607986 5771985
59227 5771985 5970501 6205949 6480097 6793440 7143985 7526485 7932760 8351745 8768388
59218H768388L95124L53160K93257K18940J32359L5585o6992j69069k64672l49029
59208I347051m18046m68645m99828n12695n09465m92939m66524m33941l98549
59199E146419l62874l28305k95101k63280k33705k07779j85918j67062j49919
59190B952476j33937j19035j05307r3432q4165p7017p0274o2955n5808m9903m5168
59179B055475m0852l6577l2260k7872k3816k0649j7979j4591j0203n977k683M71
59167A822487M374Q469J1759J4390J7229K0593K4289K8236L2200L5649L8628M1994
59155B100297M6156N0384N4171N8191O3081O8254P2917P7274Q1721Q5791Q9051
59144B847288R2032R5093R7203R7129R4970R1324Q5731P7386O6725N4919M2425
$$ plain form
59218 8768388 9163512 9516672 9809929 10028869 10161228 10196813 10129821 9960752 9696080 9347051
59208 9347051 8929005 8460360 7960532 7447837 6938372 6445433 5978909 5544968 5146419
59199 5146419 4783545 4455240 4160139 3896859 3663154 3455375 3269457 3102395 2952476
59190 2952476 2818539 2699504 2594197 2500765 2416600 2339583 2269309 2206354 2150546 2100643 2055475
59179 2055475 2014623 1978046 1945786 1917914 1894098 1873449 1855470 1840879 1830676 1824699 1822016 1822487
59167 1822487 1826861 1835330 1847089 1861479 1878708 1899301 1923590 1951826 1984026 2019675 2058303 2100297
59155 2100297 2146453 2196837 2251008 2309199 2372280 2440534 2513451 2590725 2672446 2758237 2847288
59144 2847288 2939320 3034413 3131616 3228745 3323715 3415039 3500770 3578156 3644881 3699800 3742225
59133C742225K9392J6872O132k862j0772j7085k0353k0008j6697j1009l129O529
59121C699235J7508K9990M4115N9038P3806Q8872J05425J23450J41729J59581
59111D542749J77234J94564K10801K25497K38440K48306K52489K48534K34970
59102F573584K10976J76498J32924Q2798K8881k5641p6414j18955j50967j72816
59092F660868j85726j90646j89081j83669j77146j71201j66603j63673j62272
59083E070851j61915j62270j63209j64422j65427j65949j65792j64478j61700
59074C595689j57937j53878j49370j43707j36970j30134j23785j17558j10991
59065B371359j04178r7286r0173q2839p5775o9436o3717n8154n2433m6671m1396
$$ plain form
59133 3742225 3771617 3788489 3794621 3791759 3780987 3763902 3743549 3723541 3706844 3695835 3692706 3699235
59121 3699235 3716743 3746733 3790848 3849886 3923692 4012564 4117989 4241439 4383168 4542749
59111 4542749 4719983 4914547 5125348 5350845 5589285 5837591 6090080 6338614 6573584
59102 6573584 6784560 6961058 7093982 7176780 7205661 7180020 7103606 6984651 6833684 6660868
59092 6660868 6475142 6284496 6095415 5911746 5734600 5563399 5396796 5233123 5070851
59083 5070851 4908936 4746666 4583457 4419035 4253608 4087659 3921867 3757389 3595689
59074 3595689 3437752 3283874 3134504 2990797 2853827 2723693 2599908 2482350 2371359
59065 2371359 2267181 2169895 2079722 1996883 1921108 1851672 1787955 1729801 1677368 1630697 1589301
59054A589301l7257l4465l2502l0557k8227k5761k3781k2805k2604k2031j9981
59043A289330j6649j3248j0381p534m341j340J104L439N757O994O364M832M041
59030A268368M475N658P563J0539J4254J7805K0562K2048K1462J8429J3843R020
59018A434026M387j35m007o478p657q099p793o552m912l446j640J227M525O906
59004A400352Q127Q858R020P807N225K240o39l589o446q689j0414j1876j2251
58991A387725j0366o845l916k745k267j114O78K346L649M778N825O916Q198R478
58977A402340J0521J1680J3470J5555J7062J7978J9257K1459K4180K6869K9285
58966A609656L1128L2150L2765L3564L4292L4272L3720L3550L3825L3640L2709
$$ plain form
59054 1589301 1552044 1517579 1485077 1454520 1426293 1400532 1376751 1353946 1331342 1309311 1289330
59043 1289330 1272681 1259433 1249052 1241518 1237177 1235837 1236941 1240380 1246137 1253131 1259495 1264327 1268368
59030 1268368 1272843 1278501 1286064 1296603 1310857 1328662 1349224 1371272 1392734 1411163 1425006 1434026
59018 1434026 1438413 1438278 1434271 1427793 1420136 1412037 1404244 1397692 1392780 1389334 1387694 1388921 1393446 1400352
59004 1400352 1408479 1417337 1426357 1434164 1439389 1441629 1440990 1437401 1430955 1422266 1411852 1399976 1387725
58991 1387725 1377359 1370514 1366598 1363853 1361586 1360472 1361150 1363496 1367145 1371923 1377748 1384664 1392862 1402340
58977 1402340 1412861 1424541 1438011 1453566 1470628 1488606 1507863 1529322 1553502 1580371 1609656
58966 1609656 1640784 1672934 1705699 1739263 1773555 1807827 1841547 1875097 1908922 1942562 1975271
58955A975271L1887L1888L2621L4048L6552M0069M3825M7335N0897N4775N8893
58944B438061O3439O8912P5306Q2111Q9304R7414J06463J15779J25116J34945
58934C396850J45383J55836J66080J76937J89475K04283K21714K42075K65302
58925E163935K91097L19464L50595L84306M20377M59296N01686N47039N93907
58916I031702O41270O88534P34147P75169Q08141Q29317Q34073Q17449P75688
58907A5935490P06533O08527M81863L30561J62676j2135j84657l46190m88668
58898A7194000o06115o95725p57477p93458q07445q03741p85723p56005p17748
58889A0470563o74544o28856n81701n34104m87680m43618m02226l63836l29147
$$ plain form
58955 1975271 2007158 2039046 2071667 2105715 2142267 2182336 2226161 2273496 2324393 2379168 2438061
58944 2438061 2501500 2570412 2645718 2727829 2817133 2914547 3021010 3136789 3261905 3396850
58934 3396850 3542233 3698069 3864149 4041086 4230561 4434844 4656558 4898633 5163935
58925 5163935 5455032 5774496 6125091 6509397 6929774 7389070 7890756 8437795 9031702
58916 9031702 9672972 10361506 11095653 11870822 12678963 13508280 14342353 15159802 15935490
58907 15935490 16642023 17250550 17732413 18062974 18225650 18213515 18028858 17682668 17194000
58898 17194000 16587885 15892160 15134683 14341225 13533780 12730039 11944316 11188311 10470563
58889 10470563 9796019 9167163 8585462 8051358 7563678 7120060 6717834 6353998 6024851
58880F024851k98397k71231k47581k27560k10397j94682j79873j66507j54675
58871D073948j43558j32598j21965j11655j01370r1468q2768p5247o8218o1845
58861C083256n6953n3229m9202m4384l9760l5771l1526k6572k1729j7387j2618
58850B694125o894j098M053R199J4962K0769K6085L1555L7897M4731N1481N8359
58838B985224O5553P2579P9358Q6904R5926J05688J15167J24436J34168J44748
58828D009751J56659J70612J86479K03111K20068K38499K59496K82745L07764
58819F035184L35328L66623M01837M40592M82804N28075N75015O22136O68600
58810A0456194P13044P52372P82472P99409P99065P76606P27548O49363N41951
$$ plain form
58880 6024851 5726454 5455223 5207642 4980082 4769685 4575003 4395130 4228623 4073948
58871 4073948 3930390 3797792 3675827 3564172 3462802 3371334 3288566 3213319 3145101 3083256
58861 3083256 3026303 2973074 2923872 2879488 2839728 2803957 2772431 2745859 2724130 2706743 2694125
58850 2694125 2687231 2686133 2690186 2699385 2714347 2735116 2761201 2792756 2830653 2875384 2926865 2985224
58838 2985224 3050777 3123356 3202714 3289618 3385544 3491232 3606399 3730835 3865003 4009751
58828 4009751 4166410 4337022 4523501 4726612 4946680 5185179 5444675 5727420 6035184
58819 6035184 6370512 6737135 7138972 7579564 8062368 8590443 9165458 9787594 10456194
58810 10456194 11169238 11921610 12704082 13503491 14302556 15079162 15806710 16456073 16998024
58801A6998024M07679K51901Q2689r0750k59229m13769n46589o53235p32887p86177
58791A4257657q13872q18304q04337p77356p41073o98088o51431o04082n57704
58782G791410n12923m70394m30687l93836l59762l28663l00440k74521k50784
58773D469400k29784k11597j95446j80974j68631j58198j48252j37956j28126
58764B910436j19640j11947j04080r5938q7706p9152p0553o3063n7092n1407m4932
58753B024926l8333l2831k8445k4490k0769j7281j3736j0249p524n558l420j015
58741A821275L77K72j17l01k078p033j3996k0671k6422l1599l5500l7001l6502
58728A610704l5332l3910l2065l0395k9723k9772k9825l0023l0716l1322l1213
$$ plain form
58801 16998024 17405703 17657604 17740293 17649543 17390314 16976545 16429956 15776721 15043834 14257657
58791 14257657 13443785 12625481 11821144 11043788 10302715 9604627 8953196 8349114 7791410
58782 7791410 7278487 6808093 6377406 5983570 5623808 5295145 4994705 4720184 4469400
58773 4469400 4239616 4028019 3832573 3651599 3482968 3324770 3176518 3038562 2910436
58764 2910436 2790796 2678849 2574769 2478831 2391125 2311973 2241420 2178357 2121265 2069858 2024926
58753 2024926 1986593 1953762 1925317 1900827 1880058 1862777 1849041 1838792 1831268 1825710 1822290 1821275
58741 1821275 1821652 1821924 1821807 1821506 1819428 1812395 1798399 1777728 1751306 1719707 1684207 1647206 1610704
58728 1610704 1575372 1541462 1509397 1479002 1449279 1419507 1389682 1359659 1328943 1297621 1266408
58717A266408l0833l0653k9862k7640k4763k2500k0777j8835j6817j5099j3104
58706A015525j0369p993p324p985q723r331j0107j0420r645q704q881r788j0229
58693H96026j0278j0702j1110j0579r404q399p127m828k380j370j694k072k422
58680H13661l551n011n426m799m370m271l381j411P71K913N428P584P669N398
58666H11204K514O07k18l55J40R35J290R46K51o54j902l221m069m349m178l403
58650G95538k071p65M50K546O002R607J1998J3451J4829J5898J6210J6608J8098
58637I18399K0163K1898K3860K6854K9956L1839L3252L5934L9923M4126M8833
58626A275037N5166O2575O9507P6334Q5009R5981J07914J20528J35219J52621
$$ plain form
58717 1266408 1235575 1204922 1175060 1147420 1122657 1100157 1079380 1060545 1043728 1028629 1015525
58706 1015525 1005156 997163 989839 981854 973131 963800 953693 943273 933628 924924 916043 906255 896026
58693 896026 885748 875046 863936 853357 843953 835554 828427 823599 821219 819849 818155 816083 813661
58680 813661 810110 805099 799673 794874 790504 786233 782852 781441 782212 785125 790553 798137 805806 811204
58666 811204 813718 814325 814107 813752 813892 814827 816117 817063 817314 816660 814758 811537 807468 803119 798941 795538
58650 795538 793467 792702 793152 795698 801700 811307 823305 836756 851585 867483 883693 900301 918399
58637 918399 938562 960460 984320 1011174 1041130 1072969 1106221 1142155 1182078 1226204 1275037
58626 1275037 1330203 1392778 1462285 1538619 1623628 1719609 1827523 1948051 2083270 2235891
58616B235891J71790J92076K13526K35019K53910K67839K75082K73085K58757
58607D376975K30728J89771J37233P5231Q491n6314j13860j61527j97858k21876
58597D266994k34316k37524k33562k23771k10064j94758j79020j63121j48153
58588B442705j35451j24438j13183j01270r0091q0229p0728o1279n2922m6142
58578A566972m0182l4649k9939k5773k1157j6136j1774q288n020k279j100r71
58566A369704rK294M542N840O556O353L696k051r875j8715k7860l5633m0018m1022
58552A223802m0375l8678l5122l0151k5778k2639j9352j5475j2560j1380j0571
58541I61721r143q073q253q963r472j0227j1380j2045j2058j2521j3689j4197
$$ plain form
58616 2235891 2407681 2599757 2813283 3048302 3302212 3570051 3845133 4118218 4376975
58607 4376975 4607703 4797474 4934707 5009938 5018429 4962115 4848255 4686728 4488870 4266994
58597 4266994 4032678 3795154 3561592 3337821 3127757 2932999 2753979 2590858 2442705
58588 2442705 2307254 2182816 2069633 1968363 1878272 1798043 1727315 1666036 1613114 1566972
58578 1566972 1526790 1492141 1462202 1436429 1415272 1399136 1387362 1379074 1374054 1371775 1370675 1369704
58566 1369704 1369695 1371989 1376531 1382371 1388927 1395280 1398976 1396925 1387050 1368335 1340475 1304842 1264824 1223802
58552 1223802 1183427 1144749 1109627 1079476 1053698 1031059 1011707 996232 983672 972292 961721
58541 961721 952578 944505 936252 927289 917817 907590 896210 884165 872107 859586 845897 831700
58529H31700j3359j2401j2382j2669j2441j1970j1516j0647r520r124r493r346
58517F96832q160o906o157n330m332l902l818k835j109m06j143j513m11J034J835
58502F53679K646L856M488M310M784O596Q326Q969R646J1402J3327J4446J5521
58489G61996J7294J8671J8341J6753J4959J2887J0170P443N400L668J648o27l232
58476H85371o611j0276j2697j3337j3426j4015j4730j5061j5296j5498j5134j4322
58464G24968j3917j3884j3241j1888j0720r736q111o266n525n448m165j797p69
58451F19501j906l114k897k406k673k631j373j0M11O39J552K656L562M919O900
58436F23130Q611R817J1145J2016J0836P910N576M675L587J494k88j062j799k518
$$ plain form
58529 831700 818341 805940 793558 780889 768448 756478 744962 734315 724795 715671 706178 696832
58517 696832 688672 681766 675609 670279 665947 662045 658227 655392 654283 653877 652734 651221 650810 651844 653679
58502 653679 656325 660181 664669 668979 673763 680359 688685 697654 707300 718702 732029 746475 761996
58489 761996 779290 797961 816302 833055 848014 860901 871071 878514 883914 887582 889230 888603 885371
58476 885371 878760 868484 855787 842450 829024 815009 800279 785218 769922 754424 739290 724968
58464 724968 711051 697167 683926 672038 661318 651582 643471 637205 631680 626232 622067 620270 619501
58451 619501 617595 614481 611584 609178 606505 603874 602501 602491 602902 603541 605093 607749 611311 616230 623130
58436 623130 631741 641558 652703 664719 675555 683465 689041 693716 697303 698797 698509 697447 695648 693130
58422F93130j750L70J638J489J877L364L862K559J424J369O86j057j426N90K571
58407G10696K979L694N952P698P442O905P177O148K685m71j151j444l588n776
58393G48946n615m345l910l067k82K459K674J601J632K146J566R94J870K500P45
58378G49914j983l158l346m331n258m354k479j348k34K095M282M699M750O345
58364G45594Q227Q250P229P097P490P450Q101J0168J1343R887Q189Q950J0496
58351H58471R935Q304Q171Q612P168M658L361K426k37l280l796k370j751j938
58337H97734r30R61J866K210L712N767O639O889P981R057Q727Q236R244J0406
58323I78499R927R259J0467J2244J2531J2662J4649J6903J7112J6843J8600K0751
$$ plain form
58422 693130 691380 691750 693388 694877 696754 700118 703980 706539 707963 709332 710018 708961 707535 708125 710696
58407 710696 713675 717369 723321 731019 738461 745366 752543 758691 761376 760905 759754 758310 754722 748946
58393 748946 743331 738986 735076 732009 731727 734186 736860 738461 740093 742239 743805 744799 746669 749169 749914
58378 749914 747931 744773 741427 737096 731838 727484 725005 723657 723423 725518 729800 734499 739249 745594
58364 745594 753821 762071 769300 776397 783887 791337 799438 809606 820949 830836 839025 847975 858471
58351 858471 868406 876710 884881 893493 900661 905319 908680 911106 910869 907589 903793 901423 899672 897734
58337 897734 896804 897765 899631 901841 905553 911320 917959 924848 932829 941886 950613 958849 968093 978499
58323 978499 988426 997685 1008152 1020396 1032927 1045589 1060238 1077141 1094253 1111096 1129696 1150447
58311A150447K0198J7889J6762J6405J4548J1788J0130Q919O917N880P488R345
58299A296716Q879Q280J0483J3404J3667J2976J4912J8303J9844K0447K2804K5457
58287A486172K5576K4923K6701K9231K9293K8710L0852L3691L3529L2741L6184
58276A817603M2518M6740M8796N1924N4982N4457N1734N0358M8494M2345L4591
58265B344542L0863L0220K7868K4878K5992K9925L1381L0905L3205L7572L9461
58254B686812L9937M3769M9852N3366N5622O1702P0141P5235P7819Q3085Q9693
58243C387033R2174R2241R6320J03654J08536J12381J21230J33088J40674J45177
58233D532508J54175J67353J77913J86633K00351K17751K31290K42172K58460
$$ plain form
58311 1150447 1170645 1188534 1205296 1221701 1236249 1248037 1258167 1267086 1274003 1279883 1287371 1296716
58299 1296716 1305595 1313875 1324358 1337762 1351429 1364405 1379317 1397620 1417464 1437911 1460715 1486172
58287 1486172 1511748 1536671 1563372 1592603 1621896 1650606 1681458 1715149 1748678 1781419 1817603
58276 1817603 1860121 1906861 1955657 2007581 2062563 2117020 2168754 2219112 2267606 2309951 2344542
58265 2344542 2375405 2405625 2433493 2458371 2484363 2514288 2545669 2576574 2609779 2647351 2686812
58254 2686812 2726749 2770518 2820370 2873736 2929358 2991060 3061201 3136436 3214255 3297340 3387033
58243 3387033 3479207 3571448 3667768 3771422 3879958 3992339 4113569 4246657 4387331 4532508
58233 4532508 4686683 4854036 5031949 5218582 5418933 5636684 5867974 6110146 6368606
58224F368606K79453K97624L14775L39853L71613M00651M28101M64464N10270
58215I775410N56414O03494O61782P32087Q06550Q88502R90796J114567J251514
58206A7381116J407562J601999J843855K133480K486071K925365L452560M050797
58198C7282805M724922N511526O452021P592327R019528J0872572J3309606J6487060
58190A11252367K0578230K5790770L2287978L9846019M7187269N1484321M9030000
58183C77456954L7411567J7782419n003714k4973136l8252139m4313273m4827429
58176B75281249m1876857l7091051l1648781k6368277k1670151j7661452j4336582
58169H4628098j1660281r530671p805734o391691n247176m316775l527496k840597
$$ plain form
58224 6368606 6648059 6945683 7260458 7600311 7971924 8372575 8800676 9265140 9775410
58215 9775410 10331824 10935318 11597100 12329187 13135737 14024239 15015035 16129602 17381116
58206 17381116 18788678 20390677 22234532 24368012 26854083 29779448 33232008 37282805
58198 37282805 42007727 47519253 53971274 61563601 70583129 81455701 94765307 111252367
58190 111252367 131830597 157621367 189909345 229755364 276942633 328426954 377456954
58183 377456954 414868521 432650940 427647226 402674090 364421951 320108678 275281249
58176 275281249 233404392 196313341 164664560 138296283 116626132 98964680 84628098
58169 84628098 72967817 63437146 55631412 49239721 43992545 39675770 36148274 33307677
58161C3307677k246680j714779j194272o57325r4421N25811J257757K141904L157037
58152C4482709M132013M664396M244641K642094K15812k242511m032935m922348
58144C9183871n077404m776201m237481l614086l009804k472915k013199j634569
58136A2348212j337885j107798r22854p73465o55703n58462m72120l99985l47631
58127E772309l09858k79052k56292k43630k35088k24996k15903k09646k00178
58118C597666j83636j66074j53175j41294j26029j10580r8462q6973p5052o8755
58108B387636p1541p7101p8594p7388p6504p3531o6620n9936n6613n3023m5946
58097A650839l8762l4916l1891k7134k3533k3646k4706k4386k5447k9727l3487
$$ plain form
58161 33307677 31060997 29346218 28151946 27494621 27400200 27926011 29183768 31325672 34482709
58152 34482709 38614722 43279118 47523759 50165853 50381665 48139154 44106219 39183871
58144 39183871 34106467 29330266 25092785 21478699 18468895 15995980 13982781 12348212
58136 12348212 11010327 9902529 8979675 8206210 7550507 6992045 6519925 6119940 5772309
58127 5772309 5462451 5183399 4927107 4683477 4448389 4223393 4007490 3797844 3597666
58118 3597666 3414030 3247956 3094781 2953487 2827458 2716878 2618416 2531443 2456391 2387636
58108 2387636 2316095 2238994 2160400 2083012 2006508 1932977 1866357 1806421 1749808 1696785 1650839
58097 1650839 1612077 1577161 1545270 1518136 1494603 1470957 1446251 1421865 1396418 1366691 1333204
58086A333204l3607l2617l3135l3049l0658k8784k9328k9335k6721k4311k4153
58075A007506k3444k0250j7617j7862j8249j6527j5214j6222j6651j4202j1548
58064H19720j1014j0192p141m746n380o241m588k975m514p270q045p704q358r001
58050G22551q203p562q459q891p188n352n210n029l360k303l390m160k506o48
58036F50290r97j786n98J353K132K691L928L773R35j822j863p47o19j86J943L555
58020F61982K590J267K287M037L821K845L605M972M352K491J851K183J729J005
58006G01017J603K824L048K853L631M842N502O448Q162Q519N768J616j645m870
57992G49318r743j5004j8315j9843k0723k0078j6886j2905j0425q839o592m514
$$ plain form
58086 1333204 1299597 1266980 1233845 1200796 1170138 1141354 1112026 1082691 1055970 1031659 1007506
58075 1007506 984062 963812 946195 928333 910084 893557 878343 862121 845470 831268 819720
58064 819720 808706 798514 791373 786627 781247 775006 770418 767443 762929 755659 747614 739910 731552 722551
58050 722551 714348 706786 698327 689436 682248 676896 671686 666657 663297 660994 657604 653444 650938 650290
58036 650290 649293 647507 646909 648262 650394 653085 657013 660786 661721 659899 658036 657289 656670 656484 658427 661982
58020 661982 664572 665839 668126 672163 675984 678829 682434 687406 691758 694249 696100 698283 700012 701017
58006 701017 702620 705444 708492 711345 714976 719818 725320 731768 739930 748449 754217 755833 754188 749318
57992 749318 739575 724571 706256 686413 665690 645612 628726 615821 605396 596557 589965 585451
57980E85451l971l656j667Q91J821J741K625L973L960L052L124L983M024L394
57966F08745L452M009L910L442L521L561K744K231L447N314N818N075M336L305
57952F62910J136j156k047k131k749l284k434r01j18M24J824L061K530J072M98
57937F58635K44j574m735p497r704j2299j4616j5242j4948j5807j7750j8835j8472
57924E07400j7685j6597j4403j1600r591q229o196l604j836r76K54K064L318L676
57910D25995M062N049O448Q301J0552J2219J2477J2076J2084J1936J0501Q265
57898E39965O644N858N198M611M176K929J41l015m938n860o881p815p958p921
57884E25134q565r134q538p484p140o755m999k646j461j233m78P81J397J633K721
$$ plain form
57980 585451 581480 577824 576157 577048 578869 580610 583235 587208 591168 594220 597344 601327 605351 608745
57966 608745 612197 616206 620116 623558 627079 630640 633384 635615 639062 644376 650194 655269 659605 662910
57952 662910 664046 662890 660843 658712 655963 652679 650245 649344 649226 649650 651474 654535 657065 658137 658635
57937 658635 658879 657305 652570 645073 635369 623070 608454 593212 578264 562457 544707 525872 507400
57924 507400 489715 473118 458715 447115 437524 429295 423099 419495 417659 416683 416937 419001 422319 425995
57910 425995 430057 435106 441554 449855 460407 472626 485103 497179 509263 521199 531700 539965
57898 539965 546609 552467 557665 562276 566452 569381 569522 566507 561569 555709 548828 541013 533055 525134
57884 525134 516569 507435 498897 491413 484273 477518 472519 469873 468412 467179 466701 467482 468879 470512 473233
57869D73233M392N303N527O258P473Q088Q023P904P329N577L412J987P01j525
57855E43682l772m405m039m437n245m665k936k115k666l135l018l099l051j662
57841D95437M66J291O04J88N66M06n27p89j54l48k168m291n748p169q853r917
57825D58994j0197j0809j2014j2512j1699j0718j0453j0268r456q353p346o340
57813C38829n583n552n694m896l318k123j442n24K68j73j190o65J718L995N175
57798C18825O609R193J1670J2906J3782J5363J6822J6619J4461J1141P506M444
57786D59341K741K125J463L76l76l88k39l61o45j405l243n767p830r336j1189
57771D25267j3306j4411j4136j3538j3091j1977r984q244p349o330m410k196m12
$$ plain form
57869 473233 477625 482928 488455 494713 502186 510274 518297 526201 533530 539107 542519 544506 545207 543682
57855 543682 539910 535505 531466 527029 521784 517119 514183 512068 509402 506267 503249 500150 497099 495437
57841 495437 495903 497194 497798 497986 498552 498958 498431 497642 497488 497140 494972 490681 484933 477764 468911 458994
57825 458994 448797 437988 425974 413462 401763 391045 380592 370324 360868 352515 345169 338829
57813 338829 333246 327694 322000 317104 313786 311663 310221 309697 309965 309792 308602 307937 309655 313650 318825
57798 318825 325434 334627 346297 359203 372985 388348 405170 421789 436250 447391 454897 459341
57786 459341 462082 464207 465670 466046 465670 465282 465043 464682 464037 462632 459389 453622 445792 436456 425267
57771 425267 411961 397550 383414 369876 356785 344808 334824 326580 319231 312901 308491 306295 305883
57758C05883J244L139M894O155P035P387O894O152O181O600N917M028K618K581
57744C76708K811K380K003K337K557J935J435K303M006M850M049K234N45j44L83
57729D10392J526K467L130L979N003N770O333P099P965Q616R344J0379J0910J0303
57715E03216R763J0902J3017J4031J3893J4586J6566J7886J7562J7300J8767K1342
57703F88831K3806K6333K9509L2956L6224L9682M3603M7717N2478N9163O7875
57692A148177P6974Q5506R4640J05765J18731J32988J48939J66985J86509K06829
57682B472043K27723K47914K64226K73269K73016K62064K38958K03591J58607
57673D621411J08811O0114J9048q607k0380j8528r988o423k2229o6964j36421
$$ plain form
57758 305883 307127 310266 315160 321315 328350 335737 342631 348783 354964 361564 367481 371509 374127 376708
57744 376708 379519 381899 383902 386239 388796 390731 392166 394469 398475 403325 407374 409608 410153 410009 410392
57729 410392 411918 414385 417515 421494 426497 432267 438600 445699 453664 462280 471624 482003 492913 503216
57715 503216 512979 523881 536898 550929 564822 579408 595974 613860 631422 648722 667489 688831
57703 688831 712637 738970 768479 801435 837659 877341 920944 968661 1021139 1080302 1148177
57692 1148177 1225151 1310657 1405297 1511062 1629793 1762781 1911720 2078705 2265214 2472043
57682 2472043 2699766 2947680 3211906 3485175 3758191 4020255 4259213 4462804 4621411
57673 4621411 4730222 4790336 4809384 4800777 4780397 4761869 4751881 4745458 4723229 4656265 4519844
57662D519844k12748k75496l12672l22707l10419k83758k51365k19116j88603
57653B142960j59829j33936j12068r3543p7247o3458n2560m3357l4551k6660k0615
57642A325136j5653j0355m621J128P490J5001K2633K9337L5993M3965N2749O1043
57630A563846O9316P9286R1424J04780J18683J32990J47401J62032J77771J94278
57620B841807K08438K16544K17058K09514J91997J62226J20739P0762J5545m1900
57610D212730r6822j43454j78502k02316k16449k21806k19441k11264j99203j84671
57600B338802j69114j53917j39593j26033j13619j03003r3940q5421p6974o8901
57590A208287o1454n4731m9130m4831m1120l7189l3301l0167k7666k5228k2960
$$ plain form
57662 4519844 4307096 4031600 3718928 3396221 3085802 2802044 2550679 2331563 2142960
57653 2142960 1983131 1849195 1737127 1643584 1566337 1502879 1450319 1406962 1372411 1345751 1325136
57642 1325136 1309483 1299128 1294507 1295635 1303125 1318126 1340759 1370096 1406089 1450054 1502803 1563846
57630 1563846 1633162 1712448 1803872 1908652 2027335 2160325 2307726 2469758 2647529 2841807
57620 2841807 3050245 3266789 3483847 3693361 3885358 4047584 4168323 4239085 4254630 4212730
57610 4212730 4115908 3972454 3793952 3591636 3375187 3153381 2933940 2722676 2523473 2338802
57600 2338802 2169688 2015771 1876178 1750145 1636526 1533523 1439583 1354162 1277188 1208287
57590 1208287 1146833 1092102 1042972 998141 957021 919832 886531 856364 828698 803470 780510
57579G80510k1196j9481j7306j5265j4132j3341j1864j0096r208r015q229o659
57567F24718n418m962m604m029l657l328k216l57J201K117L246N039O883Q380
57553F23013R989J1836J3147J3551J3944J5378J7767K0329K2679K5040K7818L1332
57541H45823L5535L9934M4158M8621N4122O0859O8392P6399Q4990R4391J04811
57530A558035J16398J28710J40674J51589J61618J70442J75868J74849J65507
57521B943690J47321J19972Q3525L9892p084n3168r4750j28746j53022j67420
57511B730210j73595j73501j68503j59764j48631j36327j23705j11325r9423q7946
57501A347490p7059o7211n8450n0218m2409l5877l1140k7248k2893j8064j3637
$$ plain form
57579 780510 759314 739833 722527 707262 693130 679789 667925 657829 648621 639606 631377 624718
57567 624718 619300 614338 609734 605705 602048 598720 596504 596147 597348 599465 602711 607750 614633 623013
57553 623013 633002 644838 657985 671536 685480 700858 718625 738954 761633 786673 814491 845823
57541 845823 881358 921292 965450 1014071 1068193 1129052 1197444 1273843 1358833 1453224 1558035
57530 1558035 1674433 1803143 1943817 2095406 2257024 2427466 2603334 2778183 2943690
57521 2943690 3091011 3210983 3294508 3334400 3327316 3274148 3179398 3050652 2897630 2730210
57511 2730210 2556615 2383114 2214611 2054847 1906216 1769889 1646184 1534859 1435436 1347490
57501 1347490 1270431 1203220 1144770 1094552 1052143 1016266 985126 957878 934985 916921 903284
57490I03284r873o415l244m40K618O572J0923J4628J7665K0871K4555K8416L2637
57477A042197L7850M4105N0856N7952O5703P4122Q3117R3195J04952J17929J30883
57466A902861J42954J53679J62044J66337J64751J55389J36270J06558O7796K3253
57456C181892k3485o8711j08467j39859j62256j76287j82234j80557j73193j62734
57446A804109j50613j37367j24098j12101j01375r1115q1343p2726o5112n7867
57436H10392n1274m5997m1458l6533l1571k7943k5717k3613k1228j9365j8073
57425D67620j6336j4000j2184j1351j0657r646q905q599q006p045o669p116p252
57412C39854o386n351n094n378n558n514n272m645l788l216k943k435j610j012
$$ plain form
57490 903284 893411 886996 883752 883312 885930 892502 903425 918053 935718 956589 981144 1009560 1042197
57477 1042197 1080047 1124152 1175008 1232960 1298663 1372785 1455902 1549097 1654049 1771978 1902861
57466 1902861 2045815 2199494 2361538 2527875 2692626 2848015 2984285 3090843 3158639 3181892
57456 3181892 3158407 3089696 2981229 2841370 2679114 2502827 2320593 2140036 1966843 1804109
57446 1804109 1653496 1516129 1392031 1279930 1178555 1087440 1006097 933371 868259 810392
57436 810392 759118 713121 671663 635130 603559 575616 549899 526286 505058 485693 467620
57425 467620 451284 437284 425100 413749 403092 393446 384541 375942 367936 360891 354222 347106 339854
57412 339854 333468 328117 323023 317645 312087 306573 301301 296656 292868 289652 286709 284274 282664 281652
57398B81652q81j034j488k191k357j402k95m62j559j946j228n52l78L9Q00R68
57382B67686M39K58N34Oj668l034l078k549k307k004j288p27o65n90m63j113k524
57365B46913l227k368r24j11J14J70k0k48K28J275J649R46L40N83Q32L28l04m09
57347B45767m04n76k47P77J445J188R30J376J815J675J700K428L006K781K550
57332B66211K919L036K290J770K414L250L037K339K280K547K388K286K879L312
57318C02958K618J713K045L186L629L301L271L607L490L060L275M152M815N116
57304C50236N657O414O756O711O899P381P788Q340R513J1013J2257J3513J5337
57291D67815J7197J7973J7678J7481J8159J9513K1185K3043K4853K6405K7849
$$ plain form
57398 281652 280771 279737 278249 276058 273701 272299 272004 271542 269983 268037 266809 266257 265879 265918 266718 267686
57382 267686 268125 268383 268917 268923 267255 264221 261143 258594 256287 254283 252995 252268 251603 251013 250550 249437 246913
57365 246913 243686 241318 240394 240283 240397 240567 240547 240299 240527 241802 243451 244397 244737 245320 246152 246480 246176 245767
57347 245767 245363 244787 244540 245317 246762 247950 248880 250256 252071 253746 255446 257874 260880 263661 266211
57332 266211 269130 272166 274456 276226 278640 281890 284927 287266 289546 292093 294481 296767 299646 302958
57318 302958 305576 307289 309334 312520 316149 319450 322721 326328 329818 332878 336153 340305 345120 350236
57304 350236 355893 362307 369063 375774 382673 390054 397842 406182 415695 426708 438965 452478 467815
57291 467815 485012 502985 520663 538144 556303 575816 597001 620044 644897 671302 699151
57280F99151K9294L0427L1034L1394L1548L0807K8637K5237K0725J4701P364p6
57268I80243o959j4001k1498k7975l1916l3688l4438l4253l2944l1437l0503k9093
57256F51538k5851k1593j8290j6247j4285j2205j0912j0256q895o506m337l247
57244D98914k745k248j924j956k173k552l106l276k494j250n42m08j02N15Q95
57229D75548R86J263J679J675J184O07P7l66j56J163K915L945M011L678L346L287
57213E04842M020N494O537O348N856O379P578Q229Q265Q487Q778Q442P897Q240
57199F05392R301R749R100Q136P556P645Q949J1659J4473J5672J5255J4653J4572
57186G52112J4613J4693J5154J5664J5648J5623J6457J7631J7936J7677J8304
$$ plain form
57280 699151 728445 758872 789906 821300 852848 883655 912292 937529 958254 972955 980319 980243
57268 980243 973284 959283 937785 909810 877894 844206 809768 775515 742571 711134 680631 651538
57256 651538 625687 604094 585804 569557 555272 543067 532155 521899 513004 506498 502161 498914
57244 498914 496169 493921 491997 490041 487868 485316 482210 478934 476440 475190 474648 474240 474138 474653 475548
57229 475548 476534 477797 479476 481151 482335 482942 483019 482653 482497 483660 486575 490520 494531 498209 501555 504842
57213 504842 508862 514356 520893 527241 533097 539476 547054 555283 563548 572035 580813 589255 597152 605392
57199 605392 614693 624442 633542 641678 649234 656879 665828 677487 691960 707632 722887 737540 752112
57186 752112 766725 781418 796572 812236 827884 843507 859964 877595 895531 913208 931512
57175I31512J9928K1108K1120K0622K0050J9227J8653J9319K0971K2326K3110
57164A157946K4271K6078K7761K9160L0906L2867L4195L4988L6128L7413L7839
57153A509552L7620L7914L8517L8159L7262L7837M0186M2185M2652M2978M4493
57142A949355M6536M8275N0191N2510N4065N4165N3938N4615N6023N7748O0145
57131B537566O3126O5479O6624O7579O9320P1584P4152P7739Q2635Q7935R2936
57120C356675R7861J02761J07639J14320J25760J42059J59046J72301J81166J88079
57110D747667J96177K08938K29695K59224K95005L34608L78796M30407M92166
57101G572683N67126O59725P74807R16869J091114J303199J556788J853620K197261
$$ plain form
57175 931512 951440 972548 993668 1014290 1034340 1053567 1072220 1091539 1112510 1134836 1157946
57164 1157946 1182217 1208295 1236056 1265216 1296122 1328989 1363184 1398172 1434300 1471713 1509552
57153 1509552 1547172 1585086 1623603 1661762 1699024 1736861 1777047 1819232 1861884 1904862 1949355
57142 1949355 1995891 2044166 2094357 2146867 2200932 2255097 2309035 2363650 2419673 2477421 2537566
57131 2537566 2600692 2666171 2732795 2800374 2869694 2941278 3015430 3093169 3175804 3263739 3356675
57120 3356675 3454536 3557297 3664936 3779256 3905016 4047075 4206121 4378422 4559588 4747667
57110 4747667 4943844 5152782 5382477 5641701 5936706 6271314 6650110 7080517 7572683
57101 7572683 8139809 8799534 9574341 10491210 11582324 12885523 14442311 16295931 18493192
57092A8493192K594007L047555L553952M101738M672599N238886N763956O208960
57084E3674845O538671O721870O734380O567017O221775N688062M927404L900882
57076A00974906K622979J181977l01602j736262l079782m310393n392055o269343
57068H3690425o887729p215897p256565p045141o639299o104206n499952m875240
57060C2166396m266020l696172l179247k720987k321710j978043j684704j436168
57052A0883345j227155j052055r04849p80218o74397n84723n08746m44278l89867
57043D317057l44352l05923k72233k41827k14861j91967j72779j56124j41284
57034B275707j28294j17139j07391r8725r1051q4036p7188p0654o5155o0897n7119
$$ plain form
57092 18493192 21087199 24134754 27688706 31790444 36463043 41701929 47465885 53674845
57084 53674845 60213516 66935386 73669766 80236783 86458558 92146620 97074024 100974906
57076 100974906 103597885 104779862 104478260 102741998 99662216 95351823 89959768 83690425
57068 83690425 76802696 69586799 62330234 55285093 48645794 42541588 37041636 32166396
57060 32166396 27900376 24204204 21024957 18303970 15982260 14004217 12319513 10883345
57052 10883345 9656190 8604135 7699286 6919068 6244671 5659948 5151202 4706924 4317057
57043 4317057 3972705 3666782 3394549 3152722 2937861 2745894 2573115 2416991 2275707
57034 2275707 2147413 2030274 1922883 1824158 1733107 1649071 1571883 1501229 1436074 1375177 1318058
57023A318058n3119m9113m5662m2787m0060l7148l3913l0364k6817k3721k1063
57012I14291j8250j4697j0249m996Q58P139J4047K2236L2162M3971N8690P8691
57000A123893J06218J42480J88195K40625K85275K93680K39632J24121j8258j42123
56990B583738k20771k54127k55079k35620k04502j69254j35199j04410p8073n8658
56980H68045m8416m6920n1182n7276o1496o1480n7355n1182m4809l8782l3188
56969C15959k8233k3672j8777j3346p918k715K633Q185J3471J8552K4318L1333
56957C19790L8935M5459M8465M4990L3206J4798n099k1145l0883l4871l4818l2164
56945C86663k7787k2389j6932j2498r330o372k471K128O276R722J3514J8572K4951
$$ plain form
57023 1318058 1264939 1215826 1170164 1127377 1087317 1050169 1016256 985892 959075 935354 914291
57012 914291 896041 881344 871095 866099 866957 874096 888143 910379 942541 986512 1045202 1123893
57000 1123893 1230111 1372591 1560786 1801411 2086686 2380366 2619998 2744119 2725861 2583738
56990 2583738 2362967 2108840 1853761 1618141 1413639 1244385 1109186 1004776 926703 868045
56980 868045 819629 772709 721527 664251 602755 541275 483920 432738 387929 349147 315959
56969 315959 287726 264054 245277 231931 224013 221298 223931 232116 245587 264139 288457 319790
56957 319790 358725 404184 452649 497639 530845 545643 540544 519399 488516 453645 418827 386663
56945 386663 358876 336487 319555 307057 297727 291355 288884 291012 297288 307010 320524 339096 364047
56932C64047L2594M1625N1002N7307N5790M3307K0990n477k8712m3900n0775n1804
56920D85994m9245m4497l9022l4066k9518k4460j9020j4575j1931j0379q921p395
56908A92965o022m802l775l186k852k094p16N87J143J146J248J828L075N191Q137
56893A91873J1427J4576J7552K0629K4082K8180L3241L9264M5332M9162M7675
56882E22993L8855K3763O389r037k0421k7527l0425k9342k5481k0646j5810j0857
56870D02454n735r49L231P312J2013J7715K4624L3016M3208N5509O9892Q4765
56858G47055R5848R6963Q3060N3634J4281k5104n5183p1920p7215p5147o8355
56847G17917n8074m5886l3700k2446j2052k457O489J5797K6693L9332N3317O9477
$$ plain form
56932 364047 396641 438266 489268 546575 602365 645672 666662 661185 632473 588573 537798 485994
56920 485994 436749 392252 353230 319164 289646 265186 246166 231591 219660 209281 200360 192965
56908 192965 186943 182141 178366 175180 172328 170234 169518 170105 171248 172394 173642 175470 178545 183736 191873
56893 191873 203300 217876 235428 256057 280139 308319 341560 380824 426156 475318 522993
56882 522993 561848 585611 592000 582963 562542 535015 504590 475248 449767 429121 413311 402454
56870 402454 396719 395770 399001 406313 418326 436041 460665 493681 536889 592398 662290 747055
56858 747055 842903 939866 1022926 1076560 1090841 1065737 1010554 938634 861419 786272 717917
56847 717917 659843 613957 580257 557811 545759 543302 549791 565588 592281 631613 684930 754407
56835G54407Q9858J15238J42638J64542J70208J49881J01220L3242l7213r4334
56825A589687j30059j44515j42654j30877j14562r6720p8529o0941m5147l1600
56815F14083j9659q421K735J4532K7739M2671N9454P8541R9391J17883J25997
56804A154946J15527Q3289L4030k0868o8358r9829j14073j15117j07770r5445
56794G66332q0803o6217n3088m1694l1968k3688j6064q190k5Q008J6284K5851
56782D94738L7035M8904N9616O6093O3853M9450K4029o363l4398n5004o6149o8391
56770F13413o4455n7826n0672m3430l6320l0063k4971k0601j6760j3859j1879
56759B42577j0141q463p398o975o265m719k949j715j050q10j031j411j311p16
$$ plain form
56835 754407 844265 959503 1102141 1266683 1436891 1586772 1687992 1721234 1684021 1589687
56825 1589687 1459628 1315113 1172459 1041582 927020 830300 751771 690830 645683 614083
56815 614083 594424 586003 588738 603270 631009 673680 733134 811675 911066 1028949 1154946
56804 1154946 1270473 1353762 1387792 1366924 1298566 1198737 1084664 969547 861777 766332
56794 766332 685529 619312 566224 524530 492562 468874 452810 444620 444595 452603 468887 494738
56782 494738 531773 580677 640293 706386 770239 819689 843718 837355 802957 747953 681804 613413
56770 613413 548958 491132 440460 397030 360710 330647 305676 285075 268315 254456 242577
56759 242577 232436 223973 216575 209600 203335 198616 195667 193952 192902 192092 191061 189650 188339 187623
56745A87623k98k71j61O1k24j103j848k178k612l219l307k787k536k838k797j984
56729A59521j390j836k621k704k290k194k438k445k022j387o85q7J96L41P09J030
56713A39698O70l8R1J195J852J123o2m35j58o8p5M74J518K375K721K670K299J774
56695A57624J492J542J440Q70K30K3K82Q86J829K760L057K684K265K062J696J171
56679A81913J191J958K672K733K551K594K548J965R99o3j235k376l066l345l709
56664A87330m158m225m068m370m916m729m002m208n701o818o356n296m905m679
56650A18899l632k303j788j767j189k11J61p9J23J232K644L660M014L641K773
56635A26178K054J938K246K725L441M131M027L019K220K505L228L217K424J665
$$ plain form
56745 187623 187325 187054 186893 186954 186730 185627 183779 181601 178989 175770 172463 169676 167140 164302 161505 159521
56729 159521 158131 156295 153674 150970 148680 146486 144048 141603 139581 138194 137509 137422 137618 137959 138668 139698
56713 139698 140368 140330 140421 141616 143468 144591 144529 144094 143936 143868 143793 144267 145785 148160 150881 153551 155850 157624
56695 157624 159116 160658 162098 162968 163198 163221 163503 164389 166218 168978 172035 174719 176984 179046 180742 181913
56679 181913 183104 185062 187734 190467 193018 195612 198160 200125 201124 201061 199826 197450 194384 191039 187330
56664 187330 183172 178947 174879 170509 165593 160864 156862 152654 146953 140135 133779 128483 123578 118899
56650 118899 115267 112964 111176 109409 108220 108009 108170 108091 108214 109446 112090 115750 119764 123405 126178
56635 126178 128232 130170 132416 135141 138582 142713 146740 149759 151979 154484 157712 160929 163353 165018
56621A65018J232O99k44j424k392k626j924q96m16m89m26k23n54j214j106j55
56605A52860K89l10p10j15L44l84j237o60R12J815J496O06m38j495j950j392n38
56588A49093k80l15J95J146J804J977J873J347L18n79o94j99M86J337K088K015
56572A61612J198R57K017L320L719L716M271N070N387N623O501P563P925P754
56558B26633P657P444O806O354O554O529N408L977L451L499L050K166J410K77
56544B91215j869m028m693m252m397n508o467o759o934p181p094o811o818o791
56530B11613n963m535l338k438j387n05n08j166j643j819k029k081j838k051l205
56515A77107m180l710k477k056k445k461k073k231k831k873k427k444k716k080
$$ plain form
56621 165018 166250 166949 166705 165281 162889 160263 158339 157443 157027 156538 156112 155889 155335 154121 153015 152860
56605 152860 153149 152839 152129 152014 152358 151974 150737 150077 150989 152804 154300 154906 154468 152973 151023 149631 149093
56588 149093 148813 148498 148693 149839 151643 153620 155493 156840 157158 156579 155885 155686 156172 157509 159597 161612
56572 161612 162810 163767 165784 169104 172823 176539 180810 185880 191267 196890 203391 210954 218879 226633
56558 226633 234290 241734 248540 254894 261448 267977 273385 277362 280813 284312 287362 289528 290938 291215
56544 291215 289346 285318 280625 276373 271976 266468 260001 253242 246308 239127 232033 225222 218404 211613
56530 211613 205650 201115 197777 195339 193952 193447 192939 191773 190130 188311 186282 184201 182363 180312 177107
56515 177107 172927 169217 166740 164684 162239 159778 157705 155474 152643 149770 147343 144899 142183 140103
56501A40103o61O0l75p61l09L93P57J077J622K147K569L002L121K601K019K143
56485A59508K617K544K036J818J799J496J418K344L643M002L526L417L872M020
56471A98060L721L602L621L295L139L953N014M926M032L899M577M623L782L394
56457B53638L797L596K073K87q14j491j964j752q93k76k34k28j53n17j146j273
56441B52650j035j309j957j928j215r09j179j102o27q37j877k505k184j820j990
56426B30176k171k133k449l166l582l666m107m701m399l237k435k380k241j842
56412A87667j959k468k174r26K3K01N25J281J524J098J165K031K384J459J87n32
56396A91486r30j107n30M69N20n75j193k75J153J732J431P92ro58o77n46j378
$$ plain form
56501 140103 139442 139502 139127 138366 138057 138450 139207 140284 141906 144053 146622 149624 152745 155346 157365 159508
56485 159508 162125 164669 166705 168523 170322 171818 173236 175580 179223 183225 186751 190168 194040 198060
56471 198060 201781 205383 209004 212299 215438 219391 224405 229331 233363 237262 241839 246462 250244 253638
56457 253638 257435 261031 263104 263391 262577 261086 259122 257370 256477 256201 255967 255739 255586 255069 253923 252650
56441 252650 251615 250306 248349 246421 245206 244297 243118 242016 241389 240552 238675 236170 233986 232166 230176
56426 230176 228005 225872 223423 220257 216675 213009 208902 204201 199802 196565 194130 191750 189509 187667
56412 187667 185708 183240 181066 180140 180163 180364 180889 182170 183694 184792 185957 187988 190372 191831 192018 191486
56396 191486 190556 189449 188919 189388 189908 189333 188140 187865 189018 190750 192181 192973 192964 192306 191629 191083 189705
56379A89705l027l996l485k038J1K904O032Q089Q982R715J0203R330P434O241
56365B46100N934M799K458Q23Q61J033J66o40l59R0j59j56R40K090K167J846K121
56348B70114K491K112J343Q37M20K1L43J468K133J402j79j761l130l835l128j352
56332B69299K31J547L665O194P113N963M837N139N720N408M982N233N371M869
56318C35571M763N575N979N129M279M647N441N497M976M173K629P80K77J276J635
56303C92627K92r26m84L25o7p82m67J37r2l21N75J779K134K365L555M935N326
56286D10911N337O064P006P218P252Q074R328J0295J1300J2718J4047J5264J7355
56273E42169K0173K1936K2258K3376K6616L0085L1992L3806L7648M2839M7720
$$ plain form
56379 189705 186678 182682 179197 177159 177170 180074 186106 194195 203177 212892 223095 232425 239859 246100
56365 246100 252034 256833 259291 260114 260975 262008 262174 261534 261175 261265 261106 260950 261890 263980 266147 267993 270114
56348 270114 272605 274717 276060 276897 277317 277338 277681 279149 281282 282684 282505 280744 277614 273779 270651 269299
56332 269299 269530 271077 274742 280936 288049 294012 298849 303988 309708 315116 320098 325331 330702 335571
56318 335571 340334 345909 351888 357017 361296 365943 371384 376881 381857 386030 388659 389439 389716 390992 392627
56303 392627 392919 391993 391509 391834 391767 390985 390518 390655 390563 390242 390817 392596 394730 397095 400650 405585 410911
56286 410911 416248 422312 429318 436536 443788 451862 461190 471485 482785 495503 509550 524814 542169
56273 542169 562342 584278 606536 629912 656528 686613 718605 752411 790059 832898 880618
56262H80618N2876N9682O7350P4245Q0799Q8444R6824J04596J11802J19150J26034
56251A862420J31297J34765J36157J34047J27862J19290J09623R7570Q1867O4206
56241B999104M7270L1687J7229N056l993j1407j8624k4331k6969k8052l0063l2779
56229B924128l4837l7372m2628n0156n7652o4726p2711q1491q9384r5634j00444
56218B197093j03394j04159j03875j03444j01671r7446r2232q7904q3626p7658
56208A241684p0683o4385n8265n1077m4018l9169l5902l2143k8187k5843k4718
56197G67294k2690j9476j6596j4458j2435j1026j0962j0930r229o852n925n961
56185F20754m828k635j356j238p92J57N18N40J446K902L684M205N656P408Q036
$$ plain form
56262 880618 933494 993176 1060526 1134771 1215570 1304014 1400838 1505434 1617236 1736386 1862420
56251 1862420 1993717 2128482 2264639 2398686 2526548 2645838 2755461 2853031 2934898 2999104
56241 2999104 3046374 3078061 3095290 3100346 3096353 3084946 3066322 3041991 3015022 2986970 2956907 2924128
56229 2924128 2889291 2851919 2809291 2759135 2701483 2636757 2564046 2482555 2393171 2297537 2197093
56218 2197093 2093699 1989540 1885665 1782221 1680550 1583104 1490872 1402968 1319342 1241684
56208 1241684 1171001 1106616 1048351 997274 953256 914087 878185 846042 817855 792012 767294
56197 767294 744604 725128 708532 694074 681639 670613 659651 648721 639492 632640 626715 620754
56185 620754 615926 613291 611935 610697 609905 610062 610580 611120 612566 615468 619152 623357 629013 636421 644457
56170F44457Q092Q973J0165J0504J0979J3008J5049J4503J2070J0650J0689J0241
56158G79380R032Q795R852J0818J1561J3218J5587J7498J9345K2345K5953K8976
56146I72360L2360L7805M4615N1218N8831P0116Q5144J02200J21539J44519J69630
56135A890337J92968K11761K23859K25137K12117J87136J57358J29050J06004
56126C535727R1544Q6713Q6427Q2113O8964M7903K1773n937k9545m3777m9035
56115C892870n0925n4878o4471q3327j13039j48781j81363k04400k16412k17113
56105B558161k06534j87753j65836j43326j20239r8011p9323o4399n1628m1463
56095A399649l5559l2631k9594k6345k5086k5497k5112k3765k3069k2180j9048
$$ plain form
56170 644457 652549 661522 671687 682191 693170 706178 721227 735730 747800 758450 769139 779380
56158 779380 788412 797207 807059 817877 829438 842656 858243 875741 895086 917431 943384 972360
56146 972360 1004720 1042525 1087140 1138358 1197189 1267305 1352449 1454649 1576188 1720707 1890337
56135 1890337 2083305 2295066 2518925 2744062 2956179 3143315 3300673 3429723 3535727
56126 3535727 3627271 3713984 3800411 3882524 3951488 3999391 4021164 4015227 3985682 3941905 3892870
56115 3892870 3841945 3787067 3722596 3639269 3526230 3377449 3196086 2991686 2775274 2558161
56105 2558161 2351627 2163874 1998038 1854712 1734473 1636462 1557139 1492740 1441112 1399649
56095 1399649 1364090 1331459 1301865 1275520 1250434 1224937 1199825 1176060 1152991 1130811 1111763
56084A111763j5010j3141j2730j0565o905m723l870j735R68J189r8J233N262P908
56070A059546Q031Q496R972J0053Q909R453J1418J1434R547R401J1431J2289J1529
56057A191509J2331J4885J5720J4466J4753J7315J8747J8086J8191J9670J9895
56046A375568J8937J9872K2463K3182K2107K2916K5519K5953K4229K4620K7525
56035A632891K8858K8382L0401L5032L7175L5718L5449L8159M0173M0374M2351
56024B024963M6711M9616N0590N3306N7267N7605N4603N4084N6798N7224N4635
56013B617402N5023N9915O3791O5030O8712P5793Q0464Q1267Q3885Q9710R3022
56002C434014R2808R5778J04042J11528J16281J24155J36490J46693J53148J62684
$$ plain form
56084 1111763 1096753 1083612 1070882 1060317 1053412 1048689 1044819 1043084 1044052 1045241 1045143 1046376 1051638 1059546
56070 1059546 1067577 1076073 1086045 1096098 1105007 1114460 1125878 1137312 1146859 1156260 1167691 1179980 1191509
56057 1191509 1203840 1218725 1234445 1248911 1263664 1280979 1299726 1317812 1336003 1355673 1375568
56046 1375568 1394505 1414377 1436840 1460022 1482129 1505045 1530564 1556517 1580746 1605366 1632891
56035 1632891 1661749 1690131 1720532 1755564 1792739 1828457 1863906 1902065 1942238 1982612 2024963
56024 2024963 2071674 2121290 2171880 2225186 2282453 2340058 2394661 2448745 2505543 2562767 2617402
56013 2617402 2672425 2732340 2796131 2861161 2929873 3005666 3086130 3167397 3251282 3340992 3434014
56002 3434014 3526822 3622600 3726642 3838170 3954451 4078606 4215096 4361789 4514937 4677621
55992D677621J76941J88700J96198K07178K23885K38494K48687K62781K83663
55983F704148L03267L19140L40408L70568M00937M28457M62836N08248N55623
55974A0393632O01481O56292P25425Q00843Q80947R78862J101182J239368J393145
55965A8771177J581218J818060K103370K445969K872248L395649M002967M688088
55957D1678746N477554O411542P531141Q907811J0666202J2963210J5963991J9851275
55949A29451472K4845634L1180173L8885548M7196000N3797006N4878718M6878437
55942D27112988K9192393N512917j7851351l5499968m5355964m8382703m6737641
55935B67990671m2379038l6764102l0953779k5597214k0944278j7033444j3851462
$$ plain form
55992 4677621 4854562 5043262 5239460 5446638 5670523 5909017 6157704 6420485 6704148
55983 6704148 7007415 7326555 7666963 8037531 8438468 8866925 9329761 9838009 10393632
55974 10393632 10995113 11651405 12376830 13177673 14058620 15037482 16138664 17378032 18771177
55965 18771177 20352395 22170455 24273825 26719794 29592042 32987691 36990658 41678746
55957 41678746 47156300 53567842 61098983 70006794 80672996 93636206 109600197 129451472
55949 129451472 154297106 185477279 224362827 271558827 325355833 380234551 427112988
55942 427112988 456305381 461818298 443966947 408466979 363111015 314728312 267990671
55935 267990671 225611633 188847531 157893752 132296538 111352260 94318816 80467354
55928H0467354j1329122r326252p712220o420650n400167m573944l881860l311245
55920B8511894k853784k472981k139050j856173j629676j439563j268250j123018
55912A3729399j009864r12882q18651p35377o70230o11478n49795m94880m55079
55903G471163m21039l84346l52598l31701l11853k85120k59667k43184k28645
55894D653010k09298j92046j83183j75504j61974j48561j41722j36160j26311
55885C178251j17604j15189j13171j05623r7301r3347q9229q0792p3810p3640
55875B218545p5190p2573o9289o9668o9498o4224n7743n4348n0429m2646l5920
55864A557017l4821l5055l1746k8273k8661k8977k4629j8991j6319j3213n479
$$ plain form
55928 80467354 69138232 59811980 52099760 45679110 40278943 35704999 31823139 28511894
55920 28511894 25658110 23185129 21046079 19189906 17560230 16120667 14852417 13729399
55912 13729399 12719535 11806653 10988002 10252625 9582395 8970917 8421122 7926242 7471163
55903 7471163 7050124 6665778 6313180 5981479 5669626 5384506 5124839 4881655 4653010
55894 4653010 4443712 4251666 4068483 3892979 3731005 3582444 3440722 3304562 3178251
55885 3178251 3060647 2945458 2832287 2726664 2629363 2536016 2446787 2365995 2292185 2218545
55875 2218545 2143355 2070782 2001493 1931825 1862327 1798103 1740360 1686012 1635583 1592937 1557017
55864 1557017 1522196 1487141 1455395 1427122 1398461 1369484 1344855 1325864 1309545 1296332 1290853
55853A290853K772N021J580m386j3787k6943l7884m1215l9768l8438l5873k9293
55841A032639k2076j8853j7660j4329j0449r909j1483j1700j1541j3820j7183
55830H73636j8676j9136k0496k1038j8604j5347j4246j4228j3340j3144j5178
55819F90203j6814j5395j2990j2454j2426j0690q772q619q349n826k808j264O02
55806E74398M386P566P941P937R971J1637J0178P689O894N788J602l620o556q325
55792F37486j1485j4679j5373j4812j5263j5365j3165j0720j0797j1800j0860
55781D93167r009q396p366l496J102K639J393k35k772p732j2954j5075j4791j4905
55767D01570j5078j3241j0312q781q204o565m497l995m501m294l949m623m962
$$ plain form
55853 1290853 1293625 1298646 1300226 1295840 1282053 1255110 1217226 1176011 1136243 1097805 1061932 1032639
55841 1032639 1010563 991710 974050 959721 949272 939363 927880 916180 904639 890819 873636
55830 873636 854960 835824 815328 794290 775686 760339 746093 731865 718525 705381 690203
55819 690203 673389 657994 645004 632550 620124 609434 600662 592043 583694 577868 575060 573796 574398
55806 574398 578784 586350 594291 602228 612199 623836 634014 641703 648597 654385 655987 652367 645811 637486
55792 637486 626001 611322 595949 581137 565874 550509 537344 526624 515827 504027 493167
55781 493167 484158 475762 468396 464900 466002 468641 470034 469799 467027 459295 446341 431266 416475 401570
55767 401570 386492 373251 362939 354158 345954 339389 334892 330897 326396 322102 318153 313530 308568
55754C08568l646k760m545p134p748p643r335j1328j0495p734o302o224n262l887
55740B14525m327n922o134n070m524l844j270J824K638J903K502M156L980J608
55726B02045o65k121l757m927m137k613k844m198m064k645k433l454l400k132
55712A58655j808k673k711j476m49L02K134M678O183O746P722Q332O571L136P84
55697A96126M0q02j768j178O63J600J511K284L874M071K486J126P72J86p70p15
55681B09506J93K09n58M0K377M180M077L061J978M93j022j331n99k52l39L82J711
55664B24106K075J489J560K451K684K173K525L979M908M714M556M748M187K778
55650B68933J902J896J458o2j990m065o540q569q924q248q223q613p853o297n927
$$ plain form
55754 308568 304922 302162 297617 290483 282735 275092 265757 254429 243934 236200 229898 223674 218412 214525
55740 214525 210198 204276 198142 193072 188548 184704 183434 185258 187896 189799 192301 196457 200437 202045
55726 202045 201380 199259 195502 190575 186438 183825 180981 176783 172719 170074 167641 164187 160787 158655
55712 158655 156847 154174 151463 149987 149538 149840 151974 156652 162835 169581 177303 185635 192206 195342 196126
55697 196126 196166 195364 193596 192418 193081 194681 196192 198476 202350 206421 208907 210033 210805 210991 210221 209506
55681 209506 209699 209908 209350 209390 211767 215947 220024 223085 225063 225556 224534 223203 222604 222352 222013 222395 224106
55664 224106 226181 227670 229230 231681 234365 236538 239063 243042 247950 252664 257220 261968 266155 268933
55650 268933 270835 272731 274189 274127 272137 268072 261532 252963 244039 235791 227568 218955 211102 204805 198878
55635A98878o842p103o278o109p147p695o793n567m984m707m696n478o372n860
55621A13247m156l028k857k421j628j693k349j940o79p11k229k711j089L43l56
55606H5743j897k173j328p60q64j197j471j375o53Pl64j216j000L17J146Q39L41
55589G4095J08m60j228j225p16j109k365k734j602l17K76P84J286P61p26j615
55573F3213j295q81q79l82Q06J488J283J316J948K066J366J001J246Q35m88j128
55557G1515l13O37P72Q76J307P46j523m085n462n811n506m065j713m7J67J56Q91
55540D8542J535J377J348K262L201L099K462K242K347K433K753L214K968J896
55526H1679J128J201J239O96K76L42K04j33N84K580M122M042L441L612L960L378
$$ plain form
55635 198878 192036 184933 178655 172546 165399 157704 150911 145344 140360 135653 130957 125479 119107 113247
55621 113247 109091 106063 103206 100785 99157 97464 95115 93175 92496 91785 89556 86845 85756 86099 85743
55606 85743 83846 81673 80345 79585 78721 77524 76053 74678 74025 74032 73668 72452 71452 71769 72915 73754 74095
55589 74095 74203 73743 72515 71290 70574 69465 67100 64366 62764 62447 62723 63507 64793 65554 64828 63213
55573 63213 61918 61037 60158 59776 60582 62070 63353 64669 66617 68683 70049 71050 72296 73131 72643 71515
55557 71515 71202 71839 72611 73487 74794 75540 74017 69932 64470 58659 53153 49088 47375 47328 47495 47651 48542
55540 48542 50077 51454 52802 55064 58265 61364 63826 66068 68415 70848 73601 76815 79783 81679
55526 81679 82807 84008 85247 85943 86219 86561 86765 86632 87216 89796 93918 97960 101401 105013 108973 112351
55510A12351K097P76q17k893m622n367n713o251o525o183n817n715n120l717k489
55495E3995k114j983j673j821k565k730j769r17j239j975k051j794j874j934j590
55480B5966j434j868k155j735j217r88k93J116J896J046l77q25l59Q0K87L19l22
55463A9137j722k684k208r20k6K47K38j8l04K7Q96J229O09r1m19j085k148k239
55445H519q31M40J33r15j280j141j224j045K0J193J502J423J688J643N19p32o54
55428I258M50J207J280J295J341J120Q87R46Q14J52l28l7K87j89r45j150j148
55411A5240j533j774j186l12J05N70J746K877K885K196J926K011J675R83L90m39
55395B7360j816k801k406j326q27o45K51J455J492J34j358k042j933j138J20R16
$$ plain form
55510 112351 114448 115224 114407 111514 106892 101525 95812 89561 83036 76853 71036 65321 60201 56484 53995
55495 53995 51881 49898 48225 46404 43839 41109 39340 38423 37184 35209 33158 31364 29490 27556 25966
55480 25966 24532 22664 20509 18774 17557 16569 16276 17392 19288 20334 19957 19132 18773 18853 19140 19459 19137
55463 19137 17415 14731 12523 11603 11577 11824 12062 12044 11740 11767 12663 13892 14501 14410 13991 12906 10758 8519
55445 8519 7688 8128 8261 7346 6066 4925 3701 2656 2676 3869 5371 6794 8482 10125 10644 9912 9258
55428 9258 9708 10915 12195 13490 14831 15951 16838 17784 18598 18750 18422 18385 18672 18483 17538 16388 15240
55411 15240 13707 11933 10747 10435 10540 11110 12856 15733 18618 20814 22740 24751 26426 27409 27799 27360
55395 27360 25544 22743 20337 19011 18184 17539 17790 19245 20737 20871 19513 17471 15538 14400 14520 15436
55379A5436M28q02j603j829k090k295j781o45L53R25J244J224P83M53O73J009
55363A1483J086J435K319K560J107r85j731r18KK91N15R77J193R78P70P54P27
55346B2563P40Q72O22m86j943k819k933k564j649l50K65n71j889k086j059J2N31
55329G256Q24R36N23j71m69k96m0L08Q68J116N22l83o75l95k15k10p1m8m96r36
55309G948p33k67k98o47o33l20j04K68J066J622J275O57O02O20n6o51Q5J544K001
55290A3979J273P47R03P97Op36j022j217j270o57K78M35l44j044j098r29q08n32
55272H761k60l81m93J14J076J331Q17L93K11k82q41n82L51R03R93J497K327K342
55254A8277J427Q47J053R19j94j299j453j062p36k33O01J089P54J44r9o4J4J81
$$ plain form
55379 15436 15864 15062 13459 11630 9540 7245 5464 4819 5172 6097 7341 8565 9348 9801 10474 11483
55363 11483 12569 14004 16323 18883 19990 19005 17274 16356 16358 16649 17164 18141 19334 20312 21082 21836 22563
55346 22563 23303 24175 24797 24311 22368 19549 16616 14052 12403 12053 12318 11747 9858 7772 6713 6725 7256
55329 7256 8080 9016 9539 9368 8899 8603 8563 8871 9739 10855 11377 10994 10319 9924 9709 9499 9428 9380 8884 7948
55309 7948 7215 6948 6650 6003 5370 5050 4946 5214 6280 7902 9177 9834 10436 11056 11000 10349 10434 11978 13979
55290 13979 15252 15999 16902 17699 17705 16969 15947 14730 13460 12803 13081 13516 13172 12128 11030 10101 9293 8761
55272 8761 8501 8120 7627 7741 8817 10148 10965 11358 11569 11287 10446 9864 10215 11118 12111 13608 15935 18277
55254 18277 19704 20551 21604 22523 22329 21030 19577 18515 17779 17546 18147 19236 19990 20134 20035 19971 19985 20166
55236B0166J58n48j557j727q48p6j63m62k64N6j0j36O7K54R9J5L45O20K63n02
55216A5750j100j270q96J04J220J473O28l74o66m40k79k23p4M3K1J35N63R77J018
55197A6610P57M08Kl54l63O7N98P91M16m41j276j373o43P3J34O1N88J225R38j04
55177A8114p18n15j84n0L10Q44Q18Q6n37n58l02K7P06J489J565Q17R8j23k94o38
55157B0955o08M7P66J139J376J479J052K64q4R2l1o92j110r68j026j587j784j110
55139A8170m35m72n24K46J243J343N73j77m81m79k26J96L91K37K29O45R64P91
55121B2234O39J068J652J609R29J23n80j136j196n48L40Q08P40L42l48j242j963
55104B3471k248k159j638m42J045J800J448Q49Q17R90O91J37l1J50K44L48Q29
$$ plain form
55236 20166 20324 19776 18219 16492 15644 15568 15405 14943 14679 14735 14725 14589 14656 14910 15009 15024 15369 15989 16252 15750
55216 15750 14650 13380 12484 12588 13808 15281 15909 15535 14869 14429 14150 13927 13853 13896 13917 14052 14615 15592 16610
55197 16610 17367 17775 17777 17423 17060 17127 17725 18516 18932 18491 17215 15842 15199 15272 15406 15467 16055 17280 18218 18114
55177 18114 17396 16881 16697 16647 16957 17801 18619 18705 18168 17610 17308 17335 18041 19530 21095 21912 22010 21887 21593 20955
55157 20955 20347 20394 21160 22299 23675 25154 26206 26470 26386 26478 26447 25755 24645 23677 22651 21064 19280 18170
55139 18170 17735 17263 16739 16985 18228 19571 20144 19967 19486 19007 18781 18977 19368 19605 19834 20479 21443 22234
55121 22234 22873 23941 25593 27202 28131 28254 27674 26538 25342 24794 25134 25942 26682 27024 26676 25434 23471
55104 23471 21223 19064 17426 16984 18029 19829 21277 22126 22943 23933 24624 24761 24730 24880 25124 25472 26301
55087B6301J460J610J180O49L11P1j06q4J36L71N29O50Q31J173J611J742J244
55070C9679N09L81J099J925K031J273M0j191j896j750r89k29K49N54O14K51k27
55053D2323k35K08M98M14K81J38l25r13r25k67L67N79O33N89R2o90r90o13j85
55034D0979j1K55N93M91J01K36Q44R12L44L43J234J581M97q10r81n72p20j095
55016D4221p75r7K5j67J53P27P22L52M63Q90P52J45k4K71Q6q35j614j619j166
54997D2510o99k45J22R3l00o52p28o05l19O7K52M6k44l05l35n29n05O1P24Q92
54977C9301Q15J091J639J943K082K533L209L504L207K643K090J660J486J492J371
54962G0066J316K157L972N321M974L746L443M372N339N814O593Q201J0090J1789
$$ plain form
55087 26301 27761 29371 30551 31200 31511 31582 31476 31392 31528 31899 32428 33078 33909 35082 36693 38435 39679
55070 39679 40188 40569 41668 43593 45624 46897 46937 45746 43850 42100 41111 40882 41131 41685 42299 42550 42323
55053 42323 42088 42296 42794 43208 43489 43627 43302 42389 41464 41197 41564 42143 42776 43365 43457 42767 41777 41164 40979
55034 40979 40968 41223 41816 42307 42408 42644 43488 44400 44744 45087 46321 47902 48399 47589 46608 46036 45316 44221
55016 44221 43446 43349 43374 43207 43360 44087 44809 45161 45624 46514 47266 47411 47387 47658 47744 46909 45295 43676 42510
54997 42510 41811 41566 41688 41781 41481 40829 40101 39496 39177 39244 39496 39542 39298 38993 38658 38129 37624 37685 38409 39301
54977 39301 40116 41207 42846 44789 46871 49404 52613 56117 59324 61967 64057 65717 67203 68695 70066
54962 70066 71382 73539 77511 82832 87806 91552 94995 99367 104706 110520 117113 125314 135404 147193
54948A47193J3664J5897J7759J8429J7875J6341J3598R262L554k638q301j2767
54936B49866j5880j7859j8841j8650j7197j4965j2725j0944r675q728p696o143
54924I0563m192k548j610j038n37m43q63r87j23J099J557J314J503K728M589O615
54908I7627Q694J0618J2110J3403J4975J6651J7690J7693J6717J4539J0652N155
54896B56524r92o737j1386j4464j5879j6267j6490j6656j6138j4555j2230r774
54884A04956p704o362n587m690l321k125j872k245k278j785j407j352j116n15
54870F2597j13l61j069j806k234k059j320p12q90j463j549j135r67j127q48kM18
54853D5360k26j216j531j163p74o65o47m86q2M50O17n9j216j787j273l26K52M67
$$ plain form
54948 147193 160857 176754 194513 212942 230817 247158 260756 270018 273572 270934 262633 249866
54936 249866 233986 216127 197286 178636 161439 146474 133749 122805 113130 104402 96706 90563
54924 90563 86371 83823 82213 81175 80638 80195 79332 78345 78222 79321 80878 82192 83695 86423 91012 97627
54908 97627 106321 116939 129049 142452 157427 174078 191768 209461 226178 240717 251369 256524
54896 256524 255532 248795 237409 222945 207066 190799 174309 157653 141515 126960 114730 104956
54884 104956 97252 90890 85303 80613 77292 75167 73295 71050 68772 66987 65580 64228 63112 62597
54870 62597 62484 62123 61054 59248 57014 54955 53635 52923 52033 50570 49021 47886 46919 45792 44944 44942 45360
54853 45360 45134 43918 42387 41224 40450 39785 39138 38652 38570 39020 39637 39578 38362 36575 35302 34976 35228 35695
54835C5695P06Q89P27M14M03O73P67N51M34P44J233J422J227J065J183J225O65
54818E0023l90j210j306q74k97L37R17J122R58J033J744K621L034L135L462M020
54802F8329M500N053O054P309Q313R113J0144J1435J2805J4576J7086J9537K0405
54789B14659J9094J6262J2509P824K464k737p330j1502j4967j6656j6164j4629
54777A88827j3366j2392j1044r395q088p144n924m244k737j913j469q39l9M32
54763A10665M32N66J541L302N151O671Q131R819J1517J2984J4520J6531J8884
54750B20714K1203K3423K5420K6342K5133K1581J6254R582J732o668j4436k0568
54738C49712k4523k6050k5458k3894k2518k1252j9208j6274j3459j1564j0385
$$ plain form
54835 35695 36401 37290 38017 38431 38834 39507 40274 40825 41259 42003 43236 44658 45885 46950 48133 49358 50023
54818 50023 49633 48423 47117 46243 45946 46283 47200 48322 49280 50313 52057 54678 57712 60847 64309 68329
54802 68329 72829 77882 83936 91245 99558 108671 118815 130250 143055 157631 174717 194254 214659
54789 214659 233753 250015 262524 270348 272812 270075 262745 251243 236276 219620 203456 188827
54777 188827 175461 163069 152025 142630 134542 127398 121474 117230 114493 112580 111111 110272 110233 110665
54763 110665 111097 111663 113204 116506 121657 128328 136459 146278 157795 170779 185299 201830 220714
54750 220714 241917 265340 290760 317102 342235 363816 380070 389652 391384 384716 370280 349712
54738 349712 325189 299139 273681 249787 227269 206017 186809 170535 157076 145512 135127
54727A35127r416q516p568o330m931l934l571l455l242k967k622k093j590j496
54713G3396j588j262n91l77r15j529j616j249n21P34K064K325J210qq2N56O15
54696G1162k38j202j624j446p50L52J334J572J151P63P60P56L28k79l86K80J154
54679G3687J409R11L86M11O37M37RJ53J045J975K403K541K745L035L430M069M698
54662A03981M696L974L240L062L230L275L105K777K316K098K684L953N007N412
54648A52810N837O958Q465R783J1114J2960J5124J6938J8208J9140J9571J8874
54636C15782J6587J2696P450J379m729j0217j4800j8193j9946k0064j9362j8678
54624B27905j7983j6708j4750j2630j0836r432q259p141o021n067m448l907k960
$$ plain form
54727 135127 125711 117195 109627 103297 98366 94432 90861 87406 84164 81197 78575 76482 74892 73396
54713 73396 71808 70546 69955 69578 68663 67134 65518 64269 63748 64482 66546 68871 70081 70073 69991 70547 71162
54696 71162 70924 69722 68098 66652 65902 66254 67588 69160 70311 71074 71834 72590 72918 72639 72253 72533 73687
54679 73687 75096 76007 76393 76804 77441 77878 77887 78040 79085 81060 83463 86004 88749 91784 95214 99283 103981
54662 103981 108677 112651 115891 118953 122183 125458 128563 131340 133656 135754 138438 142391 147398 152810
54648 152810 158647 165605 174070 183853 194967 207927 223051 239989 258197 277337 296908 315782
54636 315782 332369 345065 352515 353894 349165 338948 324148 305955 286009 265945 246583 227905
54624 227905 209922 193214 178464 165834 154998 145566 137307 130166 124145 119078 114630 110723 107763
54611A07763j652o12j26K43P32Q63L30k24q9L40J82n58j071j019r32j319k095
54594A00756k898l364l170k395j750j821k126j672n02J46n83j978k686k285j532
54579G2140j277j618k077k220j950j439r27o59p67j092j203q46k92jN6L24Q76
54562E7028J154P56Q1j45K76R81J560J775J477P58P9j28M1J66J22J89O07J318
54544F8095K159L004L657L866L623L344L589M540N768O631O915O982P296P932
54530A37401Q669R249R362Q619O953M823K655L46k243m608o065o807p674q849
54516A51831r591r423q773q173p481o404n147m105l320k646k102j719j467j562
54502G9918k314l356l584k368m31R30J155O18m4l80k01K79N64M28J88K10M51O56
$$ plain form
54611 107763 106111 105499 105373 105616 106348 107211 107541 107317 107228 107568 107750 107192 106121 105102 104170 102851 100756
54594 100756 97858 94494 91324 88929 87179 85358 83232 81560 81058 81204 80621 78643 75957 73672 72140
54579 72140 70863 69245 67168 64948 62998 61559 60632 59973 59206 58114 56911 56065 55773 55772 55828 56152 57028
54562 57028 58182 58938 59019 58874 59150 60131 61691 63466 64943 65701 65780 65652 65693 65859 65981 66170 66777 68095
54544 68095 70254 73258 76915 80781 84404 87748 91337 95877 101645 108276 115191 122173 129469 137401
54530 137401 146070 155319 164681 173300 180253 185076 187731 188077 185834 181226 175161 168354 160680 151831
54516 151831 142240 132817 124044 115871 108390 101986 96839 92734 89414 86768 84666 82947 81480 79918
54502 79918 77604 74248 70664 68296 67865 68795 69950 70568 70524 70144 69943 70222 70786 71214 71402 71612 72063 72719
54484G2719O81M72J22K6M65R56O99j81o22j43M96N78M47O04P02L38R6O63J496
54465H0614J389J92j049j522j308p81j96R1j32m70l32J52L27Q6K1L81O02J69o24
54446G7610j092r88o16l12r1J95M36J72p97j814j841p52L43M46j75o06n95n71
54428F8952o98o24j86K59L27L1l98q03j141j344j172l79P81J468J128M67P19J933
54410F9320K777K368J345O72L62J58N03J783L226L690L145K418J863J337J109
54395I6076J633K521K865K570K375K528K422J654N15o32j642k121j636n51R8j96
54379A08479j017j901k786l407l154j992q50o26j271k138k676k550j612k18P97
54364H3078Q48J50o13r46p86m61m55r39j416j209k87O44R38N82K1k45K0N96J005
$$ plain form
54484 72719 73400 73872 73994 74020 74485 75441 76140 75959 75337 75194 75690 76268 76715 77319 78021 78359 78455 79118 80614
54465 80614 82003 82195 81146 79624 78316 77535 77339 77430 77298 76828 76496 76648 76975 77061 77082 77463 78065 78234 77610
54446 77610 76518 75530 74914 74602 74511 74706 75142 75314 74517 72703 70862 70110 70453 70899 70724 70118 69523 68952
54428 68952 68254 67630 67444 67703 68030 68061 67663 66860 65719 64375 63203 62824 63605 65073 66201 66668 67387 69320
54410 69320 72097 74465 75810 76482 76844 77002 77505 79288 82514 86204 89349 91767 93630 94967 96076
54395 96076 97709 100230 103095 105665 108040 110568 112990 114644 115159 114527 112885 110764 109128 108577 108675 108479
54379 108479 107462 105561 102775 99368 96214 94222 93372 92746 91475 89337 86661 84111 82499 82281 83078
54364 83078 83926 84076 83463 82517 81731 81270 80815 79876 78460 77251 76964 77608 78546 79128 79149 78904 78924 79520 80525
54345H0525J138J453K148K616K307J713J738K345K676K380J880J445R31N18O06
54330A06419Q20K23j122j892j361n68q32j951k725k688k356k135j969j922k247
54315H3694k807l116l098l217l596l611k694j271l85m16o56l09M20N73k74j438
54299E7799j945j598r78o29n88o00n15m32m99o32m76J04O56O21J61j15k05p61
54281D9368j779k175j233K38J015J049J088J263J118P12N57N90K58l18l18M15
54265E1848R86O89p7m98l37P8L57L25J22J02L31K90l89j123j011j43M49K16l23
54246E1892m58q2N67J221J511J141L76k17m87o72p06k98L46O03L88K47M47P37
54228E6556J035J497J733R41q02k201k174j026J45O06K42o84j575j806j308n53
$$ plain form
54345 80525 81663 83116 85264 87880 90187 91900 93638 95983 98659 101039 102919 104364 105295 105813 106419
54330 106419 107239 107462 106340 104448 103087 102519 101687 99736 97011 94323 91967 89832 87863 85941 83694
54315 83694 80887 77771 74673 71456 67860 64249 61555 60284 59899 59483 58827 58518 58938 59511 59237 57799
54299 57799 55854 54256 53278 52649 52061 51461 50946 50514 50015 49383 48907 49011 49667 50288 50449 50334 50129 49368
54281 49368 47589 45414 44181 44419 45434 46483 47571 48834 49952 50664 51221 51811 52069 51751 51433 51848
54265 51848 52834 53523 53446 52948 52611 52689 53046 53371 53493 53595 53926 54216 53827 52704 51693 51550 51999 52215 51892
54246 51892 51434 51352 51919 53140 54651 55792 56168 55951 55464 54792 54086 53788 54134 54737 55125 55372 55819 56556
54228 56556 57591 59088 60821 61762 60960 58759 56585 55559 55704 56310 56552 55868 54293 52487 51179 50626
54212E0626Q7M54K96l96p95OJ554K336J743P08J00l16q63j062n82q9k64p14p82
54193E2047o63q05p91J18J615K420J729Mj587k085j398l75k0l27l26N03J435J529
54175E3023Q36M5n77j214j849k167j969j291l67L31M44K68M84J131J546J515J604
54158E1793J943J711M91p23p71N8N85L91qj80r9K41O80O30k44j294j572j016l34
54139E2282K0O5j43m51l53L74R83N46p15j602j417n35M01J094J317Q08l05j378
54121E0991j783j351l62O13J024P73K86q7m72j018j397j204n77J5L28L93K86J96
54103D6654L95P49O93O4m79l14L30Q88J224J332R11k0o00j28Q15J081M81k61o76
54084E3139p97n12L05J082R79K6r83j586j866j675p48M57R90P71O72J091J303
$$ plain form
54212 50626 50713 51167 51463 51067 50272 50278 51832 54168 55911 56619 56719 56403 55540 54478 53896 53807 53543 52829 52047
54193 52047 51384 50579 49788 49906 51521 53941 55670 55674 54087 52002 50604 50229 50209 49882 49556 50059 51494 53023
54175 53023 53859 53904 53327 52113 50264 48097 46128 44837 44470 44801 45245 45513 45997 47128 48674 50189 51793
54158 51793 53736 55447 55938 55215 54444 54502 55087 55478 55470 55290 55191 55432 56112 56742 56498 55204 53632 52616 52282
54139 52282 52302 52367 52224 51773 51420 51794 52777 53323 52608 51006 49589 49054 49455 50549 51866 52674 52369 50991
54121 50991 49208 47857 47495 48108 49132 49905 50191 50104 49632 48614 47217 46013 45436 45451 45779 46172 46458 46654
54103 46654 47049 47798 48491 48555 48076 47762 48092 48980 50204 51536 52447 52427 51827 51699 52514 53595 54076 53815 53139
54084 53139 52342 51830 52135 53217 54196 54222 53239 51653 49787 48112 47364 47821 48811 49582 50254 51345 52648
54067E2648P20m9PR19J739J688R56M02N98J181J303Q05N18J004J554J172J01m97
54049F6769k09K86M43M93P26J070J589K509L471L646K933K287K454L089L530L715
54033I8801L878L984M095M718O085P470P865P201O349O077O324O495O059M992
54019A80393L802L112L031L081K810K321K031K094K210J949J107j45j447k592
54005B03757l561m269m543m500m622n081n352m934m155l680l503l125k610k587
53991A47235l140l472l043k323k046k201k227j881j459j359j668k062j975j145
53977A17234p8L14k34r49q46J65J199J320N46j45J34J139J773J533J097J107J065
53960A26374J66j160j655j039l49l02l96l7M36N42O57J379K340K588J975J414
$$ plain form
54067 52648 53368 53319 53326 54245 55984 57672 58628 59030 59628 60809 62112 62917 63435 64439 65993 67165 67266 66769
54049 66769 66560 66846 67289 67782 68508 69578 71167 73676 77147 80793 83726 86013 88467 91556 95086 98801
54033 98801 102679 106663 110758 115476 121561 129031 136896 144097 150446 156523 162847 169342 175401 180393
54019 180393 184195 187307 190338 193419 196229 198550 200581 202675 204885 206834 207941 207796 206349 203757
54005 203757 200196 195927 191384 186884 182262 177181 171829 166895 162740 159060 155557 152432 149822 147235
53991 147235 144095 140623 137580 135257 133211 131010 128783 126902 125443 124084 122416 120354 118379 117234
53977 117234 117156 117470 117236 116287 115441 115606 116805 118125 118671 118526 118660 119799 121572 123105 124202 125309 126374
53960 126374 126540 125380 123725 122686 122337 122035 121639 121602 122038 122580 123237 124616 126956 129544 131519 132933
53944A32933J644K345K749K663K591K996L800M668N484O239O528N704L741J548
53930A85633Mr99k084l258l826l347k081m91J148K555L350L352K815K249K210
53915A87230K980M135M800M751M951O324Q308R488R455R112R113R055Q449P578
53901B85729O897O268N242L674J718k84j773k376k486k848l496l764l508l417
53887B85576l920m617n233o190p618q673q568p737p222p338p574p426o743n630
53873A91087m541m146m570n109n149m887m688m403l854l488l693l937l461k537
53859A32624k194k714l254l040k303j803j919k304k286j644j081j596l108m193
53845I9185l651j991p05m50o11n37l00j98k26k63l23l69k79j35k20n53p46m99
$$ plain form
53944 132933 134577 136922 139671 142334 144925 147921 151721 156389 161873 168112 174640 180344 184085 185633
53930 185633 185637 184638 182554 179296 175470 172123 170042 169551 170699 173254 176604 179956 182771 185020 187230
53915 187230 190210 194345 199145 203896 208847 215171 223479 232967 242422 251534 260647 269702 278151 285729
53901 285729 292626 298894 304136 307810 309528 309244 307471 305095 302609 299761 296265 292501 288993 285576
53887 285576 281656 277039 271806 265616 257998 249325 240757 233020 225798 218460 210886 203460 196717 191087
53873 191087 186546 182400 177830 172721 167572 162685 157997 153594 149740 146252 142559 138622 135161 132624
53859 132624 130430 127716 124462 121422 119119 117316 115397 113093 110807 109163 108082 106486 103378 99185
53845 99185 95534 93543 92838 92388 91777 91240 90940 90742 90516 90253 89930 89561 89282 89147 88927 88374 87628 87129
53827H7129l7J65m7k86m4P15J476J783J765J800J821J450P61K84J24j82o82o78
53809I7317J58J069J284J163J526K341K974L354L867M360M223L483K940L091L668
53794A36818M352N175O076O676O712O261N448M444L741L725L988L773L112K779
53780B03080K886K567J419L83L62P08L2j733l098k938j847j246j694k615l413
53765A92853m133m878n169m551l544l222l716l903k995j680j073j178j268j256
53751A50287j564j920j526n14K9k12k33N42J112M02j005j723j536j394j779k182
53735A36784k182j994j846j607j356j531k124k305j411%O19j43j472k008j183
53720A16241L59J577K067K189K308K275J831J109M65J0k97k67L10J211J884K121
$$ plain form
53827 87129 87092 87257 87210 86924 86880 87595 89071 90854 92619 94419 96240 97690 98451 98735 98859 98677 97995 97317
53809 97317 97475 98544 99828 100991 102517 104858 107832 111186 115053 119413 123636 127119 130059 133150 136818
53794 136818 141170 146345 152421 159097 165809 172070 177518 181962 185703 189428 193416 197189 200301 203080
53780 203080 205966 208533 209952 210335 210697 211405 211437 209704 206606 203668 201821 200575 198881 196266 192853
53765 192853 188720 183842 178673 174122 170578 167356 163640 159737 156742 155062 153989 152811 151543 150287
53751 150287 148723 146803 145277 144763 144792 144580 144347 144889 146001 146403 145398 143675 142139 140745 138966 136784
53735 136784 134602 132608 130762 129155 127799 126268 124144 121839 120428 120428 121047 120904 119432 117424 116241
53720 116241 116600 118177 120244 122433 124741 127016 128847 129956 130421 130431 130134 129867 130177 131388 133272 135393
53704A35393K163K145J872J349J087J599K758L945M614M577L947L083K434K157
53690A73123J956J470P42J93J82P43J611K289K344J831J399J581K121K220J452
53675A95257K11p81j100p43M8R26J531J634J208L85m81r00o32p7M8m78j144j364
53657A93548j097o95l62j10N7Q8K1q8k24k97j29K36M17J46l61o55n30rQ51J775
53637A92582K115J456K91l94k46K05M78P00J055J232R32N48P93J746K722L102
53621B09317K910K503K041J512J056R85J426K129K722L039L135L042K782K593
53607B41192K850L555M107L929L238K889L428M491N276N364M925M404M160M362
53593B98170M950N602N906N661N076M550M287M199M180M242M276L938L110K295
$$ plain form
53704 135393 137556 139701 141573 142922 144009 145608 148366 152311 156925 161502 165449 168532 170966 173123
53690 173123 175079 176549 177291 177484 177666 178409 180020 182309 184653 186484 187883 189464 191585 193805 195257
53675 195257 195468 194687 193587 192844 192892 193818 195349 196983 198191 198576 198095 197195 196563 196486 196534 196056 194912 193548
53657 193548 192451 191756 191394 191284 191341 191429 191450 191362 191138 190841 190712 190948 191365 191511 191150 190495 189965 189956 190807 192582
53637 192582 194697 196153 196444 196050 195804 196009 196487 197187 198242 199474 200406 200954 201747 203493 206215 209317
53621 209317 212227 214730 216771 218283 219339 220324 221750 223879 226601 229640 232775 235817 238599 241192
53607 241192 244042 247597 251704 255633 258871 261760 265188 269679 274955 280319 285244 289648 293808 298170
53593 298170 303120 308722 314628 320289 325365 329915 334202 338401 342581 346823 351099 355037 358147 360442
53579C60442K102K412K577K440K505K929L090K571J908J746J822J483Q47N52O63
53564C90089O48L58K18M56Q36J192J539J625J127L43j9J92N26Q45J434K074J997
53547D05480J079K16P7K66J93mJJ17L27J111K569L800L997L565L369L343K861
53530D32367K098J912K531L319L923M661N640O377O632O876P553Q381Q863R059
53516E10192R468J0361J1568J2712J3461J3662J3476J3357J3702J4505J5390J5951
53504F67805J6124J6242J6710J7668J8966K0425K1931K3270K4178K4618K4827
53493H92764K4999K5134K5173K5000K4346K3143K2009K1756K2228K2292K1324
53482A150168K0157J9928K0568K1125K1199K1280K1763K2340K2467K1871K0623
$$ plain form
53579 360442 362544 364956 367533 369973 372478 375407 378497 381068 382976 384722 386544 388027 388874 389426 390089
53564 390089 390737 391095 391313 391769 392605 393797 395336 396961 398088 398431 398412 398604 399130 399975 401409 403483 405480
53547 405480 406559 406775 406852 407118 407311 407307 407308 407425 407752 408863 411432 415232 419229 422794 426163 429506 432367
53530 432367 434465 436377 438908 442227 446150 450811 456451 462828 469460 476336 483889 492270 501133 510192
53516 510192 519660 530021 541589 554301 567762 581424 594900 608257 621959 636464 651854 667805
53504 667805 683929 700171 716881 734549 753515 773940 795871 819141 843319 867937 892764
53493 892764 917763 942897 968070 993070 1017416 1040559 1062568 1084324 1106552 1128844 1150168
53482 1150168 1170325 1190253 1210821 1231946 1253145 1274425 1296188 1318528 1340995 1362866 1383489
53471A383489J9153J8141J7919J7942J7272J5610J3532J1716J0395R452Q664P689
53459A550974O301M750L578K948K275P26k048n542q704j0732j1766j2584j3639
53446A506537j4683j5545j6714j8573k0497k1379k1016k0316k0185k0762k1749
53435A295118k2864k3765k4072k3763k3293k3050k2823k1964k0039j7372j4957
53424A057156j3646j3287j2861j1662j0048q700p571o080m165k482j522r67j23
53411I64042J333L104M660N849P212R489J2621J5550J7287J7876J8071J8476J9324
53398A114894K0745K2513K3945K4671K5365K7053K9828L2857L5522L7907M0171
53387A435471M2180M3843M5288M6576M7724M8964N0448N1820N2694N3436N4747
$$ plain form
53471 1383489 1402642 1420783 1438702 1456644 1473916 1489526 1503058 1514774 1525169 1534621 1543285 1550974
53459 1550974 1557275 1562025 1565603 1568551 1570826 1571552 1569504 1563962 1555258 1544526 1532760 1520176 1506537
53446 1506537 1491854 1476309 1459595 1441022 1420525 1399146 1378130 1357814 1337629 1316867 1295118
53435 1295118 1272254 1248489 1224417 1200654 1177361 1154311 1131488 1109524 1089485 1072113 1057156
53424 1057156 1043510 1030223 1017362 1005700 995652 986952 979381 973301 969136 966654 965132 964165 964042
53411 964042 965375 968479 973139 978988 986200 995689 1008310 1023860 1041147 1059023 1077094 1095570 1114894
53398 1114894 1135639 1158152 1182097 1206768 1232133 1259186 1289014 1321871 1357393 1395300 1435471
53387 1435471 1477651 1521494 1566782 1613358 1661082 1710046 1760494 1812314 1865008 1918444 1973191
53376A973191N6430N7421N7232N6591N6271N5975N4905N2904N0517M8128M5433
53365B564998M1784L6888L1306K6197K2365J9524J6707J3328R534N707K010j544
53353B788804n048q710j2566j6246j9392k2211k5291k9052l3674l9156m4863m9407
53341B483188n1799n2501n2597n2200n0676m8288m6391m5662m5290m4390m3323
53330A950071m2985m3409m3766m3342m2087m0415l8729l7030l4999l2691l0827
53319A519791k9759k8478k5683k1720j8359j6587j5709j4941j4576j4985j5558
53308A303436j5471j4672j3410j1581r299p407o571o353n889m980l867k498p72
53295A200666Q72J885K296K459K533K758L740N791Q352J0660J2609J4454J6176
$$ plain form
53376 1973191 2029621 2087042 2144274 2200865 2257136 2313111 2368016 2420920 2471437 2519565 2564998
53365 2564998 2606782 2643670 2674976 2701173 2723538 2743062 2759769 2773097 2782631 2788338 2790348 2788804
53353 2788804 2783756 2775046 2762480 2746234 2726842 2704631 2679340 2650288 2616614 2577458 2532595 2483188
53341 2483188 2431389 2378888 2326291 2274091 2223415 2175127 2128736 2083074 2037784 1993394 1950071
53330 1950071 1907086 1863677 1819911 1776569 1734482 1694067 1655338 1618308 1583309 1550618 1519791
53319 1519791 1490032 1461554 1435871 1414151 1395792 1379205 1363496 1348555 1333979 1318994 1303436
53308 1303436 1287965 1273293 1259883 1248302 1239003 1231596 1225025 1218672 1212783 1207803 1203936 1201438 1200666
53295 1200666 1201538 1203423 1205719 1208178 1210711 1213469 1217209 1223000 1231352 1242012 1254621 1269075 1285251
53282A285251J7762J9691K2361K5273K7359K7975K7302K6066K5211K5248K5591
53271A555090K5062K3449K1752K0546J9072J6669J4127J2506J1528J0249Q624
53260A738674P175N678L662J681O52P6j522m400p230r109j0592j2352j4135j5615
53246A682643j7166j9186k1363k3233k4785k6063k6813k6981k7013k7209k7241
53235A415590k6714k5821k5099k4836k4874k4737k3886k2284k0728k0133k0476
53224A156002k0893k0861k0675k0753k1028k1162k0837j9840j8429j7482j7575
53213I36467j7920j7174j5369j4040j4174j5066j5657j6000j6646j7412j7705
53202G59304j7590j7623j7917j8039j7687j6873j5671j4279j3142j2551j2271
$$ plain form
53282 1285251 1303013 1322704 1345065 1370338 1397697 1425672 1452974 1479040 1504251 1529499 1555090
53271 1555090 1580152 1603601 1625353 1645899 1664971 1681640 1695767 1708273 1719801 1730050 1738674
53260 1738674 1745849 1751527 1755189 1756870 1757522 1757598 1756076 1751676 1744446 1735337 1724745 1712393 1698258 1682643
53246 1682643 1665477 1646291 1624928 1601695 1576910 1550847 1524034 1497053 1470040 1442831 1415590
53235 1415590 1388876 1363055 1337956 1313120 1288246 1263509 1239623 1217339 1196611 1176478 1156002
53224 1156002 1135109 1114248 1093573 1072820 1051792 1030630 1009793 989953 971524 954042 936467
53213 936467 918547 901373 886004 871964 857790 842724 827067 811067 794421 777009 759304
53202 759304 741714 724091 706174 688135 670448 653575 637904 623625 610483 597932 585661
53191E85661j2002j1909j2250j2755j2967j3014j3442j4314j5021j5070j4517
53180D38400j3545j2100j0308q832q361q740r008q513p699p477p931q146p445
53167C20295o272n447n028m563m149m396n317o036n902n205m518l955l414l039
53153B53054k937k919k909l185l734l886l102j850j081j112j554k039k374k170
53139B18202j095L64J083N07o98j424j280p87n97q30j092j044q17p78q87o07L27
53122B08547J384J775J409R30R14J367J977K395K283J491L45n37q80r50j074j254
53106B20122j425j714k219k724k928k842k749k833l046l268l408l387l201k971
53092A81407k735k330j683j157j238j842k308k270k149k480l099l435l418l474
$$ plain form
53191 585661 573659 561750 549500 536745 523778 510764 497322 483008 467987 452917 438400
53180 438400 424855 412755 402447 393615 385254 376514 367506 358993 351294 343817 335886 327740 320295
53167 320295 314023 308576 303548 298985 294836 290440 285123 279087 273185 267980 263462 259507 256093 253054
53153 253054 250117 247198 244289 241104 237370 233484 230382 228532 227451 226339 224785 222746 220372 218202
53139 218202 217107 217471 218554 219061 218363 216939 215659 214872 214275 213445 212353 211309 210492 209714 208827 208220 208547
53122 208547 209931 211706 213115 214045 214959 216326 218303 220698 222981 224472 224817 224280 223400 222450 221376 220122
53106 220122 218697 216983 214764 212040 209112 206270 203521 200688 197642 194374 190966 187579 184378 181407
53092 181407 178672 176342 174659 173502 172264 170422 168114 165844 163695 161215 158116 154681 151263 147789
53078A47789l622l233j997n71J53J64J67N36R13P90M9j047k006k218j426k23L58
53061A34576k8o77q20n90n70p14l51P25J696J610N17o34j111j051q87o20J7Q19
53043A31907J073M49m96r34p22l91l52n31o94p32o03k99mPk20l84m53q49j794
53024A23978k743k832j839m23N33O51J42m92q31p99o81p92j026r40k81O62J383
53007A13670J639J467Q82j01j081j324n21P11J415J336J033J011J110Q92K66n18
52991A21887j188j470j112k21N80P59N55O38J137J423J012K96P3N79J318J763
52975A28029J950K232K698L107L376L737M217M322L641K622K162K446K697K341
52961A69577J803J788K219K389J904R39k03j279j979k156k110k182k139j495l79
$$ plain form
53078 147789 144167 140934 138937 138366 138519 138683 138850 139386 140299 141089 141138 140091 138085 135867 134441 134218 134576
53061 134576 134548 133871 133051 132461 131891 131177 130826 131551 133247 134857 135374 134740 133629 132578 131691 131071 131088 131907
53043 131907 132980 133429 132933 131999 131277 130886 130534 130003 129309 128577 127974 127675 127671 127678 127458 127074 126621 125772 123978
53024 123978 121235 118403 116564 116141 116674 117325 117467 116975 116144 115345 114664 113872 112846 111906 111625 112287 113670
53007 113670 115309 116776 117658 117557 116476 115152 114631 115342 116757 118093 119126 120137 121247 122139 122405 121887
52991 121887 120699 119229 118117 117896 118476 119235 119790 120428 121565 122988 124000 124296 124369 124948 126266 128029
52975 128029 129979 132211 134909 138016 141392 145129 149346 153668 157309 159931 162093 164539 167236 169577
52961 169577 171380 173168 175387 177776 179680 180619 180416 179137 177158 175002 172892 170710 168571 167076 166697
52946A66697M84O89M86J96k04o74q93p12m82o22j110j575j652j132r6R18J278
52929A61596R62N97O27P56M88j77q12j127j041n41K24Q28R65R16J203J783J948
52912A69195J245J47m29j64L90N94M68M05M24J43m68q94p72m33l58m36k09L45
52894A69193P72P96N79L80L14M79R00J388J703J835J806J474Q63M39N26O51J92
52877A84290n40o58n1N11P02J042J670J779Q90j90m48k6K45J73J51K01q2o98j100
52858A87861q37O6J289K265K309J359L79M52J474K405K710K850L256L649L691
52843B15178L674M011M397M110L043J854J022J70j294l124m341m410l860l444
52829B16986l154k601k019k116k880l416l244k961l178l446k961j893j164j164
$$ plain form
52946 166697 167181 167870 168356 168552 168348 167674 166781 166069 165587 164965 163855 162280 160628 159496 159400 160318 161596
52929 161596 162558 163155 163782 164538 165026 164849 164037 162910 161869 161328 161552 162380 163345 164261 165464 167247 169195
52912 169195 170440 170587 170158 169994 170384 170978 171446 171851 172275 172418 171950 171056 170284 169851 169493 169057 168848 169193
52894 169193 169965 170761 171340 171720 172034 172513 173413 174801 176504 178339 180145 181619 182482 182921 183447 184098 184290
52877 184290 183750 183092 183041 183552 184254 185296 186966 188745 189635 189445 188997 188971 189216 189389 189540 189741 189659 188961 187861
52858 187861 187024 187090 188379 190644 192953 194312 194691 195143 196617 199022 201732 204582 207838 211487 215178
52843 215178 218852 222863 227260 231370 234413 236267 237289 237459 236165 233041 228700 224290 220430 216986
52829 216986 213832 211231 209212 207096 204216 200800 197556 194595 191417 187971 185010 183117 181953 180789
52815A80789j384j332j125j090j260j458j580j582j468j300j161j112j257j682
52801A61998k191k348k003j470j026n28P2L53k3p01j113j272j492j585j114k97
52785A45260Q1k58q22j180j452j780j964j886j740j639j429j200j353j874k011
52770A24753j188Q3O82J20j039j917k154j990j771j509r71k25J98q2o59q61p30
52753A10740r63j718k194j716p59m06j060k089k604k246j362o86o91j080j076
52738I0090m41J38l6p32j206j271j341j557j483q52m7M15M68K93q4o21r40n90
52720H0203L68J354J843J726J115J68q63j587j756j445q69j98L37M32Q9j40K37
52703H1014R08J097P31O84J540K662K983K408J754J536J478J267J042Q93N25j75
$$ plain form
52815 180789 179405 178073 176948 175858 174598 173140 171560 169978 168510 167210 166049 164937 163680 161998
52801 161998 159807 157459 155456 153986 152960 152432 152504 152857 152834 152133 151020 149748 148256 146671 145557 145260
52785 145260 145341 145083 144261 143081 141629 139849 137885 135999 134259 132620 131191 129991 128638 126764 124753
52770 124753 123565 123648 124330 124450 123411 121494 119340 117350 115579 114070 113099 112874 113072 112990 112331 111470 110740
52753 110740 109777 108059 105865 104149 103390 102984 101924 99835 97231 94985 93623 92937 92246 91166 90090
52738 90090 89649 89787 89751 89019 87813 86542 85201 83644 82161 81309 81262 81677 82145 82438 82354 81733 80793 80203
52720 80203 80571 81925 83768 85494 86609 86777 85914 84327 82571 81126 80257 80059 80396 80828 80917 80777 81014
52703 81014 81922 83019 83750 84434 85974 88636 91619 94027 95781 97317 98795 100062 101104 101997 102522 102347
52687A02347o88n37r3j84r74j781j957j599j211j057j028r19p26o89j043j637
52671H6224j903j502q98q84j454j685j007r3l2r08j830k235k363k420j992q00
52655F4218N67J229J092P87O67M94J12j64JM53O92M02k60p35m75L91R47M06q01
52636G0023j352n71P77J465J218P57P39J069J188P13k38j098j276o79J79O18L86
52619G3918j89m96j46O30J112Q54K63N7L22M86K93J38K75L01j31o06m70K86J120
52600G8017J642J755J400O83L4k16k43l15k46K15P72R04P20P88J233J536J338
52583I0017Q87O53Q57J443K136K472K179J460P08Q5l05j13P74J677J749J094O26
52566A08399Q04J221J495J777K145K212J707R61M89L85L90K01l88j185j437n28
$$ plain form
52687 102347 101659 101122 101029 100845 99871 98090 96133 94534 93323 92266 91238 90319 89593 88904 87861 86224
52671 86224 84321 82819 81921 81037 79583 77898 76891 76798 76766 75858 74028 71793 69430 67010 65018 64218
52655 64218 64785 66014 67106 67893 68560 69054 69166 69002 69003 69456 70148 70550 70290 69555 69080 69471 70418 70824 70023
52636 70023 68671 68100 68877 70342 71560 72317 73056 74125 75313 76026 75788 74690 73414 72735 72914 73532 73918
52619 73918 73729 73233 73087 73717 74829 75683 75946 76003 76325 76811 77104 77242 77517 77818 77687 77081 76611 76897 78017
52600 78017 79659 81414 82814 83497 83531 83315 83072 82757 82511 82726 83498 84402 85122 85910 87143 88679 90017
52583 90017 90904 91557 92414 93857 95993 98465 100644 102104 102812 102897 102592 102479 103253 104930 106679 107773 108399
52566 108399 109203 110424 111919 113696 115841 118053 119760 120721 121210 121595 121985 122186 121798 120613 119176 118648
52550A18648J029J892J429M13n8K03O40P66M39j85n98k42P96J768K131K008J551
52533A32630O49m67j009o68j37n0l3M20P74K17p98q87L63J783K086J168j43j073
52515A34825j366j244j102r64l82P66J580J047m81j477j116j73K67K43N31J262
52499A32216J696J248K13o01p17l50p1j79m34m30r5L00N67P18P39N39J88k5J03
52480A35625M54P51Q31P43P11R24J238J195N50l15p28m60J38O00P03N07K96M50
52462A44213R53J216P72K5j58L73J001J359J715K115J957R32l06r45j036j030
52446A53156p99M4J076J255L24o97o99K82J308J529P37o85j991k492k147j604
52430A48597j463j594j464r35m45l65n15m73j58L9l00j171k147k770k841k378
$$ plain form
52550 118648 119677 121569 122998 123411 123353 123556 124196 124962 125401 125216 124618 124376 125172 126940 129071 131079 132630
52533 132630 133279 132812 131803 131135 130998 130948 130915 131335 132109 132326 131528 130641 131004 132787 134873 136041 135898 134825
52515 134825 133459 132215 131113 130149 129767 130533 132113 133160 132679 131202 130086 129913 130180 130423 130954 132216
52499 132216 133912 135160 135373 134772 134055 133705 133634 133455 133021 132591 132496 132796 133363 134081 134820 135359 135547 135522 135625
52480 135625 136079 136830 137661 138404 139115 140039 141277 142472 143022 142707 141979 141519 141657 142257 142960 143467 143763 144213
52462 144213 145166 146382 147154 147179 147021 147394 148395 149754 151469 153584 155541 156473 156167 155222 154186 153156
52446 153156 152357 152401 153477 154732 155056 154359 153660 153942 155250 156779 157516 156831 154840 152348 150201 148597
52430 148597 147134 145540 144076 143141 142696 142331 141816 141343 141185 141224 140924 139753 137606 134836 131995 129617
52414A29617j450k05R52J464J081K22l18q5O23J154J149P83L65Pk72k66K26J037
52396A36084J706J992K024J832J141l7r21p18K39P24K21l32J18J169J494P08p1
52379A47373K41J319J975J661Q97M53O48J382K328K976K832J909R04P19J743L490
52363A72850M824M793L492K131J865K553K988K393J279O28P29J156J620K200K922
52348B08423L588M113M582M832M420L247J896J104J032J352J734K021K077J839
52334B46260J532J481J666J741J493J112R36J166J788K593L194L294L049K901
52320B74206K979K986K831L021M001N338O025N566M434L486L290M015N443O951
52306C34572P842Q094Q502R752J1482J2615J2627J2197J2479J3861J5604J6642
$$ plain form
52414 129617 128167 127962 128914 130378 131459 131681 131363 131278 131901 133055 134204 134987 135352 135359 135087 134821 135047 136084
52396 136084 137790 139782 141806 143638 144779 144742 143821 143103 143342 144066 144287 143955 144073 145242 146736 147444 147373
52379 147373 147614 148933 150908 152569 153466 153919 154567 155949 158277 161253 164085 165994 166898 167617 169360 172850
52363 172850 177674 182467 185959 188090 189955 192508 195496 197889 199168 199796 200525 201681 203301 205501 208423
52348 208423 212011 216124 220706 225538 229958 233205 235101 236205 237237 238589 240323 242344 244421 246260
52334 246260 247792 249273 250939 252680 254173 255285 256221 257387 259175 261768 264962 268256 271305 274206
52320 274206 277185 280171 283002 286023 290024 295362 301387 306953 311387 314873 318163 322178 327621 334572
52306 334572 342414 350508 359010 368762 380244 392859 405486 417683 430162 444023 459627 476269
52294D76269J6678J6420J6739J7701J8615J8938J8897J9026J9394J9492J8956
52283F77125J8144J7857J8423J9196J9156J8012J6528J5567J5093J4410J3149
52272H62660J1572R973Q425P139O503O406O040M750K749O96r98k151k505k051
52258I19208j386j235j698k361k915l243l167k734k483k843l303k889j397L99
52244H87953J834K958M019N033O060P345Q893J0365J1605J2754J3695J3974J3580
52231A000068J3202J3357J3746J3878J3782J3600J3005J1652R944Q615P782O924
52219A139555N702M250K723J073p01k517m381o216p560p904p501p328q119r638
52205A091438j1069j1871j2087j2070j2041j1909j1451j0720j0127j0009j0138
$$ plain form
52294 476269 492947 509367 526106 543807 562422 581360 600257 619283 638677 658169 677125
52283 677125 695269 713126 731549 750745 769901 787913 804441 820008 835101 849511 862660
52272 862660 874232 884205 892630 899769 906272 912678 918718 923468 926217 926913 925915 923764 921259 919208
52258 919208 917822 916587 914889 912528 909613 906370 903203 900469 897986 895143 891840 888951 887554 887953
52244 887953 889787 892745 896764 901797 907857 915202 924095 934460 946065 958819 972514 986488 1000068
52231 1000068 1013270 1026627 1040373 1054251 1068033 1081633 1094638 1106290 1116234 1124849 1132631 1139555
52219 1139555 1145257 1149507 1152230 1153303 1152602 1150085 1145704 1139488 1131928 1124024 1116523 1109195 1101076 1091438
52205 1091438 1080369 1068498 1056411 1044341 1032300 1020391 1008940 998220 988093 978084 967946
52194I67946r914r019p686o346n311m736m571m421l740k463j273r33j348j601
52180I04584j059j74Q3n35j285j483j281j168j144r82r27j374j925j687p67m85
52164H88391j635l269l973l728l520l585l215k281j812k579l966m828m796m321
52150H40883l795l344l152l337l579l456l103l097l595m073m051l722l603l864
52136G91112m301m770n237n496n203m353l465l094l296l673l857l769l575l510
52122G33513l678l940l990l712l283k859k373j767j217p96j82Q69J973K561K796
52107G13915L389M478N369N650N923O992Q809J0759J2547J4184J5502J6351J7177
52094H41045J8589K0400K1688K2048K2180K2907K4035K4681K4477K3939K3632
$$ plain form
52194 967946 958032 949013 941327 934981 929670 924934 920363 915942 912202 909739 908466 907533 906185 904584
52180 904584 903525 903351 903434 902899 901614 900131 898850 897682 896538 895556 894629 893255 891330 889643 888876 888391
52164 888391 886756 883487 879514 875786 872266 868681 865466 863185 861373 858794 854828 850000 845204 840883
52150 840883 837088 833744 830592 827255 823676 820220 817117 814020 810425 806352 802301 798579 794976 791112
52136 791112 786811 782041 776804 771308 766105 761752 758287 755193 751897 748224 744367 740598 737023 733513
52122 733513 729835 725895 721905 718193 714910 712051 709678 707911 706694 705898 705716 706585 708558 711119 713915
52107 713915 717304 721782 727151 732801 738724 745716 754525 765284 777831 792015 807517 823868 841045
52094 841045 859634 880034 901722 923770 945950 968857 992892 1017573 1042050 1065989 1089621
52083A089621K3346K2459K0923J9439J8513J7661J5991J3443J0913R040P431N469
52071A274249L310J546J85j302k962m126m490m809o023p961r459r893r979j0724
52057A207562j1936j2380j1420r841q657p797o595n142m106l400k201m64O98Q10
52043A125131J036K489M355N000M354L946M689N966O963P722Q462Q903Q836Q587
52029A206439Q369P783O567N299M675M482L944K878J878J339Q78j74j963m013
52015A248381n684o682p164p527q132r220j0860j2792j4503j5705j6699j7972
52003A115441j9457k0560k0992k1170k1636k2417k3121k3504k3635k3731k3913
51992H71305k4138k4211k3982k3520k2970k2339k1604k0998k0884k1277k1745
$$ plain form
52083 1089621 1112967 1135426 1156349 1175788 1194301 1211962 1227953 1241396 1252309 1261349 1268780 1274249
52071 1274249 1277559 1279105 1279290 1277988 1275026 1270900 1266410 1261601 1255578 1247617 1238158 1228265 1218286 1207562
52057 1207562 1195626 1183246 1171826 1161985 1153328 1145531 1138936 1133794 1129688 1126288 1124087 1123623 1124321 1125131
52043 1125131 1126167 1128656 1133011 1138011 1142365 1146311 1151000 1156966 1163929 1171651 1180113 1189016 1197852 1206439
52029 1206439 1214808 1222591 1229158 1234457 1239132 1243614 1247558 1250436 1252314 1253653 1254531 1254357 1252394 1248381
52015 1248381 1242697 1236015 1228851 1221324 1213192 1203972 1193112 1180320 1165817 1150112 1133413 1115441
52003 1115441 1095984 1075424 1054432 1033262 1011626 989209 966088 942584 918949 895218 871305
51992 871305 847167 822956 798974 775454 752484 730145 708541 687543 666659 645382 623637
51981F23637k1870k1550k0904k0056j9150j8183j6948j5331j3739j2777j2468
51970D30661j2219j1678j1084j0618r907q673p337o463n905n159m326m064m453
51957C28775m630l876k640k012k372k991l002k383j852j991k708l465l803l619
51943B87431l130k677k393k117j686j367j586k196k430j866j142j206k083k836
51929B58716k710j864r65n20o61j242j940k452k628k356j558n75k05q36j723j771
51913B34710r63l08l83p04p44o93q00p03n1P38R58N39o1n94j102j526j782k024
51895B24507k312k221j410m18k59j099j980k048j542j219j242j120o08j42k06
51880B06681n92o37j33L81L96J59L11R17J340J094M13j29j74L23J166J875J993
$$ plain form
51981 623637 601767 580217 559313 539257 520107 501924 484976 469645 455906 443129 430661
51970 430661 418442 406764 395680 385062 375155 366482 359145 352682 346777 341618 337292 333228 328775
51957 328775 324145 320269 317629 315617 313245 310254 307252 304869 303017 301026 298318 294853 291050 287431
51943 287431 284301 281624 279231 277114 275428 274061 272475 270279 267849 265983 264841 263635 261552 258716
51929 258716 256006 254142 253177 252657 251996 250754 248814 246362 243734 241378 239820 239245 239040 238204 236481 234710
51913 234710 233747 233439 233056 232352 231608 230915 230115 229412 229361 230099 231057 231596 231535 230941 229839 228313 226531 224507
51895 224507 222195 219974 218564 218146 217887 216788 214808 212760 211218 209999 208757 207637 207029 206887 206681
51880 206681 206089 205452 205319 205700 206096 206255 206566 207483 208823 209917 210330 210201 210027 210350 211516 213391 215384
51863B15384J628J346J378J349J018Q11J199J951K500K675K529J903Q34R1M42
51848B37038J442J792J039P1k91l66p87j332j311p29k43j42m7K76N85P91J321
51831B39107K357L175K814J355k1k98M04J276J801K032K155K173J991J585J080
51816B62986P23O85P65N03k27q70p41J03Q92R73L87l97j004j305j298j031o14
51799B60530k17l6j03j56P2M14M44K51N02J433K240K097J304P11M39J5m66m01
51781B69073Q9J59l58n89m7O06P59Q11J216J529J224P36P25Q89N44m3L0Q71J702
51762B79926K063K247K472K507K275K137K403L072M141N598P028P777P678P119
51748C38443O292M790K261r63m031o156p003o750n964n231m812m610m389l906
$$ plain form
51863 215384 217012 218358 219736 221085 222103 222914 224113 226064 228564 231239 233768 235671 236505 236596 237038
51848 237038 238480 240272 241311 241382 241091 240725 239938 238606 237295 236566 236323 236181 236134 236410 236995 237786 239107
51831 239107 241464 244639 247453 248808 248787 248489 248893 250169 251970 254002 256157 258330 260321 261906 262986
51816 262986 263709 264394 265159 265662 265435 264565 263824 263927 264819 265792 266179 265782 264778 263473 262175 261144 260530
51799 260530 260313 260277 260174 260018 260090 260504 260948 261199 261701 263134 265374 267471 268775 269486 269925 269940 269474 269073
51781 269073 269162 269321 268963 268374 268327 268933 269692 270503 271719 273248 274472 275208 275933 276822 277366 277323 277353 278224 279926
51762 279926 281989 284236 286708 289215 291490 293627 296030 299102 303243 308841 315869 323646 331324 338443
51748 338443 344735 349525 351786 350823 346792 340636 333633 326883 320919 315688 310876 306266 301877 297971
51734B97971l149k456k256k403k211j386m81j14j89l28o14j197j648j457r43q22
51718B76317j065r98m26R7J58k22j123k611l976m036k618r44j73k53n57r99j842
51701B54729k953l818m068l648k761j923j653j800j581o32M06P33M45K76N86J104
51685B33442J512J844K332L149M285N465O196O088N051L267J226k62n44J15O14
51670B73780J88p52j267j083q08j041j668k093j928j430j211j525j947j885j361
51655B53969r95j216j882k726l727m790n460n358m745m258m082l762k857j625
51641B06486q67j020j592j607p50K10K92o12j696k131j724q73k31k19n96o03R4
51624A92561Q78R86M55j88q23j513j750r28M17R73L97k43q6M71P70R11J198J392
$$ plain form
51734 297971 294822 292366 290110 287707 285496 284110 283629 283515 283326 282998 282384 281187 279539 278082 277139 276317
51718 276317 275252 274254 273828 273925 274083 273861 272738 270127 266151 262115 259497 258553 258380 258127 257570 256571 254729
51701 254729 251776 247958 243890 240242 237481 235558 233905 232105 230524 229892 230298 231031 231476 231752 232338 233442
51685 233442 234954 236798 239130 242279 246564 252029 258225 264313 269364 272631 273857 273595 273051 273166 273780
51670 273780 273968 273216 271949 270866 270058 269017 267349 265256 263328 261898 260687 259162 257215 255330 253969
51655 253969 252974 251758 249876 247150 243423 238633 233173 227815 223070 218812 214730 210968 208111 206486
51641 206486 205619 204599 203007 201400 200650 200860 201152 200540 198844 196713 194989 194116 193885 193666 193070 192467 192561
51624 192561 193439 194425 194880 194692 193869 192356 190606 189678 190095 191068 191465 191222 191136 191607 192377 193288 194486 195878
51606A95878J271J170J294J146M22k14k8O30R47R47J263J998K735L404M169M675
51590B21707M389L625L356L929M749N259N512N626N415M762L856K891J887Q68
51576B77831j69j285k226k363j544o60o09j061j117q58j086j645j371O2J564K290
51560B65753K659L160L341K880K594L275M269M412L807L513L745L628K696J599
51546C11331J100J190J415J446J092L61l03l66P0L03Pk74J18J053J757J670R74
51529C22944L62L64P89R72N87%l96q04j463j888j486q00j133k722m202m406l831
51512C02887l671m043m108l546k913k674k670k674k671k480j759p15j84o49j601
51497B66529k151j943j216l37K90L01k26o62n31j54j85p05j167j195q73l63L55
$$ plain form
51606 195878 197149 198319 199613 200759 201181 200967 200939 201569 202516 203463 204726 206724 209459 212863 217032 221707
51590 221707 226096 229721 233077 237006 241755 247014 252526 258152 263567 268329 272185 275076 276963 277831
51576 277831 277662 276377 274151 271788 270244 269584 268975 267914 266797 265939 264853 263208 261837 261899 263463 265753
51560 265753 268412 271572 274913 277793 280387 283662 287931 292343 296150 299663 303408 307036 309732 311331
51546 311331 312431 313621 315036 316482 317574 317935 317632 317266 317336 317639 317646 317372 317490 318543 320300 321970 322944
51529 322944 323306 323670 324459 325431 326018 326018 325622 324818 323355 321467 319981 319181 318048 315326 311124 306718 302887
51512 302887 299216 295173 291065 287519 284606 281932 279262 276588 273917 271437 269678 268963 268779 268130 266529
51497 266529 264378 262435 261219 260882 261172 261473 261247 260585 260054 259900 259715 259010 257843 256648 255775 255412 255767
51480B55767J182J793K076K331K872L554L952L806L239K607K284K433K889L325
51466B94110L614L855M046L918L307K507K030K002K052J792J277Q24N41J93m11
51451C25657j040j246q83l05Kj86p32j260j362r82o42r84j929k698k929l329m679
51434C00473o499p438o964n993n585n655n344m322l213k845l407m300m655m055
51420B30198k883j891j426j165o10L29J315J940K091K108K467L152L489K976K175
51405B44265K082K679K816J790K97o60j181k037l343m425m894n048n218n395n592
51390B16136n964o343o252n602m965m792m762m307l488k918k888k983k710k162
51376A56000j917k315l000l223k607j517o22k36j76k62n57j025j224p61K8K90
$$ plain form
51480 255767 256949 258742 260818 263149 266021 269575 273527 277333 280572 283179 285463 287896 290785 294110
51466 294110 297724 301579 305625 309543 312850 315357 317387 319389 321441 323233 324510 325334 325875 326068 325657
51451 325657 324617 323371 322488 322183 322185 321999 321267 320007 318645 317663 317021 316037 314108 311410 308481 305152 300473
51434 300473 293974 286536 279572 273579 267994 262339 256995 252673 249460 246615 243208 238908 234253 230198
51420 230198 227315 225424 223998 222833 222223 222552 223867 225807 227898 230006 232473 235625 239114 242090 244265
51405 244265 246347 249026 251842 253632 253929 253269 252088 250051 246708 242283 237389 232341 227123 221728 216136
51390 216136 210172 203829 197577 191975 187010 182218 177456 173149 169661 166743 163855 160872 158162 156000
51376 156000 154083 151768 148768 145545 142938 141421 140799 140563 140387 140125 139568 138543 137319 136558 136586 136876
51360A36876l49j294j768j751j739j781j387m20M79O86L62Q1P8K61N96R68R76
51343A30874M47q0K4N26P12N53O98J284J681J610J605K006K358K298K246K610
51327A51452K957K820K600K884L342L284K942L144L843M055L306K170J144p4j770
51312A88099l428m256m122l546l121l186l690m125l952l273k766k782k974l015
51298A39863l173l699m073l500k033o49k16o99j445j877j766j145k53N22Q11N53
51282A17221R3j22J9J58r8o38r23o36r5J11j75m90k49O36J695K328K271J613O58
51263A23377j91m95q7O10Q42K32q73j805k168j912j185l00L01L91K04J52L28M45
51245A17866J93m62j249j727j565q73r8M41P72R58R15P33P57J011Q97j3j116j283
$$ plain form
51360 136876 136527 135233 133465 131714 129975 128194 126807 126387 126866 127552 127914 127995 128073 128334 128930 129898 130874
51343 130874 131321 131241 131265 131791 132503 133056 133754 135038 136719 138329 139934 141940 144298 146596 148842 151452
51327 151452 154409 157229 159829 162713 166055 169339 172281 175425 179268 183323 186629 188799 189943 189869 188099
51312 188099 184671 180415 176293 172747 169626 166440 162750 158625 154673 151400 148634 145852 142878 139863
51298 139863 136690 132991 128918 125418 123385 122736 122520 121821 120376 118499 116733 115588 115335 115857 116668 117221
51282 117221 117314 117192 117211 117369 117271 116633 115710 115074 114979 115090 114915 114425 114176 114812 116507 118835 121106 122719 123377
51263 123377 123186 122691 122604 123214 124056 124288 123415 121610 119442 117530 116345 116045 116346 116737 116941 117093 117421 117866
51245 117866 118059 117597 116348 114621 113056 112183 112085 112526 113298 114256 115171 115904 116661 117672 118569 118556 117440 116157
51227A16157k97Q48J149P22M68Q64J392J252M25k12PO33P26K76J80P62J165P68
51209A27285K92O82J567J808J247P63P94R17Q69Q88Q66K31r14j545j038NP16R92
51191A36425J109J039P42N25N18K91m50j218j368r50m45o4K14K69J18J39N01P00
51173A38095L00k58l33k19p36j843k533k284j734j625j728j337l39O79J197J232
51157A26534J006N43k44j220j966k170j942j581j149n18J78N63N70O17R45J170
51141A21336Q31J45k44j19J38J98K02M44Q80J156J024O66M96N99N27j29j061j572
51123A25517j551j598j989k166j637r13q57j457j860j498o34J67N56M26n6l86
51107A10064j00O44J238J383J369J569K018K525K810K547J617M55k05q8L61O02
$$ plain form
51227 116157 115860 116708 117857 118579 119047 119911 121303 122555 122980 122768 122775 123408 124134 124410 124590 125352 126517 127285
51209 127285 127577 128259 129826 131634 132881 133644 134438 135355 136224 137112 137978 138209 137295 135750 134712 134717 135433 136425
51191 136425 137534 138573 139315 139840 140358 140649 140199 138981 137613 136663 136218 136154 136368 136637 136755 136894 137395 138095
51173 138095 138395 138137 137804 137585 136849 135006 132473 130189 128455 126830 125102 123765 123426 124105 125302 126534
51157 126534 127540 128083 127839 126619 124653 122483 120541 118960 117811 117293 117471 118034 118604 119221 120166 121336
51141 121336 122167 122312 122068 121949 122087 122285 122487 122931 123811 124967 125991 126657 127153 127752 128279 128150 127089 125517
51123 125517 123966 122368 120379 118213 116576 115663 114806 113349 111489 109991 109357 109524 110080 110506 110450 110064
51107 110064 109964 110608 111846 113229 114598 116167 118185 120710 123520 126067 127684 128139 127934 127846 128207 128809
51091A28809N90N44N31N09O40J200K136K942L114K670K131J870J597P34p13j973
51075A47331k346j912j141k13Q73J715J761J091M85N10R45J263J312J305J350
51060A54329J321J083O66K86J64K75L04M2k38j09L30M66J9m78l22N24J401J667
51042A61730J215L87l36o21m51o6K78N24P29Q98R40Q34O77O24P19Q91J045J170
51024A71187J242J152Q57N65N15N56K72k77l20O71K020K434J539M00K17R00J305
51007A85235O88m14q17K3J471K448K606K595L158M149M734M438L712L423M018
50992B21467N282O652P615Q003Q044Q148Q529R092R589R857R891R948J0500J1797
50978C44414J3527J5123J6568J8460K1160K4210K6985K9686L3085L7347M1689
$$ plain form
51091 128809 129399 129943 130474 130983 131623 132823 134959 137901 141015 143685 145816 147686 149283 150017 149304 147331
51075 147331 144985 143073 141932 141719 142592 144307 146068 147159 147644 148154 149099 150362 151674 152979 154329
51060 154329 155650 156733 157399 157685 157849 158124 158428 158470 158232 158123 158453 158919 158938 158460 158138 158662 160063 161730
51042 161730 162945 163332 162996 162375 161924 161858 162136 162660 163389 164287 165227 166061 166738 167362 168081 168972 170017 171187
51024 171187 172429 173581 174438 175003 175518 176074 176346 176069 175749 176420 178440 180874 182413 182813 183030 183930 185235
51007 185235 185923 185509 184692 184715 186186 188634 191240 193835 196993 201142 205876 210314 214026 217449 221467
50992 221467 226749 233401 241016 249019 257063 265211 273740 282832 292421 302278 312169 322117 332617 344414
50978 344414 357941 373064 389632 408092 429252 453462 480447 510133 543218 580565 622254
50967F22254M5375M8626N2109N5970N9844O3619O7480P1137P3660P4421P3680
50956A308175P1903O8933O4418N8637N2184M5011L6633K7339J8394J0743M138
50945A766508k092p993j3131j7168j9778k0434j8939j5998j2746r925p898p065
50933A613341p655r363j1743j4870j9022k3906k8799l3384l7801m2025m5849m9450
50921A289474n3235n6942n9509o0106n8913n6750n4353n1995m9369m5738m0807
50910G01757l5421l0829k7269k3983k0641j7833j5893j4199j2204j0284q928p754
50898D76519o180m474l290k563j766r67o60p00l63M37Q98N68J42N27J638K616
50882D62382K925K834K956L617M700N817O621P028P246P639Q472R675J0853J1690
$$ plain form
50967 622254 667629 716255 768364 824334 884178 947797 1015277 1086414 1160074 1234495 1308175
50956 1308175 1380078 1449011 1513429 1572066 1624250 1669261 1705894 1733233 1751627 1762370 1766508
50945 1766508 1764416 1756423 1743292 1726124 1706346 1685912 1666973 1650975 1638229 1628304 1620406 1613341
50933 1613341 1605686 1596323 1584580 1569710 1550688 1526782 1497983 1464599 1426798 1384773 1338924 1289474
50921 1289474 1236239 1179297 1119788 1059682 1000769 944019 889666 837671 788302 742564 701757
50910 701757 666336 635507 608238 584255 563614 545781 529888 515689 503485 493201 484273 476519
50898 476519 470339 465865 462575 460012 458246 457279 456619 455919 455556 455993 456891 457459 457601 458128 459766 462382
50882 462382 465307 468141 471097 474714 479414 485231 491852 498880 506126 513765 522237 531912 542765 554455
50868E54455J2404J3612J5592J7880J9797K1246K2718K4716K7396L0683L4543
50857G95042L9043M4324N0401N7091O4243P2034Q0715R0135R9847J09741J19962
50846A622578J30045J38892J46099J52586J59142J64838J67736J66814J62182
50837C010912J53704J40613J22735J01159P7335N2379K7549M469j5714l2790m6620
50826C595731n6422o1457o1822n8093n0719m0441k8840j7716q173r71K676J465
50814C215218m828j5266k8637m3865n9705p5034q9560j03554j16659j27569j35123
50803B415418j39163j40064j37969j32894j25203j15586j04850r3887q3520p4013
50793A268269o5041n6317m7970m0136l2636k5431j8974j3665r249n159j275K132
$$ plain form
50868 554455 566859 580471 596063 613943 633740 654986 677704 702420 729816 760499 795042
50857 795042 834085 878409 928810 985901 1050144 1122178 1202893 1293028 1392875 1502616 1622578
50846 1622578 1752623 1891515 2037614 2190200 2349342 2514180 2681916 2848730 3010912
50837 3010912 3164616 3305229 3427964 3529123 3606458 3658837 3686386 3690855 3675141 3642351 3595731
50826 3595731 3539309 3477852 3416030 3357937 3307218 3266777 3237937 3220221 3212048 3211077 3213753 3215218
50814 3215218 3210390 3195124 3166487 3122622 3062917 2987883 2898323 2794769 2678110 2550541 2415418
50803 2415418 2276255 2136191 1998222 1865328 1740125 1624539 1519689 1425802 1342282 1268269
50793 1268269 1203228 1146911 1098941 1058805 1026169 1000738 981764 968099 958850 953691 952416 954548
50781I54548M868O803P575O902N188L197J165j234l956o215p330p538p669q240
50767I48064r146j0042j0739j1294j1811j2201j2169j1555j0555r450q232o790
50755H24080n315m073k892j411J97J357K037K887M179N389O287P650J0178J3251
50741H63801J5820J8157K1635K6826L2765L8427M3927M9851N6177O2538O9018
50730A298942P5954Q3075Q9524R4637R8294J00525J01182R9996R6660R0798Q2180
50719B311767P0979N7612M2323K5218O785j1859k9303m4250n5583o2440o4533
50708B246716o2262n6423m7883l7699k7234j7688r543k788K275M892M577J543
50696A998483l946j2203k3454l6653m9608o0509o8916p5114p9049q0329p8979
$$ plain form
50781 954548 959416 966219 973794 980696 985884 989081 990246 989012 985056 978841 971511 963973 956304 948064
50767 948064 938918 928876 918137 906843 895032 882831 870662 859107 848552 839102 830870 824080
50755 824080 818765 814692 811800 810389 810586 811943 813980 816867 821046 826435 832722 840372 850550 863801
50741 863801 879621 897778 919413 946239 979004 1017431 1061358 1111209 1167386 1229924 1298942
50730 1298942 1374896 1457971 1547495 1642132 1740426 1840951 1942133 2042129 2138789 2229587 2311767
50719 2311767 2382746 2440358 2482681 2507899 2514684 2502825 2473522 2429272 2373689 2311249 2246716
50708 2246716 2184454 2128031 2080148 2042449 2015215 1997527 1987984 1985196 1987471 1992363 1996940 1998483
50696 1998483 1994537 1982334 1958880 1922227 1872619 1812110 1743194 1668080 1589031 1508702 1429723
50685A429723p5644p1051o5547n9166n2007m4445l7085l0369k4203j8197j2338
50674I39671p086k608J731O745J2555J8691K4780L0625L5751L9453M1387M1635
50662A183330M0344L7727L4471L1486K9114K6983K4828K2926K1524K0326J8869
50651A491928J7089J5161J3053J0572P727M844K476J245J475K821M595O588R208
50638A588782J2683J6576K0283K3650K6611K8652K9146K8062K5933K3248K0154
50627A843780J6608J2474P642K370k700p111j0886j3886j5368j4804j2918j1063
50615A794138r551p297l322J963P235J1439J4136J5219J4852J3535J1724R403
50603A873474O267K316k097o832j2338j9238k7545l6425m4777n1971n7906o2427
$$ plain form
50685 1429723 1354079 1283028 1217481 1158315 1106308 1061863 1024778 994409 970206 952009 939671
50674 939671 932585 929977 931708 938453 951008 969699 994479 1025104 1060855 1100308 1141695 1183330
50662 1183330 1223674 1261401 1295872 1327358 1356472 1383455 1408283 1431209 1452733 1473059 1491928
50651 1491928 1509017 1524178 1537231 1547803 1555530 1560374 1562850 1564095 1565570 1568391 1572986 1579574 1588782
50638 1588782 1601465 1618041 1638324 1661974 1688585 1717237 1746383 1774445 1800378 1823626 1843780
50627 1843780 1860388 1872862 1880504 1882874 1880174 1873063 1862177 1848291 1832923 1818119 1805201 1794138
50615 1794138 1784587 1777290 1773968 1775931 1783166 1794605 1808741 1823960 1838812 1852347 1864071 1873474
50603 1873474 1879741 1882057 1879960 1873128 1860790 1841552 1814007 1777582 1732805 1680834 1622928 1560501
50591A560501o5032o5395o4013o1969n9984n7897n5155n1611m7699m3930m0391
50580I47425l6807l3018k9266k5888k2814j9609j6073j2508r296o489m016j955
50568G29686k67J496L692O011P790Q952J0041J1388J2738J3926J5400J7653K0452
50555H58958K3046K5113K7164K9968L3689L7655M1005M3485M5580M7731M9682
50544A263076N0817N0936N0235M8666M5951M2383L9014L6703L5395L4723L4800
50533A732699L5863L7476L8826L9835M1306M3829M7102N0614N4583N9709O6089
50522B247931P2761P8379Q2224Q4523Q5848Q6273Q5114Q1588P5554O7443N7528
50511C105166M5600L1604J6204L55j5542l1592m7479o2099p4390q4196r1862r7127
$$ plain form
50591 1560501 1495469 1430074 1366061 1304092 1244108 1186211 1131056 1079445 1031746 987816 947425
50580 947425 910618 877600 848334 822446 799632 780023 763950 751442 742146 735657 731641 729686
50568 729686 729419 730915 734607 740618 748408 757360 767401 778789 791527 805453 820853 838506 858958
50555 858958 882004 907117 934281 964249 997938 1035593 1076598 1120083 1165663 1213394 1263076
50544 1263076 1313893 1364829 1415064 1463730 1509681 1552064 1591078 1627781 1663176 1697899 1732699
50533 1732699 1768562 1806038 1844864 1884699 1926005 1969834 2016936 2067550 2122133 2181842 2247931
50522 2247931 2320692 2399071 2481295 2565818 2651666 2737939 2823053 2904641 2980195 3047638 3105166
50511 3105166 3150766 3182370 3198574 3198929 3183387 3151795 3104316 3042217 2967827 2883631 2791769 2694642
50499B694642r8960r6563r0186q0779o9250n6232m2291k7953j3614K87J3053K3842
50487B155996L2010L7172L9110L7784L3265K5384J3605k271k1231m1207o0138
50476B249479p6615q9600r8240j02367j02792j00769r7235r2758q7781q2471p6547
50465A242304o9823o2792n6309n0605m5133l9452l3877k9028k5079k1681j8472
50454G90053j5352j2404r730p343n052k537K28K747M445N335O070P244Q778J0130
50440G82612J0964J1503J2267J3558J5218J6809J8062J9143K0438K2037K3534
50429I66145K4475K4903K5250K5744K6180K6355K6510K7034K7878K8530K8609
50418A257613K8284K8029K8150K8713K9758L1345L3366L5521L7533L9338M0983
$$ plain form
50499 2694642 2595682 2499119 2408933 2328154 2258904 2202672 2160381 2132428 2118814 2119101 2132154 2155996
50487 2155996 2188006 2225178 2264288 2302072 2335337 2360721 2374326 2372055 2350824 2309617 2249479
50476 2249479 2172864 2083264 1985024 1882657 1779865 1679096 1581861 1489103 1401322 1318851 1242304
50465 1242304 1172481 1109689 1053380 1002775 957642 918190 884313 855285 830206 808525 790053
50454 790053 774701 762297 752567 745224 740172 737635 737863 740610 745055 750390 756460 763704 772482 782612
50440 782612 793576 805079 817346 830904 846122 862931 880993 900136 920574 942611 966145
50429 966145 990620 1015523 1040773 1066517 1092697 1119052 1145562 1172596 1200474 1229004 1257613
50418 1257613 1285897 1313926 1342076 1370789 1400547 1431892 1465258 1500779 1538312 1577650 1618633
50407A618633M2467M3731M4725M5326M5213M4020M1627L8251L4160K9408K3952
50396B051513J7848J1096L464n321j5133k5413l5619m5510n4923o3453p0518p5590
50384A692441p8317p8548p6434p2323o6482n9067n0495m1583l3029k4897j6849
50373A094417q804j055O170J2838J8698K2965K4635K3103J8509J1672L674m627
50361A222195j2780k0423k7039l2242l6133l8985m0610m0564l9049l7137l5750
50350H61483l4714l3222l0922k8239k5704k3420k1191j8801j6159j3364j0842
50339F04905r135q382q010p185n574l622j966p35M10J661K820L749M760O117P458
50324E87271Q150Q194Q262Q743R329R753J0372J1531J2805J3475J3601J3931J4864
$$ plain form
50407 1618633 1661100 1704831 1749556 1794882 1840095 1884115 1925742 1963993 1998153 2027561 2051513
50396 2051513 2069361 2080457 2083921 2078600 2063467 2038054 2002435 1956925 1902002 1838549 1768031 1692441
50384 1692441 1614124 1535576 1459142 1386819 1320337 1261270 1210775 1169192 1136163 1111266 1094417
50373 1094417 1085613 1084558 1090728 1103566 1122264 1145229 1169864 1192967 1211476 1223148 1226822 1222195
50361 1222195 1209415 1188992 1161953 1129711 1093578 1054593 1013983 973419 934370 897233 861483
50350 861483 826769 793547 762625 734386 708682 685262 664071 645270 629111 615747 604905
50339 604905 595770 587388 579378 572193 566619 562997 561031 560296 560706 562367 565187 568936 573696 579813 587271
50324 587271 595421 603615 611877 620620 629949 639702 650074 661605 674410 687885 701486 715417 730281
50311G30281J6005J6872J7470J8013J8556J9061J9449J9350J8252J6262J4352
50300I23923J3328J2806J1691R565P083M934L080J246l54j320j869k746m244n867
50286I71256p157q475j0500j3162j5612j7288j8498j9672k0483k0247j9035j7802
50274G83325j7261j7117j6619j5573j4416j3535j2886j2238j1453j0486r406q345
50262F23990p234n609l091j07K245L253L240L021L030L238L558L939M224M327
50248F42024M489M924N361N285M665L898L099J944L63j123k101k782l511m139
50234F62396m313m121l969m006m140m495n312o407p162p171o577n703m684l562
50220E90774k499j719j323j211j045m34P28K128L367M297M910N142N042M918M948
$$ plain form
50311 730281 746286 763158 780628 798641 817197 836258 855707 875057 893309 909571 923923
50300 923923 937251 950057 961748 971313 978396 983330 986410 987656 987302 985982 984113 981367 977123 971256
50286 971256 964099 955624 945124 931962 916350 899062 880564 860892 840409 820162 801127 783325
50274 783325 766064 748947 732328 716755 702339 688804 675918 663680 652227 641741 632335 623990
50262 623990 616756 611147 608056 607949 610194 613447 616687 619708 622738 625976 629534 633473 637697 642024
50248 642024 646513 651437 656798 662083 666748 670646 673745 675689 676052 674929 672828 670046 666535 662396
50234 662396 658083 653962 649993 645987 641847 637352 632040 625633 618471 611300 604723 599020 594336 590774
50220 590774 588275 586556 585233 584022 582977 582543 583271 585399 588766 593063 597973 603115 608157 613075 618023
50205F18023M852M357L715L257K655J290p10k495l575m199m580m554m222m144
50191F09670m473m647m391m260m681n155n131n078n759o917p671p940q436r274
50177E25857r608q798p238n769m913m756m912m475k789m97R07R27O68J120J669
50162D77393J035q36k779l989m680n211n484n469n588o090o490o145n181m353
50148D16133m077l996l619k998k533k349k212j962j683j440j093n66r3L9j57l88
50132C87006l77RP30J482J801J467P58J97J78R19K376L983M807M514L888L909
50116D17647M515M869M733M715N120N330M714L547K568K023J593J061O09O10J306
50101D64960K463L310L190K387J934K391L295L961M327M681N091N563O261P117
$$ plain form
50205 618023 622875 627232 630947 634204 636859 638149 637439 634944 631369 627170 622590 618036 613814 609670
50191 609670 605197 600550 596159 591899 587218 582063 576932 571854 566095 559178 551507 543567 535131 525857
50177 525857 516249 507451 500213 494444 489531 484775 479863 475388 472599 472102 473009 473936 474604 475724 477393
50162 477393 478428 477592 474813 470824 466144 460933 455449 449980 444392 438302 431812 425667 420486 416133
50148 416133 412056 408060 404441 401443 398910 396561 394349 392387 390704 389264 388171 387605 387512 387551 387394 387006
50132 387006 386629 386638 387368 388850 390651 392118 392876 393073 393251 394170 396546 400529 405336 409850 413738 417647
50116 417647 422162 427031 431764 436479 441599 446929 451643 455190 457758 459781 461374 462435 463044 463654 464960
50101 464960 467423 470733 473923 476310 478244 480635 483930 487891 492218 496899 501990 507553 513814 520931
50087E20931P668P756P926Q581R230R243Q904Q887R124R150R231J0074J1456J2266
50073F50427J2072J1709J1997J2765J3442J3854J3960J3592J2890J2368J2238
50062G91314J2224J2338J2981J3952J4251J3637J3461J5001J7546J9260J9503
50051I55468J9248J9443K0063K0889K2130K3991K6329K9022L2062L5207L8174
50040A242026M1236M4831M8363N0265M9650M7099M3273L7613K9340J9346J0060
50029A663102L462p5j093r5K367N343P779Q942Q257N013j277j0233k0634l1202
50015A639656m1176n0093n7245o1754o3144o1714n8272n3679m8581m3386l8277
50004A062335l3379k9034k5708k3503k1962k0573j9281j8236j7324j6370j5636
$$ plain form
50087 520931 528599 536355 544281 552862 562092 571335 580239 589126 598250 607400 616631 626705 638161 650427
50073 650427 662499 674208 686205 698970 712412 726266 740226 753818 766708 779076 791314
50062 791314 803538 815876 828857 842809 857060 870697 884158 899159 916705 935965 955468
50051 955468 974716 994159 1014222 1035111 1057241 1081232 1107561 1136583 1168645 1203852 1242026
50040 1242026 1283262 1328093 1376456 1426721 1476371 1523470 1566743 1604356 1633696 1653042 1663102
50029 1663102 1666564 1666489 1665396 1665301 1667668 1673011 1680790 1689732 1697989 1703002 1701725 1691492 1670858 1639656
50015 1639656 1598480 1548387 1491142 1429388 1366244 1304530 1246258 1192579 1143998 1100612 1062335
50004 1062335 1028956 999922 974214 950711 928749 908176 888895 870659 853335 836965 821329
49993H21329j5562j6026j6388j6361j6196j5919j5066j3644j2620j2781j3541
49982F57225j3671j2970j2311j2084j1571j0155q354o992n983m652l048k107k378
49969E50949l199l438k713j590p86n37o32o83l70L67J158J492J230Q09O73P67
49953E43497P89Q07J182J849K237K121K153L027M356N022M705M462N470P616R800
49938E99093J1349J2601J4070J5696J7220J8901K1339K4662K8331L1958L5960
49927H31180M1192M7988N5871O4024P1843P8950Q4858Q8745Q9598Q6689Q0143
49916A621081P1145O1455N2574M5309L9885L6369L4888L5494L7686M0016M0447
49905B116349L7419L0575K0289O827r495k7322m4204n7983o8076p5255q0478q4168
$$ plain form
49993 821329 805767 789741 773353 756992 740796 724877 709811 696167 683547 670766 657225
49982 657225 643554 630584 618273 606189 594618 584463 576109 569117 563134 558482 555434 553327 550949
49969 550949 547750 544312 541599 540009 539223 538686 538054 537371 537001 537368 538526 540018 541248 542057 542730 543497
49953 543497 544286 545093 546275 548124 550361 552482 554635 557662 562018 567040 571745 576207 581677 589293 599093
49938 599093 610442 623043 637113 652809 670029 688930 710269 734931 763262 795220 831180
49927 831180 872372 920360 976231 1040255 1112098 1191048 1275906 1364651 1454249 1540938 1621081
49916 1621081 1692226 1753681 1806255 1851564 1891449 1927818 1962706 1998200 2035886 2075902 2116349
49905 2116349 2153768 2184343 2204632 2211459 2201964 2174642 2130438 2072455 2004379 1929124 1848646 1764478
49893A764478q6246q6420q4596q1312p7633p4348p1399o8245o4524o0192n5384
49882I54179n0529m6257m2680l9100l4900l0524k6951k4357k2043j9533j7063
49871F00242j4909j3040j1577j0859j0674j0209r136q179q046q400q406p913p395
49858D71499p067o688o125n560n127m770m379l803k895j897j459j815k286k131
49844D15497j663j752k442k922k799k539k371j772n36M88M59k05m56r5J88J28
49828C97208L22J198K306K945L078L189L573M095M544M907N381O211P504R041
49814D55502J0422J1535J2695J4242J6128J8209K0675K3917K7843L1786L5278
49803F78232L8716M3030M8702N5239O1415O5787O7164O4999N9586N1825M2678
$$ plain form
49893 1764478 1678232 1591812 1507216 1425904 1348271 1273923 1202524 1134279 1069755 1009563 954179
49882 954179 903650 857393 814713 775613 740713 710189 683238 658881 636838 617305 600242
49871 600242 585333 572293 560716 549857 539183 528974 519838 511659 503613 495213 486807 478894 471499
49858 471499 464432 457744 451619 446059 440932 436162 431783 427980 425085 423188 421729 419914 417628 415497
49844 415497 413834 412082 409640 406718 403919 401380 399009 397237 396701 397189 397648 397443 396987 396892 397080 397208
49828 397208 397530 398728 401034 403979 407057 410246 413819 417914 422458 427365 432746 438957 446461 455502
49814 455502 465924 477459 490154 504396 520524 538733 559408 583325 611168 642954 678232
49803 678232 716948 759978 808680 863919 925334 991121 1058285 1123284 1182870 1234695 1277373
49792A277373L2984K3608J5510R439N793M857O789J0943J5448J8001J7299J3318
49780A451362O229m311j8355l4451m9918o2445p1143p6134p7633p5822p1295o5187
49768H50897n8648n2309m6241m0353l4769k9836k5787k2437j9326j6185j3165
49757D91841j0623q753p509o682o002n238m406l744l338k942k292j526r47n20
49743D27319MM82M03k42o22OJ272K101J986J409R63P23N90P66J417K171K432K201
49725D45381K078K362K551J996Q01k40m77M5Q18J348J412J124Q33P48O39K28k26
49708D61421j41L93N16r9m50N31K249K994K190J091R48J514J897K033K441L066
49692D82594L307L029K652K396K149K016K236K516K171J176L86M36R30J077O85
$$ plain form
49792 1277373 1310357 1333965 1349475 1358914 1364707 1369564 1376353 1387296 1402744 1420745 1438044 1451362
49780 1451362 1457591 1453280 1434925 1400474 1350556 1288111 1216968 1140834 1063201 987379 916084 850897
49768 850897 792249 739940 693699 653346 618577 588741 562954 540517 521191 505006 491841
49757 491841 481218 472465 464956 458274 452272 447034 442628 438884 435546 432604 430312 428786 427839 427319
49743 427319 427323 427805 428208 427966 427344 427350 428622 430723 432709 434118 435081 435804 436394 437160 438577 440748 443180 445381
49725 445381 447459 449821 452372 454368 455169 454929 454452 454497 455315 456663 458075 459199 460032 460780 461419 461647 461421
49708 461421 461280 461673 462189 462090 461640 462171 464420 467414 469604 470695 471643 473157 475054 477087 479528 482594
49692 482594 485901 488930 491582 493978 496127 498143 500379 502895 505066 506242 506628 507064 507994 509071 509756
49677E09756J37k42m67o63q76j040j013p31l26L7M39J009J547J637J177M77j89
49660E10669o86q19m81q5k11p14p82j44M34K90j48n4N36Q47M72k43q49j257j531
49641E05244j664j632j421r96l77K74Q68J499K194K720K823K525K008J410Q72
49626E16347N42L10j23o96q42k45O64J235J414J562J867K283K826L435L812L867
49610E38258M056M722N450N691N708O180P022P484P422P597Q489R598J0299J0698
$$ plain form
49677 509756 509893 509651 509184 508521 507645 506605 505592 504861 504535 504572 505011 506020 507567 509204 510381 510858 510669
49660 510669 509983 509164 508683 508598 508387 507673 506891 506747 507181 507471 507323 507269 507805 508652 509124 508881 508032 506775 505244
49641 505244 503580 501948 500527 499531 499154 499428 500296 501795 503989 506709 509532 512057 514065 515475 516347
49626 516347 516889 517199 517076 516380 515538 515293 515957 517192 518606 520168 522035 524318 527144 530579 534391 538258
49610 538258 542314 547036 552486 558177 563885 570065 577087 584571 591993 599590 608079 617677 627976 638674
$$ [...]
##END NTUPLES=NMR SPECTRUM
##END=
