
##TITLE=AC1339_BRAAS10082_6528763_xx9DvZD7Ui
##JCAMPDX= 6.0         $$ Bruker NMR JCAMP-DX V2.0
##DATA TYPE= NMR SPECTRUM
##DATA CLASS= NTUPLES
##ORIGIN= BRUKER
##OWNER= Administrator
$$ 1.72 TOPSPIN		Version 2.1
$$ 2012-07-15 17:17:30.656 -0500  Administrator@TOPSPIN
$$ Compression mode = diff/dup
##.OBSERVE FREQUENCY= 400.02188249412
##.OBSERVE NUCLEUS= ^1H
##.ACQUISITION MODE= SIMULTANEOUS (DQD)
##.ACQUISITION SCHEME= undefined
##.AVERAGES= 8
##.DIGITISER RES= 22
##SPECTROMETER/DATA SYSTEM= spect
##.PULSE SEQUENCE= zg30
##.SOLVENT NAME= COFFEE_meoh
##.SHIFT REFERENCE= INTERNAL, COFFEE_meoh, 1, 14.98509
##AUDIT TRAIL= $$ (NUMBER, WHEN, WHO, WHERE, PROCESS, VERSION, WHAT)
$$ ##TITLE= Audit trail, TOPSPIN		Version 2.1
$$ ##JCAMPDX= 5.01
$$ ##ORIGIN= Bruker BioSpin GmbH
$$ ##OWNER= Administrator
$$ $$ C:\Bruker\TOPSPIN/data/COFFEE/nmr/AC1339_BRAAS10082_6528763_xx9DvZD7Ui/10/pdata/1/auditp.txt
$$ ##AUDIT TRAIL=  $$ (NUMBER, WHEN, WHO, WHERE, PROCESS, VERSION, WHAT)
(   1,<2012-07-15 17:17:22.250 -0500>,<Administrator>,<TOPSPIN>,<go>,<TOPSPIN 2.1>,
      <created by zg
	started at 2012-07-15 17:16:15.625 -0500,
	POWCHK enabled, PULCHK disabled,
       configuration hash MD5:
       6B 1B 68 BB D9 2E 58 E2 7F 35 AD 54 07 DF 0E 41
       data hash MD5: 64K
       BC 4E 5E 53 30 A4 45 3B 86 92 86 D2 20 92 0B 86>)
(   2,<2012-07-15 17:17:26.484 -0500>,<Administrator>,<TOPSPIN>,<proc1d>,<TOPSPIN 2.1>,
      <Start of raw data processing
       efp LB = 0 FT_mod = 6 PKNL = 1 PHC0 = 0 PHC1 = 0 SI = 32K 
       data hash MD5: 32K
       FB 51 89 50 5E 92 8A E9 CD 83 A3 FB 05 EA 5A 9D>)
(   3,<2012-07-15 17:17:26.812 -0500>,<Administrator>,<TOPSPIN>,<proc1d>,<TOPSPIN 2.1>,
      <pk PHC0 = 173.6005 PHC1 = 0 
       data hash MD5: 32K
       9F 99 EB 89 81 AD EB C5 9C F1 B4 2D 91 71 30 3D>)
(   4,<2012-07-15 17:17:26.875 -0500>,<Administrator>,<TOPSPIN>,<proc1d>,<TOPSPIN 2.1>,
      <abs ABSG = 1 
       data hash MD5: 32K
       3A 68 88 A4 27 93 AD 3D 65 27 43 73 1C 31 CF 1D>)
(   5,<2012-07-15 17:17:26.906 -0500>,<Administrator>,<TOPSPIN>,<proc1d>,<TOPSPIN 2.1>,
      <abs ABSG = 2 
       data hash MD5: 32K
       7A 4C A9 25 4B 95 27 B3 7E D5 51 55 9F AD 3D C1>)
(   6,<2012-07-15 17:17:26.937 -0500>,<Administrator>,<TOPSPIN>,<proc1d>,<TOPSPIN 2.1>,
      <abs ABSG = 3 
       data hash MD5: 32K
       40 F5 1E 9D 93 46 FE 45 75 3F 7D 8F A0 79 73 36>)
(   7,<2012-07-15 17:17:26.984 -0500>,<Administrator>,<TOPSPIN>,<proc1d>,<TOPSPIN 2.1>,
      <abs ABSG = 4 
       data hash MD5: 32K
       59 24 CE 0D 0B 4F B2 C3 F6 40 BA 18 31 6B 79 7F>)
(   8,<2012-07-15 17:17:27.015 -0500>,<Administrator>,<TOPSPIN>,<proc1d>,<TOPSPIN 2.1>,
      <abs ABSG = 5 
       data hash MD5: 32K
       41 10 00 B0 00 57 87 7A 29 76 B7 EF 7C 18 98 6A>)
$$ ##END=
$$ 
$$ $$ hash MD5
$$ $$ CE EB 2A D7 0C 04 E4 5B 45 A6 AA D2 2F F2 75 4A
##$RELAX= 
##$RELAX= 
##$RELAX= 
##$RELAX= 
##$RELAX= 
##$RELAX= 
##$RELAX= 
$$ Bruker specific parameters
$$ --------------------------
$$ [...]
150 150 150 150 150 150 150 150
##$TP07= 0
##$TPNAME0= <>
##$TPNAME1= <>
##$TPNAME2= <>
##$TPNAME3= <>
##$TPNAME4= <>
##$TPNAME5= <>
##$TPNAME6= <>
##$TPNAME7= <>
##$TPOAL= (0..7)
0.5 0.5 0.5 0.5 0.5 0.5 0.5 0.5
##$TPOFFS= (0..7)
0 0 0 0 0 0 0 0
##$TUNHIN= 0
##$TUNHOUT= 0
##$TUNXOUT= 0
##$USERA1= <user>
##$USERA2= <user>
##$USERA3= <user>
##$USERA4= <user>
##$USERA5= <user>
##$V9= 5
##$VALIST= <valist>
##$VCLIST= <CCCCCCCCCCCCCCC>
##$VD= 0
##$VDLIST= <DDDDDDDDDDDDDDD>
##$VPLIST= <PPPPPPPPPPPPPPP>
##$VTLIST= <TTTTTTTTTTTTTTT>
##$WBST= 2048
##$WBSW= 25
##$XGAIN= (0..3)
0 0 0 0
##$XL= 0
##$YL= 0
##$YMAX_a= 515217
##$YMIN_a= -643993
##$ZGOPTNS= <>
##$ZL1= 120
##$ZL2= 120
##$ZL3= 120
##$ZL4= 120
##$ABSF1= 14.98509
##$ABSF2= -5.573092
##$ABSG= 5
##$ABSL= 3
##$ALPHA= 0
##$AQORDER= 0
##$ASSFAC= 0
##$ASSFACI= 0
##$ASSFACX= 0
##$ASSWID= 0
##$AUNMP= <proc_prof1d_extract_pilot.lims>
##$AXLEFT= 0
##$AXNAME= <>
##$AXNUC= <1H>
##$AXRIGHT= 0
##$AXTYPE= 0
##$AXUNIT= <>
##$AZFE= 0.1
##$AZFW= 0.1
##$BCFW= 0
##$BC_mod= 0
##$BYTORDP= 0
##$COROFFS= 0
##$CY= 15
##$DATMOD= 1
##$DC= 0
##$DFILT= <>
##$DTYPP= 0
##$F1P= 0
##$F2P= 0
##$FCOR= 0.5
##$FTSIZE= 32768
##$FT_mod= 6
##$GAMMA= 0
##$GB= 0
##$INTBC= 1
##$INTSCL= 1
##$ISEN= 128
##$LB= 0
##$LEV0= 0
##$LPBIN= 0
##$MAXI= 10000
##$MC2= 0
##$MEAN= 0
##$ME_mod= 0
##$MI= 0
##$NCOEF= 0
##$NC_proc= -8
##$NLEV= 6
##$NOISF1= 0
##$NOISF2= 0
##$NSP= 0
##$NTH_PI= 0
##$NZP= 0
##$OFFSET= 14.98509
##$PC= 1
##$PHC0= 173.6005
##$PHC1= 0
##$PH_mod= 1
##$PKNL= yes
##$PPARMOD= 0
##$PPDIAG= 0
##$PPIPTYP= 0
##$PPMPNUM= 2147483647
##$PPRESOL= 1
##$PSCAL= 4
##$PSIGN= 0
##$PYNMP= <proc.py>
##$REVERSE= no
##$SF= 400.02
##$SI= 32768
##$SIGF1= 0
##$SIGF2= 0
##$SINO= 400
##$SIOLD= 32768
##$SPECTYP= <>
##$SREGLST= <1H.CDCl3>
##$SSB= 0
##$STSI= 32768
##$STSR= 0
##$SW_p= 8223.68421052631
##$SYMM= 0
##$S_DEV= 0
##$TDeff= 65536
##$TDoff= 0
##$TI= <>
##$TILT= no
##$TM1= 0
##$TM2= 0
##$TOPLEV= 0
##$USERP1= <user>
##$USERP2= <user>
##$USERP3= <user>
##$USERP4= <user>
##$USERP5= <user>
##$WDW= 1
##$XDIM= 32768
##$YMAX_p= 482840516
##$YMIN_p= -744632
##$CURPLOT= <Network HP LaserJet P1505>
##$CURPRIN= <$Network HP LaserJet P1505>
##$DFORMAT= <normdp>
##$LAYOUT= <+/1D_H.xwp>
##$LFORMAT= <normlp>
##$PFORMAT= <normpl>
##$SURQMSG= 1
$$ End of Bruker specific parameters
$$ ---------------------------------
##NTUPLES= NMR SPECTRUM
##VAR_NAME=  FREQUENCY,     SPECTRUM/REAL,   SPECTRUM/IMAG
##SYMBOL=    X,             R,               I
##VAR_TYPE=  INDEPENDENT,   DEPENDENT,       DEPENDENT
##VAR_FORM=  AFFN,          ASDF,            ASDF
##VAR_DIM=   32768,         32768,           32768
##UNITS=     HZ,            ARBITRARY UNITS, ARBITRARY UNITS
##FACTOR=    0.250966925370066, 1,           1
##FIRST=     8223.43324360094, -152692,      -3682
##LAST=      0,             195882,          -220736
##MIN=       0,             -744632,         0
##MAX=       8223.43324360094, 482840516,    0
$$ Real data points
##PAGE= N=1
##DATA TABLE= (X++(R..R)), XYDATA
$$ [...]
19563a59797C9979a42751I9817o996C0120a92961Q2530p3500m1432e971j24951
$$ -159797 39979 -142751 99817 92821 30120 -192961 -110431 -183931 -225363 -5971 -130922
19552a30922M0474J2445B20004B9192b4720j86452H8456a41670k05563C30810
$$ -130922 -90448 -78003 220004 29192 -24720 -211172 88456 -141670 -347233 330810
19541b88908A34422d5797l1558j32486G5462c2314A26562b00721B43807f9588
$$ -288908 134422 -45797 -77355 -209841 75462 -32314 126562 -200721 243807 -69588
19530C58192f5170B4097q425b33362O0353H9084d01927J02312i5353j53815J23197
$$ 358192 -65170 24097 15672 -233362 -173009 89084 -401927 -299615 -95353 -249168 -125971
19519a25971j20097C52281a64874k0391P7140D2471a20793c225r0072j9094j88737
$$ -125971 -246068 352281 -164874 -185265 -108125 42471 -120793 -3225 -93297 -112391 -301128
19508c01128g1525G6150B7474K38908b96634B64411c4939k2990E9573i1554D1553
$$ -301128 -71525 76150 27474 266382 -296634 264411 -34939 -57929 59573 -91554 41553
19496b7886k00706Q3026B4769O2521h9750A79287b52023N2354D385b60499Q8170
$$ -27886 -228592 -145566 24769 87290 -89750 179287 -252023 -199669 4385 -260499 -172329
19485a72329A48239F6719b8531j03837A28702a41864B09243a76164J6125A09042
$$ -172329 148239 66719 -28531 -132368 128702 -141864 209243 -176164 -160039 109042
19474a24262E7702i2186j26650M9461f6775j06884E1751f16j68040r7361Q2670
$$ -124262 57702 -92186 -218836 -169375 -66775 -173659 51751 -616 -168656 -266017 -183347
19463a83347E8127N7312b58261J07045J2741I6248h6569m9539e2559K5786B72714
$$ -183347 58127 115439 -258261 -151216 -138475 96248 -86569 -136108 -52559 -26773 272714
19451a37664M2728B76443a89661n450g1548b920m3329A90945b00612B22799f0733
$$ -137664 -94936 276443 -189661 -195111 -71548 -2920 -46249 190945 -200612 222799 -60733
19439b64585J10467A45728a34517K4117r7710Q7998j31586J19148A59a1663l42599
$$ -264585 -154118 145728 -134517 -110400 -208110 -120112 -251698 -132550 159 -11663 -354262
19428c54262a21567j0674c2180C04113a10169B02819d4114m65973J69244C50725
$$ -354262 -121567 -132241 -32180 304113 -110169 202819 -44114 -510087 -340843 350725
19417A49257a56763O1270B55347d56221d4795B32183c00250h3567n5226a6046
$$ 149257 -156763 -95493 255347 -456221 -44795 232183 -300250 -83567 -138793 -16046
19406g5225K6667G564b47638R9853K1453N2808k18958B96758j24842j2087B759
$$ -75225 -48558 7564 -247638 -147785 -126332 -73524 -292482 296758 171916 159829 2759
19394C03206e8270C07177G6805b60622O494G4389b29949I8672a49964G6331b8192
$$ 303206 -58270 307177 76805 -260622 -254128 74389 -229949 98672 -149964 76331 -28192
19382a57004B55463j12912c032r2936K1773B9286Q256J76959f8418j9007c4575
$$ -157004 255463 142551 -3032 -95968 -74195 29286 37542 214501 -68418 -87425 -34575
19370a11730K4033K6394B9001b00700G6433g3712D348h6652p9799j84675J42398
$$ -111730 -87697 -61303 29001 -200700 76433 -73712 4348 -86652 -166451 -351126 -208728
19359b08728M07E6557C784a15998B63215O0074E0965h0935r4745f4679l21100
$$ -208728 -208321 56557 3784 -115998 263215 323289 50965 -80935 -175680 -64679 -385779
19348c85779J29584a4224p5928B44422p7819l0519L2010g9736H6330f5710B72047
$$ -385779 -256195 -14224 -90152 244422 166603 136084 168094 -79736 86330 -65710 272047
19336A74471P1847h8502B54934c3437A16694h6250A4009M3980g9863o5887C8810
$$ 174471 246318 -88502 254934 -33437 116694 -86250 14009 57989 -79863 -145750 38810
19324a58718k54042A05490b13950a667n7890A8637b44647C9217i1152k02434M0217
$$ -158718 -412760 105490 -213950 -1667 -59557 18637 -244647 39217 -91152 -293586 -253369
19313b53369B94654j41306A2822b59087m6619Q0403o5765J29203j03090J21338
$$ -253369 294654 153348 12822 -259087 -305706 -225303 -291068 -161865 -264955 -143617
19303a43617A13185M842a14876j7752A31601e1381o6767B33433b13843J05095
$$ -143617 113185 118027 -114876 -132628 131601 -51381 -118148 233433 -213843 -108748
19293a08748C3346a81670B9953b02750j76180B56535a03945c3682j0360A50236
$$ -108748 33346 -181670 29953 -202750 -378930 256535 -103945 -33682 -44042 150236
19282h7206k9536q2704A86533o2216P4354p5106a2520B2484g9921B3381a78067
$$ -87206 -116742 -199446 186533 124317 198671 123565 -12520 22484 -79921 23381 -178067
19270A00147K59174h7481A5674a26254b1657G2621j4627b42108f7665A25743a57887
$$ 100147 359321 -87481 15674 -126254 -21657 72621 57994 -242108 -67665 125743 -157887
19258d58491B26385d7690o0889D8540Q8577Q830b62263J21165G7285M5367m5791
$$ -458491 226385 -47690 -108579 48540 137117 145947 -262263 -141098 77285 122652 76861
19247G6861a46588H7805L9768e0838A27829b56775F2934c33047a29307A9693a76785
$$ 76861 -146588 87805 127573 -50838 127829 -256775 62934 -333047 -129307 19693 -176785
19235g8841o2256f4026B86732j26223b42871e7474m0763L4279p6651j95849A80304
$$ -78841 -141097 -64026 286732 160509 -242871 -57474 -98237 -63958 -140609 -336458 180304
19223b3930R714n412A34141F6675a00861j27632e8395A08771d9407G259a43352
$$ -23930 -14216 -19628 134141 66675 -100861 -228493 -58395 108771 -49407 7259 -143352
19211I2586h2396E6240O7149B4290c5157j70016B14474H5253a6163l60584J73111
$$ 92586 -82396 56240 123389 24290 -35157 -205173 214474 85253 -16163 -376747 -203636
19200b03636R2130j09572A08185a92168f5170G6486A963b88219A94229a93226
$$ -203636 -111506 -221078 108185 -192168 -65170 76486 1963 -288219 194229 -193226
19189a54079r8780A97649b81238f7481p8549L1677B1458L63705A57598j5647a7166
$$ -154079 -252859 197649 -281238 -67481 -146030 -114353 21458 385163 157598 141951 -17166
19177a69898p0743q2176A94520b90073J03792l9358a9532k2790j36798O1110m4261
$$ -169898 -240641 -322817 194520 -290073 -186281 -225639 -19532 -42322 -179120 -118010 -162271
19166a62271j64775k7348d3088j97277B4402i9953A51147K376l3032l154b60921
$$ -162271 -327046 -354394 -43088 -240365 24402 -99953 151147 153523 120491 117337 -260921
19154e6946l09553B4065J29817a75193D8962g3331l02038I2525a74239M856A8069
$$ -56946 -366499 24065 153882 -175193 48962 -73331 -375369 92525 -174239 -169383 18069
19142i331q0307c3567j54225c3080p9030e3924A50042C5773Q1910d02582A59280
$$ -9331 -89638 -33567 -187792 -33080 -112110 -53924 150042 35773 117683 -402582 159280
19130a92507d0612m6993L7097l16245B27375j2100p6747E0302b4065j83959j8662
$$ -192507 -40612 -87605 -50508 -366753 227375 215275 138528 50302 -24065 -208024 -226686
19119b26686f6918I3582c0510I3258i4681C9765c3936j95972B0345J05958c05276
$$ -226686 -66918 93582 -30510 93258 -94681 39765 -33936 -229908 20345 126303 -305276
19107C1761J04161c45779a06514H0242a43743A39222f2466E008J54975a6722D35979
$$ 31761 135922 -345779 -106514 80242 -143743 139222 -62466 5008 159983 -16722 435979
19095A0352a52680A28867E278a15585C7873c24163a59564A46261g2417m76629
$$ 10352 -152680 128867 5278 -115585 37873 -324163 -159564 146261 -72417 -549046
19085e49046d5231k83259a01466k94028H2431G840R09a59297c1170j56236j71268
$$ -549046 -45231 -328490 -101466 -395494 82431 7840 8749 -159297 -31170 -187406 -358674
19074c58674J75203M9068k6653I9679l6137K30000j41693l3474b38982J8650C2911
$$ -358674 -183471 -134403 -161056 99679 63542 293542 151849 118375 -238982 -220332 32911
19062D6641a93709j49660G9226P6583a17220A17870g0226B77460c94482B5660
$$ 46641 -193709 -343369 79226 155809 -117220 117870 -70226 277460 -394482 25660
19051G9257b1396l33437I9840b42859D7370b57283l0311f3400D4514b46356M6793
$$ 79257 -21396 -354833 99840 -242859 47370 -257283 -287594 -63400 44514 -246356 -199563
19040a99563d3059A26162D5205d0889A05648a08122j35501H8567J79811A12765
$$ -199563 -43059 126162 45205 -40889 105648 -108122 -243623 88567 268378 112765
19029a21375E447K16698a12528B4996K0295L7197c0923k6176C0952K99396B9710
$$ -121375 5447 222145 -112528 24996 45291 82488 -30923 -57099 30952 330348 29710
19017i1687A32910D5497a43125A01756R5684b63149F0669f6237m47727a08271
$$ -91687 132910 45497 -143125 101756 197440 -263149 60669 -66237 -513964 -108271
19006a37483c4289m1169o8358f4493A72353b27887d9299k34120D0209a61526f1482
$$ -137483 -34289 -75458 -143816 -64493 172353 -227887 -49299 -283419 40209 -161526 -61482
18994b04064I1134a63522j8533K207p230K4173k7902l7405A63680i6441A25950
$$ -204064 91134 -163522 -182055 -179848 -187078 -162905 -190807 -228212 163680 -96441 125950
18982a32848m6177p5115f2544A18754a59294P1514j25883g9287H125N2362e3359
$$ -132848 -179025 -254140 -62544 118754 -159294 -87780 -213663 -79287 8125 60487 -53359
18970B10719E9211k9552R4016J8131p877C3304M6067P4242l5750C6203i3581j98853
$$ 210719 59211 29659 123675 141806 133929 33304 79371 153613 117863 36203 -93581 -292434
18958b92434a10769B6402f1511r8311e0145j69471A60991m3440e5007n446A01923
$$ -292434 -110769 26402 -61511 -159822 -50145 -219616 160991 117551 -55007 -60453 101923
18946c99054a26128j17858j24424B7143J22645b5612B60172i0667j3633A77730
$$ -399054 -126128 -243986 -368410 27143 149788 -25612 260172 -90667 -104300 177730
18935A27832a6806A36817d2752k09677a00811G2671c81896a39419A22847G499
$$ 127832 -16806 136817 -42752 -252429 -100811 72671 -381896 -139419 122847 7499
18924d7888D8836h4110k08406A07897a32970n5271a9339A88224E4118a36856C28716
$$ -47888 48836 -84110 -292516 107897 -132970 -188241 -19339 188224 54118 -136856 328716
18912a73976A09021d1824j5826j46314g6368b6020a3005A86924H4652K5097P9624
$$ -173976 109021 -41824 -57650 -203964 -76368 -26020 -13005 186924 84652 109749 189373
18901A89373L1818a25035A23528f326B27877A11905B8607a61328o1724a08075
$$ 189373 221191 -125035 123528 -6326 227877 111905 28607 -161328 -223052 -108075
18890i9178C4445a23405D119g2308k97046a46519q0432A1706L8201p10N8582b2679
$$ -99178 34445 -123405 4119 -72308 -369354 -146519 -226951 11706 49907 49197 107779 -22679
18877E3214J74811b19729L8642c444j40807I9017a41185M4282j57204A00150j3105
$$ 53214 228025 -219729 -181087 -3444 -144251 99017 -141185 -96903 -254107 100150 87045
18866H7045C3169e8619a2838j34698G16d85268a30131q0855r830d5804m404K0019
$$ 87045 33169 -58619 -12838 -147536 716 -485268 -130131 -210986 -220816 -45804 -50208 -30189
18854c0189D7625b536B91130m6708a3324B47807B4280J56277b79651A17458e4752
$$ -30189 47625 -2536 291130 244422 -13324 247807 24280 180557 -279651 117458 -54752
18842f7120K1789H9880a54205j32595O0044J12919q609k3141b5726D2529Q6061
$$ -67120 -45331 89880 -154205 -286800 -226756 -113837 -122446 -145587 -25726 42529 128590
18831A28590b99703k48485b22555N3314i742A85150l2676a75076M6547j58914
$$ 128590 -299703 -548188 -222555 -169241 -9742 185150 152474 -175076 -128529 -287443
18821b87443D2976a30553C22840j26001O1896a26922N0114E2776N4740a07233
$$ -287443 42976 -130553 322840 196839 258735 -126922 -76808 52776 107516 -107233
18810e240A08877C1938J41061A7943c89B95103n3737A00561b39841a6460j12228
$$ -5240 108877 31938 172999 17943 -389 295103 241366 100561 -239841 -16460 -128688
18799a28688j66032l8705B7005h7331k09048L8430j6240N9057B19622J60737A04658
$$ -128688 -294720 -333425 27005 -87331 -296379 -257949 -274189 -215132 219622 380359 104658
18787b84575b647A38513n5932F868M3914a60555E5382a47479A40583K55735A75686
$$ -284575 -2647 138513 82581 6868 50782 -160555 55382 -147479 140583 396318 175686
18775a72927m2066l0595g8519C314b76019A5272J88143r4357f2009I8932b28814
$$ -172927 -214993 -245588 -78519 3314 -276019 15272 203415 109058 -62009 98932 -228814
18763C8435c12671C48735c12461b5116D4243K3972B9139a17213F0739J54381A01963
$$ 38435 -312671 348735 -312461 -25116 44243 68215 29139 -117213 60739 215120 101963
18751b05472I4443b71653q0200J71760o1379J03761G5559a76122M3540N3014K1879
$$ -205472 94443 -271653 -351853 -180093 -241472 -137711 75559 -176122 -132582 -79568 -57689
18740e7689B12629a88780I0996a52938j5415l1519A25817A7927a62694C0965e949
$$ -57689 212629 -188780 90996 -152938 -168353 -199872 125817 17927 -162694 30965 -5949
18728h6770A46780g9078A74926b01698L1294e4888C34011b01217r8628K9661h4724
$$ -86770 146780 -79078 174926 -201698 -170404 -54888 334011 -201217 -299845 -270184 -84724
18716A86317b02599E7978a08280B0446b23977B12589B0795a31877H573i0552B01230
$$ 186317 -202599 57978 -108280 20446 -223977 212589 20795 -131877 8573 -90552 201230
18704a51170b9854B794J52403b43554k0484j08194A04045b1693B52675b6007H8877
$$ -151170 -29854 2794 155197 -243554 -264038 -372232 104045 -21693 252675 -26007 88877
18692a42194b3756k47161e989j00369r8482c5619A12741J39581a88683A2501b30246
$$ -142194 -23756 -270917 -5989 -106358 -204840 -35619 112741 252322 -188683 12501 -230246
18680b9397r563j0622e252j26719n5751j756J2710B10725h2553l8335A09784b63585
$$ -29397 -38960 -49582 -5252 -131971 -187722 -189478 -176768 210725 -82553 -120888 109784 -263585
18667i9117B23752A04853a08112C1798b05686A17163e71039a60576m4612Q6636
$$ -99117 223752 104853 -108112 31798 -205686 117163 -571039 -160576 -205188 -118552
18657a18552l8149B1236J68619L8762i6995I9709L1878b03875G2055G839a40912
$$ -118552 -156701 21236 189855 228617 -96995 99709 131587 -203875 72055 7839 -140912
18645g3786A20542E7199h9593B1105J69443a77356l6545a124k98923D0528i4499
$$ -73786 120542 57199 -89593 21105 190548 -177356 -213901 -1124 -300047 40528 -94499
18633b25377A39792M2162l7392L7925a92382B36508L070e5627p0433B5808K25059
$$ -225377 139792 181954 144562 182487 -192382 236508 239578 -55627 -126060 25808 250867
18622B50867c49904M8984I6938g3696j96651D6190J98842g0764l9993j80k88485
$$ 250867 -349904 -300920 96938 -73696 -270347 46190 245032 -70764 -110757 -110937 -399422
18611c99422J22122B99497b09985R3625B59596I5369d5949A13173a94182p7774
$$ -399422 -277300 299497 -209985 -116360 259596 95369 -45949 113173 -194182 -271956
18601b71956p6559G51M0587c61916H9261R6211G5386e7502l0632c7905j54856
$$ -271956 -348515 751 41338 -361916 89261 185472 75386 -57502 -88134 -37905 -192761
18590a92761n8202d5943B0064k647f4448A14554k7807d6617F4038b37606E9568
$$ -192761 -250963 -45943 20064 17417 -64448 114554 86747 -46617 64038 -237606 59568
18578b92801I9128j1322j6865k6101d3857A66638d7150m28582a12343A01075R974
$$ -292801 99128 87806 70941 44840 -43857 166638 -47150 -475732 -112343 101075 111049
18567A11049a03619k30146f0256k58429A1136a65762A43883c450q8819c2704D295
$$ 111049 -103619 -333765 -60256 -318685 11136 -165762 143883 -3450 -92269 -32704 4295
18555D3894L0763f7240L26q6788a4325j9782r5115A55272a78758N3374K100H9352
$$ 43894 74657 -67240 -66914 -153702 -14325 -34107 -129222 155272 -178758 -125384 -123284 89352
18542a88241C4099M0557a65342O9805j61279f1557C3928d9331g253A21293C8254
$$ -188241 34099 74656 -165342 -95537 -256816 -61557 33928 -49331 -7253 121293 38254
18530b00505K1135d3236H7920F78a82951b0347A26694J5995a14973c7626I9517
$$ -200505 -179370 -43236 87920 678 -182951 -20347 126694 142689 -114973 -37626 99517
18518a12530l39676K06355K5248p6353a5203k5495B38351Q3782A03838J45431
$$ -112530 -452206 -245851 -220603 -296956 -15203 -40698 238351 322133 103838 249269
18508B49269b56935f5358C0485a11275C14941b13065B3163d37527J07672c0693
$$ 249269 -256935 -65358 30485 -111275 314941 -213065 23163 -437527 -329855 -30693
18497a0310B39268D121J01282i4176m9136A94166L7342I6990m1481d19385a76797
$$ -10310 239268 4121 105403 -94176 -143312 194166 231508 96990 55509 -419385 -176797
18485C9160c82754B6270b22913J07281C7770O4985l7831d28225A84131a26394
$$ 39160 -382754 26270 -222913 -115632 37770 102755 64924 -428225 184131 -126394
18474B35105a07362c9744j09727k64341a38700B77273a52762k22778B7787a54037
$$ 235105 -107362 -39744 -149471 -413812 -138700 277273 -152762 -375540 27787 -154037
18463b48536D3677c70004J30897a01736j59608F3072O5619a84444A5633E366a05227
$$ -248536 43677 -370004 -239107 -101736 -261344 63072 128691 -184444 15633 5366 -105227
18451a12435m8463e0364a5159q1912D33374b06901c077l5844q9988N5764A18621
$$ -112435 -160898 -50364 -15159 -97071 433374 -206901 -3077 -38921 -128909 -73145 118621
18439I5550K78649c89103J13866L3375C80212a00449b3897F1359a37750C54307
$$ 95550 374199 -389103 -275237 -241862 380212 -100449 -23897 61359 -137750 354307
18428a64750g447A94700c23917f6542A95427i6193j36449F574i9335M1113D82865
$$ -164750 -7447 194700 -323917 -66542 195427 -96193 -232642 6574 -99335 -58222 482865
18416f8469j93952d9619l14573J78999A6152L0323g0777j20198h6259j25745A27611
$$ -68469 -262421 -49619 -364192 -185193 16152 46475 -70777 -190975 -86259 -212004 127611
18404D014J34482n4229b11151g1940A64398J7437G818c0483j05680j36374I5565
$$ 4014 138496 84267 -211151 -71940 164398 181835 7818 -30483 -136163 -272537 95565
18392c94315F0191c41660g7643A3530K2823a70901d3274q8730N6389A15875j2362
$$ -394315 60191 -341660 -77643 13530 36353 -170901 -43274 -132004 -75615 115875 103513
18381A03513f0585B95223a13087N4373B5288b34289A14340b40008B20268a62728
$$ 103513 -60585 295223 -113087 -58714 25288 -234289 114340 -240008 220268 -162728
18370A18351K5794F6162a43648q23C24650a73480A74821a17931A05136b35427
$$ 118351 144145 66162 -143648 -144471 324650 -173480 174821 -117931 105136 -235427
18359h216o6973B25659F6449a24936B56658a6269B5132b49492B09176a46349d1447
$$ -8216 -75189 225659 66449 -124936 256658 -16269 25132 -249492 209176 -146349 -41447
18347b599k88374g1737r8202F5704a46515A15475A5278a76373G6323b84272g6030
$$ -2599 -290973 -71737 -169939 65704 -146515 115475 15278 -176373 76323 -284272 -76030
18335e856m3641A98914e9877o7010C22004I1242c72435a22387K8231B48598c7390
$$ -5856 -49497 198914 -59877 -126887 322004 91242 -372435 -122387 -94156 248598 -37390
18323b37719D9235b29201f4470j55500g1007A19614O7935b87434A84228a49097
$$ -237719 49235 -229201 -64470 -219970 -71007 119614 187549 -287434 184228 -149097
18312h2898l2477j39977A65884K8310e0931J9222k20152A22704M7085j887B7330
$$ -82898 -115375 -255352 165884 194194 -50931 -31709 -251861 122704 169789 167902 27330
18300b78043F4942a08721j11126D1192g5229j34146A9913d652k4668A65747J4072
$$ -278043 64942 -108721 -219847 41192 -75229 -209375 19913 -4652 -29320 165747 179819
18289A79819a00531l05710A2754f9924F3715B4398a23304M0370b2500A4603e2751
$$ 179819 -100531 -406241 12754 -69924 63715 24398 -123304 -82934 -22500 14603 -52751
18277a00817k15796b9497j7452o3737L560j01125O1325A38183N232C3131j0741
$$ -100817 -316613 -29497 -46949 -110686 -107126 -208251 -146926 138183 143415 33131 22390
18266B2390O7700J1909K00534c2874A52948G0180j3343h4615B20845H4479a2780
$$ 22390 90090 101999 302533 -32874 152948 70180 56837 -84615 220845 84479 -12780
18254b84984B46118d17923a36691E5662J19169J43130H8104J65808b82629R7006
$$ -284984 246118 -417923 -136691 55662 174831 317961 88104 253912 -282629 -185623
18244a85623h3211A38037j7816b11083l4485f9581L159m2500B3718c74225a7923
$$ -185623 -83211 138037 120221 -211083 -245568 -69581 -66422 -108922 23718 -374225 -17923
18232B46175l0087b46973A77711a07269b7975k1958j3773k1778H4030J769a98027
$$ 246175 216088 -246973 177711 -107269 -27975 -49933 -63706 -85484 84030 85799 -198027
18220G0422f034k11710N7767j0061F7794b18445g3081P570h232o085j83621h7252
$$ 70422 -6034 -217744 -159977 -170038 67794 -218445 -73081 -65511 -8232 -14317 -197938 -87252
18207C1625d4557C7602b08949m9981A28652B9577b24047C30398a5985p6305L7663
$$ 31625 -44557 37602 -208949 -258930 128652 29577 -224047 330398 -15985 -92290 -54627
18196e4627k56202D2761A9567J49770C8056e48909c4388d312j71257e0708j1156
$$ -54627 -310829 42761 19567 169337 38056 -548909 -34388 -4312 -175569 -50708 -61864
18185f1864l5722F5223h6253L2489b1895o1910E992c41083E3754g9448i968A63355
$$ -61864 -97586 65223 -86253 -53764 -21895 -83805 5992 -341083 53754 -79448 -9968 163355
18172C88162a4349H0996c093j36958N9161K5727G908i2945A06081a93944j05337
$$ 388162 -14349 80996 -3093 -140051 -80890 -55163 7908 -92945 106081 -193944 -299281
18161b99281b5608n4034K9291n5965C41738a1113k0398j26849c5028A79436P1128
$$ -299281 -25608 -79642 -50351 -106316 341738 -11113 -31511 -158360 -35028 179436 250564
18150B50564j07881a15786H720M0481a0383I352J86996b5225p4159m9767j89015
$$ 250564 142683 -115786 8720 49201 -10383 9352 196348 -25225 -99384 -149151 -338166
18139c38166O2582p2345A49805m4205b05191f3032A15874g9302j56253F7300b64266
$$ -338166 -275584 -347929 149805 105600 -205191 -63032 115874 -79302 -235555 67300 -264266
18127A61069p5911a73750a9850I4195i1406C7330h4456A20658D3426H544J00933
$$ 161069 85158 -173750 -19850 94195 -91406 37330 -84456 120658 43426 8544 109477
18116A09477M5314a19688e7723k3001A81058F6363a38313k0342O7443B0213b53873
$$ 109477 154791 -119688 -57723 -80724 181058 66363 -138313 -158655 -91212 20213 -253873
18104D8124a06170A08563D5711a44105p2156R7854A4472a85532p0728c4609G7227
$$ 48124 -106170 108563 45711 -144105 -216261 -118407 14472 -185532 -256260 -34609 77227
18092i5854A59491b14923B7826b9685j7244j84282A39506a15664j3359B51375
$$ -95854 159491 -214923 27826 -29685 -46929 -231211 139506 -115664 -129023 251375
18081d9950k78247J38083f5327A11915K11812e66659A04638a1312r4552j98551
$$ -49950 -328197 -190114 -65327 111915 323727 -566659 104638 -11312 -105864 -304415
18071c04415F2312b4226p3467A4046a36766j92189d6865A55122a49178k2706A4129
$$ -304415 62312 -24226 -97693 14046 -136766 -328955 -46865 155122 -149178 -171884 14129
18059e2750o4907L9111B3527Q8156Q1154d6107j96294a10917M6606A80336f7407
$$ -52750 -117657 -78546 23527 111683 192837 -46107 -242401 -110917 -64311 180336 -67407
18047a11855b7936a0766j88977k3870E3255c75080a75687f8305k03374F5335a48698
$$ -111855 -27936 -10766 -199743 -223613 53255 -375080 -175687 -68305 -271679 65335 -148698
18035a56951D85529d0921j82452d2367A1886O8732a79314b4122E1399b1094j9842
$$ -156951 485529 -40921 -223373 -42367 11886 80618 -179314 -24122 51399 -21094 -40936
18024d0936k25363O0407a00926I1470c68671a09261m1187L5903A98181M572g5348
$$ -40936 -266299 -205892 -100926 91470 -368671 -109261 -150448 -114545 198181 202753 -75348
18012B45325b34690f4389B55653i5195l3491p5745A99694f9127j32898A12940
$$ 245325 -234690 -64389 255653 -95195 -128686 -204431 199694 -69127 -202025 112940
18001F9778a28517J73l6681m7319F2904D771P3690l7478a48226C500P6927C5816
$$ 69778 -128517 -128344 -165025 -212344 62904 4771 78461 40983 -148226 3500 80427 35816
17988a73808B2446m367K56608b23685R6267k57158B36517g89B5267Q203d6932
$$ -173808 22446 18079 274687 -223685 -127418 -384576 236517 -789 25267 33470 -46932
17976b59021A29P207d5074a4502I2932A1576P3357Q1104C7872J03386J7640D6237
$$ -259021 129 7336 -45074 -14502 92932 11576 84933 166037 37872 141258 158898 46237
17963d1481J8490L186A4738c58821H6779p152c3249j03901A72609h6557o6288
$$ -41481 -22991 -19805 14738 -358821 86779 79627 -33249 -137150 172609 -86557 -152845
17952a52845A14309b69989j0405H4393M9521k1552b20611r2886a7695A34518J21255
$$ -152845 114309 -269989 -280394 84393 133914 112362 -220611 -313497 -17695 134518 255773
17941B55773O8673g5911j50833Q5173D1295a1630H7887b14358L7615q239B53477
$$ 255773 324446 -75911 -226744 -141571 41295 -11630 87887 -214358 -176743 -184982 253477
17929g4719E8737i8803k32686B02018b5472q2814b2908q6711A33064I931a74803
$$ -74719 58737 -98803 -331489 202018 -25472 -108286 -22908 -109619 133064 9931 -174803
17917A73602A5328M30913A52797Q9252g0751A51370d6758B02706q8256K67115
$$ 173602 15328 446241 152797 242049 -70751 151370 -46758 202706 114450 381565
17907C81565e6921q933k04086A1949i060p5469E006a18949M5207g27j4441D4928
$$ 381565 -56921 -65854 -269940 11949 -9060 -84529 5006 -118949 -73742 -727 -15168 44928
17894D7064J9518J88711a54960k0230F3801J75976o3719J40315F1626M9079D4472
$$ 47064 66582 255293 -154960 -175190 63801 239777 176058 316373 61626 110705 44472
17882A87872l8373A74J38683L6211a5390A69327N3593A02691c364A49338f4666
$$ 187872 149499 174 138857 175068 -15390 169327 222920 102691 -3364 149338 -64666
17870a98012A36991K6238N6403D7555d1369j03664C09440A04728Q617E1728b28398
$$ -198012 136991 163229 219632 47555 -41369 -145033 309440 104728 113345 51728 -228398
17858A53594j0681E6840a11052C66011e4490A8632R2504c03926j14709B6707b7934
$$ 153594 142913 56840 -111052 366011 -54490 18632 111136 -303926 -418635 26707 -27934
17846h8752B34156d6101B26140e3679k29822A20438K88980a84514F1351J04057
$$ -88752 234156 -46101 226140 -53679 -283501 120438 409418 -184514 61351 165408
17836A65408a19653e3972b3265H6692e7752q1715e7338A23907J51084F4960i3009
$$ 165408 -119653 -53972 -23265 86692 -57752 -139467 -57338 123907 274991 64960 -93009
17824i5000O531I7066P0413B0711a23569j74302E9190c0230A19402I714J12530
$$ -95000 -88469 97066 167479 20711 -123569 -297871 59190 -30230 119402 9714 122244
17813A22244D6363K56989A43603c45963D8358b94701g6779p7235b3844r4289E9400
$$ 122244 46363 303352 143603 -345963 48358 -294701 -76779 -154014 -23844 -118133 59400
17801c75306a18500l30337a61643D5373b28301G5700J38291b3215H0691K7505
$$ -375306 -118500 -448837 -161643 45373 -228301 75700 213991 -23215 80691 108196
17791A08196J3880c6192I8743l7332a45070A65175b64410A38869a22073B88016
$$ 108196 122076 -36192 98743 61411 -145070 165175 -264410 138869 -122073 288016
17780b03138q7078H6800J37303b07591C5171g7737G3922e4451A10477a90414I0146
$$ -203138 -290216 86800 224103 -207591 35171 -77737 73922 -54451 110477 -190414 90146
17768G117h7186D0499a62532j13267L4055M6546M121j04100d3355q7349q1674
$$ 7117 -87186 40499 -162532 -275799 -241744 -195198 -191077 -295177 -43355 -130704 -212378
17757b12378B52348A19031b8305k97515C3965J8242b79249H9068a16089A28473
$$ -212378 252348 119031 -28305 -325820 33965 52207 -279249 89068 -116089 128473
17746i8991i87D33220f6825c1831A7608a32034a9781A46083a25583B68723A13596
$$ -98991 -987 433220 -66825 -31831 17608 -132034 -19781 146083 -125583 268723 113596
17734C96613b09945B3411J21038b18559E4554a69783Q2580l8277k16359J54167
$$ 396613 -209945 23411 144449 -218559 54554 -169783 -87203 -125480 -341839 -187672
17724a87672g4906k0139G6780N3459J10847D9558a60246f6428A0508N5238h035
$$ -187672 -74906 -95045 76780 130239 241086 49558 -160246 -66428 10508 65746 -8035
17712i112o7535D25760a20092G9863b65881a25487k0875L4600C39828I1980a848
$$ -9112 -76647 425760 -120092 79863 -265881 -125487 -146362 -111762 339828 91980 -1848
17700a85576d0038k9874j23904j4512I0949L3955d337F3740c156n0476H2335M952
$$ -185576 -40038 -69912 -193816 -208328 90949 124904 -4337 63740 -3156 -53632 82335 87287
17688H7287L27230B0897K2379c5596A3682b00298A5523J28095C6079g2253A5337
$$ 87287 414517 20897 43276 -35596 13682 -200298 15523 143618 36079 -72253 15337
17676A56437c0939n1848c1716j29890A31838n8977c5133k9720B52396a87088r2351
$$ 156437 -30939 -82787 -31716 -161606 131838 72861 -35133 -64853 252396 -187088 -279439
17665b79439C30249H7979R055l7190O6987K3605b24791E01116B13361A00222b00732
$$ -279439 330249 87979 97034 59844 126831 150436 -224791 501116 213361 100222 -200732
17653I7321J67302j13364a08558B96278j16598h9762C14600e6171I539K8911J44922
$$ 97321 264623 151259 -108558 296278 179680 -89762 314600 -56171 9539 38450 183372
17642A83372o8522j7117a21583j01254A63398l8254d48505B60881M6374C2615
$$ 183372 114850 97733 -121583 -222837 163398 125144 -448505 260881 307255 32615
17631A44343a39958A63279g5742C7926g8003A46291e4616p4899C30334b14240
$$ 144343 -139958 163279 -75742 37926 -78003 146291 -54616 -129515 330334 -214240
17620H1284R5203m6024a23367C95197B3311b86281J33880N0447M5767j19968d3926
$$ 81284 176487 130463 -123367 395197 23311 -286281 -152401 -101954 -56187 -176155 -43926
17608a60991c2151C1933L14367d6943A94170a22249I6340b50074f3724A74127
$$ -160991 -32151 31933 346300 -46943 194170 -122249 96340 -250074 -63724 174127
17597D437O9497A5083L60857a01085M150A89834g4246B39493H1389J65357J64766
$$ 4437 73934 15083 375940 -101085 -96935 189834 -74246 239493 81389 246746 411512
17586D11512h4629R042c5511E5424P7722C3769Q0494J01876q3381a15248A80245
$$ 411512 -84629 -75587 -35511 55424 133146 33769 114263 216139 132758 -115248 180245
17574A35474a37048A68701O5563b0276j66313H7542J32198I7996a02047j14498
$$ 135474 -137048 168701 234264 -20276 -186589 87542 219740 97996 -102047 -216545
17564b16545I366J65673O9266E2650j4640J3016B4322K19501b8069D6276J30131
$$ -216545 9366 175039 244305 52650 38010 51026 24322 243823 -28069 46276 176407
17553A76407l6512A2755N5179K22164l8882o0704J141G7563K71021D8596L41996
$$ 176407 139895 12755 67934 290098 251216 190512 191653 77563 348584 48596 390592
17542C90592E2905c63441A18295j0704J42349f758j43851d762F6230K16783d0480
$$ 390592 52905 -363441 118295 107591 249940 -6758 -150609 -4762 66230 283013 -40480
17530C41546j29329G3079A8825b70990a21639A56140b25289b3408E4530f4480
$$ 341546 212217 73079 18825 -270990 -121639 156140 -225289 -23408 54530 -64480
17519A55265a07388J0012k26180b9729F7878N4572g9024j8341A67220b31607J02344
$$ 155265 -107388 -97376 -323556 -29729 67878 122450 -79024 -97365 167220 -231607 -129263
17508a29263A80760J14470D4667b45260B42342a09326a5189B36430a17572A64709
$$ -129263 180760 295230 44667 -245260 242342 -109326 -15189 236430 -117572 164709
17497D02421A84097G6445K36576a10272B89500d24495H4589j6902a6428A69636
$$ 402421 184097 76445 313021 -110272 289500 -424495 84589 67687 -16428 169636
17486A25381J47856A4533D38O6022R8541B0613L33980m8002R855a71640r805C88773
$$ 125381 273237 14533 438 66460 165001 20613 354593 306591 316446 -171640 -181445 388773
17473A22757l2992K02281D7546K82687K2491c369H2405J59280D0783Q6504a35432
$$ 122757 89765 292046 47546 330233 352724 -3369 82405 241685 40783 127287 -135432
17461B92981H6368L12825A38794N35681H9303K73863p1370A41481F6976a50847
$$ 292981 86368 399193 138794 674475 89303 363166 291796 141481 66976 -150847
17450B12361o4850J521N35063j79132k31512p3990K05756A79802D2817b8683g924
$$ 212361 147511 149032 684095 504963 273451 199461 405217 179802 42817 -28683 -7924
17438A57932L9221n2899K86497A09119f2630D07969K36144i8814C54042H2494
$$ 157932 197153 144254 430751 109119 -62630 407969 644113 -98814 354042 82494
17427E435P7898K97927b2418A29888Q102K78186E6097K30666d2374D15029j27239
$$ 5435 83333 381260 -22418 129888 137990 416176 56097 286763 -42374 415029 287790
17416B87790N3772g2727D62919D6115K82496A45657j1981b51574B96087a8751
$$ 287790 341562 -72727 462919 46115 328611 145657 133676 -251574 296087 -18751
17405D93253k35517n5261J02611j49378K72687A48573K21758o9251G7491L00551
$$ 493253 257736 202475 305086 155708 428395 148573 370331 301080 77491 378042
17395C78042A35061a24516A89973L70956c3795A53634n7853C2885L14964F299
$$ 378042 135061 -124516 189973 560929 -33795 153634 95781 32885 347849 6299
17384C40266I4516J6575l8494i3952F41761e5816O105j0812A16021d5341A31411
$$ 340266 94516 111091 72597 -93952 641761 -55816 -49711 -60523 116021 -45341 131411
17372E43202B71569J44590j82544B3170J0492N07942H4456L43968A36972b02599
$$ 543202 271569 416159 233615 23170 33662 541604 84456 428424 136972 -202599
17361a0429B44914C3405J75974b3538B75534n7849f4475b942B13227J28135E3854
$$ -10429 244914 33405 209379 -23538 275534 217685 -64475 -2942 213227 341362 53854
17349A13248J67308c9152A94760m8422K02863a92291B65198D562J90157i8807
$$ 113248 280556 -39152 194760 146338 349201 -192291 265198 4562 194719 -98807
17338I6423K42754H9511M0302l243K05122b7553I6243O4824M0671J20771b52478
$$ 96423 339177 89511 129813 126570 331692 -27553 96243 161067 201738 322509 -252478
17326b15595B82289K8566I437J41221e2270A69992g4861I2030d3831A67878G5120
$$ -215595 282289 310855 9437 150658 -52270 169992 -74861 92030 -43831 167878 75120
17314A02392K29956F1178P3255f7049A44686Q4754c4112E04013j00862f2786I631
$$ 102392 332348 61178 134433 -67049 144686 229440 -34112 504013 403151 -62786 9631
17302C03039j14217J03089G283M02656E5950B6932M2435j2552J59654A02577L8438
$$ 303039 188822 291911 7283 409939 55950 26932 69367 56815 216469 102577 141015
17291A41015D2997Q3112L1675G1824P7037J61338k1958c0583K22B48146m2687
$$ 141015 42997 126109 157784 71824 148861 310199 288241 -30583 -30361 248146 205459
17280B05459R8977J87053D2928K33727a1914m684D02310p6288j15530g9441B69503
$$ 205459 304436 491489 42928 276655 -11914 -16598 402310 326022 210492 -79441 269503
17268B17354P7648p7439F6692L61956a6783C36164A34417J68509j3745j2373A22073
$$ 217354 295002 217563 66692 428648 -16783 336164 134417 302926 289181 276808 122073
17256B04890K6072m7924R1843F1405K61653A28596l8271L0568K81277A63389F695
$$ 204890 230962 183038 274881 61405 323058 128596 90325 120893 402170 163389 6695
17244B10649O587a3623F7145a27834B34730k168G8482a805o2148C78959C3068
$$ 210649 217236 -13623 67145 -127834 234730 232562 78482 -1805 -63953 378959 33068
17232A09684L72177k02018l5395B5869K24393J5717J786l0855H5010J5421J09753
$$ 109684 481861 279843 244448 25869 250262 265979 267765 236910 85010 100431 210184
17221B10184m0966J97691J08434A38368k0757J50184k7689M1208D373J85829J11318
$$ 210184 169218 366909 475343 138368 117611 267795 240106 281314 4373 190202 301520
17210C01520a23966A5339O72065C0081J51578q3465K01142N1450C3152K61097
$$ 301520 -123966 15339 687404 30081 181659 98194 299336 350786 33152 294249
17200B94249A19493J18843K88399M1726k17063F372M44834A39416J86774J69462
$$ 294249 119493 238336 526735 568461 351398 6372 451206 139416 326190 495652
17190D95652o3541j7533K38747g1227H5672N10901j2842h78C12538J62478A73698
$$ 495652 432111 414578 653325 -71227 85672 596573 583731 -878 312538 475016 173698
17178b4514A87666J00010L5606E4169a14232A54662J87122J7496K25745A31525
$$ -24514 187666 287676 323282 54169 -114232 154662 341784 359280 585025 131525
17167C04997N70383B72742A08445M87953j60026n0909j54798n3770n2834K58460
$$ 304997 875380 272742 108445 596398 436372 385463 230665 176895 124061 382521
17157C82521A72790J87766K0577A82141q7739Q4318J03217K73570B41980A18360
$$ 382521 172790 360556 381133 182141 94402 178720 281937 555507 241980 118360
17146C98116o3487l9455A29999b56055A45241K69679N1867r515B09179d7495D19562
$$ 398116 334629 295174 129999 -256055 145241 414920 466787 457272 209179 -47495 419562
17134B0111M42163l8674G3363K47501K6373j52474A8775N29692J1341o2801A92267
$$ 20111 462274 423600 73363 320864 347237 194763 18775 548467 559808 497007 192267
17122D33781o6825j29400J21464I1513Q6614M31054k52191l8844j2717N4479A22792
$$ 433781 366956 237556 359020 91513 178127 609181 356990 318146 305429 359908 122792
17110A02562N95257k25999J72165k69808K37325j51490m814q6126r3920Q2149
$$ 102562 697819 471820 643985 374177 611502 460012 455198 369072 275152 357301
17100C57301J28546j21175K5210L57191A73712L16886I7524K42200j18013R0808
$$ 357301 485847 364672 389882 747073 173712 490598 97524 339724 221711 312519
17090C12519J19169Q2721A42757K80459r5136d9927E25537L3321k8044o1081A39328
$$ 312519 431688 514409 142757 423216 328080 -49927 525537 558858 530814 469733 139328
17078E57374B49857L71246k61076J49559k45975L03939k03452L00161j65494N6598
$$ 557374 249857 621103 360027 509586 263611 567550 364098 664259 498765 555363
17068E55363J26248k81359J64385J92850l75243J03608J74102M05213C64051J18391
$$ 555363 681611 400252 564637 757487 382244 485852 659954 1065167 364051 482442
17058D82442J0668O1823N4985J02177j9527k07315R3505n6006j34131M4774K02860
$$ 482442 493110 554933 609918 712095 692568 485253 578758 522752 388621 433395 636255
17047F36255l9489j90168M61398l26201k55486M15225j1283k84393j37795J35933
$$ 636255 596766 406598 867996 541795 286309 701534 690251 405858 268063 403996
17037D03996K5949J47393J07712k02437j02954J08838R7179J58695j3946j90953
$$ 403996 429945 577338 685050 482613 379659 488497 585676 744371 730425 539472
17027E39472J09054j33693m3600J21176M2335Q3968K8154J90715l62002o0888
$$ 539472 648526 514833 471233 592409 634744 718712 746866 937581 575579 514691
17017E14691J79890j748K19369C59710K16299J2639J36151j46088L90382l86160
$$ 514691 694581 692833 912202 359710 576009 588648 724799 578711 969093 582933
17007E82933k04369K46071Q1799P5973j47004n3266K94831j63681j2298j2106
$$ 582933 378564 624635 706434 782407 635403 582137 876968 713287 700989 688883
16997F88883q5493m3953L06694r6663j34556j73926L45664K06405l61120K08457
$$ 688883 603390 559437 866131 769468 634912 460986 806650 1013055 651935 860392
16987H60392l22414M34134j24038l8954J52491q6545l5046o8972J74086m3427
$$ 860392 537978 972112 848074 809120 961611 875066 840020 771048 945134 901707
16977I01707J22825j28426k391j6762j16621K32960r8791M7079Q0232r8156N5239
$$ 901707 1024532 896106 893715 876953 760332 993292 894501 941580 1021812 923656 978895
16966I78895l988k38645K68793k26170n2400L79007k75141O2974J28022J91642
$$ 978895 974907 736262 1005055 778885 726485 1105492 830351 893325 1021347 1212989
16956A212989j88136l94968N39200R9883F14124N40929m7269K93665j58981j5127
$$ 1212989 1024853 629885 1169085 1268968 614124 1155053 1107784 1401449 1242468 1227341
16946A227341j99218J41203k61019L28704j49959J56427j01734M0519L53881l68022
$$ 1227341 1028123 1169326 908307 1237011 1087052 1243479 1141745 1182264 1536145 1168123
16936A168123J89550k8623k14631k2917M33629l68389K3826j37122K46239m6007
$$ 1168123 1357673 1329050 1114419 1091502 1525131 1156742 1180568 1043446 1289685 1243678
16926A243678Q9062k08592L62029j42882J38777K71492k85095J88113m4594k6646
$$ 1243678 1332740 1124148 1486177 1343295 1482072 1753564 1468469 1656582 1611988 1585342
16916A585342j77944m11389M91087J30556J54472l73225N20540K9280j33084j95241
$$ 1585342 1407398 996009 1487096 1617652 1772124 1398899 1919439 1948719 1815635 1620394
16906A620394J9774l13812K11595J64259q1210K61037l39346K86107k80052M21104
$$ 1620394 1640168 1326356 1537951 1702210 1621000 1882037 1542691 1828798 1548746 1969850
16896A969850k54149J62657j04628M31833n55811L49124k36890l6135M01392k01740
$$ 1969850 1715701 1878358 1773730 2205563 1649752 1998876 1761986 1725851 2127243 1925503
16886A925503K26715p9430J50066j91183J91334J56289j92465k6436K22828j65194
$$ 1925503 2152218 2072788 2222854 2031671 2223005 2379294 2186829 2160393 2383221 2218027
16876B218027L06679r3863k59582r7843N39145j03028k97965N15785k79446K38517
$$ 2218027 2524706 2430843 2171261 2073418 2612563 2509535 2211570 2727355 2447909 2686426
16866B686426m3486P7431L7159j89249J42808r6482J55836J48868p1162R1999
$$ 2686426 2642940 2720371 2757530 2568281 2711089 2614607 2770443 2919311 2848149 2940148
16856B940148L07807q2274k09464J40897M72522k28816M0191m1364L5739R6331
$$ 2940148 3247955 3165681 2956217 3097114 3569636 3340820 3381011 3339647 3375386 3471717
16846C471717K20148n66741J74640J57562j95516O02826k4550J37667N5202k2749
$$ 3471717 3691865 3125124 3299764 3457326 3261810 3864636 3840086 3977753 4032955 4010206
16836D010206j58353M23876m27910K05568M82657r9486j5745K75877L66074k67844
$$ 4010206 3851853 4275729 3847819 4053387 4536044 4436558 4420813 4696690 5062764 4794920
16826D794920j18110q8783K30779O27522m86038J79171M5932K38990k29976L32263
$$ 4794920 4676810 4588027 4818806 5446328 4960290 5139461 5185393 5424383 5194407 5526670
16816E526670L69927M621N0420L45178l39571M17919N34104k13010L58137j52433
$$ 5526670 5896597 5901218 5951638 6296816 5957245 6375164 6909268 6696258 7054395 6901962
16806F901962L38793m9962J72581O4306M10479J00608J49988J03407M18283r337
$$ 6901962 7240755 7190793 7363374 7427680 7838159 7938767 8088755 8192162 8610445 8601108
16796H601108K69365M8795L43367O43434J75296N6166O6185K64139N36408j47927
$$ 8601108 8870473 8919268 9262635 9906069 10081365 10137531 10203716 10467855 11004263 10856336
16786A0856336K65870R66916o296K11988N01435M21516K71824P74351L4378P59516
$$ 10856336 11122206 12089122 12082826 12294814 12796249 13217765 13489589 14263940 14298318 15057834
16776A5057834K45862K45622O17601P45664K99303N13250P79487N84178N76095
$$ 15057834 15303696 15549318 16166919 16912583 17211886 17725136 18504623 19088801 19664896
16767A9664896J026736N93842N34676Q39853J197159P08458J242307P03822J239201
$$ 19664896 20691632 21285474 21820150 22660003 23857162 24565620 25807927 26511749 27750950
16758B7750950J168556J011638J161514J517590J627866J577585J519321J625790
$$ 27750950 28919506 29931144 31092658 32610248 34238114 35815699 37335020 38960810
16750C8960810J939270K132579K018304K128812K981020K521074K849356K947779
$$ 38960810 40900080 43032659 45050963 47179775 50160795 52681869 55531225 58479004
16742E8479004L302881L718220L458874M180367M383340M661240N185362N438562
$$ 58479004 61781885 65500105 68958979 73139346 77522686 82183926 87369288 92807850
16734I2807850N613571N919802O737488P178478P155540P599132Q227462Q349920
$$ 92807850 98421421 104341223 111078711 118257189 125412729 133011861 141239323 149589243
16726A49589243Q618177Q661991Q171907Q268848P752438O791028O208848M702561
$$ 149589243 158207420 166869411 175041318 183310166 191062604 197853632 204062480 208765041
16718B08765041L160003J525452J195697j871982k641700m190430n838575o248744
$$ 208765041 211925044 213450496 214646193 212774211 210132511 205942081 200103506 193854762
16710A93854762p414511p861765q620999q692956q627050q794218q413189p836823
$$ 193854762 186440251 178578486 169957487 161264531 152637481 143843263 135430074 127593251
16702A27593251p856167p505745p145813o291904n690828o087734n186327m870616
$$ 127593251 119737084 112231339 105085526 98793622 93102794 87015060 81828733 76958117
16694G6958117m798560l818195m264531l664242k773952l467095l365600k523703
$$ 76958117 72159557 68341362 64076831 60412589 57638637 54171542 50805942 48282239
16686D8282239k584639k136605k466801k189646j373062k345955j473672j162086
$$ 48282239 45697600 43560995 41094194 38904548 37531486 35185531 33711859 32549773
16678C2549773j655156j404307j195511j252249j174727r37957j176354p92736
$$ 32549773 30894617 29490310 28294799 27042550 25867823 24929866 23753512 22960776
16670B2960776j020313j157760p44595n98171p17651p73383k78413o87998n90399
$$ 22960776 21940463 20782703 20038108 19439937 18722286 17948903 17670490 16982492 16392093
16661A6392093o98568l99899p61577n11758l07254k21084n07430n62707j50677
$$ 16392093 15693525 15293626 14532049 14020291 13713037 13491953 12984523 12421816 12271139
16652A2271139m14396k26022r31365P4408n21321m4568m70303n90587J77371j60672
$$ 12271139 11856743 11630721 10699356 10773764 10252443 10207875 9737572 9146985 9324356 9163684
16642I163684m62677m50699M50257m77185k89852N0283j03076k61640o38214l5133
$$ 9163684 8701007 8250308 8700565 8223380 7933528 7983811 7880735 7619095 6980881 6945748
16632F945748r2700j23189p9854l52518J69051n72256J1911p621j77485j47466
$$ 6945748 6853048 6729859 6650005 6297487 6466538 5894282 5906193 5898572 5721087 5573621
16622E573621m6059j81073P8784j27366j13361l40535m0352j62484J01874J94784
$$ 5573621 5527562 5346489 5425273 5297907 5184546 4844011 4803659 4641175 4743049 4937833
16612D937833k90766n18016M13504k60514l83044q2073K86848J5321l26345k75400
$$ 4937833 4647067 4129051 4542555 4282041 3898997 3816924 4103772 4119093 3792748 3517348
16602C517348L90076j21237k53974k37991K78888k11524j2060k91957j41011L77904
$$ 3517348 3907424 3786187 3532213 3294222 3573110 3361586 3349526 3057569 2916558 3294462
16592C294462l23730K09847m7231j14430l41266p7568j02488K59105j2117P6256
$$ 3294462 2970732 3180579 3133348 3018918 2677652 2600084 2497596 2756701 2744584 2820840
16582B820840o1411m8947j79079l5060j10910L89577m13229j20056J54306m14083
$$ 2820840 2759429 2710482 2531403 2496343 2385433 2775010 2361781 2241725 2396031 1981948
16572A981948L12657q5775L1677j19142j53462K67109j52552r5174L8361l3817
$$ 1981948 2294605 2208830 2240507 2121365 1967903 2235012 2082460 1987286 2025647 1991830
16562A991830N2238k9188J18520k18973J3655j3246l0023R9885p5072n05933P7523
$$ 1991830 2044068 2014880 2133400 1914427 1928082 1914836 1884813 1984698 1909626 1403693 1481216
16551A481216K93081r284l34129L82564k05451k66337L55440j14125M5673l07712
$$ 1481216 1774297 1765013 1430884 1813448 1607997 1341660 1697100 1582975 1628648 1320936
16541A320936J46714M8688j8563k86363K11391k11610K75886k88992k06419n2561
$$ 1320936 1467650 1516338 1497775 1211412 1422803 1211193 1487079 1198087 991668 939107
16531I39107N82148l79152K67964j95940O8201r6599J66374m65890O55448n09968
$$ 939107 1521255 1142103 1410067 1214127 1282328 1185729 1352103 886213 1541661 1031693
16521A031693N35468m43456R8643J48775l56372K06635J27750n08399L5026J7463
$$ 1031693 1567161 1123705 1222348 1371123 1014751 1221386 1349136 840737 875763 893226
16511H93226k3981K64971j21302j17634J35609j73972M02004F10945N35690m19033
$$ 893226 869245 1134216 1012914 895280 1030889 856917 1258921 610945 1146635 727602
16501G27602J92080j61480J90167k5873P7825j01125M3447O8243k9974l19473
$$ 727602 919682 758202 948369 922496 1000321 899196 942643 1010886 980912 661439
16491F61439J81047J5488J44432k21256Q7329j66276J79416B86140P40830j59076
$$ 661439 842486 857974 1002406 781150 868479 702203 881619 286140 1026970 867894
16481H67894K10353k68018m832j17659p6768K19554j73200K72963k30383J05205
$$ 867894 1078247 810229 805397 687738 610970 830524 657324 930287 699904 805109
16471H05109k25403J14844N5035K31564m09246o6875Q0707j36253K88280q5737
$$ 805109 579706 694550 749585 981149 571903 505028 585735 449482 737762 652025
16461F52025p0787J77854j17539C05871P3966M01792j49534q3471n195l3868l8795
$$ 652025 581238 759092 641553 305871 379837 781629 632095 548624 543429 509561 470766
16450D70766m4563J97932m0249j1697j56747M90283l93542k5437j60152q1855
$$ 470766 426203 624135 583886 572189 415442 905725 512183 486746 326594 244739
16440B44739M59253j92568Q5028k56430P26692m43632k36412K0833J02391J47990
$$ 244739 703992 511424 596452 340022 1066714 623082 386670 407503 509894 657884
16430F57884k42573R511L38880A16164N39406J2547B24051K03044K29451j84156
$$ 657884 415311 424822 763702 116164 655570 668117 224051 427095 656546 472390
16420D72390j59076n3594L66047k23347k6970P533K86470C30061j33794M48938
$$ 472390 313314 259720 625767 402420 375450 382983 669453 330061 196267 645205
16410F45205B64272K90394r1959K26175k17337A47415L11807j84687p758O28931
$$ 645205 264272 554666 462707 688882 471545 147415 459222 274535 266777 895708
16400H95708B09609J86109o3988o3649J11811a19918E80504A96413L14422k32332
$$ 895708 209609 395718 331730 268081 379892 -119918 580504 196413 510835 278503
16390B78503K53155B60640K31796n5701E7783K75565R1700p9066l4073N7303j62188
$$ 278503 531658 260640 492436 436735 57783 333348 425048 345982 311909 369212 207024
16379B07024J17991J65269Q4741B30376A877K92869J86825j80464j5685K79676
$$ 207024 325015 490284 575025 230376 1877 294746 481571 301107 285422 565098
16369E65098B64602L40803A12058J35601J50261j15385J0624C7387P3201J00078
$$ 565098 264602 605405 112058 247659 397920 282535 293159 37387 110588 210666
16359B10666a06863C66169b69766G5502L20435A63366M0291J641m2519j4283J5181
$$ 210666 -106863 366169 -269766 75502 395937 163366 203657 205298 162779 148496 163677
16348A63677a7596B00233m2772J43415l7942q0842K00859E0627K58043A14659
$$ 163677 -17596 200233 157461 300876 262934 182092 382951 50627 308670 114659
16337A65975R3074K8198J60006E4590O9519L94633j39552j07181K3878k5057q6390
$$ 165975 259049 287247 447253 54590 124109 518742 379190 272009 295887 270830 184440
16326A84440O968D0395J80556M7958r4478J80115b4159B03463F7975O2832d4543
$$ 184440 191408 40395 220951 268909 174431 354546 -24159 203463 67975 130807 -44543
16314a01784R905B6174K77697A22319K5065l8110A8583L03257L1336j15569A14740
$$ -101784 -91879 26174 303871 122319 147384 109274 18583 321840 353176 237607 114740
16302a51560A11982c1287C13058R1890F9669B9925f8411C17542j53468L545O1635
$$ -151560 111982 -31287 313058 404948 69669 29925 -68411 317542 164074 167619 229254
16291B29254A3487L34885K0569j77819K2809J6895p7729l6068h0862D49085A30808
$$ 229254 13487 348372 368941 191122 213931 230826 153097 117029 -80862 449085 130808
16279a33889p4332D10425j25828A01183K09768a30444G2867K18787j25208G0178
$$ -133889 -208221 410425 284597 101183 310951 -130444 72867 291654 166446 70178
16268B96245G9332J53222o59l6110q7129J85413j10564A0647L75610a7044A60359
$$ 296245 79332 232554 231895 195785 108656 294069 183505 10647 386257 -17044 160359
16256B15364N2560Q4381C6300K4836k959J35933b1785j26311N8371B30814J2433
$$ 215364 267924 352305 36300 61136 58177 194110 -21785 -148096 -89725 230814 243247
16245B43247n5034J52070K8992H0584M8897C4949K05921C738b24401f8727B63463
$$ 243247 188213 340283 369275 80584 129481 34949 240870 3738 -224401 -68727 263463
16233a03914M2663j04511D02711A79637o47b66590B45136a3287C65573A18068
$$ -103914 -61251 -165762 402711 179637 178990 -266590 245136 -13287 365573 118068
16222a38199f8438b9011G0605g6952A3135K02384a28608C14706a47105A26511
$$ -138199 -68438 -29011 70605 -76952 13135 215519 -128608 314706 -147105 126511
16211B80534A00178Q4157f6998E8321N12589A66489e7873n5468j2624B7597a61265
$$ 280534 100178 184335 -66998 58321 570910 166489 -57873 -113341 -125965 27597 -161265
16199A61308C338J02787b2456A8605b27502G4609d7629A79764e4007C51797E7127
$$ 161308 3338 106125 -22456 18605 -227502 74609 -47629 179764 -54007 351797 57127
16187E3935K4837k8936L0888h2292E5768n075J8773L39883a20343b948A47436
$$ 53935 78772 49836 80724 -82292 55768 50693 69466 409349 -120343 -2948 147436
16175B67466a03708o2693A57020a71172B5917O164o718O5742l6997b40272H4143
$$ 267466 -103708 -166401 157020 -171172 25917 32081 25363 91105 54108 -240272 84143
16163a27864p0191e0331C43449J11618d8690n46r8937B2065e1338A18655e4913
$$ -127864 -198055 -50331 343449 455067 -48690 -49236 -148173 22065 -51338 118655 -54913
16151a5791B68358a80208G204a83424A07395N6776B3006J7049K6861b00540N8410
$$ -15791 268358 -180208 7204 -183424 107395 164171 23006 40055 66916 -200540 -142130
16140a42130B93912E043K45766a17792d5192o1590e0943B9700c6282l77870I8005
$$ -142130 293912 5043 250809 -117792 -45192 -106782 -50943 29700 -36282 -414152 98005
16128c0220l33444a31503A29310a09228I8474j9286k6420P3184e387B69267A18056
$$ -30220 -363664 -131503 129310 -109228 98474 79188 52768 125952 -5387 269267 118056
16116a76064A52995b5328E8189J44822p2657f020A38332b39C23213N3321A50226
$$ -176064 152995 -25328 58189 203011 130354 -6020 138332 -239 323213 376534 150226
16104B23895Q570C4872K3712B938a04336A82985J22385a86485h667n1895K5528
$$ 223895 232465 34872 58584 2938 -104336 182985 305370 -186485 -8667 -60562 -35034
16093c5034C29617a1971n3912A46407b54940P4018A01575C1932g4384B75104J19981
$$ -35034 329617 -11971 -65883 146407 -254940 -180922 101575 31932 -74384 275104 395085
16082C95085A10564e4556j76876j16219B54960a29290J7270C80443E412J36342
$$ 395085 110564 -54556 -231432 -347651 254960 -129290 -112020 380443 5412 141754
16072A41754b58579A15363R1730c7934D1550a92902A54573b07530j83490d1894
$$ 141754 -258579 115363 207093 -37934 41550 -192902 154573 -207530 -391020 -41894
16061c1125j8076n2456j4993e0621k3076I1582b7325k11337B10514a62668C50528
$$ -31125 -49201 -101657 -116650 -50621 -73697 91582 -27325 -238662 210514 -162668 350528
16049a73032B61947I883a5532k88792i4609j13195B62659D7341p089J0891L3982
$$ -173032 261947 9883 -15532 -304324 -94609 -207804 262659 47341 40252 51143 85125
16038H5125L2962g9614A0901J08597C9520a23623A37244o4640e09286a00927D5594
$$ 85125 118087 -79614 10901 119498 39520 -123623 137244 72604 -509286 -100927 45594
16026a36841H100Q985c43840E290c20677h2194C06609a88942C3069h9492K8467
$$ -136841 8100 17085 -343840 5290 -320677 -82194 306609 -188942 33069 -89492 -61025
16015f1025R922A97080o4325a58454k0014m3010G4237b23868A10446g0124b9745
$$ -61025 -51103 197080 132755 -158454 -178468 -221478 74237 -223868 110446 -70124 -29745
16003A03918Q7280q4076A0404K5279a43931j06866G5469N5879b8425j64547R0936
$$ 103918 191198 107122 10404 35683 -143931 -250797 75469 131348 -28425 -192972 -102036
15992a02036k33588B31457a20024G2644f0949A40788C9918K14414k7072K15407
$$ -102036 -335624 231457 -120024 72644 -60949 140788 39918 254332 227260 442667
15982D42667d8408B17126r0790l4819b31891A06068a21726K5658a4970m7455k2185
$$ 442667 -48408 217126 126336 91517 -231891 106068 -121726 -96068 -14970 -62425 -84610
15971h4610A01859a52600g1548B23474o4864j2973B709J94223b19733j07836B40252
$$ -84610 101859 -152600 -71548 223474 158610 145637 2709 196932 -219733 -327569 240252
15959E1076J18118i4203B85229b74247H3783b18651D7561L1324j3258A3971b952
$$ 51076 169194 -94203 285229 -274247 83783 -218651 47561 78885 65627 13971 -2952
15947A50940a76403N3370I3451b2085m2798n0742k63666a82504b1824n1800C08608
$$ 150940 -176403 -123033 93451 -22085 -64883 -115625 -379291 -182504 -21824 -73624 308608
15935a10666m502A6746P3587J02701a97592m6733Q7170A0081e4459A21704g2456
$$ -110666 -115168 16746 90333 193034 -197592 -244325 -157155 10081 -54459 121704 -72456
15923B41553D9092L58881c59859J5418C1925a65315B01754H1632J95875o8192
$$ 241553 49092 407973 -359859 -344441 31925 -165315 201754 81632 277507 209315
15913B09315a98334L9295n392B36336h4506C37138j17154C6952h891o2719A73333
$$ 209315 -198334 -159039 -164431 236336 -84506 337138 219984 36952 -8891 -71610 173333
15901c00159D4126a13898K6871a4171j38682J3493e9609p8562G9291a88852A7895
$$ -300159 44126 -113898 -87027 -14171 -152853 -139360 -59609 -138171 79291 -188852 17895
15889d0718k0301j655D15789A78132b30001R7888L1167A24290E0457L102a13032
$$ -40718 -61019 -62674 415789 178132 -230001 -132113 -100946 124290 50457 53559 -113032
15877f709k88639a44513A51016d8368H7076a89840b7844J3840n8121r9069m2928
$$ -6709 -295348 -144513 151016 -48368 87076 -189840 -27844 -14004 -72125 -171194 -214122
15866b14122R2034C80098c01359J05836h0005p3029n4149r8572a04121C3557K54997
$$ -214122 -122088 380098 -301359 -195523 -80005 -153034 -207183 -305755 -104121 33557 288554
15855B88554E6859B356J94463a07556A81815a34572D7262A2677M8959K14802a20890
$$ 288554 56859 2356 196819 -107556 181815 -134572 47262 12677 61636 276438 -120890
15843B80241a99858H6698n891h2426j75095P6177A44904e4236A03464b1131k97975
$$ 280241 -199858 86698 80807 -82426 -257521 -181344 144904 -54236 103464 -21131 -319106
15832c19106a25359B59320b1176j55090M9902A56159p7861K26826e4219F4054
$$ -319106 -125359 259320 -21176 -176266 -126364 156159 78298 305124 -54219 64054
15821b40488Q5331j07330M9571K5800O1483H4092N3910b64018L9155B15050a66671
$$ -240488 -155157 -262487 -212916 -187116 -125633 84092 138002 -264018 -224863 215050 -166671
15809f0336A00094a4123A41567a4246D0290J25039a20336B31122e8468G4330b7062
$$ -60336 100094 -14123 141567 -14246 40290 165329 -120336 231122 -58468 74330 -27062
15797D5911J30001p0042A751K88823c8169l3281H8468c37819K437a19177F1959
$$ 45911 175912 105870 1751 290574 -38169 -71450 88468 -337819 -335382 -119177 61959
15785a14740B5862J23849e4949k10062a20434M9473k9241A89040a61433C8385
$$ -114740 25862 149711 -54949 -265011 -120434 -70961 -100202 189040 -161433 38385
15774b65687J09919d9335m8564E6217e9730C02590h5493J0772j20574k3113J5597
$$ -265687 -155768 -49335 -97899 56217 -59730 302590 -85493 -74721 -195295 -218408 -202811
15763b02811r436f3697m9343m1439M8565A15959L7046p0116i7404b5863E9599
$$ -202811 -212247 -63697 -113040 -154479 -105914 115959 153005 82889 -97404 -25863 59599
15751b17180c5604j04303A14563a38603B70834A2567Q2566k1227b19152A58524
$$ -217180 -35604 -139907 114563 -138603 270834 12567 95133 73906 -219152 158524
15740C15691h0246j43287B6084K15995c88233J66044F1741f4449j02668A31652
$$ 315691 -80246 -223533 26084 242079 -388233 -222189 61741 -64449 -167117 131652
15729b21341j83014d6127j41999j44563e3126b1021j24422j08835A52685b60335
$$ -221341 -404355 -46127 -188126 -332689 -53126 -21021 -145443 -254278 152685 -260335
15718c03488F1491a44703G4240b8361j64961H7460J8065c531k49541a21971D2149
$$ -303488 61491 -144703 74240 -28361 -193322 87460 105525 -3531 -253072 -121971 42149
15706i3263A89025c96375A11326A6638J68980D1162g9582j84043E2708c9098k13948
$$ -93263 189025 -396375 111326 16638 185618 41162 -79582 -263625 52708 -39098 -253046
15695b53046M0720A74004a20894b7261B69644E8193f2521q508F0054j9619a25035
$$ -253046 -212326 174004 -120894 -27261 269644 58193 -62521 -71029 60054 40435 -125035
15683c94451A94670e3638D3518a06561E8601b71309I5366b14659j52246F4368
$$ -394451 194670 -53638 43518 -106561 58601 -271309 95366 -214659 -366905 64368
15672I1809d21998H7021K19436B1957M46186k21127a34883G2372c10044B76094
$$ 91809 -421998 87021 306457 21957 468143 247016 -134883 72372 -310044 276094
15661a84172j37313C41026c74632a35796A79305d7532B17975a30981I140b5197
$$ -184172 -321485 341026 -374632 -135796 179305 -47532 217975 -130981 9140 -25197
15650b80100A35900h6144B3939d2944j48381f7591j83552F9809N9079a43639a9234
$$ -280100 135900 -86144 23939 -42944 -191325 -67591 -251143 69809 128888 -143639 -19234
15638B70270j18435n9998a55058B8250M0192b62255a08504a9915G798L0043a10523
$$ 270270 151835 91837 -155058 28250 68442 -262255 -108504 -19915 7798 37841 -110523
15626b3620D0984K8686O7491a10527A47012a6289q3170B4158f2180A29497b48203
$$ -23620 40984 69670 137161 -110527 147012 -16289 -99459 24158 -62180 129497 -248203
15614c01106c8063p4990a2082k20800a9307A7909a61963c5849k57784B28892a1237
$$ -301106 -38063 -113053 -12082 -232882 -19307 17909 -161963 -35849 -293633 228892 -11237
15602a19931M3690m8363A23511N7359J34411a65121A85036a76837H8680a42264
$$ -119931 -76241 -124604 123511 180870 315281 -165121 185036 -176837 88680 -142264
15591B5822d30204h0591a8449l6164B5809K29913B079K39103a1935I3641F392
$$ 25822 -430204 -80591 -18449 -54613 25809 255722 2079 241182 -11935 93641 6392
15579a18800n5318h753B71765E6813b56641K9328j6872c3401j32380B5806K25767
$$ -118800 -174118 -8753 271765 56813 -256641 -227313 -244185 -33401 -165781 25806 251573
15568B51573k9576g3263A55354a06220A73378a87973A15827J33365G3882b30062
$$ 251573 221997 -73263 155354 -106220 173378 -187973 115827 249192 73882 -230062
15557f5429A7988f9996j05973A64783b19298G3676c21996B7217Q6498b0634l5497
$$ -65429 17988 -69996 -175969 164783 -219298 73676 -321996 27217 113715 -20634 -56131
15546e6131j47298n1564a18068H1516b09865P974g5293B45679h0621K3640A40782
$$ -56131 -203429 -254993 -118068 81516 -209865 -201891 -75293 245679 -80621 -56981 140782
15534f0078j25886I6550B3175f8131m83586g1014D52J31114J55602a17016B41754
$$ -60078 -185964 96550 23175 -68131 -551717 -71014 452 131566 287168 -117016 241754
15522a14333G1289b74067P5855R2646n9636a8507E8516a8637j45254A44898L8610
$$ -114333 71289 -274067 -198212 -105566 -165202 -18507 58516 -18637 -163891 144898 183508
15511A83508I0212g8115l14515J89275A70990a62940A26216d78191D430P0836
$$ 183508 90212 -78115 -392630 -203355 170990 -162940 126216 -478191 4430 75266
15501G5266b68860A69392J17489A37386C2857P8908b96981j00535a4009j76425
$$ 75266 -268860 169392 286881 137386 32857 111765 -296981 -397516 -14009 -190434
15491a90434j42721J25565I6733J24113c08899h4677B48131j17261c5704G4847
$$ -190434 -333155 -207590 96733 220846 -308899 -84677 248131 130870 -35704 74847
15480a71264j7335Q5046D08076a46009j2654I2888a17128k16692I5214Q7550a43046
$$ -171264 -188599 -103553 408076 -146009 -158663 92888 -117128 -333820 95214 182764 -143046
15468a3998j46343n8514j4111G254J11289h2874A82931K91680a17721a8753A39165
$$ -13998 -160341 -218855 -232966 7254 118543 -82874 182931 474611 -117721 -18753 139165
15456H8440K03019j31173J94257i2312j98926C5384c28879a57559n5286H0435
$$ 88440 291459 160286 354543 -92312 -291238 35384 -328879 -157559 -212845 80435
15445A4352a57916E8158Q5121a45400a2162A45012a72162C48890f0023J8334E7064
$$ 14352 -157916 58158 143279 -145400 -12162 145012 -172162 348890 -60023 -41689 57064
15433C9587M49320a89460e6315m7604E5844k260O4474a24473F3515d8337B01830
$$ 39587 488907 -189460 -56315 -103919 55844 53584 118058 -124473 63515 -48337 201830
15421a04380C1592e5120l9521G2908M892J44754a02620F5292a02475E7500K47308
$$ -104380 31592 -55120 -94641 72908 77800 222554 -102620 65292 -102475 57500 304808
15410C04808A51801R8440a47187B46070b01530D0389a58388A66680o7628b08742
$$ 304808 151801 250241 -147187 246070 -201530 40389 -158388 166680 99052 -208742
15399B4951f7519a0118k6697p5066B83320B7659a2813n5860F2076L3876a34326
$$ 24951 -67519 -10118 -36815 -111881 283320 27659 -12813 -68673 62076 95952 -134326
15387D1546o868a76402A581b33129A69264h3509b1891j46381d7757C5451Q852
$$ 41546 34678 -176402 1581 -233129 169264 -83509 -21891 -168272 -47757 35451 44303
15376D4303M248J16111c25396a12522A21636c0688A6687a37231L2618B00088a3731
$$ 44303 48551 164662 -325396 -112522 121636 -30688 16687 -137231 -104613 200088 -13731
15364A16957f6859j9151m6365b6201B57470D4944a27646A98353a83225A99008
$$ 116957 -66859 -86010 -132375 -26201 257470 44944 -127646 198353 -183225 199008
15353a8627A89977R3868p3032a81688A84619G2476b29391c0754j24043A93148
$$ -18627 189977 283845 210813 -181688 184619 72476 -229391 -30754 -154797 193148
15342A79303L90436i6764a602j67554k96754A79467l1151J13188A03269e8342
$$ 179303 569739 -96764 -1602 -169156 -465910 179467 148316 261504 103269 -58342
15331C0527L48481B0026M124a47407A50366E9658H177b40404K7468j6217d0271
$$ 30527 379008 20026 24150 -147407 150366 59658 8177 -240404 -212936 -229153 -40271
15319e22018a31382a1884l8328A85821q1237d00241a7524D47501f0180D28620
$$ -522018 -131382 -11884 -50212 185821 104584 -400241 -17524 447501 -60180 428620
15308b02889A63451d0268B13618K474h0606A10060e7889A95742k0522j3410J00452
$$ -202889 163451 -40268 213618 216092 -80606 110060 -57889 195742 175220 161810 262262
15297B62262a62944C19829j15992e8120J8351B9925K17696r9732K0394F1688J50396
$$ 262262 -162944 319829 203837 -58120 -39769 29925 247621 147889 168283 61688 212084
15286B12084p5315o7501a81115A03994J3681A8848J23858l4532A0450N1219f9176
$$ 212084 136769 69268 -181115 103994 117675 18848 142706 108174 10450 61669 -69176
15274D47849j86906i6456A19236L08905a22124B90990e7520p0329C66182j67022
$$ 447849 260943 -96456 119236 428141 -122124 290990 -57520 -127849 366182 199160
15264A99160A3287M7818O7644e9914A7646J84886B0828q230i9049I8905K58323
$$ 199160 13287 61105 128749 -59914 17646 202532 20828 12598 -99049 98905 357228
15253C57228A67509g9976C00747F0044O03609J087093o44724j92717L35050l76564
$$ 357228 167509 -79976 300747 60044 663653 1750746 1106022 913305 1248355 871791
15243H71791l44277E8270J1792J38426I4035l8803j3131f7628A97115J04074A49689
$$ 871791 527514 58270 70062 208488 94035 55232 42101 -67628 197115 301189 149689
15231e347j27019F3218b75041B94342A7666a84286a0354F4678R4923m9630b88948
$$ -5347 -132366 63218 -275041 294342 17666 -184286 -10354 64678 159601 109971 -288948
15219D5009M0996Q7902J9820K7593b12854A12676i4045D2324a41311B12977J21422
$$ 45009 86005 173907 193727 221320 -212854 112676 -94045 42324 -141311 212977 334399
15208C34399A18873p967J71590a06132A2471c7243D7412Q8755g5311p7958C9785
$$ 334399 118873 110906 282496 -106132 12471 -37243 47412 136167 -75311 -153269 39785
15196H6952R6225k5056b8342J0449A15210g7719j92144A27695O4543E6071J5860
$$ 86952 183177 158121 -28342 -17893 115210 -77719 -269863 127695 192238 56071 71931
15185G1931a0892J495B7327q533J43010c602l902B56321O1821F1327J56547M7549
$$ 71931 -10892 -9397 27327 18794 161804 -3602 -7504 256321 318142 61327 217874 265423
15173B65423c59104a51114B45579a94426C67133b88432B14300b3057A73783J2983
$$ 265423 -359104 -151114 245579 -194426 367133 -288432 214300 -23057 173783 186766
15163A86766D8896J93061c07203A21091K33954j64271D7098D798e9736B20431
$$ 186766 48896 241957 -307203 121091 355045 190774 47098 4798 -59736 220431
15152A00664j2213K2774l4748L4352b40021A1462Q9055k3859K315a8415j49785
$$ 100664 88451 111225 76477 110829 -240021 11462 100517 76658 78973 -18415 -168200
15141a68200c0208n986r0616A89034J20036J05343m113g002A29327C1597J34172
$$ -168200 -30208 -36194 -126810 189034 309070 414413 410300 -7002 129327 31597 165769
15130A65769J67871A22600h9440E5124J4399L36962F4662f2337A07432K69502
$$ 165769 333640 122600 -89440 55124 69523 406485 64662 -62337 107432 376934
15120C76934a83057B28568q3043a95716A06215C7669d00381A09769O3043G2364
$$ 376934 -183057 228568 145525 -195716 106215 37669 -400381 109769 172812 72364
15109B87238e5845j55307D5411i9204b1852B61992a5746p6963B65231A10409J3379
$$ 287238 -55845 -211152 45411 -99204 -21852 261992 -15746 -92709 265231 110409 123788
15098A23788b5712B61130q8452J38311g3267a826B51983O9642G0958a44255C14684
$$ 123788 -25712 261130 172678 310989 -73267 -1826 251983 321625 70958 -144255 314684
15086B91662A5725K72145K17349d7020n2030G8946l493L42626o6931a3628B09964
$$ 291662 15725 287870 505219 -47020 -99050 78946 75453 418079 351148 -13628 209964
15074A38750K34472A56110J85481o2577j0879m1441F6401K02505D3122K09851
$$ 138750 373222 156110 341591 279014 268135 226694 66401 268906 43122 252973
15064B52973J91803d5469A13257j1470Q8698J38642o1788k9584L92245k77522
$$ 252973 444776 -45469 113257 101787 190485 329127 267339 237755 630000 352478
15054C52478n5695q9119a00037A44626N7625I0136c33901B71158I1168K43971
$$ 352478 296783 207664 -100037 144626 202251 90136 -333901 271158 91168 335139
15044C35139I0320M93533K4263B52400H5822a45674A61714b9959C23319J27730
$$ 335139 90320 583853 608116 252400 85822 -145674 161714 -29959 323319 451049
15034D51049k14862J33025A01971J97021J0913j24171J6246a32482I5626K6470
$$ 451049 236187 369212 101971 298992 309905 185734 201980 -132482 95626 122096
15024A22096K83594A93240Q7125j34907J0292Q2895G6763L88898k17097H7088
$$ 122096 405690 193240 280365 145458 155750 238645 76763 465661 248564 87088
15013b36580B66868B0775N45664A21440E7749L17377H7874n099O4435d1054C52724
$$ -236580 266868 20775 566439 121440 57749 375126 87874 82775 147210 -41054 352724
15001C0336L08318g4149B71487j23033p4102P4576K36930j36845K58988A36841
$$ 30336 338654 -74149 271487 148454 74352 148928 385858 249013 508001 136841
14990C52275F9915K04608j5595J39950A66688J3214K11687C9531J51042q8769
$$ 352275 69915 274523 258928 398878 166688 179902 391589 39531 190573 101804
14980A01804N8755p7951L63817B14421F7671J61543f4092A60678O25916C25934
$$ 101804 160559 82608 446425 214421 67671 229214 -64092 160678 786594 325934
14969a80725B54615H0386b4123E93763k02160L9685n7843h5229B9609K72610r0498
$$ -180725 254615 80386 -24123 593763 391603 431288 373445 -85229 29609 302219 211721
14958B11721N3760k3586J65187a715B35417J84620L5001A65075O422l6588M20379
$$ 211721 265481 241895 407082 -1715 235417 420037 455038 165075 171497 134909 555288
14947E55288A34592K37966o2304J92141A14020N47587A0956L47503j28851g1156
$$ 555288 134592 372558 310254 502395 114020 661607 10956 358459 229608 -71156
14936B48358j05979K20113J48903j18782j36173J5987A35037J92469K75208a52676
$$ 248358 142379 362492 511395 392613 256440 272427 135037 327506 602714 -152676
14925A46814K25938j12398O3527q2019r804l0116R9153D6253M60600q9567j42465
$$ 146814 372752 260354 323881 241862 232058 201942 301095 46253 506853 417286 274821
14914B74821J86170A78728M30073k26861R1775b4501F00448B92605J33923j44164
$$ 274821 460991 178728 608801 381940 473715 -24501 600448 292605 426528 282364
14904B82364J43530j07879l7696M670A23806J36607k3400M36326j97079p0611
$$ 282364 425894 318015 280319 284989 123806 260413 237013 673339 476260 405649
14894D05649R9069R1127M6567C04598k0350A23179m6250M84063j89313J37720
$$ 405649 504718 595845 642412 304598 284248 123179 76929 560992 371679 509399
14884E09399r4138q3797q2565o2456L2668L35957j73656J54599p4745j82810A02799
$$ 509399 415261 331464 248899 186443 219111 555068 381412 536011 461266 278456 102799
14872G37764C30340M06451B99830j1276K8357J26517B00169J55019A06081L11535
$$ 737764 330340 736791 299830 288554 316911 443428 200169 355188 106081 417616
14862D17616B4073L59767R9250J7124j07333J2242k6222A88965l0023N20571j26105
$$ 417616 24073 383840 483090 500214 392881 405123 378901 188965 158942 679513 553408
14851E53408j12556L1752j29794J81394B23553K62449r3738J17573o6412K99437
$$ 553408 440852 472604 342810 524204 223553 486002 392264 509837 443425 742862
14841G42862C43483M88146B90887D8949M11088K22527k04299K4986j55841K40467
$$ 742862 343483 831629 290887 48949 460037 682564 478265 503251 347410 587877
14831E87877p2293o2338J66783N1076p504L0778j20275l3369j24686J94501k04272
$$ 587877 515584 453246 620029 671105 663601 694379 574104 540735 416049 610550 406278
14820D06278J0799O4257M3239k01693L20016p4607j09119q295p3616Q9993J46409
$$ 406278 417077 481334 524573 322880 642896 568289 459170 450875 377259 467252 613661
14809F13661k41681R975P5568K28847j41932J73537K2696k95668J17959K53476
$$ 613661 371980 381955 457523 686370 544438 717975 740671 445003 562962 816438
14799H16438k84821K36006C03119j09763O68454l49294r8654M80114j25985n9742
$$ 816438 531617 767623 303119 193356 861810 512516 413862 893976 767991 708249
14789G08249j77030J80159J0746l51367L65705j38540j35709J44039n0185K12832
$$ 708249 531219 711378 722124 370757 736462 597922 462213 606252 556067 768899
14779G68899j6924n2359k47674K74279J4488k676q20k83908j48187O09108j43046
$$ 768899 751975 699616 451942 726221 740709 738033 737213 453305 305118 914226 771180
14768G71180C70004J47511K85080A16344M07897M4846N1738M9659k60807L56995
$$ 771180 370004 517515 802595 116344 524241 569087 620825 670484 409677 766672
14758G66672M34594n06926K51805m65386J19804N2924J0130K00300j27969K12820
$$ 766672 1201266 694340 946145 480759 600563 653487 663617 863917 735948 948768
14748I48768k50375K34467j3812m27445M02217j45257j07564R7672K22901K65495
$$ 948768 698393 932860 919048 491603 893820 748563 640999 738671 961572 1227067
14738A227067n70838J43746J49851K371l69730J84384p6804l8952Q0216k38923
$$ 1227067 656229 799975 949826 952197 582467 766851 690047 651095 731311 492388
14728D92388J04822J43794L51431k65756n1477R9831k97771J72543l4492J30146
$$ 492388 597210 741004 1092435 826679 775202 875033 577262 749805 715313 845459
14718H45459N7264j97986P3884M48371E37147L53846Q539K31481m30811L98545
$$ 845459 902723 704737 778621 1226992 537147 890993 899532 1131013 700202 1098747
14708A098747k41496j67792M41780K72200o84377R8492K14483j79412J916K88606
$$ 1098747 857251 689459 1131239 1403439 719062 817554 1032037 852625 854541 1143147
14698A143147k00946k04964L45131k13541K09073J6116o2864m6595j0601Q0188
$$ 1143147 942201 737237 1082368 868827 1077900 1094016 1031152 984557 973956 1054144
14688A054144j70350j70290L46503j41507j3418J8287o2335K81860m90013M11523
$$ 1054144 883794 713504 1060007 918500 905082 923369 861034 1142894 652881 1064404
14678A064404J78348k08462j28520K49157q2313K34434j64905p5202k9123O9208
$$ 1064404 1242752 1034290 905770 1154927 1072614 1307048 1142143 1066941 1037818 1107026
14668A107026O0227k98048J34923M27425l75209j01726K34230L74973k52373k2110
$$ 1107026 1167253 869205 1004128 1431553 1056344 954618 1188848 1563821 1311448 1289338
14658A289338R4826j21430l74761J58341M15213k61319L89108k30605j26560K65922
$$ 1289338 1384164 1262734 887973 1046314 1461527 1200208 1589316 1358711 1232151 1498073
14648A498073k77455l44629k0029L25012K61614o5778n6310Q1208J11060L18m7647
$$ 1498073 1220618 875989 855960 1180972 1442586 1376808 1320498 1401706 1512766 1513084 1465437
14637A465437n90434L29124J88095J16822j75168j07187N6566J75535j13238o907
$$ 1465437 875003 1204127 1392222 1509044 1333876 1226689 1283255 1458790 1345552 1338645
14627A338645J13110K20429n02392j17714P78541n53392L26169k15889p1542J75805
$$ 1338645 1451755 1672184 1169792 1052078 1830619 1277227 1603396 1387507 1315965 1491770
14617A491770K5345p5858j0445L29350k91528j84619P50428o86016o225N76368
$$ 1491770 1517115 1441257 1430812 1760162 1468634 1284015 2034443 1348427 1342202 1918570
14607A918570o8230N6882j07304j79039L14755k47955l1829j92489K11971J64232
$$ 1918570 1850340 1907222 1799918 1620879 1935634 1687679 1655850 1463361 1675332 1839564
14597A839564P4106k44964K51066l27819L51664q4710R6590q15M08655m73826
$$ 1839564 1913670 1668706 1919772 1591953 1943617 1858907 1955497 1954682 2363337 1889511
14587A889511J63729j45634m8911K12555J09878l05434J16678Q9371k0292K32520
$$ 1889511 2053240 1907606 1858695 2071250 2181128 1875694 1992372 2081743 2061451 2293971
14577B293971K05388Q2265l515k37283N8704l62639K19529L40923p8852P7507
$$ 2293971 2499359 2581624 2578109 2340826 2399530 2036891 2256420 2597343 2518491 2595998
14567B595998J68583j28652M01979l56488n3975K1099L86468j89598N2587K41583
$$ 2595998 2764581 2635929 3037908 2681420 2627445 2648544 3035012 2845414 2898001 3139584
14557C139584K16760k82618K99607Q21408J46992K81990O94496P45289J965750
$$ 3139584 3356344 3073726 3373333 4194741 4341733 4623723 5318219 6063508 8029258
14548H029258M157266R169645J8205626P360868k1321099A0755379m898505k131205
$$ 8029258 12186524 21356169 39561795 46922663 25601564 10755379 5856874 3725669
14540C725669r65549k23424l0002j22827k20739K09648n6182j4123J95125R0100
$$ 3725669 2760120 2536696 2506694 2383867 2163128 2372776 2316594 2302471 2497596 2587696
14530B587696k50857l74146N07953K93220l97001J11979M00467l89823L15131
$$ 2587696 2336839 1962693 2470646 2763866 2366865 2478844 2879311 2489488 2804619
14521B804619J97938k69437j82367K58221K91010l2751p9891j91047l0780K60703
$$ 2804619 3002557 2733120 2550753 2808974 3099984 3067233 2987342 2796295 2765515 3026218
14511C026218j56771K10415L21634j8785l51718j69376K26549J73217Q3006j73728
$$ 3026218 2869447 3079862 3401496 3382711 3030993 2861617 3088166 3261383 3344389 3170661
14501C170661L68154l33721M24166j77579J4160l9620P17015m06136k46353J77236
$$ 3170661 3538815 3205094 3629260 3451681 3465841 3426221 4143236 3737100 3490747 3667983
14491C667983M7490J65681R1183l33485N75113m08288K83866n0148J25421K00082
$$ 3667983 3715473 3881154 3972337 3638852 4213965 3805677 4089543 4039395 4164816 4364898
14481D364898J32944J57181j23776m39143M42150J90168j6803k34080j10273J07118
$$ 4364898 4497842 4655023 4531247 4092104 4534254 4724422 4707619 4473539 4363266 4470384
14471D470384L89069R0963k49940J96887k19282N64876m81480M19327K33637j8316
$$ 4470384 4859453 4950416 4700476 4897363 4678081 5242957 4761477 5180804 5414441 5396125
14461E396125o5164P3354l9814Q9512L6336L43522k9724j03627J53037j63381
$$ 5396125 5330961 5404315 5364501 5454013 5490349 5833871 5804147 5700520 5853557 5690176
14451E690176L95011M9806l81373N40810n4159p3966K01122l5494p4862M76875
$$ 5690176 6085187 6134993 5753620 6294430 6240271 6166305 6367427 6331933 6257071 6733946
14441F733946j33798M8522L10662j82140K30924M90665m86526K68949K8295J65002
$$ 6733946 6600148 6648670 6959332 6777192 7008116 7498781 7012255 7281204 7309499 7474501
14431G474501J12267J61695k50699L76812K06263N9994O2354J68589J46287J43495
$$ 7474501 7586768 7748463 7497764 7874576 8080839 8140833 8203187 8371776 8518063 8661558
14421H661558P3851l9296M04665l5834k55805N27564N21564j17930k18941K52488
$$ 8661558 8735409 8696113 9100778 9064944 8809139 9336703 9858267 9740337 9521396 9773884
14411I773884J31965L95940j26849q7243P06069j36104K78358p2740L37301j1096
$$ 9773884 9905849 10301789 10174940 10087697 10793766 10657662 10936020 10863280 11200581 11189485
14401A1189485N21149K11808J87259K3833M6761J28261P8104K99122N74125K75375
$$ 11189485 11710634 11922442 12109701 12133534 12180295 12308556 12386660 12685782 13259907 13535282
14391A3535282l6162K37411N15119J36732J33441K24972K24660J76597J89423
$$ 13535282 13499120 13736531 14251650 14388382 14521823 14746795 14971455 15148052 15337475
14382A5337475N82192N51679l6863L71427L85823L01471L54412K47157M11419
$$ 15337475 15919667 16471346 16434483 16805910 17191733 17493204 17847616 18094773 18506192
14373A8506192N53014J52857J87868M33386N45225M51885J27514M81922M11321
$$ 18506192 19059206 19212063 19399931 19833317 20378542 20830427 20957941 21439863 21851184
14364B1851184Q76149L04874M60718O87193M67780M52317R19522N66956N55086
$$ 21851184 22727333 23032207 23492925 24180118 24647898 25100215 26019737 26586693 27141779
14355B7141779M21705P11175O09335R55843L86912M77787Q90624J039688J029258
$$ 27141779 27563484 28274659 28883994 29839837 30226749 30704536 31595160 32634848 33664106
14346C3664106M73688Q84529J422675N85692R11557J120333J001119J301100J021350
$$ 33664106 34137794 35022323 36444998 37030690 37942247 39062580 40063699 41364799 42386149
14337D2386149J557227J091054J295108J128913J360506J591459K000188J149212
$$ 42386149 43943376 45034430 46329538 47458451 48818957 50410416 52410604 53559816
14329E3559816J680197J936936J555944K241186J592944K307868K487354K172083
$$ 53559816 55240013 57176949 58732893 60974079 62567023 64874891 67362245 69534328
14321F9534328K427201K583934K688312K635834K998910K980839L411307L234033
$$ 69534328 71961529 74545463 77233775 79869609 82868519 85849358 89260665 92494698
14313I2494698L979887L577815M474736L839445M754480M622507N064782N238142
$$ 92494698 96474585 100052400 104527136 108366581 113121061 117743568 122808350 128046492
14305A28046492N322326O393917O002909O585115P138608P339263P603616Q550564
$$ 128046492 133368818 139762735 145765644 152350759 159489367 166828630 174432246 182982810
14297A82982810R074731R555911R495468J0252964J1111834J1462862J2214031
$$ 182982810 192057541 201613452 211108920 221361884 232473718 243936580 256150611
14290B56150611J2451943J3013665J3678868J4511001J4219522J5199881J5144175
$$ 256150611 268602554 281616219 295295087 309806088 324025610 339225491 354369666
14283C54369666J5151627J5221158J5207666J4674500J3963981J3125197J2021337
$$ 354369666 369521293 384742451 399950117 414624617 428588598 441713795 453735132
14276D53735132J0413797Q786918O482496L422173j31386k709634l882051k654232
$$ 453735132 464148929 472935847 479418343 482840516 482709130 479999496 476117445 473463213
14268D73463213n999931p414879r331788j1010321j1662888j2671160j4630701
$$ 473463213 467463282 460048403 450716615 439706294 428043406 415372246 400741545
14261D00741545j4423335j5405058j5884724j5794059j5683817j5513324j4363184
$$ 400741545 386318210 370913152 355028428 339234369 323550552 308037228 293674044
14254B93674044j3417106j3837196j3057666j2503862j1701043j0959717j0852879
$$ 293674044 280256938 266419742 253362076 240858214 229157171 218197454 207344575
14247B07344575j0024630r542485q765134p814813p870824p632322p049239o841941
$$ 207344575 197319945 187777460 179012326 171197513 163326689 155694367 148645128 141803187
14239A41803187o270765n644828n120933n477360n217934m636680m563000l981807
$$ 141803187 135532422 129887594 124766661 119289301 114071367 109434687 104871687 100889880
14231A00889880l335424l740517l726865l872385k999809l253209k553221k952752
$$ 100889880 97554456 93813939 90087074 86214689 83214880 79961671 77408450 74455698
14223G4455698k891583k351194k395592j933011k085275k324153k154324j569544
$$ 74455698 71564115 69212921 66817329 64884318 62799043 60474890 58320566 56751022
14215E6751022j879271j291890j320200k017565j923911r36947j688373o22715
$$ 56751022 54871751 53579861 52259661 50242096 48318185 47381238 45692865 45070150
14207D5070150j108867j400532q95097j751484r24989j072284j111103l20177
$$ 45070150 43961283 42560751 41665654 39914170 38989181 37916897 36805794 36485617
14199C6485617r12304j043070r79925j172440n27178o77542p16490q42053p05750
$$ 36485617 35573313 34530243 33550318 32377878 31850700 31173158 30456668 29614615 28908865
14190B8908865o47468p90342p68441m18210p34582k28395o66298o72418l85506
$$ 28908865 28261397 27471055 26702614 26284404 25549822 25321427 24655129 23982711 23597205
14181B3597205l91480q82352k35189n83769j02991o77525q2728p25278m18705
$$ 23597205 23205725 22323373 22088184 21504415 21401424 20723899 20641171 19915893 19497188
14172A9497188l23900j59517k57514q36488j25481j98123n42901J29326n80024
$$ 19497188 19173288 19013771 18756257 17919769 17794288 17596165 17053264 17182590 16602566
14163A6602566k42749n81231N4516k65070J20294q54892j52892j0272l48239j77065
$$ 16602566 16359817 15778586 15833102 15568032 15688326 14833434 14680542 14670270 14322031 14144966
14153A4144966m19151l75834L2712l43098q5254m22105J0428k46798k06310j93612
$$ 14144966 13725815 13349981 13382693 13039595 12954341 12532236 12542664 12295866 12089556 11895944
14143A1895944l56666J45897j84352k57272k38355r1996r6029o13977L44774k40539
$$ 11895944 11539278 11685175 11500823 11243551 11005196 10913200 10817171 10203194 10547968 10307429
14133A0307429m15000J05768k90021n6715l02174K16967n22493L360k13645L0162
$$ 10307429 9892429 9998197 9708176 9651461 9349287 9566254 9043761 9047121 8833476 8863638
14123H863638N4695o3422l52940P8146j77762n07782K43216q8739j51788n3744
$$ 8863638 8918333 8854911 8501971 8580117 8402355 7894573 8137789 8049050 7897262 7843518
14113G843518p0740j57982m94514R2191N8799p0477J48904n26992L56056q8882
$$ 7843518 7772778 7614796 7120282 7212473 7271272 7200795 7349699 6822707 7178763 7089881
14103G089881l00219j19027j54305J59846L5762m36224J11263j68370q5609j32715
$$ 7089881 6789662 6670635 6516330 6676176 6711938 6275714 6386977 6218607 6132998 6000283
14093F000283l00981M46003k85397j96229M4889N8281J9978k90895j4316k66615
$$ 6000283 5699302 6145305 5859908 5663679 5708568 5766849 5786827 5495932 5481616 5215001
14083E215001J40416J38868q4786l11992j14439L9960J31785j19468M965j10042
$$ 5215001 5355417 5494285 5409499 5097507 4983068 5023028 5154813 5035345 5040310 4930268
14073D930268J00265k02664j56603k18310j74378N62250r186k09597L7734k58674
$$ 4930268 5030533 4827869 4671266 4452956 4278578 4840828 4831642 4622045 4659779 4401105
14063D401105j10106J01050L2548J08837j00528m2617n52010K52318j11575K28103
$$ 4401105 4290999 4392049 4424597 4533434 4432906 4390289 3838279 4090597 3979022 4207125
14053D207125j18359J54796l46968K11486l51229M55894n50266l27173M66262
$$ 4207125 4088766 4243562 3896594 4108080 3756851 4212745 3662479 3335306 3801568
14044C801568J50109l77005J22574j34542j48707J72729l284j70213J18997l53837
$$ 3801568 3951677 3574672 3697246 3562704 3413997 3586726 3583442 3413229 3532226 3178389
14034C178389N25696l06239N1928j95028J37433n4812J65879k30159n65836K21874
$$ 3178389 3704085 3397846 3449774 3254746 3392179 3337367 3503246 3273087 2707251 2929125
14024B929125J2937K04198j16671K59257l23472j14005R2221k23294J24634n499
$$ 2929125 2942062 3146260 3029589 3288846 2965374 2851369 2943590 2720296 2844930 2839431
14014B839431r2541j03834R3264L02084n43422K66946k43054j91001J95059l04153
$$ 2839431 2746890 2643056 2736320 3038404 2494982 2761928 2518874 2327873 2522932 2218779
14004B218779J27616J16031j47024K28521j08117J24564k15831l16758J30063
$$ 2218779 2346395 2462426 2315402 2543923 2435806 2560370 2344539 2027781 2157844
13995B157844M56244l97457j67828M62568M87123j3013R61079K914274O863642
$$ 2157844 2614088 2216631 2048803 2511371 2998494 2985481 3946560 6860834 13724476
13986A3724476J8562515J3782268j7797444j3448005n425459k385200j351241
$$ 13724476 32286991 46069259 28271815 14823810 9398351 7013151 5661910
13979E661910j163654l68888m80019O1550p30155J32653j05448j91927P3338j77078
$$ 5661910 4498256 4129368 3649349 3710899 2980744 3113397 3007949 2816022 2889360 2712282
13969B712282j0659k21392M8087J41469j14024r1803J41496k71816j04510J2608
$$ 2712282 2701623 2480231 2528318 2669787 2555763 2463960 2605456 2333640 2229130 2241738
13959B241738J51380M4409j74782Q205m67650M12398k0614k23761P7422L4515
$$ 2241738 2393118 2437527 2262745 2270950 1803300 2215698 2195084 1971323 2048745 2083260
13949B083260p5184j75846p8364L13354J59751l62600j25871L13534j13822j65059
$$ 2083260 2008076 1832230 1753866 2067220 2226971 1864371 1738500 2052034 1938212 1773153
13939A773153L6332K40982k50976n5391M40564k16788l35097K30418j97072L77741
$$ 1773153 1809485 2050467 1799491 1744100 2184664 1967876 1632779 1863197 1666125 2043866
13929B043866l83162K12127l09309J72594q2145R341J4774j126K94223k16532
$$ 2043866 1660704 1872831 1563522 1736116 1653971 1663312 1678086 1676960 1971183 1754651
13919A754651m3471j28781N3761Q5276k06258k8734P1174l6023K4214n1165j19078
$$ 1754651 1711180 1582399 1636160 1721436 1515178 1486444 1557618 1521595 1545809 1494644 1375566
13908A375566R7642L21877L0320j80711q8767J44695j12991m50253M02584l42108
$$ 1375566 1473208 1795085 1825405 1644694 1555927 1700622 1587631 1137378 1539962 1197854
13898A197854L30914k73987J00073N3703j21958L01613J8981k77738L27252m14763
$$ 1197854 1528768 1254781 1354854 1408557 1286599 1588212 1607193 1329455 1656707 1241944
13888A241944L53999l94363M3929L54210J7137j01610n30899J59684j276K82257
$$ 1241944 1595943 1201580 1245509 1599719 1616856 1515246 984347 1144031 1142755 1425012
13878A425012k60351K54910k37570L06535k56334K9501l37140M70720m09517L03223
$$ 1425012 1164661 1419571 1182001 1488536 1232202 1261703 924563 1395283 985766 1288989
13868A288989l30392K71296j51838L4094K2362K47859k04523r3554J50942j90343
$$ 1288989 958597 1229893 1078055 1112149 1134511 1382370 1177847 1084293 1235235 1044892
13858A044892Q620K44684J57650k23584J64427J41027j78329k50791L8796o8325
$$ 1044892 1053512 1298196 1455846 1232262 1396689 1537716 1359387 1108596 1147392 1079067
13848A079067k67073J10027K39187R376l32138N67543k63947N5999J96917j47762
$$ 1079067 811994 922021 1161208 1170584 838446 1405989 1142042 1198041 1394958 1247196
13838A247196m4298j39949M5348l56200L99945q8559l90591L87854k8988p818
$$ 1247196 1202898 1062949 1108297 752097 1152042 1063483 672892 1060746 1031758 1023940
13828A023940j14064r2372J18701o8550K09885J28678l76849M6794j34035P6037
$$ 1023940 909876 817504 936205 867655 1077540 1206218 829369 876163 742128 818165
13818H18165M83166n40344M20718l37986n6450J44249M54818o05757p4978j21676
$$ 818165 1301331 760987 1181705 843719 787269 931518 1386336 780579 705601 583925
13808E83925J95274N6071n3077j99635L63906k00863J68068p7351R6235J88353
$$ 583925 779199 835270 782193 582558 946464 745601 913669 836318 932553 1120906
13798A120906k22719j81887K84655K58901n27641L6165p5766N7372J24433j39979
$$ 1120906 898187 716300 1000955 1259856 732215 768380 692614 749986 874419 734440
13788G34440l1497K5831K88268n8424j90925J27641l39095J33081J04028K19497
$$ 734440 702943 728774 1017042 958618 767693 895334 556239 689320 793348 1012845
13778A012845j27538m8411J14626j98175o0739K60582k8010Q6080k98134L75973
$$ 1012845 885307 836896 951522 753347 692608 953190 925180 1011260 713126 1089099
13768A089099l89469p8770k3559J88015j63717J21855j21183M51845m60571M31542
$$ 1089099 699630 620860 597301 785316 621599 743454 622271 1074116 613545 1045087
13758A045087m05206p4070P6543O1920k10877L68022q1356j2116q8405q6352L07074
$$ 1045087 639881 565811 642354 704274 493397 861419 780063 767947 679542 593190 900264
13747I00264Q3485l64064J8537O8605k807p3241K02591O0942l20397L23697l00961
$$ 900264 983749 619685 638222 706827 704020 630779 833370 894312 573915 897612 596651
13736E96651L38901D54849L27302J1371p0594N3984j74538Q2269q1458J65312
$$ 596651 935552 454849 782151 793522 722928 776912 602374 684643 603185 768497
13726G68497k21142J45203K29741A22031M81896j72679L13561j89291M20499k34422
$$ 768497 547355 692558 922299 122031 603927 431248 744809 555518 976017 741595
13716G41595C27869O93469k30296j79041R7587k13956M9372n8722j10070K00963
$$ 741595 327869 1021338 791042 612001 709588 495632 545004 486282 376212 577175
13706E77175j83887K00663J9634k45970L1914K29382l5198j94378K54186j43656
$$ 577175 393288 593951 613585 367615 399529 628911 593713 399335 653521 509865
13696E09865R2770J4354j021r420M024M5565q1397L23869B70758M79739j45383
$$ 509865 602635 616989 615968 606548 610572 656137 574740 898609 270758 750497 605114
13685F05114j60973K26833j87350L3962M7996n6462K36900j58406N7306k37836
$$ 605114 444141 670974 483624 517586 565582 509120 746020 587614 644920 407084
13675D07084J48656K892k69598M9781n3117M18985j51443l7681K23299n0019a24165
$$ 407084 555740 558632 289034 338815 285698 704683 553240 515559 738858 688839 -124165
13663H52920l84396r7599j3827r1330q5098N35584k54780K38369n1642A81810
$$ 852920 468524 370925 357098 265768 180670 716254 461474 699843 648201 181810
13652E80287K7055j50636D2659N27475m005j81356Q7611j216K5467k33670m1386
$$ 580287 607342 456706 42659 570134 566129 384773 472384 471168 496635 262965 221579
13641B21579I2719N91691k80665J28677k11384R2705J65138A39207J69035L3298
$$ 221579 92719 684410 403745 532422 321038 413743 578881 139207 308242 341540
13631C41540J36560Q6264M13908C44721K27345J47390a66830D87950J4851o2152
$$ 341540 478100 564364 978272 344721 572066 719456 -166830 487950 502801 440649
13621D40649j65052M4659j33527K21011K17960B47681J42949J36251G4140J23493
$$ 440649 275597 320256 186729 407740 625700 247681 390630 526881 74140 197633
13611A97633N07618l17387J33767k00034K23055A84767K08820o6615E5830J72494
$$ 197633 705251 387864 521631 321597 544652 184767 393587 326972 55830 228324
13601B28324M00736n0766k05694l5482L38331j83678I2396M84570A39160L46009
$$ 228324 629060 578294 372600 337118 675449 491771 92396 576966 139160 485169
13591D85169m5399D190N57351j18464J9770m7469K55620K13109m12673j42797
$$ 485169 439770 4190 561541 443077 462847 415378 670998 884107 471434 328637
13581C28637o0208R8748J32258k45652K72770m705j71274j35213p7134M16364
$$ 328637 268429 367177 499435 253783 526553 521848 350574 215361 138227 554591
13571E54591B00878K61538R2633A41929Q0550R5784N4397r0260P9470j47040K26637
$$ 554591 200878 462416 555049 141929 222479 318263 372660 282400 361870 214830 441467
13560D41467N9083j12834j1710G971K61889J76087j8383j54840k312J17441A72530
$$ 441467 500550 387716 376006 7971 269860 445947 427564 272724 270412 387853 172530
13548B55367M9946A44386N5507P0996k5757P9207Q1713K20943k69541L9205J48809
$$ 255367 305313 144386 199893 270889 245132 324339 406052 626995 357454 396659 545468
13537E45468B69237J89329A06404M47149B00114M0525F0098Q6151K49708n6500
$$ 545468 269237 458566 106404 553553 200114 240639 60098 146249 395957 339457
13527C39457A39591J90362j4197J95448m5162e0839B27328i3373C08987A16738
$$ 339457 139591 329953 315756 511204 466042 -50839 227328 -93373 308987 116738
13516D41095O4048F0255O1192K92154o8104J75348A05689m1986J10656M38347
$$ 441095 505143 60255 121447 413601 345497 520845 105689 63703 174359 612706
13506F12706k93352A01145J68437n1322J39801j24182L9006a33331B66399J2507
$$ 612706 319354 101145 269582 218260 358061 233879 272885 -133331 266399 278906
13496B78906J23558P8094j97073p2619j8813A2019K61120J86701A01189J04244
$$ 278906 402464 480558 283485 210866 192053 12019 273139 459840 101189 205433
13486B05433j9385n6681N11467j85552j73800d8435B19532J08906o5606A14506
$$ 205433 186048 129367 640834 455282 281482 -48435 219532 328438 262832 114506
13475E59158k03042a0411D87089k19715R881R7569I784d6347A90056a15365C48206
$$ 559158 356116 -10411 487089 267374 277255 374824 9784 -46347 190056 -115365 348206
13463A19912Q7661K42247j12900j17119q5358J3172n3745b0472E30381B30824
$$ 119912 207573 449820 336920 219801 134443 147615 93870 -20472 530381 230824
13452b967A81050h4336A58728g5651b7703B17721K38316a5181D00169j00038A27080
$$ -2967 181050 -84336 158728 -75651 -27703 217721 456037 -15181 400169 300131 127080
13440I9307m3167l908K23119o9497J48344A49752O4596K59348B20943h3549A88996
$$ 99307 56140 52232 275351 205854 354198 149752 214348 473696 220943 -83549 188996
13428a36286B20168K93467g5377B21434I3895K71315a14763D70615j06833p3073
$$ -136286 220168 513635 -75377 221434 93895 365210 -114763 470615 363782 290709
13418B90709J94910k39775L77442B40794J7160P1769H8581a9105j01037B75955
$$ 290709 485619 245844 623286 240794 257954 329723 88581 -19105 -120142 275955
13407E59332A5120J19508n8582L53349p4931G3659J00435J89610k9391A07684
$$ 559332 15120 134628 76046 429395 354464 73659 174094 363704 334313 107684
13396A383K95272r6146F4698K12065M537A15489K36125G6874L7973J05917L7611
$$ 1383 296655 200509 64698 276763 281300 115489 351614 76874 114847 220764 258375
13385B58375p0518C9954J47857J70461K4026o0560j49740e0052F31416B67542
$$ 258375 187857 39954 187811 358272 382298 321738 171998 -50052 631416 267542
13374A01951J51990J31612J23570A15580L30524o1280j37557J95698R620j15728
$$ 101951 253941 385553 509123 115580 446104 384824 247267 442965 452585 336857
13364C36857K92618q8041A4510K71231a1542F4955J48689j4540b39855a812B43608
$$ 336857 629475 541434 14510 285741 -11542 64955 213644 199104 -239855 -1812 243608
13352D54432A86165J06713k2325N1959j02637c0765I0882J03278e0280G2613J40429
$$ 454432 186165 292878 270553 322512 219875 -30765 90882 194160 -50280 72613 213042
13341B13042J47319r4976K3562K61756j20516q4417j12148k8728N4377D5042L85387
$$ 213042 360361 265385 288947 550703 430187 345770 233622 204894 259271 45042 430429
13330D30429B11393K71930j21784A11491R3207A155K1988K30298M8823C7480O968
$$ 430429 211393 483323 361539 111491 204698 1155 23143 253441 302264 37480 44448
13319D4448J12978M4523d3060C02170L9517A32544o3186K41341I7981J47287K85950
$$ 44448 157426 201949 -43060 302170 341687 132544 69358 310699 97981 245268 531218
13308E31218A09748K30894A41881N9532J49621A23920R982J81730i8249J6405
$$ 531218 109748 340642 141881 201413 351034 123920 133902 315632 -98249 -81844
13298h1844B44777j08426J53047j38366a23888A72911K37255a32058C0413e9993
$$ -81844 244777 136351 289398 151032 -123888 172911 410166 -132058 30413 -59993
13287D80272a75653E5630L35136j08068J0165E2533a7005D06714G1447c624B61968
$$ 480272 -175653 55630 390766 282698 292863 52533 -17005 406714 71447 -3624 261968
13275a35964F7874L37802e7038j6660C16806B5104J41339K09449j39416K23728
$$ -135964 67874 405676 -57038 -73698 316806 25104 166443 375892 236476 460204
13265D60204E2906L30364G4286b14911f8394B62328A5455J16343K99706I8791
$$ 460204 52906 383270 74286 -214911 -68394 262328 15455 131798 431504 98791
13254B56282J2401m3564C1399J22115a5092C39690j64096J30620e4805k6344H3451
$$ 256282 268683 225119 31399 153514 -15092 339690 175594 306214 -54805 -81149 83451
13242B75397L65512B23627L01386r7468A71847K7550R4639c7866l579B37394M7587
$$ 275397 640909 223627 525013 427545 171847 199397 294036 -37866 -41445 237394 284981
13231B84981j3488g2642D9750L79846a94027i0395k11154H8627J87274N8783d4840
$$ 284981 271493 -72642 49750 429596 -194027 -90395 -301549 88627 275901 334684 -44840
13219A03642c4249H8381J96381n863o5763K5527a74142a6807k41599B61493P5994
$$ 103642 -34249 88381 284762 278899 213136 238663 -174142 -16807 -258406 261493 337487
13208C37487a69534A1784K36844I844J53725e2968B0038J57085o1460g0355B48414
$$ 337487 -169534 11784 248628 9844 163569 -52968 20038 177123 115663 -70355 248414
13196C44820e2712E91205A28549k8116B3649g8634C60088A11674C6971N6309K38606
$$ 344820 -52712 591205 128549 100433 23649 -78634 360088 111674 36971 93280 331886
13185C31886A28916e2492B91248M8201d4240H6144c4463J6912A84957D1231b28913
$$ 331886 128916 -52492 291248 339449 -44240 86144 -34463 -17551 184957 41231 -228913
13173a22535A31692e3735A27223o687D5250K2131K0547K93769A53683J43978r9707
$$ -122535 131692 -53735 127223 120536 45250 67381 87928 381697 153683 297661 197954
13162A97954E6203J03109j8701b39188B6692P4954i3798B80687D7931b77762I5299
$$ 197954 56203 159312 140611 -239188 26692 101646 -93798 280687 47931 -277762 95299
13150a38651I5314k6045B4021J61532K8723P0531H2015M7881O1253J36128f3489
$$ -138651 95314 69269 24021 185553 214276 284807 82015 129896 191149 327277 -63489
13138B10384k5347D0571N2680K66078q9287I0348O8505a88548A36514a35019B60350
$$ 210384 185037 40571 93251 359329 270042 90348 158853 -188548 136514 -135019 260350
13126C23868g6423B2441a80359B36709M02760A22307C885J24714B613a1424B88571
$$ 323868 -76423 22441 -180359 236709 639469 122307 3885 128599 2613 -11424 288571
13114a27372m0428G5044R564J08595e1157G2673C2513L04231A37627B2572K27556
$$ -127372 -167800 75044 84608 193203 -51157 72673 32513 336744 137627 22572 250128
13103B50128o2386J29215A24743J90161a70262A22124g820D79484a51979E1338
$$ 250128 187742 316957 124743 314904 -170262 122124 -7820 479484 -151979 51338
13092B76446A23511k8435J53367L8154j00652a07628A6398a96211r0161e3682
$$ 276446 123511 95076 248443 286597 185945 -107628 16398 -196211 -286372 -53682
13081A43689E2993K53855j30209N8630J67140I8041R8750K625b1725C44476r6444
$$ 143689 52993 306848 176639 235269 402409 98041 196791 199416 -21725 344476 248032
13070B48032n2025J41151m6852q9738a456C11388a41197A15089J25443F3595f2208
$$ 248032 196007 337158 290306 200568 -1456 311388 -141197 115089 240532 63595 -62208
13058C45380E1411f2372A14674e867r0113C31441A1905K23852b0263B07188A0035
$$ 345380 51411 -62372 114674 -5867 -95980 331441 11905 235757 -20263 207188 10035
13046A9462M5386J5551L3555D2618P6734k8437A1668K35806n6500A4571b2854
$$ 19462 64848 80399 113954 42618 119352 90915 11668 247474 190974 14571 -22854
13034g1057C45685K66686B44341a50126J8338A61603l7715C4469L06873K9159
$$ -71057 345685 612371 244341 -150126 -131788 161603 123888 34469 341342 370501
13024C70501A35002b46454B7304L028a618I4568J59462K07787D8600i9796C7781
$$ 370501 135002 -246454 27304 30332 -1618 94568 254030 461817 48600 -99796 37781
13012B06765O3851F8405R4430c1694A20730L7879a22859E7923a92955A99214n7372
$$ 206765 270616 68405 162835 -31694 120730 158609 -122859 57923 -192955 199214 141842
13001A41842a05620H9106l5948J29685J36960G3488J89388C3983K20125c48065
$$ 141842 -105620 89106 53158 182843 319803 73488 262876 33983 254108 -348065
12990A55844b44128A62034L0769i2566h832C1676e9986A78689j8378a6350M756
$$ 155844 -244128 162034 192803 -92566 -8832 31676 -59986 178689 160311 -16350 -11594
12979a1594j06642B44197a70387A12629g741G1882J05388J66448A08978N8411
$$ -11594 -118236 244197 -170387 112629 -7741 71882 177270 343718 108978 167389
12969A67389E8726L9591l3175a16062A69091C0992C137Q7178O5561A7978O273
$$ 167389 58726 98317 65142 -116062 169091 30992 3137 90315 155876 17978 24251
12958B4251a18309C8282i0470c3982k4342A69434G5128a71251A28026f7160B0709
$$ 24251 -118309 38282 -90470 -33982 -58324 169434 75128 -171251 128026 -67160 20709
12946B0066f6063j38161A47355a77337B1432f527q7281R50F9689f9051b3646B7009
$$ 20066 -66063 -204224 147355 -177337 21432 -6527 -93808 -92858 69689 -69051 -23646 27009
12933A34935J53121c1831A36196J00790b8161B79950h1018A63253e3448K6111
$$ 134935 288056 -31831 136196 236986 -28161 279950 -81018 163253 -53448 -27337
12923b7337A6343M6392K60683b39271K9030K1651B07993o5225k0809b9156l485
$$ -27337 16343 62735 323418 -239271 -210241 -188590 207993 142768 121959 -29156 -32641
12912c2641A35548b3340I100K54624j6123E0732O6940d13035E9240h4269C08212
$$ -32641 135548 -23340 9100 263724 247601 50732 117672 -413035 59240 -84269 308212
12900B62701a16770e8378h774j84028K8833Q0584D229M37985a02968a217F5053
$$ 262701 -116770 -58378 -8774 -192802 -163969 -83385 4229 442214 -102968 -1217 65053
12888f5471A09339d8945m2649A53160P8867E746K02225b79449C1247a10399j75099
$$ -65471 109339 -48945 -91594 153160 232027 5746 207971 -279449 31247 -110399 -285498
12877b85498g211A96560a10745A18885c88841B93684A34465N1518f2634A8588
$$ -285498 -7211 196560 -110745 118885 -388841 293684 134465 185983 -62634 18588
12866c9041B83127a2902c487A31402K31663d3515B31687j11739k0302D4546a29667
$$ -39041 283127 -12902 -3487 131402 363065 -43515 231687 119948 99646 44546 -129667
12854a157j70500A55344G2563a19946k7814r2343A74334d5420o1225l5464c4364
$$ -1157 -171657 155344 72563 -119946 -147760 -240103 174334 -45420 -106645 -142109 -34364
12842A31574K19352a1924B77375n1657I4471Q4247a33828e2881j33171A04184
$$ 131574 350926 -11924 277375 225718 94471 178718 -133828 -52881 -186052 104184
12831a2619j15782E8896B8534R5708a31093d6486A79985b62089c9227J4701A46972
$$ -12619 -128401 58896 28534 124242 -131093 -46486 179985 -262089 -39227 -24526 146972
12819A32393c4321G2929a81881c9619B48918b28965a03829A96462Q6685a8375
$$ 132393 -34321 72929 -181881 -39619 248918 -228965 -103829 196462 283147 -18375
12808A40761D2458a73701C66823I989a16722C28977c279A79274B6225P5032P9685
$$ 140761 42458 -173701 366823 9989 -116722 328977 -3279 179274 26225 101257 180942
12797A80942c05249i1230J8097j0537A75219a59730D0349b46639A2155K54542
$$ 180942 -305249 -91230 -73133 -83670 175219 -159730 40349 -246639 12155 266697
12787B66697P5468f1149B15425c07355A3168K2739b82099C36120A06070a37374
$$ 266697 342165 -61149 215425 -307355 13168 35907 -282099 336120 106070 -137374
12776a81530A12877a24633m387A01477b99150a19820B86075a66998J0393f8234
$$ -181530 112877 -124633 -129020 101477 -299150 -119820 286075 -166998 -156605 -68234
12765C9311K54572j41599c8578k8173k7716l5324F6899K00618A03512J00437f3458
$$ 39311 293883 152284 -38578 -66751 -94467 -129791 66899 267517 103512 203949 -63458
12753a86624Q7201F3173J59475b66292D6534K5151l2043d1488A78765a74863C20552
$$ -186624 -99423 63173 222648 -266292 46534 71685 39642 -41488 178765 -174863 320552
12741c0563k13443A2936J62006n7079J1189a28868H8693M6800D6365J13619a95884
$$ -30563 -244006 12936 174942 117863 129052 -128868 88693 135493 46365 159984 -195884
12729b86263G8068J32993l644r93j2008h000G8919K59756F877J83393O9571c9847
$$ -286263 78068 211061 207417 206424 194416 -8000 78919 338675 6877 190270 259841 -39847
12716I6067M3796N4847i7791C2157b93823C68137J96646k70112G820K12222J19799
$$ 96067 139863 194710 -97791 32157 -293823 368137 564783 294671 7820 220042 339841
12705C39841J13914O7109a68950E7845L22558j67340D0180g2446A33513b12531
$$ 339841 453755 520864 -168950 57845 380403 213063 40180 -72446 133513 -212531
12694E7778J19928l748a4046b997B3688J25288k5446K41166b72365g4420A06609
$$ 57778 177706 173958 -14046 -2997 23688 148976 123530 364696 -272365 -74420 106609
12682a1614F4880h9291E48647n8004j23477A33510a53059f3942C04718J24649
$$ -11614 64880 -89291 548647 490643 367166 133510 -153059 -63942 304718 429367
12672D29367A61537a42430j25659C4315L29098F5471e8531B11505E4484J88118
$$ 429367 161537 -142430 -268089 34315 363413 65471 -58531 211505 54484 242602
12662B42602a49434N8449A01198K87011A48383K1278a84349F6769M815K2825J06289
$$ 242602 -149434 -90985 101198 388209 148383 169661 -184349 66769 71584 94409 200698
12651B00698G7625J86896B7635b0131A94163a12315A73088B9415K83974j3074
$$ 200698 77625 264521 27635 -20131 194163 -112315 173088 29415 313389 300315
12641C00315I8618J58046D7792g0855k5322J6944L6942k13175b4651A68982Q2952
$$ 300315 98618 256664 47792 -70855 -96177 -79233 -42291 -255466 -24651 168982 251934
12630B51934b21077B07507b78304C03688A16539K96076a0298E8418O0261J70852
$$ 251934 -221077 207507 -278304 303688 116539 412615 -10298 58418 118679 289531
12620B89531o2076r5309E2129f5800A05054M6111a44867B59008e0277C2038a60628
$$ 289531 227455 132146 52129 -65800 105054 151165 -144867 259008 -50277 32038 -160628
12608a54872I9179P1704l8609B668f5589C36517F3895Q4157R5443I3493l9626
$$ -154872 99179 170883 132274 2668 -65589 336517 63895 148052 243495 93493 53867
12597E3867g9888A48521a39964M9385A48304c1641E33539C4513f4680H5646l14
$$ 53867 -79888 148521 -139964 -90579 148304 -31641 533539 34513 -64680 85646 85332
12586H5332c82016J66562j43007C94666d4903G4955K55996A42847a97244I9852
$$ 85332 -382016 -215454 -358461 394666 -44903 74955 330951 142847 -197244 99852
12575B33284a91151j22979a02310A04117b41007e440n5531E33270d8214M961A1843
$$ 233284 -191151 -314130 -102310 104117 -241007 -5440 -60971 533270 -48214 -43253 11843
12563a34391B3779J32259E6794K13162d0640A88155J14359D5048J58066a10536
$$ -134391 23779 156038 56794 269956 -40640 188155 302514 45048 203114 -110536
12552C28492F269L95696b28901A81666a81122k98402A53527a8880D5925P2706
$$ 328492 6269 401965 -228901 181666 -181122 -479524 153527 -18880 45925 118631
12542A18631k6605N2061k8275L7985M0256a51253D085N27607a45753J1999I5277
$$ 118631 92026 144087 115812 153797 194053 -151253 4085 531692 -145753 -133754 95277
12530c26752B69467a1087A32910a36283b4085A45836a05083F9316M0464J89021
$$ -326752 269467 -11087 132910 -136283 -24085 145836 -105083 69316 109780 298801
12520B98801A01888d0236A82336a17396D67668a58002f4151D3601e3761p9207
$$ 298801 101888 -40236 182336 -117396 467668 -158002 -64151 43601 -53761 -132968
12510a32968A5480D602M0960g9334C9438c1250A49268l3520m582a3912A97889
$$ -132968 15480 4602 45562 -79334 39438 -31250 149268 115748 111166 -13912 197889
12498C307K61416J41038g4943E2535a5107A26267d5916C11259o8924d8533j68519
$$ 3307 264723 405761 -74943 52535 -15107 126267 -45916 311259 242335 -48533 -217052
12487b17052j5189B43173A19739D1474a46235j81482a22191J0785k66612A82962
$$ -217052 -232241 243173 119739 41474 -146235 -327717 -122191 -111406 -378018 182962
12476A4535N5500O2100C2410a54854a4527j43930A67500b94307B30068C5444g383
$$ 14535 70035 132135 32410 -154854 -14527 -158457 167500 -294307 230068 35444 -7383
12464e0990B37623b13299a27j1565B59794c61464A50769F6817a27894B4748i7327
$$ -50990 237623 -213299 -127 -11692 259794 -361464 150769 66817 -127894 24748 -97327
12452b89086F2693h7560F1111K3472J433c60975A7983a82079E6396K14006B5724
$$ -289086 62693 -87560 61111 84583 86016 -360975 17983 -182079 56396 270402 25724
12440G7397a92701B77305J17679c98419A0748J45658J71326b01079c3700j86626
$$ 77397 -192701 277305 394984 -398419 10748 156406 327732 -201079 -33700 -220326
12430b20326A18791E7246J00181J4765b00987h7678m0517B70700E8792a71757
$$ -220326 118791 57246 157427 172192 -200987 -87678 -128195 270700 58792 -171757
12419a05690d5701A92974g0285I031J78492A6055O9872b27465L6430G6194g5721
$$ -105690 -45701 192974 -70285 9031 187523 16055 85927 -227465 -191035 76194 -75721
12407I295e6528e764j88749A53960a00173P371A07203D3062a67869b5828B00622
$$ 9295 -56528 -5764 -194513 153960 -100173 -92802 107203 43062 -167869 -25828 200622
12395b43933B21961h0182F4576a0260C36026h6026k04399B30679I0270P5019b55762
$$ -243933 221961 -80182 64576 -10260 336026 -86026 -290425 230679 90270 165289 -255762
12383A43685F2503b6454k66978a39173q590a1796A75729E5852g6333m3255j72226
$$ 143685 62503 -26454 -293432 -139173 -147763 -11796 175729 55852 -76333 -119588 -291814
12372b91814A78735i1711B25574m4796B5384f4381A08883c43620A89513N806G5515
$$ -291814 178735 -91711 225574 180778 25384 -64381 108883 -343620 189513 195319 75515
12360i7847A02355K68730b6821A01926a83590B19576d25892C09006j08069b25583
$$ -97847 102355 371085 -26821 101926 -183590 219576 -425892 309006 200937 -225583
12349A13703M9465b7097n5844A61723a48544O0192J644m0643A23033B4341K73459
$$ 113703 163168 -27097 -82941 161723 -148544 -88352 -86708 -127351 123033 24341 297800
12338B97800j8093r2364a94659D167P7066K42010G3375J36643b52097C03959a28775
$$ 297800 279707 187343 -194659 4167 81233 323243 73375 210018 -252097 303959 -128775
12326H8852N9722h9795G014J67817A169J14179b46822a07807D4548J88441f201
$$ 88852 148574 -89795 7014 174831 1169 115348 -246822 -107807 44548 232989 -6201
12314F7427j0692J4499a51542A33528F4713K02036a99061F2765a04722l91283
$$ 67427 56735 71234 -151542 133528 64713 266749 -199061 62765 -104722 -496005
12304d96005a93859Q0074A29594B3056d49631B44548o9327J1G1703c2124a5220
$$ -496005 -193859 -113785 129594 23056 -449631 244548 175221 175232 71703 -32124 -15220
12292E1053j0319j4816N9832k4940K03100c27537O4365b0167C02337A49278l2713
$$ 51053 40734 25918 85750 60810 263910 -327537 -263172 -20167 302337 149278 116565
12281A16565P6405o0123a24815A11805h3678B37887E7184a24669D15732f1616
$$ 116565 192970 132847 -124815 111805 -83678 237887 57184 -124669 415732 -61616
12270A96168L0825g464E4593J8453r937K24982j2717a13303K3695b7881B25881
$$ 196168 226993 -7464 54593 73046 63109 288091 275374 -113303 -89608 -27881 225881
12258d1809A91182D3182L1929l6560r539a9855A58549J00477a53534B03423A0422
$$ -41809 191182 43182 75111 38551 29012 -19855 158549 259026 -153534 203423 10422
12246A8113J65603a5636B00407f6338K3441A65539J50201g7889F1454K17255B4407
$$ 18113 183716 -15636 200407 -66338 -42897 165539 315740 -77889 61454 278709 24407
12234a80593B28638J76583b59762H2884K99562g7679o8820B92166J7433r884n3795
$$ -180593 228638 405221 -259762 82884 382446 -77679 -146499 292166 309599 299715 245920
12223B45920k2614a06890C49193K37174k21284A47627a27360C08860j50603A255
$$ 245920 223306 -106890 349193 586367 365083 147627 -127360 308860 158257 1255
12212d5500q169D4386d7923F2402J20159k768h4640B44178j11236g1363B63184
$$ -45500 -53669 44386 -47923 62402 182561 179793 -84640 244178 132942 -71363 263184
12200B28338D0792b78522C37283j03474P4997J70426A19627L1973E7452K95675
$$ 228338 40792 -278522 337283 233809 308806 479232 119627 151600 57452 353127
12190C53127J0043K9920A19034h5852D08347H3369L32270a74582A37774a79800
$$ 353127 363170 393090 119034 -85852 408347 83369 415639 -174582 137774 -179800
12179B01773a28503C53103q8659G9975J99155L89403a7352D2596L41182C1827
$$ 201773 -128503 353103 264444 79975 279130 668533 -17352 42596 383778 31827
12168D72575B6798K60663G7531c718n7750q4958B80919F1847b09763A46443r259
$$ 472575 26798 287461 77531 -3718 -61468 -146426 280919 61847 -209763 146443 137184
12157A37184C3224P0929C8981d4837A46192a30420E0720K14695J28354g6134C5736
$$ 137184 33224 104153 38981 -44837 146192 -130420 50720 265415 393769 -76134 35736
12145A3606g7280j21226A14371l6966l21a49412A44167d1192k72201A21080e8972
$$ 13606 -77280 -198506 114371 77405 77084 -149412 144167 -41192 -313393 121080 -58972
12133A08419i6583A74434D093J19585E3004c6219I3612D982R4702O0422f736o6137
$$ 108419 -96583 174434 4093 123678 53004 -36219 93612 4982 99684 160106 -6736 -72873
12121g2873j45021A67484a20663R549Q779A23606b24704j06328A39022N6022g9395
$$ -72873 -217894 167484 -120663 -111114 -102335 123606 -224704 -331032 139022 195044 -79395
12109a42340f146I7574b42385f2262B18886j9660a35885d2385A64619a01036q9983
$$ -142340 -6146 97574 -242385 -62262 218886 199226 -135885 -42385 164619 -101036 -191019
12098a91019M5374k5612M4217I9538J39436h3263r2009h1243G9862J6261A9511
$$ -191019 -145645 -171257 -127040 99538 238974 -83263 -175272 -81243 79862 96123 19511
12086A39243d9050I6857a88876B5153N2749f2104O895m1811D10378A27093b25714
$$ 139243 -49050 96857 -188876 25153 77902 -62104 -55209 -97020 410378 127093 -225714
12074e6922B29350J32251f0276k51359c0972k52923A53426O6101e5063B99940
$$ -56922 229350 361601 -60276 -311635 -30972 -283895 153426 219527 -55063 299940
12063I61432M01082K23052D89797m4343j71979j24197b03383n3118a9277A83837
$$ 961432 1362514 1585566 489797 445454 273475 149278 -203383 -256501 -19277 183837
12052B49926a86098A5632K62322r8784c6383k85578l7079a4667A88744a14551
$$ 249926 -186098 15632 277954 179170 -36383 -321961 -359040 -14667 188744 -114551
12041c15731b2607A18518i7058B6507J96271b39876D6902K38296A32981a24558
$$ -315731 -22607 118518 -97058 26507 222778 -239876 46902 285198 132981 -124558
12030A32528P166O1082n010D0225K14159A09027f6685B24153a49008A7138f4120
$$ 132528 139694 200776 195766 40225 254384 109027 -66685 224153 -149008 17138 -64120
12018b64332N8942B04076d06279B71181h5076B2446J48293i9774K848k3561A18707
$$ -264332 -205390 204076 -406279 271181 -85076 22446 170739 -99774 -96926 -120487 118707
12006A17090i4450e844l91202A58876C921J27769b81088C9034c02172a35256N7839
$$ 117090 -94450 -5844 -397046 158876 3921 131690 -281088 39034 -302172 -135256 -77417
11995g7417A80049b37588B7821J49757H8584O8882E2023i2835j33839C03850a26243
$$ -77417 180049 -237588 27821 177578 88584 157466 52023 -92835 -226674 303850 -126243
11983A52379J22401a15039k76283h1020B2610f7308J074B34246a41467j44845
$$ 152379 274780 -115039 -391322 -81020 22610 -67308 -66234 234246 -141467 -286312
11973b86312J25315B1297g2190c3479a738o1138A21771b05354C40927b41016A54318
$$ -286312 -160997 21297 -72190 -33479 -1738 -62876 121771 -205354 340927 -241016 154318
11961B38618i02j60053k32783a60235E9885J9398g0575H6574D0178b51692e9941
$$ 238618 -902 -160955 -393738 -160235 59885 79283 -70575 86574 40178 -251692 -59941
11949b40011B56498E2443p705e8215q1157c9218N598A14480a44890A69095D1031
$$ -240011 256498 52443 44738 -58215 -139372 -39218 -33620 114480 -144890 169095 41031
11937B57965c16951Q0326a02854j3043A31474a2962H4149b84761C42629E4952
$$ 257965 -316951 -236625 -102854 -115897 131474 -12962 84149 -284761 342629 54952
11926A52086C6927b14709B00786c80299C1526c6087l3480A74855q5273O4094M6401
$$ 152086 36927 -214709 200786 -380299 31526 -36087 -69567 174855 89582 153676 200077
11915B00077i5329A5714b09047h3129j63239C12419c01876B40904c3535k07607
$$ 200077 -95329 15714 -209047 -83129 -246368 312419 -301876 240904 -33535 -241142
11905b41142e5722l7216C14492h0076K7331A17632k991d5796E6173c06180A86032
$$ -241142 -55722 -92938 314492 -80076 -52745 117632 114641 -45796 56173 -306180 186032
11893A43354a57636e1823C9981f7935N258A24793m3318M25613H7942a21581l088
$$ 143354 -157636 -51823 39981 -67935 -62677 124793 81475 507088 87942 -121581 -124669
11882a24669A10785a56388j44635i5643B04152L60968f9314C26880F0837b9135
$$ -124669 110785 -156388 -301023 -95643 204152 565120 -69314 326880 60837 -29135
11871B699a22276c1040B11548D2134c8933F1507a32112K0930C0567a95199b0199
$$ 2699 -122276 -31040 211548 42134 -38933 61507 -132112 -111182 30567 -195199 -20199
11859h2440A22106M39a35081e9458I6133f5453J7582I7262l2697K44580g6412
$$ -82440 122106 122545 -135081 -59458 96133 -65453 -47871 97262 64565 309145 -76412
11847a91871d9013k58124E8986P3431c0349j2023F1600J2864M4087a86704A22320
$$ -191871 -49013 -307137 58986 132417 -30349 -42372 61600 74464 118551 -186704 122320
11835i1430b8506A02868h6719p7235C20403c71931j14652a50988O5357q8990k9537
$$ -91430 -28506 102868 -86719 -163954 320403 -371931 -486583 -150988 -85631 -174621 -204158
11824b04158e6751A70648C3692J46258l4681E5109N2024J28913E7545b08328C14516
$$ -204158 -56751 170648 33692 179950 145269 55109 107133 236046 57545 -208328 314516
11812A22381b06588f4938l76732B05828i8607l4659A0934b70131J26470A28722
$$ 122381 -206588 -64938 -441670 205828 -98607 -133266 10934 -270131 -143661 128722
11801D520b67853A42657L1013e2260k3357H7462a29558A5599O3787O3155M2087
$$ 4520 -267853 142657 173670 -52260 -75617 87462 -129558 15599 79386 142541 184628
11790A84628E9361g9073j354I5927O171J12356b75571f6803C10821h6094A5893
$$ 184628 59361 -79073 -80427 95927 102098 214454 -275571 -66803 310821 -86094 15893
11778a19346C286h8194F1909a53776j26378g6907A37110j7507J44999f2652I8999
$$ -119346 3286 -88194 61909 -153776 -280154 -76907 137110 119603 264602 -62652 98999
11766g9844H2798R3902a6870k20239F0710a00324L161k28198G0344a42550B12897
$$ -79844 82798 176700 -16870 -237109 60710 -100324 -97163 -325361 70344 -142550 212897
11754b3327l6266A45226c4920j3833A20359c8268A12952d7906A79306b23842B48365
$$ -23327 -59593 145226 -34920 -48753 120359 -38268 112952 -47906 179306 -223842 248365
11742D28762B02053c25819B49961a17383N1593j74926A21544C1754J8760f3299
$$ 428762 202053 -325819 249961 -117383 -65790 -240716 121544 31754 50514 -63299
11731g8813A87973m4055n0989J01587M7707E2170b49046B60487h3841H2818a54704
$$ -78813 187973 143918 92929 194516 242223 52170 -249046 260487 -83841 82818 -154704
11719I4402i3968B33971A8815O6783A7385J38485D7290J47106a18469A83272M3610
$$ 94402 -93968 233971 18815 85598 17385 155870 47290 194396 -118469 183272 226882
11708B26882F0916A8802J02158a34677F0036J35747n4502c1720A67666J21249
$$ 226882 60916 18802 120960 -134677 60036 195783 141281 -31720 167666 288915
11698B88915r7614D7868a57885P1482A90018a2961C5189J04108L7246D0829J05039
$$ 288915 191301 47868 -157885 -86403 190018 -12961 35189 139297 176543 40829 145868
11687A45868O1362l4331a16100a1287A18925N3252a47852A49550B4825K16684
$$ 145868 207230 172899 -116100 -11287 118925 172177 -147852 149550 24825 241509
11677B41509E4415d6442q9737a6081A60123E0896a54935B80788i3588A35952E9569
$$ 241509 54415 -46442 -136179 -16081 160123 50896 -154935 280788 -93588 135952 59569
11665f7125B60051a45619o2852F5279b46477B240J86589a94613B1546a36764N7303
$$ -67125 260051 -145619 -208471 65279 -246477 2240 188829 -194613 21546 -136764 -79461
11654g9461k55295A57274J05688I9249C71J12548a44654D17691B6781J3331A2264
$$ -79461 -334756 157274 262962 99249 371 112919 -144654 417691 26781 40112 12264
11642a53941o3909g6229b6798B64769Q9412G6532a33214b8136F7173L8769C2498
$$ -153941 -217850 -76229 -26798 264769 354181 76532 -133214 -28136 67173 105942 32498
11630a3889A37848a39270F4717d5956m0433H6242a04335b2484A53683b32767C44543
$$ -13889 137848 -139270 64717 -45956 -86389 86242 -104335 -22484 153683 -232767 344543
11618A82651h9457H1837H145a67047B93997b11631L4443o0835A73237d5584A01427
$$ 182651 -89457 81837 8145 -167047 293997 -211631 -177188 -238023 173237 -45584 101427
11606C94098p9087j24667i2245B1843h2507A1205m921K5743K19710b20067A21678
$$ 394098 315011 190344 -92245 21843 -82507 11205 6284 32027 251737 -220067 121678
11594A73405R3664r6349a77804a9614j00714A79850o1314f3952C3997J90732a23853
$$ 173405 267069 170720 -177804 -19614 -120328 179850 118536 -63952 33997 224729 -123853
11582A75854p3012b8406I0398a8098I8743a98991C28285c9462l58988C50554d6759
$$ 175854 102842 -28406 90398 -18098 98743 -198991 328285 -39462 -398450 350554 -46759
11570E9538R9710J16461K29702H7014a90810A13086K41593d2469A71810i3863
$$ 59538 159248 275709 505411 87014 -190810 113086 354679 -42469 171810 -93863
11559a85210Q1295B21156i3056a1804A08929l5706J73678A16207m2261k2202a9213
$$ -185210 -103915 221156 -93056 -11804 108929 73223 246901 116207 73946 51744 -19213
11547b1612A28761i6388K3083C11020D0262a44176A15354c7793A56301a659A55003
$$ -21612 128761 -96388 -73305 311020 40262 -144176 115354 -37793 156301 -1659 155003
11535H5953A9702b8939n5590B89049K3753a68706O7672C17163b4873E4776e2502
$$ 85953 19702 -28939 -84529 289049 312802 -168706 -101034 317163 -24873 54776 -52502
11523a26771B33552b38617A4892K59837c0060A18278a40629b9973j17104H6496
$$ -126771 233552 -238617 14892 274729 -30060 118278 -140629 -29973 -147077 86496
11512C00862M9593G5588E814L06923A0468L85724a59740D08600A66405K07996
$$ 300862 350455 75588 5814 312737 10468 396192 -159740 408600 166405 374401
11502C74401A13511a37267C41219J53878A88066J26358A18571R7903k7115f9888
$$ 374401 113511 -137267 341219 495097 188066 314424 118571 216474 189359 -69888
11491e1388B67525L3123n8044J32541m3707F8193J44106F2624b163A06584R6739
$$ -51388 267525 300648 242604 375145 331438 68193 212299 62624 -2163 106584 203323
11480B03323d9473G2109J45218J30258m5477p8291a19540A97069n609C5528K68325
$$ 203323 -49473 72109 217327 347585 302108 223817 -119540 197069 191460 35528 303853
11469C03853E4456N35579b54564B51453I3514a3986A01828L76970D4131J38880
$$ 303853 54456 590035 -254564 251453 93514 -13986 101828 478798 44131 183011
11459A83011E3596c2098k1244A8860K62024M6918f0502C36682A18497J44557n7979
$$ 183011 53596 -32098 -53342 18860 280884 327802 -60502 336682 118497 263054 205075
11448B05075a02063H2284g4183E462c7312C46591f5767B17850c1392A07273h1274
$$ 205075 -102063 82284 -74183 5462 -37312 346591 -65767 217850 -31392 107273 -81274
11436A33475L718J05570c4348A55121J4590a92488g6088j13462A91721N8322c5130
$$ 133475 137193 242763 -34348 155121 169711 -192488 -76088 -189550 191721 250043 -35130
11424A23030J76844p7791i274b440B21122m9617e34721b2343k1214B62840I0855
$$ 123030 299874 222083 -9274 -2440 221122 171505 -534721 -22343 -43557 262840 90855
11412a50921M4636j15731A03227P5139j7615c17390B34958A09038d0537A84435
$$ -150921 -106285 -222016 103227 178366 160751 -317390 234958 109038 -40537 184435
11401b56739B39504E4160B0508Q7129g505A79942a60385E1451a70015A8734J62282
$$ -256739 239504 54160 20508 107637 -7505 179942 -160385 51451 -170015 18734 181016
11390A81016g8359J0259j68490b3503H9758C0057J83890a52487C20237b8391A49684
$$ 181016 -78359 -68100 -236590 -23503 89758 30057 213947 -152487 320237 -28391 149684
11378G5184J51926e7607l5365j70700q3885A39178L13053a53355q5515B03738
$$ 75184 227110 -57607 -92972 -263672 -347557 139178 452231 -153355 -238870 203738
11367c01749J47535B7415R5519a17934j61589E1527o640N4662a51662C04318a81429
$$ -301749 -154214 27415 122934 -117934 -279523 51527 44887 99549 -151662 304318 -181429
11355a00110G412M6514O3049a20358A06427d1870A15612K09674i626F5278J58040
$$ -100110 7412 53926 116975 -120358 106427 -41870 115612 325286 -9626 65278 223318
11344B23318f4372b8301A59535J4961E1713B2753f0998l14829H7424g5106A9866
$$ 223318 -64372 -28301 159535 174496 51713 22753 -60998 -375827 87424 -75106 19866
11332G4566M5252b1602B7638d3569A95396D0129R247L8048M5581K0569f4561p7176
$$ 74566 119818 -21602 27638 -43569 195396 40129 49376 87424 133005 153574 -64561 -141737
11320a41737c4303k35699B35730p7157G3827J48503b96113J07162k72418E2851
$$ -141737 -34303 -270002 235730 158573 73827 222330 -296113 -188951 -461369 52851
11309a24209o0076a6020k98264A338c45965b1786o6462B5176a16040b9955C01891
$$ -124209 -184285 -16020 -314284 1338 -345965 -21786 -88248 25176 -116040 -29955 301891
11297A12073a66920B22291c57566a73449r4166A18559a67695g7149L3939J4198
$$ 112073 -166920 222291 -357566 -173449 -267615 118559 -167695 -77149 -43210 -29012
11287b9012m34042e3056C8603a62375C209a76263G9289b86085N2449K9117A86574
$$ -29012 -463054 -53056 38603 -162375 3209 -176263 79289 -286085 -233636 -204519 186574
11275b48456b4494j87990A26764d2902H4546B6931c6779o8833h943F9745K12880
$$ -248456 -24494 -212484 126764 -42902 84546 26931 -36779 -105612 -8943 69745 282625
11264B82625g9902j28702H7853P6539a66355c2962p3235q5371A31009J522F3594
$$ 282625 -79902 -208604 87853 164392 -166355 -32962 -106197 -191568 131009 132531 63594
11252b21749B98974B1822Q610P849K50354A12624F76b41467Q6288F4726J28293
$$ -221749 298974 21822 30432 38281 288635 112624 676 -241467 -155179 64726 193019
11241A93019b49630a15784A3427i431A68076d5553A30442d42852J93423H3498
$$ 193019 -249630 -115784 13427 -9431 168076 -45553 130442 -442852 -249429 83498
11230B79978L5386A49365b34561h8976H1219c90945F1611J9974d0638d523j4057
$$ 279978 315364 149365 -234561 -88976 81219 -390945 61611 81585 -40638 -4523 -18580
11219a8580p4757f460j06716A8339a68475j22704j8136a24179c675C1541b4000
$$ -18580 -93337 -6460 -113176 18339 -168475 -291179 -309315 -124179 -3675 31541 -24000
11207C23788e4563j44895B4695J48627J85440G4888b7852l79606c1411q931j20382
$$ 323788 -54563 -199458 24695 173322 358762 74888 -27852 -407458 -31411 -40342 -160724
11196a60724B8218M0683P0071a51719F3605a95400A00959c77634A81459a77883
$$ -160724 28218 68901 138972 -151719 63605 -195400 100959 -377634 181459 -177883
11185D5058a8227B30113h7559G352e3126k17690f9981l3601D1124L05257j64615
$$ 45058 -18227 230113 -87559 7352 -53126 -270816 -69981 -103582 41124 346381 181766
11174A81766b6649G9417a09026I1572g1769A11146D8150a01242J1167A23560c4176
$$ 181766 -26649 79417 -109026 91572 -71769 111146 48150 -101242 -90075 123560 -34176
11162a01978A5838b28804Q0389A04774A35P4462J42167F2661c56297a25214B48279
$$ -101978 15838 -228804 -148415 104774 135 74597 216764 62661 -356297 -125214 248279
11150C194M7251F671P5478J45099d954A09251O7989d03574a04933D9553a68941
$$ 3194 50445 6671 82149 227248 -4954 109251 177240 -403574 -104933 49553 -168941
11138A4322a77510F1010K38151a80407e126A27435k2844l839A6717J10473K98050
$$ 14322 -177510 61010 299161 -180407 -5126 127435 104591 100752 16717 127190 425240
11127D25240A38590F6681h9564n8543L4638C8802O1121h6216c2230A39570P964
$$ 425240 138590 66681 -89564 -148107 -113469 38802 99923 -86216 -32230 139570 147534
11116A47534J08763q5022f3460b2126C1147J41422p4030N2440a275A66912H3338
$$ 147534 256297 171275 -63460 -22126 31147 172569 98539 150979 -1275 166912 83338
11104D5168J12617Q460E8977K34159A21627m375J75661H8880l6323K79648j46147
$$ 45168 157785 166245 58977 293136 121627 117252 292913 88880 52557 332205 186058
11093A86058o2893M22479k32612K7787I2070K7891E5064J05499L1547E3338k970
$$ 186058 123165 545644 313032 340819 92070 119961 55064 160563 192110 53338 50368
11082E0368a4862H0834E980K24642J52005A25955J91189P3652o4114K04383B07161
$$ 50368 -14862 80834 5980 230622 382627 125955 317144 390796 326682 531065 207161
11070B72755K7687j21326K24846q5035L4159J67171q4342M1027J49646K24000
$$ 272755 300442 179116 403962 318927 353086 520257 435915 476942 626588 850588
11060H50588j47535j52118O2353J8365K39469j1382A97211N29293O0334J51743
$$ 850588 703053 550935 613288 631653 871122 859740 197211 726504 786838 938581
11050I38581j51775Q855l9740j67548K47696j27465J60848M11l36851K67260j33577
$$ 938581 786806 795661 755921 588373 836069 708604 869452 869863 533012 800272 666695
11039F66695J51125k65063J49180J47446L08J6936j44842p0207K53435j4985j19551
$$ 666695 817820 552757 701937 849383 849691 866627 721785 651578 905013 890028 770477
11028G70477l76153P20869n21011j89160N97854m64676O1701J16398J91812N9335
$$ 770477 394324 1115193 594182 405022 1002876 538200 599901 716299 908111 967446
11018I67446C18790L82419q5830J4586j4883O9677o3451K23019C65355M94839
$$ 967446 318790 701209 615379 629965 615082 684759 621308 844327 365355 860194
11008H60194k56329o1669L6200K13323P3442k30395N2799J11551P5539j33721
$$ 860194 603865 542196 578396 791719 865161 634766 687565 799116 874655 740934
10998G40934J38241l09611l8489J95751J04023j30169M36768j43461n3188Q3381
$$ 740934 879175 569564 531075 726826 830849 700680 1137448 993987 940799 1024180
10988A024180l90151M20168m3529P5346j26872M54570j28328M68111k85702P6437
$$ 1024180 634029 1054197 1010668 1086014 959142 1413712 1285384 1753495 1467793 1544230
10978A544230P1214L45377L61404N4037n5767O51408q6790J28632K12590k06436
$$ 1544230 1615444 1960821 2322225 2376262 2320495 2971903 2885113 3013745 3226335 3019899
10968C019899J14295l46513p41389K79856k99855q9248k23159K64664l50870N70326
$$ 3019899 3134194 2787681 2046292 2326148 2026293 1937045 1713886 1978550 1627680 2198006
10958B198006L9476k59379l52701R1062n1162j15919m30121j34517j12939k7920
$$ 2198006 2237482 1978103 1625402 1716464 1665302 1549383 1119262 984745 871806 843886
10948H43886q3313k99609p8109Q023A82851n5348J6157L01428p8696k4168q6535
$$ 843886 760573 460964 382855 390878 182851 127503 143660 445088 366392 342224 255689
10937B55689j00620a780l8079I6779L25908E9875Q3522J11872J8069A28899A4012
$$ 255689 155069 -1780 -39859 96779 422687 59875 143397 255269 273338 128899 14012
10925D4323f4593A15512Q9970J12260j8628j30001p8104L31065A92632a3718A61898
$$ 44323 -64593 115512 205482 317742 299114 169113 91009 422074 192632 -13718 161898
10913B3311b30242C5722b93193k3914B04144J38115a82933h6328j33654B45406
$$ 23311 -230242 35722 -293193 -317107 204144 342259 -182933 -86328 -219982 245406
10902D54657a66602A31407R2459a20229N8686A14296n5287d921B34223a23094
$$ 454657 -166602 131407 223866 -120229 -61543 114296 59009 -4921 234223 -123094
10891b33596M0182A13365e8721j25847P9020B28051g3996k25023h7780B16007
$$ -233596 -193414 113365 -58721 -184568 -105548 228051 -73996 -299019 -87780 216007
10880E454N0705O5121K65635b05316A88095g1497A61330J53449C8061h9517L3180
$$ 5454 56159 121280 386915 -205316 188095 -71497 161330 314779 38061 -89517 -56337
10869e6337k0042K9568A65556b50569k6754A37482a24632P664j25564j4974A41914
$$ -56337 -76379 -46811 165556 -250569 -277323 137482 -124632 -116968 -242532 -257506 141914
10857a35337B70081c69921J61358G8418f046F2527a20719G5596a67870F4434a55124
$$ -135337 270081 -369921 -208563 78418 -6046 62527 -120719 75596 -167870 64434 -155124
10845f9350n1210M5672A10469F930c90708a70217A20899a45107j83915P9485h6017
$$ -69350 -120560 -74888 110469 6930 -390708 -170217 120899 -145107 -329022 -249537 -86017
10833B16763J3912f705j1867B67789g4982n0650A54188F9589J30540a27613A5550
$$ 216763 230675 -6705 -18572 267789 -74982 -125632 154188 69589 200129 -127613 15550
10821a40480j18827E0377b4716q9446A33597d5795k13868d0256k75067a40938
$$ -140480 -259307 50377 -24716 -114162 133597 -45795 -259663 -40256 -315323 -140938
10810B2843O6007c66838a52094j8229h4331B4332L141d22434g277H6805d4770
$$ 22843 88850 -366838 -152094 -170323 -84331 24332 27473 -422434 -7277 86805 -44770
10798a1193j26864l14221J68228c3619D660a96076B03208L5190a95636E9242O727
$$ -11193 -138057 -452278 -284050 -33619 4660 -196076 203208 238398 -195636 59242 65969
10787F5969b55973c1048j54149B1210J00629b13933K6412i1590k9316j75962A2761
$$ 65969 -255973 -31048 -185197 21210 121839 -213933 -187521 -91590 -120906 -296868 12761
10775a15815G939a6387l08933B5007J82124n0564b287m1120q6650O3947H66i3085
$$ -115815 7939 -16387 -325320 25007 207131 156567 -2287 -43407 -130057 -66110 866 -93085
10762B1803c8200k19966P9900N7582g643n9029D0733M0765e2501A64997e2919
$$ 21803 -38200 -258166 -178266 -120684 -7643 -66672 40733 81498 -52501 164997 -52919
10750a0191m78717C68061a15939D70770g9317k0129j81656C6856b42128A1356
$$ -10191 -488908 368061 -115939 470770 -79317 -99446 -281102 36856 -242128 11356
10739a64838j77629l03415L22149a5761A66320b13843b234C556c6699m576n369
$$ -164838 -342467 -645882 -323733 -15761 166320 -213843 -2234 3556 -36699 -41275 -46644
10728d6644c744B6758a59437d6181A28688b94938a40056E2921a57781B40314g7153
$$ -46644 -3744 26758 -159437 -46181 128688 -294938 -140056 52921 -157781 240314 -77153
10716A0709J7051b54641B43173A6257c05590C1504Q0089J33555F2850J004c47878
$$ 10709 27760 -254641 243173 16257 -305590 31504 111593 245148 62850 63854 -347878
10704b49665O6283j01888N4345j08315I7319a58582j8533A56833K02778b33468
$$ -249665 -183382 -285270 -230925 -339240 97319 -158582 -177115 156833 359611 -233468
10693A55498G0319a9467C31718c3328A23281g9575r3684D04442a91996B0476b05073
$$ 155498 70319 -19467 331718 -33328 123281 -79575 -173259 404442 -191996 20476 -205073
10681A21896O8323a98861Q5128E2534J18123a52337A16680O3578c6836A87642
$$ 121896 190219 -198861 -113733 52534 170657 -152337 116680 180258 -36836 187642
10670A87535C5049c07865H3680h6172c5981l40771I3565K3155e741B94675e20812
$$ 187535 35049 -307865 83680 -86172 -35981 -376752 93565 116720 -5741 294675 -520812
10658a71307D6513b05281i9966F6890a55618G7338J05381E03b05699c5296k967
$$ -171307 46513 -205281 -99966 66890 -155618 77338 182719 503 -205699 -35296 -38263
10647c8263k15096C27379b40591B48766h9472j41472A50953a00723J4184A11875
$$ -38263 -253359 327379 -240591 248766 -89472 -230944 150953 -100723 -86539 111875
10636a49621F7016b40818A83633i7117A64933d1104n385B50790c55438a06186
$$ -149621 67016 -240818 183633 -97117 164933 -41104 -46489 250790 -355438 -106186
10625a60731I3523a37517d810G8899a11075j30338A53378b98988R2212B22252
$$ -160731 93523 -137517 -4810 78899 -111075 -241413 153378 -298988 -206776 222252
10614a24301c7290q1219H8042a91725A76521n8804O3309g7684l6385N5520C03309
$$ -124301 -37290 -118509 88042 -191725 176521 117717 181026 -77684 -114069 -58549 303309
10602a83680O6918e4936q0008c6899l08049a8995j15467l7426A60902P999b18497
$$ -183680 -116762 -54936 -134944 -36899 -344948 -18995 -134462 -171888 160902 168901 -218497
10590e1511k39184Q6772F5788d31675K13374Q1212A18880j4002a7510n681G2867
$$ -51511 -290695 -203923 65788 -431675 -218301 -137089 118880 104878 -17510 -23191 72867
10578a09880q3331p5613h7001j0584b8240k75644C9039c3409C50934b75670Q0498
$$ -109880 -193211 -268824 -87001 -97585 -28240 -303884 39039 -33409 350934 -275670 -195172
10567a95172A0016a95897D1835a06684D2535b9949B10212o7344a96356M0854F125
$$ -195172 10016 -195897 41835 -106684 42535 -29949 210212 142868 -196356 -155502 6125
10555e1694Q95R906A00789a23144l6327A16842n3191a20954J9343A43907a11915
$$ -51694 -50799 -40893 100789 -123144 -159471 116842 63651 -120954 -101611 143907 -111915
10543a50101A22750a18853C27446d56984g4236E4530L8147J04167b72295d2702
$$ -150101 122750 -118853 327446 -456984 -74236 54530 92677 196844 -272295 -42702
10532a33176J0992b8732m4677j05863K1655I6674D5244i4381C19524G9297e3450
$$ -133176 -122184 -28732 -73409 -179272 -157617 96674 45244 -94381 319524 79297 -53450
10520h5581J7315n6516A49980a12645j98818K7323g20j22924N817j04173d870
$$ -85581 -68266 -124782 149980 -112645 -311463 -284140 -720 -123644 -117827 -222000 -4870
10508f4169m0804A8329Q3033O8245a4839K320n0502H1093a41970a0436m6904j060
$$ -64169 -104973 18329 101362 169607 -14839 -12519 -63021 81093 -141970 -10436 -57340 -58400
10496e8400j88843k8572A7484b49916p158o3362G1046g6669A7141Q3697i334k60085
$$ -58400 -247243 -275815 17484 -249916 -257074 -320436 71046 -76669 17141 100838 -9334 -269419
10484b69419A86217o9585K55889j21728L51154A23824K33216G8661R4913q4777
$$ -269419 186217 116632 372521 250793 601947 123824 357040 78661 173574 88797
10474H8797b0241D02631i5596B27241C1186J16670a23374F1687a98464H7186a83468
$$ 88797 -20241 402631 -95596 227241 31186 147856 -123374 61687 -198464 87186 -183468
10462A08255b40222B8398c7978A22864N0002q0710a67357I0541L6665a02440A60731
$$ 108255 -240222 28398 -37978 122864 172866 92156 -167357 90541 127206 -102440 160731
10450a33238q804A25052n9151Q1081c9237j5061C3473P8503k2084L7290I892c44344
$$ -133238 -142042 125052 65901 146982 -39237 -54298 33473 111976 89892 127182 9892 -344344
10437F0857K255b03009k0620B5529b86652a29778o062c4253j59655a154B59139
$$ 60857 63112 -203009 -223629 25529 -286652 -129778 -135840 -34253 -193908 -1154 259139
10425f4357A79963a75970g386A09876B1716a82941d1241C3604O572a22637g581
$$ -64357 179963 -175970 -7386 109876 21716 -182941 -41241 33604 40176 -122637 -7581
10413E4833h8731j16532A10368E4353B83J54334c2870o7502k95538A514J54763
$$ 54833 -88731 -205263 110368 54353 283 154617 -32870 -100372 -395910 1514 156277
10402A56277a3462l4993J8866k33907I3655c53082C1927a42796m9225G1755a47267
$$ 156277 -13462 -48455 -29589 -263496 93655 -353082 31927 -142796 -192021 71755 -147267
10390B80341G8496K28842a19194D6169d0598G7674J7313b0613H7909K07895O2249
$$ 280341 78496 307338 -119194 46169 -40598 77674 94987 -20613 87909 295804 358053
10379C58053Q7300B10398a33669B72421D7107O72599k53264j63736I5431K56392
$$ 358053 445353 210398 -133669 272421 47107 719706 466442 302706 95431 351823
10369C51823n8250J75611j59343M66031j85180j74808j17593L54506A63233K5445
$$ 351823 293573 469184 309841 775872 590692 415884 298291 652797 163233 188678
10359A88678h3443A1228J53529a01433A43678L5786K27945N1523A39509O38943
$$ 188678 -83443 11228 164757 -101433 143678 179464 407409 458932 139509 778452
10349G78452l32095O4488j70228a18560E81305J58429k75074H1318M86187A95573
$$ 778452 446357 510845 340617 -118560 581305 739734 464660 81318 567505 195573
10338i705k37564B47185J71064j98946J5296b88538a4379A43712J78265j27371
$$ -9705 -247269 247185 418249 219303 234599 -288538 -14379 143712 321977 194606
10328A94606g0430A48012J08519A13573a60426c4966C31732j07694R194G7959
$$ 194606 -70430 148012 256531 113573 -160426 -34966 331732 224038 233232 77959
10317A72065F8561P0593I848J47953i5165j46319n7202C14008H5581a4269m45596
$$ 172065 68561 139154 9848 157801 -95165 -241484 -298686 314008 85581 -14269 -459865
10306d59865a07203k1183B13755O2460n5082f1526A24357K40661a00756j8559
$$ -459865 -107203 -128386 213755 276215 221133 -61526 124357 365018 -100756 -119315
10296a19315B54605a39156M9864B74567B4971a07455c014k53532A76634D4481
$$ -119315 254605 -139156 -89292 274567 24971 -107455 -3014 -256546 176634 44481
10285d8599j61994C9402J32927b58317A80148c67142k3582I3498c82585a68935
$$ -48599 -210593 39402 172329 -258317 180148 -367142 -390724 93498 -382585 -168935
10274b347A09402a02300A17473P7665I0892d03121B67189b27290R3024j9417a1211
$$ -2347 109402 -102300 117473 195138 90892 -403121 267189 -227290 -134266 -153683 -11211
10262a08244c3099j39259C42414n0883M6378L19062B61205A22460J71008d6380
$$ -108244 -33099 -172358 342414 291531 337909 656971 261205 122460 293468 -46380
10251A27945G182a06111C15104b09127j57013D25877j34055p1487i4499A17945
$$ 127945 7182 -106111 315104 -209127 -366140 425877 291822 220335 -94499 117945
10240a40677G0333R6527K4770f8753C1716c0175B0788P3299c61664J01026c750
$$ -140677 70333 166860 191630 -68753 31716 -30175 20788 94087 -361664 -260638 -3750
10228e8294N724o6086o5443G4833a43874k9451f9464K4645B97129d7973D8060
$$ -58294 -52570 -118656 -184099 74833 -143874 -173325 -69464 -44819 297129 -47973 48060
10216b52020m486h597k11593A66735p1056A498J79182a55124C0686R0263a03721
$$ -252020 -256506 -8597 -220190 166735 95679 1498 180680 -155124 30686 120949 -103721
10204b07058B2313a67176l77273a09443A35467b46810B76879c34912J52813M8185
$$ -207058 22313 -167176 -544449 -109443 135467 -246810 276879 -334912 -182099 -133914
10194a33914k08772a60435K3041A23493c70794A51754j9296f5766c1432l5235
$$ -133914 -342686 -160435 -137394 123493 -370794 151754 132458 -65766 -31432 -66667
10184f6667K977k98349a74221I8802K10960a13960E3662K21946f5175A5624b69899
$$ -66667 -63690 -362039 -174221 98802 309762 -113960 53662 275608 -65175 15624 -269899
10172g2896A68254a71406B41786b14382d3997p9835j9137E7994J6997c07332a20475
$$ -72896 168254 -171406 241786 -214382 -43997 -123832 -142969 57994 74991 -307332 -120475
10160b11378p2555J14839j9650R2383j04822k5982m1217b1068k8751o6771j42662
$$ -211378 -283933 -169094 -188744 -96361 -201183 -227165 -268382 -21068 -49819 -116590 -259252
10149b59252B68688a42979N6411I9267l3575k49b60220D9511O2411b44665E6658
$$ -259252 268688 -142979 -86568 99267 65692 65443 -260220 49511 111922 -244665 56658
10137a12170A12914p848a16209A92175b38073A70280b0907n307B03759a46137
$$ -112170 112914 105066 -116209 192175 -238073 170280 -20907 -26214 203759 -146137
10126a33595j568g616A69262a98227B3029b56806h9811H3161h3697A49075F199
$$ -133595 -135163 -7616 169262 -198227 23029 -256806 -89811 83161 -83697 149075 6199
10114e6560A72707b78088H0071b37900i5271a4632l73878J00083J24645A23562
$$ -56560 172707 -278088 80071 -237900 -95271 -14632 -388510 -288427 -163782 123562
10103a43059A69252l336C5981c05927a0186k29630k6080f8293O050k1272I5525
$$ -143059 169252 165916 35981 -305927 -10186 -239816 -265896 -68293 -62243 -83515 95525
10091b37454i5699r3342n1043a17612G7172a2192j58625k9377m059C1139b02837
$$ -237454 -95699 -189041 -240084 -117612 77172 -12192 -170817 -200194 -204253 31139 -202837
10079a3308G7600a79582H9380a5843p7061l51821J54408B2640O3985c91167J90470
$$ -13308 77600 -179582 89380 -15843 -92904 -444725 -290317 22640 86625 -391167 -200697
10068b00697a2280o7974n5498f6326r3951j74632j2274J43542k75666A14475l1298
$$ -200697 -12280 -80254 -135752 -66326 -160277 -334909 -347183 -203641 -479307 114475 83177
10057H3177J23619b26l14015R9619J8357E3981P9278A3307J63164a69276B22684
$$ 83177 206796 -226 -314241 -214622 -196265 53981 133259 13307 176471 -169276 222684
10045c01607G8990C4695i3951a6888A321c0984k67726j18224J16689a4142o7111
$$ -301607 78990 34695 -93951 -16888 1321 -30984 -298710 -416934 -300245 -14142 -81253
10034h1253L0703A15673i4261L5200j45909C7026a8174A15070c5417A81014q7679
$$ -81253 -50550 115673 -94261 -59061 -204970 37026 -18174 115070 -35417 181014 93335
10023I3335a90433A27214e1500m3427j13687a03449H2388M5724n2996a18950b8546
$$ 93335 -190433 127214 -51500 -94927 -208614 -103449 82388 128112 75116 -118950 -28546
10011A9934J04999a17154L0144C1523k902b67948A33003g6289B442a6454p369
$$ 19934 124933 -117154 -87010 31523 28621 -267948 133003 -76289 2442 -16454 -23823
10000b3823A52703F4889c8415J5624m8546m6443b4766j25570B7746J69805a51759
$$ -23823 152703 64889 -38415 -22791 -71337 -117780 -24766 -150336 27746 197551 -151759
9988c02523E696a40628N5782l30c8524k8698k25684h8247m6591n8763C39855D547
$$ -302523 5696 -140628 -84846 -85176 -38524 -67222 -292906 -88247 -134838 -193601 339855 4547
9975F7627b02897P5224H7248B409c9750k28691a31096D809b58909a15967d5424
$$ 67627 -202897 -127673 87248 2409 -39750 -268441 -131096 4809 -258909 -115967 -45424
9963a4761C63874a4447H0841k9634d21857a18535k80061i4295o4830a5628j31203
$$ -14761 363874 -14447 80841 51207 -421857 -118535 -398596 -94295 -159125 -15628 -146831
9952a46831A68976b35466L0284B0909f8854A10265E3207d6443p2817j53043I3655
$$ -146831 168976 -235466 -205182 20909 -68854 110265 53207 -46443 -119260 -272303 93655
9940D0176c7365j49467e3720B37607c41322J13586J4277A66850H1266f0819A88884
$$ 40176 -37365 -186832 -53720 237607 -341322 -227736 -213459 166850 81266 -60819 188884
9928H3631b63658d016j64833D1547b4112o1914g946B7209N4748H34g7313j07652
$$ 83631 -263658 -4016 -168849 41547 -24112 -86026 -7946 27209 81957 834 -77313 -184965
9916a84965Q0610b9491j28767a6787j0327B18391D1080a76305k72287J92050A084
$$ -184965 -104355 -29491 -158258 -16787 -27114 218391 41080 -176305 -448592 -256542 1084
9904a58242m6083B935i4387e715F7131a67106J0854j93926B1572L8605d0685l3825
$$ -158242 -204325 2935 -94387 -5715 67131 -167106 -156252 -350178 21572 60177 -40685 -74510
9892g4510k00176J21294e5702D4091a61341N9383E3430k2692R0800c46726J05776
$$ -74510 -274686 -153392 -55702 44091 -161341 -101958 53430 30738 121538 -346726 -240950
9881b40950g1867m0442d9763Q45A46151O8026a87684A4853K4358g8698A54897
$$ -240950 -71867 -112309 -49763 -48918 146151 214177 -187684 14853 39211 -78698 154897
9869B45910b00513M4632A99576h6066k2942L743j25978P8425D4340c83221J19758
$$ 245910 -200513 -155881 199576 -86066 -109008 -105265 -231243 -152818 44340 -383221 -263463
9858b63463A199c9650I1399e270o5740L2187l6937H868b85762N804a03309A06680
$$ -263463 1199 -39650 91399 -5270 -71010 -38823 -75760 8868 -285762 -279958 -103309 106680
9845a08390n6404o5784b3535p189B9435b57787N9802B01932q6133g1549j88552
$$ -108390 -164794 -230578 -23535 -30724 29435 -257787 -197985 201932 115799 -71549 -260101
9834b60101L1262q7590A01097M3182d9238A08598d703F891M9555a65799j0622
$$ -260101 -228839 -316429 101097 144279 -49238 108598 -4703 6891 56446 -165799 -176421
9823a76421B3433a30201l2176l0191Q2255j19799j10936J69093d6184q6201j88966
$$ -176421 23433 -130201 -162377 -192568 -110313 -230112 -341048 -171955 -46184 -132385 -321351
9812c21351e5976A35922a55202j32850G20d570n4188k0646a0258k86149M347J44485
$$ -321351 -55976 135922 -155202 -288052 720 -4570 -58758 -79404 -10258 -296407 -292060 -147575
9800a47575I1420F228b05870e8766m01320H4393c9933p5716C11853h8977F8006
$$ -147575 91420 6228 -205870 -58766 -460086 84393 -39933 -115649 311853 -88977 68006
9788C38084a38135A24662a88393H3470d02569A00436k0893d0002j84601A341c1140
$$ 338084 -138135 124662 -188393 83470 -402569 100436 79543 -40002 -224603 1341 -31140
9776c17171d1653l17718c7417B01704c05331A8854f9866j64396Q2984r3591b1624
$$ -317171 -41653 -359371 -37417 201704 -305331 18854 -69866 -234262 -151278 -244869 -21624
9764b94871a0525B50579d9933q5032B6966d43053J88558J03103o2283E5849b66846
$$ -294871 -10525 250579 -49933 -134965 26966 -443053 -254495 -151392 -213675 55849 -266846
9752e0547o842j88967p9549I8453b4634A61270d0374k5689A63384J5124K615a24803
$$ -50547 -57389 -246356 -325905 98453 -24634 161270 -40374 -66063 163384 178508 181123 -124803
9739f214C0344h8009j77055j27150B11991g8467m7613j03244G6459a32796A04379
$$ -6214 30344 -88009 -265064 -392214 211991 -78467 -126080 -229324 76459 -132796 104379
9727c5661B45777A08952a6922l81388a01456B8030J64746a73835P0828A06115
$$ -35661 245777 108952 -16922 -398310 -101456 28030 192776 -173835 -103007 106115
9716c19816J36005M9283p0735I1631C3776h0711B13053k8599Q1321a30132M7844
$$ -319816 -183811 -134528 -205263 91631 33776 -80711 213053 184454 265775 -130132 -82288
9705h2288j2611A97681C2449a11407A26787d92542a15620L1589C99230j93981
$$ -82288 -94899 197681 32449 -111407 126787 -492542 -115620 -84031 399230 205249
9695B05249o0749b58677F4032b17901L9334O464F0339c08687j80224A17796a33521
$$ 205249 144500 -258677 64032 -217901 -178567 -172103 60339 -308687 -488911 117796 -133521
9683a76853E4288b70847c9445n0222H2378M1885P1870j5231K03155c89103A06582
$$ -176853 54288 -270847 -39445 -89667 82378 124263 196133 180902 384057 -389103 106582
9671d88815A75855a62736C82727a04173d2439j12293n0507r4830J47695k6221
$$ -488815 175855 -162736 382727 -104173 -42439 -154732 -205239 -300069 -152374 -178595
9661a78595G3683a55882B6564a27797E6632b93756A88698p265a85227B04880h2197
$$ -178595 73683 -155882 26564 -127797 56632 -293756 188698 181433 -185227 204880 -82197
9649g8613m629E1396a57957B4826R5858e4244B6863d28428B29541m7491L67706
$$ -78613 -83242 51396 -157957 24826 120684 -54244 26863 -428428 229541 182050 549756
9638E49756d0620C22090J18103c40320G971c3924A67129a90876j06693n433J30719
$$ 549756 -40620 322090 440193 -340320 7971 -33924 167129 -190876 -297569 -303002 -172283
9627a72283j25133d8646a7133k13794F6568d17403Q7876E9949d9014j83896n7364
$$ -172283 -297416 -48646 -17133 -230927 66568 -417403 -329527 59949 -49014 -232910 -290274
9616b90274O5357k05556b05404O8517a2499I7107a71537j5108A5934J39933b52848
$$ -290274 -224917 -430473 -205404 -136887 -12499 97107 -171537 -186645 15934 155867 -252848
9604A6228N9883P5384m7638A7567L3097a83374G1321K8138B5536g5748n870m4020
$$ 16228 76111 151495 103857 17567 50664 -183374 71321 99459 25536 -75748 -81618 -125638
9592a25638m3937b2113m8132k28422m5961E3505O8831a39855K3164j16477B8295
$$ -125638 -169575 -22113 -70245 -298667 -344628 53505 122336 -139855 -116691 -233168 28295
9580a62584P1298C4810a05749j50256j9725A05299O6293b22446a08184A31492
$$ -162584 -91286 34810 -105749 -256005 -275730 105299 171592 -222446 -108184 131492
9569A99883B0808N8167b66968M5550b1995k37755i5586d0614j82507C44554H1370
$$ 199883 20808 78975 -266968 -221418 -21995 -259750 -95586 -40614 -223121 344554 81370
9557b42415k12526K08724j3933c4701j4774A34348d15538a55375g2936C72754
$$ -242415 -454941 -246217 -260150 -34701 -49475 134348 -415538 -155375 -72936 372754
9546d06908e6040j14000j62663e0110j46998D0666J59282F8615a3612D8336h6734
$$ -406908 -56040 -170040 -332703 -50110 -197108 40666 199948 68615 -13612 48336 -86734
9534B07220E0152a23270j84594a15569A0102b02480f3029b19j30832n3135a5520
$$ 207220 50152 -123270 -307864 -115569 10102 -202480 -63029 -219 -131051 -184186 -15520
9522A44161a05897r7769g8703L5470l00232e7794i207I9673b76652a5337o62441
$$ 144161 -105897 -203666 -78703 -43233 -343465 -57794 -9207 99673 -276652 -15337 -677778
9511f77778A6932d4378k31097G4103a37052O0720k56489d4317B17562e7888a1895
$$ -677778 16932 -44378 -275475 74103 -137052 -76332 -332821 -44317 217562 -57888 -11895
9499A70288b95492j00328J41335A27850B2174d3925l610j4697A70205p3128H654
$$ 170288 -295492 -395820 -254485 127850 22174 -43925 -47535 -62232 170205 97077 8654
9487i5893j3953A40560A6271N3043O0317l9149F956b60110C10836j55365C1258
$$ -95893 -109846 140560 16271 69314 129631 90482 6956 -260110 310836 155471 31258
9475c61160i4409a1230F0000c2015A40349o6827d62151g8890A6019b16225i0284
$$ -361160 -94409 -11230 60000 -32015 140349 73522 -462151 -78890 16019 -216225 -90284
9463g5739B40107d8834l5707A91852E1340d7296D416a22778B12302b77841D01163
$$ -75739 240107 -48834 -84541 191852 51340 -47296 4416 -122778 212302 -277841 401163
9451h9003j29843g7010r0535K8204A92992c2050k58485f1518A03612j7578a29524
$$ -89003 -218846 -77010 -167545 -139341 192992 -32050 -290535 -61518 103612 86034 -129524
9439f7178B1081g0811C54542b21206B2320J55204g2929k52266a45930D4450d5140
$$ -67178 21081 -70811 354542 -221206 22320 177524 -72929 -325195 -145930 44450 -45140
9427E6331j9474a06643A07482b49209j01016J54487g2753A18370a15194r6891
$$ 56331 36857 -106643 107482 -249209 -350225 -195738 -72753 118370 -115194 -212085
9417b12085J00800A92946l6819g8598B7642b32246B73357O009a54034f3932b5608
$$ -212085 -111285 192946 156127 -78598 27642 -232246 273357 279366 -154034 -63932 -25608
9405a07548A08496R53P2810h5366B45522b41203a19284A60400a63806F2062a98877
$$ -107548 108496 109449 182259 -85366 245522 -241203 -119284 160400 -163806 62062 -198877
9393C3320K0457J36549a11217H1881J57991a26936o17696a17248H6598a1237j4545
$$ 33320 53777 190326 -111217 81881 239872 -126936 -744632 -117248 86598 -11237 -25782
9382b5782B34031A8662L56409A47879c02269J01951M9245A4325J51389d0888J1888
$$ -25782 234031 18662 375071 147879 -302269 -200318 -151073 14325 165714 -40888 -29000
9371b9000m1627j22076l0904a07675j38493R4590l3647E971d90789a99344k13293
$$ -29000 -70627 -192703 -223607 -107675 -246168 -151578 -185225 5971 -490789 -199344 -412637
9360d12637A22212l3968b96568a3558p4454l85494H0231a10055C0013L18597b81834
$$ -412637 122212 88244 -296568 -13558 -88012 -473506 80231 -110055 30013 348610 -281834
9348b33564A691a66090j9384l8885r4584a41037A31116D2760b46432A79946D6588
$$ -233564 1691 -166090 -185474 -224359 -318943 -141037 131116 42760 -246432 179946 46588
9336A9608a88259j34006a20564j21053E9411J36221a61535A53761i5609L8007
$$ 19608 -188259 -322265 -120564 -241617 59411 195632 -161535 153761 -95609 -57602
9326e7602A85251E3066l535M027b7051E3083b2333o5245c4954p7303M4911Q162
$$ -57602 185251 53066 49531 53558 -27051 53083 -22333 -87578 -34954 -112257 -67346 -59184
9314e9184a4286m66279d354A205g0162k87441k8439D5165h3678j79201g7950l7095
$$ -59184 -14286 -480565 -4354 1205 -70162 -357603 -386042 45165 -83678 -262879 -77950 -115045
9302a15045k40852a54040B1557K03321a42146A65211a35037K6574q4889K0384
$$ -115045 -355897 -154040 21557 224878 -142146 165211 -135037 -108463 -193352 -172968
9292a72968h2762j52166A17771L8945A431b21712B58698h4928D2542c31099a63722
$$ -172968 -82762 -234928 117771 156716 1431 -221712 258698 -84928 42542 -331099 -163722
9280a4910k65661D5272J08792f5615C11829a31559N9097a3841B20249F834f0184
$$ -14910 -280571 45272 154064 -65615 311829 -131559 -72462 -13841 220249 6834 -60184
9268h9486K5304j26379a6171k55657l4565J22089a0949A26280a00116A04057b94326
$$ -89486 -64182 -190561 -16171 -271828 -306393 -184304 -10949 126280 -100116 104057 -294326
9256C8405K25499a7021n494A8506a73146L992j6086N2973C5918a14661j76038
$$ 38405 263904 -17021 -22515 18506 -173146 -169154 -185240 -132267 35918 -114661 -290699
9245b90699l9047A28402a9718A37437k4609R9028a21631G7123a43790C07686b81440
$$ -290699 -329746 128402 -19718 137437 112828 211856 -121631 77123 -143790 307686 -281440
9233I7816c23907a1052j34715B08392f8144B90348d5981j59637a980l6353D2083
$$ 97816 -323907 -11052 -145767 208392 -68144 290348 -45981 -205618 -1980 -38333 42083
9221d7594B1682a89568c2780G5460b1879r1089A50467a86863n922m8367I7655
$$ -47594 21682 -189568 -32780 75460 -21879 -112968 150467 -186863 -192785 -241152 97655
9209G5805h6663A72029a69693C42036a00510H9656B4643a48457l4639P742B9595
$$ 75805 -86663 172029 -169693 342036 -100510 89656 24643 -148457 -183096 -175354 29595
9197h9975p2896j02027L6841A58109a65939P7164E2316b34004L5328o632a2247
$$ -89975 -162871 -264898 -228057 158109 -165939 -88775 52316 -234004 -198676 -205308 -12247
9185A12350g5090n6244A31230e369r8200k83107a02365d8786k3388a1348A46416
$$ 112350 -75090 -131334 131230 -5369 -103569 -386676 -102365 -48786 -72174 -11348 146416
9173a8667j00221a068n292A9208b67597G1691P0649b464m09665E3533B0703c57608
$$ -18667 -118888 -1068 -6360 19208 -267597 71691 142340 -2464 -412129 53533 20703 -357608
9160b95907J30126C34041r8432H0610a44297c293j40504B220J61763p7227i6970
$$ -295907 -165781 334041 235609 80610 -144297 -3293 -143797 2220 163983 86756 -96970
9148i3372q8625L6161O0235m88229J94402g5384A68284n2200a24763L8792M2278
$$ -93372 -181997 -145836 -85601 -573830 -379428 -75384 168284 116084 -124763 -85971 -43693
9137d3693k51384a39009b4915l29311e4577l474l03002d7788j4470D6463a32808
$$ -43693 -295077 -139009 -24915 -354226 -54577 -58051 -361053 -47788 -62258 46463 -132808
9125f4089r7680B6802M6121c58851O6269j52970J94891A93763D0858a5554A71355
$$ -64089 -161769 26802 72923 -358851 -292582 -445552 -250661 193763 40858 -15554 171355
9113a89087Q7787j08091r731d9202o4380m3078N4535E307i8307r7732r000O2839
$$ -189087 -101300 -209391 -219122 -49202 -113582 -156660 -102125 5307 -98307 -196039 -205039 -142200
9101a42200N4485C38336j66957P1207H16P686b79222K6111B04006D0859a99596
$$ -142200 -87715 338336 171379 242586 816 8502 -279222 -253111 204006 40859 -199596
9089b02753C40338F8031c55841f5702A59153d3490n659n731G0166A6148c24886
$$ -202753 340338 68031 -355841 -65702 159153 -43490 -49149 -54880 70166 16148 -324886
9077f0971h052q157j25760C7879J44974b29730B75980F1231M2687B9503J62574
$$ -60971 -8052 -16209 -141969 37879 182853 -229730 275980 61231 103918 29503 192077
9066A92077a17134k7547M5238M071p5890L8257O1437F8870a43288O836f6348F1791
$$ 192077 -117134 -144681 -99443 -95372 -171262 -133005 -71568 68870 -143288 -136452 -66348 61791
9053D10418a30538j26341h986q5945l3703A29336b52603a1188l48788E2805A1454
$$ 410418 -130538 -256879 -8986 -94931 -128634 129336 -252603 -11188 -359976 52805 11454
9041c91446a42176r9788j77006A3192a40553m5454i951D05123c16447F7673b73699
$$ -391446 -142176 -241964 -418970 13192 -140553 -186007 -9951 405123 -316447 67673 -273699
9029a8057G1012j9548c0970j43179F940e6722a0898H5202k319C2864J19674D3847
$$ -18057 71012 51464 -30970 -174149 6940 -56722 -10898 85202 82883 32864 152538 43847
9016D22808B5720c2369i477A57063a35658A84568a11415E0393d0549E774b31653
$$ 422808 25720 -32369 -9477 157063 -135658 184568 -111415 50393 -40549 5774 -231653
9004B28316A951K25564g2027Q243N401K8516l4772l6312M8665j35746B23210a4196
$$ 228316 1951 227515 -72027 -63784 -58383 -29867 -64639 -100951 -52286 -188032 223210 -14196
8991c04752H6026d82607b712A57895a12290q3531B6126a84937J5505M6032A94386
$$ -304752 86026 -482607 -2712 157895 -112290 -195821 26126 -184937 -169432 -123400 194386
8979a76726G3980p821h5203j4585J7378K9445A2374J16121a22424j23058a3498
$$ -176726 73980 66159 -85203 -99788 -82410 -52965 12374 128495 -122424 -245482 -13498
8967e59346L0572b13665E8453B0382i4390B89087J21211b63820c9835k03475J15071
$$ -559346 -528774 -213665 58453 20382 -94390 289087 410298 -263820 -39835 -243310 -128239
8956a28239K9191q9776b4425p9085G9038c6034A96748A9105e18650J46514a68401
$$ -128239 -99048 -188824 -24425 -103510 79038 -36034 196748 19105 -518650 -372136 -168401
8944A74526c21536f9920B02482a56481M6444J2509J4112B92617B7275M53451G18
$$ 174526 -321536 -69920 202482 -156481 -110037 -97528 -83416 292617 27275 480726 718
8932g9892B40595h398B25129d3917B21395c74496h2978D25013O40824J985692
$$ -79892 240595 -8398 225129 -43917 221395 -374496 -82978 425013 1065837 3051529
8922C051529N980274k927926A952431D98810k33778K64025A89290A8336K42195
$$ 3051529 9031803 6103877 1952431 498810 265032 529057 189290 18336 260531
8913B60531b15428O1805F9906A0439i2468C47229f2676F2367b14939r9111B12715
$$ 260531 -215428 -153623 69906 10439 -92468 347229 -62676 62367 -214939 -314050 212715
8901d0571k43705A2525a4225B49173D9398a22062k1633j38075i3308N958q8781
$$ -40571 -284276 12525 -14225 249173 49398 -122062 -143695 -281770 -93308 -87350 -176131
8890a76131k6896q4746i4637A86685n2557D2034b48126a20508n1133B2450K47201
$$ -176131 -203027 -287773 -94637 186685 134128 42034 -248126 -120508 -171641 22450 269651
8879B69651h3309q6624B11411a21500B6139a50146d1174l17578B08794J596b49880
$$ 269651 -83309 -169933 211411 -121500 26139 -150146 -41174 -358752 208794 210390 -249880
8867A51352g4289j37921i3505j06968A14233a83620a2192H5926m691b81654i9863
$$ 151352 -74289 -212210 -93505 -200473 114233 -183620 -12192 85926 81235 -281654 -99863
8855c26320J9350a10353c5504k43060B2219L4359L3969a40611L254d5798m5877
$$ -326320 -306970 -110353 -35504 -278564 22219 56578 90547 -140611 -137357 -45798 -91675
$$ [...]
##END NTUPLES=NMR SPECTRUM
##END=
