
##TITLE=AC1339_BRAAS10082_6528763_xx9DvZD7Ui
##JCAMPDX= 6.0         $$ Bruker NMR JCAMP-DX V2.0
##DATA TYPE= NMR SPECTRUM
##DATA CLASS= NTUPLES
##ORIGIN= BRUKER
##OWNER= Administrator
$$ 1.72 TOPSPIN		Version 2.1
$$ 2012-07-15 17:30:34.359 -0500  Administrator@TOPSPIN
$$ Compression mode = diff/dup
##.OBSERVE FREQUENCY= 400.02188249412
##.OBSERVE NUCLEUS= ^1H
##.ACQUISITION MODE= SIMULTANEOUS (DQD)
##.ACQUISITION SCHEME= undefined
##.AVERAGES= 64
##.DIGITISER RES= 22
##SPECTROMETER/DATA SYSTEM= spect
##.PULSE SEQUENCE= noesygpps1d.comp
##.SOLVENT NAME= COFFEE_meoh
##.SHIFT REFERENCE= INTERNAL, COFFEE_meoh, 1, 14.96079
##AUDIT TRAIL= $$ (NUMBER, WHEN, WHO, WHERE, PROCESS, VERSION, WHAT)
$$ ##TITLE= Audit trail, TOPSPIN		Version 2.1
$$ ##JCAMPDX= 5.01
$$ ##ORIGIN= Bruker BioSpin GmbH
$$ ##OWNER= Administrator
$$ $$ C:\Bruker\TOPSPIN/data/COFFEE/nmr/AC1339_BRAAS10082_6528763_xx9DvZD7Ui/12/pdata/1/auditp.txt
$$ ##AUDIT TRAIL=  $$ (NUMBER, WHEN, WHO, WHERE, PROCESS, VERSION, WHAT)
(   1,<2012-07-15 17:30:29.296 -0500>,<Administrator>,<TOPSPIN>,<go>,<TOPSPIN 2.1>,
      <created by zg
	started at 2012-07-15 17:18:59.093 -0500,
	POWCHK enabled, PULCHK disabled,
       configuration hash MD5:
       6B 1B 68 BB D9 2E 58 E2 7F 35 AD 54 07 DF 0E 41
       data hash MD5: 64K
       E2 06 D1 1C 0D 71 DC 40 65 1B 64 30 CF 72 79 BC>)
(   2,<2012-07-15 17:30:32.203 -0500>,<Administrator>,<TOPSPIN>,<proc1d>,<TOPSPIN 2.1>,
      <Start of raw data processing
       efp LB = 0.3 FT_mod = 6 PKNL = 1 PHC0 = 0 PHC1 = 0 SI = 128K 
       data hash MD5: 128K
       54 DC 47 24 A7 FA 50 37 32 3A 8C 1F 23 65 E7 74>)
(   3,<2012-07-15 17:30:33.328 -0500>,<Administrator>,<TOPSPIN>,<proc1d>,<TOPSPIN 2.1>,
      <pk PHC0 = -4.070435 PHC1 = 0 
       data hash MD5: 128K
       20 C0 17 74 44 48 CE 38 00 A6 FF F5 BA 51 37 A0>)
(   4,<2012-07-15 17:30:34.015 -0500>,<Administrator>,<TOPSPIN>,<proc1d>,<TOPSPIN 2.1>,
      <abs ABSG = 1 
       data hash MD5: 128K
       0C B8 D0 E1 D6 7D 1F A1 B6 3B 37 00 1F B9 F1 E4>)
(   5,<2012-07-15 17:30:34.093 -0500>,<Administrator>,<TOPSPIN>,<proc1d>,<TOPSPIN 2.1>,
      <abs ABSG = 2 
       data hash MD5: 128K
       D5 59 43 E4 77 E7 67 D2 C3 A8 D2 35 45 58 D4 0C>)
(   6,<2012-07-15 17:30:34.140 -0500>,<Administrator>,<TOPSPIN>,<proc1d>,<TOPSPIN 2.1>,
      <abs ABSG = 3 
       data hash MD5: 128K
       2F 75 F4 D1 AD B6 E0 4A 37 26 43 32 BC 80 B0 4A>)
(   7,<2012-07-15 17:30:34.203 -0500>,<Administrator>,<TOPSPIN>,<proc1d>,<TOPSPIN 2.1>,
      <abs ABSG = 4 
       data hash MD5: 128K
       B6 F1 24 66 52 FC C4 85 E0 1A AE 74 E2 6D EE 5F>)
(   8,<2012-07-15 17:30:34.265 -0500>,<Administrator>,<TOPSPIN>,<proc1d>,<TOPSPIN 2.1>,
      <abs ABSG = 5 
       data hash MD5: 128K
       1F EA F3 5D 3A 1E 31 CE E9 D5 45 01 D5 B1 C1 6B>)
$$ ##END=
$$ 
$$ $$ hash MD5
$$ $$ E1 CC 57 2D 51 A1 44 1C 58 D2 96 2D 97 35 03 5D
##$RELAX= 
##$RELAX= 
##$RELAX= 
##$RELAX= 
##$RELAX= 
##$RELAX= 
##$RELAX= 
##$RELAX= 
$$ Bruker specific parameters
$$ [...]
##$TP07= 0
##$TPNAME0= <>
##$TPNAME1= <>
##$TPNAME2= <>
##$TPNAME3= <>
##$TPNAME4= <>
##$TPNAME5= <>
##$TPNAME6= <>
##$TPNAME7= <>
##$TPOAL= (0..7)
0.5 0.5 0.5 0.5 0.5 0.5 0.5 0.5
##$TPOFFS= (0..7)
0 0 0 0 0 0 0 0
##$TUNHIN= 0
##$TUNHOUT= 0
##$TUNXOUT= 0
##$USERA1= <user>
##$USERA2= <user>
##$USERA3= <user>
##$USERA4= <user>
##$USERA5= <user>
##$V9= 5
##$VALIST= <valist>
##$VCLIST= <CCCCCCCCCCCCCCC>
##$VD= 0
##$VDLIST= <DDDDDDDDDDDDDDD>
##$VPLIST= <PPPPPPPPPPPPPPP>
##$VTLIST= <TTTTTTTTTTTTTTT>
##$WBST= 2048
##$WBSW= 25
##$XGAIN= (0..3)
0 0 0 0
##$XL= 0
##$YL= 0
##$YMAX_a= 11634398
##$YMIN_a= -9721053
##$ZGOPTNS= <>
##$ZL1= 120
##$ZL2= 120
##$ZL3= 120
##$ZL4= 120
##$ABSF1= 14.96079
##$ABSF2= -5.597392
##$ABSG= 5
##$ABSL= 3
##$ALPHA= 0
##$AQORDER= 0
##$ASSFAC= 0
##$ASSFACI= 0
##$ASSFACX= 0
##$ASSWID= 0
##$AUNMP= <proc_prof1d_extract.lims>
##$AXLEFT= 0
##$AXNAME= <>
##$AXNUC= <1H>
##$AXRIGHT= 0
##$AXTYPE= 0
##$AXUNIT= <>
##$AZFE= 0.1
##$AZFW= 0.1
##$BCFW= 0
##$BC_mod= 0
##$BYTORDP= 0
##$COROFFS= 0
##$CY= 15
##$DATMOD= 1
##$DC= 0
##$DFILT= <>
##$DTYPP= 0
##$F1P= 0
##$F2P= 0
##$FCOR= 0.5
##$FTSIZE= 131072
##$FT_mod= 6
##$GAMMA= 0
##$GB= 0
##$INTBC= 1
##$INTSCL= 1
##$ISEN= 128
##$LB= 0.3
##$LEV0= 0
##$LPBIN= 0
##$MAXI= 10000
##$MC2= 0
##$MEAN= 0
##$ME_mod= 0
##$MI= 0
##$NCOEF= 0
##$NC_proc= -2
##$NLEV= 6
##$NOISF1= 0
##$NOISF2= 0
##$NSP= 0
##$NTH_PI= 0
##$NZP= 0
##$OFFSET= 14.96079
##$PC= 1
##$PHC0= -4.070435
##$PHC1= 0
##$PH_mod= 1
##$PKNL= yes
##$PPARMOD= 0
##$PPDIAG= 0
##$PPIPTYP= 0
##$PPMPNUM= 2147483647
##$PPRESOL= 1
##$PSCAL= 4
##$PSIGN= 0
##$PYNMP= <proc.py>
##$REVERSE= no
##$SF= 400.020009722023
##$SI= 131072
##$SIGF1= 0
##$SIGF2= 0
##$SINO= 400
##$SIOLD= 131072
##$SPECTYP= <>
##$SREGLST= <1H.CDCl3>
##$SSB= 0
##$STSI= 131072
##$STSR= 0
##$SW_p= 8223.68421052631
##$SYMM= 0
##$S_DEV= 0
##$TDeff= 65536
##$TDoff= 0
##$TI= <>
##$TILT= no
##$TM1= 0
##$TM2= 0
##$TOPLEV= 0
##$USERP1= <user>
##$USERP2= <user>
##$USERP3= <user>
##$USERP4= <user>
##$USERP5= <user>
##$WDW= 1
##$XDIM= 131072
##$YMAX_p= 397653844
##$YMIN_p= -11662
##$CURPLOT= <Network HP LaserJet P1505>
##$CURPRIN= <$Network HP LaserJet P1505>
##$DFORMAT= <normdp>
##$LAYOUT= <+/1D_H.xwp>
##$LFORMAT= <normlp>
##$PFORMAT= <normpl>
##$SURQMSG= 1
$$ End of Bruker specific parameters
$$ ---------------------------------
##NTUPLES= NMR SPECTRUM
##VAR_NAME=  FREQUENCY,     SPECTRUM/REAL,   SPECTRUM/IMAG
##SYMBOL=    X,             R,               I
##VAR_TYPE=  INDEPENDENT,   DEPENDENT,       DEPENDENT
##VAR_FORM=  AFFN,          ASDF,            ASDF
##VAR_DIM=   131072,        131072,          131072
##UNITS=     HZ,            ARBITRARY UNITS, ARBITRARY UNITS
##FACTOR=    0.0627417313425164, 1,          1
##FIRST=     8223.62146879497, 2767,         -64759
##LAST=      0,             3850,            -64708
##MIN=       0,             -11662,          0
##MAX=       8223.62146879497, 397653844,    0
$$ Real data points
##PAGE= N=1
##DATA TABLE= (X++(R..R)), XYDATA
$$ [...]
67791 81494 80318 79528 78892 78201 77593 77492 78031 78695 78929 78910 79170 79623 79591 78866 78141 78191 79080 80346 81522
67772 81522 82268 82443 82307 82401 83021 84024 85239 86730 88554 90600 92793 95099 97250 98886 100091 101375
67756 101375 102921 104300 105113 105458 105469 104892 103535 101808 100371 99524 99211 99284 99390 98961 97846 96701 96273
67739 96273 96469 96618 96470 96426 96830 97511 98017 97947 97024 95292 93249 91476 90097 88851 87634 86565 85587
67722 85587 84396 82856 81106 79232 77206 75254 73908 73469 73664 74015 74335 74704 75125 75449 75543 75420 75200
67705 75200 74971 74637 73994 73096 72464 72670 73699 74994 76144 77196 78165 78628 78155 77029 76140 76131 76819 77539
67687 77539 77908 78130 78609 79381 79984 79901 79076 78015 77392 77594 78576 80018 81516 82711 83375 83520 83421 83415 83631
67668 83631 84002 84561 85496 86751 87771 87988 87495 86951 86810 86973 87181 87349 87433 87426 87634 88530 90019 91328 91882
67649 91882 91897 91725 91175 90147 89485 90272 92323 94225 94973 94865 94566 94086 93152 92070 91616 92240 93744 95568
67631 95568 97142 98106 98472 98512 98431 98345 98585 99569 101114 102291 102386 101820 101694 102524 103763 104509 104328 103400 102227
67612 102227 101331 100992 101066 101091 100631 99564 98158 96957 96428 96524 96634 96121 94939 93621 92734 92479 92717 93151
67594 93151 93443 93456 93433 93767 94418 94717 93956 92135 90022 88506 87998 88329 88964 89286 88958 88198 87574 87347 87201
67575 87201 86808 86463 86783 87859 89125 90121 90937 91757 92407 92679 92725 92755 92614 92082 91415 91113 91255 91491 91643
67556 91643 91915 92492 93302 94199 95049 95654 95869 95765 95385 94497 93064 91845 91840 93040 94354 94958 95145 95488
67538 95488 95827 95604 94801 93918 93207 92445 91438 90310 89241 88233 87280 86613 86669 87702 89329 90637 91036
67521 91036 90914 91055 91482 91461 90741 90070 90135 90672 91126 91590 92362 93081 93160 92854 93059 94066 95268 96163 96946
67502 96946 97929 99037 100078 100964 101410 100974 99728 98478 97872 97576 96717 94972 92911 91353 90695 90800 91257
67485 91257 91651 91755 91615 91507 91705 92128 92287 91837 91287 91754 93707 96233 97974 98607 98915 99617 100733 102052
67467 102052 103488 104757 105322 105065 104564 104399 104515 104595 104640 104782 104858 104637 104318 104387 105095 106400 108202 110239
67449 110239 111915 112760 112994 113155 113155 112289 110347 108206 106958 106836 107381 108377 110020 112221 114271 115460 115751
67432 115751 115624 115526 115663 116100 116707 117090 116894 116193 115348 114531 113747 113262 113487 114236 114591 113919 112657 111630
67414 111630 110880 109796 108277 107075 106740 106802 106416 105538 104991 105442 106654 107868 108713 109479 110461 111281 111213 110205
67396 110205 109157 108967 109608 110516 111497 112689 113817 114235 113902 113683 114341 115654 116849 117584 118114 118669 119080
67379 119080 118990 118254 117125 116163 115866 116309 117182 118075 118658 118691 118242 117848 118111 119059 120129 120822 121133 121378 121933
67360 121933 123058 124533 125468 125026 123416 121714 120635 120041 119705 119808 120391 121010 121376 121730 122185 122334 121982
67343 121982 121656 121845 122334 122892 123957 125824 127693 128486 128276 128045 128334 129019 130088 131570 132888 133400 133616
67326 133616 134852 137539 140792 143772 146443 148745 150088 150138 149331 148174 146796 145561 145204 145808 146380 146105
67310 146105 145400 145123 145354 145641 145938 146514 147260 147766 147908 147858 147753 147760 148219 149241 150475 151577 152561 153387 153767
67291 153767 153822 154289 155421 156317 156117 155333 155009 155003 154224 152378 150326 148664 147103 145528 144629 144946 145987
67274 145987 146858 147296 147637 148170 148943 149963 151300 153114 155594 158579 161315 163045 163914 164762 165968 167029
67258 167029 167423 167252 166807 166064 164987 163880 163044 162409 161859 161501 161347 161127 160784 160798 161592 162877 163933 164299
67240 164299 163910 162913 161740 161049 161145 161646 162045 162359 162847 163471 164100 165001 166515 168381 169907 170837 171548 172415
67222 172415 173388 174236 174820 175094 175148 175272 175627 175903 175636 174894 174268 174171 174471 174825 175065 175231 175577 176480 177968
67203 177968 179354 179896 179864 180351 181776 183191 183506 182934 182608 183033 183648 183898 184038 184558 185302 185659 185500 185461
67185 185461 186161 187427 188483 188771 188362 187637 186911 186404 186251 186313 186238 186000 186207 187450 189452 191228 192147 192430
67167 192430 192588 192740 192716 192490 192244 192169 192410 193031 193831 194395 194553 194676 195287 196478 197910 199267 200445 201368
67149 201368 201904 202039 201964 201923 202051 202330 202596 202665 202614 202876 203836 205308 206659 207534 208250 209285 210558 211468 211679
67130 211679 211582 211836 212598 213442 214011 214463 215131 216003 216826 217643 218814 220409 221903 222733 222948 222988 222993 222735 222298
67111 222298 222337 223348 224921 226121 226583 226846 227491 228332 228758 228620 228348 228243 228172 228126 228593 229951 231754 233103
67093 233103 233691 234039 234692 235601 236456 237213 238023 238926 239893 241026 242429 243978 245437 246752 248034 249291
67077 249291 250378 251209 251914 252782 254129 256078 258317 260187 261226 261659 262178 263224 264605 265802 266484 266723
67061 266723 266848 267205 267992 269272 271115 273583 276476 279196 281129 282248 283183 284543 286241 287620 288232
67046 288232 288378 288842 290156 292246 294650 296871 298476 299181 299138 299078 299839 301721 304499 307929 311859 315805
67030 315805 318927 320783 321809 322758 323863 324876 325731 326768 328369 330690 333687 337109 340483 343425 346000
67015 346000 348549 351195 353782 356250 358720 361203 363537 365692 367843 370047 372125 373958 375696 377594
67001 377594 379834 382568 385835 389431 393096 396839 400802 404787 408373 411563 414884 418653 422613 426583
66987 426583 430952 436095 441622 446727 451060 454831 458309 461780 465806 470844 476527 481905 486547 490965
66973 490965 495776 500914 505953 510825 515888 521502 527787 534555 541275 547339 552695 558052 564155 571016
66959 571016 578127 585274 592694 600485 608327 616021 623953 632701 642322 652264 662035 671764 682050 693280
66945 693280 705138 716828 727839 738487 749631 761896 775241 789215 803406 817582 831701
66934 831701 846060 861262 877713 895117 912782 930500 948837 968342 988737 1009193 1029305
66923 1029305 1049488 1070379 1092146 1114490 1137127 1160072 1183588 1208014 1233648 1260595 1288704
66912 1288704 1317637 1347054 1376797 1407016 1438152 1470623 1504437 1539133 1574251 1609814 1646267
66901 1646267 1684014 1723171 1763703 1805607 1848787 1892879 1937398 1982148 2027452 2073902 2121754
66890 2121754 2170467 2218865 2265971 2311819 2357460 2404063 2451975 2500572 2548855 2595952 2641183
66879 2641183 2684044 2724466 2762983 2800334 2836798 2872028 2905527 2937028 2966359 2993121 3016725
66868 3016725 3036690 3052821 3065204 3074153 3080006 3082769 3081991 3077132 3068025 3054839 3037772 3017064 2993244
66855 2993244 2966961 2938444 2907416 2873699 2837650 2799838 2760533 2719762 2677659 2634392 2589831
66844 2589831 2543681 2495997 2447256 2397847 2347862 2297601 2247901 2199512 2152202 2104954 2057161
66833 2057161 2009287 1962105 1915673 1869540 1823780 1779241 1736523 1695122 1653973 1612668 1571825
66822 1571825 1532393 1494882 1459198 1424794 1390971 1357322 1324095 1291979 1261490 1232646 1205119
66811 1205119 1178353 1151555 1124078 1096139 1068903 1043516 1020114 997880 975898 953728 931426
66800 931426 909381 888152 868128 849213 830899 812672 794353 776220 758899 742950 728295
66789 728295 714125 699603 684624 669716 655331 641555 628443 616211 604890 594006 582907
66778 582907 571425 560115 549738 540448 531538 522081 511885 501673 492259 483773 475864 468408 461621
66765 461621 455517 449636 443347 436218 428108 419244 410331 402176 394959 388084 380983 373916 367720 362805
66751 362805 358648 354383 349737 345302 341826 339302 336879 333709 329726 325441 321156 316717 312011 307263
66737 307263 302703 298280 293936 289922 286506 283535 280599 277528 274472 271539 268709 266106 264007 262367
66723 262367 260569 257859 254040 249623 245319 241491 238073 234912 232072 229759 227983 226347 224290 221559
66709 221559 218404 215234 212169 209120 206300 204352 203635 203515 202767 200851 198421 196327 194481 192149 189179
66694 189179 186359 184464 183448 182730 181835 180510 178622 176396 174472 173294 172496 171280 169386 167315 165632
66679 165632 164383 163300 162253 161329 160629 160135 159708 159087 158045 156580 154903 153217 151638 150292 149243
66664 149243 148262 146945 145260 143781 143122 143179 143202 142597 141458 140273 139355 138713 138295 138062 137805 137129 135838
66647 135838 134262 133027 132420 132108 131562 130673 129814 129308 129018 128498 127427 125831 123964 122133 120596 119441
66631 119441 118509 117545 116560 115985 116315 117525 118928 119649 119244 117904 116196 114695 113739 113321 113141 112811 112085
66614 112085 110879 109205 107226 105389 104247 103959 104052 103882 103341 102928 103111 103802 104579 105268 106018 106803 107126
66597 107126 106471 105001 103552 102809 102583 102027 100511 98205 95879 94313 93900 94523 95665 96699 97297 97546
66581 97546 97653 97667 97613 97753 98370 99246 99669 99191 98228 97625 97688 97862 97406 96116 94354 92600 91217 90453 90349
66562 90349 90600 90754 90686 90702 91068 91579 91744 91334 90574 89812 89218 88815 88616 88589 88585 88472 88305 88180 87915 87102 85666
66541 85666 84201 83456 83466 83505 83026 82361 82251 82898 83862 84791 85765 86836 87713 88140 88235 88168 87806 87015 86088 85420
66521 85420 84904 84091 82940 81958 81535 81531 81584 81422 80803 79560 77981 76795 76435 76562 76581 76366 76145 75896 75319
66502 75319 74428 73754 73861 74935 76826 79175 81312 82340 81682 79594 77002 74829 73508 73026 73214 73878
66486 73878 74759 75583 76214 76676 76877 76501 75412 74115 73514 74028 75187 76234 76902 77350 77573 77302 76422 75113
66468 75113 73510 71637 69842 68855 69073 69993 70726 70947 70976 71026 70882 70469 70269 70849 72158 73668 75020 76147
66450 76147 76856 76772 75905 74881 74316 74203 74195 74286 74839 75984 77374 78544 79229 79242 78416 76902 75364 74548 74659
66431 74659 75238 75659 75633 75248 74694 74090 73581 73458 73969 74968 75899 76265 76021 75442 74811 74422 74626 75505 76558
66412 76558 77100 76996 76669 76298 75420 73543 70944 68603 67468 67799 69079 70440 71362 71986 72620 73040 72695
66395 72695 71580 70425 69827 69682 69704 69954 70468 70850 70813 70805 71473 72646 73483 73558 73227 72917 72632 72232 71778 71468
66375 71468 71606 72615 74558 76607 77603 77387 77066 77642 78866 79805 80061 79854 79235 77996 76394 75313 75355
66358 75355 76056 76294 75357 73486 71552 70381 70317 71157 72344 73270 73520 73014 72032 71096 70663 70767 71007 71031
66340 71031 71019 71440 72304 72970 72964 72682 72858 73476 73800 73475 72988 72810 72664 72100 71346 71036 71371 72020 72669 73172
66320 73172 73328 73021 72504 72095 71657 70881 69997 69664 70130 70981 71777 72470 73166 73908 74728 75458 75553 74655 73344
66301 73344 72649 72695 72504 71383 69838 68777 68481 68826 69808 71194 72150 71961 70950 70058 69672 69373 68728 67825
66283 67825 67052 66756 67071 67793 68508 69082 69843 71047 72416 73530 74394 75236 75975 76366 76457 76451 76231 75522 74405
66264 74405 73288 72410 71790 71503 71607 71915 72261 72828 73736 74517 74657 74549 75131 76519 77668 77684 76831 75951
66246 75951 75407 75039 74735 74564 74544 74628 74840 75216 75675 76106 76428 76567 76516 76505 76807 77340 77697 77668 77482 77451 77597
66225 77597 77738 77689 77321 76667 76054 75869 76150 76651 77234 77850 78198 77898 77095 76364 75914 75430 74880 74806 75465 76253
66205 76253 76516 76380 76231 75877 75039 74376 75085 77364 79948 81384 81259 80051 78359 76644 75377 74908 75149
66188 75149 75642 75995 76156 76219 76130 75818 75634 76332 78240 80576 82068 82297 81980 81857 81879 81680 81230 80596 79621
66169 79621 78451 77853 78352 79408 80184 80745 81603 82365 82021 80689 79909 80730 82337 83189 82849 82093 81687 81704
66151 81704 81749 81362 80386 79338 79170 80315 82228 84134 85786 87122 87709 87329 86807 87403 89263 91162 92030
66134 92030 92165 92607 93670 94548 94290 92861 91132 89937 89349 88951 88620 88701 89429 90630 92154 94090 96211
66117 96211 97660 97793 97094 96657 96834 96982 96535 95714 95005 94475 93915 93325 92984 93234 94267 95896 97500 98466
66099 98466 98840 99275 100266 101701 103160 104303 104946 105134 105251 105640 106031 105832 105115 104737 105150 105683 105448 104518
66081 104518 103620 103061 102644 102439 102880 103953 104816 104497 102755 100288 98294 97721 98600 100131 101618 103156
66065 103156 105090 107072 108259 108381 108079 108098 108586 109202 109459 108895 107461 105894 105157 105299 105359 104673 103780 103667
66047 103667 104568 106023 107656 109307 110591 111045 110753 110333 110176 110104 109889 109716 109895 110387 110879 111202 111457 111782
66029 111782 112194 112662 113180 113721 114207 114656 115276 116276 117572 118854 119994 121188 122528 123697 124359 124679
66013 124679 125103 125738 126388 127156 128402 129960 131009 131165 131205 132206 134167 136105 137388 138482 140332 143440
65997 143440 147616 152262 156754 160815 164665 168711 173077 177519 181659 185070 187298 188274 188657 189297 190253
65982 190253 190762 190368 189585 189137 188932 188311 187027 185378 183368 180367 175944 170667 165727 161846 158842 156145
65966 156145 153435 150693 147960 145282 142831 140895 139685 139207 139259 139459 139351 138616 137277 135709 134491 134175
65950 134175 134937 136327 137524 138150 138740 140158 142596 145407 147946 150207 152564 155177 157835 160243 162336
65935 162336 164396 166847 169689 172280 174041 175269 176732 178424 179473 179586 179836 181427 184194 187018 189311
65920 189311 191351 193422 195525 197923 201184 205431 210134 214778 219307 223829 228352 232867 237256 241084
65906 241084 243981 246232 248386 250295 251297 251497 252015 253541 255386 256501 256844 257043 257198 256800 255591 253829
65890 253829 251782 249502 247067 244527 241594 237782 232899 227148 220884 214600 209004 204633 201297 198178
65876 198178 194539 190191 185435 180774 176580 172780 169027 165378 162548 161157 160953 161179 161421 161590 161383
65861 161383 160462 159141 158120 157401 156149 153886 151266 149297 148287 147899 147793 147798 147788 147907 148726 150655 153250
65844 153250 155463 156640 157049 157477 158548 160349 162412 163997 164595 164312 163753 163504 163759 164326 164923 165504 166388
65827 166388 167969 170315 173181 176485 180520 185553 191364 197444 203533 209765 216322 223124 229840 236057
65813 236057 241441 245826 249142 251174 251587 250376 248159 245712 243248 240364 236728 232571 228447 224720
65799 224720 221321 217897 214185 210421 207346 205509 204613 203838 202880 202222 202214 202398 202189 201913 202560 204603 207596
65782 207596 210992 214791 219124 223745 228428 233686 240593 249751 260673 272256 283692 294802 305581
65769 305581 315649 324306 331025 335649 337984 337473 333601 326522 316929 305391 292256 278295 264852
65756 264852 252999 242928 234568 228447 225417 225633 228350 232718 238372 245238 253285 262638 273555 286096
65742 286096 300023 315087 331158 348005 365238 382445 399034 413872 425563 433362 437479 438298
65730 438298 435669 429305 419498 407006 392457 376272 358972 341038 322535 303371 284059 265819
65718 265819 249741 235983 223876 212661 202081 192493 184480 178284 173535 169583 166060 163019 160589
65705 160589 158668 156958 155239 153605 152419 151889 151633 150910 149506 148170 147851 148617 149687 150462 151067 151837
65689 151837 152728 153538 154358 155458 156850 158279 159585 160818 161966 162898 163715 165016 167535 171441 176126
65674 176126 180843 185564 191043 198032 206639 216619 228131 241789 257868 275727 294290 313041 332341
65661 332341 352742 374139 395680 416323 435267 451961 466099 477826 487694 496047 502538 506546
65649 506546 508071 507882 506860 505556 504470 504210 505077 506748 508635 510297 511260 510851 508601 504538 498636
65634 498636 490200 478324 462889 444650 424464 402884 380439 357702 334926 312176 290018 269678
65622 269678 252210 237697 225401 214379 203891 193668 184113 176058 169972 165479 161756 158243 154890
65609 154890 151943 149637 147911 146339 144546 142740 141510 141011 140775 140448 140293 140610 141104 141282 141161 141043
65593 141043 140804 140032 138888 138222 138694 140180 142174 144388 146745 149137 151512 153979 156613 159374 162428
65578 162428 166310 171431 177578 184291 191678 200450 211126 223630 237870 254193 272817 293002 313367
65565 313367 333063 352200 371019 389052 405313 418976 429522 436513 439619 438828 434306 426115 414352
65552 414352 399501 382363 363641 343945 324154 305359 288199 272482 257627 243402 230117
65541 230117 218284 208198 199727 192434 185954 180310 175759 172365 169893 168129 167153 167198 168326 170239
65527 170239 172306 173844 174515 174423 173763 172532 170773 168847 167035 164975 161983 158009 153855 150322 147542
65512 147542 145296 143572 142522 142094 141944 141585 140558 138776 136749 135175 134200 133446 132834 132871 133890 135472
65496 135472 136955 138098 138948 139500 139952 140847 142450 144296 145911 147685 150445 154370 158948 163780 168700
65481 168700 173231 176761 179487 182441 186189 189979 192543 193392 192969 191843 190183 187934 185206 182346 179653
65466 179653 176989 173810 169739 165084 160525 156421 152690 149295 146349 143689 140893 138056 136122 135990
65452 135990 137409 139097 139908 139652 138887 138248 138060 138364 139066 140012 140995 141811 142429 143111 144283 146221 148825
65435 148825 151684 154372 156803 159308 162205 165265 167844 169685 171263 173060 174747 175499 174964 173481 171449
65420 171449 169008 166361 163828 161391 158712 155851 153501 152169 151486 150749 149860 149288 149364 150029 151175 152741
65404 152741 154452 155869 156773 157275 157534 157661 157963 158929 160764 163067 165136 166588 167649 168939 170986 173820
65388 173820 176958 179804 182112 184035 185745 187080 187548 186653 184274 180885 177388 174617 172899 172075 171802
65373 171802 171730 171492 170821 169800 168869 168471 168775 169775 171460 173743 176402 179302 182635 186708 191501 196603
65357 196603 201628 206456 211068 215503 220170 225896 233223 241771 250592 259107 267347 275326 282607 288622
65343 288622 293012 295493 295795 294065 291083 287698 284140 280126 275483 270371 264998 259421 253553 247148
65329 247148 239900 231845 223535 215523 207821 200311 193572 188707 186131 184952 183804 181971 179578 177058
65315 177058 174852 173370 172774 172770 172778 172326 171198 169352 166970 164497 162408 160838 159560 158316 157047 155830
65299 155830 154804 154233 154498 155801 157865 160080 162052 163965 166334 169476 173315 177535 181645 184897 186527
65284 186527 186347 184906 182883 180524 177838 175045 172448 170058 167758 165785 164593 164204 164044 163539 162619
65269 162619 161600 160877 160713 161020 161273 160951 160142 159463 159333 159654 160141 160574 160646 160117 159324 159128 160026 161618
65251 161618 163192 164526 165809 167047 167890 167961 167135 165649 164016 162605 161172 159159 156586 154246 152759
65236 152759 151841 150885 149863 149189 149027 149290 150059 151350 152553 152806 152098 151476 151875 153017 153663 152832 150652
65219 150652 148166 146359 145342 144542 143660 143145 143512 144492 145276 145388 144976 144390 143930 143871 144254 144687 144844 145120
65201 145120 146209 147971 149331 149485 148710 147708 146721 145736 145081 145148 145670 145821 145190 144245 143699 143655 143646 143472 143694
65182 143694 145031 147310 149399 150433 150810 151548 152863 154044 154776 155849 158146 161391 164376 166135 166459
65167 166459 165643 164321 163405 163562 164672 166176 167949 170232 172746 174508 174991 174960 175699 177608 180005 182150
65151 182150 184002 186023 188659 192126 196320 200758 204857 208547 212502 217633 224441 232907 242738 253469
65137 253469 264439 275034 285087 294892 304790 314764 324396 333124 340591 346897 352470 357598 362068
65124 362068 365391 367246 367582 366460 364160 361397 358929 356696 353639 348672 341718 333608 325138 316490
65110 316490 307524 298312 289222 280504 271911 262895 253293 243643 234606 226187 217889 209609 201926 195425
65096 195425 190151 185873 182365 179157 175597 171605 167956 165299 163282 161215 159240 158136 158195 159123 160954
65081 160954 164125 168381 172353 174653 174958 173872 172254 170984 170753 171536 172523 172903 172516 171599 170395 169317
65065 169317 168967 169451 170015 169854 169047 168202 167486 166636 165751 165399 165854 166841 168078 169524 170949 171823 172011 172127
65047 172127 172766 173645 173894 173059 171457 169647 167970 166654 165949 165887 165977 165422 163718 161055 158207 155991 154767
65030 154767 154337 154301 154412 154457 153921 152115 148941 145324 142500 140927 140216 140113 140964 142940 145269 146817 147246
65013 147246 147168 147226 147550 148080 148864 149844 150750 151495 152406 153919 156259 159497 163543 167910 171820 174858 177267
64996 177267 179375 181065 182134 182832 183541 184117 184049 183260 182252 181445 180857 180589 181159 183009 185902 189140 192270
64979 192270 195369 198691 202249 205743 208753 210950 212169 212297 211147 208607 204962 200942 197252 194064
64965 194064 191048 187867 184479 181025 177652 174528 171861 169726 168034 166773 166100 165927 165611 164473 162657
64950 162657 161067 160285 159970 159478 158666 157678 156377 154584 152736 151721 151949 153009 154262 155332 156006 156183
64934 156183 156157 156586 157847 159573 160943 161286 160409 158742 157250 156852 157690 159130 160495 161485 161888 161457 160314
64917 160314 159084 158305 158047 158268 159059 160240 161234 161794 162442 163713 165291 166501 167365 168529 170272 172226
64901 172226 174131 176321 179384 183609 188796 194370 199790 205134 211077 217951 225084 231578 237501 243698
64887 243698 250520 257401 263714 269387 274528 279042 282918 286479 290017 293401 296114 297507 297084 294921
64873 294921 291757 288213 283985 278327 271381 264392 258498 253898 250343 247705 245686 243666 241384 239374
64859 239374 238162 237367 236036 233651 230382 226627 222729 218937 215220 211257 206891 202338 197671 192472
64845 192472 186521 180634 176144 173543 172076 170764 169429 168581 168627 169350 170034 170021 169284 168479 168402 169321 170769
64828 170769 171883 172012 171309 170742 171193 172438 173379 173446 173313 173951 175487 177407 179450 181633 183711 185382
64812 185382 187019 189536 193427 198394 204064 210542 218043 226431 235326 244461 253708 262917 271835 280010
64798 280010 286707 291089 292596 291171 287256 281727 275579 269342 262858 255871 248695 242003 236146 231083
64784 231083 226848 223608 221323 219816 219128 219321 219927 220226 220158 220369 221233 222369 223381 224498 226166 228503
64768 228503 231510 235345 239961 244925 250056 255933 263228 271768 280700 289424 297883 306058 313652 320282
64754 320282 325702 329936 333437 336938 340801 344622 347845 350610 353595 357043 360322 362455 362798 361256
64740 361256 358224 354302 349730 344092 336846 328115 318649 309038 299396 289854 280927 273155 266699 261511
64726 261511 257643 255163 253848 253176 252579 251678 250397 248947 247655 246841 246905 248324 251253 255166 259247 263165
64710 263165 267216 271692 276473 281293 285945 289924 292288 292324 290280 287092 283437 279291 274313 268335 261429
64695 261429 253819 245959 238564 232361 227673 224264 221548 219000 216419 213963 211992 210810 210384 210272 209986
64680 209986 209531 209469 210281 211869 213829 216084 218994 222984 228329 235137 243107 251400 259254 266781 274698
64665 274698 283158 291366 298495 304336 308721 310993 310723 308505 305277 301053 295166 287746 280121 273475
64651 273475 267744 262248 256935 252440 249131 246622 244341 242309 241168 241486 243086 245271 247794 251408
64637 251408 257053 264551 272642 280532 289015 299643 312964 327915 342836 356702 369385 381076
64625 381076 391632 400314 406111 408454 407666 404588 399711 392807 383443 371641 357987 343353 328715
64612 328715 315035 302915 292298 282747 274133 266825 261050 256297 251658 246679 241614 236905 232788
64599 232788 229498 227425 226729 226893 227006 226530 225675 225029 224953 225358 225968 226759 228106 230390 233531 237091 240839
64582 240839 244959 249638 254889 261019 268783 278498 289275 299792 309755 319946 330814 341786 352186
64569 352186 362063 371562 380018 386350 390067 391310 390105 386281 380081 372224 363167 352777 340927 328058
64555 328058 314912 302000 289570 277908 267409 258417 251178 245855 242413 240472 239359 238420 237304
64542 237304 236082 235103 234732 235151 236279 237761 239123 240211 241518 243697 246486 248468 248300 246059 242922
64527 242922 239675 236149 232124 228058 224543 221571 218928 216963 216356 217106 218264 218828 218634 218298 218550 219699
64511 219699 221521 223464 225067 226280 227388 228630 230042 231660 233735 236622 240528 245376 250866 256699
64497 256699 262867 269740 277698 286617 295812 304601 312760 320294 326937 332090 335285 336472 335866 333711
64483 333711 330329 326251 322052 318087 314454 311204 308455 306296 304681 303415 302184 300622 298471 295681
64469 295681 292308 288369 284024 279844 276575 274516 273307 272523 272244 272862 274520 277045 280240 283866 287374
64454 287374 290064 291589 292109 291982 291629 291593 292233 293269 294149 295039 296900 300223 304232 307847 311013 314470
64438 314470 318584 323255 328804 335994 344973 355053 365992 378759 394462 413057 433857 457012
64426 457012 483721 515081 551437 593049 640742 695593 758392 829742 910398 1001024 1101636
64415 1101636 1211473 1329160 1452451 1577736 1700284 1815668 1921183 2015853 2099113 2169667
64405 2169667 2225530 2264671 2285296 2285979 2266385 2228094 2174142 2107251 2028612 1938460 1837467
64394 1837467 1727265 1610142 1488911 1366970 1247854 1134499 1029106 933457 848635 774361
64384 774361 709222 651913 601882 558717 521571 489693 462991 441403 423966 409124 395933
64373 395933 384400 374632 366219 358649 351877 346106 341166 336409 331176 325246 318800 312031 304905 297409
64359 297409 289924 283048 276934 271098 265228 259973 256508 255345 255862 257046 258435 260296 263111 266961
64345 266961 271282 275341 279078 283241 288327 293574 297447 299074 298661 296600 292895 287693 281758 275928
64331 275928 270518 265636 261735 259304 258248 257979 258058 258428 259135 260081 260960 261306 260820 259823 259090 258987 259131
64314 259131 259220 259684 261004 262778 264195 265139 266004 266518 265767 263598 261105 259210 257429 254579 250233 244885
64298 244885 239064 232951 226778 221003 216063 212253 209754 208362 207328 205964 204453 203642 203954 204951 206107
64283 206107 207532 209602 212299 215400 219080 223702 229017 234149 238645 243143 248597 255055 261614 267525
64269 267525 272976 278734 285261 292264 298856 304030 307180 308320 307797 305930 303142 300254 298107 296787
64255 296787 295713 294733 294583 295821 297686 298613 297653 294845 290429 284433 277064 268869 260329 251793 243939
64240 243939 237681 233317 230207 227571 225204 223151 221165 219016 217041 215880 215758 216407 217523 218926 220360
64225 220360 221535 222417 223236 224167 225179 226125 226834 227210 227398 227678 228043 228080 227480 226406 225073 223280 220833
64208 220833 218193 216136 214839 213871 213046 212680 212858 213189 213555 214488 216328 218495 220167 221314 222507 224010
64192 224010 225761 228063 231542 236298 241785 247741 254700 263281 273466 284872 297240 310184 322893
64179 322893 334611 345097 354020 360176 362170 359939 354847 348103 339753 329575 318250 306964 296302
64166 296302 286209 276828 268604 261563 255168 249110 243726 239305 235363 231056 226246 221848 219060 218311
64152 218311 218955 219906 220545 221021 221856 223421 225776 228658 231489 233750 235660 238215 242146 247002 251656
64137 251656 255472 258447 260416 260931 260069 258641 257220 255488 252917 249688 246538 244055 242485 241918 242228
64122 242228 243028 244017 245214 246623 248044 249553 251836 255577 260740 266892 273981 282216 291348 300717 310007
64107 310007 319368 328711 337458 345190 352069 358282 363461 367060 369171 370613 372213 374196 376306 378431
64093 378431 381024 384805 389973 395740 400711 403689 404187 402407 398918 394209 388305 380913 372065 362440
64079 362440 352808 343361 333893 324459 315445 307106 299494 292869 287665 283898 280967 278269 275797 273980
64065 273980 273128 273153 273657 274221 274718 275389 276480 277848 279162 280416 281936 283917 286271 288956 292076 295607
64049 295607 299418 303636 308608 314354 320464 326720 333458 341079 349582 358854 368939 379591 389934
64036 389934 399076 406901 413738 419381 422986 423993 422701 419777 415615 410402 404520 398600 393262 388930
64022 388930 385878 384278 384201 385546 387957 390844 393635 395978 397613 398105 396926 393876 389279 383616 377164
64007 377164 370147 363128 356928 352054 348426 345722 343735 342155 340325 337700 334562 331799 329886 328547
63993 328547 327609 327643 329315 332501 336607 341436 347045 352916 358108 362402 366591 371404 376734 382286 388281
63978 388281 395007 402130 409144 416301 424458 434033 444568 455334 465947 476389 486833 497628 509228
63965 509228 521966 535923 550918 566547 582458 598943 617158 638391 663028 690519 720422
63954 720422 753305 790566 833607 883308 940190 1004966 1078964 1163988 1261717 1373317 1499715
63943 1499715 1642008 1801209 1977475 2169744 2376137 2594469 2822363 3057261 3296562
63934 3296562 3537548 3776706 4009028 4228216 4427916 4602876 4749089 4863244 4942551 4985356
63924 4985356 4991557 4962055 4897789 4799609 4669068 4509024 4323505 4117389 3896336 3666388
63914 3666388 3432953 3200000 2970308 2746317 2530594 2325715 2133988 1957123 1795852
63905 1795852 1649963 1518934 1402461 1300156 1211034 1133692 1066889 1009597 960581 918415
63895 918415 881947 850402 822976 798724 776930 757260 739522 723603 709597 697503 686694
63884 686694 676232 666001 657081 650625 646771 645107 645818 649674 656994 667276 679985 695171 713062
63871 713062 733474 756071 780993 808828 839912 873914 910114 947855 986636 1025974 1065391
63860 1065391 1104448 1142642 1179295 1213771 1245792 1275278 1301780 1324341 1342155 1355095 1363263
63849 1363263 1366181 1362977 1353449 1338411 1318635 1293940 1263792 1228555 1189489 1147542 1102820 1055589
63837 1055589 1007220 959534 913327 868114 823357 779545 737849 699081 663280 630122 599316
63826 599316 570626 543825 518854 495926 475335 457154 441054 426420 412673 399587 387325
63815 387325 376157 366252 357711 350493 344078 337517 330267 322913 316582 311601 307204 302682 298254 294453
63801 294453 291173 287910 284726 282249 280708 279446 277581 274808 271392 267732 264169 261028 258473 256295
63787 256295 254018 251313 248328 245555 243384 241835 240781 240251 240264 240445 240222 239561 239080 239191 239456 239169 238293
63770 238293 237322 236423 235277 233723 232007 230373 228893 227769 227230 226989 226359 225169 224061 223578 223426 223058
63754 223058 222549 222334 222391 222348 222271 222706 223830 225106 225998 226653 227568 228859 230169 231218 232192 233584 235775
63737 235775 238729 241916 244530 246007 246564 247181 248811 251517 254525 257212 259838 263106 267217 271737 276304
63722 276304 281019 285990 290979 295747 300449 305299 310102 314510 318612 322810 327053 330561 332459 332513 331175
63707 331175 329094 326591 323425 319075 313515 307768 303366 301076 300364 300237 300323 300833 301796 302890 303994 305444
63691 305444 307535 310121 312930 315945 319238 322686 326230 330124 334420 338306 340649 341369 341761 343078 345181
63676 345181 346962 347764 347840 347641 347313 347024 347227 348271 350017 352037 354058 356054 358084 360159 362106 363398
63660 363398 363329 361620 358845 356045 353792 351623 348419 343404 336833 329711 322855 316389 310209 304672 300454
63645 300454 297809 296270 295144 294068 293072 292420 292496 293557 295442 297748 300362 303581 307571 311971 316234
63630 316234 320215 324265 328911 334526 341070 348013 354740 361207 368004 375634 383978 392699 401979 412472
63616 412472 424641 438366 453192 468786 485236 503034 522714 544448 568057 593432 620625
63605 620625 649385 678901 708212 736708 764011 789624 812941 833352 850079 862192 869199 871446
63593 871446 869697 864642 857208 848925 841152 833897 825954 816244 804449 790367 773482 753657 731767
63580 731767 709127 686462 663764 640953 618396 596908 577494 560936 547432 536635 528144 521806
63568 521806 517538 515114 514326 515156 517624 521578 526837 533359 541074 549646 558612 567690 576848 586206 596009
63553 596009 606660 618605 632203 647797 665821 686779 711094 738957 770239 804650 842214
63542 842214 883387 928076 974180 1017386 1052868 1077369 1089958 1091587 1084570 1072100 1057312 1042288
63530 1042288 1027969 1014864 1003410 993562 984485 974877 963450 949070 930837 908365 881851 851724
63518 851724 818400 782597 745670 709233 674402 641557 610816 582502 557050 534642 515062
63507 515062 497808 482302 468085 455012 443284 433220 424873 417802 411191 404328 397153 390421 385135
63494 385135 381593 379014 376296 373157 370324 368563 367821 367555 367615 368344 369801 371408 372686 374051 376467
63479 376467 380316 384879 389031 392301 395193 398554 402709 407104 410713 412861 413728 414074 414403 414370 413012
63464 413012 409652 404650 399260 394615 390794 386945 382348 377202 372332 368387 365515 363650 362737 362670 363335
63449 363335 364800 367249 370639 374676 379270 384689 391054 397966 405057 412847 422607 435268 450710 468271
63435 468271 487713 509522 534420 562849 594923 630565 669280 709477 748028 780940 805088
63424 805088 819623 825883 826193 822980 818732 816017 817018 823067 834687 851792 873764 899677 928808
63411 928808 960695 994366 1027690 1057900 1082771 1101133 1112533 1117014 1115362 1109167 1100345 1090574
63399 1090574 1080954 1071743 1062157 1050719 1036116 1017847 996159 971516 944149 913956 880916 845724
63387 845724 809854 774720 740866 708343 677726 650196 626498 606289 588728 573323 560009
63376 560009 548794 539656 532549 527353 524050 523107 525173 530111 536739 543949 551791 561121 572577 586320
63362 586320 602406 620748 640950 662809 686856 713745 743152 773976 805728 839052 874576
63351 874576 911721 948892 984462 1017255 1046435 1071277 1090970 1104497 1110949 1110297 1103857 1093896
63339 1093896 1082703 1071768 1061404 1050970 1039604 1026738 1011834 993893 971820 945409 915627
63328 915627 883811 850994 818144 786528 757357 731302 708683 689941 675510 665292 658586 654670
63316 654670 653151 653548 654426 653101 646524 632929 612898 588842 563451 538609 515372 494338 475808
63303 475808 459828 446273 434792 424740 415490 406858 399011 391972 385519 379625 374527 370303 366721
63290 366721 363624 361009 358627 356019 353179 350607 348401 345901 342743 339729 337956 337366 336878 335794 334447
63275 334447 333511 333284 333647 334209 334422 334046 333563 333693 334487 335305 335756 336155 336942 338111 339419 340847 342627
63258 342627 345024 348146 351698 354991 357613 360159 363772 368741 374102 378927 383547 388972 395470 402393
63244 402393 409313 416690 425184 434803 445077 455894 467783 481338 496653 513437 531546 551099
63232 551099 572069 593982 616179 638290 660321 682445 704865 727763 751152 774794 798370
63221 798370 821688 844622 867129 889547 912594 936585 960731 983704 1004861 1024325 1041785
63210 1041785 1055872 1065102 1068947 1067630 1061312 1050012 1034034 1013847 989652 961633 930662 898287
63198 898287 865910 834334 804193 776370 751693 730480 712695 698418 687910 681256 678207 678421
63186 678421 681763 688260 697880 710440 725658 743086 761921 781149 800206 819490 839852 861440
63174 861440 883278 904195 923933 943097 962208 981092 999060 1015243 1028768 1039032 1045988 1049833
63162 1049833 1050270 1046319 1037047 1022264 1002343 977728 949009 917263 883820 849586 814948 780419
63150 780419 747003 715656 686543 659150 633135 608979 587757 570282 556356 544837 534561
63139 534561 525221 517176 510472 504429 498435 492787 488293 485207 482983 480989 478980 476844 474466 472121
63125 472121 470586 470462 471650 473733 476558 480110 484047 487806 491086 493944 496582 499369 502908 507515
63111 507515 512604 516972 519850 521498 522853 524820 527771 531274 534313 536168 537142 538082 539244 540229 541023
63096 541023 542357 544624 547053 548502 548737 548455 548380 548833 549927 551518 552993 553648 553437 552996 552943 553486 554676
63079 554676 556619 559328 562700 566740 571559 577099 583140 589643 596759 604418 612215 619920 627926 637050
63065 637050 647998 661028 675861 691852 708557 726354 746324 769343 795437 824099 854976
63054 854976 888057 923498 961625 1002998 1048076 1096743 1148334 1202106 1257466 1313834 1370648
63043 1370648 1427655 1484999 1542823 1600903 1658787 1716220 1773316 1830409 1887906 1946148 2005081
63032 2005081 2063818 2120648 2173665 2221453 2263054 2297322 2322506 2336570 2337891 2325649 2299826
63021 2299826 2261127 2210926 2151130 2083877 2011270 1935291 1857948 1781441 1708059 1639689 1577395
63010 1577395 1521682 1473206 1432864 1401024 1377059 1360100 1350044 1347316 1351746 1362222 1377523 1397003
62998 1397003 1420299 1446937 1476528 1508940 1543823 1580196 1616893 1653305 1689466 1725582 1761683
62987 1761683 1797437 1831951 1863948 1892413 1916826 1936441 1949681 1954835 1951166 1938822 1917835 1887928
62975 1887928 1849344 1803126 1750334 1691617 1627874 1560805 1492381 1424102 1357102 1292548 1231456
62964 1231456 1174382 1121679 1073841 1031100 992856 957995 925722 895795 868045 842142 817852
62953 817852 795147 773989 754230 735718 718233 701331 684545 667756 651208 635230 620132
62942 620132 606180 593277 580867 568616 557104 547250 539015 531345 523576 516205 509946 504681 499902
62929 499902 495642 492174 489105 485640 481760 478396 476245 475002 473944 472699 471099 468866 466021 463297
62915 463297 461540 460728 460073 459067 457962 457069 456104 454564 452480 450339 448386 446439 444410 442582 441203
62900 441203 440144 439193 438430 437970 437537 436732 435665 434910 434775 434980 435169 435369 435715 436095 436374 436732 437424 438293
62882 438293 438882 438923 438486 437736 436919 436555 437183 438754 440519 441699 442110 442081 441964 441872 441685 441147 440026 438356
62864 438356 436504 434926 433887 433385 433209 433030 432601 431958 431329 430791 430236 429690 429454 429730 430322 430980 431837 433227
62846 433227 435056 436735 437801 438396 438978 439792 440777 441807 442823 443748 444443 444811 444876 444829 445001 445637 446558 447199
62828 447199 447233 447070 447498 448798 450533 452253 454026 456072 458258 460411 462877 466242 470448 474696 478372
62813 478372 481637 484874 488007 490799 493592 497214 502129 507999 514179 520435 527098 534599 542907 551419
62799 551419 559523 567342 575735 585426 596348 608098 620766 634877 650653 667870 686597 707642
62787 707642 732014 760152 791882 826977 865613 908459 956420 1010194 1069970 1135669 1207383
62776 1207383 1285280 1369026 1457606 1549784 1644349 1739687 1833498 1923249 2006708 2081747 2146003
62765 2146003 2197212 2233819 2254906 2259711 2247761 2219541 2176605 2120942 2054546 1979589 1898406
62754 1898406 1812953 1724555 1634549 1544920 1457928 1375106 1296919 1223300 1154155 1089377 1028827
62743 1028827 972641 921339 875349 834431 797805 764816 735254 709063 686059 666035 648819
62732 648819 633986 620763 608580 597568 588171 580326 573455 567272 562150 558504 556230 554983 554622
62719 554622 555065 556034 557444 559936 564585 571971 581768 593126 605258 617865 631412 646988 665528
62706 665528 687155 711554 738879 769847 804959 844183 887544 935493 988383 1045976 1107835
62695 1107835 1173876 1244096 1317947 1394362 1472197 1550209 1626660 1699450 1766662 1826631 1877383
62684 1877383 1916476 1941796 1952441 1948747 1931586 1901782 1860010 1807079 1744290 1673646 1597737
62673 1597737 1519289 1440649 1363424 1288381 1215736 1145794 1079405 1017675 961147 909498 862139
62662 862139 818921 779987 745110 713565 684783 658823 635966 615976 598043 581504 566405
62651 566405 553216 542061 532379 523307 514244 505048 495902 487213 479500 473071 467712 462863 458257 454256
62637 454256 451428 449899 449268 449069 449050 449077 449060 449119 449561 450477 451423 451705 451009 449696 448487 447861 447653 447187 445916
62618 445916 444089 442731 442816 444481 447093 450008 453117 456681 460878 465628 470824 476663 483678 492373 502733
62603 502733 514206 526250 538920 552849 568707 586765 606954 629305 654303 682790 715309
62592 715309 751508 790425 831469 874781 920378 967208 1013461 1057544 1098231 1134014 1163054
62581 1163054 1184041 1196650 1201016 1197250 1185646 1166764 1141000 1108639 1070834 1029979 988445 947183
62569 947183 906086 865339 825628 787279 750218 714966 682808 654550 629728 607448 587501
62558 587501 570052 554689 540492 527089 515102 505403 498211 492991 488924 485213 481090 475989 470002
62545 470002 464111 459591 456952 455567 454487 453447 452888 453198 454329 456072 458297 460828 463458 466133 468846
62530 468846 471307 473160 474626 476550 479589 483761 488999 495719 504476 515403 528374 543452 560798
62517 560798 580367 602192 626760 654625 685720 719528 755829 794813 836417 880046 924971
62506 924971 970485 1015485 1058379 1097735 1132659 1162306 1185369 1200561 1207591 1207313 1200948 1189334
62494 1189334 1172915 1152202 1128134 1102089 1075661 1050400 1027748 1009043 995305 986858 983275 983991
62482 983991 989062 999205 1014995 1036059 1061145 1088939 1118703 1150049 1182200 1213603 1242213 1266055
62470 1266055 1283617 1294031 1297079 1292884 1281442 1262498 1235872 1201795 1160968 1114639 1064762 1013591
62458 1013591 962653 912220 862137 813011 766225 723014 684013 649599 620004 594855 573166
62447 573166 554072 537347 523082 511308 502078 495460 491062 487973 485494 483611 482426 481539 480493
62434 480493 479486 479040 479119 479188 479042 478952 478937 478451 476896 474022 469704 463905 457141 450526 444982 440616 437036
62417 437036 433988 431351 428778 425759 422072 417978 414008 410616 407922 405708 403725 401971 400482 398972
62403 398972 397084 395055 393636 393109 392843 392162 391223 390601 390412 390479 391160 393221 396784 400968 404777 407913
62387 407913 410594 413021 415324 417687 420258 423113 426500 430896 436607 443458 451015 458924 466970 475084
62373 475084 483486 492544 502277 512280 522412 533266 545519 559008 572988 587340 603016 621094
62361 621094 641739 664489 689382 717439 749888 787100 828450 873177 921077 972188 1025985
62350 1025985 1081220 1136546 1190862 1242796 1290253 1330993 1363676 1388052 1404207 1412019 1411397 1402666
62338 1402666 1386480 1363627 1335085 1302094 1265868 1227220 1186547 1144146 1100573 1056841 1014356
62327 1014356 974463 937869 904534 874188 846767 822175 799800 778616 757856 737419 717520
62316 717520 698123 678842 659296 639370 619170 598944 579217 560828 544571 530665 518678
62305 518678 508028 498516 490327 483649 478379 474099 470218 466236 462095 458283 455451 453886 453406 453746
62291 453746 454824 456627 458956 461443 463797 466066 468641 471857 475492 478865 481673 484543 488373 493135
62277 493135 497795 501514 504475 507328 510300 513291 516525 520515 525489 531311 537987 545887 555390 566656
62263 566656 579753 594736 611627 630734 653058 679945 712105 749262 790906 836994 887601
62252 887601 942234 999918 1059726 1120706 1181269 1239157 1292189 1338792 1377763 1407922 1428365
62241 1428365 1438868 1439709 1431205 1413741 1388225 1356053 1318325 1275323 1227072 1174391 1119004 1062640
62229 1062640 1006352 950935 897594 847741 802240 761222 724622 692464 664550 640292 619116
62218 619116 600710 584647 570105 556332 543263 531299 520599 510940 502172 494350 487391 481012
62206 481012 475168 470215 466432 463606 461293 459289 457651 456468 455857 456024 457135 459124 461791 464965 468493
62191 468493 472281 476537 481844 488753 497382 507591 519301 532284 545808 558990 571614 584238
62179 584238 597340 610644 623379 634850 644614 652468 658671 664058 669672 676351 684799 695803 710071
62166 710071 728044 750196 777361 810287 848783 891644 937466 985243 1034135 1083062 1130743
62155 1130743 1175781 1216481 1250896 1277499 1295761 1305921 1308380 1303594 1292279 1275206 1252797 1225302
62143 1225302 1193311 1157616 1118550 1076146 1031343 986537 944388 906228 872044 841683 815366
62132 815366 793041 774047 757837 744613 734834 728405 724733 723306 723772 725632 728456 732536 738810
62119 738810 747839 759105 771609 784899 799074 813718 827204 837413 843189 844963 843998 841277 837278
62106 837278 832505 827698 823296 819021 814229 808510 801789 794205 786268 778963 773199 769223 766951 766757
62092 766757 769338 774650 781588 788995 796559 804398 812296 819894 827328 835062 843234 851740 860920 871577
62078 871577 884203 898682 914922 933248 953856 976228 999526 1023349 1047700 1072309 1096424
62067 1096424 1119421 1141370 1162868 1184462 1206361 1228587 1251204 1274339 1298086 1322382 1346860
62056 1346860 1370743 1392980 1412620 1429067 1441940 1450789 1455119 1454674 1449469 1439501 1424566 1404426
62044 1404426 1379001 1348420 1313097 1273801 1231398 1186487 1139571 1091689 1044431 999042 955867
62033 955867 914924 876638 841546 809685 780886 755403 733516 714633 697569 681840 667878
62022 667878 655804 644781 633995 623567 613856 604483 594795 584938 575690 567329 559427 551795 544928
62009 544928 539315 534842 531163 528271 526447 525917 526835 529377 533589 539234 545993 553663 562034 570704 579206
61994 579206 587202 594339 600010 603564 604772 603915 601358 597300 591980 585838 579191 571862 563467 554058
61980 554058 544232 534577 525298 516499 508451 501279 494591 487798 480786 473975 467775 462272 457450 453397
61966 453397 450186 447735 445868 444337 442792 441027 439296 438129 437747 437876 438170 438500 438763 438808 438795 439298 440771
61949 440771 443193 446453 450777 456425 463210 470747 479006 488272 498727 510502 524069 540023 558375
61936 558375 578420 599435 621152 643441 665902 688024 709444 729814 748664 765765 781449
61925 781449 796070 809064 818984 824822 827031 826911 825067 820930 813840 804138 793034 781862 771888
61912 771888 764372 760088 758828 759973 763646 770744 781766 796127 812764 830791 849351 867472 884539
61899 884539 900432 914683 925896 932532 933983 930526 922651 910986 896506 880142 862345 843520
61887 843520 824500 805960 787648 769034 750519 733155 717242 702151 687578 673970 661393
61876 661393 648982 636097 623272 611344 600211 589163 578162 568126 560021 554116 550036 547227
61864 547227 545479 545227 547193 551580 557892 565685 575063 586102 598315 611263 625515 642407 662854
61851 662854 686871 714110 744331 777125 811623 846822 882185 917700 953320 988352 1021457
61840 1021457 1051308 1077116 1098348 1114131 1123432 1125976 1122587 1114451 1102410 1087276 1070422 1053637
61828 1053637 1038528 1026327 1017981 1014014 1014422 1019018 1027678 1039916 1054454 1069655 1084243 1097193
61816 1097193 1107124 1112391 1111815 1104846 1091082 1070241 1042821 1010292 974360 936309 897215 858352
61804 858352 820961 785818 753249 723455 696557 672423 650691 630975 612971 596442 581297
61793 581297 567656 555742 545580 536781 528654 520628 512705 505448 499366 494365 489928 485751 482048
61780 482048 479206 477293 475919 474473 472493 470013 467554 465726 464793 464636 465030 465799 466860 468278 470230
61765 470230 472663 475158 477356 479506 482319 486270 491233 496722 502168 507092 511382 515451 519742 524076
61751 524076 527841 530858 533537 536113 538204 539379 539630 538979 537135 534061 530493 527342 524788 522482 520375
61736 520375 518741 517495 516170 514675 513539 513253 513763 514717 515785 516683 517340 518175 519756 522004 524249 526281
61720 526281 528785 532341 536508 540496 544323 548642 553608 558598 563041 566861 570036 572299 573465 573608
61706 573608 572700 570516 567084 562850 558151 552884 546954 540724 534715 529162 524105 519573 515327 510794
61692 510794 505762 500924 497163 494421 491828 488908 486018 483447 480709 477188 473152 469645 467428 466299
61678 466299 465515 464656 463958 463825 464161 464368 464024 463280 462408 461270 459634 457801 456382 455414 454261 452579 450916
61661 450916 450039 449996 450175 450115 449957 450249 451477 453661 456261 458648 460793 463240 466274 469436 472101 474237
61645 474237 476267 478431 480619 482657 484449 486004 487633 489858 492765 495620 497549 498428 498658 498265 496869
61630 496869 494471 491624 488677 485461 481969 478764 476283 474200 471948 469618 467858 466988 466641 466310 465954
61615 465954 465994 466869 468560 470457 471684 471679 470459 468333 465513 462041 457886 452935 447094 440520 433665 426942
61599 426942 420538 414704 409898 406293 403308 400018 395995 391492 386860 382194 377529 372978 368612 364552
61585 364552 361173 358741 356736 354081 350408 346596 343611 341227 338519 335325 332450 330456 329022 327699
61571 327699 326561 325734 324829 323390 321602 320053 318950 317947 316697 315205 313740 312635 312028 311576 310629
61556 310629 309007 307408 306703 307029 307923 309098 310505 311816 312528 312704 313000 313779 314665 315125 315021 314459 313655
61539 313655 313239 314154 316798 320565 324547 328336 331895 335081 337804 340279 342579 344112 344123 342714 340911
61524 340911 339695 339215 338875 337874 335695 332386 328494 324612 321066 318070 315897 314617 313882 313227 312435
61509 312435 311407 309989 308334 307156 307105 307950 308751 308807 308124 307090 306080 305278 304510 303336 301717 300428
61493 300428 300313 301206 302084 302284 302038 301792 301571 301237 300866 300595 300373 300104 299793 299422 298979 298692 298919 299647 300399
61474 300399 300812 301105 301844 303363 305477 307559 308931 309390 309321 309102 308602 307649 306766 306810 307895 309257 310259
61457 310259 310913 311267 311026 310199 309515 309653 310404 311098 311580 312311 313680 315622 317759 319613 320814 321427 321964
61440 321964 322892 324267 325992 328109 330584 333095 335374 337555 339948 342702 345982 350040 354691 358949
61426 358949 361720 362793 362825 362535 362327 362451 362914 363277 363152 363036 364099 366864 370483 373574 375476 376392 376655
61409 376655 376346 375626 374958 374755 374859 374604 373436 371405 368941 366234 363006 359009 354553 350376 346962 344197
61393 344197 341799 339965 339286 339908 341015 341512 341159 340681 340690 340985 341143 341269 341652 342091 342290 342646 343873 345903
61375 345903 347982 349892 352139 354777 357041 358576 360101 362196 364284 365718 367119 369511 372569 374919
61361 374919 376150 377425 379947 383747 388190 392809 397218 400988 404200 407755 412599 418872 426070 433783
61347 433783 441939 450600 459809 469508 479322 488538 496496 502989 508235 512583 516295 519450 522018 524147
61333 524147 526331 529026 532057 534730 536566 537583 537715 536420 533268 528736 523967 519748 516001 512316
61319 512316 508648 505330 502582 500294 498335 496917 496462 497103 498476 500119 502033 504735 508785 514341 521180
61304 521180 529084 538131 548524 560089 572041 583355 593358 601771 608245 612197 613286 611806 608387
61291 608387 603463 597182 589684 581314 572646 564451 557420 551701 546809 542156 537564 533283 529779 527601
61277 527601 527074 527830 528992 530103 531599 534025 537196 540664 544670 549927 556538 563793 571053 578223 585252
61262 585252 591782 597618 603175 609203 616287 624699 634422 645143 656448 668037 679470 689763 697755
61249 697755 703128 706746 709739 712455 714400 714957 713979 711874 709169 705863 701256 694754 686818 678749 671522
61234 671522 665236 659692 654875 650604 646312 641683 637179 633518 630879 629032 627948 627815 628566 629863 631537
61219 631537 633613 635897 637869 639147 639828 640347 641228 642967 645875 649772 653942 657548 660150 661809 662844
61204 662844 663613 664465 665711 667521 669884 672713 676008 679965 685062 692051 701520 713240 726191 739725
61190 739725 754593 772149 792339 813105 832167 848838 863555 876233 886107 893117 898474 903500
61178 903500 908429 912647 915687 917639 918879 919650 919774 918706 916056 912124 907634 902932 897682 891415 883997
61163 883997 875466 865720 854590 842065 828431 814329 800585 787680 775363 763068 750681 738677
61151 738677 727666 718192 710772 705524 701734 698400 695367 693364 692733 692556 691261 687710 681600 673315
61137 673315 663681 653484 643034 632467 622502 614363 608703 605072 602627 600970 600142 600359 602051 605707
61123 605707 611323 618380 626591 636297 647885 661259 676127 692417 710205 729642 751087 774770
61111 774770 800158 826234 852592 879563 907076 934253 960534 986289 1011648 1035603 1057117
61100 1057117 1076409 1094145 1109861 1122209 1130467 1134810 1135321 1131767 1124394 1114004 1101015 1085068
61088 1085068 1065845 1043898 1020540 997114 974282 951779 929032 906169 884066 863234 843298
61077 843298 823953 805755 789257 774001 759177 744889 731849 720247 709898 701247 695109 691373
61065 691373 688900 686801 685085 684019 683624 683954 685202 687412 690516 694581 699498 704715 709974 716096 724221
61050 724221 734401 745741 757812 771050 785840 802083 819735 838966 859757 882043 906162
61039 906162 932404 960343 989499 1020369 1053749 1089241 1125685 1163020 1202363 1244203 1287913
61028 1287913 1333279 1381072 1431689 1484511 1539025 1595275 1652812 1710667 1769087 1830112 1895854
61017 1895854 1967497 2046461 2134964 2234540 2345389 2468151 2605123 2759397 2934935 3138975
61007 3138975 3383009 3680719 4047219 4501657 5067753 5769138 6625341 7652014 8858633
60998 8858633 10241191 11783635 13475000 15315732 17279956 19254203 21027442 22375033
60990 22375033 23178854 23478539 23420428 23174266 22894376 22715314 22719572 22870101 22981995 22794898
60980 22794898 22107410 20870349 19181189 17213764 15150593 13146646 11312728 9707361
60972 9707361 8341673 7197686 6247189 5460689 4809682 4268923 3818396 3442129 3125929
60963 3125929 2857366 2626787 2426719 2250638 2093256 1951477 1823922 1709594 1607436
60954 1607436 1516615 1436414 1365952 1304272 1250327 1202640 1159564 1120105 1083837 1049758 1016197
60943 1016197 982322 948936 917145 887087 858630 832412 809107 788173 768308 748804 729646
60932 729646 710696 691823 673655 657200 642640 629149 615944 602935 590406 578690 568168
60921 568168 559038 550984 543465 536322 529774 523915 518630 513956 510139 507358 505599 504689 504227 503790 503446
60906 503446 503703 504618 505391 505364 504975 505129 505975 507000 507994 509070 509891 509751 508524 506852 505326 504069 503025
60889 503025 501922 499964 496385 491586 486932 483174 479668 475474 470586 465621 460879 456248 451746 447641
60875 447641 444152 441345 439245 437891 437357 437684 438579 439347 439573 439842 441266 444226 448163 452674 458033 464351
60859 464351 470980 477413 484125 491766 499847 507013 512577 517156 521795 527000 532659 538434 543990 549080
60845 549080 553551 557251 560017 561894 563184 564063 564330 563750 562497 560877 558773 555765 551824 547544 543591
60830 543591 540111 536696 532811 528290 523622 519675 516992 515390 514370 513720 513488 513606 513918 514503 515583
60815 515583 517153 519054 521437 524749 529185 534446 540145 546167 552544 559264 566364 573986 582196 590999
60801 590999 600602 611434 623708 637151 651352 666221 681949 698625 716111 734174 752615 771260
60789 771260 789947 808534 826914 845029 862824 880075 896392 911577 925894 939651 952481
60778 952481 963346 971356 976325 978489 978106 975538 971298 965612 958167 948648 937347 924901 911658
60765 911658 897708 883285 868590 853326 837084 820270 804005 788810 773953 758468 742309
60754 742309 725994 709533 692459 674864 657710 641906 627534 614177 601654 590096 579614
60743 579614 570214 561962 554882 548657 542616 536058 528533 519951 510609 501085 491861 483027 474524 466668
60729 466668 460077 454956 450730 446703 442870 439725 437402 435463 433571 431880 430533 429272 427968 427174
60715 427174 427539 428788 429870 430151 429908 429444 428397 426313 423446 420368 417058 412994 408137 403216 398910
60700 398910 395229 391855 388663 385614 382500 379150 375742 372580 369679 366835 364021 361447 359252 357380
60686 357380 355752 354314 352862 351044 348720 346287 344560 344227 345330 347187 348898 350054 350992 352392 354674
60671 354674 357776 361283 364608 367185 368755 369474 369720 369816 370027 370569 371397 372075 372158 371644 370848 369995 369349 369687
60653 369687 372014 376472 381847 386517 389831 392365 395105 398684 403250 408635 414452 420181 425271 429212
60639 429212 431623 432426 431893 430456 428496 426347 424316 422492 420607 418267 415370 412204 409147 406353 403702
60624 403702 400981 398103 395160 392218 389195 386138 383563 382112 381722 381509 380782 379808 379151 378567 377179 374778
60608 374778 372342 371020 370993 371536 371888 371815 371563 371466 371503 371138 369854 367908 366231 365425 365227 365210 365573 366707
60590 366707 368214 369013 368501 367178 366014 365610 366141 367618 369751 371785 372950 373179 373173 373730 375190 377513
60574 377513 380538 383982 387414 390600 393946 398391 404734 413077 422927 433680 444952 456553 468261
60561 468261 479601 489804 498077 504030 507790 509642 509628 507627 503714 498301 492011 485614 480001 475880
60547 475880 473427 472436 472893 475151 479474 485684 493423 502516 512859 524133 535940 548094 560438
60534 560438 572451 583312 592293 598766 601949 601227 597006 590799 584095 577350 570424 563702 558153 554316
60520 554316 551817 550036 548715 547625 546133 543755 540924 538656 537474 537167 537641 539362 542645 546969 551482
60505 551482 556052 561452 568611 578043 589940 604509 622105 643224 668448 698238 732682 771398
60493 771398 813662 858519 904784 950923 994944 1034566 1067700 1092739 1108182 1112236 1103457 1082067
60481 1082067 1050188 1010451 964815 915042 863671 813589 766690 723571 684451 649675 619309
60470 619309 592866 569679 549121 530511 513448 498407 486345 477392 470378 463920 457568 451673
60458 451673 446702 442984 440597 438947 436805 433279 428652 424001 420159 417198 414624 411806 408500 405156
60444 405156 402449 400380 398309 396010 394108 393088 392430 391267 389501 387741 386537 386140 386600 387478 387825
60429 387825 387130 386047 385616 385995 386540 386823 386846 386540 385858 385244 385263 385806 386326 386705 387167 387503 387326 387113 388006
60410 388006 390334 393179 395656 397851 400119 402247 403833 404911 405801 406755 408021 409686 411180 411613 411035
60395 411035 410778 412065 414731 417780 420663 423488 426438 429651 433397 437778 442386 446660 450346 453295
60381 453295 455193 456063 456765 458409 461250 464570 467524 469757 471369 472722 474262 476189 478279 480219 481978
60366 481978 483678 485297 486758 488114 489390 490403 491001 491276 491356 491200 490765 490130 489279 488158 487141 486996
60350 486996 488015 489641 491401 493749 497447 502504 508269 514204 519924 524825 528491 531346 534151 536890
60336 536890 538785 539401 539039 538046 536442 534293 531828 529012 525558 521529 517403 513417 509380 505197 500963
60321 500963 496430 491075 485056 479528 475592 473336 472153 471528 471168 470918 471107 472648 476286 481852 488633
60306 488633 496274 504969 514986 526466 539628 554740 571726 589944 608283 625435 640186 651610
60294 651610 658978 661569 658909 651340 640065 626458 611606 596622 582855 571199 561356 552255 543264
60281 543264 534684 527119 520784 515505 511076 507343 504081 500947 497613 493956 490123 486313 482516 478563
60267 478563 474502 470655 467195 463862 460437 457301 455193 454388 454427 454696 454969 455202 455106 454214 452335 449717
60251 449717 446793 443980 441767 440706 441046 442320 443555 444041 443872 443628 443623 443680 443616 443669 444183 444987 445443 445200
60233 445200 444691 444700 445605 447284 449615 452602 455912 458842 461147 463566 466875 470628 473513 475111 476519
60218 476519 478948 482303 485682 488702 491671 494831 498212 502085 506813 512245 517946 524015 531003 538888
60204 538888 546882 554445 561783 569019 575620 581241 586514 592240 598116 603026 606488 609126 611688 614218
60190 614218 616355 617947 619063 619664 619508 618296 615868 612396 608419 604476 600641 596571 592054 587326 582753
60175 582753 578364 573867 569046 564028 559129 554552 550300 546398 543083 540697 539394 538978 539026 539076 538775 538001
60159 538001 536868 535577 534282 533193 532679 532987 533911 534981 535975 537009 538149 539348 540759 542613 544592
60144 544592 545849 546077 546151 547234 549510 552325 555361 559062 563906 569795 576217 582597 588459 593732 598938
60129 598938 604576 610189 614498 616724 617345 617340 617185 617022 617281 618435 620207 621671 622265 622367 622761 623916 625904
60112 625904 628653 631963 635364 638231 640110 640969 641145 641027 640633 639483 637051 633362 628998 624461 619773
60097 619773 614821 609854 605431 601950 599448 597706 596355 594929 593161 591254 589681 588768 588666 589629 591856
60082 591856 594893 597628 599278 600229 601560 603835 606586 608869 609992 609679 607925 604878 600720 595551 589460
60067 589460 582717 575706 568614 561352 553891 546518 539632 533390 527711 522520 517811 513419 508931 504054
60053 504054 499095 494943 492359 491309 491120 491289 491850 492869 494017 495039 496459 499291 503973 509970 516471
60038 516471 523142 530066 537322 544840 552356 559275 564868 568861 571591 573293 573571 571989 568920 565157
60024 565157 560762 555044 547887 540426 533856 527990 521669 514407 506897 499824 492872 485305 477026 468610
60010 468610 460608 453386 447392 442951 439779 437309 435542 434970 435499 436206 436616 437551 440023 443670 447080
59995 447080 449413 450924 452000 452679 453350 455047 458416 462837 467084 470594 473716 477034 480898 485399 490345
59980 490345 495264 499743 503675 507013 509491 510966 511875 512901 514147 514946 514600 513069 510860 508461 505987
59965 505987 503296 500357 497548 495522 494664 494718 495073 495371 495689 496130 496516 496612 496519 496622 497079 497553 497587 497226 497068
59946 497068 497583 498569 499435 499855 499864 499430 498392 496910 495607 494995 494920 494775 494061 492616 490527 488073 485639
59929 485639 483439 481332 479077 476709 474565 473026 472302 472299 472635 473026 473799 475745 479166 483262 486801 489291
59913 489291 491167 492966 494798 496717 499116 502358 506183 509887 513124 516295 519987 524146 528006 530918
59899 530918 533025 535009 537277 539581 541337 542046 541454 539692 537414 535521 534548 534460 535127 536703 539319 542715
59883 542715 546559 550949 556195 562105 567906 573010 577618 582389 587673 593214 598482 603057 606611 608740
59869 608740 609130 607935 605777 603138 599928 595855 591031 585869 580495 574781 568967 563793 559804 556944
59855 556944 554964 553769 553167 552828 552989 554693 558731 564525 570710 576694 583061 590374 598146 605188 610560
59840 610560 613948 615474 615532 614773 613975 613705 613992 614315 614006 612721 610424 607040 602400 596642 590351 584121
59824 584121 578256 573014 568737 565343 562046 558029 553258 548245 543266 538312 533586 529410 525647 521842
59810 521842 518038 514916 512867 511361 509522 507037 504263 501688 499562 497901 496611 495642 495060 494903 494933
59795 494933 494632 493519 491392 488307 484489 480270 476008 471994 468502 465779 463887 462603 461546 460308
59781 460308 458501 455967 453171 451026 449988 449532 448868 447950 447336 447274 447520 448012 449125 451111 453745 456667
59765 456667 459717 462810 465833 468834 471961 475037 477520 479118 480264 481838 484510 488347 492791 496986
59751 496986 500410 503297 506314 509842 513872 518482 523977 530346 536950 542954 547932 551927 555216 558116
59737 558116 560820 563215 564982 565962 566321 566311 566059 565599 565012 564531 564625 565775 567875 570026 571331 571864 572447
59720 572447 573485 574511 574966 574968 575074 575661 576753 578158 579548 580638 581576 582974 585417 588945 593000 596722
59704 596722 599407 601028 602301 603935 605841 607439 608701 610368 613028 616429 619884 622941 625498 627698
59690 627698 629944 632549 635076 636370 635626 633209 630251 627673 625809 624549 623521 622330 620949 619671
59676 619671 618547 617132 614953 611929 608071 603183 597211 590697 584503 579172 574713 570807 567014 563012
59662 563012 558893 555076 551809 548975 546489 544543 543282 542579 542404 543105 544979 547811 551081 554432 557710
59647 557710 560766 563449 565543 566589 566101 564193 561580 558734 555467 551674 547940 544881 542235 539259
59633 539259 535838 532634 530228 528563 527198 525734 524104 522720 522161 522365 522347 521137 518824 516321 514341
59618 514341 512957 511837 510358 507747 503812 499428 495720 492852 490262 487920 486550 486472 487078 487752 488689
59603 488689 490334 492487 494398 495488 495664 495222 494717 494631 494865 494799 494105 493288 493112 493690 494454 494896 495081 495454
59585 495454 496297 497315 497710 496857 495008 493066 491519 489918 487654 484854 482033 479162 475760 471846 468133
59570 468133 465096 462497 460207 458894 459256 460853 462342 462767 462120 460805 459221 457916 457432 457729 458263 458840
59554 458840 459825 461223 462260 462412 462317 463046 464886 467458 470547 474024 477358 480211 483395 488282 495241
59539 495241 503552 512797 523314 535192 548075 562263 578689 596855 613722 625640 631018 630578
59527 630578 625845 618470 610575 604444 601490 601889 605038 609897 615192 620022 624318 628325 631826 634275
59513 634275 635384 635003 632673 627939 621039 612711 603438 593381 582944 572734 562929 553215 543412 533793
59499 533793 524796 516857 510460 505832 502526 499695 496872 494217 492122 490925 490864 491858 493307 494534 495493
59484 495493 496715 498605 501061 503771 506612 509799 513866 519345 526207 533725 541148 548293 555309 562191
59470 562191 568771 574787 579611 582410 583086 582574 581601 579703 576327 572442 570008 569957 571681 574464 578399
59455 578399 583775 590507 598502 607870 618447 629794 641854 654964 668929 682722 695403 706775
59443 706775 716866 725290 731365 734336 733274 727430 717217 704480 691366 679097 667941 657941
59431 657941 649246 641866 635300 628523 620624 611807 603482 596986 592529 589876 589551 592412 598346 606506
59417 606506 616816 630094 646577 665415 685796 707373 729361 750705 771709 793860 816730
59406 816730 836140 846814 846437 836405 819706 799593 779528 762346 749118 739920 735635 737411
59394 737411 743800 749669 748993 738624 719357 694357 667241 640951 617189 596396 578344 562865
59382 562865 550021 539800 531870 525688 520798 517052 514487 513052 512529 512733 513538 514700 515948 517349
59368 517349 519252 521646 523946 525714 527260 529114 531195 533048 534772 537152 540766 545391 550408 555542
59354 555542 561053 567458 575238 584690 595891 608702 622763 637626 653106 669529 687410 706798
59342 706798 727080 747466 767437 786704 805078 822441 838516 852613 864006 872601 878714 882001
59330 882001 881290 875911 866679 855095 842060 827937 813316 798846 784500 769826 754958 740724
59318 740724 727698 715754 704682 694668 685962 678434 671672 665275 659017 653020 647857 644175 642151
59305 642151 641502 642021 643877 647407 652835 660148 669054 679188 690555 703428 717284 730005 738744
59292 738744 741732 738892 730972 718890 704129 688917 675245 663823 654371 646678 641043 637826 636949
59279 636949 637894 640035 643038 647071 652539 659542 667681 676490 685926 696352 708219 721791 736903
59266 736903 752718 767957 781651 793645 804087 812537 817963 819666 817869 813207 805955 796123 784091
59253 784091 770670 756405 741300 725444 709615 694841 681550 669568 658928 650143 643523 638658
59241 638658 634897 632082 630417 629773 629589 629563 630143 632094 635617 640046 644399 648162 651465 654517 656972
59226 656972 658036 657202 654744 651379 647484 642734 636516 628643 619587 610042 600343 590463 580491 570895
59212 570895 562235 554816 548727 544016 540644 538473 537433 537449 538000 538190 537630 536984 537104 537861 538505 539091 540806
59195 540806 544617 550117 555954 561079 565386 569516 574193 579487 584668 589075 593011 597250 601712 605424
59181 605424 608032 610592 614433 619727 625637 631358 636473 640763 644362 647964 652299 657431 662885 668328
59167 668328 673847 679739 686368 694059 702766 711926 720898 729479 737798 745818 753085 758782 762020 762406
59153 762406 760460 757163 752934 747381 740090 731105 720504 708308 695327 683362 673749 666036 658803
59140 658803 651516 644801 639107 633946 628659 623274 618326 614175 610741 607783 605353 604004 604351 606313
59126 606313 609017 611741 614721 618775 624341 631161 638733 646757 655297 664734 675398 687145 699561
59113 699561 712641 726698 741385 755425 767753 778401 787814 795921 802609 808533 814505 820302 824900
59100 824900 827797 829337 829882 829468 828319 826886 825156 822542 818692 814025 809349 805254 801903 798999 795992
59085 795992 792621 789174 785962 782773 779194 775074 770128 763500 754531 743800 732631 721689 710803
59072 710803 700003 689714 679890 670020 660319 651968 645641 640441 634874 628370 621424 614740 608806 603925
59058 603925 600046 596653 593185 589473 585571 581378 576816 572235 568267 565191 562652 560131 557604 555579
59044 555579 554429 553856 553243 552465 551953 551943 552186 552605 553667 555621 557903 559912 562011 565019 568946 573000
59028 573000 576753 580560 584807 589525 594924 601684 610441 621328 634058 648028 662409 676635 690868
59015 690868 705437 719827 732754 743339 751604 757706 761335 762185 760615 757517 753775 749974 746344
59002 746344 742931 740068 738633 739489 742703 747637 753655 760253 766670 772029 775980 778780 780758 782142
58988 782142 783241 784106 784055 782230 778699 774335 769533 763805 756799 749028 741330 734235 728153 723530 720434
58973 720434 718524 717788 718845 722212 727648 734540 742576 751737 761933 772861 784021 794851 805228
58960 805228 815750 826990 838408 848591 856651 862780 867287 869696 869075 864747 856517 844782 830667
58947 830667 815510 799940 783890 767678 752390 738935 727298 717001 707740 699279 691386 684293
58935 684293 678677 674713 671604 668473 665255 662276 659444 656389 653100 649868 646783 643691 640524 637356
58921 637356 634292 631513 629298 627766 626738 625947 625196 624279 623024 621503 620008 618829 618266 618694 620277
58906 620277 622754 626033 630787 637836 646978 657058 667255 677718 689002 701505 715416 730403
58894 730403 745303 758903 771203 783269 795856 808965 822721 837671 854027 871542 890338
58883 890338 910833 932545 953955 973884 992031 1007810 1019891 1027472 1030995 1030940 1026935 1018733 1007024
58870 1007024 992465 974931 954686 933414 912956 893653 874941 856990 840683 826406 813835
58859 813835 802606 792309 782218 771896 761801 752531 743807 734907 725662 716281 706659 696754 687298
58846 687298 679221 672558 666689 661378 656780 652695 648638 644504 640374 635913 630691 624974 619410 614027
58832 614027 608277 602067 596101 591149 587450 584807 582855 581304 580244 579970 580286 580423 580029 579721 580186 581286
58816 581286 582702 584849 588295 592673 596965 600651 603875 606813 609581 612419 615219 617182 617702 617258 616710
58801 616710 616084 614893 613285 611851 610515 608601 605925 602925 599748 596125 592143 588300 584721 581107
58787 581107 577549 574649 572783 571924 572248 574167 577605 581935 586776 592248 598283 604292 609761 614711 619324
58772 619324 623391 626328 627582 626976 624735 621099 615962 609346 602264 596342 592165 588642 584591 580286
58758 580286 576713 573970 571411 568907 566921 565662 565153 565913 568482 572312 576105 579262 582144 585042 587889
58743 587889 590989 595003 599965 605251 610767 617330 625511 634809 644352 653794 663155 672337 681268 690243
58729 690243 699691 709628 719433 728167 735276 741114 746470 751362 754650 755232 753288 749947 746088 741979
58715 741979 737757 733731 730445 728776 729449 732033 735006 737455 739986 743188 745957 746520 744616 741372 737215
58700 737215 731155 722239 710632 697121 682428 667252 652216 637536 623107 608918 595056 581643
58688 581643 569238 558802 550612 543697 537084 531008 526018 521585 516766 511713 507283 503612 500408 498170
58674 498170 497599 498040 498099 497765 498332 500229 502587 505196 509247 515553 523493 532264 541965 552820 564433
58659 564433 576333 588148 598736 606273 609924 610611 609644 607490 604284 600490 596380 591652 586156 580332
58645 580332 574577 568905 563540 558939 554882 550467 545479 540865 537418 534897 533016 532362 533562 536216
58631 536216 539288 542128 544603 546745 548669 550408 551573 551666 550884 550047 549685 549841 550732 552634 555073 557240
58615 557240 559443 563096 568856 575856 583193 591052 599716 608471 616240 622564 627310 630165 631152 631004 630438
58600 630438 629614 628700 628134 627706 626194 622748 618069 613481 609328 605067 600569 596551 593855 592929 594010
58585 594010 597374 603216 611362 621141 631677 642487 653545 664584 674801 683754 692061 700439 708483
58572 708483 715395 721566 728350 736338 745024 754177 764495 776749 791315 808595 828884 851648 875894
58559 875894 901290 927963 955353 982469 1009225 1036108 1062312 1085574 1104208 1118118 1127610 1132578
58547 1132578 1133296 1130696 1125367 1117348 1107236 1096257 1084885 1072550 1058991 1044549 1028824 1010555
58535 1010555 989356 966228 941965 916571 890811 866643 845244 825962 808051 792036 778526
58524 778526 767117 757472 750168 745432 742210 739557 737840 737614 738355 739302 740491 742006 743227 743811 744457
58509 744457 745748 747162 748127 749102 750670 752395 753434 753455 752253 749400 745060 740301 735949 731982 728448
58494 728448 725851 724092 722309 720394 719371 719685 720513 721459 723398 726836 730980 735444 741333 749610 759899
58479 759899 771994 786860 804753 823866 842333 860276 878419 895979 911488 924536 935124
58468 935124 942298 944977 943367 938308 930111 919222 906954 894369 881495 868718 857718 849835 844810
58455 844810 842335 843349 848303 855617 863554 872343 882726 893611 902980 910028 914714 916307 914209 909236
58441 909236 902358 893220 881642 869445 858837 849949 841931 835509 832217 831791 832501 833713 836173 840118
58427 840118 844975 850722 857885 866373 875712 886122 898064 911105 924340 937369 949691 959943
58415 959943 966941 970750 971661 969203 963402 955830 947951 939514 929999 920311 911457 902774 893353 884101
58401 884101 876642 871181 867150 864782 864237 864298 863866 863738 865197 867995 871401 875827 881443 886588 889703
58386 889703 891595 893688 895438 895697 895173 895128 895007 893917 893113 894260 896451 897754 898679 901243 905581 910345
58370 910345 915599 922392 930199 937671 945243 954250 964172 973579 983093 994602 1008244 1022948 1039090
58357 1039090 1057591 1077135 1095367 1112212 1128969 1144828 1157538 1166909 1174384 1179711 1181499 1180736
58345 1180736 1180329 1181312 1182701 1184770 1189085 1195481 1202392 1210116 1220462 1233334 1246977 1261438 1278303
58332 1278303 1297041 1315143 1332014 1349322 1367381 1384593 1400613 1416591 1432031 1444795 1454522
58321 1454522 1462884 1470314 1475770 1479720 1483968 1488453 1491697 1494451 1499339 1506779 1514854 1523297 1533888 1546724
58307 1546724 1559935 1573396 1589011 1607007 1625574 1644397 1664856 1686570 1707584 1728036 1749750
58296 1749750 1772133 1792658 1811489 1831336 1852585 1873088 1892995 1915109 1939948 1965211 1990727
58285 1990727 2019137 2050861 2083281 2115881 2151388 2190612 2230825 2270389 2310523 2351472 2391593
58274 2391593 2431290 2473231 2517626 2561953 2606216 2653644 2705293 2758853 2813674 2871809 2933278
58263 2933278 2995650 3059350 3127932 3202026 3278464 3356317 3438014 3523529 3609433 3694918 3782665
58252 3782665 3872644 3961310 4048206 4136909 4228335 4319839 4412175 4510238 4615496 4724887 4838540
58241 4838540 4960933 5092923 5230686 5374301 5529089 5696593 5872848 6057574 6256003
58232 6256003 6469442 6693595 6928678 7181295 7453531 7740628 8042623 8367508 8719420
58223 8719420 9094851 9494355 9926412 10395617 10899178 11439614 12028510 12673084 13372188
58214 13372188 14130578 14963398 15881681 16888553 17995516 19226761 20601829 22131829
58206 22131829 23840053 25768694 27959534 30450363 33300500 36600111 40449798 44962224
58198 44962224 50301536 56701761 64444146 73854718 85333413 99327813 116224372 136256999
58190 136256999 159481978 185743731 214641242 245631493 278169849 311450975 343641335
58183 343641335 371374466 390462938 397653844 392057471 375160781 349751063 318862830
58176 318862830 285304960 251493661 219266294 189761120 163516062 140676577 121134264
58169 121134264 104600787 90697368 79039324 69263703 61031777 54053217 48105027
58162 48105027 43011639 38619736 34804074 31477238 28572525 26025049 23778354 21793679
58154 21793679 20038207 18474218 17069420 15805978 14669049 13637070 12692440 11830683
58146 11830683 11049428 10337938 9685838 9092044 8555993 8068778 7621341 7213084 6844197
58137 6844197 6507098 6192967 5899549 5625598 5365041 5113785 4875629 4654708 4448284
58128 4448284 4252878 4070700 3903666 3747444 3597808 3457043 3328028 3207722 3092444
58119 3092444 2984027 2884776 2791617 2701101 2615309 2537112 2464211 2393356 2325881 2263702 2204206
58108 2204206 2144441 2086283 2032384 1980896 1929117 1878437 1830850 1784345 1736607 1689682 1646297
58097 1646297 1605007 1563522 1523409 1486977 1452785 1418763 1386648 1358891 1334096 1309787 1286897
58086 1286897 1267436 1250491 1234518 1220669 1209914 1199645 1187098 1173482 1160917 1148087 1132833
58075 1132833 1116277 1100310 1083503 1063575 1041663 1020240 999038 976848 955155 936083 918701
58064 918701 901105 884277 870206 858043 845749 833863 824103 815854 807359 798821 791008 782496 771580
58051 771580 759411 748132 737490 726365 715928 707931 701423 694425 687498 682445 678745 674415 669260
58038 669260 664387 659564 653880 647881 642493 637112 631175 626067 622793 619329 613104 604559 595467 585415
58024 585415 573186 560205 549240 540515 532132 523522 515682 508847 502703 498088 495802 494478 492132
58011 492132 488959 486255 483720 480420 477262 475711 474957 473097 470339 468368 467289 465871 464103 462948
57997 462948 462202 461147 460659 462101 464692 466532 467724 469951 473325 476024 476870 476249 474893 473674 473937
57982 473937 475988 477814 477202 474451 471240 467939 464163 460761 458762 457157 454175 450101 446557 443784
57968 443784 441010 438724 438027 438328 438132 437664 438399 440564 443323 446753 451231 455530 457985 458982 459945 460616
57952 460616 459885 458575 458514 459315 458908 457028 455356 454440 453361 452382 453008 455220 457421 459452 462963 468340
57936 468340 473882 478623 483588 489620 496197 503036 510666 518699 525547 530558 534602 537943 539398 538266
57922 538266 535396 531623 526644 520024 511982 502783 492647 482449 473233 464935 456897 449512 443801 439559
57908 439559 435567 431622 428611 426658 424969 423534 423114 423445 423272 422336 421577 421253 420599 419440 418312 416952
57892 416952 414599 411890 410451 410301 409658 407757 405859 404968 404499 403890 403712 404322 404936 404746 403702 401691
57876 401691 398333 393970 389442 384587 378461 371359 364999 360281 356408 352653 349389 346843 344421 341848
57862 341848 339638 337976 336551 335898 337380 341333 346573 352087 357792 363402 368262 372767 378240 384742
57848 384742 390600 394788 398187 401802 405304 408150 410627 412823 413986 413883 413582 413842 413824 412364 409684
57833 409684 406977 405110 404367 404637 405268 405473 405411 406081 407876 410106 412196 414392 416984 419896 423241 427242
57817 427242 431401 434878 437815 441030 444227 445877 445186 442818 439346 434441 428011 420685 412673 403547
57803 403547 393720 384781 377723 372033 367010 362664 358885 355137 351641 349521 349152 349637 350408 351917 354206
57788 354206 356353 358102 360514 364124 367903 370994 374115 378193 382890 387623 392890 399436 407028 414974
57774 414974 422966 430555 436869 441792 446451 451584 456310 459330 460396 459796 457448 453422 448444 442948
57760 442948 436497 428955 421209 413870 406288 397915 389687 382890 377444 372423 367633 363611 360583 358391
57746 358391 357060 356623 356795 357453 358903 361110 363222 364439 364835 364881 364804 364790 365082 365483 365540 365523 366278 367808
57728 367808 369132 369943 371161 373315 375644 377495 379349 381661 383944 385844 387924 390452 392594 393768
57714 393768 394627 395671 396138 395417 394426 394267 394515 394126 393134 392152 391057 389540 388153 387512 387140 386422 385987
57697 385987 386816 388567 390146 391396 392894 394550 395715 396380 396952 397117 396180 394372 392814 392327 393104 395150
57681 395150 398147 401356 404695 409557 417567 428939 443061 460324 482196 509833 543681 584169
57669 584169 631535 684939 742831 804289 868953 935029 997475 1048112 1077864 1080381 1055204 1007791
57657 1007791 946173 877625 808094 742865 685819 638172 598996 566940 540936 519894 502900
57646 502900 489611 479716 472266 466168 461018 456793 453216 450136 448042 447350 447556 447799 447827 447753 447489 447223
57630 447223 447805 449689 451977 453449 454066 454635 455511 456531 457660 458766 459235 458815 458274 458290 458297 457473 456220
57613 456220 455465 455144 454714 454627 455738 457572 458716 458911 459344 460830 462966 465149 467211 468910 469927 470560
57597 470560 471455 472559 473219 473307 473266 473099 472424 471532 471275 471702 471870 471230 470281 469572 468977 468278 467701 467553 467879
57578 467879 468677 469887 471136 472020 472608 473070 473018 471989 470460 469482 469365 469624 470218 471811 474481 477109 478612
57561 478612 479254 480267 482446 485417 488128 489978 491463 493539 496333 498980 501058 503512 507476 512731
57547 512731 518064 522784 527059 531098 534868 538475 542058 545430 548409 551301 554435 557562 560348 563098
57533 563098 566233 569416 572017 574116 576256 578539 580760 583076 585739 588505 591114 593893 597033 599828
57519 599828 601714 603570 606734 611073 615292 618928 622698 627033 631578 636149 640933 645634 649648 653266
57505 653266 657638 663343 669882 676563 682877 688045 691408 693493 695708 698841 702685 706993 711661 715984
57491 715984 719014 720871 722686 725121 727993 731363 735653 740525 745001 749121 754211 760906 768027 774051
57477 774051 778795 783071 787520 792352 797499 802502 806834 810723 815069 820299 825966 831628 837337 843096
57463 843096 848625 853984 859612 865504 871082 876145 881248 886912 893125 899754 906692 913571 920032 926371
57449 926371 933089 939868 946001 951777 958220 965348 972002 977775 983843 991280 999677 1008106 1016478 1025200
57435 1025200 1034248 1043268 1052035 1060352 1068057 1075482 1083219 1091171 1098571 1105283 1112278 1120432 1129589 1139126
57421 1139126 1148668 1157914 1166571 1174832 1183253 1191924 1200489 1209053 1218095 1227381 1236130 1244558 1254010 1265026
57407 1265026 1276480 1287223 1297474 1307848 1318106 1327739 1336914 1346015 1355014 1364036 1373726 1384347
57395 1384347 1395283 1406132 1417403 1429359 1441095 1451749 1461872 1472571 1483964 1495521 1507360
57384 1507360 1519990 1533107 1545822 1558030 1570643 1584385 1598994 1613630 1627535 1640354 1652293
57373 1652293 1663990 1676017 1688585 1701718 1715275 1728678 1741243 1753113 1765317 1778544 1792408
57362 1792408 1806269 1820181 1834532 1849287 1864156 1879142 1894468 1910226 1926421 1943027 1959838
57351 1959838 1976653 1993725 2011442 2029495 2047047 2063930 2080897 2098451 2116227 2133811 2151257
57340 2151257 2168429 2184782 2200442 2216553 2233903 2251918 2269713 2287368 2305371 2323508 2341230
57329 2341230 2358669 2376414 2394598 2412879 2431078 2449204 2467086 2484507 2501570 2518593 2535859
57318 2535859 2553593 2571836 2590214 2608289 2626241 2644641 2663524 2682455 2701576 2721582 2742429
57307 2742429 2763052 2782819 2802295 2822140 2842219 2862359 2882973 2904195 2925260 2945458 2965013
57296 2965013 2984433 3003830 3023466 3044084 3065948 3088325 3110570 3132907 3155563 3178077 3200184
57285 3200184 3222426 3245075 3267414 3288942 3310354 3332382 3354639 3376604 3398767 3421593 3444215
57274 3444215 3465520 3485898 3506610 3527913 3549028 3569582 3589903 3610204 3630569 3651465 3673194
57263 3673194 3695059 3715932 3735440 3753912 3771670 3789165 3807271 3826496 3846293 3865908 3885343
57252 3885343 3904687 3923309 3940784 3957971 3975943 3994388 4012230 4029408 4046785 4064641 4082394
57241 4082394 4099548 4115881 4131032 4144993 4158639 4172732 4186733 4199654 4211675 4223765 4236149
57230 4236149 4248394 4260677 4273674 4287330 4300912 4314204 4327591 4341157 4354696 4368351 4382189
57219 4382189 4395495 4407578 4418930 4430431 4441814 4452172 4461575 4470738 4479427 4486718 4492687 4498215
57207 4498215 4503123 4506200 4507274 4507603 4507810 4506940 4504172 4500091 4495580 4490495 4484172 4476416 4467439 4457538 4447243
57192 4447243 4437128 4427111 4416504 4404907 4392539 4379735 4366884 4354700 4343646 4333160 4322344
57181 4322344 4311340 4301048 4291585 4282221 4272750 4263644 4254703 4244917 4234011 4222927 4212357 4201954
57169 4201954 4191411 4181213 4171713 4162433 4152797 4142791 4132455 4121691 4110943 4101157 4092502 4084017
57157 4084017 4075046 4066159 4058086 4050625 4043288 4036248 4029747 4023099 4015117 4005387 3994477 3983010 3970856
57144 3970856 3957140 3940767 3921069 3898091 3872336 3844439 3815323 3786210 3757862 3729940 3701653
57133 3701653 3672933 3644577 3617598 3593110 3572483 3556614 3545162 3537204 3532393 3530547 3530338 3529553 3526813
57120 3526813 3522307 3516987 3511976 3508772 3509003 3513905 3524752 3543601 3572539 3612248 3662359 3723231 3796391
57107 3796391 3883414 3985731 4105977 4248697 4419752 4626090 4876236 5180238 5549396 5997390
57097 5997390 6541995 7205008 8010620 8984334 10151834 11535711 13151132 15003398 17086965
57088 17086965 19383902 21863715 24487700 27215512 30009151 32834679 35662400 38457254
57080 38457254 41152485 43622873 45690753 47176106 47958610 48006629 47361159 46100590 44315750
57071 44315750 42102503 39562646 36803689 33934011 31054255 28248796 25581291 23094887
57063 23094887 20814736 18751202 16903473 15262678 13813757 12537269 11412378 10419752
57055 10419752 9542403 8765205 8074941 7460692 6913236 6423981 5984819 5588593 5229072
57046 5229072 4900796 4599475 4322149 4066409 3829761 3610036 3405763 3215639 3038346
57037 3038346 2873400 2721388 2582668 2456585 2342609 2241247 2153067 2077775 2015251 1966349
57027 1966349 1931286 1908184 1894779 1890530 1894533 1901060 1899165 1877957 1832076 1762710 1675268 1576936
57015 1576936 1475029 1375727 1283359 1200309 1127174 1063158 1006972 957573 913999 875024 839650
57004 839650 807709 779321 753945 730608 708839 688664 669870 652005 635028 619193 604319
56993 604319 589842 575677 562387 550504 540280 532127 526576 523601 522578 523211 526015 531445 538757
56980 538757 545941 550735 551630 548099 540271 528685 514445 499175 484333 470569 458080 447346 438916
56967 438916 432594 427671 424139 422926 424686 429096 435628 444209 454688 466497 479320 493350 508182
56954 508182 522062 532819 538999 539714 534342 523234 508076 490681 471923 452588 434559 420038
56942 420038 409810 403107 398888 396527 395622 396190 399058 405357 415501 429035 445307 463871 484346
56929 484346 506060 527414 545363 556210 557566 549350 532924 510108 483402 455874 429692 405247
56917 405247 382445 362106 345239 331637 320228 310266 301302 292678 284202 276791 271279 266995 262633
56904 262633 258145 254594 252457 251353 251286 252807 255764 259054 261895 264572 267736 271735 276815 283395 291924
56889 291924 302766 316076 331431 347949 365147 383124 401280 417463 429217 435481 436414 432320
56877 432320 423844 412634 400569 388593 377303 368217 363041 361899 363562 367492 374561 385822 401724
56864 401724 422584 448631 479352 513703 551139 591616 634379 677292 717031 749202 768839
56853 768839 772488 760377 736010 703791 667709 631602 598909 571669 550663 536534 529822 530113
56841 530113 536563 549545 570688 601019 640049 686718 740110 799067 862262 928653 996259 1059843
56829 1059843 1111109 1142231 1148970 1130854 1090262 1032354 964535 894191 826633 765175 712068
56818 712068 668486 634270 608773 591922 584063 585107 594436 611502 636036 667645 705417 747915
56806 747915 793441 839985 884383 921424 944710 949487 934798 902826 857064 801878 742802 685276
56794 685276 632648 586154 546571 514653 490134 471803 458932 451622 449680 452460 460074 473302
56782 473302 491666 512761 534250 555542 576604 595739 609355 613673 606473 587919 560373 527181
56770 527181 491256 454810 419891 388248 360589 336629 315924 298020 282038 267200 253783
56759 253783 242596 233513 225591 218574 212970 208489 203858 198612 193757 190075 187001 183857 181026 179027
56745 179027 177432 175568 173561 171912 170667 169690 169063 168575 167536 165753 164057 163210 162847 162092 160703 159030
56729 159030 157359 155935 155172 155253 155755 156064 155970 155716 155815 156758 158420 159844 160302 160369 161072 162208 162672 162432
56711 162432 162724 164046 165423 166203 167129 168873 170753 171888 172560 173452 174470 175313 176375 178118 180175 181953
56695 181953 183503 185014 186105 186423 186390 186664 187385 188521 190263 192407 194050 194650 194770 195095 195374 194969 193789
56678 193789 191999 189541 186700 184472 183537 183421 183315 183102 182916 182453 181526 180660 180270 179855 178823 177527 176669
56661 176669 176228 175808 175532 175789 176543 177637 179278 181507 183687 185214 186271 187221 187862 187964 187937 188271 188879
56644 188879 189670 191074 193210 195280 196640 197838 199748 202328 205117 208241 211847 215185 217370 218564
56630 218564 219421 219868 219536 218910 218833 219188 219246 219045 219323 220184 220914 221043 220681 219887 218564 216881 215018 212675
56612 212675 209589 206292 203552 201300 198984 196732 195246 194627 194202 193509 192683 191929 191294 190927 190913 190900 190484
56595 190484 189787 189179 188666 188098 187616 187316 186853 186014 185282 185166 185419 185681 186365 187972 189908 191012 191035 190712
56577 190712 190581 190658 191120 192330 194230 196470 199120 202442 206007 208835 210457 211310 212133 213515 215858 219255
56561 219255 223533 228748 235330 243325 252055 261015 270355 279737 287493 292010 293422 292919 291035 287893
56547 287893 284619 282804 282467 281970 280234 277900 275987 274549 273127 271628 270140 268470 266358 263829 261057
56532 261057 258144 255108 251921 248663 245825 244091 243410 242678 240935 238524 236500 235260 234442 233805 233383
56517 233383 232980 232298 231441 230630 229608 227982 225933 223922 221923 219709 217652 216473 216268 216445 216546 216552 216566
56500 216566 216821 217773 219557 221466 222499 222287 221145 219547 218030 217077 216541 215644 214068 212513 211653 211232
56484 211232 210916 211197 212540 214244 215162 215060 214415 213489 212570 212464 213629 215276 216403 217221 218503 220076
56468 220076 221141 221583 221800 221726 221226 220981 221672 222723 223154 223266 224024 225177 225527 224867 224132 223702 223057 222135
56450 222135 221634 221810 222242 222863 224045 225610 226904 227883 228994 230123 230781 231206 231998 232828 232826 232152 231802 231936
56432 231936 231799 231296 231101 231090 230236 228419 226946 226787 227402 227682 227082 225667 224022 223259 224033 225511 226301
56415 226301 226268 226312 226625 226620 226538 227451 229458 231381 232582 233689 235134 236357 236977 237557 238698 240322 242146
56398 242146 243927 245119 245343 245258 245905 247222 248384 249451 251253 253627 255335 255864 255846 255552 254598 253451
56382 253451 253510 255102 256837 257523 257486 257548 257995 259013 260827 262934 264313 264787 265115 265625 266002 266468 267656
56365 267656 269131 269639 269088 268688 268860 268718 268024 267826 268536 269128 268963 268760 269049 269337 269605 270922 273541 275929
56347 275929 276758 276578 276533 276714 276753 276802 276940 276729 276231 276383 277531 278750 279385 280155 281938 284589 287699 291373
56329 291373 295481 299255 302394 305521 308938 312057 314703 317724 321611 325617 328926 331538 333429 334122
56315 334122 333689 332992 332344 331205 329657 328747 328822 329075 329352 330715 333446 336170 337931 339604 342243 345547
56299 345547 349020 353146 358266 363514 367947 371590 374595 376647 378027 379824 382229 383975 384325 384214 384684
56284 384684 385765 387660 391278 396538 401866 406513 411720 418512 425997 433038 439955 447326 454709 461870
56270 461870 469677 478529 487362 495455 503656 512755 522433 532940 545784 561288 577473 593038 609519
56257 609519 628860 650846 674902 702412 734921 771710 811504 855197 904516 959281 1018347
56246 1018347 1082156 1152026 1227751 1308009 1392221 1479877 1568858 1656494 1741531 1823129 1898815
56235 1898815 1965507 2021828 2067473 2101073 2120726 2126115 2118189 2097350 2063813 2019299 1966575 1907614
56223 1907614 1843532 1775690 1705425 1633442 1560822 1489725 1421657 1356066 1292150 1231014 1174378
56212 1174378 1122211 1073380 1027699 985573 946550 909975 876262 845910 818176 792228 768551
56201 768551 747670 728672 710672 694478 681024 669395 658259 647954 639211 631182 622916 615519
56189 615519 610575 607430 604330 601206 599110 597834 596422 595175 594909 594993 594348 593611 594198 595963 597747 599337
56173 599337 600927 601742 601412 601654 604259 608335 611768 614393 617525 621425 625662 630977 638254 646502 654189
56158 654189 661728 670439 680132 690082 701185 714588 729328 743983 759543 777937 798910 821243
56146 821243 846007 875609 910576 950440 996901 1052896 1119055 1194132 1278304 1372907 1477315
56135 1477315 1588979 1705968 1826450 1946095 2059026 2161255 2250975 2326785 2388954 2441664
56125 2441664 2490393 2536969 2579541 2616282 2645845 2665140 2670715 2662579 2643757 2616392 2581002 2538510
56113 2538510 2489320 2430722 2358764 2272688 2174898 2067680 1953503 1837749 1727084 1625062
56103 1625062 1532418 1450801 1382392 1326380 1279714 1241129 1210856 1187135 1167136 1150904 1140240
56092 1140240 1134072 1129186 1125186 1124275 1126219 1128136 1129367 1132001 1136242 1139801 1142372 1146271 1151922 1157003
56078 1157003 1160757 1165094 1170841 1176966 1183989 1193954 1206422 1218566 1229821 1242443 1257113 1272124
56066 1272124 1287235 1304078 1322378 1340095 1357616 1377398 1399193 1420162 1440052 1461581 1485280
56055 1485280 1508758 1531429 1555149 1579663 1602388 1623253 1644932 1667867 1690031 1711850 1736090
56044 1736090 1762533 1788257 1813518 1841679 1872863 1903614 1933486 1965893 2001675 2038023 2074517
56033 2074517 2113834 2155551 2195930 2234990 2277066 2323030 2368837 2413290 2460230 2511264 2563279
56022 2563279 2615051 2669363 2726738 2784114 2841700 2903985 2972087 3042327 3114103 3191436 3274829
56011 3274829 3359696 3445101 3535849 3633581 3734212 3836592 3944892 4059763 4176271 4293655
56001 4293655 4417898 4551489 4690124 4832882 4985741 5151200 5324405 5503638 5694523
55992 5694523 5899764 6115074 6339517 6579287 6836962 7108118 7392963 7699720 8032089
55983 8032089 8385585 8760846 9167384 9609272 10081364 10585302 11134371 11736398 12387789
55974 12387789 13091389 13863547 14716020 15648797 16669586 17802152 19066701 20472442 22040152
55965 22040152 23811659 25827473 28120114 30743862 33788536 37354248 41545959 46515007
55957 46515007 52482704 59713895 68509076 79241226 92342940 108197964 127042526
55950 127042526 148944965 173778444 201169233 230576181 261464466 293140270 324023919
55943 324023919 351017442 369975008 377324247 371642345 354026693 327308910 294993603
55936 294993603 260499962 226668778 195431767 167754802 143878572 123632452 106632159
55929 106632159 92396569 80459154 70432426 61989739 54836529 48728314 43487099
55922 43487099 38972695 35055210 31628858 28625829 25993916 23675423 21620616 19801444
55914 19801444 18194808 16766876 15486801 14340477 13317483 12397811 11563083 10807515
55906 10807515 10126221 9504728 8930512 8403118 7922591 7479038 7063425 6678013 6326242
55897 6326242 6002027 5698203 5416066 5157639 4917386 4690294 4479666 4288595 4111760
55888 4111760 3943667 3787205 3646176 3516721 3393827 3279255 3175633 3079441 2986926 2900297
55878 2900297 2821012 2743359 2661766 2578641 2498473 2420146 2341588 2266015 2196593 2130193 2062913
55867 2062913 1996775 1934772 1874410 1812549 1751904 1696489 1645011 1594655 1547100 1504896 1465953
55856 1465953 1427305 1390433 1357540 1326576 1295268 1266082 1241728 1219517 1195473 1170455 1147060
55845 1147060 1124106 1099481 1075021 1053360 1033075 1011886 991458 974106 957915 940108 922198
55834 922198 906889 892799 877165 861018 846833 833679 819453 805424 793867 783622 772527
55823 772527 761785 753374 745519 735328 723731 713285 703268 691462 678778 667601 657413 646437
55811 646437 635765 627549 620763 613064 605253 599758 596263 592933 590402 590421 591943 592607 592856 594709 597783
55796 597783 600400 603294 608214 613949 617621 618964 619676 619551 617065 612906 609241 606053 601640 596109 591172
55781 591172 587072 582658 577656 571925 563539 550790 535375 520710 508063 497115 488902 484867 484035
55768 484035 484510 486886 492771 500606 506243 507395 504618 498623 489723 479513 470095 461705 453494 445930
55754 445930 439971 434667 428325 421308 415038 409002 401566 393022 385080 377899 370358 362639 355922 350143
55740 350143 344550 339720 336469 333669 329870 326146 324440 323954 322203 318964 316088 313950 311265 308004
55726 308004 305358 302922 298932 293308 287715 282696 277418 272177 268380 266014 263729 261439 260419 260881
55712 260881 261906 263616 266952 271415 275456 278961 282912 286859 289309 290441 291753 293071 292481 289351
55698 289351 284921 279891 273919 267533 261999 257163 251787 246132 241776 238819 235732 232109 229154 227311
55684 227311 225856 224956 225713 227950 230359 232991 237139 242588 247567 251648 256037 260650 263614 264254 264008
55669 264008 263701 262479 260219 258493 258075 257725 256460 254996 253975 252758 250972 249439 248664 248077 247498 247646
55653 247646 248511 249026 249053 249878 251983 254077 255078 255368 255387 254743 253518 252683 252283 250814 247304 242643 237996
55636 237996 233330 228323 223359 218766 214250 209741 205711 202177 198569 194979 192250 190480 188755 186697
55622 186697 184879 183441 181823 180217 179677 180329 180979 180937 180681 180290 178866 176133 173083 170443 167920 165401
55606 165401 163364 161629 159336 156704 155155 155057 154997 153974 152654 151656 150332 148240 146302 145333 144667 143376
55590 143376 141752 140593 139938 139463 139303 139698 140463 141285 141931 142009 141408 141037 141975 143921 145726 147378 149903
55573 149903 153310 156539 159662 164162 170428 176895 182404 187564 192849 197207 199670 200751 201067 199998
55559 199998 196944 192692 188438 184501 180877 177865 175298 172358 169017 166419 165004 163601 161318 158991
55545 158991 157696 157107 156376 155457 154490 153063 151194 149965 150076 150853 151636 152896 154888 156469 156657 156304
55529 156304 156806 158041 158997 159601 160476 161470 161823 161382 160466 158935 156477 153454 150501 147628 144626 141942
55513 141942 140229 139339 138535 137456 136226 134913 133488 132014 130462 128691 126881 125463 124461 123555 122932
55498 122932 123110 123678 123386 121975 120790 120893 121666 121991 121754 121385 120834 119980 119275 119133 119338 119690 120470 121637
55480 121637 122399 122273 121791 121521 121320 121098 121327 122024 122241 121400 120239 119694 119700 119833 120091 120271 119672 118330 117459
55461 117459 117644 117649 116192 113941 112491 112139 111957 111466 111023 110942 111231 111833 112348 112071 111019 110255 110488 111141
55443 111141 111513 111900 112686 113296 113141 112776 112957 113352 113271 112909 112724 112357 111428 110739 111364 113030 114583 115526
55425 115526 116042 116081 115656 115513 116257 117229 117369 116789 116385 116383 116475 116937 118291 120121 121417 121907 122029 121893 121371
55406 121371 120925 121159 121682 121517 120538 119547 119024 118727 118465 118378 118517 118812 119336 120043 120538 120678 120936 121558 121969
55387 121969 121710 121268 121127 120737 119467 117883 116966 116647 116261 115817 115553 114820 112877 110497 109342 109901 111224
55370 111224 112418 113133 112852 111263 109289 108406 108781 109290 109373 109588 110201 110552 110208 109701 109747 110508 111806 113276
55352 113276 114203 113980 112891 111708 110659 109532 108558 108190 108095 107496 106568 106370 107215 108121 108148 107426 106598 106053
55334 106053 105971 106403 107081 107678 108348 109440 110740 111634 111910 111748 111110 109979 108986 108818 109084 108745 107664 106695
55316 106695 106170 105411 103995 102429 101206 100110 99021 98613 99621 101840 104318 106271 107570 108586 109693
55301 109693 110703 110900 109948 108546 107709 107637 107840 108083 108515 109046 109405 109725 110349 111072 111337 111143 111073 111417 111937
55282 111937 112478 113147 113870 114353 114509 114427 114115 113751 113828 114367 114410 113181 111430 110590 110809 110901 110177 109141 108280
55263 108280 107348 106189 105319 105207 105680 106415 107406 108717 110247 111872 113363 114215 114118 113517 113065 112649 111712
55246 111712 110409 109577 109538 109780 109936 110304 111205 112440 113516 113911 113253 111812 110646 110592 111287 111827 112016 112204
55228 112204 112332 112213 112386 113440 114713 114902 113903 112805 112104 111323 110429 110126 110414 110346 109667 109379 110030 110686
55210 110686 110330 109268 108460 108322 108826 109950 111373 112400 112721 112647 112360 111714 110987 110833 111142 111006 110239 109818
55192 109818 110230 110582 110159 109772 110485 111825 112422 111972 111464 111641 112051 111666 109969 107487 105512 105055 105960
55175 105960 107305 108543 109677 110518 110773 110999 112316 114717 116670 116987 116216 115629 115661 116007 116432 116732 116535
55158 116535 115789 114946 114193 113216 112188 112068 113220 114595 115143 115280 116013 117272 118123 118192 117870 117429 116812 116081
55140 116081 115295 114198 112740 111649 111708 112678 113603 114012 114167 114306 114312 114061 113612 113121 112902 113295 114088 114479 114070
55121 114070 113541 113781 114743 115688 116228 116490 116575 116531 116659 117177 117710 117730 117432 117560 118420 119463 119899 119375 118138
55102 118138 116880 116310 116563 117118 117474 117699 118094 118683 119317 119950 120467 120624 120531 120788 121641 122418 122374 121809 121676
55083 121676 122255 122853 122832 122393 122260 122923 124225 125453 125858 125293 124296 123446 122824 122255 121738 121365 121047 120637
55065 120637 120193 119925 120033 120674 121826 123097 123992 124507 125087 125880 126523 126843 127193 127729 127849 126862 124933 122985
55047 122985 121866 121785 122305 122688 122565 122364 122697 123405 123849 124157 125226 127169 128774 129098 128696 128528 128486 127951
55029 127951 127108 126574 126152 125116 123529 122222 121466 120688 119582 118616 118193 118093 118069 118371 119278 120477 121271
55012 121271 121225 120482 119561 118960 118787 118794 118803 118947 119409 120148 121011 121877 122517 122631 122277 121975 122117 122579 123186 124166
54992 124166 125740 127589 129148 130239 131029 131628 132110 132689 133455 134107 134285 134031 133633 133284 133161 133574 134629
54975 134629 135963 137074 137768 138097 138149 138069 137898 137258 135707 133704 132579 133122 134727 136422 138133 140292
54959 140292 142764 144947 146585 147670 147864 146839 145067 143469 142291 140983 139175 137171 135514 134614 134782
54944 134782 135987 137489 138275 138040 137397 137058 137131 137269 137182 136932 136931 137625 139007 140535 141668 142327 142734 143142
54926 143142 143920 145471 147706 149956 151808 153691 156237 159485 163243 167874 173967 181390 189302 197097
54912 197097 204756 212146 218410 222341 223236 221390 217799 213235 207638 200709 193029 185999 180419 175763
54898 175763 171214 166804 162997 159666 156232 152516 148873 145701 143338 142156 142209 142957 143790 144647 145800
54883 145800 147316 149139 151353 153941 156614 159269 162252 165833 169860 174323 179645 185904 192360 198362
54869 198362 204155 210127 215780 220168 222848 223676 222226 218330 212795 206750 200592 194280 188128 182433
54855 182433 176819 170938 165413 161058 157530 153840 149921 146619 144408 143196 143043 143816 144301 143007 139950
54840 139950 136495 133492 130780 128583 127864 128902 130690 132208 133345 134240 134765 135121 135886 136996 137530 137016
54824 137016 136123 135616 135415 135135 134773 134390 133871 133472 133828 134936 135828 135835 135457 135435 135601 135351 134695 134143 133917
54805 133917 133893 134068 134504 134984 135178 135037 134766 134544 134504 134774 135353 136068 136741 137198 137252 137039 137278 138657 140912
54786 140912 142992 144220 144801 145191 145548 145926 146424 146981 147442 147917 148553 149011 148782 148150 148159 149460 151788 154729
54768 154729 158350 162831 168033 173673 179438 184875 189820 195066 201888 210537 219697 227636 233413 236881
54754 236881 238183 237518 234902 230038 222981 214937 207570 201361 195458 189362 183807 179569 176291 173102
54740 173102 169788 166778 164495 163235 163101 163558 163511 162322 160386 158496 157226 157150 158806 161826 164790 166654
54724 166654 167871 169518 171823 174241 176623 179472 183187 187662 192644 197998 203609 209276 214620 218885
54710 218885 220998 220085 216050 209723 202583 196081 190727 185825 180490 174846 169761 165650 162254 159506
54696 159506 157686 156618 155619 154488 153742 153573 153377 152671 151722 150890 150090 149240 148504 147743 146544 145108 144212
54679 144212 143876 143081 141387 139835 139463 139806 139785 139326 139114 139280 139318 138938 138215 137208 136087 135326 135141 135121
54661 135121 134885 134613 134448 134056 133431 133441 134728 136573 137722 137934 137894 138028 138186 138163 137810 136994 136101 136079 137274
54642 137274 138809 139819 140607 141621 142098 141081 139296 138487 139032 139640 139499 139246 139481 139616 138899 137696 136987
54625 136987 137089 137427 137317 136639 135964 136107 137331 139016 140389 141361 142215 142722 142266 140818 139202 138323 138552
54608 138552 139719 141195 142086 141997 141587 141819 142718 143437 143468 143106 142701 142198 141609 141329 141634 142247 142596 142259 141142
54589 141142 139601 138441 138410 139504 141007 142162 142653 142543 142101 141630 141230 140826 140535 140716 141338 141759 141565
54572 141565 141338 142007 143662 145498 146776 147309 147293 147159 147378 147878 147915 147090 146133 145952 146265 146026 145083 144495
54554 144495 145147 146859 148912 150694 151693 151602 150796 150187 150350 151163 152330 153829 155721 157902 160191 162337
54538 162337 164063 165370 166654 168153 169532 170406 170967 171583 172171 172571 173104 173926 174220 173086 171070 169704
54522 169704 169531 169589 168996 167938 166845 165586 163972 162256 160705 159306 158229 157895 158228 158452 157980 156939
54506 156939 155635 154199 153001 152585 152826 152868 152357 152020 152486 153205 153221 152538 152039 152363 153389 154578 155365 155429
54488 155429 154957 154499 154359 154359 154316 154352 154547 154783 155171 156145 157776 159469 160720 161764 163052 164504 165697 166504
54470 166504 167106 167625 168123 168783 169742 170934 172316 173990 175864 177450 178286 178363 177969 177344 176660 176042 175466
54453 175466 174865 174404 174240 174028 173233 172060 171421 171715 172284 172492 172648 173252 173934 173925 173206 172423 171836 171123 170154
54434 170154 169276 168727 168355 168054 167974 168092 167925 166995 165446 164016 163372 163530 163943 164169 164362 164861 165402 165211
54416 165211 164056 162817 162617 163614 165017 166084 166730 167225 167767 168409 169065 169383 168893 167557 166172 166015 167882
54399 167882 171410 175394 178776 181280 183122 184425 185141 185405 185563 185831 186087 186087 185762 185414 185639 186854 188668
54382 188668 189984 190015 189005 187672 186320 184957 183864 183281 182714 181428 179635 178362 178004 177846 177265 176554
54366 176554 176199 176111 176111 176502 177514 178702 179485 179935 180490 181255 182123 183250 184751 186152 186695 186093 184548 182292
54348 182292 179634 177262 175917 175716 176208 177034 178061 178952 179180 178651 177952 177748 178089 178476 178486 178259 178393 179408
54330 179408 181254 183393 185369 187226 189371 192069 195033 197395 198209 197223 195184 193157 191650 190606 189939
54315 189939 189512 188695 186673 183482 180165 177651 175921 174477 173114 171917 170993 170549 170773 171334 171446 170855
54299 170855 170261 170312 170703 170798 170663 170771 171037 170928 170401 169999 170032 170242 170315 170196 169874 169428 169299 170043 171614 173319
54279 173319 174607 175557 176437 177203 177676 177943 178289 178757 178994 178581 177513 176297 175507 175245 175170 175061 175067 175321 175620
54260 175620 175727 175735 175877 176208 176791 177926 179771 181808 183192 183657 183753 184058 184548 184920 185202 185633 185988 185503
54242 185503 183819 181742 180549 180452 180334 179348 178188 178027 178562 178182 176182 173744 172294 171767 171201 170393 170003
54225 170003 170299 170672 170463 169694 168909 168708 169445 170945 172426 173007 172465 171402 170703 170838 171503 171799 171033 169579
54207 169579 168687 169190 170596 171707 171820 171068 169989 169235 169407 170581 172048 172988 173336 173570 173774 173501 172644
54190 172644 171896 172065 173191 174580 175526 175840 175785 175646 175459 175133 174747 174494 174314 173820 172738 171260 169850
54173 169850 168852 168369 168268 168215 167889 167293 166643 165979 165205 164486 164077 163704 162791 161548 161113 162062 163408 163796
54155 163796 163246 162947 163599 164785 165905 166865 167664 167971 167493 166465 165498 165073 165227 165662 166131 166725 167649 168724
54137 168724 169439 169594 169523 169515 169439 169200 169054 169112 169027 168654 168556 169287 170564 171735 172709 173808 174966 175751 175969 175654
54117 175654 174749 173394 172278 171964 172102 172009 171838 172366 173790 175532 177160 178658 179794 180102 179677 179228 179204
54100 179204 179458 179853 180490 181154 181263 180592 179483 178263 177075 176376 176845 178511 180573 182320 183672 184726
54084 184726 185419 185820 186079 185925 184962 183636 183067 183588 184334 184720 185408 187132 189371 191035 191946 192729 193603
54067 193603 194128 194006 193432 192758 192374 192773 194114 195797 197008 197623 198084 198510 198564 198199 197929 198162 198785 199585
54049 199585 200667 202198 204125 206423 209304 212804 216439 219753 223160 227668 233601 240045 245905 251140
54035 251140 256497 262381 268640 275365 282968 291220 299009 305577 311368 317139 322860 328227 333670 339897
54021 339897 346754 353519 360144 367211 374692 381861 388601 395718 403465 410520 414873 415172 410905 402116
54007 402116 389580 374789 359239 343904 329503 316657 305518 295771 287327 280427 274822 269606
53995 269606 264382 259907 256961 255150 253462 251511 249514 247467 245147 242683 240446 238453 236470 234535
53981 234535 232858 231308 229542 227516 225506 223830 222883 223076 224136 224801 223960 221994 220342 219787 219818 219721
53965 219721 219561 219879 220917 222413 223914 225115 226101 227227 228530 229434 229401 228774 228531 229232 230664 232491
53949 232491 234704 237301 240039 242746 245563 248656 251987 255563 259636 264425 269781 275249 280366 284864
53935 284864 288841 292794 297196 301887 306102 309296 311778 314308 317233 320297 323257 326374 330130 334622
53921 334622 339470 344329 349270 354573 360261 366121 372126 378601 385853 393738 401673 409026 415570 421685
53907 421685 428012 434657 440782 445241 447557 447947 446546 443291 438772 434441 431411 429301 426815 423233
53893 423233 418903 414427 409907 405028 399485 393188 386195 378503 370004 360878 352068 344843 339533 335071
53879 335071 330208 324879 319920 315834 312490 309781 307746 305996 303765 300800 297617 294671 291787 288738
53865 288738 285925 284076 283572 284448 286820 290997 297268 305839 316767 329694 343792 358315 373213
53852 373213 388860 404973 419825 430652 434988 431912 422311 408157 391454 373652 355616 337911
53840 337911 321085 305841 292922 282741 275138 269509 265095 261125 256998 252677 248780 245940 244069
53827 244069 242525 240969 239721 239147 239086 239105 239060 239088 239164 239031 238613 238274 238564 239736 241628 243930 246495 249328
53809 249328 252317 255143 257581 259876 262653 266372 270878 275532 279784 283662 287717 292521 298136 304047
53795 304047 309583 314386 318491 322108 325445 328691 332047 335569 338996 341781 343414 343794 343289 342386 341297
53780 341297 339869 337795 334856 331096 326837 322426 317871 312899 307561 302563 298632 295623 292602 288821
53766 288821 284244 279164 273860 268812 264811 262399 261412 261309 261685 262216 262379 261697 260183 258223 256034 253500
53750 253500 250519 247261 244124 241572 239921 239069 238474 237558 236134 234439 232921 232085 232281 233366 234714
53735 234714 235695 236035 235714 234846 233912 233664 234361 235358 235871 235930 236138 236720 237461 238457 240227 242876 245744 248121
53717 248121 249885 251204 252088 252648 253457 255173 257864 260996 263993 266539 268438 269594 270253 271043 272515
53702 272515 274660 276981 279017 280738 282435 284386 286787 289824 293529 297526 301263 304613 307928 311308
53688 311308 314148 315810 316512 317112 318093 319180 319908 320057 319497 318141 316328 314813 314034 313612 312903 311838
53672 311838 310837 310080 309288 308282 307292 306530 305763 304623 303226 302160 301805 301916 301950 301657 301202 300870 300787 300836
53654 300836 300761 300451 300201 300481 301294 302033 302286 302473 303224 304314 304892 304747 304638 305205 306262 307516 309246 311626
53636 311626 313897 314969 314651 313730 313107 313445 315340 318955 323448 327504 330674 333682 337233 341093 344581
53621 344581 347471 350074 352790 355903 359584 363691 367702 371085 373726 375909 377982 380140 382411 384800
53607 384800 387510 390927 395132 399491 403054 405562 407776 410641 414331 418259 421811 424768 427093 428633
53593 428633 429196 428837 427883 426627 425096 423308 421637 420609 420224 419761 418530 416581 414503 412738 411346
53578 411346 410210 409071 407582 405693 403884 402588 401535 400148 398478 397268 397102 397929 399461 401420 403380
53563 403380 404966 406505 408961 412887 417767 422603 426777 430090 432409 433650 433899 433264 431852 430094 428687
53548 428687 427888 427181 426047 424809 424333 425116 427057 429889 433371 437148 440927 444817 449113 453741 458264
53533 458264 462488 466814 471902 478282 486244 495769 506454 517780 529625 542307 556068 570712 585866
53520 585866 601361 617189 633334 649871 667112 685431 705010 725937 748355 772191 796771
53509 796771 821110 844843 868627 893392 919283 945571 971488 996860 1021926 1046843 1071511
53498 1071511 1095705 1119297 1142431 1165503 1188779 1211974 1234434 1255852 1276607 1297212 1317643
53487 1317643 1337450 1356384 1374643 1392553 1410271 1427837 1445320 1462776 1480093 1496879 1512591
53476 1512591 1526876 1539781 1551452 1561677 1569929 1575835 1579268 1579962 1577573 1572326 1565061 1556234 1545306
53463 1545306 1531680 1515884 1499160 1482148 1464678 1446713 1428679 1410701 1392222 1372632 1351751
53452 1351751 1329549 1305993 1281478 1256913 1233059 1210130 1188238 1167715 1148660 1130692 1113626
53441 1113626 1098035 1084584 1073112 1062916 1053848 1046517 1041375 1038033 1035636 1033650 1032164 1031678 1032742
53428 1032742 1035703 1040594 1047233 1055301 1064398 1074192 1084682 1096236 1109255 1123901 1140255 1158521
53416 1158521 1178792 1200618 1223141 1245925 1269591 1295409 1324130 1355257 1387616 1420648 1454974
53405 1454974 1491698 1531390 1573863 1618659 1665370 1713656 1763345 1814623 1867851 1923091 1979952
53394 1979952 2037848 2096229 2154626 2212758 2270664 2328510 2386279 2443807 2500966 2557424 2612259
53383 2612259 2664249 2712721 2757852 2799996 2839062 2874698 2906827 2935682 2961367 2983459 3000995
53372 3000995 3012945 3018929 3019467 3015291 3006350 2991644 2969986 2940793 2904296 2861407 2813410 2761462
53360 2761462 2706288 2648525 2589165 2529313 2469595 2410196 2351376 2293568 2237078 2182215 2129563
53349 2129563 2079468 2031309 1983945 1936906 1890407 1844223 1797581 1750540 1704544 1661019 1620134
53338 1620134 1581467 1545143 1511559 1480595 1451958 1425877 1402716 1382125 1363273 1345695 1329285
53327 1329285 1313757 1298794 1284495 1270969 1257621 1243557 1228651 1213658 1199425 1186542 1175578
53316 1175578 1166875 1160103 1154614 1150229 1147146 1145203 1144046 1144029 1146140 1150779 1157229 1164540 1172403 1180981
53302 1180981 1190573 1201704 1214985 1230512 1247856 1266899 1288105 1311600 1336556 1362071 1388241
53291 1388241 1415760 1444697 1474283 1503728 1532672 1560824 1587708 1612956 1636438 1657919 1676864
53280 1676864 1692885 1706215 1717486 1726918 1733859 1737229 1736477 1732073 1725017 1715954 1704846 1691441 1675805
53267 1675805 1658221 1638740 1617039 1592819 1566311 1538308 1509672 1480801 1451558 1421656 1391013
53256 1391013 1359717 1327900 1295812 1263907 1232614 1202065 1172238 1143327 1115647 1089131 1063230
53245 1063230 1037448 1011748 986238 960716 934870 908789 882932 857657 833219 810280 789870
53234 789870 772424 757158 742912 729423 717276 706684 696976 687393 677745 667924 657427 645910
53222 645910 633821 621813 609832 597397 584551 571783 559137 546236 533147 520426 508231
53211 508231 496274 484905 475244 467648 460903 453648 445990 438914 432668 426676 420669 414860 409018 402379
53197 402379 394734 386879 379629 372880 365991 358747 351670 345542 340749 336906 333086 328692 324131 320405
53183 320405 317982 316304 314387 311639 308091 304271 301019 299053 298390 298241 297666 296327 294565 292883 291491
53168 291491 290352 289545 289440 290412 292372 294668 296524 297505 297664 297387 297140 297119 297066 296621 295886 295392 295400 295551 295372
53149 295372 294800 293962 292756 291020 288925 286874 285099 283661 282696 282412 282828 283673 284474 284699 284053 282778
53133 282778 281494 280624 280142 279872 279672 279311 278620 277928 277768 277975 277706 276730 275997 276389 277509 278373 278769 279159
53115 279159 279648 279913 279862 279541 278639 276912 274928 273535 272733 271917 271064 270705 270721 270264 269081 267955 267515 267406
53097 267406 267023 266253 265143 263606 261940 260901 260685 260426 259297 257630 256374 255820 255531 255272 255335 255923 256668
53080 256668 256926 256444 255680 255391 255726 255908 255143 253767 252964 253310 254215 254971 255707 256930 258623 260266 261438
53063 261438 262018 262083 261918 261929 262226 262495 262484 262368 262451 262828 263517 264577 265825 266768 267135 267221 267445 267816 268022 267771
53043 267771 266835 265151 263130 261524 260663 260128 259468 258857 258650 258633 258244 257343 256297 255388 254604 253997 253887 254538
53025 254538 255811 257164 257974 257938 257298 256589 256168 256077 256270 256672 257005 256974 256788 257121 258360 260121 261641 262413
53007 262413 262365 261797 261266 261163 261218 260830 260011 259504 259725 260175 260264 260189 260444 260923 261101 260812 260347 260002 260102 261116
52987 261116 263120 265283 266600 267135 267902 269394 270868 271395 271168 271322 272607 274567 276104 276689 276861 277482
52971 277482 278706 279978 280986 282176 284114 286734 289497 292002 294120 295788 297065 298220 299418 300449
52957 300449 301039 301273 301434 301549 301406 300882 299913 298294 295814 292598 289065 285624 282561 280019 277858 275751
52941 275751 273709 272300 271984 272423 272815 272768 272454 272089 271686 271286 270980 270657 270103 269400 268867 268558 268162 267553
52923 267553 267107 267228 267745 268071 267977 267942 268566 269666 270279 269792 268810 268533 269375 270646 271519 271741 271303 270209
52905 270209 268900 268207 268245 267884 266028 263131 260754 259862 260175 260980 261771 262111 261645 260534 259452 258943 259117
52888 259117 259938 261354 263020 264328 264912 264895 264561 264037 263332 262418 261298 260147 259298 258821 258329 257523 256706
52871 256706 256324 256212 255966 255885 256805 258885 261267 263149 264559 265798 266827 267687 268989 271345 274464 277269
52855 277269 278794 278770 277607 276147 275194 274824 274277 272824 270592 268221 265901 263284 260323 257602 255572
52840 255572 253844 251692 249102 246827 245316 244012 242079 239685 238081 238288 239956 241699 242323 241607 240182
52825 240182 239025 238981 240345 242659 244984 246486 246825 246196 245161 244318 243901 243722 243632 243906 244961 246784 248936
52808 248936 251084 253202 255231 256867 257921 258699 259782 261422 263224 264406 264287 262570 259366 255168 250818
52793 250818 247206 244737 243150 242044 241433 241491 241889 241900 241209 240154 239100 238094 237328 237271 237963 238692 238910
52776 238910 239054 239853 241239 242596 243828 245376 247246 248778 249476 249503 249239 248920 248827 249225 249879 250030 249187
52759 249187 247656 246118 244951 244146 243590 243181 242824 242493 242275 242322 242771 243625 244564 245069 244956 244645 244682 245205
52741 245205 246086 247284 248635 249611 249908 250126 251162 252987 254639 255550 256195 257279 258905 260880 263250 266049
52725 266049 268855 271061 272477 273355 273943 274193 273884 272930 271637 270511 269618 268347 266172 263572 261705 261120
52709 261120 261270 261370 261271 261281 261555 261942 262271 262595 263221 264372 265580 265701 264106 261777 260573 261294 262992
52692 262992 264250 264520 264069 263361 262884 263032 263727 264531 265326 266382 267580 268278 268289 268230 268398 268094 266857 265714
52674 265714 266135 268048 269888 270610 270607 270500 269966 268329 265812 263518 262296 261982 261809 261393 261203 261987 263793
52657 263793 265761 267025 267649 268496 270324 273213 276690 280034 282515 283690 283701 283160 282614 282103 281216 279536
52641 279536 277078 274340 271909 270095 268984 268697 269306 270502 271668 272384 272652 272637 272468 272289 272159 271826 271046
52624 271046 270277 270539 272228 274403 275661 275465 274286 272753 271128 269487 267950 266673 265804 265475 265717 266510
52608 266510 267937 269999 272149 273413 273309 272407 271678 271584 272092 273209 274990 277183 279362 281319 282984 284179
52592 284179 284881 285548 286627 287815 288383 288207 287935 288046 288389 288775 289453 290601 291804 292507 292723 292886 293181
52575 293181 293406 293452 293519 293823 294326 294842 295213 295309 295053 294554 294062 293649 292993 291698 289813 287844 286243 285072
52557 285072 284257 283891 284036 284377 284419 284026 283525 283214 283019 282713 282281 281967 282035 282468 282829 282504 281331 279875 278835
52538 278835 278246 277635 276896 276567 277116 278354 279728 280841 281511 281705 281712 282094 283151 284534 285597 285976 285729
52521 285729 285155 284606 284276 284050 283765 283684 284348 285838 287555 288893 289813 290632 291740 293685 296935 301082 304832
52504 304832 307319 309048 310962 312933 313870 313084 310854 307765 304269 300999 298733 297560 296471 294259 290769
52489 290769 287059 284337 282881 282024 281155 280471 280575 281463 282373 282735 282805 283142 283866 284718 285452 285801 285492 284815
52471 284815 284821 286387 289249 292429 295395 298282 301210 304051 306847 309805 312758 315136 316688 317891 319474
52456 319474 321629 323689 324475 323240 320458 317383 314568 311284 306875 302169 298717 296914 295769 294448
52442 294448 293067 291829 290370 288420 286434 285063 284456 284394 284650 284882 284650 283972 283530 283921 284910 285696 285726
52425 285726 285032 284052 283347 283276 283735 284363 285034 285927 287088 288331 289695 291596 294312 297640 301255 305077
52409 305077 309175 313682 318913 325125 331978 338762 345473 353089 362233 371902 380055 385222 387059 385645
52395 385645 381064 373815 365078 356175 347911 340517 334089 328863 325099 322724 321248 320181 319530 319692 320823
52380 320823 322575 324475 326286 327917 329350 330877 333024 335957 339250 342554 346180 350617 355738 360884
52366 360884 365578 369646 372813 374772 375756 376538 377614 378700 379210 379012 378499 378136 378122 378391 378780 379238 379901
52349 379901 380956 382426 384209 386221 388371 390508 392638 395190 398660 402966 407461 411786 416300 421444
52335 421444 427028 432640 438572 445752 454686 464953 475990 487987 501645 517212 534087 551385
52323 551385 568674 586235 604735 624674 645970 668037 690228 712057 733103 753071 772209
52312 772209 791274 810658 829745 847595 864158 880278 896543 912705 928314 943280 957544
52301 957544 970755 982700 993672 1004022 1013667 1022364 1030095 1036722 1041614 1044111 1044183 1042139 1037946 1031394
52287 1031394 1022881 1013408 1003763 994145 984659 975693 967656 960675 954727 949833 946105 943862 943737 946306
52273 946306 951493 958523 966591 975371 984889 995192 1006344 1018610 1032428 1048031 1064978 1082082
52261 1082082 1098076 1112525 1125981 1139217 1152614 1166289 1180258 1194086 1206852 1218028 1228079
52250 1228079 1237631 1246380 1253467 1258677 1262470 1264880 1265107 1262278 1256027 1246441 1234180 1220705 1207533
52237 1207533 1194999 1182376 1169297 1156306 1143797 1131353 1118678 1106428 1095462 1085794 1076915 1068715
52225 1068715 1061439 1055021 1049123 1043690 1038995 1035233 1032527 1031169 1031431 1033150 1035830 1039082 1042724 1046590
52211 1046590 1050574 1054747 1059253 1064167 1069583 1075614 1082082 1088452 1094356 1099970 1105612 1111136 1115986 1119815
52197 1119815 1122857 1125792 1129316 1133562 1137928 1141731 1145141 1149028 1153735 1158510 1162500 1165817 1169122 1172572
52183 1172572 1175754 1178381 1180338 1181109 1179836 1176166 1170594 1163806 1155977 1146906 1136648 1125805 1115233
52170 1115233 1105584 1097186 1090301 1085193 1081714 1079117 1076808 1075260 1075550 1077875 1081182 1084571 1088307 1092905
52156 1092905 1097835 1101962 1104918 1107185 1109019 1110134 1110507 1110680 1111027 1111309 1111241 1111048 1111145 1111605 1112271 1113169 1114503
52139 1114503 1116260 1118017 1119229 1119738 1119951 1120388 1121103 1121851 1122920 1125439 1130577 1138736 1149863 1164122 1181691
52124 1181691 1202104 1224486 1248528 1274678 1303228 1333660 1365051 1396704 1428174 1459045 1488996
52113 1488996 1517949 1545872 1572467 1597104 1619018 1637576 1652601 1664497 1673948 1681403 1686896 1690319
52101 1690319 1691794 1691852 1691297 1690737 1690057 1688476 1685363 1680849 1675469 1669414 1662481 1654577 1645757 1635744 1623857
52086 1623857 1609596 1593086 1574957 1556183 1538087 1521995 1508546 1497451 1488204 1480915 1476253 1474709
52074 1474709 1476099 1479741 1484952 1491381 1499072 1508384 1519806 1533651 1549661 1566939 1584457 1601767
52062 1601767 1619037 1636306 1652918 1667884 1680691 1691565 1701037 1709456 1716865 1723064 1727719 1730450
52050 1730450 1730927 1729024 1725076 1719844 1713808 1706339 1695988 1681897 1664647 1645497 1625158 1603665 1581075
52037 1581075 1557756 1534159 1510854 1488687 1468370 1449881 1432737 1416876 1402750 1390450 1379219
52026 1379219 1368145 1357031 1346365 1336536 1327295 1317938 1307988 1297717 1287897 1278854 1269975 1260378 1249972
52013 1249972 1239521 1229715 1220488 1211249 1201468 1190972 1179889 1168336 1155982 1142051 1125986 1108053
52001 1108053 1089053 1069538 1049558 1029060 1008156 987102 966346 946492 927871 910251 893368
51990 893368 877585 863559 851365 840465 830413 821004 811774 802045 791649 780994 770302 759354
51978 759354 748097 736783 725248 712835 699469 686149 673827 662352 651197 640683 631703 624535
51966 624535 618805 614531 612404 612862 615492 619562 624660 630638 637356 644745 652805 661175 668852 674590
51952 674590 677614 677868 675699 671466 665500 658304 650653 643301 636615 630666 625762 622751 622569 625524 631194
51937 631194 638986 648545 659557 671369 683099 694158 704458 713904 721704 726417 726890 723102 715957
51924 715957 706301 694295 679788 663101 645285 627612 610920 595407 580948 567495 555128 543890
51912 543890 533755 524770 516988 510181 503930 498220 493734 491300 491207 493295 497488 503754 511595 520076
51898 520076 528567 537154 546100 555106 563270 569688 573924 575987 575904 573433 568323 560940 552474 544339 537537
51883 537537 532710 530493 531413 535613 543043 553779 567677 583863 601130 618786 636544 653475 667821
51870 667821 678149 684198 686294 684537 679041 670588 660391 649244 637280 624484 611083 597463
51858 597463 583943 570776 558328 547284 538560 532762 529703 528673 529140 530805 533038 534856 535725 535902
51844 535902 535608 534273 531035 525752 519080 511784 504395 497372 491089 485623 480866 476896 473977 472244
51830 472244 471559 471657 472277 473271 474713 476753 479136 481055 481769 481258 480024 478361 476110 473098 469524 465922
51814 465922 462900 460886 459942 459864 460552 462156 464781 468254 472294 476611 480582 483188 483792 482848 481351 479630
51798 479630 477172 473665 469683 466124 463336 461106 459168 457344 455321 452677 449296 445527 441810 438245
51784 438245 434710 431449 429282 428982 430368 432261 433425 433470 432834 432089 431464 430867 430197 429643 429791 431310 434389
51767 434389 438600 443518 449435 457202 467291 479122 491384 502956 513400 522618 530183 535328 537607
51754 537607 537249 534566 529292 521047 510410 498944 487964 477687 467761 458152 449155 441002 433990
51741 433990 428740 425845 425314 426732 429866 434727 441178 448861 457493 466903 476758 486581 495976 504586
51727 504586 511897 517421 521116 523394 524835 526108 527975 530759 533704 535268 534341 531088 526579 521876
51713 521876 517558 513813 510706 508324 506640 505199 503129 499788 495417 490879 486800 483331 480797 480157
51699 480157 482397 487470 493968 499840 503512 504634 503974 502630 501255 500005 498974 498363 498187 498071 497377
51684 497377 495432 491675 485937 478703 470913 463342 456367 450366 445999 443838 443927 445916 449420 453945 458736
51669 458736 463201 467564 472622 478749 485493 492384 499680 507787 516140 523203 527638 529028 527392 522604
51655 522604 514750 504771 494276 484774 477347 472761 471378 472917 476662 481889 487762 492950 495998 496266
51641 496266 494130 490080 484093 476062 466413 455975 445634 436350 428984 423575 419080 414376 409380 404820
51627 404820 401185 398493 396931 396968 398617 401057 403289 404889 406015 406940 407825 408778 409901 411284 412966
51612 412966 414833 416531 417625 417970 417945 418244 419281 420660 421335 420598 418924 417594 417447 418368 420096 422976
51596 422976 427497 433424 439868 446130 452175 458472 465660 474010 482720 489932 493974 494586 492689 489266
51582 489266 485094 481278 479129 479200 481000 483928 488175 494585 504047 517132 533875 553635 575390 598289
51568 598289 621701 644861 667063 688429 709948 732381 755429 778266 800621 823106 846790
51557 846790 872778 901902 934419 969980 1007858 1046817 1084456 1117073 1140745 1152778 1152227 1139500
51545 1139500 1115981 1083828 1045484 1003019 957911 911362 864566 818688 774835 734109 697452
51534 697452 665279 637322 612968 591756 573496 557955 544613 532880 522534 513729 506450 500152
51522 500152 494117 488104 482433 477486 473322 469680 466088 462038 457430 452895 449357 447120 445650 444322
51508 444322 443044 441956 440875 439450 437687 435911 434218 432309 429990 427576 425592 424201 423113 422072
51494 422072 421171 420567 420065 419319 418434 418007 418433 419480 420792 422481 424762 427260 429205 430345 431164 432112
51478 432112 433026 433463 433247 432528 431648 431098 431287 432113 433016 433560 433658 433033 430962 426980 421578 415808 410263
51461 410263 404886 399690 395165 391812 389547 387812 386179 384666 383517 382806 382401 382293 382804 384292 386766
51446 386766 390066 394460 400724 409402 420183 432251 445196 459303 474889 491446 507478 521161
51434 521161 531202 537247 539619 538865 535701 531302 527210 524483 522777 520431 515698 508036 498229 487467
51420 487467 476598 466304 457497 450932 446472 443278 440804 439164 438379 437959 437581 437626 438404 439319 439559 439341
51404 439341 439629 440723 442010 443118 444444 446238 447994 449262 450502 452538 455546 459024 462561 466265
51390 466265 470617 476140 483080 491268 500562 511467 525007 541921 562446 586963 616258 650899
51378 650899 690874 736102 786607 841722 899781 959204 1019376 1079590 1137417 1188860 1230119
51367 1230119 1258732 1273437 1273938 1261021 1236220 1201000 1156571 1104514 1047158 987130 926764 867828
51355 867828 811442 758196 708636 663655 624072 589927 560647 535868 515575 499280 485633
51344 485633 473242 461645 451188 442206 434590 428052 422449 417754 413855 410526 407613 405152 403158
51331 403158 401368 399388 397224 395393 394350 393985 393849 393646 393273 392617 391664 390681 389969 389528 389225 389122 389342
51314 389342 389803 390485 391716 393684 395769 397008 397198 396991 396734 395888 393878 391031 388293 386361 385413 385323
51298 385323 385691 385873 385423 384502 383545 382603 381260 379152 376353 373291 370502 368480 367558 367842 369295 371824
51282 371824 375258 379354 383983 389232 395233 401891 408882 415843 422418 428157 432572 435378 436682 436893
51268 436893 436488 435822 435053 434157 433012 431523 429700 427689 425714 423958 422433 420948 419238 417176 414869
51253 414869 412501 410148 407744 405171 402255 398741 394566 390244 386680 384379 383045 382223 382013 382661 383665
51238 383665 384009 383445 382891 383257 384357 385342 385783 385886 385957 386175 386673 387361 387777 387529 386895 386630 387196 388430
51220 388430 389871 391153 392200 393263 394713 396548 398331 399834 401472 403712 406267 408364 409665 410437
51206 410437 410957 411299 411657 412351 413424 414680 416128 417930 419914 421655 423116 424632 426148 427003 426683 425326
51190 425326 423312 420816 418049 415471 413496 412313 412161 413301 415415 417512 418888 419885 421280 423149 424751
51175 424751 425385 425015 424129 423248 422550 421836 420873 419751 418608 417146 414883 412075 409750 408564 408111 407795
51159 407795 407971 409552 412745 416642 419943 421690 421530 419857 417626 415669 414213 413296 413284 414421 416100
51144 416100 417232 417339 416753 415851 414741 413732 413383 413797 414439 414926 415450 416104 416332 415592 414236 413140 412605
51127 412605 412130 411292 410452 410454 411842 414427 417520 420578 423673 427276 431524 435865 439593 442559 445146 447631
51111 447631 449856 451522 452514 452908 452898 452794 452900 453224 453505 453671 454108 455228 456839 458283 459206 459939 460953
51094 460953 462250 463581 465067 467145 469825 472367 473921 474330 474215 474418 475492 477503 480039 482534 484729
51079 484729 486738 488556 489730 489831 489092 488233 487701 487384 487006 486435 485650 484847 484670 485812 488233 491196 494367
51062 494367 498402 504031 510951 518305 526080 535337 546818 559749 572313 582989 591260 597383 602044
51049 602044 606353 611830 619851 630734 643358 655957 667461 677918 687581 696069 702783 707739 711234
51036 711234 712793 711381 706988 701324 696267 691891 686404 677789 665092 648607 629607 609982 591546
51023 591546 575392 561973 551569 544261 539559 536657 535131 534945 535834 537304 539457 543197 549150 556708
51009 556708 564512 571629 578005 584101 590437 597275 604340 611087 617513 624480 632862 642589 652879 663168
50995 663168 673368 683512 693848 705186 718423 733505 749445 765556 782160 799768 818125
50984 818125 836534 854728 872843 890691 907628 923254 937843 951914 965563 978331 989583
50973 989583 998971 1006764 1013945 1022031 1032665 1047197 1066495 1091035 1121153 1157089 1198742 1245470
50961 1245470 1296458 1351365 1410457 1473902 1540974 1610014 1679089 1746626 1811666 1873741 1932419
50950 1932419 1986728 2035090 2076133 2109643 2136562 2158002 2174516 2186337 2193986 2198356 2200430 2201169
50938 2201169 2201410 2201338 2200026 2195937 2188208 2177200 2163718 2148036 2129894 2109087 2085628 2059484 2030594
50925 2030594 1999048 1964796 1927182 1885248 1838658 1787992 1734081 1677541 1619199 1560521 1503078
50914 1503078 1447743 1394721 1344277 1297055 1253674 1214219 1178177 1144793 1113726 1085461 1060914
50903 1060914 1040335 1022772 1006829 991778 977697 964786 953052 942560 933482 925795 919226 913532
50891 913532 908509 903788 899094 894782 891640 889950 889169 888813 889247 891200 894765 899295 904121 908905 913412
50876 913412 917509 921577 926539 933144 941405 950875 961291 972738 985321 999045 1014006 1030394 1048235
50863 1048235 1067388 1088022 1110876 1136769 1165902 1197908 1232660 1270828 1313589 1361875 1415935
50852 1415935 1475550 1540762 1612528 1692520 1782057 1881294 1989668 2106938 2233356 2368852
50842 2368852 2512551 2663095 2818841 2977524 3136302 3292477 3443686 3587035 3718658
50833 3718658 3834751 3932753 4011131 4068670 4104944 4121300 4120460 4105100 4077488 4040467 3997916
50822 3997916 3953862 3911677 3874281 3844284 3823230 3810890 3805577 3804844 3805680 3804503 3797588 3781680 3754117
50809 3754117 3712652 3655517 3581797 3491806 3387158 3270364 3144106 3010876 2873337 2734635
50799 2734635 2597826 2465143 2338376 2219821 2112039 2016353 1932216 1858499 1794916 1741793
50789 1741793 1698867 1664966 1638731 1619152 1605415 1596599 1591691 1589726 1589837 1591197 1592878 1593875 1593455
50776 1593455 1591438 1587926 1582777 1575619 1566392 1555495 1543293 1529717 1514394 1496877 1476752 1453886
50764 1453886 1428694 1401881 1373929 1345163 1316259 1288142 1261340 1235899 1211992 1189983 1169866
50753 1169866 1151347 1134750 1121107 1110938 1103646 1098580 1096035 1096615 1100248 1106570 1115806 1128465 1144538
50740 1144538 1163765 1186419 1213024 1243546 1277711 1316037 1359645 1408954 1463296 1522041 1585380
50729 1585380 1653770 1727172 1805173 1887324 1972908 2060680 2149140 2236901 2322616 2404850 2482302
50718 2482302 2553979 2618843 2675254 2720887 2753251 2770449 2771744 2757723 2730169 2691907 2646636
50707 2646636 2598443 2551046 2507350 2469594 2439450 2417655 2403739 2396471 2394530 2396562 2400874 2405449
50695 2405449 2408218 2406983 2399204 2382336 2354592 2315335 2264903 2204426 2135908 2062235 1986783 1912707
50683 1912707 1842270 1776691 1716760 1663599 1618534 1582206 1554283 1534293 1522326 1518647 1523115 1535452
50671 1535452 1555653 1583443 1617472 1655687 1696490 1739052 1782513 1825419 1866053 1903016 1935523
50660 1935523 1963505 1987511 2008247 2026146 2041510 2054827 2066630 2077245 2086933 2096051 2104692 2112412
50648 2112412 2118804 2124239 2129702 2136158 2144493 2155746 2170747 2189631 2212287 2239165 2270987 2307658
50636 2307658 2348072 2390998 2435623 2481214 2526906 2572033 2616193 2658850 2699105 2735908 2768297
50625 2768297 2795762 2818630 2837290 2849969 2851613 2836397 2802034 2751344 2689972 2623624 2557379
50614 2557379 2495836 2442524 2399342 2366968 2345388 2333725 2330176 2332589 2338829 2346487 2352971 2356209
50602 2356209 2354621 2346219 2328627 2300493 2262180 2214629 2158471 2094903 2026458 1955805 1884247 1812350
50590 1812350 1741509 1673757 1610190 1550652 1495067 1444162 1398627 1358277 1322396 1290587 1263028
50579 1263028 1240087 1221722 1207209 1195577 1186374 1179706 1175432 1172917 1171908 1172983 1176500 1181610 1187063
50566 1187063 1192573 1198647 1205441 1212770 1221085 1231470 1244615 1260619 1279803 1302679 1328967 1357600
50554 1357600 1388170 1421659 1459224 1500844 1545485 1591959 1639072 1685465 1729982 1772051 1811385
50543 1811385 1847691 1881109 1912671 1943856 1975894 2009818 2046865 2088262 2134652 2186124 2242732
50532 2242732 2304709 2372289 2445697 2525267 2611251 2703598 2802239 2907452 3019478 3137700 3260554
50521 3260554 3386296 3513481 3640567 3765428 3885489 3998009 4100000 4188206 4259671 4312400
50511 4312400 4345320 4357734 4349062 4319088 4268267 4197905 4110336 4008905 3897459 3779756 3659439
50500 3659439 3540459 3427120 3323612 3233629 3160239 3105456 3069662 3051826 3050586 3064784 3092672
50489 3092672 3130908 3174711 3218710 3257380 3285146 3296965 3289093 3259256 3206571 3131967 3038554
50478 3038554 2930865 2813446 2690319 2565295 2441840 2322334 2207969 2099506 1997658
50469 1997658 1902664 1814192 1731948 1655954 1586161 1522389 1464797 1413668 1368444 1327724 1290717
50458 1290717 1257980 1230221 1207076 1187726 1172027 1160065 1151079 1143908 1138337 1134974 1133827 1133973 1134854
50445 1134854 1136952 1140798 1146059 1152151 1159255 1168098 1178841 1190607 1202047 1212163 1220799 1228593 1236461
50432 1236461 1244935 1254027 1263771 1274761 1287944 1303893 1322374 1342715 1364427 1387291 1410811 1433977
50420 1433977 1456022 1477439 1499870 1524890 1553214 1585135 1621208 1662136 1708318 1759906 1817046
50409 1817046 1879606 1946775 2017299 2090036 2164028 2238216 2311450 2382665 2450679 2513854 2570239
50398 2570239 2618066 2656020 2683275 2699507 2704642 2698233 2679288 2647033 2601721 2544541 2477207 2402042
50386 2402042 2322035 2240110 2158529 2079535 2006166 1941538 1887255 1843279 1809380 1785930 1773084
50375 1773084 1769929 1774818 1786028 1801741 1819841 1838088 1854197 1865543 1869217 1862788 1845081 1816310
50363 1816310 1777862 1731866 1680440 1625133 1567323 1509011 1452549 1399389 1349588 1302616 1258047
50352 1258047 1215398 1174221 1134860 1098464 1065614 1035517 1007172 980882 957845 938529 922195
50341 922195 907940 895528 885111 876716 870191 865357 862000 859794 858250 856781 855139 853886 854016 855769
50327 855769 858192 860254 862046 864431 867906 872396 877859 884285 891188 897956 904785 912577 921687 931453
50313 931453 941268 951410 962421 974256 986718 1000320 1015974 1033897 1053377 1073531 1093603 1112337
50301 1112337 1127672 1137670 1141702 1140575 1135635 1128080 1119070 1110052 1102525 1097375 1094569 1093577 1094026 1095888
50287 1095888 1099144 1103595 1109145 1116130 1125123 1136384 1149738 1165135 1183107 1204184 1227478 1249781
50275 1249781 1266306 1272819 1267664 1252356 1230516 1206060 1181841 1159348 1139194 1121583 1106410 1093268
50263 1093268 1081660 1071236 1061713 1052736 1044069 1036000 1029289 1024584 1021906 1020771 1020644 1021218 1022401 1024275
50249 1024275 1027012 1030640 1034827 1038978 1042609 1045615 1048188 1050585 1053074 1055989 1059647 1064091 1068973 1073812
50235 1073812 1078396 1082857 1087357 1091788 1095881 1099572 1103200 1107261 1112011 1117306 1122888 1128855 1135872 1144949
50221 1144949 1157113 1173272 1194054 1219447 1248658 1280628 1314722 1350580 1387279 1423121 1456585
50210 1456585 1487239 1515479 1541669 1565930 1588540 1609958 1630287 1648990 1665139 1677651 1685150
50199 1685150 1685829 1677679 1659051 1629353 1589558 1542061 1489823 1435558 1381600 1330038 1282460 1239621
50187 1239621 1201751 1169090 1141729 1119007 1099614 1082335 1066137 1049459 1030186 1006990 980452
50176 980452 952406 924308 896690 869975 845203 823563 805455 790292 777242 766005 756774 749598
50164 749598 744004 739342 735318 732065 729845 728864 729210 730702 732922 735611 738905 742961 747576 752663 758924
50149 758924 767352 777891 789080 799238 807588 814056 818625 821328 822446 822184 820391 817125 813284 810180
50135 810180 808434 807785 807972 809419 812821 818270 825055 832278 839593 847303 855773 864831 873891 882650 891476
50120 891476 901048 911815 923820 936834 950511 964633 979380 995277 1012829 1032322 1054011 1078277
50108 1078277 1105577 1136491 1171878 1212607 1258979 1310682 1367484 1429624 1497367 1570542 1648674
50097 1648674 1730921 1815404 1899121 1979328 2055017 2126674 2194959 2260281 2323430 2385493 2446658
50086 2446658 2505486 2559528 2606101 2642278 2664809 2670911 2659188 2629668 2583278 2521782 2448015
50075 2448015 2365478 2277294 2185703 2092614 2000315 1911269 1827228 1748817 1676058 1609121 1548392
50064 1548392 1494007 1445593 1402430 1363616 1328039 1294592 1262687 1232424 1204059 1177455 1152349
50053 1152349 1129069 1108627 1091884 1078682 1067937 1058551 1050174 1043101 1037623 1033749 1031568 1031433 1033438
50040 1033438 1036954 1041213 1046195 1052356 1059429 1066182 1071690 1076228 1080542 1084858 1089146 1093708 1098640 1103016
50026 1103016 1105569 1106149 1105697 1104723 1102658 1098952 1094007 1088557 1082703 1076070 1068496 1060095 1050952 1041255 1031438
50011 1031438 1021644 1011246 999445 986430 973528 962087 952469 944148 936472 929248 922932 918521 917103
49998 917103 919195 924495 932388 942733 956030 972737 992505 1014186 1036580 1059138 1081971 1105427
49986 1105427 1129811 1155421 1182566 1211475 1242273 1275086 1310056 1347140 1385879 1425352 1464282
49975 1464282 1501254 1535080 1565246 1592080 1616413 1638987 1660186 1680299 1699839 1719203 1737765
49964 1737765 1753430 1763353 1765083 1756846 1736984 1704014 1657865 1600816 1536701 1469125 1400785 1334210
49952 1334210 1272268 1217365 1170430 1131075 1098592 1072477 1052154 1036764 1025418 1017323 1011430 1006265
49940 1006265 1000557 993987 986935 979474 971072 961440 951110 940583 929152 915186 897616 876618
49928 876618 852960 827516 801755 777826 757269 739853 724362 710367 698553 689380 682262 676406
49916 676406 671877 669301 668777 669569 670829 672239 673848 675569 677118 678459 680124 682915 687368 693625 701647
49901 701647 711210 721685 732321 743052 754720 768201 783443 799566 815516 830250 842595 851593
49889 851593 856978 858958 857654 853264 846560 838413 828727 816628 802090 786666 772010 758124 743693
49876 743693 727900 711223 694577 678457 663214 649562 638214 629154 621716 615440 610529 607309
49864 607309 605535 604601 604342 605232 607696 611577 616458 622189 628830 636387 644999 655209 667547 681818
49850 681818 697110 712475 727306 741168 753719 764826 774360 781861 786892 789798 791569 792717 792723
49837 792723 790802 786681 780285 771294 759747 746803 734116 722378 711123 700120 690353 683116 678506
49824 678506 675396 672885 671300 671589 674150 678606 684380 690981 697837 704592 711831 720910 732619 746306
49810 746306 760709 775158 789362 802494 813467 822112 829224 835333 840169 843579 846075 848017 848849
49797 848849 847709 844321 838822 831196 821441 809952 797173 783164 768054 752668 738123 724913
49785 724913 712876 701922 692237 683862 676630 670583 665948 662622 660018 657520 654875 652172 649751 648138
49771 648138 647776 648827 651348 655439 660886 666936 672985 679375 686978 695956 705457 714524 722708 729720
49757 729720 735195 739190 742372 745279 747687 749043 749022 747185 742533 734169 722495 709213 696072 683972
49743 683972 673225 664066 656585 650543 645674 641978 639430 637556 635752 633969 632714 632245 632213 632305 632904
49728 632904 634663 637627 641161 644687 648039 651120 653808 656519 660457 666814 675769 686489 698038 710070
49714 710070 722787 736415 750574 763977 774875 782058 785392 785403 782660 777895 772274 766911 762044
49701 762044 757070 751429 745148 738595 732126 726062 720577 715453 710244 704770 699156 693374 687214 680969
49687 680969 675751 672731 672183 673534 676139 679818 684790 691416 699970 710490 722883 737162 753288
49674 753288 770654 788152 805238 822609 841075 859590 875002 884309 887085 885517 882354 879198
49662 879198 876534 874574 873563 873604 874795 877523 882032 887319 890733 889124 880606 865325 844893 821414
49648 821414 796814 772505 749314 727815 708734 692813 680282 670677 663352 657995 654558 652881
49636 652881 652512 652788 652952 652412 651010 648997 646596 643752 640428 636917 633564 630250 626483 622017 617124
49621 617124 612157 607091 601696 596017 590456 585416 581078 577565 575124 573972 574002 574827 576108 577715 579563
49606 579563 581526 583638 586157 589150 592114 594375 595879 597211 598699 599800 599697 598351 596639 595535
49592 595535 595485 596523 598505 600959 603021 603964 603889 603687 604226 605710 607772 609956 612002 613858 615687 617804
49576 617804 620376 623181 625877 628512 631560 635390 639971 645303 651897 660476 671185 683335 695871
49563 695871 707928 718977 728819 737600 745577 752630 758056 761017 761173 758794 754301 747962 740119 731626
49549 731626 723761 717522 713037 709861 707866 707529 709124 711900 714473 716059 716965 717827 718812 719807 721075
49534 721075 723264 726786 731467 736834 742611 748961 756407 765503 776457 789066 803123 818809 836498
49521 836498 856176 877176 898434 918745 936735 951003 960809 966744 970471 973563 976587 979376 982061
49508 982061 985561 990899 998178 1006391 1014081 1019962 1022946 1022007 1016371 1005809 990655 971685 950174
49495 950174 927870 906496 887111 870011 855180 842518 831624 821782 812527 804124 797139 791569
49483 791569 786692 781868 777267 773616 771395 770429 770180 770201 770270 770323 770436 770817 771727 773335 775669 778614 781956
49466 781956 785474 789085 792942 797357 802576 808520 814662 820236 824691 828007 830490 832262 833090 832723 831188
49451 831188 828607 824886 819851 813663 806896 800067 793227 786162 778950 772200 766582 762130 758108 753800
49437 753800 749436 746168 745025 746011 748302 751124 754259 757960 762781 769475 778663 790356 803896 818572
49423 818572 834286 851560 870865 891888 913546 934963 956365 978365 999878 1017182 1026024 1024929
49411 1024929 1016057 1003054 988964 976292 967593 964609 967142 973823 983869 997220 1013154 1030018
49399 1030018 1046794 1064007 1082415 1101424 1119473 1135595 1149849 1162523 1173720 1183753 1193063
49388 1193063 1201403 1207564 1210345 1209569 1205893 1199913 1191833 1181837 1170247 1157242 1142790 1127130 1111192
49375 1111192 1096277 1083357 1072761 1064440 1058281 1054114 1051661 1050662 1050999 1052515 1054705 1056771 1058036 1058281
49361 1058281 1057635 1056115 1053305 1048557 1041626 1033163 1024420 1016308 1008745 1001038 992824 984477 976711 970020
49347 970020 964555 960295 957202 955363 955012 956172 958214 960113 961428 962754 964806 967135 968222 966916
49333 966916 963449 958934 954234 949590 945066 940926 937525 935034 933359 932247 931472 930965 930812 931112 931916
49318 931916 933294 935312 937855 940623 943435 946465 949963 953825 957599 960881 963531 965552 967021 968212
49304 968212 969516 971100 972756 974235 975595 977082 978785 980676 982922 985970 990239 995852 1002657 1010413
49290 1010413 1018877 1027789 1036850 1045777 1054463 1063128 1072193 1081883 1091988 1102114 1112047 1121692 1130776
49277 1130776 1138979 1146428 1153771 1161606 1170136 1179469 1189871 1201339 1213176 1224530 1235261 1245697
49265 1245697 1255353 1262358 1264573 1261161 1252927 1241380 1227798 1213142 1198554 1185780 1176971 1173904 1177317
49252 1177317 1187077 1202838 1224096 1249508 1276857 1304195 1330651 1355491 1376684 1391316 1397537 1395377
49240 1395377 1385556 1368373 1344388 1315570 1284986 1255366 1228301 1204468 1184064 1167148 1154102
49229 1154102 1145723 1142427 1143441 1147226 1152658 1159364 1167044 1175168 1183534 1192492 1202255 1212332 1221893 1230316
49215 1230316 1237236 1242504 1246494 1250014 1253499 1256616 1259097 1261599 1265137 1269883 1275206 1280853 1287394 1295407
49201 1295407 1304877 1315704 1328188 1342528 1358212 1374332 1390294 1405819 1420469 1433744 1445612
49190 1445612 1456487 1466636 1475946 1484386 1492309 1500129 1507997 1516027 1524565 1533988 1544456 1556187 1569851
49177 1569851 1586348 1606230 1629586 1656415 1686773 1720534 1757454 1797695 1841922 1890528 1942690
49166 1942690 1996079 2047063 2091029 2123166 2140027 2141049 2128785 2107776 2083082 2059173 2039160
49155 2039160 2024472 2015213 2010904 2010857 2014091 2019334 2025372 2031385 2036991 2042173 2047163 2052218 2057470 2063175
49141 2063175 2069966 2078560 2089137 2101281 2114516 2128599 2143311 2158405 2173969 2190469 2208166 2226716
49129 2226716 2245528 2264294 2282951 2301411 2319510 2337091 2354047 2370581 2387477 2405647 2425050
49118 2425050 2444492 2462884 2480498 2498680 2518656 2541063 2566405 2595481 2629480 2670001 2718733
49107 2718733 2776689 2844172 2922220 3013729 3121655 3244814 3375391 3501444 3613441 3710085
49097 3710085 3798317 3885957 3971798 4042012 4077672 4067811 4016534 3938587 3848758 3754539 3656104
49086 3656104 3550910 3438334 3321623 3206715 3099476 3003776 2921435 2852896 2797383 2753019
49076 2753019 2717652 2689679 2667887 2650863 2637033 2625109 2614072 2603049 2591711 2580577 2570286
49065 2570286 2560586 2550567 2539813 2528734 2517819 2507204 2497124 2488077 2480253 2473287 2466876 2461148
49053 2461148 2456076 2451074 2445760 2440821 2437474 2436070 2435699 2435219 2434304 2433388 2432990 2433338 2434475 2436488 2439597
49038 2439597 2444159 2450628 2459456 2470920 2484923 2500984 2518581 2537506 2557663 2578383 2598119 2615012
49026 2615012 2627669 2635273 2637325 2633864 2626008 2615706 2604645 2593590 2582901 2573212 2565187 2558916 2554136
49013 2554136 2550942 2549751 2550561 2552792 2556038 2560450 2566165 2572883 2580372 2588892 2598528 2608469 2617637 2625856
48999 2625856 2633662 2640997 2646975 2651152 2654229 2656959 2658963 2659278 2657734 2655083 2651854 2647742 2642259 2635554
48985 2635554 2628393 2621571 2615436 2609849 2604507 2599365 2594699 2590639 2586861 2582973 2579130 2575916 2573642 2572087
48971 2572087 2570985 2570449 2570710 2571558 2572249 2572048 2571008 2570161 2570723 2572881 2575577 2577773 2579692 2582446 2586660 2591966
48955 2591966 2597828 2604231 2611431 2619648 2629330 2641260 2655974 2673295 2692713 2713992 2737129 2762035
48943 2762035 2788644 2817090 2847449 2879444 2912639 2946717 2981332 3016134 3051398 3088312 3128104
48932 3128104 3171030 3216665 3264839 3315567 3368274 3422106 3477167 3534624 3595245 3658508 3723433
48921 3723433 3789526 3856418 3923318 3989582 4055408 4121171 4186269 4249287 4309204 4365803 4419088
48910 4419088 4468984 4515649 4559495 4600710 4639269 4675484 4710079 4743556 4775834 4806587 4835537
48899 4835537 4862395 4886985 4909573 4930651 4950193 4967477 4981795 4993061 5001588 5007655 5011418 5012759
48887 5012759 5011042 5005492 4996117 4983892 4969736 4953630 4934959 4913268 4888305 4859799 4827737 4792598
48875 4792598 4754884 4714576 4671394 4625280 4576220 4523896 4467979 4408625 4346342 4281669 4215433
48864 4215433 4148949 4083397 4019204 3956587 3896315 3839229 3785292 3734004 3685667 3641372 3601613
48853 3601613 3565756 3533061 3503488 3477235 3454183 3434029 3416381 3400503 3385780 3372765 3363016
48842 3363016 3357457 3355533 3356406 3360143 3367050 3376555 3387685 3400255 3414697 3430925 3448254 3466339 3485501
$$ [...]
##END NTUPLES=NMR SPECTRUM
##END=
