
##TITLE=AC1343_NESKAZ160_6540833_UhumO3AfwI
##JCAMPDX= 6.0         $$ Bruker NMR JCAMP-DX V2.0
##DATA TYPE= NMR SPECTRUM
##DATA CLASS= NTUPLES
##ORIGIN= BRUKER
##OWNER= Administrator
$$ 1.72 TOPSPIN		Version 2.1
$$ 2012-07-18 02:50:07.531 -0500  Administrator@TOPSPIN
$$ Compression mode = diff/dup
##.OBSERVE FREQUENCY= 400.02188249412
##.OBSERVE NUCLEUS= ^1H
##.ACQUISITION MODE= SIMULTANEOUS (DQD)
##.ACQUISITION SCHEME= undefined
##.AVERAGES= 8
##.DIGITISER RES= 22
##SPECTROMETER/DATA SYSTEM= spect
##.PULSE SEQUENCE= zg30
##.SOLVENT NAME= COFFEE_meoh
##.SHIFT REFERENCE= INTERNAL, COFFEE_meoh, 1, 14.98509
##AUDIT TRAIL= $$ (NUMBER, WHEN, WHO, WHERE, PROCESS, VERSION, WHAT)
$$ ##TITLE= Audit trail, TOPSPIN		Version 2.1
$$ ##JCAMPDX= 5.01
$$ ##ORIGIN= Bruker BioSpin GmbH
$$ ##OWNER= Administrator
$$ $$ C:\Bruker\TOPSPIN/data/COFFEE/nmr/AC1343_NESKAZ160_6540833_UhumO3AfwI/10/pdata/1/auditp.txt
$$ ##AUDIT TRAIL=  $$ (NUMBER, WHEN, WHO, WHERE, PROCESS, VERSION, WHAT)
(   1,<2012-07-18 02:50:00.671 -0500>,<Administrator>,<TOPSPIN>,<go>,<TOPSPIN 2.1>,
      <created by zg
	started at 2012-07-18 02:48:54.062 -0500,
	POWCHK enabled, PULCHK disabled,
       configuration hash MD5:
       6B 1B 68 BB D9 2E 58 E2 7F 35 AD 54 07 DF 0E 41
       data hash MD5: 64K
       BA 52 31 22 BF E3 30 62 58 B5 92 75 5F 7F B0 3C>)
(   2,<2012-07-18 02:50:03.484 -0500>,<Administrator>,<TOPSPIN>,<proc1d>,<TOPSPIN 2.1>,
      <Start of raw data processing
       efp LB = 0 FT_mod = 6 PKNL = 1 PHC0 = 0 PHC1 = 0 SI = 32K 
       data hash MD5: 32K
       89 34 AA F9 53 11 B4 B7 0E B0 5A F0 1C 42 6F 0B>)
(   3,<2012-07-18 02:50:03.812 -0500>,<Administrator>,<TOPSPIN>,<proc1d>,<TOPSPIN 2.1>,
      <pk PHC0 = 181.1151 PHC1 = 0 
       data hash MD5: 32K
       49 1E 2A 3D 8F 8C 6C 65 EC F9 1F AB 84 E8 67 E6>)
(   4,<2012-07-18 02:50:03.875 -0500>,<Administrator>,<TOPSPIN>,<proc1d>,<TOPSPIN 2.1>,
      <abs ABSG = 1 
       data hash MD5: 32K
       A7 3C 87 68 74 D9 56 00 71 D2 AD 5F 4B 44 44 FA>)
(   5,<2012-07-18 02:50:03.906 -0500>,<Administrator>,<TOPSPIN>,<proc1d>,<TOPSPIN 2.1>,
      <abs ABSG = 2 
       data hash MD5: 32K
       58 B7 E0 4D A5 20 AB D1 5B EF 12 48 EB E2 EB B4>)
(   6,<2012-07-18 02:50:03.937 -0500>,<Administrator>,<TOPSPIN>,<proc1d>,<TOPSPIN 2.1>,
      <abs ABSG = 3 
       data hash MD5: 32K
       DC F3 50 AF F8 9A 7B C0 99 87 DD 39 CE 6A 85 FA>)
(   7,<2012-07-18 02:50:03.968 -0500>,<Administrator>,<TOPSPIN>,<proc1d>,<TOPSPIN 2.1>,
      <abs ABSG = 4 
       data hash MD5: 32K
       49 12 D1 FB 92 DC 95 12 DC AE 27 35 DB 33 57 E0>)
(   8,<2012-07-18 02:50:04.000 -0500>,<Administrator>,<TOPSPIN>,<proc1d>,<TOPSPIN 2.1>,
      <abs ABSG = 5 
       data hash MD5: 32K
       3B 42 54 DA C8 09 4B 1C A6 37 3C 52 DA 95 F8 0F>)
$$ ##END=
$$ 
$$ $$ hash MD5
$$ $$ 3B 01 A7 A6 5F 33 A9 64 CE A1 08 CE EC 71 EB 99
##$RELAX= 
##$RELAX= 
##$RELAX= 
##$RELAX= 
##$RELAX= 
##$RELAX= 
##$RELAX= 
$$ Bruker specific parameters
$$ --------------------------
$$ [...]
150 150 150 150 150 150 150 150
##$TP07= 0
##$TPNAME0= <>
##$TPNAME1= <>
##$TPNAME2= <>
##$TPNAME3= <>
##$TPNAME4= <>
##$TPNAME5= <>
##$TPNAME6= <>
##$TPNAME7= <>
##$TPOAL= (0..7)
0.5 0.5 0.5 0.5 0.5 0.5 0.5 0.5
##$TPOFFS= (0..7)
0 0 0 0 0 0 0 0
##$TUNHIN= 0
##$TUNHOUT= 0
##$TUNXOUT= 0
##$USERA1= <user>
##$USERA2= <user>
##$USERA3= <user>
##$USERA4= <user>
##$USERA5= <user>
##$V9= 5
##$VALIST= <valist>
##$VCLIST= <CCCCCCCCCCCCCCC>
##$VD= 0
##$VDLIST= <DDDDDDDDDDDDDDD>
##$VPLIST= <PPPPPPPPPPPPPPP>
##$VTLIST= <TTTTTTTTTTTTTTT>
##$WBST= 2048
##$WBSW= 25
##$XGAIN= (0..3)
0 0 0 0
##$XL= 0
##$YL= 0
##$YMAX_a= 505116
##$YMIN_a= -648352
##$ZGOPTNS= <>
##$ZL1= 120
##$ZL2= 120
##$ZL3= 120
##$ZL4= 120
##$ABSF1= 14.98509
##$ABSF2= -5.573092
##$ABSG= 5
##$ABSL= 3
##$ALPHA= 0
##$AQORDER= 0
##$ASSFAC= 0
##$ASSFACI= 0
##$ASSFACX= 0
##$ASSWID= 0
##$AUNMP= <proc_prof1d_extract_pilot.lims>
##$AXLEFT= 0
##$AXNAME= <>
##$AXNUC= <1H>
##$AXRIGHT= 0
##$AXTYPE= 0
##$AXUNIT= <>
##$AZFE= 0.1
##$AZFW= 0.1
##$BCFW= 0
##$BC_mod= 0
##$BYTORDP= 0
##$COROFFS= 0
##$CY= 15
##$DATMOD= 1
##$DC= 0
##$DFILT= <>
##$DTYPP= 0
##$F1P= 0
##$F2P= 0
##$FCOR= 0.5
##$FTSIZE= 32768
##$FT_mod= 6
##$GAMMA= 0
##$GB= 0
##$INTBC= 1
##$INTSCL= 1
##$ISEN= 128
##$LB= 0
##$LEV0= 0
##$LPBIN= 0
##$MAXI= 10000
##$MC2= 0
##$MEAN= 0
##$ME_mod= 0
##$MI= 0
##$NCOEF= 0
##$NC_proc= -8
##$NLEV= 6
##$NOISF1= 0
##$NOISF2= 0
##$NSP= 0
##$NTH_PI= 0
##$NZP= 0
##$OFFSET= 14.98509
##$PC= 1
##$PHC0= 181.1151
##$PHC1= 0
##$PH_mod= 1
##$PKNL= yes
##$PPARMOD= 0
##$PPDIAG= 0
##$PPIPTYP= 0
##$PPMPNUM= 2147483647
##$PPRESOL= 1
##$PSCAL= 4
##$PSIGN= 0
##$PYNMP= <proc.py>
##$REVERSE= no
##$SF= 400.02
##$SI= 32768
##$SIGF1= 0
##$SIGF2= 0
##$SINO= 400
##$SIOLD= 32768
##$SPECTYP= <>
##$SREGLST= <1H.CDCl3>
##$SSB= 0
##$STSI= 32768
##$STSR= 0
##$SW_p= 8223.68421052631
##$SYMM= 0
##$S_DEV= 0
##$TDeff= 65536
##$TDoff= 0
##$TI= <>
##$TILT= no
##$TM1= 0
##$TM2= 0
##$TOPLEV= 0
##$USERP1= <user>
##$USERP2= <user>
##$USERP3= <user>
##$USERP4= <user>
##$USERP5= <user>
##$WDW= 1
##$XDIM= 32768
##$YMAX_p= 465667018
##$YMIN_p= -716127
##$CURPLOT= <Network HP LaserJet P1505>
##$CURPRIN= <$Network HP LaserJet P1505>
##$DFORMAT= <normdp>
##$LAYOUT= <+/1D_H.xwp>
##$LFORMAT= <normlp>
##$PFORMAT= <normpl>
##$SURQMSG= 1
$$ End of Bruker specific parameters
$$ ---------------------------------
##NTUPLES= NMR SPECTRUM
##VAR_NAME=  FREQUENCY,     SPECTRUM/REAL,   SPECTRUM/IMAG
##SYMBOL=    X,             R,               I
##VAR_TYPE=  INDEPENDENT,   DEPENDENT,       DEPENDENT
##VAR_FORM=  AFFN,          ASDF,            ASDF
##VAR_DIM=   32768,         32768,           32768
##UNITS=     HZ,            ARBITRARY UNITS, ARBITRARY UNITS
##FACTOR=    0.250966925370066, 1,           1
##FIRST=     8223.43324360094, -41053,       -189375
##LAST=      0,             43374,           -189738
##MIN=       0,             -716127,         0
##MAX=       8223.43324360094, 465667018,    0
$$ Real data points
##PAGE= N=1
##DATA TABLE= (X++(R..R)), XYDATA
$$ [...]
19552c5025F1139c00169A55455b0217k48727A21788a71714d7396G298a44820o6360
$$ -35025 61139 -300169 155455 -20217 -268944 121788 -171714 -47396 7298 -144820 -211180
19541b11180B8452a49571k9005g0485D0006a73049N8718a176H4421L060b7884
$$ -211180 28452 -149571 -178576 -70485 40006 -173049 -114331 -1176 84421 87481 -27884
19529B04022G2754k6040e861j71032B29580j09492a77356R43j12442A86055b43601
$$ 204022 72754 46714 -5861 -176893 229580 120088 -177356 -176413 -288855 186055 -243601
19517b40727A20292a83753c2875n7116b7762I9166h4672j17815i0925E3062J33993
$$ -240727 120292 -183753 -32875 -89991 -27762 99166 -84672 -202487 -90925 53062 187055
19506A87055D4701b21053D3434b48422h6853l78913a4674j38474O7602L6607j15145
$$ 187055 44701 -221053 43434 -248422 -86853 -465766 -14674 -153148 -85546 -48939 -164084
19495a64084K0945D8729J44683R18H4082a90878M7404j20012f8497d759j19291
$$ -164084 -143139 48729 193412 194330 84082 -190878 -143474 -263486 -68497 -4759 -124050
19484a24050G4996M3084N8497a69541O7796F9547a60972p6260O9585A04363d0936
$$ -124050 74996 118080 176577 -169541 -101745 69547 -160972 -237232 -167647 104363 -40936
19472I9488P6168k1634a86185B23401b52690E0094i9902l67287H9494b73484J01122
$$ 99488 175656 154022 -186185 223401 -252690 50094 -99902 -467189 89494 -273484 -172362
19461a72362B53925m5040d57524a79281j61263B49396r2715k9023J48022A36785
$$ -172362 253925 208885 -457524 -179281 -340544 249396 156681 127658 275680 136785
19450A47355K3264a76485F3757a97577d1908k1393n3534A22508a24000E6490J02399
$$ 147355 170619 -176485 63757 -197577 -41908 -63301 -116835 122508 -124000 56490 158889
19439A58889g4312B02155a39157O6408F0422a76225H0449i1432q3635n7583B92725
$$ 158889 -74312 202155 -139157 -72749 60422 -176225 80449 -91432 -175067 -232650 292725
19427b26652H328i587A41393a56245G4346a12036E4494f9035j04230I3492a73057
$$ -226652 8328 -9587 141393 -156245 74346 -112036 54494 -69035 -173265 93492 -173057
19415b1474A76335o1307a06292c726A10783g737C61340F2881c6933A4372J07895
$$ -21474 176335 115028 -106292 -3726 110783 -7737 361340 62881 -36933 14372 122267
19404A22267D481a20930A06572c2457p5024b6042l6945A84083c07151B05270d5276
$$ 122267 4481 -120930 106572 -32457 -107481 -26042 -62987 184083 -307151 205270 -45276
19392A9987b00827h5624I0819N0561a40o1595n5929B47925r4068b9444r7328j25786
$$ 19987 -200827 -85624 90819 141380 -140 -61735 -117664 247925 153857 -29444 -126772 -252558
19380b52558j29462A22361L2873o4586L8588a74883d4788j13527F0269d2077k65484
$$ -252558 -382020 122361 155234 90648 129236 -174883 -44788 -158315 60269 -42077 -307561
19369c07561A93514b2240q930q1798a1126C28647a60486A19373n78a74027j49005
$$ -307561 193514 -22240 -31170 -112968 -11126 328647 -160486 119373 118795 -174027 -323032
19358c23032g7945a7104j00028k84286A46550a11114j50971l671b6525m89828
$$ -323032 -77945 -17104 -117132 -401418 146550 -111114 -262085 -265756 -26525 -516353
19348e16353A69658d34560A74851D1115d9034o2764j61340d3397A30265a39590
$$ -516353 169658 -434560 174851 41115 -49034 -111798 -273138 -43397 130265 -139590
19337C2212a70184L1990A67981b96275L2555J27862A39562b63004c3495C3323
$$ 32212 -170184 -138194 167981 -296275 -263720 -135858 139562 -263004 -33495 33323
19326i0643l3875k62742d2815E5472M755L2121a63953B13694g9965A9837L4097
$$ -90643 -124518 -387260 -42815 55472 60227 92348 -163953 213694 -79965 19837 53934
19315E3934e2207o4507k82405a23134j78622O6335a11475B1407J00567K86723
$$ 53934 -52207 -116714 -399119 -123134 -301756 -235421 -111475 21407 121974 408697
19305D08697g2404k79102E26070d52762B20907a13344J6124r0319f9424k02612
$$ 408697 -72404 -351506 526070 -452762 220907 -113344 -97220 -187539 -69424 -272036
19295b72036B04475h2793A08915c16321g0771H1736g184j424F8095a42201k21213
$$ -272036 204475 -82793 108915 -316321 -70771 81736 -7184 -8608 68095 -142201 -363414
19284c63414a43536M8475B60436b5169k11487M2581i1905j48323B78559b75841
$$ -363414 -143536 -95061 260436 -25169 -236656 -194075 -91905 -240228 278559 -275841
19273h5603C9583e0918n48982b05445R2063F0682e6389j71702d1701A9720b83
$$ -85603 39583 -50918 -599900 -205445 -113382 60682 -56389 -228091 -41701 19720 -283
19261b57146H0055a4002k5663j45325G4265a72513A2455b23235A1719J3900a70677
$$ -257146 80055 -14002 -39665 -184990 74265 -172513 12455 -223235 11719 25619 -170677
19249d7113J0370G5863a20010d6690J2128l00837B37093a49119B9299b93719A76530
$$ -47113 -36743 75863 -120010 -46690 -34562 -335399 237093 -149119 29299 -293719 176530
19237E6153g4965l1099N0553C0636b61046e1467l97570a75237A14894a73761A29258
$$ 56153 -74965 -106064 -55511 30636 -261046 -51467 -449037 -175237 114894 -173761 129258
19225b09619q3887J24596b1415B5246C140b65754H760J84075D1065N8794a13852
$$ -209619 -293506 -168910 -21415 25246 3140 -265754 8760 192835 41065 99859 -113852
19213b8527o1019G36f1157I715J05697j7639b35468O6116B97452a20619j49131
$$ -28527 -89546 736 -61157 9715 115412 97773 -235468 -169352 297452 -120619 -269750
19202b69750J07940c0358l91398H0278a86737N2261H5267e467B23275c54679B8350
$$ -269750 -161810 -30358 -421756 80278 -186737 -134476 85267 -5467 223275 -354679 28350
19190B95929e4370D4426h4520j06789c1200p1431r4832M4223L4787p8359d1476
$$ 295929 -54370 44426 -84520 -191309 -31200 -102631 -197463 -153240 -118453 -196812 -41476
19178g8049j11227j1605j03412C66826j28999F7965b30450I282a73095e812A77036
$$ -78049 -189276 -200881 -304293 366826 237827 67965 -230450 9282 -173095 -5812 177036
19166b7204k03643C8834f9629B68529C5660i2185C3050a53568k28124a77315j45581
$$ -27204 -230847 38834 -69629 268529 35660 -92185 33050 -153568 -381692 -177315 -322896
19155c22896E2959b99637e1019n5136d2548a3406E0313d7870F2609a16373R834
$$ -322896 52959 -299637 -51019 -106155 -42548 -13406 50313 -47870 62609 -116373 -106539
19144a06539K9924L1111F368b81589B39803E0663f4127k846l582o6718O7481k90343
$$ -106539 -76615 -45504 6368 -281589 239803 50663 -64127 -66973 -70555 -137273 -69792 -360135
19132c60135J59577J8780g0883l2134j61642A619a68161A7212d4232l62848b4365
$$ -360135 -200558 -181778 -70883 -103017 -264659 1619 -168161 17212 -44232 -407080 -24365
19120A14017E5861a46577e7891k5047E5700M5295D3810i045A11429e8475b5630
$$ 114017 55861 -146577 -57891 -82938 55700 100995 43810 -9045 111429 -58475 -25630
19108b29685A25422a12270m14965a84833r9199A9891J75164c80167D7431a57818
$$ -229685 125422 -112270 -527235 -184833 -284032 19891 195055 -380167 47431 -157818
19097G0603l2945d79517a41442d4015G5119A0112b46048a11527F918i8082l48792
$$ 70603 37658 -479517 -141442 -44015 75119 10112 -246048 -111527 6918 -98082 -446874
19086d46874a54415A00796c50416e0414p8128J230D0221b6564j0443j80111b6356
$$ -446874 -154415 100796 -350416 -50414 -128542 -127312 40221 -26564 -37007 -217118 -26356
19074b92559B32499h4463A30651a11159m7780A5553d0821n6795p5901q0177j14203
$$ -292559 232499 -84463 130651 -111159 -158939 15553 -40821 -97616 -173517 -253694 -367897
19063c67897A20952f6059j57831A67465a71683B2048b17099J00415r0232B58487
$$ -367897 120952 -66059 -223890 167465 -171683 22048 -217099 -116684 -206916 258487
19052b46788P8899C13105a29721d2534j83647L8861a2359j6304j24965d4612n98131
$$ -246788 -167889 313105 -129721 -42534 -226181 -187320 -12359 -28663 -153628 -44612 -642743
19041f42743A9038c5053A48622b00008M3294B32190k6747C207i4277B50374a91609
$$ -642743 19038 -35053 148622 -200008 -156714 232190 205443 3207 -94277 250374 -191609
19029B26680a29j69871D6152M7618R5453A76J05966a3392B25883c5904A73204
$$ 226680 -129 -170000 46152 93770 189223 176 106142 -13392 225883 -35904 173204
19017G3963J10734E2502A4710K6247J9761g1307r5195A18193h8267C0774a4443
$$ 73963 184697 52502 14710 40957 60718 -71307 -166502 118193 -88267 30774 -14443
19005E2571d7795j64259l77950b09858A03833A7158b43803A74415K395J28392
$$ 52571 -47795 -212054 -590004 -209858 103833 17158 -243803 174415 176810 305202
18995C05202e2661B53649a00802L6717j4296A97082a74740c710l13732c7443j67893
$$ 305202 -52661 253649 -100802 -64085 -78381 197082 -174740 -3710 -317442 -37443 -205336
18984b05336a2250j13382l3772a6478m5367l3754G829f5953m56456a57921O9449
$$ -205336 -12250 -125632 -159404 -16478 -61845 -95599 7829 -65953 -522409 -157921 -88472
18973h8472c1513H0479h8249M1597j08470f5388j29461c3783j24554e5857a9568
$$ -88472 -31513 80479 -88249 -46652 -155122 -65388 -194849 -33783 -158337 -55857 -19568
18961G9038f9293a9002C12794c50151J07816k65140A51692R8862o3117c24969
$$ 79038 -69293 -19002 312794 -350151 -242335 -507475 151692 250554 187437 -324969
18950c6413k54195A10461f7325k0304l8794H4518d51963a42077p2814B80879b2743
$$ -36413 -290608 110461 -67325 -87629 -126423 84518 -451963 -142077 -214891 280879 -22743
18938b37456P7655r1215c62m0382j18182b7061C78572a6352A54064o5580J16963
$$ -237456 -159801 -251016 -362 -40744 -158926 -27061 378572 -16352 154064 88484 205447
18927B05447C7629J54354J9684C8513b10583e3160D067a38713n1207n6633N0034
$$ 205447 37629 191983 211667 38513 -210583 -53160 4067 -138713 -189920 -246553 -196519
18916a96519B39298D3157O864c67982d8562j31944K225A40251l4141d4248A89045
$$ -196519 239298 43157 50021 -367982 -48562 -180506 -178281 140251 106110 -44248 189045
18904b04511M9783B48480R3211I9013B050f3865G1973O1605b13177A68503A9369
$$ -204511 -154728 248480 341691 99013 2050 -63865 71973 133578 -213177 168503 19369
18892B17061D5626d3208j57726F8482a40576M0110j14947L6662G8087b69448M3877
$$ 217061 45626 -43208 -200934 68482 -140576 -100466 -215413 -178751 78087 -269448 -225571
18881b25571a8978j60496f3057B51233q908A07536M4740H625b03113B37682a1363
$$ -225571 -18978 -179474 -63057 251233 242325 107536 152276 8625 -203113 237682 -11363
18869a45709O389D3262b53384C13275a41749I86L21431j44050L118b85884r4599
$$ -145709 -139320 43262 -253384 313275 -141749 986 322417 178367 181485 -285884 -380483
18858c80483J50374d810k1722j33095o1346B1726L9587J523A4687a9519H0054
$$ -380483 -230109 -4810 -26532 -159627 -220973 21726 61313 62836 14687 -19519 80054
18846a63390B27918E1568R9410b13821j1364A50256c42229J20847j15911D296
$$ -163390 227918 51568 150978 -213821 -225185 150256 -342229 -221382 -337293 4296
18835B2413c8722D9598D099d86547b9578Q912c049G7853c4861j89459B41202b5516
$$ 22413 -38722 49598 4099 -486547 -29578 -20666 -3049 77853 -34861 -224320 241202 -25516
18822g4939k23638J40310H1907R5286d3723a3163c594j03112D9066M10069h1953
$$ -74939 -298577 -158267 81907 177193 -43723 -13163 -3594 -106706 49066 459135 -81953
18810A90100O3543i7251b5394G5138P9268d31543D8287c11104e3430j33773k9242
$$ 190100 253643 -97251 -25394 75138 154406 -431543 48287 -311104 -53430 -187203 -216445
18799b16445a02297l19359b7218B33463b33897F6334a3148k18041B00272g0436
$$ -216445 -102297 -421656 -27218 233463 -233897 66334 -13148 -231189 200272 -70436
18788a07632K8136A21701b15539F7499a74690j72786h9889j53915l7455B08095
$$ -107632 -79496 121701 -215539 67499 -174690 -347476 -89889 -243804 -281259 208095
18777B650J46592f6841J8442n7080C1852b63664d2583A20022a27724C7573L1646
$$ 2650 149242 -66841 -48399 -105479 31852 -263664 -42583 120022 -127724 37573 69219
18766F9219J04708b90331A37440j2658c5621C3009R3318b53993a08200l1074l0396
$$ 69219 173927 -290331 137440 124782 -35621 33009 126327 -253993 -108200 -139274 -169670
18755a69670B40815b71553A45913a7488k61008A02728f4360I2497O6692k4411
$$ -169670 240815 -271553 145913 -17488 -278496 102728 -64360 92497 159189 134778
18745A34778a81707m405l9858g5498l46878J38305J16461E0843J99819F8462i4556
$$ 134778 -181707 -186112 -225970 -75498 -422376 -284071 -167610 50843 250662 68462 -94556
18733B4079a45993E4444a81259L5977A27927E350a91285O2330b9943k48394A11734
$$ 24079 -145993 54444 -181259 -145282 127927 5350 -191285 -128955 -29943 -278337 111734
18721a50387A08208B6808c53653J54665L1870k86874E120J44263h8217k62583
$$ -150387 108208 26808 -353653 -198988 -167118 -453992 5120 149383 -88217 -350800
18711c50800A74039l1889F0923a99537e1313k71109k33194A26534l526J0231a53614
$$ -350800 174039 142150 60923 -199537 -51313 -322422 -555616 126534 123008 133239 -153614
18699d6749a766j98535k6381j8700J08688g005k43801M8461B33578a10359k16100
$$ -46749 -1766 -200301 -226682 -245382 -136694 -7005 -250806 -202345 233578 -110359 -326459
18688c26459B18731a1669l3048n2587A07952b10763B28263m5902a02363C2172
$$ -326459 218731 -11669 -44717 -97304 107952 -210763 228263 182361 -102363 32172
18677A71416k1002a62657G4873K13039a75114m9529d1224k46C8796A8456d02387
$$ 171416 150414 -162657 74873 287912 -175114 -224643 -41224 -41470 38796 18456 -402387
18665C96321A51096b49013d2005A39344a52524M5848I5576J09623b75521c1905
$$ 396321 151096 -249013 -42005 139344 -152524 -106676 95576 205199 -275521 -31905
18654C404J73228O759F2527b50304A27012M48c3386k63739A08377h3719b0777
$$ 3404 176632 183391 62527 -250304 127012 127460 -33386 -297125 108377 -83719 -20777
18642b24559J07613e5041o2814A737Q4171h0052l05287A54553a16118B86030b30511
$$ -224559 -116946 -55041 -117855 1737 85908 -80052 -385339 154553 -116118 286030 -230511
18630D6111B0476b4352k61892G4220k8301b40210C0071A0695f6673j27039l3426
$$ 46111 20476 -24352 -286244 74220 45919 -240210 30071 10695 -66673 -193712 -227138
18619b27138C19251a24014F7230b58552b1586r5053A39065f8974h991k10449l3136
$$ -227138 319251 -124014 67230 -258552 -21586 -116639 139065 -68974 -8991 -219440 -252576
18608b52576O5135k8326C58916e0414a121j58560b7737j64892B86605E0643a14169
$$ -252576 -187441 -215767 358916 -50414 -1121 -159681 -27737 -192629 286605 50643 -114169
18596e1700r5294j97686A68353b1810r0419I781i4803L7333j26996o1776H9603
$$ -51700 -146994 -344680 168353 -21810 -112229 9781 -94803 -57470 -184466 -246242 89603
18584C21796a55339O1357M4603j96250K7285g6344k06142A68309i9548j09998
$$ 321796 -155339 -93982 -49379 -245629 -218344 -76344 -282486 168309 -99548 -209546
18574b09546M6145m1727p1507J31193O5390D8207F570L9330i6036k06992f7112
$$ -209546 -163401 -205128 -276635 -145442 -80052 48207 6570 45900 -96036 -303028 -67112
18562d7668k88697n375J51653E5360d44027J56126L990A37864o5930f4942B5713
$$ -47668 -336365 -341740 -190087 55360 -444027 -287901 -283911 137864 71934 -64942 25713
18550f5643j32959A08239k7500D370a58189e4556k66074A07425d50541A10077
$$ -65643 -198602 108239 80739 4370 -158189 -54556 -320630 107425 -450541 110077
18539h0601a2169A02539a52465J5967A64172g4585D5311M1535b8741A71803j3617
$$ -80601 -12169 102539 -152465 -136498 164172 -74585 45311 86846 -28741 171803 158186
18528A58186d6545J2766l9230A94145e3964d694q324j80737G7112a19311n0349
$$ 158186 -46545 -33779 -73009 194145 -53964 -4694 -13018 -193755 77112 -119311 -169660
18517a69660G8543N4036A252L7202O804J41461a53465A8726D294J31714P7103
$$ -169660 78543 132579 1252 38454 45258 186719 -153465 18726 4294 136008 213111
18506B13111b86991A57501n7653M2682b4864k16754c0448j55194B5048b44313
$$ 213111 -286991 157501 99848 142530 -24864 -241618 -30448 -185642 25048 -244313
18495i6624H7981c9912I3002j7027J4284J92727A21211c34561j88606a2357j57280
$$ -96624 87981 -39912 93002 75975 90259 282986 121211 -334561 -523167 -12357 -169637
18484a69637h2830C76a4277I4258b10959j49948A01995a17834n6145b4513A19463
$$ -169637 -82830 376 -14277 94258 -210959 -360907 101995 -117834 -173979 -24513 119463
18472F4010J13454L03326b05616G5407q075h6390c3602j99097D169c36296J19352
$$ 64010 177464 480790 -205616 75407 67332 -86390 -33602 -232699 4169 -336296 -216944
18461b16944j0247D9401Q2596h5979b6017C12185a6475m5523m77338B6655a913
$$ -216944 -227191 49401 131997 -85979 -26017 312185 -16475 -61998 -539336 26655 -1913
18449b66906A41910a06013K5041o1682A85695a71378C1039b8994j97803Q3319
$$ -266906 141910 -106013 -80972 -142654 185695 -171378 31039 -28994 -226797 -143478
18439a43478e0237j8511k79292J69742h8062L0082D464J65017a40101I252j689
$$ -143478 -50237 -68748 -348040 -178298 -88062 -57980 4464 169481 -140101 9252 7563
18428G563h6974j03860B20972h4575j82805R2841B02010q9078f9482q6768f4910
$$ 7563 -86974 -190834 220972 -84575 -267380 -174539 202010 112932 -69482 -156250 -64910
18416E651b74479I4710E967a13999M6169o5470k61965C9721K5298a03072m3077
$$ 5651 -274479 94710 5967 -113999 -67830 -133300 -395265 39721 65019 -103072 -146149
18405a46149q4719C7315J03789c10219a08165c0692B21037m8366c17503A17046
$$ -146149 -230868 37315 141104 -310219 -108165 -30692 221037 172671 -317503 117046
18394b25531P898a9333l0585m6762C56717B9265i0582n4060B35166a49157k49549
$$ -225531 -217633 -19333 -49918 -96680 356717 29265 -90582 -144642 235166 -149157 -398706
18383c98706f8080l8213F9934a15264A16888a35659A91314k3302j5021L23082
$$ -398706 -68080 -106293 69934 -115264 116888 -135659 191314 168012 152991 476073
18373D76073a61808l7620G9859b26802h6486m6992k0898B07066i0099A33710M3990
$$ 476073 -161808 -199428 79859 -226802 -86486 -133478 -154376 207066 -90099 133710 177700
18362A77700n3069n1709b445o0402q7243A9774b222B31037h6791j35165a9699
$$ 177700 124631 72922 -2445 -62847 -150090 19774 -2222 231037 -86791 -221956 -19699
18350a41577a6726o7386K0095p6665N1217E8389d69478d75A46193b44361b9297
$$ -141577 -16726 -84112 -64017 -140682 -89465 58389 -469478 -475 146193 -244361 -29297
18338i2472F8339L6771b664A56336h7127l12209q795a24620A56657J54098j05719
$$ -92472 68339 105110 -2664 156336 -87127 -399336 -408131 -124620 156657 310755 205036
18327B05036a55892j6454B06177g0460B8850c24018H4694a6608q1266B91090a78797
$$ 205036 -155892 -172346 206177 -70460 28850 -324018 84694 -16608 -97874 291090 -178797
18315a9005m04369a55866k38672e2489a1523n4114j66788f0790k3772D8863d6128
$$ -19005 -423374 -155866 -394538 -52489 -11523 -65637 -232425 -60790 -84562 48863 -46128
18303D3221b77905A98300P3504A2443h7075j31225K0456I290J30962m1749A2105
$$ 43221 -277905 198300 271804 12443 -87075 -218300 -197844 9290 140252 98503 12105
18291a80452n5264F9180c4802A92013b98589F8663J6275b13135R5682q3829f8087
$$ -180452 -235716 69180 -34802 192013 -298589 68663 84938 -213135 -117453 -201282 -68087
18279a51197g2239b0579I9835b74909B14242a63079a8457k72416B2856a42940
$$ -151197 -72239 -20579 99835 -274909 214242 -163079 -18457 -290873 22856 -142940
18268G0379a08278p3111j42561n233o9494D6050i7514C14395b25529C9881J03644
$$ 70379 -108278 -181389 -323950 -329183 -398677 46050 -97514 314395 -225529 39881 143525
18257A43525d11434A21844B3267c84642A1690c60634b8914p7457k007j02152K3248
$$ 143525 -411434 121844 23267 -384642 11690 -360634 -28914 -106371 -108378 -210530 -187282
18246a87282k83676a48259C1718J51585J42716d6815r789j7089B8373a87419a2669
$$ -187282 -470958 -148259 31718 183303 326019 -46815 -56604 -73693 28373 -187419 -12669
18234g3442r6179C24303D3463h6334H356R0859l2567a00318p335j04418i4280
$$ -73442 -169621 324303 43463 -86334 8356 99215 66648 -100318 -107653 -212071 -94280
18222e9028F5890g5401c3414r625C3122K48847m7118g8159A3684c3038l4985B12516
$$ -59028 65890 -75401 -33414 -43039 33122 281969 234851 -78159 13684 -33038 -68023 212516
18209c30475E2600g2548l1715c4767P925F204Q5016J61302B2294K51834a00809
$$ -330475 52600 -72548 -104263 -34767 -26842 6204 91220 252522 22294 274128 -100809
18197B06286c71552d1327k5498j66076J8730E522J19005a08815p7231E7963a29591
$$ 206286 -371552 -41327 -66825 -232901 -214171 5522 124527 -108815 -186046 57963 -129591
18185a19712k43700I6612J64139A1803a29338j72003f3557m08369a63417k1966
$$ -119712 -363412 96612 260751 11803 -129338 -301341 -63557 -471926 -163417 -185383
18175a85383C306a91080I9388J19722O6147D0772N4891a56742G1609J66415h4812
$$ -185383 3306 -191080 99388 219110 285257 40772 95663 -156742 71609 238024 -84812
18163d7360j36018b9739j80941N2330e2689B00620H5073b06046K6389B84484i8030
$$ -47360 -183378 -29739 -210680 -158350 -52689 200620 85073 -206046 -179657 284484 -98030
18151b42789I3249g2553K5699A10473J98965e684k08879C20543b02452B00703
$$ -242789 93249 -72553 -46854 110473 309438 -5684 -214563 320543 -202452 200703
18140a7169Q381k63552h796m309F1960a46815A04181b66046q0409G7567d2426
$$ -17169 -8788 -272340 -8796 -13105 61960 -146815 104181 -266046 -346455 77567 -42426
18128D8303c08820G3686a33048e740H7341j0563Q1485a51785D57522A36335i7979
$$ 48303 -308820 73686 -133048 -5740 87341 76778 158263 -151785 457522 136335 -97979
18116a24750n4813G449L6037a90755a0916m5838j47126j22242b8589C86812F1383
$$ -124750 -179563 7449 43486 -190755 -10916 -56754 -203880 -326122 -28589 386812 61383
18104i6498K2088A57774b39735e1125B30329I8749g9884A72613l1889e2033C9287
$$ -96498 -74410 157774 -239735 -51125 230329 98749 -79884 172613 140724 -52033 39287
18092A19533j6925c6198p0644B3891h6913j03190I8821a74329B64830c58533L6041
$$ 119533 102608 -36198 -106842 23891 -86913 -190103 98821 -174329 264830 -358533 -322492
18081c22492C0643i5937E9411c2687r7545d6256q9920N9613C5916P9423a57125
$$ -322492 30643 -95937 59411 -32687 -130232 -46256 -136176 -76563 35916 115339 -157125
18069a51100l5249A76293a10108C8971K65591a66811E8297a32700B38553a03445
$$ -151100 -186349 176293 -110108 38971 304562 -166811 58297 -132700 238553 -103445
18058B30670r4113b72012H6718a89073j10712A40327l2261D1078a13117o8384
$$ 230670 136557 -272012 86718 -189073 -299785 140327 108066 41078 -113117 -181501
18048a81501A97764r2328K06677d8877A72007K15282a9723A08776a95844k7808
$$ -181501 197764 105436 312113 -48877 172007 387289 -19723 108776 -195844 -223652
18038b23652i7220A73401O5374a70871m0279J03738B6556J08335f2095H0772b69127
$$ -223652 -97220 173401 238775 -170871 -211150 -107412 26556 134891 -62095 80772 -269127
18026b44656b3114p7750A60822a60940F5828J6835k3813a3261p3301m340j2852
$$ -244656 -23114 -100864 160822 -160940 65828 82663 58850 -13261 -86562 -90902 -103754
18015a03754j02287A07512c96328A86287c8650F9448J79349F6876b61049A30146
$$ -103754 -206041 107512 -396328 186287 -38650 69448 248797 66876 -261049 130146
18004a55251O474A48266O1783a81881I6765b83585d7518M48A79284i9611j87280
$$ -155251 -148777 148266 210049 -181881 96765 -283585 -47518 -47070 179284 -99611 -286891
17993b86891g5936k48732e2887b0259B28630f1798C4802M8266h0914g184l31988
$$ -286891 -75936 -324668 -52887 -20259 228630 -61798 34802 83068 -80914 -7184 -339172
17982c39172J15165P2318e3534b4730o081k48571b94p6612c3822j46312b9532
$$ -339172 -224007 -151689 -53534 -24730 -30811 -279382 -294 -76906 -33822 -180134 -29532
17970A93144l8516B5574a14457d5072j02814c5065B10691O5626a35125j97502
$$ 193144 154628 25574 -114457 -45072 -147886 -35065 210691 276317 -135125 -332627
17960c32627e8602C5887a35659C5213a61840A49320N4793H1543c7028k38418J01188
$$ -332627 -58602 35887 -135659 35213 -161840 149320 204113 81543 -37028 -275446 -174258
17949a74258C2966a53921k3094j57017A24643E0612a66671g2538k04812G3905
$$ -174258 32966 -153921 -177015 -334032 124643 50612 -166671 -72538 -277350 73905
17938C24720b01952D9113b18689C9890b38752B06883q1657c2091e291B9239P0487
$$ 324720 -201952 49113 -218689 39890 -238752 206883 125226 -32091 -5291 29239 99726
17927I9726O9724J72290e6947j37761J7189E7381D05a7721j17524j46363h7594
$$ 99726 169450 341740 -56947 -194708 -177519 57381 405 -17721 -135245 -281608 -87594
17915a16705M7952m6907l1272R338j2406o8166n8291A6401Q2003b25153e4329
$$ -116705 -68753 -115660 -146932 -137594 -150000 -218166 -276457 16401 98404 -225153 -54329
17903E9016d0849C6284K62023C1432c09061e5029A60056b22194b4594B60848e1786
$$ 59016 -40849 36284 298307 31432 -309061 -55029 160056 -222194 -24594 260848 -51786
17891I9370c7106j83598F0305B3077K03779h957I5952e8309G0806J10363j2960
$$ 99370 -37106 -220704 60305 23077 226856 -8957 95952 -58309 70806 181169 168209
17880A68209J5203i7216A78447G1188g286m2372m1080C9047J7070J60428m1589
$$ 168209 183412 -97216 178447 71188 -7286 -49658 -90738 39047 56117 216545 174956
17869A74956a1919C274J62472l2807a42019f7618p2483a2031m04966J26883B64538
$$ 174956 -11919 3274 165746 132939 -142019 -67618 -140101 -12031 -416997 -290114 264538
17857A21726F0331a77816m214r0873A09729b36553B8136D197Q974R0174A3535
$$ 121726 60331 -177816 -182030 -272903 109729 -236553 28136 4197 13171 103345 13535
17845I4707C1052Q460a05659g635l09181I1429P6502Q181J00502a27871G8395
$$ 94707 31052 39512 -105659 -7635 -316816 91429 167931 176112 276614 -127871 78395
17833A04927a87806P0111A39361d7186B11675n0845b60826J997R4639O7683A63781
$$ 104927 -187806 -117695 139361 -47186 211675 160830 -260826 -258829 -164190 -96507 163781
17821g6487E4169b72815A11828C4672J74255J04668d3386C8880b24431m530d983
$$ -76487 54169 -272815 111828 34672 208927 313595 -43386 38880 -224431 -228961 -4983
17809a68196O8114q7811C3594P1122h2948r6012g7761E8517J59925p4607a0489
$$ -168196 -100082 -187893 33594 104716 -82948 -178960 -77761 58517 218442 143835 -10489
17797g5365C800f8565r2019C80684d6688j7471A77112o3137c5728k9869G0169
$$ -75365 3800 -68565 -160584 380684 -46688 -64159 177112 113975 -35728 -65597 70169
17785a2562A22694a33406e2016E542c45486B65657a21579J4862M6014B62238b99185
$$ -12562 122694 -133406 -52016 5542 -345486 265657 -121579 -106717 -60703 262238 -299185
17773c09885B06207L758B7105i6680q4238h3523J2745B14981b9512B16970c11203
$$ -309885 206207 209965 27105 -96680 -180918 -83523 -70778 214981 -29512 216970 -311203
17761h775A3255J24866B9103G111J5514K4696j8871a8119C07240r9372a85521
$$ -8775 13255 138121 29103 7111 22625 47321 28450 -18119 307240 207868 -185521
17749F6850K98701A1175a10376A4567a83391B53383D0415M782b05063C2765b52503
$$ 66850 365551 11175 -110376 14567 -183391 253383 40415 45197 -205063 32765 -252503
17737c61137F6093A6016a9149A74223A1700J64469g4297A36209a19113k44810
$$ -361137 66093 16016 -19149 174223 11700 176169 -74297 136209 -119113 -363923
17727c63923A24878L6096a473j57171D1538b73458j18348J74614d9030p1707b692
$$ -363923 124878 160974 -1473 -158644 41538 -273458 -391806 -217192 -49030 -120737 -2692
17715a27814A09766m3368a5021N818A99062G3930J28967q9306b29467A36759n4385
$$ -127814 109766 66398 -15021 -9203 199062 73930 202897 113591 -229467 136759 82374
17704H2374a70184B8500J3632a67284j62913D2688d9894m6842D0773K09773a62219
$$ 82374 -170184 28500 42132 -167284 -330197 42688 -49894 -96736 40773 250546 -162219
17692i7919k23578B35774p5036J549h2347k90562H3787l4222i7063B99334j40440
$$ -97919 -321497 235774 160738 162287 -82347 -372909 83787 49565 -97063 299334 158894
17681A58894b80222O3289A91918l4285p5952a6806r6045A46457e4166a8130A46269
$$ 158894 -280222 -216933 191918 157633 81681 -16806 -112851 146457 -54166 -18130 146269
17669i3312A1532f8795o8855R928m6093B18283D0761A3890J36724P1747c7524
$$ -93312 11532 -68795 -137650 -127722 -173815 218283 40761 13890 150614 222361 -37524
17657A7957K47783E4625K5961f9133q9907A27988F0502a16153N6305B09417a5069
$$ 17957 265740 54625 80586 -69133 -159040 127988 60502 -116153 -59848 209417 -15069
17645a56601Q474A90798b0681A32876a438H9453M725k5093b0268G9757j8375Q2744
$$ -156601 -148127 190798 -20681 132876 -1438 89453 94178 69085 -20268 79757 61382 144126
17633A44126J39138a22276j29514d2294B40152g0354Q84B44507q5311G3432J35375
$$ 144126 283264 -122276 -251790 -42294 240152 -70354 -69470 244507 159196 73432 208807
17622B08807c9900B47771a12761j3304D8409J93311Q2515j38360j1392N7821q5453
$$ 208807 -39900 247771 -112761 -126065 48409 241720 324235 185875 174483 232304 146851
17611A46851J06595H0209l9022J17521a22987G4049J7209J81141J3949O6586j72837
$$ 146851 253446 80209 41187 158708 -122987 74049 91258 272399 286348 352934 180097
17600A80097i8402B0425b29031Q0457A28425K1166a99554a9194n4880l13038B8334
$$ 180097 -98402 20425 -229031 -148574 128425 149591 -199554 -19194 -74074 -387112 28334
17588a28263o500C13965A08105a79145D55726k01341a23198j78091Q3100E9944
$$ -128263 -134763 313965 108105 -179145 455726 254385 -123198 -301289 -218189 59944
17577A04565a36162O2176B64287a86145m558A58209b81910d9587A15358d1123
$$ 104565 -136162 -73986 264287 -186145 -190703 158209 -281910 -49587 115358 -41123
17566A87796D2869i8213k47370A44244J74320B1582J78042h6214A72511i2067
$$ 187796 42869 -98213 -345583 144244 318564 21582 199624 -86214 172511 -92067
17555A91994a93058e5692J8521C9552o636N9495K7174K1386J4022b02951N9870
$$ 191994 -193058 -55692 -37171 39552 32916 92411 119585 140971 154993 -202951 -143081
17544a43081C26070A39777c91487J64248K3491A15379a81855I8194i9279l0359
$$ -143081 326070 139777 -391487 -227239 -203748 115379 -181855 98194 -99279 -129638
17534a29638l6859A47603J92900A50624E6109b6594G4704a09647A4665O1023b2241
$$ -129638 -166497 147603 340503 150624 56109 -26594 74704 -109647 14665 75688 -22241
17522a00829K9628B25706R9435k8807b1783j37078B11610a10571D5384J37643
$$ -100829 -71201 225706 325141 296334 -21783 -158861 211610 -110571 45384 183027
17512A83027a71562L5475k845c661C0983J85881a51039K0431K4222B37021b61817
$$ 183027 -171562 -136087 -138932 -3661 30983 216864 -151039 -130608 -106386 237021 -261817
17500A51267a75953i472G2920C3004i4664K5816j3225c3591d828B93629H253a06315
$$ 151267 -175953 -9472 72920 33004 -94664 -68848 -82073 -33591 -4828 293629 8253 -106315
17487h1266p6342C0629K57107F8179a21867I1432J90069H409d5620j73985B84788
$$ -81266 -157608 30629 287736 68179 -121867 91432 281501 8409 -45620 -219605 284788
17475d8146B6129N5950M37114k10317H1010A3353J71188a62306A0572J98999o3651
$$ -48146 26129 82079 519193 308876 81010 13353 184541 -162306 10572 209571 145920
17464A45920k8710c7006p1440A41239Q5120F529c14444a33844e584A73508k3551
$$ 145920 117210 -37006 -108446 141239 226359 6529 -314444 -133844 -5584 173508 149957
17453A49957p4033J55277P9259M75592e6939A68713L5516J6575n6413R5831A21508
$$ 149957 75924 231201 310460 786052 -56939 168713 204229 220804 164391 260222 121508
17441A94780m3109p391o6744N0564j416J80757J00691f5253H8596R5479D1657
$$ 194780 151671 144280 77536 128100 126684 307441 408132 -65253 88596 184075 41657
17429B02441A396J85131i7125C31471n463A31720J39062k6361o7679G735M04462
$$ 202441 1396 186527 -97125 331471 326008 131720 270782 244421 176742 7735 412197
17418D12197j59757H1427K17511B9000Q5416L97879A72055K45954A63546L1224
$$ 412197 252440 81427 298938 29000 114416 512295 172055 418009 163546 194770
17408A94770m6596K41488C9096b33352D05525H8841J07233G7712K28189d9509
$$ 194770 148174 389662 39096 -233352 405525 88841 196074 77712 305901 -49509
17397c8036D29775i2304D4562J52212Q8753D738L02947A47288a58395A45727a26460
$$ -38036 429775 -92304 44562 196774 285527 4738 307685 147288 -158395 145727 -126460
17385C0893R2812H053N740a07482B57310R7561b0279G3404B3289K0401g1193B24653
$$ 30893 123705 8053 13793 -107482 257310 354871 -20279 73404 23289 43690 -71193 224653
17372D6339j400G99L13842A22788B3626K27825j22685c25531B72650N9059A58615
$$ 46339 44939 799 314641 122788 23626 251451 128766 -325531 272650 331709 158615
17360i4781B93149K23084A19744Q2660m5663a62A0945a6488B25108j05527D7354
$$ -94781 293149 516233 119744 202404 156741 -162 10945 -16488 225108 119581 47354
17348I633L8855b17952H2656M6768a08984d3195A75040E2603K84726j14986A06094
$$ 9633 48488 -217952 82656 129424 -108984 -43195 175040 52603 337329 222343 106094
17336A26429m423b27079D75261j19112B5025L30587A34692f3051A52085J30184
$$ 126429 122006 -227079 475261 356149 25025 355612 134692 -63051 152085 282269
17326B82269J5982f9390F2041P7441f9439A84829a41825C02276J85830N4035D7973
$$ 282269 298251 -69390 62041 139482 -69439 184829 -141825 302276 488106 542141 47973
17314a91979C87842A93863a45011D07084H2865J10666a7914m0465C57013I4534
$$ -191979 387842 193863 -145011 407084 82865 193531 -17914 -58379 357013 94534
17303B918e1880B01020D8701l779R2007L12967k12453n8326H3116P8684J52381
$$ 2918 -51880 201020 48701 44922 136929 449896 237443 179117 83116 161800 314181
17292C14181j39583J09795n8215m1466J62458I0885g8451b740D95066q6725A0140
$$ 314181 174598 284393 226178 184712 347170 90885 -78451 -2740 495066 408341 10140
17280D89769a10391B97936j45945M01353a1520B7775J08620L23541A18773M545
$$ 489769 -110391 297936 151991 553344 -11520 27775 136395 459936 118773 123318
17270A23318D2354K69421B4962b06211G0079O6342M7876a04653B13036K01690
$$ 123318 42354 311775 24962 -206211 70079 136421 184297 -104653 213036 414726
17260D14726f0472C70415j36671g1875B63664b47784A20202K78094j83718K44424
$$ 414726 -60472 370415 233744 -71875 263664 -247784 120202 398296 214578 459002
17250D59002E6664J81683o2249K07859l1025G5696K86438j48109k606K32896A20960
$$ 459002 56664 238347 176098 383957 352932 75696 362134 214025 211419 444315 120960
17238B08547p9384P30Q4847I6356b01342D46844j14679r5729l9390J97261j23764
$$ 208547 129163 129893 214740 96356 -201342 446844 332165 236436 197046 394307 270543
17227B70543J23227a00864C39076A57898o0460J81942m3334O5015a09694A00428
$$ 270543 393770 -100864 339076 157898 97438 279380 236046 301061 -109694 100428
17216C13839H586d0148C74027I0316l5268M71222k54616d0480A85863k8475F7564
$$ 313839 8586 -40148 374027 90316 55048 526270 271654 -40480 185863 157388 67564
17204A12803J6689Q1730N5395I6952K8933J16598P0664C8939J76870L1199r4158
$$ 112803 129492 211222 266617 96952 125885 242483 313147 38939 215809 247008 152850
17193A52850K20675A58135C5123L81431d2877D34617j13565a47144C60139A8443
$$ 152850 373525 158135 35123 416554 -42877 434617 321052 -147144 360139 18443
17182A86585a3771C70279l7413G895K60852M83271A30928m2690J66750a9717A29570
$$ 186585 -13771 370279 332866 7895 268747 752018 130928 88238 254988 -19717 129570
17170D27597j17782J15017P3177A89068J20648K80785p3436k26103l8121n4173
$$ 427597 309815 424832 498009 189068 309716 590501 517065 290962 252841 198668
17160A98668J46382j02412I0903J07538J24200p7515r9279O31341C48260A69893
$$ 198668 345050 242638 90903 198441 322641 245126 145847 777188 348260 169893
17149D05498j75044G4425J09582K23312k094O1276J31989A65060K11858H6248
$$ 405498 230454 74425 184007 407319 405225 466501 598490 165060 376918 86248
17138G05576A24788K06982N5182n8913H8518L70373j71024J7299J65826J42345
$$ 705576 124788 331770 386952 328039 88518 458891 287867 305166 470992 613337
17128F13337B75414K88888k09107j70530a30701C49997B222L04344L3986K01771
$$ 613337 275414 564302 355195 184665 -130701 349997 2222 306566 340552 542323
17118E42323j09663j42222J19738P9473q2452j05804K27540A14031L89678k42822
$$ 542323 432660 290438 410176 489649 407197 301393 528933 114031 503709 260887
17108B60887J71321J6689l3491n5600L0699j91330J63107J47230j81422j56952
$$ 260887 432208 448897 415406 359806 390505 199175 362282 509512 328090 171138
17098A71138M54131k73505J67853H7519L83982j48030j09739J02369L7775k5080
$$ 171138 625269 351764 519617 87519 471501 323471 213732 316101 353876 328796
17088C28796M6027o436M9148l6120j61619B9781J84998M6574J29205K69914K332
$$ 328796 374823 368387 417535 381415 219796 29781 214779 261353 390558 660472 662804
17077F62804J0106A51050M39097B50222L27276B85254j3262R5142J02170M7845
$$ 662804 672910 151050 590147 250222 577498 285254 271992 367134 469304 517149
17067E17149j98847J51859o910J42857R9026B07839K92722j57717m1610M58097
$$ 517149 318302 470161 463251 606108 705134 207839 500561 342844 301234 759331
17057G59331l37338J23362k21675o8045q298O45542B52406J98494j31773R3783
$$ 759331 421993 545355 323680 255635 247337 892879 252406 450900 319127 412910
17047D12910O6085j79980J72753k3927L9773j27092R2367K03751j190l21929j47603
$$ 412910 478995 299015 471768 447841 487614 360522 452889 656640 655450 333521 185918
17036A85918K94761j07594L42388j46443j33253P6520j6287O04J42287K4605J65533
$$ 185918 480679 373085 715473 569030 435777 512297 496010 496614 638901 663506 829039
17025H29039C75737K75633C07071K17940M3053o911J81343M7710l00895K35959
$$ 829039 375737 651370 307071 525011 568064 561153 742496 790206 489311 725270
17015G25270j36165k1506j34906P1579K81263o2097K73878D94827L01830K86688
$$ 725270 589105 567599 432693 504272 785535 723438 997316 494827 796657 1083345
17005A083345j02225k63548K03027l26511j81826J84460P7786K76360j32801m3148
$$ 1083345 981120 717572 920599 594088 412262 596722 674508 950868 818067 774919
16995G74919p8861L10476j52001j33788o9783R5157k93921K80002k033K25397
$$ 774919 696058 1006534 854533 720745 650962 746119 452198 732200 730167 955564
16985I55564l10896J77473k92906K64297j96519K3940L90542j03721j78113K39833
$$ 955564 644668 822141 529235 793532 597013 620953 1011495 907774 729661 969494
16975I69494j58956J71313k36428J19194K51698j41325k42549n388R7198K13514
$$ 969494 810538 981851 745423 864617 1116315 974990 732441 727053 824251 1037765
16965A037765q2812m9712L09051k26889M4439J25046l34874J02339J68696n16844
$$ 1037765 954953 905241 1214292 987403 1031842 1156888 822014 924353 1093049 576205
16955E76205L11114K60839j86761L47815j0463l93977P6676L470j21809L14834
$$ 576205 887319 1148158 961397 1309212 1298749 904772 981448 984918 863109 1177943
16945A177943j0995K09589l96902k6699j99186N08526l04510L34446j67568K49397
$$ 1177943 1166948 1376537 979635 952936 753750 1262276 957766 1292212 1124644 1374041
16935A374041j68597p3817J43205k74391J81371M03041n46330J50242K22922j98148
$$ 1374041 1205444 1131627 1274832 1000441 1181812 1584853 1038523 1188765 1411687 1213539
16925A213539P9456m3600j03980L65220J97910l64075J56381O8941l59929L4521
$$ 1213539 1292995 1249395 1145415 1510635 1708545 1344470 1500851 1569792 1209863 1244384
16915A244384L08737j52305J73837k56945j59463N15233j1078O8240j49838k77256
$$ 1244384 1553121 1400816 1574653 1317708 1158245 1673478 1662400 1730640 1580802 1303546
16905A303546K91056K18269j10007o2962J14591l69777N26854k13505J16519j82158
$$ 1303546 1594602 1812871 1702864 1639902 1754493 1384716 1911570 1698065 1814584 1632426
16895A632426j36373K24669N4733L56119J63268n33927K38837k79608J91891K1944
$$ 1632426 1496053 1720722 1775455 2131574 2294842 1760915 1999752 1720144 1912035 1933979
16885A933979J26743k29409K04541l1137n7733M52530q2269m3987k47088M31383
$$ 1933979 2060722 1831313 2035854 2004717 1946984 2399514 2317245 2273258 2026170 2457553
16875B457553j04542j02568m3653r5645M26458L051k34716J92970J18300l47372
$$ 2457553 2353011 2250443 2206790 2111145 2537603 2540654 2305938 2498908 2617208 2269836
16865B269836J39489K83091P5368m2440J10932o9461R7151K58940j46716l51913
$$ 2269836 2409325 2692416 2767784 2725344 2836276 2766815 2863966 3122906 2976190 2624277
16855B624277P53927l87993K8807l39988M38337J25325R9446n2440o3358K68332
$$ 2624277 3378204 2990211 3019018 2679030 3117367 3242692 3342138 3289698 3226340 3494672
16845C494672J2158J56856J70814k32807n8091J89357J66039j1065n9099K90503
$$ 3494672 3506830 3663686 3834500 3601693 3543602 3732959 3898998 3887933 3828834 4119337
16835D119337k98748M13908k12466j81370Q03230O2897l80583K01791M9291J37815
$$ 4119337 3820589 4234497 4022031 3840661 4643891 4706788 4326205 4527996 4577287 4715102
16825D715102L73364k99856L92583m7448L1776J29812j15712K60461L74232l68269
$$ 4715102 5088466 4788610 5181193 5133745 5165521 5295333 5179621 5440082 5814314 5446045
16815E446045K63010o2094L01873J15677J51455P91720k38336l9019N0123K62156
$$ 5446045 5709055 5646961 5948834 6064511 6215966 7007686 6769350 6730331 6780454 7042610
16805G042610p4545L37029M1994Q7041L68025N6430J89890L96450L13718j26660
$$ 7042610 6968065 7305094 7347088 7434129 7802154 7858584 8048474 8444924 8758642 8631982
16795H631982J98986K67068K59533L22703L0411O98568j07189M04941L56654J07664
$$ 8631982 8830968 9098036 9357569 9680272 9710683 10409251 10302062 10707003 11063657 11171321
16785A1171321O52186l77048O35286Q08899J83682q230N86447K81299R46001J86068
$$ 11171321 11823507 11446459 12081745 12890644 13074326 13066096 13652543 13933842 14879843 15065911
16775A5065911L50078M47990R72080K19435Q25087L93291R58738M31852Q59640
$$ 15065911 15415989 15863979 16836059 17055494 17880581 18273872 19232610 19664462 20524102
16766B0524102L14518J167940Q31556N92310J226183N10609J378152R16880J261618
$$ 20524102 20838620 22006560 22838116 23430426 24656609 25167218 26545370 27462250 28723868
16757B8723868P68463J658518J477297J232342J578732J902076J643977J769954
$$ 28723868 29492331 31150849 32628146 33860488 35439220 37341296 38985273 40755227
16749D0755227K642142J988600K059395K617630K747931K418154L515521K956559
$$ 40755227 43397369 45385969 47445364 50062994 52810925 55229079 58744600 61701159
16741F1701159L160631L962119L933688M473508M399891M917496M895361N794842
$$ 61701159 64861790 68823909 72757597 77231105 81630996 86548492 91443853 97238695
16733I7238695O013572O202826O558248O909667P002690P606632P692306P598664
$$ 97238695 103252267 109455093 116013341 122923008 129925698 137532330 145224636 152823300
16725A52823300P577762P307829P288139O316545N535493M958223L807566K146658
$$ 152823300 160401062 167708891 174997030 181313575 186849068 191807291 195614857 197761515
16717A97761515J444720m32553j405998l358493l763521n065432o206831o403352
$$ 197761515 199206235 198773682 197367684 194009191 190245670 185180238 178973407 172570055
16709A72570055p275290p508284p600446q305630p655034p729546p012645p013448
$$ 172570055 165294765 157786481 150186035 141880405 134225371 126495825 119483180 112469732
16701A12469732o526970o386757n949760n466382n243951m653431m748207m235795
$$ 112469732 105942762 99556005 93606245 88139863 82895912 78242481 73494274 69258479
16693F9258479m321511l128805l699103l123753l059781k696994k579518j923199
$$ 69258479 64936968 61808163 58109060 54985307 51925526 49228532 46649014 44725815
16685D4725815k488564j930060j907537k048449j402724j947848j032846j593755
$$ 44725815 42237251 40307191 38399654 36351205 34948481 33000633 31967787 30374032
16677C0374032j500389r09309j180643j634682n44630j088436r83001q43710r16743
$$ 30374032 28873643 27964334 26783691 25149009 24604379 23515943 22532942 21689232 20772489
16668B0772489q00351o17891p67084n26991o69655q36104k29965n22931o63514
$$ 20772489 19972138 19354247 18587163 18060172 17390517 16554413 16324448 15801517 15138003
16659A5138003l26424n52875o03195n92857o9486o73219j99246j94961o52653
$$ 15138003 14811579 14258704 13655509 13062652 12993166 12319947 12120701 11925740 11273087
16650A1273087j04653o68702J66467m26498m13416l02096O1850M3766p98039k91679
$$ 11273087 11168434 10499732 10666199 10239701 9826285 9524189 9586039 9629805 8831766 8540087
16640H540087k83255j7821l60358Q935l50304l42487L2011J47668m39844n7119
$$ 8540087 8256832 8239011 7878653 7887588 7537284 7194797 7226808 7374476 6934632 6877513
16630F877513r7929k63040K41238o29976j66195O5732j460k80410n3577k32940
$$ 6877513 6779584 6516544 6757782 6127806 5961611 6027343 6025883 5745473 5691896 5458956
16620E458956j52412J92224n6586k33586j14463m27362K08705m08187j01489J98176
$$ 5458956 5306544 5498768 5442182 5208596 5094133 4666771 4875476 4467289 4365800 4563976
16610D563976J14075l33847j41345m01437L5473J05368J69636n93501N2391j84298
$$ 4563976 4678051 4344204 4202859 3801422 3836895 3942263 4111899 3518398 3570789 3386491
16600C386491L55465J02555l51662J20160l58542r378J95322k19769j48815j42169
$$ 3386491 3741956 3844511 3492849 3613009 3254467 3245089 3440411 3220642 3071827 2929658
16590B929658j52746J06532k94721L54953j12699K2129K61489m74026l1529q9510
$$ 2929658 2776912 2883444 2588723 2943676 2830977 2853106 3114595 2640569 2609040 2519530
16580B519530j05292K09329j84716Q1687k97765P8716K63171J75370l22018k31402
$$ 2519530 2414238 2623567 2438851 2520538 2222773 2301489 2564660 2740030 2418012 2186610
16570B186610k74801K4537L69204M3338m8365J20919k41798k00435K78794j98635
$$ 2186610 1911809 1936346 2305550 2348888 2300523 2421442 2179644 1979209 2258003 2059368
16560B059368K54942m36625r9206J7809J71088j06990r8896m1388J18947j87743
$$ 2059368 2314310 1877685 1778479 1796288 1967376 1860386 1761490 1720102 1839049 1651306
16550A651306J33215J23658m71411N76256k25933k93805J64800N6898k56041n9809
$$ 1651306 1784521 1908179 1436768 2013024 1787091 1493286 1658086 1714984 1458943 1399134
16540A399134k30861P13828J30705p09023M61931J71183m31984j36263n6344K40236
$$ 1399134 1168273 1882101 2012806 1303783 1765714 1936897 1504913 1368650 1312306 1552542
16530A552542l09921K29708j84609j02533L28541j99781j18019K52498l02354
$$ 1552542 1242621 1472329 1287720 1185187 1513728 1313947 1195928 1448426 1146072
16521A146072L22126j41370n3856J10878k62535R1656j536K86469j08443m26159
$$ 1146072 1468198 1326828 1272972 1383850 1121315 1212971 1211435 1497904 1389461 963302
16511I63302L00830K25796l72391Q148J31175k34776J06852k82541Q6328K2954
$$ 963302 1264132 1489928 1117537 1125685 1256860 1022084 1128936 846395 932723 955677
16501I55677K41702j90182O3095L64150n66708j57632L65992l3324j29573M02610
$$ 955677 1197379 1007197 1070292 1434442 867734 710102 1076094 1042770 913197 1315807
16491A315807k66910r5820J37245j90490R1270N172k82372R6581o0625L7324J03483
$$ 1315807 1048897 953077 1090322 899832 991102 996274 713902 810483 749858 787182 890665
16480H90665j25380l8957j46200l3043L55867n9144J02061k66265k33455M87032
$$ 890665 765285 726328 580128 547085 902952 843808 945869 679604 446149 933181
16470I33181l11980J19679K22618J9970j93833K17489l91839j01457N5823J96456
$$ 933181 621201 740880 963498 983468 789635 1007124 615285 513828 569651 766107
16460G66107K96439j49872m33226J04901R6988k48211R8123Q5048K46184j99761
$$ 766107 1062546 912674 479448 584349 681337 433126 531249 616297 862481 662720
16450F62720K0242j66262L0458J74396j35973j567k07142j05120L28139P6569
$$ 662720 682962 516700 547158 721554 585581 584014 376872 271752 599891 676460
16440F76460K24316N9630m71200K1924M7030j05184L4362j92342K28168m3496
$$ 676460 900776 960406 489206 511130 558160 452976 487338 294996 523164 479668
16430D79668L82131r2896C76849J64661A69259M63078k19880K20678l07382l8330
$$ 479668 861799 768903 376849 541510 169259 632337 412457 633135 325753 287423
16420B87423o868L14319A07169L79915J7258J10868B46924M28544O696K1938K28409
$$ 287423 280555 594874 107169 487084 504342 615210 246924 675468 682164 704102 932511
16409I32511k68159j53489j69590j5515J44026n485J51186l6574m0784k07147
$$ 932511 664352 510863 341273 325758 469784 464299 615485 578911 538127 330980
16399C30980A57282K76723j04277L51440m4449k64275j5661P5850j14847L59616
$$ 330980 157282 434005 329728 681168 636719 372444 356783 432633 317786 677402
16389F77402j90415j93010A07869K16437n2529K22599m8546A40598K44594P375
$$ 677402 486987 293977 107869 324306 271777 494376 445830 140598 385192 392567
16379C92567Q9091k08426O4586j05042J33196N3679j46454a30155L6160D6502
$$ 392567 481658 273232 337818 232776 365972 419651 273197 -130155 -93995 46502
16368B41219K09367l0459L05134B11622H4542K3829R3788O4409R7033J64215A68694
$$ 241219 450586 420127 725261 211622 84542 108371 202159 266568 363601 527816 168694
16356D31249J01164k30689F4741M06032m570I4463J77088K17436k19547C5083
$$ 431249 532413 301724 64741 470773 466203 94463 271551 488987 269440 35083
16345C11603J24799I6608J17209J46745j26838F0291K10756a21628C89403J46597
$$ 311603 436402 96608 213817 360562 233724 60291 271047 -121628 389403 536000
16335E36000k07539E9727L67018K98038C26866N8848o8434R8358A30447J67542
$$ 536000 328461 59727 426745 724783 326866 385714 317280 415638 130447 297989
16325B97989R8226A94457J45895j21624e3831D8996L02987p757K4162R3353E1127
$$ 297989 396215 194457 340352 218728 -53831 48996 351983 344226 368388 461741 51127
16313h6210C51472J06301B09869J87636j7155A82311L6431E6407K83908J76071
$$ -86210 351472 457773 209869 397505 380350 182311 218742 56407 340315 516386
16303E16386m3670A71112E2875J31209K58802B19258L03269r9298O4315j64828
$$ 516386 472716 171112 52875 184084 442886 219258 522527 423229 487544 322716
16293C22716J9550i962B07522K48804j70053B1755M11820j61608L8127F5036L28099
$$ 322716 342266 -9962 207522 456326 286273 21755 433575 271967 310094 65036 393135
16282C93135h2974A47713j1908O0822P5408A14818J83208J05149L1925C004M54240
$$ 393135 -82974 147713 135805 196627 272035 114818 298026 403175 435100 3004 457244
16271D57244L3485n650a68037B659L41701A35004l7802a1274A25428P4517l6357
$$ 457244 490729 485079 -168037 2659 344360 135004 97202 -11274 125428 199945 163588
16260A63588G5991N361K74605n1992J15708M6796M8341E5020e0663E27871k03397
$$ 163588 75991 81352 355957 303965 419673 466469 514810 55020 -50663 527871 324474
16249C24474j12092p2750m4690M08912J54506f9023b035A37183K39555e6563B76495
$$ 324474 212382 139632 94942 503854 658360 -69023 -2035 137183 376738 -56563 276495
16237A83701R8671m5004H8739a1951A53282a60974C14813A46014M1622j4189K11477
$$ 183701 282372 237368 88739 -11951 153282 -160974 314813 146014 187636 173447 384924
16226C84924o4407f6288G0456b36468C77112o2926J12891B3599O8728J68853b14780
$$ 384924 320517 -66288 70456 -236468 377112 314186 427077 23599 92327 261180 -214780
16214A62175b18748N5637c0335K41k3490G2405C5453C659e4602A06179K21543
$$ 162175 -218748 -163111 -30335 -30094 -53584 72405 35453 3659 -54602 106179 327722
16203C27722G2322K7943L1860E1548B4163J84851J44872A04723J70877h0272B02199
$$ 327722 72322 100265 132125 51548 24163 209014 353886 104723 275600 -80272 202199
16191A71070f684B43402d9331a4284F6841M5407P8549b79638B07539a3967A26380
$$ 171070 -6684 243402 -49331 -14284 66841 112248 190797 -279638 207539 -13967 126380
16179C95781A30090Q1332e6082A51330K16292a40874j21341A70348m227l71b2884
$$ 395781 130090 211422 -56082 151330 367622 -140874 -262215 170348 166121 165750 -22884
16167C75127I1298c5391A26632c0202B49607b40370C19069H4257J00763P3129
$$ 375127 91298 -35391 126632 -30202 249607 -240370 319069 84257 185020 258149
16157B58149A24939J57357g3856A72798b78222a20438a7157C231N5892L7753a81097
$$ 258149 124939 282296 -73856 172798 -278222 -120438 -17157 3231 59123 96876 -181097
16145e3871F297b3420m374C08893E5714J6725j6522b49600E2328g8146H0834f5433
$$ -53871 6297 -23420 -27794 308893 55714 72439 55917 -249600 52328 -78146 80834 -65433
16132B64613I9974b0106A97268d2156j5495r2524B2160K70470p7823L9813o8044
$$ 264613 99974 -20106 197268 -42156 -57651 -150175 22160 292630 214807 254620 186576
16121A86576E600a44570A02416a1064j17693B74430A0484J31134c2899j12143
$$ 186576 5600 -144570 102416 -11064 -128757 274430 10484 141618 -32899 -145042
16111a45042B06955a14721k579b3887A00472a76295k28j94429E0713K23251H088
$$ -145042 206955 -114721 -117300 -23887 100472 -176295 -176523 -370952 50713 273964 8088
16099C34486n6006a78982r021A54161a97605C41265c4123A50129b2857A0707b78739
$$ 334486 278480 -178982 -188003 154161 -197605 341265 -34123 150129 -22857 10707 -278739
16087C9433A1474a10026C31035F1971a01914M3421A62027a36060B16693a6342
$$ 39433 11474 -110026 331035 61971 -101914 -58493 162027 -136060 216693 -16342
16076D10740h4951Q342M94H852a14462o3486d6512k28633Q4194B269Q2790g7339
$$ 410740 -84951 -76609 -76115 8852 -114462 -177948 -46512 -275145 -190951 2269 85059 -77339
16063i7376C38995a14912k3172c5034j08556q6558A56945o9665J13057a19390
$$ -97376 338995 -114912 -138084 -35034 -143590 -230148 156945 87280 200337 -119390
16052a2073A3557g1742A7956M9311p563e5672A28248K69314e9904B84809E4410
$$ -12073 13557 -71742 17956 67267 59704 -55672 128248 397562 -59904 284809 54410
16040a82308e0538E5334d3502n1424n3712A99169l9439i7302k7859E1251O038
$$ -182308 -50538 55334 -43502 -94926 -148638 199169 159730 -97302 -125161 51251 57289
16029E7289J33997G9300b71990g235B98850d2010B32123l7980c06780F4809R3012
$$ 57289 191286 79300 -271990 -7235 298850 -42010 232123 194143 -306780 64809 157821
16018A57821d0088m9213J6648k32975a266l48810R9864A02361E102O5016B4280
$$ 157821 -40088 -89301 -72653 -305628 -1266 -350076 -250212 102361 5102 70118 24280
16006a78678h3030G2205b61799Q6210l1528j83215D656b67332c91A30653K13211
$$ -178678 -83030 72205 -261799 -175589 -207117 -390332 4656 -267332 -391 130653 343864
15995C43864a27409r5944H85i8853l156G6523a36711A32375c7060L040k66624
$$ 343864 -127409 -223353 885 -98853 -102009 76523 -136711 132375 -37060 -34020 -300644
15984c00644h7196E6677a18608a3057F3555L19337a20010E70099b7379I7800d3134
$$ -300644 -87196 56677 -118608 -13057 63555 382892 -120010 570099 -27379 97800 -43134
15972b19151R3520l17607a88861M6391I590a80357B9436c6370p4264A21944B2165
$$ -219151 -125631 -443238 -188861 -142470 9590 -180357 29436 -36370 -110634 121944 22165
15960C8489L06986A09234A9292P2888g7724A0027K0192a03013o917B8833L511
$$ 38489 345475 109234 19292 92180 -77724 10027 30219 -103013 -109930 28833 32344
15949C2344K67474c25357D5598O5025N8037a9725B27277a04960d8G7964e9523
$$ 32344 299818 -325357 45598 110623 168660 -19725 227277 -104960 -48 77964 -59523
15937b8987l0666C32033a19839m6465h2416K8355k22509Q3951B37717D1545J77296
$$ -28987 -59653 332033 -119839 -166304 -82416 -54061 -276570 -192619 237717 41545 218841
15926B18841J71245a96194a5270C7926a44348A40832B5869f09746b8967C8223
$$ 218841 390086 -196194 -15270 37926 -144348 140832 25869 -609746 -28967 38223
15915b90347d8874k8335i896k75647a39716E7021b5382j12527A24527a42337H0905
$$ -290347 -48874 -77209 -9896 -285543 -139716 57021 -25382 -137909 124527 -142337 80905
15903b78835O1430J00423o9336A38023a38481m0679A2148J53332C4661i6913j99691
$$ -278835 -217405 -116982 -186318 138023 -138481 -179160 12148 165480 34661 -96913 -296604
15892b96604G1340M5972k1200j4518c82928B09653a15719A57585K4562c14011
$$ -296604 71340 117312 96112 81594 -382928 209653 -115719 157585 182147 -314011
15881G5639a99078J2365k9163O8874k35647a74402e2502k7464b6268k52983B17267
$$ 75639 -199078 -186713 -215876 -147002 -382649 -174402 -52502 -79966 -26268 -279251 217267
15869D5361j8226L8642b97540a37612B64679c17860B26544e6469r117k2702B9129
$$ 45361 27135 65777 -297540 -137612 264679 -317860 226544 -56469 -65586 -88288 29129
15857D8744a35688j56621g3655l77286G3876K0786b74458B73527j29153e1566
$$ 48744 -135688 -292309 -73655 -450941 73876 94662 -274458 273527 144374 -51566
15846D78962c132D5829h1575C60396f6349k93790C62033b22461B29187h4976J286
$$ 478962 -3132 45829 -81575 360396 -66349 -360139 362033 -222461 229187 -84976 -83690
15835h3690D5060K5555h968A20588f0901C8197J80734I5775a11896n3753B94782
$$ -83690 45060 70615 -8968 120588 -60901 38197 218931 95775 -111896 -165649 294782
15823c5888A27013b6056O464j30938B0194K8604b05336h6174a2684k16436c2107
$$ -35888 127013 -26056 -19592 -150530 20194 48798 -205336 -86174 -12684 -229120 -32107
15811A1714M8697P5566c2250A9019h2025B29666p3497N172b55062K4939G2584
$$ 11714 60411 135977 -32250 19019 -82025 229666 156169 161341 -255062 -230123 72584
15799b74461j04535J69671E3581b1675j42753g2301H0780a84065C3872N366a52832
$$ -274461 -378996 -209325 53581 -21675 -164428 -72301 80780 -184065 33872 39238 -152832
15787i314A77261a26686A81112l4457c8632j90194J02740P300N0510j91196N4299
$$ -9314 177261 -126686 181112 146655 -38632 -228826 -126086 -118786 -68276 -259472 -205173
15776b05173c4482I0873d09235a23721D03614h5375E6417a21822l34292I3882
$$ -205173 -34482 90873 -409235 -123721 403614 -85375 56417 -121822 -456114 93882
15765i722j55168B6832b29726k30881a17965j39552j07716R807B5251a14475K9754
$$ -9722 -164890 26832 -229726 -460607 -117965 -257517 -365233 -355426 25251 -114475 -84721
15754h4721l4041m3609f8372a9414q818a1517B6610c59499a51979j02536H3218
$$ -84721 -118762 -162371 -68372 -19414 -28232 -11517 26610 -359499 -151979 -254515 83218
15742D3020L74992A0069J3640L0049h4452A30085b2544k41528i7853B2043a28172
$$ 43020 418012 10069 23709 53758 -84452 130085 -22544 -264072 -97853 22043 -128172
15730H2410l0439k3283P9999e6405D7455a94395A66751g7750p5008A34735g6172
$$ 82410 51971 28688 108687 -56405 47455 -194395 166751 -77750 -152758 134735 -76172
15718a41717j51092Q3186i5095A23547b03752j8424r6352c5761k09130b0967m5188
$$ -141717 -292809 -209623 -95095 123547 -203752 -222176 -318528 -35761 -244891 -20967 -66155
15707f6155B7613c50550B00710c23703J41527a6799n6698j66825G7820e3769A88702
$$ -66155 27613 -350550 200710 -323703 -182176 -16799 -73497 -240322 77820 -53769 188702
15695a35739k71798G8786R0652i3012e539A51015K0163L4263M981d4771D5667
$$ -135739 -407537 78786 169438 -93012 -5539 151015 171178 205441 210422 -44771 45667
15683f9247j34546B20047J61439a49287N2247B37173G43M8426i4074j28755Q9964
$$ -69247 -203793 220047 381486 -149287 -97040 237173 743 49169 -94074 -222829 -132865
15672a32865A86675H766L18284C7361C949d7965m1479B9769a22251b2194k10102
$$ -132865 186675 8766 327050 37361 3949 -47965 -89444 29769 -122251 -22194 -232296
15661b32296M4254C5052d18102D795g4089A66596a7039j29387A10795d4423B116
$$ -232296 -188042 35052 -418102 4795 -74089 166596 -17039 -146426 110795 -44423 2116
15649b97925A77575i5380j1645A31460b02856O8340B55544h6171E7871L1634L2404
$$ -297925 177575 -95380 -107025 131460 -202856 -134516 255544 -86171 57871 89505 121909
15638A21909M7938n5190C2199J04952C1997R3916b55067k006C0440a84116k577
$$ 121909 169847 114657 32199 137151 31997 125913 -255067 -257073 30440 -184116 -186693
15627a86693b7932j48234e9258A7093a8914r2644K6399c7737F4189b9477B989
$$ -186693 -27932 -176166 -59258 17093 -18914 -111558 -85159 -37737 64189 -29477 2989
15615g395k04463C2207Q0248c4098l41844d3375j49781h5890b5218p5169G9449
$$ -7395 -211858 32207 112455 -34098 -375942 -43375 -193156 -85890 -25218 -100387 79449
15603H2869h6231k86284c7059A19784c11847Q8567Q2383l03948j21054e8656l93789
$$ 82869 -86231 -372515 -37059 119784 -311847 -223280 -140897 -444845 -565899 -58656 -452445
15592d52445a04768C12433i2891A05874d05731D2578e8391g927C661M2928P752
$$ -452445 -104768 312433 -92891 105874 -405731 42578 -58391 -7927 3661 46589 54341
15581E4341O8850a81184D3962g6264q289B33294K1888a72539M1743a4302j6097
$$ 54341 123191 -181184 43962 -76264 -84553 233294 255182 -172539 -130796 -14302 -30399
15570c0399k26962a22023F2291j3450a70142A906J13307O7349e5004C7042f755
$$ -30399 -257361 -122023 62291 48841 -170142 1906 115213 182562 -55004 37042 -6755
15558i3291G3681b08183B20356A05295A3874J01861c08234A00355J85945a49267
$$ -93291 73681 -208183 220356 105295 13874 115735 -308234 100355 286300 -149267
15547c757r1845F8742e8675G4929h5416B9213L2414b37897K1252n6501f9647A19555
$$ -3757 -95602 68742 -58675 74929 -85416 29213 61627 -237897 -216645 -273146 -69647 119555
15534h1829E00462a13314M7729p7530d816A25035a27376H1544J74006A10031b44264
$$ -81829 500462 -113314 -65585 -143115 -4816 125035 -127376 81544 255550 110031 -244264
15522A6770a78649c0981H9561J3474a53722K2235N4521D6746d6210I2363b21831
$$ 16770 -178649 -30981 89561 103035 -153722 -131487 -76966 46746 -46210 92363 -221831
15510g060r5149K7200j81328H243Q085c91767a12412D3790J63500C5100c13060
$$ -7060 -102209 -75009 -256337 8243 16328 -391767 -112412 43790 207290 35100 -313060
15498b1922j17044A73605a31271r0869j54585J71677M8663d0969A00439c9667
$$ -21922 -138966 173605 -131271 -222140 -376725 -205048 -156385 -40969 100439 -39667
15487D0836b1111N456D50526c333E6980a39436n3734O6892A26944b07502A47068
$$ 40836 -21111 -15655 450526 -3333 56980 -139436 -193170 -126278 126944 -207502 147068
15475A10353k8802a65758A64852o4349L1035a24252j76914c4067j1661A30863
$$ 110353 81551 -165758 164852 100503 131538 -124252 -301166 -34067 -45728 130863
15464c05225A75121c54650a39279G3432b69173a1838l9292B15756P7104r9555
$$ -305225 175121 -354650 -139279 73432 -269173 -11838 -51130 215756 292860 193305
15454A93305A1971b1805l22225A37837a53631d2065k14874i3775l4124G8530J26080
$$ 193305 11971 -21805 -344030 137837 -153631 -42065 -256939 -93775 -127899 78530 204610
15443B04610B3516a55836G8738e3606G2007i6634d1497H4918P6049J14913d34013
$$ 204610 23516 -155836 78738 -53606 72007 -96634 -41497 84918 160967 275880 -434013
15431A17551K381g5627B3838O1297a37852G4247j5982j9135P1687b61927E8628
$$ 117551 119932 -75627 23838 85135 -137852 74247 58265 39130 110817 -261927 58628
15419A40343J6329a12640L3443B6030b08697B86221a68868D3710J18776o5867
$$ 140343 156672 -112640 -79197 26030 -208697 286221 -168868 43710 162486 96619
15409I6619J87717A4622k289K42292D5378d22619A68117o0470a08591o6382B23813
$$ 96619 284336 14622 12333 254625 45378 -422619 168117 107647 -108591 -174973 223813
15397A11551a26739j7099B95681c17848f3644n6555I6146a84870l4218B32267
$$ 111551 -126739 -143838 295681 -317848 -63644 -120199 96146 -184870 -219088 232267
15386B81561j00625C7472i5622D8617b32052j07834J47404A56435R4388b13313
$$ 281561 180936 37472 -95622 48617 -232052 -339886 -192482 156435 250823 -213313
15375a31176A4926J6079D486b45112A14967K04717g8311L1638A10650b401C70451
$$ -131176 14926 31005 4486 -245112 114967 319684 -78311 -46673 110650 -2401 370451
15363C43816j69471m4664J01399I0087B8278a948k54607e1943B37789q8224J9095
$$ 343816 174345 129681 231080 90087 28278 -1948 -256555 -51943 237789 149565 168660
15352A68660a28574A52742e01948B77392d14756G1064E702c1367B31123B7825
$$ 168660 -128574 152742 -501948 277392 -414756 71064 5702 -31367 231123 27825
15341b9262A22622i6713D59091a36185f0994j54024B86807c41652B98404j28648
$$ -29262 122622 -96713 459091 -136185 -60994 -215018 286807 -341652 298404 169756
15331A69756l304J62377l1344I3866j6273K37296G9405J06635F2827j8833a77310
$$ 169756 166452 328829 297485 93866 77593 314889 79405 186040 62827 43994 -177310
15319i983k7743n4711A04716b22012C3008K9694A9862O9007L9769J89449H0104
$$ -9983 -37726 -92437 104716 -222012 33008 62702 19862 88869 128638 318087 80104
15307a19138B60387r8467P7042M4220b58844A46714l753b54388e5068o9769K1179
$$ -119138 260387 161920 238962 283182 -258844 146714 142961 -254388 -55068 -124837 -103658
15296a03658A94139p8626c6384C78429b94987A21820Q21n6080c0231A91537H33
$$ -103658 194139 115513 -36384 378429 -294987 121820 122641 66561 -30231 191537 833
15284E0242d016A2904b43743a12286G3197L0569L3894n4729j3720a33674c5513
$$ 50242 -4016 12904 -243743 -112286 73197 103766 137660 82931 69211 -133674 -35513
15272C1521L4400K15814m2481r0007C8540J3724J57566a60825A16641b57813i1376
$$ 31521 65921 281735 239254 149247 38540 52264 209830 -160825 116641 -257813 -91376
15260B23979j10635n0202O1630b73766a28880A36703E5392Q7487F4422k9318J11924
$$ 223979 113344 63142 124772 -273766 -128880 136703 55392 142879 64422 35104 147028
15249A47028a66954C87647Q3920Q22543J428185A283923Q17933l93090F14234
$$ 147028 -166954 387647 471567 1294110 2722295 1283923 2101856 1708766 614234
15239C34016a13243a1592A24180J0326i2415F4899b97889a5265A60123J24524
$$ 334016 -113243 -11592 124180 134506 -92415 64899 -297889 -15265 160123 284647
15229B84647C3292a5709L402l57612a81333c8887A8770J84495H5733J43769J97191
$$ 284647 33292 -15709 -12307 -369919 -181333 -38887 18770 203265 85733 229502 426693
15218D26693G664h4448c9793E5937a18508k38066A24532j5383i4732m119H5796
$$ 426693 7664 -84448 -39793 55937 -118508 -356574 124532 109149 -94732 -98851 85796
15206A52790j1672a32628B39218m6611J11576L469F4700c24720B42158o5074b0521
$$ 152790 141118 -132628 239218 192607 304183 307652 64700 -324720 242158 177084 -20521
15194g0747k14489C25051b98760B66396j14915J06785D4727J11984E5360M5423
$$ -70747 -285236 325051 -298760 266396 151481 258266 44727 156711 55360 100783
15184A00783a12368f511B54519h4633k1695d3626j33261Q2451D3135M91475A59883
$$ 100783 -112368 -6511 254519 -84633 -106328 -43626 -176887 -94436 43135 534610 159883
15172A9264J9938L40839b6504j3595B71874a83358d1920a6046B31936n6812a1668
$$ 19264 39202 380041 -26504 -40099 271874 -183358 -41920 -16046 231936 175124 -11668
15160A41694e7279C1886J02817J96438h6651r1691A22315b31044C38680j02169
$$ 141694 -57279 31886 134703 331141 -86651 -178342 122315 -231044 338680 236511
15150B36511a22338B19474c0696C06069D3931K40151D5913j1732J07785K90945
$$ 236511 -122338 219474 -30696 306069 43931 284082 45913 34181 141966 432911
15140D32911h9481B7206a01716M1051B7729Q570K59405a51011O9622d685m1347
$$ 432911 -89481 27206 -101716 -60665 27729 36299 295704 -151011 -81389 -4685 -46032
15129d6032B26881l6966g6929C09170J18410A24617m5191J23778K76666B22649
$$ -46032 226881 189915 -76929 309170 427580 124617 79426 203204 479870 222649
15118c8618C4143J91094m2451H5087b93570A72204m473f6719G0635K82077J1769
$$ -38618 34143 225237 182786 85087 -293570 172204 167731 -66719 70635 352712 364481
15107C64481k6880A25801c9830F4858J29174q969j0384M9780E6669K23923l3281
$$ 364481 337601 125801 -39830 64858 194032 185063 174679 224459 56669 280592 247311
15096B47311l9736n0257d6398B02217c8817I3378a5878l05429a32972e4107j36517
$$ 247311 207575 157318 -46398 202217 -38817 93378 -15878 -321307 -132972 -54107 -190624
15085a90624H9079L1913K10823r998J03826H848J20695J30235m7665a18496C16733
$$ -190624 89079 120992 331815 321817 425643 8848 129543 259778 212113 -118496 316733
15073b54925B79499o845K8792F7435L70165H0721J24245Q6745q0504b7621C57635
$$ -254925 279499 272654 301446 67435 437600 80721 204966 291711 211207 -27621 357635
15061C975L29419Q7829A03769d5239D4762K06544A02884B3503L21656H2111M42693
$$ 3975 333394 421223 103769 -45239 44762 251306 102884 23503 345159 82111 524804
15050E24804A96464J5233p6394l531L31564A91080m9817o3298K9349e9151A05949
$$ 524804 196464 211697 135303 131772 463336 191080 141263 77965 107314 -59151 105949
15038f5456D76403A26906B7388C639J19327K39451k5286D9105L94344j98330J00375
$$ -65456 476403 126906 27388 3639 122966 362417 337131 49105 443449 245119 345494
15027C45494N6484J03819A3623K32200J2480Q4829m5271b9135D5611B1177K13762
$$ 345494 401978 505797 13623 245823 258303 343132 297861 -29135 45611 21177 234939
15016B34939E3461J18884J45560F8265m962J12236m5323J36256B6408M45757I0381
$$ 234939 53461 172345 317905 68265 63303 175539 130216 266472 26408 472165 90381
15004B14841r9138a9408B03978r7141J47370a21410A55654K12742r1834E3174
$$ 214841 115703 -19408 203978 106837 254207 -121410 155654 368396 276562 53174
14993I5438M752J20951K39374C8273a86119D37239A89725E6965J26975K25650
$$ 95438 100190 221141 460515 38273 -186119 437239 189725 56965 183940 409590
14983D09590I6855J81147L44612F0589L68154d0232n8373B23659C96J66034K56922
$$ 409590 96855 278002 622614 60589 428743 -40232 -98605 223659 396 166430 423352
14972D23352A29424J32298I0738P5552L00834j64284j45808a60865C95010J34084
$$ 423352 129424 261722 90738 166290 467124 302840 157032 -160865 395010 529094
14962E29094A27782r192L30572p0857j61153A7977N33658p5799j0422A92026m7249
$$ 529094 127782 118590 449162 378305 217152 17977 551635 475836 465414 192026 144777
14951A44777l4866K3371K19763A07143L62691A3089J03012O9313J73641r9608
$$ 144777 109911 133282 353045 107143 469834 13089 116101 185414 359055 259447
14941B59447p9377E8392L92194j05412A29448h3561B66321O3545J15653B17404
$$ 259447 180070 58392 450586 345174 129448 -83561 266321 329866 445519 217404
14930E64547B55421E7781J14177A7970Q7194K64626P2981I678L20585Q3098K51917
$$ 564547 255421 57781 171958 17970 105164 369790 442771 9678 330263 413361 665278
14919F65278e7254E43946K56558C98030A31968K10239o3325K10773j36300A66314
$$ 665278 -57254 543946 800504 398030 131968 342207 278882 489655 353355 166314
14908A42993J40254K63874B03567o392d575B48722J7836j28936L42351k21508
$$ 142993 283247 547121 203567 197175 -4575 248722 266558 137622 479973 258465
14898B58465J22085o4648K10965p4483j9443J2205q3635J03768j79728p6895J11599
$$ 258465 380550 315902 526867 452384 432941 445146 361511 465279 285551 208656 320255
14887C20255j04279M7948j6382p9758J13707K7132A21551L48137K16599B12558
$$ 320255 215976 263924 247542 167784 281491 308623 121551 469688 686287 212558
14876D39002l8572e017B41747A09692Q5307o4051J62090K8116K11955j74777P7077
$$ 439002 400430 -5017 241747 109692 194999 130948 293038 321154 533109 358332 435409
14865D35409j69380J30052E2702K81690M46230j31400D8877L08834L55798A78586
$$ 435409 266029 396081 52702 334392 780622 649222 48877 357711 713509 178586
14854B39648J1307J21787r1310J9277L15036l03245j45174N41644l50866J49821
$$ 239648 250955 372742 281432 300709 615745 312500 167326 708970 358104 507925
14844E07925N8864A41393Q1821Q7087j03446J55993A36383K183K1619K30150K34981
$$ 507925 566789 141393 223214 310301 206855 362848 136383 138566 160185 390335 625316
14833F25316l0960I0833M30999j01055E3790O5683L51917E7515M32734j33729
$$ 625316 594356 90833 521832 420777 53790 119473 471390 57515 490249 356520
14823C56520O2062o35A62032L57992J1794j0560j15954M7866K82336M228k94247
$$ 356520 418582 417947 162032 520024 531818 521258 405304 453170 735506 739734 445487
14812D45487K29549j29221j42212j3390J00421J21657B09572L55708j71451K5531
$$ 445487 675036 545815 403603 390213 490634 612291 209572 565280 393829 419360
14802D19360j48428L47568j42722L4771j54339M28803l63864M6658j79930L57751
$$ 419360 270932 618500 475778 510549 356210 785013 421149 467807 287877 645628
14792F45628r466J24110j74462p3901J597P249k57587J96722J30630o274k13903
$$ 645628 636162 760272 585810 511909 513506 520755 263168 459890 590520 584246 370343
14781C70343Q9312R8452m5537R6571P2439Q0401J36177B80487O31891l44106J97157
$$ 370343 459655 558107 512570 609141 681580 761981 898158 280487 912378 568272 765429
14770G65429j32498j68868K59482l13663N61102C09314l499J11945K93322l0537
$$ 765429 632931 464063 723545 409882 970984 309314 305815 417760 711082 680545
14760F80545k9200j69976j23429N33948m38989O53174l39267P7961J3349j74870
$$ 680545 651345 481369 357940 891888 452899 1106073 766806 844767 858116 683246
14750F83246B78660N06404k06712M1445N8332K19556L36999E02626K23495m73
$$ 683246 278660 785064 578352 619797 678129 897685 1234684 502626 726121 725648
14740G25648J74568O259C02117O05226p0924k37859N6442j33961J01927M8793
$$ 725648 900216 906475 302117 907343 836419 598560 655002 521041 622968 671761
14730F71761M9496C20254L18601k22966K80760l1605J63898J61339j78795J11611
$$ 671761 721257 320254 638855 415889 696649 665044 828942 990281 811486 923097
14720I23097j94724J1085K5331L15603n28261J83742K2920k28232N44344j02946
$$ 923097 728373 739458 764789 1080392 552131 735873 758793 530561 1074905 971959
14710I71959j37295k40747M17627m05850M15472P7553l12600M02069j60313j5865
$$ 971959 834664 593917 1011544 605694 1021166 1098719 786119 1188188 1027875 1012010
14700A012010J26562m73551L17520q212j51179L20267k90931J81102k50145R1859
$$ 1012010 1138572 665021 982541 974329 823150 1143417 852486 1033588 783443 875302
14690H75302k04274L63229r017n0211l91059L05949J14847l34419L39989K86850
$$ 875302 671028 1034257 1025240 975029 583970 889919 1004766 670347 1010336 1297186
14680A297186p8647m16267K09064q5390J98215l12304J14317J54053j94593L39615
$$ 1297186 1218539 802272 1011336 925946 1124161 811857 926174 1080227 885634 1225249
14670A225249l14881O6934J65827l30047K49492K21938k34571j44259J73927n8675
$$ 1225249 910368 977302 1143129 813082 1062574 1284512 1049941 905682 1079609 1020934
14660A020934K07807j35j530k04119m4510j87489M28611n4488K20132j19784N681
$$ 1020934 1228741 1228606 1227076 1022957 978447 790958 1219569 1165081 1385213 1265429 1271110
14649A271110r0467j2496J98983o1859K3790l11184K50523J88856l81026L97411
$$ 1271110 1180643 1168147 1367130 1305271 1329061 1017877 1268400 1457256 1076230 1473641
14639A473641m96245M12787j4270p8074j39715R7650K64575o4007J80842o55525
$$ 1473641 977396 1390183 1375913 1297839 1158124 1255774 1520349 1456342 1637184 981659
14629I81659M63390j4230l4603R7316r601l3126K45097m12637J94866o2019j49276
$$ 981659 1445049 1430819 1396216 1493532 1483931 1450805 1695902 1283265 1478131 1416112 1266836
14618A266836K4548N8406O5982l3599J11034r1746K05558k01853R4076j84716
$$ 1266836 1291384 1349790 1415772 1382173 1493207 1401461 1607019 1405166 1499242 1314526
14608A314526M07080j03897j45134K46012l16590J58650J58583j14967K8355r0482
$$ 1314526 1721606 1617709 1472575 1718587 1401997 1560647 1719230 1604263 1632618 1542136
14598A542136K05618j10449J47993l51510L85760M6518K6471J86756l20597k19665
$$ 1542136 1747754 1637305 1785298 1433788 1819548 1866066 1892537 2079293 1758696 1539031
14588A539031L63883j81361K50269M0300k93762J67282M5820O0992L32347j86148
$$ 1539031 1902914 1721553 1971822 2012122 1718360 1885642 1931462 1992454 2324801 2138653
14578B138653K62756m22268K71141k18480J37209j79145J40651N2914J56654n1445
$$ 2138653 2401409 1979141 2250282 2031802 2169011 1989866 2130517 2183431 2340085 2288640
14568B288640l3973p2324L58292q084j67489R9552O952M05108J03307k9617j26521
$$ 2288640 2254667 2182343 2540635 2532551 2365062 2464614 2471566 2876674 2979981 2950364 2823843
14557B823843M85423m05774K37415J97352L83318M85886K03507J230608J521221
$$ 2823843 3309266 2903492 3140907 3338259 3721577 4207463 4410970 5641578 7162799
14548G162799L559023Q051324J9309029J1682139B0034835I214922j556631P34187
$$ 7162799 10721822 18773146 38082175 49764314 20034835 9214922 7658291 8392478
14540H392478D048049j364137o92770M01139j52630k10700J90839l06354K76664
$$ 8392478 4048049 2683912 1991142 2392281 2239651 2028951 2219790 1913436 2190100
14531B190100J68095J9152l15992L4575L39340n06686N26120k59379n668K75830
$$ 2190100 2358195 2377347 2061355 2095930 2435270 1928584 2454704 2195325 2189657 2465487
14521B465487J8979M3707k04967J76056M6339L37277K525l67318r7388L46613
$$ 2465487 2484466 2528173 2323206 2499262 2545601 2882878 2885403 2518085 2420697 2767310
14511B767310M06679p0710j48987P345J3941j4446J02634K9833N0830o6296L19729
$$ 2767310 3173989 3103279 2954292 2961637 2975578 2961132 3063766 3093599 3144429 3078133 3397862
14500C397862j91565l32282L78598R0219j13272J19231L38715j20040l0050J05378
$$ 3397862 3206297 2874015 3252613 3342832 3229560 3348791 3687506 3567466 3537416 3642794
14490C642794P977q9773P7995J10462j51483K57443l6776l0290J95042k87735
$$ 3642794 3650771 3560998 3638993 3749455 3597972 3855415 3818639 3788349 3983391 3695656
14480C695656P0492M69669k33937L36552k91653K41691k08623K70858M0636K0373
$$ 3695656 3766148 4235817 4001880 4338432 4046779 4288470 4079847 4350705 4391341 4411714
14470D411714r2175J78653L21373k31360K97493n14066l6875L97417K09422k63786
$$ 4411714 4319539 4498192 4819565 4588205 4885698 4371632 4334757 4732174 4941596 4677810
14460D677810N90679k50971j16357L54186Q513L0993o3224K57966P6635j62536
$$ 4677810 5268489 5017518 4901161 5255347 5263860 5294853 5231629 5489595 5566230 5403694
14450E403694N9980j64713K56643L47672J25138l9957j27755J02002K74746J12936
$$ 5403694 5463674 5298961 5555604 5903276 6028414 5988457 5860702 5962704 6237450 6350386
14440F350386J21810k48000M41423l31322K53687J99406J16099j3936O6890r933
$$ 6350386 6472196 6224196 6665619 6334297 6587984 6787390 6903489 6889553 6956443 6946510
14430F946510j32822L64051K6655j08367J95669J22010L75332J17561r6954j07641
$$ 6946510 6813688 7177739 7204394 7096027 7291696 7413706 7789038 7906599 7809645 7702004
14420G702004M56904O7940J63124K93612k75413N34848P0246o9590L51548j85844
$$ 7702004 8158908 8226848 8389972 8683584 8408171 8943019 9013265 8943675 9295223 9109379
14410I109379M56008J15279J92901L5284J57361n9795O60344j96953K31794M18599
$$ 9109379 9565387 9680666 9873567 9908851 10066212 10006417 10666761 10469808 10701602 11120201
14400A1120201m20413O23118R0357j35963M06074l1693K28055N96900r8976L51282
$$ 11120201 10699788 11322906 11413263 11277300 11683374 11651681 11879736 12476636 12377660 12728942
14390A2728942k4303M59193o3236M01704O09411l89662N18628J85399J99601M59297
$$ 12728942 12704639 13163832 13100596 13502300 14111711 13722049 14240677 14426076 14625677 15084974
14380A5084974N0209M26594R7138R54056k87485N17119K43451K6763N04921J95897
$$ 15084974 15135183 15561777 15658915 16612971 16325486 16842605 17086056 17112819 17617740 17813637
14370A7813637M87489N19567K23067N75897K08379M21158M21945O81018K64672
$$ 17813637 18301126 18820693 19043760 19619657 19828036 20249194 20671139 21352157 21616829
14361B1616829N93254M07810N56299L46194L81585J152262J41015Q17059O06178
$$ 21616829 22210083 22617893 23174192 23520386 23901971 25054233 25195248 26012307 26618485
14352B6618485O74579M88901N60279P69582O75166P10290P18298J061885R41944
$$ 26618485 27293064 27781965 28342244 29111826 29786992 30497282 31215580 32277465 33219409
14343C3219409P67294R32921R62483M92239J771811M59871J099055Q05721J390086
$$ 33219409 33986703 34919624 35882107 36374346 38146157 38606028 39705083 40510804 41900890
14334D1900890J316448J393590J363879J423353J282007J497562J376479J934451
$$ 41900890 43217338 44610928 45974807 47398160 48680167 50177729 51554208 53488659
14326E3488659J945003J813878J732359J970383J944138K099985K491545K307149
$$ 53488659 55433662 57247540 58979899 60950282 62894420 64994405 67485950 69793099
14318F9793099K577328K311903K890803L311825L151706L225594L355209L263372
$$ 69793099 72370427 74682330 77573133 80884958 84036664 87262258 90617467 93880839
14310I3880839L811799M257908M109344M462339M966587M915842N280479N708778
$$ 93880839 97692638 101950546 106059890 110522229 115488816 120404658 125685137 131393915
14302A31393915N679484O266801P081970O946739P270144P722778Q416463Q658137
$$ 131393915 137073399 143340200 150422170 157368909 164639053 172361831 180778294 189436431
14294A89436431R187016R940200J0104185J0853959J1182648J1942848J2431380
$$ 189436431 198623447 208563647 218667832 229521791 240704439 252647287 265078667
14287B65078667J2995774J3712768J3576339J4385923J4763795J4680201J4938474
$$ 265078667 278074441 291787209 305363548 319749471 334513266 349193467 364131941
14280C64131941J4398035J4426885J4055492J3215220J2422258J0995189R477369
$$ 364131941 378529976 392956861 407012353 420227573 432649831 443645020 453122389
14273D53122389O711398L565359R59147J37860J170865m079447o477798o636267
$$ 453122389 459833787 463399146 464358293 464496153 465667018 461587571 455109773 448473506
14265D48473506p457485q705249j0286400j2617109j3302855j4245728j4848927
$$ 448473506 441016021 432310772 422024372 409407263 396104408 381858680 367009753
14258C67009753j4742927j5622301j5452146j4762989j4678754j4789459j1859736
$$ 367009753 352266826 336644525 321192379 306429390 291750636 276961177 265101441
14251B65101441j2557216j2208521j1973762j1224436j0595262j0080982r196773
$$ 265101441 252544225 240335704 228361942 217137506 206542244 196461262 187264489
14244A87264489q448774q358560q463398p120279p201776o538827o320754n180605
$$ 187264489 178815715 170457155 161993757 154873478 147671702 141132875 134812121 129631516
14236A29631516n879236n283477n046023n227157l804458l744341m245381l892755
$$ 129631516 123752280 118468803 113422780 108195623 104391165 100646824 96401443 92508688
14228I2508688l814436l246954l118763k853881k975036k940022k862572j923884
$$ 92508688 88694252 85447298 82328535 79474654 76499618 73559596 70697024 68773140
14220F8773140k579389k224820j745463k287736k206932j539224j667031j214294
$$ 68773140 66193751 63968931 62223468 59935732 57728800 56189576 54522545 53308251
14212E3308251j796053k013399j518493j471283p80927q42460j092300j543265
$$ 53308251 51512198 49498799 47980306 46509023 45728096 44885636 43793336 42250071
14204D2250071j386623j303703r83352q43360o16082j449420j140890j003113
$$ 42250071 40863448 39559745 38576393 37733033 37116951 35667531 34526641 33523528
14196C3523528m80638o06865j012570q20264n71334q06699n45419r56804p78954
$$ 33523528 33042890 32436025 31423455 30603191 30031857 29225158 28679739 27722935 26943981
14187B6943981m97831m93249r82994j49464m65060l82200p10659q98644J70401
$$ 26943981 26446150 25952901 24969907 24820443 24355383 23973183 23262524 22363880 22534281
14178B2534281o60203m72010m62261m46234m8635q51862l50918j4145r21698J07846
$$ 22534281 21874078 21402068 20939807 20493573 20444938 19593076 19242158 19228013 18306315 18414161
14168A8414161l69602o83244l83848j20677j72572n40843Q92m63653m59346q5983
$$ 18414161 18044559 17361315 16977467 16856790 16684218 16143375 16144267 15680614 15221268 15135285
14158A5135285j54899j58318l87866j63196k64027m51984n3128n02671K23450
$$ 15135285 14980386 14822068 14434202 14271006 14006979 13554995 13501867 12999196 13222646
14149A3222646m44957j64721n31241J18719l84555k38459L3378k42333k10253
$$ 13222646 12777689 12612968 12081727 12200446 11815891 11577432 11610810 11368477 11158224
14140A1158224j02682k47291k03076r1536j2870K4553k00384m38242J50215m52825
$$ 11158224 11055542 10808251 10605175 10513639 10500769 10525322 10324938 9886696 10036911 9584086
14130I584086j68349Q9063j99542l15709j76306J23576n5357l28330k13737K3298
$$ 9584086 9415737 9504800 9305258 8989549 8813243 8936819 8881462 8553132 8339395 8362693
14120H362693j12927j05497P2812o0395j28159l5114j70600k17230r8356j68457
$$ 8362693 8249766 8144269 8217081 8156686 8028527 7993413 7822813 7605583 7507227 7338770
14110G338770J06057l09563r7064j4039O2148n8925m28445J17016L3019m4318
$$ 7338770 7444827 7135264 7038200 7024161 7086309 7027384 6598939 6715955 6748974 6704656
14100F704656j06177j82027j97949J68310k22350N5612l96135M07244l71663J27925
$$ 6704656 6598479 6416452 6218503 6386813 6164463 6220075 5823940 6231184 5859521 5987446
14090E987446j00227j26162K8903m0978k30780j94913K90785j68993M6323k75407
$$ 5987446 5887219 5761057 5789960 5748982 5518202 5323289 5614074 5445081 5491404 5215997
14080E215997J99827m23675l4477N0761j72428O09865o65346q0036K57181k58419
$$ 5215997 5415824 4992149 4957672 5008433 4836005 5445870 4780524 4700488 4957669 4699250
14070D699250j99189l2041J73321k12461j73792K44320q1360j04478o5992m8877
$$ 4699250 4500061 4468020 4641341 4428880 4255088 4499408 4418048 4313570 4247578 4198701
14060D198701K1993J92302l94144K89682Q3457l35128m242j50479m1005P787k6873
$$ 4198701 4220694 4412996 4018852 4308534 4391991 4056863 4052621 3902142 3861137 3868924 3842051
14049C842051l58642O3533M48441j52715n4589k90968J21304J74926k7828n37879
$$ 3842051 3483409 3546942 3995383 3842668 3788079 3497111 3618415 3793341 3765513 3227634
14039C227634J81249M3662j40256J12023j1252l72269L29439j03701p9770R5690
$$ 3227634 3408883 3452545 3312289 3424312 3413060 3040791 3370230 3266529 3186759 3282449
14029C282449J72704m01640L78250k93459J84795l58369J45807P9697k06339O1946
$$ 3282449 3455153 3053513 3431763 3138304 3323099 2964730 3110537 3190234 2983895 3045841
14019C045841m06697L94628L9898n25543M62700l08652M1027n9510J96440l71268
$$ 3045841 2639144 3033772 3073670 2548127 3010827 2702175 2743202 2683692 2880132 2508864
14009B508864L5005Q7303k49806M8392M8968n4235j23700J90635j6963L34599
$$ 2508864 2543869 2631172 2381366 2429758 2478726 2424491 2300791 2491426 2474463 2809062
13999B809062k37743J17958n70438O8933p1100J70231l5846Q8665K19275K83977
$$ 2809062 2571319 2689277 2118839 2187772 2116672 2286903 2251057 2339722 2558997 2842974
13989B842974P00103K138056O430452J8111753K1943795k4916066j3253209n269213
$$ 2842974 3543077 5681133 12111585 30223338 52167133 27251067 13997858 8728645
13981H728645j748581j404509j046358m00232l11671j82390n32886k6545k17404
$$ 8728645 6980064 5575555 4529197 4128965 3817294 3634904 3102018 3075473 2858069
13972B858069k6128J52994l91779p2399K99276K7603k34373k97023J86449P7920
$$ 2858069 2831941 2984935 2593156 2520757 2820033 2847636 2613263 2316240 2502689 2580609
13962B580609j76702k62148J78778l29465K07672j49951K21269K6266m34700L49003
$$ 2580609 2403907 2141759 2320537 1991072 2198744 2048793 2270062 2296328 1861628 2210631
13952B210631l4742j59335K46876r3077K9548j70043j21727J73881P0031j94387
$$ 2210631 2175889 2016554 2263430 2170353 2199901 2029858 1908131 2082012 2152043 1957656
13942A957656J17722p5836p8183K65093q2398K6153n15530J98461O8923j58415
$$ 1957656 2075378 1999542 1921359 2186452 2104054 2130207 1614677 1813138 1882061 1723646
13932A723646J52746k71256L29668J3503k1501j99550J93015o9718j30759J27490
$$ 1723646 1876392 1605136 1934804 1948307 1926806 1727256 1920271 1850553 1719794 1847284
13922A847284j85133K32695o05387N65080l60872j05376L10474j51030L75431
$$ 1847284 1662151 1894846 1289459 1854539 1493667 1388291 1698765 1547735 1923166
13913A923166m99899K97247J36534K2231m78203m2896J74059J13858J2574k87241
$$ 1923166 1423267 1720514 1857048 1879279 1401076 1358180 1532239 1646097 1658671 1371430
13903A371430K35132m6287l9093k81441M73566m42578L20842k93047Q0314K15271
$$ 1371430 1606562 1560275 1521182 1239741 1713307 1270729 1591571 1298524 1378838 1594109
13893A594109M1123j35180j07785K83055l61690Q5033J06182j72099J75641p4360
$$ 1594109 1635232 1500052 1392267 1675322 1313632 1398665 1504847 1332748 1508389 1434029
13883A434029j35428q2585M14321m61546R7920j68570J76676J58700O2680l38715
$$ 1434029 1298601 1216016 1630337 1168791 1266711 1098141 1274817 1433517 1496197 1157482
13873A157482J66333j65419L6603O0066K54842k54178L4817J03639K52326k30317
$$ 1157482 1323815 1158396 1194999 1255065 1509907 1255729 1290546 1394185 1646511 1416194
13863A416194j83187j14810K67156m65975J02694r5619J80252J12786n37920L41551
$$ 1416194 1233007 1118197 1385353 919378 1022072 926453 1106705 1219491 681571 1023122
13853A023122J56689J2882j75187J90578p1227K54652F49583O50916J07640l81481
$$ 1023122 1179811 1192693 1017506 1208084 1136857 1391509 649583 1300499 1408139 1026658
13843A026658J12645q6795q0080k132J58597k08205n9652L39438k7122k90262
$$ 1026658 1139303 1052508 972428 970296 1128893 920688 861036 1200474 1173352 883090
13833H83090L31491O0703j16382p7191J10112j28235j49297K88017q4182j66994
$$ 883090 1214581 1275284 1158902 1081711 1191823 1063588 914291 1202308 1118126 951132
13823I51132p364Q8547l88082K56143K59959m05326L60154M8171k60082o3132
$$ 951132 943768 1032315 644233 900376 1160335 755009 1115163 1163334 903252 840120
13813H40120K63807j04285L6931l62990Q1131K91424k24342p223J72549k06041
$$ 840120 1103927 999642 1036573 673583 754714 1046138 821796 814573 987122 781081
13803G81081Q7698L31102l79025j52637J21728j33425J71065J05489k20950m4289
$$ 781081 868779 1199881 820856 668219 789947 656522 827587 933076 712126 667837
13793F67837J71994K21853j14248j15431P8687k66895J5162J76095k92401L61689
$$ 667837 839831 1061684 947436 832005 910692 643797 658959 835054 542653 904342
13783I04342K5918j80448J63504L59734o2398l78556J73507k54552Q9147j26924
$$ 904342 930260 749812 913316 1273050 1210652 832096 1005603 751051 840198 713274
13773G13274J06560J70989J1600j12669p4081j19973r4787N224M31662j2394j56669
$$ 713274 819834 990823 1002423 889754 815673 695700 600913 606137 1037799 1025405 868736
13762H68736J14406R0988l09590C76985M34822n1752R8531j02838j45583j20903
$$ 868736 983142 1074130 764540 376985 811807 760055 858586 755748 610165 489262
13752D89262K8208J65162k18101L08310M0023K8848k43871K84237j47444k61618
$$ 489262 517470 682632 464531 772841 812864 841712 597841 882078 734634 473016
13742D73016N05733C61283O44272C38591N49776k27789L31415l18994Q3603o1641
$$ 473016 978749 361283 1005555 338591 888367 660578 991993 672999 756602 694961
13732F94961J40949j42447M4703J89178l05866k4852j10178R4836j52638K44627
$$ 694961 835910 693463 738166 927344 621478 596626 486448 581284 428646 673273
13722F73273B60177L11304j12230K86151j08461J38133j22482J34150k49114k64734
$$ 673273 260177 571481 459251 745402 636941 775074 652592 786742 537628 272894
13712B72894J73508J70072L0432K2317A60218L51017K86292j40233j64227r3114
$$ 272894 446402 616474 646906 669223 160218 511235 797527 657294 493067 399953
13702C99953J15227J77932j16509k4455P6894K55288k46198Q2164R9367O326B88075
$$ 399953 515180 693112 576603 552148 629042 884330 638132 720296 819663 825989 288075
13690H29935l25388J81626k04199B29580K92954l7352r0153J91508j38306L24652
$$ 829935 504547 686173 481974 229580 522534 485182 395029 586537 448231 772883
13680G72883K9614l51739r2997J2039K83087I4249L71780M524j85329K85671B11082
$$ 772883 802497 450758 357761 369800 652887 94249 466029 470553 285224 570895 211082
13668D51507m6558K29205l00797L14141A64594M56537m3014J42953j30833p6049
$$ 451507 404949 634154 333357 647498 164594 621131 578117 721070 590237 514188
13658E14188N7620J43080j5567l09430P3304B10338L67226j3672j52640j19680
$$ 514188 571808 714888 699321 389891 463195 210338 577564 563892 411252 291572
13648B91572L99401k47914k04319M11917j96429o9298j56255M60243B55332M81920
$$ 291572 690973 443059 238740 650657 454228 384930 228675 688918 255332 737252
13638G37252C58529L07374n701k29954n3374l6893l5862M75143l25938R0596k01069
$$ 737252 358529 665903 660202 430248 376874 339981 304119 779262 453324 543920 342851
13627C42851K34725B65464L34925B22712J71505Q4657G0313L04846Q5951n7322
$$ 342851 577576 265464 600389 222712 394217 478874 70313 375159 461110 403788
13617D03788L53203C42122L26001j53308B27401M44797c5422F20786A87301K52750
$$ 403788 756991 342122 668123 514815 227401 672198 -35422 620786 187301 440051
13607D40051K7279A31769R2447M39144k45679A16112M7176J82101R7714p4760
$$ 440051 467330 131769 224216 663360 417681 116112 163288 345389 443103 368343
13597C68343P6819K20409j45695l5686E4214J00415j5624K31049J18570J38432
$$ 368343 445162 665571 519876 484190 54214 154629 139005 370054 488624 627056
13587F27056k56660M52626C88381O9739A01947L9314P6289K30895j28357k8700
$$ 627056 370396 823022 388381 458120 101947 141261 217550 448445 320088 291388
13577B91388K35758k32122L12012J30517k49350B12449J64154j68117R3073j04529
$$ 291388 527146 295024 607036 737553 488203 212449 376603 208486 301559 197030
13567A97030M63591k57231J22934r8516J59019r8371A18615j3476M3728M86462
$$ 197030 660621 403390 526324 427808 586827 488456 118615 105139 148867 635329
13557F35329A34051L86490j14319K3289A31896M64680j26644j752j13533j1547
$$ 635329 134051 520541 406222 429511 131896 596576 469932 468180 354647 343100
13547C43100K30862C3508N6705J27463K07991o41j21463C7993L31959J05747q4482
$$ 343100 573962 33508 90213 217676 425667 425026 303563 37993 369952 475699 391217
13536C91217j68731M66387j49514k28268K62085B35969B8840M03597j79800G3983
$$ 391217 222486 688873 539359 311091 573176 235969 28840 432437 252637 73983
13525B01220o3173N9725O6858K54856k53181E7303M45800m3260j29995P508r5967
$$ 201220 138047 197772 264630 519486 266305 57303 503103 459843 329848 337356 241389
13514B41389M38187j70012A29354O94560B99958q2378K96609B44992A08774L66109
$$ 241389 679576 509564 129354 823914 299958 217580 514189 244992 108774 474883
13504D74883A68315L8315E4723K14933c0855B88756J73825A04036R6556J77203
$$ 474883 168315 206630 54723 269656 -30855 288756 462581 104036 200592 377795
13494C77795K45778l03580j4405A51073l8946i4671A81545k8133e2166A66374
$$ 377795 623573 319993 305588 151073 112127 -94671 181545 153412 -52166 166374
13483C13437J35831r9298G8622K37523J26168k15009l1831K72573q5150j31441
$$ 313437 449268 349970 78622 316145 442313 227304 195473 468046 382896 251455
13473B51455k4836l629e5920B98803A38265C5143K96593K13823A0858L11465l3666
$$ 251455 226619 222990 -55920 298803 138265 35143 331736 545559 10858 322323 288657
13462B88657r0943E9706J23601c8009A54948J06963m4322J0063J56851G3480K79499
$$ 288657 197714 59706 183307 -38009 154948 261911 217589 227652 384503 73480 352979
13451C52979A11026Q1104q9217K05329l4441L27289j66412G9097K56336K06733
$$ 352979 111026 192130 102913 308242 273801 601090 434678 79097 335433 542166
13441E42166A08780L22776j30891j30520R0113m0000c8630D62614j88209j19259
$$ 542166 108780 431556 300665 170145 260258 220258 -38630 462614 274405 155146
13431A55146K40874Q1500B38111R9983m0144q2401Q4484A02061K41699k6776J62834
$$ 155146 396020 477520 238111 338094 297950 215549 300033 102061 343760 316984 479818
13420D79818H2267L51113H6750J92287F8106J50756D8429K14290M00j0229j26173
$$ 479818 82267 433380 86750 279037 68106 218862 48429 262719 263119 252890 126717
13409A26717B7926J69640L33254E935K3767N8672M90711B46380J20879l6850k3424
$$ 126717 27926 197566 530820 5935 29702 88374 579085 246380 367259 330409 306985
13398C06985m0295G3804L00574j32717M2055L96621a45933F7223J17181H0183
$$ 306985 266690 73804 374378 241661 283716 680337 -145933 67223 184404 80183
13387B9816K37645i3232B00060a74871D6062L65902K92213k66293A77004J59831
$$ 29816 267461 -93232 200060 -174871 46062 411964 704177 437884 177004 336835
13377C36835D7614M03351A69571J14135K068j25824G9526Q6160N58226A50032
$$ 336835 47614 450965 169571 283706 285774 159950 79526 165686 723912 150032
13366B19399P4598m5912r0110J58116A04255K40374J36646j96557j19872G2007
$$ 219399 293997 248085 157975 316091 104255 344629 481275 284718 164846 72007
13355A41872M5592q0408M32947B57576H9085L4039K90810K53305k44301M60472
$$ 141872 187464 107056 540003 257576 89085 123124 413934 667239 422938 883410
13345H83410C91262J03938j65547R2177K52585B70888H8011L00818A18931K78564
$$ 883410 391262 495200 329653 421830 674415 270888 88011 388829 118931 397495
13335C97495n8616j09638R1211A24381f8811B12034m0902L7261j02468J9336M3415
$$ 397495 338879 229241 320452 124381 -68811 212034 171132 208393 105925 125261 168676
13324A68676M0416J14622o0879K7260K77883b66216E85454B92226c078j91001
$$ 168676 209092 323714 262835 290095 567978 -266216 585454 292226 -3078 -194079
13314a94079C65324i2771A83823J8279q9025K67069A72229D5637K94645H5881
$$ -194079 365324 -92771 183823 202102 113077 380146 172229 45637 340282 85881
13303C02920C3713R4126J10821J40535H0526J72506m2002A115J46399J19143n2672
$$ 302920 33713 127839 238660 379195 80526 253032 211030 1115 147514 266657 213985
13292B13985R3831L0J44528C8972e8788A87996q2106c6364C94027A13327J77681
$$ 213985 307816 307846 452374 38972 -58788 187996 105890 -36364 394027 113327 291008
13281B91008A15789J30097C0394J56629a01330D9249L898J00515K36928H9083
$$ 291008 115789 245886 30394 187023 -101330 49249 53147 153662 390590 89083
13270G9027Q0939b4172E8242N25915a13804A26641m1047J51498A9290J78868Q5489
$$ 79027 159966 -24172 58242 584157 -113804 126641 85594 237092 19290 198158 283647
13259B83647A29604c3113I6074J80544E0975a30974D84226A46358L3101g4595
$$ 283647 129604 -33113 96074 276618 50975 -130974 484226 146358 179459 -74595
13248D8903F967J4547L9148K62881A18130k0411H639A603M0561j7724f2459D6786
$$ 48903 6967 21514 60662 323543 118130 97719 8639 1603 42164 24440 -62459 46786
13235A79511a65787C23464A08732M9181R1403i2625B725J6776a42166A78350J16489
$$ 179511 -165787 323464 108732 157913 249316 -92625 2725 19501 -142166 178350 294839
13224B94839J3853B4985J72174J51095K1121B6066J64862j2300b29671C6499J25946
$$ 294839 308692 24985 197159 348254 369375 26066 190928 178628 -229671 36499 162445
13213A62445f6909j1235L7904C7828g5134a0343B15930r6243l1068Q2550h1813
$$ 162445 -66909 -78144 -40240 37828 -75134 -10343 215930 119687 88619 171169 -81813
13201B46097c8158o0737L1470G9667g7860B24874p5160O0310J2059a35913E38603
$$ 246097 -38158 -98895 -67425 79667 -77860 224874 149714 210024 222083 -135913 538603
13189A6844K04492M80i0335D88a3614H0650K10656B0723M0798a57471A15603J39515
$$ 16844 221336 221816 -90335 488 -13614 80650 291306 20723 61521 -157471 115603 255118
13177B55118J70377H8149K87144H2091O6706d5880C02324j02278A4613Q2264L0355
$$ 255118 425495 88149 375293 82091 148797 -45880 302324 200046 14613 96877 127232
13166A27232k154Q9737r2660b0181B64751H3086i1727b2925B36166j13364P6119
$$ 127232 125078 214815 122155 -20181 264751 83086 -91727 -22925 236166 122802 198921
13155A98921o0721l8625C8523a25189D23090b8094G422Q9671K61410h1822B52901
$$ 198921 138200 99575 38523 -125189 423090 -28094 7422 97093 358503 -81822 252901
13143A4912K27318p5827K02879A64443C3331a6875r9439A80017n9972c04110c7855
$$ 14912 242230 166403 369282 164443 33331 -16875 -116314 180017 120045 -304110 -37855
13131B39142q8504G2649E774M0738J69504q6191C0586j5128K01804c08987B02139
$$ 239142 150638 72649 5774 46512 216016 129825 30586 15458 217262 -308987 202139
13119a23122L9382M1739l1299B1677a7857F94740A29717c14583C16516a20258
$$ -123122 -83740 -42001 -73300 21677 -17857 694740 129717 -314583 316516 -120258
13108A99228E3752b81350B03890J41067i6897A81972a33329G8921d3504B71329
$$ 199228 53752 -281350 203890 344957 -96897 181972 -133329 78921 -43504 271329
13097b5656C48306A13128J36081m821n1394b3780A3125L17996O2623j29064K03835
$$ -25656 348306 113128 249209 244388 192994 -23780 13125 331121 393744 264680 468515
13086D68515E5382b8908D57302H5262J5216b25018M1746C89648E3310J05289J46615
$$ 468515 55382 -28908 457302 85262 100478 -225018 -183272 389648 53310 158599 305214
13075C05214B0659L80468D4765b14024B36428i4019C1821j3389K05990J84995
$$ 305214 20659 401127 44765 -214024 236428 -94019 31821 18432 224422 409417
13065D09417A54216f0059A83224a98731C15576D2793M0330M7971J36509E0218
$$ 409417 154216 -60059 183224 -198731 315576 42793 83123 131094 267603 50218
13054b1119A4437i3698a4123C80820A88889k9775o0198k0650a54432G8469c6209
$$ -21119 14437 -93698 -14123 380820 188889 159114 98916 78266 -154432 78469 -36209
13042I7702A3417K2597J52137o7025a3826j17561C71693j02786E4421L9281c6559
$$ 97702 13417 36014 188151 121126 -13826 -131387 371693 268907 54421 93702 -36559
13030B39227p5351L5946o9007J12846r9552J70579b8821j51375B76729A27270
$$ 239227 163876 199822 130815 243661 144109 314688 -28821 -180196 276729 127270
13019B49665A9928R4996J33291M870r6844a15103C7926J16318R6164b7661A82090
$$ 249665 19928 114924 248215 253085 156241 -115103 37926 154244 250408 -27661 182090
13007D0081c0986C98196A19513J72655q6266J65630A11089J55606a43999A04387
$$ 40081 -30986 398196 119513 292168 205902 371532 111089 266695 -143999 104387
12996C47434j25980G3123K22560A37242Q2512C3063L08918A45135J81447K4874
$$ 347434 221454 73123 295683 137242 219754 33063 341981 145135 326582 351456
12986C51456o7710d2956B7374K16969C3917K35644j18626J55592G7314p91G918
$$ 351456 283746 -42956 27374 244343 33917 269561 150935 306527 77314 76523 7918
12974a38212B63129i8756B54694c4970A68731a27390B59991k1369I6389c33127
$$ -138212 263129 -98756 254694 -34970 168731 -127390 259991 238622 96389 -333127
12963a64127C43809A06003K313b1240F05J1375L32818B8962a31427C09530A2925
$$ -164127 343809 106003 108316 -21240 605 11980 344798 28962 -131427 309530 12925
12951d7431r6066B82409d9327D05c41466B2921F11M44653h7659L4744J1229a5617
$$ -47431 -143497 282409 -49327 405 -341466 22921 611 445264 -87659 -52915 -41686 -15617
12938A68049e2957C52225j62624b28167a8450A52944c9479p3331B91119a86033
$$ 168049 -52957 352225 189601 -228167 -18450 152944 -39479 -112810 291119 -186033
12927E5051g0620A62410E8735a73327A03700J68253a75852a1601C3855i3808J2744
$$ 55051 -70620 162410 58735 -173327 103700 271953 -175852 -11601 33855 -93808 -81064
12916h1064n7194k7531b0436j50632B25076c23336A86657c5715H7113J09267J67028
$$ -81064 -138258 -165789 -20436 -171068 225076 -323336 186657 -35715 87113 196380 363408
12905C63408G4304J52517o0257a15043d8859A92565D6466a09165D70696b04042
$$ 363408 74304 226821 166564 -115043 -48859 192565 46466 -109165 470696 -204042
12894F5638i5537C95952J01837j80565A38462R0941b5149B47081o5106K04077
$$ 65638 -95537 395952 497789 317224 138462 229403 -25149 247081 181975 386052
12884C86052A42806a41468E4129K88377k9283e1981B85809c27134J57457M0849
$$ 386052 142806 -141468 54129 342506 313223 -51981 285809 -327134 -169677 -128828
12874a28828a5302B12504A9046e972l3795B4158b45943J21119G9183b19312H92
$$ -128828 -15302 212504 19046 -5972 -39767 24158 -245943 -124824 79183 -219312 892
12862I3793b28360i5538K0717p5449c5007l2545A13182l8454a14906C5603M33
$$ 93793 -228360 -95538 -74821 -150270 -35007 -67552 113182 74728 -114906 35603 36036
12851C6036h1235G6555c3807B93607g5331A73054q06J7546J06599m0738n5369
$$ 36036 -81235 76555 -33807 293607 -75331 173054 172248 189794 296393 255655 200286
12840B00286K7318q1965J48189m8509b75467H714L74517r9669b07973K4752c896
$$ 200286 227604 145639 293828 245319 -275467 8714 383231 283562 -207973 -183221 -3896
12828A46460K2782N2822I7739b83192A18515J18902a75896N0964F9269a65597
$$ 146460 169242 222064 97739 -283192 118515 237417 -175896 -124932 69269 -165597
12817A60644c9146j9837I0297J52701q2401m283a38976A15587K65419a9187I6029
$$ 160644 -39146 -58983 90297 242998 160597 156314 -138976 115587 381006 -19187 96029
12805A07360J26641b4827j64162N647B3212c1454E7592k2857Q6830J08554k7900
$$ 107360 234001 -24827 -188989 -183342 23212 -31454 57592 34735 121565 230119 202219
12794B02219H1199b19724A13203D2729e1034j82127D7041L03767A16892h8097
$$ 202219 81199 -219724 113203 42729 -51034 -233161 47041 350808 116892 -88097
12783b56865a07130A62360B9962P6650Q7258A4647i3099B3422f0536F1564B2507
$$ -256865 -107130 162360 29962 106612 193870 14647 -93099 23422 -60536 61564 22507
12771D4555k354b71331D8185O5518J2594a60369m0067B36910A14770d0189j42450
$$ 44555 42201 -271331 48185 113703 126297 -160369 -200436 236910 114770 -40189 -182639
12760a82639A58387a00005c4367A15957J8677a8740k83544a20061A91946I4810
$$ -182639 158387 -100005 -34367 115957 134634 -18740 -302284 -120061 191946 94810
12749B66J9021J47751p9163a45010j8654G6971J69587h1376k2393A25879a14444
$$ 266 19287 167038 87875 -145010 -163664 76971 246558 -81376 -103769 125879 -114444
12737A3717P917b7038Q495A34569O9170J77769A22360O9815I1331K08060n2413
$$ 13717 21634 -27038 -18543 134569 203739 381508 122360 192175 91331 299391 246978
12726B46978b521A72969a04080J6733C5461N2894J9456C0221b36032B68557b4911
$$ 246978 -2521 172969 -104080 -87347 35461 88355 107811 30221 -236032 268557 -24911
12714c90195J85440G9325J11896b63827A42652C7976c00275e1613C5028O2354
$$ -390195 -204755 79325 191221 -263827 142652 37976 -300275 -51613 35028 97382
12704I7382J35399Q8537j55024n5620J00662a11814B56787l1738D0373J52862
$$ 97382 232781 321318 166294 110674 211336 -111814 256787 225049 40373 193235
12694A93235a69302e0751a6066C0552K02337c7042B48686g075o1413A51529o1350
$$ 193235 -169302 -50751 -16066 30552 232889 -37042 248686 -7075 -68488 151529 90179
12683I0179K63549m7708k3337a3563A27920K0189J41998K5135a08397e3476j08744
$$ 90179 353728 306020 282683 -13563 127920 148109 290107 315242 -108397 -53476 -162220
12672a62220k3208A88315b86308B9203J52649c4976A06211B8312g3915I5885J984
$$ -162220 -185428 188315 -286308 29203 181852 -34976 106211 28312 -73915 95885 97869
12661I7869c1299A71866M8965p1622J61286B9716K66245O6778A38297L61412a84947
$$ 97869 -31299 171866 220831 149209 310495 29716 295961 362739 138297 499709 -184947
12649G8991k7330P441f327C81324A19775d7777B65166j29109L72407B39049a50921
$$ 78991 51661 59102 -6327 381324 119775 -47777 265166 136057 508464 239049 -150921
12637G5530A7656K37692a62446A02517d4186C67475a91600B90498a47247G2233
$$ 75530 17656 255348 -162446 102517 -44186 367475 -191600 290498 -147247 72233
12626A00041a6727A84909J51277j38107b2485A46078c2141l0586D43006B19501
$$ 100041 -16727 184909 336186 198079 -22485 146078 -32141 -62727 443006 219501
12615f4688b6927D94440A53426i5297j45563H3205i3129B38893d5429n2138B81237
$$ -64688 -26927 494440 153426 -95297 -240860 83205 -93129 238893 -45429 -97567 281237
12603b9221B60212q7930h3290A33171J01287F5827c7020B38754a21830d9520j27832
$$ -29221 260212 172282 -83290 133171 234458 65827 -37020 238754 -121830 -49520 -177352
12592a77352A87174Q5J10559o6512a60900m938C25279A1583M64436c07742B56051
$$ -177352 187174 187259 297818 231306 -160900 -165838 325279 11583 476019 -307742 256051
12580A34596k1322J94367C5938K83887b8106k7279E6684J91215b04987A4478a77023
$$ 134596 113274 307641 35938 319825 -28106 -55385 56684 247899 -204987 14478 -177023
12568F664c2328l5409C9611a1304B1393c4533C6519J2444J65357r5052j0213g1650
$$ 6664 -32328 -67737 39611 -11304 21393 -34533 36519 48963 214320 119268 109055 -71650
12555h8876I6402L35678A40643b821k38625f8884C22039H3552d8216D99552f7112
$$ -88876 96402 432080 140643 -2821 -241446 -68884 322039 83552 -48216 499552 -67112
12543A21532L2579k5321b89534O2272I6412J91714r8154E4550c58463A14347A3993
$$ 121532 154111 128790 -289534 -227262 96412 288126 189972 54550 -358463 114347 13993
12531b57108A40352j0962l1743J09528G8296b3796l8702H8784J41878c95699G881
$$ -257108 140352 129390 97647 207175 78296 -23796 -62498 88784 230662 -395699 7881
12519A33554a2264C0108J13370J9469c64017D8302K98885A65691g667A20392h7088
$$ 133554 -12264 30108 143478 162947 -364017 48302 347187 165691 -7667 120392 -87088
12507a15395C54693a92694a3398k4906A25898L92747k24151J40360h2587n601
$$ -115395 354693 -192694 -13398 -38304 125898 518645 294494 434854 -82587 -88188
12497h8188A0120R681a14496P717H2353J77617j27129J69723I4046l9465a75732
$$ -88188 10120 19801 -114496 -106779 82353 259970 132841 302564 94046 54581 -175732
12485B29646G1798j7247a56531A98954N8122E220K32214B3216O4625J84318D7344
$$ 229646 71798 54551 -156531 198954 257076 5220 237434 23216 87841 272159 47344
12473A4220J99487a60419B75156n7242n254A0599O2921b53611a10076b2850k2905
$$ 14220 213707 -160419 275156 217914 212660 10599 73520 -253611 -110076 -22850 -45755
12462d5755I879c329A38218d4540r8998B18435M476i1151o8127i89H0956c7260
$$ -45755 9879 -3329 138218 -44540 -143538 218435 222911 -91151 -159278 -989 80956 -37260
12449B10470f1081a6982A75737O1314a63161L9772l1473B23082q6580i9459c8219
$$ 210470 -61081 -16982 175737 237051 -163161 -123389 -154862 223082 136502 -99459 -38219
12437a03414k16334A37143O1681b77740B7698K59601F9012b66069L9060H0020
$$ -103414 -319748 137143 198824 -277740 27698 287299 69012 -266069 -227009 80020
12426I841a2684A85539b38333F2766a13339A00240a9841C8039K2207J42373j6820
$$ 9841 -12684 185539 -238333 62766 -113339 100240 -19841 38039 60246 202619 185799
12415A85799a49313K5333o8942C6567a46121H3963P3470P3951m4802c86630E2282
$$ 185799 -149313 -123980 -192922 36567 -146121 83963 157433 231384 186582 -386630 52282
12403B71254c47318C4467J77112r0753a38991j5089g501A27197m3570L7354m1255
$$ 271254 -347318 34467 211579 120826 -138991 -154080 -7501 127197 83627 120981 79726
12392G9726A4455J47490b58895r0608A14725f7245r6150Q1614G6866A0358J82057
$$ 79726 14455 161945 -258895 -349503 114725 -67245 -163395 -81781 76866 10358 192415
12381A92415R0510a12252j87192B35529j16209N5888a06361A28999k1031a61532
$$ 192415 282925 -112252 -299444 235529 119320 175208 -106361 128999 107968 -161532
12370B04914b9806C6437K5860L07610a73649N8265f469A70091J88724B5819J3547
$$ 204914 -29806 36437 62297 369907 -173649 -115384 -6469 170091 358815 25819 39366
12359C9366M2067B5420a65439C1374b57667f0916j65060A184f943B25903b123
$$ 39366 81433 25420 -165439 31374 -257667 -60916 -225976 1184 -6943 225903 -2123
12347G1912K04136a77886B35997Q7065c926C4016e8969B40116Q9816i8280A9142
$$ 71912 276048 -177886 235997 323062 -3926 34016 -58969 240116 329932 -98280 19142
12335B54051E6904a82332e2811k2486c512F2423d8433K760q288D3014b7285E3663
$$ 254051 56904 -182332 -52811 -75297 -3512 62423 -48433 -45673 -53961 43014 -27285 53663
12322A85449i923j29031B72249I8304K0705a76479b6535p2988B29074i2571K7609
$$ 185449 -9923 -138954 272249 98304 119009 -176479 -26535 -99523 229074 -92571 -64962
12311f4962B39110F3965a50531c0631A60397a08361C45077A62102K0232R9114
$$ -64962 239110 63965 -150531 -30631 160397 -108361 345077 162102 182334 281448
12301B81448O9010O4519A58189D5289c25580A94168G5185b58383A75284d0020
$$ 281448 350458 414977 158189 45289 -325580 194168 75185 -258383 175284 -40020
12290B54298I2111a0622l2709B44186h2053F8111J23128e7891B90586A2752b02258
$$ 254298 92111 -10622 -43331 244186 -82053 68111 191239 -57891 290586 12752 -202258
12278c22596B3929K36148o9283i8117A05614K57635A01840e3640B63821R8413
$$ -322596 23929 260077 190794 -98117 105614 363249 101840 -53640 263821 362234
12268C62234A15981l4234O9262k404d8461d910A72306P276C9109L7753a87462
$$ 362234 115981 81747 151009 148605 -48461 -4910 172306 179582 39109 76862 -187462
12256C13173e5217m0187K6604M412c0198o7463B47831O2586d6195A56478a14011
$$ 313173 -55217 -95404 -68800 -64388 -30198 -97661 247831 310417 -46195 156478 -114011
12244A21785f2945C6222c4176E268O198J57357P9534E8728J1898a672E1877K49741
$$ 121785 -62945 36222 -34176 5268 11466 168823 248357 58728 70626 -1672 51877 301618
12232C01618b80820I6296d2604C0862K7368P1171j4117D1503L22598G6560l7717
$$ 301618 -280820 96296 -42604 30862 58230 129401 115284 41503 364101 76560 38843
12221C8843L77264a69902A2699K48285r6458N9318f3065A12968q341J4442b03891
$$ 38843 416107 -169902 12699 260984 164526 223844 -63065 112968 104627 119069 -203891
12209D8295K0889L82665a87224C89118A05653g3091F05666n3826b045A73998B0722
$$ 48295 69184 451849 -187224 389118 105653 -73091 605666 551840 -2045 173998 20722
12197a06393A55190K4769D3322d2808A64169d4920B2867a09456E6248J70556M654
$$ -106393 155190 179959 43322 -42808 164169 -44920 22867 -109456 56248 226804 231458
12186B31458R699p1065o964L5561b01280B58237l7012M1841E4527i1260A56441
$$ 231458 241157 170092 163128 198689 -201280 258237 221225 263066 54527 -91260 156441
12174D5368d0715j39688M1288A24607K66681h0507C0824d6529F1497b5010A12484
$$ 45368 -40715 -180403 -139115 124607 391288 -80507 30824 -46529 61497 -25010 112484
12162A07140K96151h9770B1765J51413J75930H1665J91308b88660B47075e2302
$$ 107140 403291 -89770 21765 173178 349108 81665 272973 -288660 247075 -52302
12151G800L85352j13675g1092j0391k41078h863D8434b12192b9747j7950D6235
$$ 7800 393152 279477 -71092 -81483 -322561 -8863 48434 -212192 -29747 -47697 46235
12139B1219Q2665Q8798B7069M3464d8631C02122i2013J994A20550e7088G2770
$$ 21219 103884 192682 27069 70533 -48631 302122 -92013 -90019 120550 -57088 72770
12127A76773b00471B07896a2183I0653J58000m6839f8979a6382r2123N1116j94760
$$ 176773 -200471 207896 -12183 90653 248653 201814 -68979 -16382 -108505 -57389 -252149
12116b52149E5491i6803B28548K5993f4841q5252k9752a7863j50663m1862K3458
$$ -252149 55491 -96803 228548 254541 -64841 -150093 -179845 -17863 -168526 -210388 -186930
12105a86930g421l7003B39424a24910C25407c41025d4519B98864A23225J77280
$$ -186930 -7421 -44424 239424 -124910 325407 -341025 -44519 298864 123225 300505
12095C00505A11465L18577k11207b24825Q4806n1190O5167N4804H2012b03557
$$ 300505 111465 430042 218835 -224825 -140019 -191209 -126042 -71238 82012 -203557
12084c30966e2006k60043B91746G2461b0006C8685a31049g938B8961a17996B2269
$$ -330966 -52006 -312049 291746 72461 -20006 38685 -131049 -7938 28961 -117996 22269
12072h5926F8248P4424a43207H1466E759a25041A70896m1777a84502D5485J12298
$$ -85926 68248 142672 -143207 81466 5759 -125041 170896 129119 -184502 45485 157783
12061A57783O3018G892K32592o8211l4317m3042g4715j75726e0654F8490f9214
$$ 157783 220801 7892 240484 172273 137956 94914 -74715 -250441 -50654 68490 -69214
12049b67230a1939r6845c1697k1697H663L14287g311I29061J150204C56637H8848
$$ -267230 -11939 -108784 -31697 -53394 8663 322950 -7311 929061 2079265 356637 88848
12037D3094L37028A81422i9584j93201A02803a69358a3008A29943R9944a04156
$$ 43094 380122 181422 -99584 -292785 102803 -169358 -13008 129943 229887 -104156
12026d4500j02359j00384c3301B78432a72885A71324a39864r3528G4811f037A41212
$$ -44500 -146859 -247243 -33301 278432 -172885 171324 -139864 -233392 74811 -6037 141212
12014C6454a16627A87280k6732e0072q6481G9844C7232b91340g984j8807m4973
$$ 36454 -116627 187280 160548 -50072 -136553 79844 37232 -291340 -7984 -26791 -71764
12003g1764A75939a24994A58503F1305a09001r0486D3930J37343b94682e8422
$$ -71764 175939 -124994 158503 61305 -109001 -199487 43930 181273 -294682 -58422
11992a87857A7865R1347E1769a10330e4742A52561b0548G2028b45824B7087i3373
$$ -187857 17865 109212 51769 -110330 -54742 152561 -20548 72028 -245824 27087 -93373
11980b05300a3992r406j11671h97m2845I2957a0965l72118G5216O8049k5641a35373
$$ -205300 -13992 -23398 -135069 -897 -43742 92957 -10965 -383083 75216 143265 117624 -135373
11967A98373d5641k03851G5008c68554i3580j46046A45742n8120b07922A34289
$$ 198373 -45641 -249492 75008 -368554 -93580 -239626 145742 87622 -207922 134289
11956C12136j6634a14920B90041e2821n8604A97281i2949L6293A8914g6370L2491
$$ 312136 295502 -114920 290041 -52821 -111425 197281 -92949 -56656 18914 -76370 -43879
11945d3879o9165n0421a7495k1634H4811a54045c584m9778b2556D2389b78171
$$ -43879 -113044 -163465 -17495 -39129 84811 -154045 -3584 -53362 -22556 42389 -278171
11933C6032d3024H953K45073m5170b7884j52561m8729j11905A02696a32728B9199
$$ 36032 -43024 8953 254026 208856 -27884 -180445 -229174 -341079 102696 -132728 29199
11921A24996g7434C46589A18187D2883F194N6653J4810a05075A7632a9255B3751
$$ 124996 -77434 346589 118187 42883 6194 62847 77657 -105075 17632 -19255 23751
11909a04262L7468G5418L17850b51060A16664E4113b30617D0692M0158a25170
$$ -104262 -66794 75418 393268 -251060 116664 54113 -230617 40692 80850 -125170
11898I3940c54689E2629K83931r4984C1902J13582j4287m5364g7847A08748c17050
$$ 93940 -354689 52629 336560 241576 31902 145484 131197 85833 -77847 108748 -317050
11886e4872F6867R8972a38528p1119N0517B0924R6620d9973j16823A20908a10694
$$ -54872 66867 165839 -138528 -209647 -159130 20924 117544 -49973 -166796 120908 -110694
11874E1395d9320m1657A41407c39351o3461A98970D9672b09022C4136a17233B07844
$$ 51395 -49320 -90977 141407 -339351 -402812 198970 49672 -209022 34136 -117233 207844
11862e1983o3995G740b53615k6013J05914L3417q4513c2874k03256H088J49699
$$ -51983 -115978 7740 -253615 -279628 -173714 -140297 -224810 -32874 -236130 8088 157787
11851A57787a66434p3089a04123f07A92638L0165a10316l7055O8022G6386K47050
$$ 157787 -166434 -239523 -104123 -607 192638 222803 -110316 -147371 -79349 76386 323436
11840C23436G4677a47239m0638B6243d1153A52098a06592J4709F3721O0089b94752
$$ 323436 74677 -147239 -187877 26243 -41153 152098 -106592 -91883 63721 123810 -294752
11828a08185k4365G0436b28982B4229a41300A976a2998r2396A51738a36466f1173
$$ -108185 -132550 70436 -228982 24229 -141300 1976 -12998 -105394 151738 -136466 -61173
11816b41506D8937a2901j89126D942J60848o4733b94663E4056N7413l602J16926
$$ -241506 48937 -12901 -202027 4942 165790 101057 -294663 54056 111469 107867 224793
11805B24793l6763a68324n2943D5180f6458j27783r3271A54587a10810F2789a11125
$$ 224793 188030 -168324 -221267 45180 -66458 -194241 -287512 154587 -110810 62789 -111125
11793a98247A53000a30385e2572E4176d0851G5729j1979b9852j79459C03303j09667
$$ -198247 153000 -130385 -52572 54176 -40851 75729 63750 -29852 -209311 303303 193636
11782A93636B7037M6971K30970G5824J35738I2601a36361j52538B23650D0902
$$ 193636 27037 74008 304978 75824 211562 92601 -136361 -288899 223650 40902
11771A81579m6573E1391J56499I8762c86847a75602L1330d8134H9864b35146A98960
$$ 181579 135006 51391 207890 98762 -386847 -175602 -144272 -48134 89864 -235146 198960
11759c54679I3580a5868p4715B85637a52631j66100a6032n1820H1945c50436a43963
$$ -354679 93580 -15868 -90583 285637 -152631 -318731 -16032 -67852 81945 -350436 -143963
11747A5862a72079O9772c9200A87522K9916E2284P7324a02321j64161B09660G5188
$$ 15862 -172079 -102307 -39200 187522 217438 52284 129608 -102321 -266482 209660 75188
11735G820J99139E8821L1042a8499A62265a9240q9875b7129h206A79274a49638
$$ 7820 206959 58821 89863 -18499 162265 -19240 -109115 -27129 -8206 179274 -149638
11723a90717B14014b77842D6554b18887G060M3448J52622a77454C7698J78758
$$ -190717 214014 -277842 46554 -218887 7060 50508 203130 -177454 37698 216456
11713B16456i0887C09672d6710A03640L393J09950b6462i597j18575B49582A03701
$$ 216456 -90887 309672 -46710 103640 107033 216983 -26462 -9597 -128172 249582 103701
11701A3853R7499d0864H5637b29268A9982c05808A30688k8892a98447A70127e7909
$$ 13853 111352 -40864 85637 -229268 19982 -305808 130688 101796 -198447 170127 -57909
11689b69016i4579A03994m3126E327J47548N4003A8544a00916j42740B23699a05795
$$ -269016 -94579 103994 60868 5327 152875 206878 18544 -100916 -243656 223699 -105795
11677A77734E8869K97486m6029f0531G5078L1101n1960J82184h0482A80943c36780
$$ 177734 58869 356355 310326 -60531 75078 106179 54219 236403 -80482 180943 -336780
11665h0792j16332k88988D3885J09231b23711J6470I8602j0645l6398c21852B311
$$ -80792 -197124 -486112 43885 153116 -223711 -207241 98602 87957 51559 -321852 2311
11653A20762d6625k0118C7025j1781d8283F4784g1423A25899F0398b12196H9885
$$ 120762 -46625 -66743 37025 25244 -48283 64784 -71423 125899 60398 -212196 89885
11641g172j42959N2767j6066E5275d7664D1851c7844I4113P0124A0534K49592
$$ -7172 -150131 -97364 -113430 55275 -47664 41851 -37844 94113 164237 10534 260126
11630B60126a28273l18247J96698a16508B16582A03059i8340A52443j4587f3625
$$ 260126 -128273 -446520 -249822 -116508 216582 103059 -98340 152443 137856 -63625
11619b57059E6808O9258a19815n7513l6133a8822A24101P3141D4755c11265L7207
$$ -257059 56808 126066 -119815 -177328 -213461 -18822 124101 197242 44755 -311265 -274058
11608b74058f1670G9051b35090E1480O2318A8127D478Q0136f8827A77808k0030
$$ -274058 -61670 79051 -235090 51480 113798 18127 4478 84614 -68827 177808 157778
11597A57778b91075B51990b25805A41364F0145J93281c2636J441i493j31737c8437
$$ 157778 -291075 251990 -225805 141364 60145 253426 -32636 -31195 -9493 -141230 -38437
11585c03307A7932J13830k4449c3809I3206L51494C0762c9095m6372k80352h6492
$$ -303307 17932 131762 107313 -33809 93206 444700 30762 -39095 -85467 -365819 -86492
11573A12529L01837q4609h3224j71386D7251c20150C4995a19940I9873a5263k82932
$$ 112529 414366 329757 -83224 -254610 47251 -320150 34995 -119940 99873 -15263 -298195
11562b98195g3134I1971K04570g4206A71555P8234H4377b3776B8517Q2547b54979
$$ -298195 -73134 91971 296541 -74206 171555 249789 84377 -23776 28517 111064 -254979
11550f7903B32649a44228k02414A28150j3824K53113p4622N351j04672c70693
$$ -67903 232649 -144228 -346642 128150 114326 367439 292817 298168 193496 -370693
11539A60104J05577a18533l0410E7283N3771h8854A44536J78192H2971A1596K6133
$$ 160104 265681 -118533 -148943 57283 111054 -88854 144536 322728 82971 11596 37729
11528C7729J60700N1918G2603d12000B00508a7182B36081m982a21858F9368F634
$$ 37729 198429 250347 72603 -412000 200508 -17182 236081 231099 -121858 69368 6634
11516C5353c8718o16B7225O6882j5916c26472A26077o905J78245f5074I2792a04417
$$ 35353 -38718 -39334 27225 94107 78191 -326472 126077 119172 297417 -65074 92792 -104417
11503G3232K70551G7186A4189Q9184a75812H6427O3096n8731L6725f6214B17397
$$ 73232 343783 77186 14189 103373 -175812 86427 149523 90792 127517 -66214 217397
11491A90562D6925J03916F859K36072b53383B58511C0741K71829n3637K07404
$$ 190562 46925 150841 6859 242931 -253383 258511 30741 302570 248933 456337
11481D56337B13503e0532B28379A01045k2515l743K60847A38916a128A20952N1072
$$ 456337 213503 -50532 228379 101045 78530 74787 335634 138916 -1128 120952 172024
11470A72024a15169F6447O3571L0828F8305K52851Q4550b31688l4050a26453n5131
$$ 172024 -115169 66447 130018 160846 68305 321156 405706 -231688 -265738 -126453 -181584
11459a81584D37429A25764J54166b11468e1701B95257A15158K7805a41008C46883
$$ -181584 437429 125764 279930 -211468 -51701 295257 115158 142963 -141008 346883
11448A79039o7087K41086E3572K38674q9812i4102B17708e4452Q080l12562O8276
$$ 179039 111952 353038 53572 292246 202434 -94102 217708 -54452 -46372 -358934 -290658
11437b90658A14301L74310k33805b08908A42140C2090a37372m9983a2349C39180
$$ -290658 114301 488611 254806 -208908 142140 32090 -137372 -187355 -12349 339180
11426B99548C5411M8943m0692M6924e9918p7099C63418a07197A75190l8526K46849
$$ 299548 35411 84354 43662 90586 -59918 -137017 363418 -107197 175190 136664 383513
11415C83513C3161b19721e3525j494j94074g9556B07382J01460I8813G424i1752
$$ 383513 33161 -219721 -53525 -55019 -249093 -79556 207382 308842 98813 7424 -91752
11403G7867C2964a0245m3986k72806A5408J04007f2748J853p06A7790K67092a24294
$$ 77867 32964 -10245 -54231 -327037 15408 119415 -62748 -60895 -61601 17790 284882 -124294
11390e5761f414p5882E3413a37578O8257K2056D7958N3130d01238D81536k15176
$$ -55761 -6414 -82296 53413 -137578 -69321 -47265 47958 101088 -401238 481536 266360
11379B66360F3039i2930L9767F0859J6578J64953c6042a3552B24501f1051k8574
$$ 266360 63039 -92930 -53163 60859 77437 242390 -36042 -13552 224501 -61051 -89625
11368h9625I0097l9069h0514j47698Q1520B1654a53555b7950A00773a56002E3279
$$ -89625 90097 51028 -80514 -228212 -146692 21654 -153555 -27950 100773 -156002 53279
11356b27697A38006j6696a8992C47578D17N4162a06206M3656j61212C7154a48659
$$ -227697 138006 121310 -18992 347578 417 54579 -106206 -62550 -223762 37154 -148659
11344c28735g8202I9548k4020a09246a2132j5925j26181a8572C9309K35111b08634
$$ -328735 -78202 99548 75528 -109246 -12132 -28057 -154238 -18572 39309 274420 -208634
11332H6524b51047D24408E2701J54734a52006B02650q6220J71335i5192j581r8237
$$ 86524 -251047 424408 52701 207435 -152006 202650 116430 287765 -95192 -96773 -195010
11321a95010f7160A89616d7701B2799h324B94875b57448a3533r5273c7378j26828
$$ -195010 -67160 189616 -47701 22799 -8324 294875 -257448 -13533 -108806 -37378 -164206
11310a64206k2737A01862a29020B92924b42835H8673R4027g943j64631n2093h4981
$$ -164206 -186943 101862 -129020 292924 -242835 88673 182700 -7943 -172574 -224667 -84981
11298A68676c70423A81159a28846A67930b7937B82843a22102j14509B07872d95532
$$ 168676 -370423 181159 -128846 167930 -27937 282843 -122102 -236611 207872 -495532
11287a51527A79795c89761a93744e6517j1514k45699J39369b1499k77199G2313
$$ -151527 179795 -389761 -193744 -56517 -68031 -313730 -174361 -21499 -298698 72313
11276A03723a64167J8869C1831b88369a14804B13403a15883H855a80702H8981
$$ 103723 -164167 -145298 31831 -288369 -114804 213403 -115883 8855 -180702 88981
11265a95269G9489A102K70891i0406k06206a9487A17706a90947B40155D4668J3965
$$ -195269 79489 1102 271993 -90406 -296612 -19487 117706 -190947 240155 44668 58633
11254E8633a75235o0858A47503j0125m3645c31570C5382K06336b46213M6744A41478
$$ 58633 -175235 -236093 147503 137378 93733 -331570 35382 241718 -246213 -199469 141478
11242a17242d3864l75590J06850a09781B77940a40986o5264F588K29119a16668
$$ -117242 -43864 -419454 -312604 -109781 277940 -140986 -206250 6588 235707 -116668
11231a86679j10074k859A13950h5604b6868B7171L78109E7625J6905K5427k964
$$ -186679 -296753 -299612 113950 -85604 -26868 27171 405280 57625 74530 99957 96993
11220I6993J99638c7354j88203f811n6701A60762g2041j21149M9619B3858D378
$$ 96993 296631 -37354 -225557 -6811 -63512 160762 -72041 -193190 -143571 23858 4378
11208B28484b47896C80593f6538A44296b76478Q041B60697b81575j00051A31426
$$ 228484 -247896 380593 -66538 144296 -276478 -268437 260697 -281575 -381626 131426
11197D4103J78555b40723A06412d6256j31835d0016j31842L6624n7509I0204i0856
$$ 44103 222658 -240723 106412 -46256 -178091 -40016 -171858 -135234 -192743 90204 -90856
11185h1896p1931E9024e24358i6781j02701f838j2677D4437A813b27586n3761
$$ -81896 -153827 59024 -524358 -96781 -199482 -6838 -19515 44437 1813 -227586 -281347
11174b81347A12365b70035A07368b91946g7907C13758j14516c8065a7770j53175
$$ -281347 112365 -270035 107368 -291946 -77907 313758 199242 -38065 -17770 -170945
11164a70945n0815A20439M5359e3380C54614e2007o4396A88859q6164i5111n0051
$$ -170945 -221760 120439 165798 -53380 354614 -52007 -116403 188859 102695 -95111 -145162
11153a45162j69839C97438j61568p9799J4942J18771a80855k3141A95666D5552
$$ -145162 -315001 397438 235870 156071 171013 289784 -180855 -203996 195666 45552
11142c03768a11866H9276a67335C8377J53938L9217h8738C00547D4888L19397
$$ -303768 -111866 89276 -167335 38377 192315 231532 -88738 300547 44888 364285
11132C64285J1672h7053E2986K25885a17907D3187J21958a84053M8367H2859l3973
$$ 364285 375957 -87053 52986 278871 -117907 43187 165145 -184053 -135686 82859 48886
11121D8886Q8830a20442N3846E6114J26092H8717K06077F056b3430j480m86328
$$ 48886 137716 -120442 -66596 56114 182206 88717 294794 6056 -23430 -24910 -511238
11110e11238C5829K10292n9061o8287J5090C5166L46523I4593J23902J14175q5718
$$ -511238 35829 246121 187060 118773 133863 35166 381689 94593 218495 332670 246952
11099B46952q0554a51833A16986a76413a1331J079E8041J84640r1799b54049A23995
$$ 246952 166398 -151833 116986 -176413 -11331 -10252 58041 242681 150882 -254049 123995
11087c49140A14164D5253R4882J66271b3156l0988C1797b7975G975K71298a47860
$$ -349140 114164 45253 140135 306406 -23156 -54144 31797 -27975 7975 279273 -147860
11075C19308O8821O408j74932H4116l3897L09108J49781L0292n4464B42427L83071
$$ 319308 388129 394537 219605 84116 50219 359327 509108 539400 484936 242427 625498
11064F25498j3496A64257K70739m5351o8642A16994J60355J4891r0541J56797
$$ 625498 612002 164257 434996 389645 321003 116994 277349 292240 201699 358496
11054C58496M36555C41601N11365l01575p5002K04241j4460k29539J59680o9880
$$ 358496 795051 341601 852966 551391 476389 680630 666170 436631 596311 526431
11044E26431J58325k78087J77612L77910j68981l3544k56558M85974D62010K76118
$$ 526431 684756 406669 584281 962191 793210 759666 503108 989082 462010 738128
11034G38128J01404C89008K92442J46217l31529R3614J0760j20004j981R7135
$$ 738128 839532 389008 681450 827667 496138 589752 600512 480508 478527 575662
11024E75662K5741L2413J82741k37240B54569P076J15509A39285K04409J22683
$$ 575662 601403 633816 816557 579317 254569 261645 377154 139285 343694 466377
11014D66377I1228M62808l4534j22320o0648k2741J65563m7378q9461K77802m6751
$$ 466377 91228 554036 519502 397182 336534 313793 479356 431978 342517 620319 573568
11003E73568A66413O70647C33933L08266k21930J02010k14939L33446j44918K41285
$$ 573568 166413 837060 333933 642199 420269 522279 307340 640786 495868 737153
10993G37153l9461j57671N4300L95018j70817j63400O1141J0712j06419m2468
$$ 737153 697692 540021 594321 989339 818522 655122 716263 726975 620556 578088
10983E78088J74526K81128k93362M31960k04991L03043j11886K38984J60015L12743
$$ 578088 752614 1033742 740380 1172340 967349 1270392 1158506 1397490 1557505 1870248
10973A870248M38947l68839N44462K0447n9352m7589J88393n85006l37239J3049
$$ 1870248 2309195 1940356 2484818 2505265 2445913 2398324 2586717 2001711 1664472 1677521
10963A677521l48152q1004l72663J91675K18685O6461l58452j2375k5414p1640
$$ 1677521 1329369 1248365 875702 1067377 1286062 1352523 994071 981696 956282 884642
10953H84642K69253j57122m36007n3659j07181j07352o2251q6716C5607M13764
$$ 884642 1153895 996773 560766 507107 399926 292574 230323 143607 35607 449371
10943D49371r7249j9222J13936Q634j94954J55625J2904e7020j26435C163O297
$$ 449371 352122 332900 446836 455470 260516 416141 429045 -57020 -183455 3163 9460
10932I460M7462c9165B80715r2168j3172h1220B10279a08834C16604A12571C3954
$$ 9460 56922 -39165 280715 188547 175375 -81220 210279 -108834 316604 112571 33954
10920h9085A92334F7769P3910f9257l03084a15458n2322A59174e3751A72957g1194
$$ -89085 192334 67769 141679 -69257 -372341 -115458 -167780 159174 -53751 172957 -71194
10908C08113b9241j05841N0263C3752c2079A13463Q1527G3238Q1990J62367a52025
$$ 308113 -29241 -135082 -84819 33752 -32079 113463 194990 73238 155228 317595 -152025
10896e9831A49993e282A39466b8974B69385i7144C52200a41638K4717C1201K12375
$$ -59831 149993 -5282 139466 -28974 269385 -97144 352200 -141638 -116921 31201 243576
10885B43576p8696p6541C655g8574A77921b56152A33542o1115J31038d2310o8072
$$ 243576 164880 88339 3655 -78574 177921 -256152 133542 72427 203465 -42310 -110382
10874a10382A94476C9110Q1440m6732f0621A4944a91687A82504a83402N3550A66422
$$ -110382 194476 39110 120550 73818 -60621 14944 -191687 182504 -183402 -129852 166422
10862B5080b31361Q6160M3068A96207b21039c0263A89243a0205F4099J97152e3647
$$ 25080 -231361 -145201 -102133 196207 -221039 -30263 189243 -10205 64099 261251 -53647
10850i1185j28160c0705k8034k44779H5838a82948N7117A69380e3577C4228b26565
$$ -91185 -219345 -30705 -58739 -303518 85838 -182948 -125831 169380 -53577 34228 -226565
10838b20569A54260G6135j2443a06256A36090a60217C2425e0743C7625H930a61948
$$ -220569 154260 76135 63692 -106256 136090 -160217 32425 -50743 37625 8930 -161948
10826a37795M4249a3695A31187P4282F9177J3033h1780A64324K06801G56g152
$$ -137795 -93546 -13695 131187 205469 69177 82210 -81780 164324 371125 756 -7152
10814H4529N5538b01717q0324j07383R0410f7879j13949O2187n2218C2268h6693
$$ 84529 140067 -201717 -282041 -389424 -299014 -67879 -181828 -119641 -171859 32268 -86693
10802G9167J16h9125j21074O0938O207A82153J48955j22171a04979j3497G7277
$$ 79167 79283 -89125 -210199 -149261 -143054 182153 331108 208937 -104979 -118476 77277
10790B00513a64214c1836H431i5603A0750h3569k4346C07590C3099a7858D57604
$$ 200513 -164214 -31836 8431 -95603 10750 -83569 -107915 307590 33099 -17858 457604
10778a04010E0454a65786N7066A72648o1241c83244a49344A30845b55892E38358
$$ -104010 50454 -165786 -108720 172648 111407 -383244 -149344 130845 -255892 538358
10767b0311I6276m3579a05357j07935Q5589r7970b1228B01858i4431B08746c26496
$$ -20311 96276 52697 -105357 -213292 -127703 -225673 -21228 201858 -94431 208746 -326496
10755C3635K28406J10469I6337d1837a031j24535G6063C1248c36678a34085E318
$$ 33635 262041 372510 96337 -41837 -1031 -125566 76063 31248 -336678 -134085 5318
10743E8679a14928A95840p8967a07750o9532l4981B63321g3085k55439J52068
$$ 58679 -114928 195840 116873 -107750 -177282 -212263 263321 -73085 -328524 -176456
10733a76456p2823i665j92841j77384e2780I1769O9121N0587p6668a15181r1894
$$ -176456 -249279 -9665 -202506 -379890 -52780 91769 160890 211477 134809 -115181 -207075
10722b07075A84313G9538r56L5453J21379e4272A80043c41523a42641k18214J29252
$$ -207075 184313 79538 78582 114035 235414 -54272 180043 -341523 -142641 -360855 -231603
10711b31603p375F2655a91373a4884n0736j1270c2445H1255a7038C00368j46282
$$ -231603 -238978 62655 -191373 -14884 -65620 -76890 -32445 81255 -17038 300368 154086
10700A54086D6842j1519a7498j61705k0462d1964k52049b6813k2686o2686B6398
$$ 154086 46842 35323 -17498 -179203 -199665 -41964 -294013 -26813 -49499 -112185 26398
10688h8883k16904J51856b7781A50894e69729E3421M7587a4353m9976b423A09855
$$ -88883 -305787 -153931 -27781 150894 -569729 53421 101008 -14353 -64329 -2423 109855
10676A4859b44059C9468J36044d7406k82255C01084A49597b90237J24202K7336
$$ 14859 -244059 39468 175512 -47406 -329661 301084 149597 -290237 -166035 -138699
10666a38699r8607A83309D3811N0602J16764a60998e5188A32290b78101A21217
$$ -138699 -237306 183309 43811 94413 211177 -160998 -55188 132290 -278101 121217
10655B66039a10811e4625j84342C4764f8636j6064b7530l8177j51107A7443J11233
$$ 266039 -110811 -54625 -238967 34764 -68636 -84700 -27530 -65707 -216814 17443 128676
10644A28676A5447J00597a16632B07211N0114c17854a19632L9817E7952K03897
$$ 128676 15447 116044 -116632 207211 257325 -317854 -119632 -79815 57952 261849
10634B61849a90958A04867N4725k4294J00802d30900a30881l22986a10052q1254
$$ 261849 -190958 104867 159592 135298 236100 -430900 -130881 -453867 -110052 -191306
10624a91306k6625n1202a3303j48414J4135A95314C596Q9388i7581j68702A88379
$$ -191306 -217931 -269133 -13303 -161717 -147582 195314 3596 92984 -97581 -266283 188379
10612B417a46710l1595A46040b07270l5510G137i4963k9612G8295b69182i9860
$$ 2417 -146710 -178305 146040 -207270 -242780 7137 -94963 -124575 78295 -269182 -99860
10600b62185B5897b01248g1824j48672A12491g9207B34435q1978a79225N1203
$$ -262185 25897 -201248 -71824 -220496 112491 -79207 234435 152457 -179225 -128022
10590a28022H3977g5329j27516A49669a66378P841B27687j11241O225B7208d948
$$ -128022 83977 -75329 -202845 149669 -166378 -158537 227687 116446 122671 27208 -4948
10578a91309B82770i3704M3181j16137A48499b35482B50927a95107B17901L05032
$$ -191309 282770 -93704 -50523 -166660 148499 -235482 250927 -195107 217901 522933
10568E22933c46839a03141A003N7440a33885F7934a50578b9773j47705h3860j26225
$$ 522933 -346839 -103141 1003 58443 -133885 67934 -150578 -29773 -177478 -83860 -210085
10557b10085B27630a06618I4227a12515N5201B29870p1901j9324a69344A08441
$$ -210085 227630 -106618 94227 -112515 -57314 229870 157969 138645 -169344 108441
10546a04135I3751i2786A77774L54095c2335k28791d507B2828N2920l3549K8437
$$ -104135 93751 -92786 177774 531869 -32335 -261126 -4507 22828 75748 42199 70636
10535G0636j9246J24790a77579O4719j91312k4786a9224A23619n6984g0847L0604
$$ 70636 51390 176180 -177579 -112860 -304172 -328958 -19224 123619 66635 -70847 -40243
10524d0243J9410B51594h5548m5506J4323M8232H4361d5091A99091D4597e2659
$$ -40243 -20833 251594 -85548 -131054 -116731 -68499 84361 -45091 199091 44597 -52659
10512D2269h6145k17091a21567j0282k17601A40356a49983j29658C09317I3715
$$ 42269 -86145 -303236 -121567 -131849 -349450 140356 -149983 -279641 309317 93715
10501b9563K020B61406a32397e3671l8337D42492f3310k55006A65940A6886b4679
$$ -29563 -27543 261406 -132397 -53671 -92008 442492 -63310 -318316 165940 16886 -24679
10489b21603B89224i9798k07570M7363K0705A99448k7897e1817C08785j51381
$$ -221603 289224 -99798 -307368 -260005 -239300 199448 171551 -51817 308785 157404
10479A57404Q7248k2307p95b0723j03469o0201h4230a9166A1648d36618e7388
$$ 157404 244652 222345 221550 -20723 -124192 -184393 -84230 -19166 11648 -436618 -57388
10467C2018o06J1211a13516j52306B76446a16768k28003J15802i5939A40791B86
$$ 32018 31412 42623 -113516 -265822 276446 -116768 -344771 -228969 -95939 140791 286
10455A83848G5564R9476r362c03738C8251R1266i3077d0103m5701k68032J46560
$$ 183848 75564 175040 165678 -303738 38251 129517 -93077 -40103 -85804 -353836 -207276
10444b07276i3451B59930B1809a60336a2507q9865n27r8956k32727B11628o8222
$$ -207276 -93451 259930 21809 -160336 -12507 -102372 -102899 -201855 -434582 211628 143406
10433A43406L2330a81051J8260B77357D7537h2972A25037b92931B77286b43820
$$ 143406 175736 -181051 -162791 277357 47537 -82972 125037 -292931 277286 -243820
10422g2721C5140g8190o6714J3565j44675C0918c06271c0549q4204D72749A16751
$$ -72721 35140 -78190 -144904 -131339 -276014 30918 -306271 -30549 -114753 472749 116751
10410A5675a22542q26I5742b51968e5143A55151B1870b73671h3953B0623Q8137
$$ 15675 -122542 -123368 95742 -251968 -55143 155151 21870 -273671 -83953 20623 108760
10399A08760b231B57001b1975C22582k0116j369j14564p7964a1450C17269g3806
$$ 108760 -2231 257001 -21975 322582 302466 301097 186533 108569 -11450 317269 -73806
10387A29607a32927B90421D479g6546B05801J35389j22047J22367A2391J24190
$$ 129607 -132927 290421 4479 -76546 205801 341190 219143 341510 12391 136581
10377A36581K78681J02360B9994K23132K86964A74537i8961C59152c7359B09161
$$ 136581 415262 517622 29994 253126 540090 174537 -98961 359152 -37359 209161
10366A00077J14834O7329G0924L72574j32997k1293P0866A37581J37664g4012
$$ 100077 214911 282240 70924 443498 310501 289208 360074 137581 275245 -74012
10355C59599j58624J43116j26171N4574j4820J61797j12959A17687M32634k19887
$$ 359599 200975 344091 217920 272494 257674 419471 306512 117687 550321 330434
10345C30434j4421c1261C63655l6509O2401j34898m7358q3876l422K7297P3608
$$ 330434 316013 -31261 363655 327146 389547 254649 207291 123415 119993 147290 220898
10334B20898I862c4822n5671k2277B3581N9206J71628o4702i883A19355b93846
$$ 220898 9862 -34822 -90493 -112770 23581 82787 254415 189713 -9883 119355 -293846
10322e6721B11511o7948B7793L55315b0011I8289a3109m7642q284G5010J02127
$$ -56721 211511 143563 27793 383108 -20011 98289 -13109 -60751 -69035 75010 177137
10311A77137a63028h0047B8774O61j3923J36288C8695b46720d648k64253F3178
$$ 177137 -163028 -80047 28774 29435 15512 151800 38695 -246720 -4648 -268901 63178
10299f3928A3702c5136A14584b37629j60972a72827g5838G1663R3189I095P6200
$$ -63928 13702 -35136 114584 -237629 -398601 -172827 -75838 71663 164852 9095 85295
10288H5295b15476O8750k61650a193p9218j35469b4956A35078a43402A24595b6792
$$ 85295 -215476 -146726 -408376 -1193 -80411 -215880 -24956 135078 -143402 124595 -26792
10276e3888A57837a20570l142B38631k0940P0533a98037O4979l3666B80797l7017
$$ -53888 157837 -120570 -123712 238631 217691 288224 -198037 -133058 -166724 280797 243780
10265B43780a5696A95961q5700J71639b1445A41708F8081K34820A0560K31852
$$ 243780 -15696 195961 110261 281900 -21445 141708 68081 302901 10560 242412
10255B42412A4047a31566F0262L9973A198L02871j30549a23364M0702G1629a08113
$$ 242412 14047 -131566 60262 100235 1198 304069 173520 -123364 -82662 71629 -108113
10243a80912a5507j52674B74438B7150a52633k48499i4669B29715a34229R206
$$ -180912 -15507 -168181 274438 27150 -152633 -401132 -94669 229715 -134229 -125023
10233a25023j65060i8949A15009e1600A26916a92878B13243J00751a99283I0397
$$ -125023 -290083 -98949 115009 -51600 126916 -192878 213243 313994 -199283 90397
10222c0682A7514a10555d880j23721o4730J3923C7828j0511c15297a6635p8603
$$ -30682 17514 -110555 -4880 -128601 -193331 -179408 37828 27317 -315297 -16635 -95238
10211i5238c501l22629M4956A28488J90842A6023a49196B00603c67044h0910j5448
$$ -95238 -3501 -326130 -281174 128488 319330 16023 -149196 200603 -367044 -80910 -96358
10200i6358A21048N024g7087j574j52029j18411J70973f195m09867f683l48182
$$ -96358 121048 126072 -77087 -78661 -230690 -349101 -178128 -6195 -416062 -6683 -354865
10189c54865A05632b51226a15854O677q4607b3936k09429h4990K8727k01124R8962
$$ -354865 105632 -251226 -115854 -109177 -193784 -23936 -233365 -84990 -56263 -257387 -158425
10178a58425G4679g4995j62826g9522j342l768j509A93828n5777R327k4630e1207
$$ -158425 74679 -74995 -237821 -79522 -80864 -84632 -86141 193828 138051 147378 122748 -51207
10165c0639A9500h1892j61549R5464F3951A9823N254J04296f0710D3491R0949
$$ -30639 19500 -81892 -243441 -147977 63951 19823 25077 129373 -60710 43491 134440
10154A34440M218a42400B21275q9139b02466h2396n993k89500J85398n1120j16752
$$ 134440 138658 -142400 221275 132136 -202466 -82396 -88389 -377889 -192491 -243611 -360363
10143c60363a20900L7921c8829C6906e5374m22016b33505h7917J8778A05673g5027
$$ -360363 -120900 -82979 -38829 36906 -55374 -477390 -233505 -87917 -69139 105673 -75027
10131I2022m1624A7859a24083L6208n1951J4628d897o3689j0684H4154C3903J72593
$$ 92022 50398 17859 -124083 -87875 -139826 -125198 -4897 -68586 -79270 84154 33903 206496
10119B06496a21652j88067a32880a8825A22210b96622g5231j93749A40624F840
$$ 206496 -121652 -309719 -132880 -18825 122210 -296622 -75231 -268980 140624 6840
10108a60711M7288a5276r0589A16512j4094b08650C0145j2226P1583h8135k0542
$$ -160711 -113423 -15276 -105865 116512 102418 -208650 30145 17919 89502 -88135 -108677
10097a08677B03116d6184m06789a75741E1536K43295a37018a8511D8566a85156
$$ -108677 203116 -46184 -452973 -175741 51536 294831 -137018 -18511 48566 -185156
10086c14148a48083o8783C5695g9444k71221H7346B5673c54977A91273f215i29
$$ -314148 -148083 -216866 35695 -79444 -350665 87346 25673 -354977 191273 -6215 -929
10074a51285I1942b90910a11007o5680j64884a35891B60390A17654e4554k04151
$$ -151285 91942 -290910 -111007 -176687 -341571 -135891 260390 117654 -54554 -258705
10064b58705a11211J1441c6888k17531d9470k27647A67541A9199a25386A12585
$$ -258705 -111211 -99770 -36888 -254419 -49470 -277117 167541 19199 -125386 112585
10053a72095C6040g5993K7920A91191p6112g2389k06846B34343j14484c3601H0941
$$ -172095 36040 -75993 -48073 191191 115079 -72389 -279235 234343 119859 -33601 80941
10041B47549L9413H760a84204j00181j64150B35700c74702J42113f4686D138b32145
$$ 247549 286962 8760 -184204 -284385 -448535 235700 -374702 -232589 -64686 4138 -232145
10029E2118a63846A18722B4351K92225b73761Q481B7199a57433d3155k84831B5923
$$ 52118 -163846 118722 24351 316576 -273761 -265280 27199 -157433 -43155 -327986 25923
10017B7430J32946b01473L4057J1459k58896a72751C082a83234B0016K3213e2683
$$ 27430 160376 -201473 -167416 -155957 -414853 -172751 3082 -183234 20016 43229 -52683
10005e0228j16643k0446h8009m4535c9683l917A2905a13633c6530l00745A46882
$$ -50228 -166871 -187317 -88009 -132544 -39683 -43600 12905 -113633 -36530 -337275 146882
9993a4882E620O7584a16119j42061E399J45879D7439a52691n6479c4353B0432
$$ -14882 5620 73204 -116119 -258180 5399 151278 47439 -152691 -209170 -34353 20432
9981B06957D3599c4526G936a03492E5937b6002B6571a85350B05577l4609J3288
$$ 206957 43599 -34526 7936 -103492 55937 -26002 26571 -185350 205577 170968 184256
9970A84256a61112A23691a51863C0422d2178j41674k1015dl95145H9883a49426
$$ 184256 -161112 123691 -151863 30422 -42178 -183852 -204867 -4 -395149 89883 -149426
9958a70882j64223b2649B8224g600A42453d5321j18042d8341I7109J95497a2674
$$ -170882 -335105 -22649 28224 -7600 142453 -45321 -163363 -48341 97109 292606 -12674
9946A34029a9892k14981A65492d23920A84117l3537N4331F7634J19390g1028r8785
$$ 134029 -19892 -234873 165492 -423920 184117 150580 204911 67634 187024 -71028 -169813
9935a69813k24720h3410k2774J0345q5012A9539L6755B7182g9097j47257A63000
$$ -169813 -394533 -83410 -106184 -95839 -180851 19539 56294 27182 -79097 -226354 163000
9923a2079j74140E6995h5857n5238N0277B6948J01967a32013A51748J6384l0889
$$ -12079 -186219 56995 -85857 -141095 -90818 26948 128915 -132013 151748 168132 137243
9912A37243a43932M5885B16133a02828d1726j76847P6262A5567J0089Q6796a82847
$$ 137243 -143932 -98047 216133 -102828 -41726 -218573 -142311 15567 25656 112452 -182847
9900e7174l8963j26435D0102a61678I4537p243a15428j24937J7312a07488M1785
$$ -57174 -96137 -222572 40102 -161678 94537 87294 -115428 -240365 -223053 -107488 -65703
9889f5703J0650k63554J04452A22086g5185B40586b82501N1503J05485C7837L3586
$$ -65703 -55053 -318607 -214155 122086 -75185 240586 -282501 -230998 -125513 37837 71423
9878G1423b97510g4330A40746a4057j11450j99948g1179A1992c58210C907b16230
$$ 71423 -297510 -74330 140746 -14057 -125507 -325455 -71179 11992 -358210 3907 -216230
9866a34453l46781A08913a15580e1501C28111b52166A97143A8498K80650a41775
$$ -134453 -481234 108913 -115580 -51501 328111 -252166 197143 18498 299148 -141775
9855a25075J9325A4133c25655a51593R627B6361a09015C69298a65199A93126a06545
$$ -125075 -105750 14133 -325655 -151593 -141966 26361 -109015 369298 -165199 193126 -106545
9843b05039i6160B07767a7954j99074A00715k5477d23648B16392B9147a89168
$$ -205039 -96160 207767 -17954 -217028 100715 75238 -423648 216392 29147 -189168
9832b66385B4823d17679a99551k4541Q2770q0609K2215m5902k4126B03379g2737
$$ -266385 24823 -417679 -199551 -224092 -141322 -221931 -199716 -245618 -269744 203379 -72737
9820d63637C70216b10876B1636g9733K084F9084P5095J7101a84050d261j6476
$$ -463637 370216 -210876 21636 -79733 -77649 69084 144179 161280 -184050 -4261 -20737
9809b0737A38638k0151j3486A94f1988M399j7777j04720J1281k403P464B44660
$$ -20737 138638 118487 105001 194 -61988 -57589 -75366 -180086 -168805 -171208 -163744 244660
9796i2303L6632b6131k02092k8540E38P1460h1842A00415P4804a50134B33783
$$ -92303 -55671 -26131 -228223 -256763 538 71998 -81842 100415 175219 -150134 233783
9784A7090J00825a39646A13237a48504A89353a38593K4426p6171N9234E1958b25703
$$ 17090 117915 -139646 113237 -148504 189353 -138593 -114167 -190338 -131104 51958 -225703
9772b34102b3654l5357j66645r2514J55333p8116R7977d7478j5311m8193M1703
$$ -234102 -23654 -59011 -225656 -318170 -162837 -240953 -142976 -47478 -62789 -110982 -69279
9761f9279j30246a4257j69904d7981A51072L0142r0290e4668C35168C9243a15561
$$ -69279 -199525 -14257 -184161 -47981 151072 181214 90924 -54668 335168 39243 -115561
9749a57064B31847C5048a29511D8831h6142G4130e6905A01392b1440m956E6803
$$ -157064 231847 35048 -129511 48831 -86142 74130 -56905 101392 -21440 -26396 56803
9737B35043a87015A30116a03614L8324j2785k12893i4292o4740j75627a10295
$$ 235043 -187015 130116 -103614 -65290 -78075 -290968 -94292 -159032 -334659 -110295
9726a23288j11414L8282B08763a55538C1155d40557a53595L6348a5903C610R0122
$$ -123288 -234702 -196420 208763 -155538 31155 -440557 -153595 -117247 -15903 3610 93732
9715I3732b07650o082h9029J1327K6003j84654L977l06031A7702c60541a41415
$$ 93732 -207650 -213732 -89029 -77702 -51699 -236353 -232376 -538407 17702 -360541 -141415
9703e09888K30325J36369n8573l082b1735j79956A66599i0879k11382Q9031O7357
$$ -509888 -279563 -143194 -201767 -204849 -21735 -201691 166599 -90879 -302261 -213230 -145873
9692a45873g2138o913j16871B1757c29154A05748a04738m5445j19493e9863J3861
$$ -145873 -72138 -79051 -195922 21757 -329154 105748 -104738 -150183 -269676 -59863 -46002
9681d6002A84993c3366H245c4280I3941f9210k8748E6376e6653l55596a19581
$$ -46002 184993 -33366 8245 -34280 93941 -69210 -97958 56376 -56653 -412249 -119581
9669A162e8094B04837I5947b20625c8697m1116A04001a66971K8128B23748F7252
$$ 1162 -58094 204837 95947 -220625 -38697 -79813 104001 -166971 -138843 223748 67252
9657A8747c90459G6569d58667a72833G8696h9385a9422d07j47238e518A84669
$$ 18747 -390459 76569 -458667 -172833 78696 -89385 -19422 -407 -147645 -5518 184669
9645a93736c9712C1211a88366F9642b21775A37512a26416C88602e40645D7291
$$ -193736 -39712 31211 -188366 69642 -221775 137512 -126416 388602 -540645 47291
9634i2172I210b71178e9103A47495d4680k8956A51929p5583f4467A18970g5397
$$ -92172 9210 -271178 -59103 147495 -44680 -73636 151929 76346 -64467 118970 -75397
9622c7622m14673A03099a59986A44625p1755A8907J13171f3186A1075J22847a2394
$$ -37622 -452295 103099 -159986 144625 72870 18907 132078 -63186 11075 133922 -12394
9610c11105A58561b24754P6139a2282j22819A64636b32862G3017b73767j16583
$$ -311105 158561 -224754 -148615 -12282 -135101 164636 -232862 73017 -273767 -390350
9600c90350d9128j67643c5970H1552b43313G9698a42785g0224k23513A73953q4731
$$ -390350 -49128 -216771 -35970 81552 -243313 79698 -142785 -70224 -293737 173953 89222
9589H9222a99641e1135f324l00467m6929A13984a66986A36210e5648a1572j15695
$$ 89222 -199641 -51135 -6324 -306791 -353720 113984 -166986 136210 -55648 -11572 -127267
9578a27267A47503a95664A33384d4533E8327k8696a35561A2158J24118d08923
$$ -127267 147503 -195664 133384 -44533 58327 29631 -135561 12158 136276 -408923
9567D9692A2712a80287E3290g4307B45348a01089F0153d0094j01264p8818A58972
$$ 49692 12712 -180287 53290 -74307 245348 -101089 60153 -40094 -141358 -220176 158972
9555a0737B77435a11598N2026B25706f8773j9276B12117a67351G9910b94452b9730
$$ -10737 277435 -111598 -59572 225706 -68773 -88049 212117 -167351 79910 -294452 -29730
9543b492j21522A16894b48100i6272j0664a9822p9261b1898q8326M1955A4633
$$ -2492 -124014 116894 -248100 -96272 -106936 -19822 -99083 -21898 -110224 -68269 14633
9531d8661F9786c78704a1032p3973D1919P9398e5896F0985b27416c1479j0891
$$ -48661 69786 -378704 -11032 -85005 41919 121317 -55896 60985 -227416 -31479 -42370
9520d2370I0290b4633j04140p6452F4838a12255b5143l19426J09537j61725J00377
$$ -42370 90290 -24633 -128773 -205225 64838 -112255 -25143 -344569 -235032 -396757 -296380
9509b96380G4725O1810c497k03844k098H9509d10616a49856j4334j10441a22783
$$ -296380 74725 136535 -3497 -207341 -209439 89509 -410616 -149856 -164190 -274631 -122783
9497g9439E6164A8894b61223c3639k5502j71946A04330m8794g7232j99100F0314
$$ -79439 56164 18894 -261223 -33639 -59141 -231087 104330 55536 -77232 -276332 60314
9485c37128c3793F8050j9813M6056J83940b20928f5116l7929l2882N1993l6343
$$ -337128 -33793 68050 48237 94293 278233 -220928 -65116 -103045 -135927 -83934 -120277
9474a20277C8681j3639c887A40323a69478C194K17606d8894B29845a87980B18780
$$ -120277 38681 25042 -3887 140323 -169478 3194 220800 -48894 229845 -187980 218780
9462i9864o2135G967h4512H6851O8957c29741M7215B5984b264F6623N0934c6458
$$ -99864 -161999 7967 -84512 86851 155808 -329741 -282526 25984 -2264 66623 117557 -36458
9449A15676G395c00167F5287b98596J12155A89374D9048G19a6299D4784a1161
$$ 115676 7395 -300167 65287 -298596 -186441 189374 49048 719 -16299 44784 -11161
9437d3706j28336G4967a12274l7675M0558C47865e9031a3481j61911q1310e6569
$$ -43706 -172042 74967 -112274 -149949 -109391 347865 -59031 -13481 -175392 -256702 -56569
9425a52153B77565L2680c78973J37925D0561a03322j6136q3433a1113r8766M5153
$$ -152153 277565 310245 -378973 -241048 40561 -103322 -119458 -202891 -11113 -109879 -64726
9414f4726A29340p15c7539C45978i5956m9028L8029H3391O9734C9262J49939a53330
$$ -64726 129340 128625 -37539 345978 -95956 -144984 -106955 83391 153125 39262 189201 -153330
9401G5809b09976k48315a26505k4262j1386A16654a35802E08440a2213j84592
$$ 75809 -209976 -458291 -126505 -150767 -162153 116654 -135802 508440 -12213 -196805
9391a96805R7797r3582L8874a2775k71787i5260F631f2781n499D3900a31631L3372
$$ -196805 -99008 -192590 -153716 -12775 -284562 -95260 6631 -62781 -68280 43900 -131631 -98259
9379i8259l2689p9689A41648a48156A4987b00480R8552j0195m5982A24980b83177
$$ -98259 -130948 -210637 141648 -148156 14987 -200480 -101928 -112123 -158105 124980 -283177
9367B11066k836e6011k75664I772I29c85656Q1042A73151q4279e5785f851B4123
$$ 211066 208230 -56011 -331675 9772 929 -385656 -304614 173151 88872 -55785 -6851 24123
9354B25728i6269A2383K22255A08920c8085I3482h0589l07133A07099a02530k6320
$$ 225728 -96269 12383 234638 108920 -38085 93482 -80589 -387722 107099 -102530 -128850
9343a28850o6820p4254b0253C1311J45785J2485j1835a62973A81842a32934j53893
$$ -128850 -195670 -269924 -20253 31311 177096 189581 177746 -162973 181842 -132934 -286827
9332b86827J30906A81563E7536d45175i8820J0072H6725j3681K6404b1185A45781
$$ -286827 -155921 181563 57536 -445175 -98820 -88748 86725 73044 99448 -21185 145781
9320b15866H3532A3404J69628i6117A3419b25981g1377m1625l4589d8663A45002
$$ -215866 83532 13404 183032 -96117 13419 -225981 -71377 -113002 -147591 -48663 145002
9308g4839F1600J34366a08602j48093B39349C7667J03988l8468d3161K1200j17981
$$ -74839 61600 195966 -108602 -256695 239349 37667 141655 103187 -43161 -21961 -139942
9297a39942n1422j53268e9126k07962F34e4432j84511c0136D6530G319K435a09094
$$ -139942 -191364 -344632 -59126 -267088 634 -54432 -238943 -30136 46530 7319 9754 -109094
9284a70975j72604i0139H0157a86857j03661D4631M0283a4508l05255a27834C3721
$$ -170975 -343579 -90139 80157 -186857 -290518 44631 84914 -14508 -319763 -127834 33721
9272c17284K0105j11147J35523K6961i8334j44325R7032b2563P634C6420a60649
$$ -317284 -297179 -408326 -272803 -245842 -98334 -242659 -145627 -22563 -14929 36420 -160649
9260a61123d0101j35009A71591d77102C8189J10396J19786a63590j73924H56a03071
$$ -161123 -40101 -175110 171591 -477102 38189 148585 268371 -163590 -337514 856 -103071
9248d1577C4099h2272D2993c74082J04080k37d0720o3878D1418K06496c8560H3985
$$ -41577 34099 -82272 42993 -374082 -270002 -270239 -40720 -104598 41418 247914 -38560 83985
9235a10320k06035C6635b26521q0416b8532n2221A17605a82954B08901a58958
$$ -110320 -316355 36635 -226521 -306937 -28532 -80753 117605 -182954 208901 -158958
9224I0964b64634P2946N5559o7203A36851m2439b34441C04330H2406R9222O0204
$$ 90964 -264634 -191688 -136129 -203332 136851 94412 -234441 304330 82406 181628 241832
9213B41832b21001a08423l21937J90422M6771Q5359j6845j4500c0156F6307b34585
$$ 241832 -221001 -108423 -430360 -239938 -193167 -107808 -124653 -139153 -30156 66307 -234585
9201a66662l5720M7479g0834J1451j32224A43258a57395B26909b5915m2470k72642
$$ -166662 -202382 -154903 -70834 -59383 -191607 143258 -157395 226909 -25915 -68385 -341027
9190c41027e1562k6464j288B1134b43213N1779M5066j2763A06826K01435a83012
$$ -341027 -51562 -78026 -79314 21134 -243213 -191434 -146368 -159131 106826 308261 -183012
9178e8569C3479g7539Q523j22346L1171l9173E6526K77231H0022a91651b3651
$$ -58569 33479 -77539 -69016 -191362 -160191 -199364 56526 333757 80022 -191651 -23651
9166b50261a13757K3887C12312o9984e3958j65460G6857d1778A99009p1976b5611
$$ -250261 -113757 -89870 312312 242328 -53958 -219418 76857 -41778 199009 127033 -25611
9154c8608l0760I4078P2639m9368J8122M1332e8117o7086C6901i1100n6688B56991
$$ -38608 -69368 94078 166717 117349 135471 176803 -58117 -125203 36901 -91100 -147788 256991
9141a83395F937K20389A01463D8818D799b8394B20930b06671A29694c19746B5827
$$ -183395 6937 227326 101463 48818 4799 -28394 220930 -206671 129694 -319746 25827
9129a9889l26729a14253B01277b4391m802A89029E1195b80884p7171a23810H400
$$ -19889 -346618 -114253 201277 -24391 -29193 189029 51195 -280884 -358055 -123810 8400
9117D7502A6940a39819A96159g7074j50868a12195B3493c57753b7510p2512A60247
$$ 47502 16940 -139819 196159 -77074 -227942 -112195 23493 -357753 -27510 -100022 160247
9105B27381b00901L4408P6358J4263G6814a787B7850O906a51491B03402c02392
$$ 227381 -200901 -166493 -90135 -75872 76814 -1787 27850 34756 -151491 203402 -302392
9093a66376B1348h9851j37913L3642B04878a41687O4517a0753E25917d16220f5965
$$ -166376 21348 -89851 -227764 -194122 204878 -141687 -77170 -10753 525917 -416220 -65965
9081A53396f0069A68152b42084B3132a30733O1522A7545b6372B7778a6755G0259
$$ 153396 -60069 168152 -242084 23132 -130733 -69211 17545 -26372 27778 -16755 70259
9069b12581O1014a2777j24056m2892I7465e8524a8815j57885A14726c48321N1968
$$ -212581 -151567 -12777 -136833 -179725 97465 -58524 -18815 -176700 114726 -348321 -296353
9058b96353j5125C6505J22192a28951j1660F4451K46435b57130j12246a39285
$$ -296353 -311478 36505 158697 -128951 -140611 64451 310886 -257130 -369376 -139285
9047F2833B9607a75506D0996a40550G3047b08119c581A65992C486Q820d1359l47100
$$ 62833 29607 -175506 40996 -140550 73047 -208119 -3581 165992 3486 12306 -41359 -388459
9035c88459a63914K4904A29558J85123c41973O8688A75580a49276A63754J15693
$$ -388459 -163914 -139010 129558 314681 -341973 -273285 175580 -149276 163754 279447
9025B79447p0310d7099k54552O1082B7435c21171A58756b7073j2798j58613h4930
$$ 279447 209137 -47099 -301651 -240569 27435 -321171 158756 -27073 -39871 -198484 -84930
9013b42035a02374n3262e5189j14890Q218E7863b76705d269k98666J2974C05802
$$ -242035 -102374 -155636 -55189 -170079 -161861 57863 -276705 -4269 -302935 -289961 305802
9001e8315E5555f3926j57645A38216a51321A21026a80967D74212A38642f3909
$$ -58315 55555 -63926 -221571 138216 -151321 121026 -180967 474212 138642 -63909
8990c7356j84208B70215d2740k01390J21501j13051a16713H1065b1231q0762k56817
$$ -37356 -221564 270215 -42740 -244130 -122629 -235680 -116713 81065 -21231 -101993 -358810
8979c58810R892g2564E4987j5210e1495D8265a62371A10866a6591I3445l9971
$$ -358810 -348918 -72564 54987 39777 -51495 48265 -162371 110866 -16591 93445 53474
8968E3474a41034d1924j9924F6373c5714F7872J11582b95590h9298C76382H1707
$$ 53474 -141034 -41924 -61848 66373 -35714 67872 179454 -295590 -89298 376382 81707
8956A0511e1466j74942C662a89551Q057n6905G1254b0001j24242A61515d027j79700
$$ 10511 -51466 -226408 3662 -189551 -181494 -238399 71254 -20001 -144243 161515 -4027 -183727
8944a83727p2746D9038A5945a66182a8008g792A56375E8374i2687F2036b0562
$$ -183727 -256473 49038 15945 -166182 -18008 -7792 156375 58374 -92687 62036 -20562
8932a32347a3917A9689d62901A29007l5518b6078d251F5768L51194L48737K769170
$$ -132347 -13917 19689 -462901 129007 93489 -26078 -4251 65768 416962 765699 3534869
8921C534869O073499A874901r08398A43364K56871o7743j49372d88903E8652a3043
$$ 3534869 9608368 1874901 966503 143364 400235 332492 183120 -488903 58652 -13043
8910A23380B9631J01650k8797b70159J26369B9887d75955a55713g2736H300i0209
$$ 123380 29631 131281 102484 -270159 -143790 29887 -475955 -155713 -72736 8300 -90209
8898a91398g3835p5994A13568c05410A7258K68820D444o17b13959A1384K86643
$$ -191398 -73835 -149829 113568 -305410 17258 286078 4444 3827 -213959 11384 298027
8887B98027H5352c36336j24358a85624M9670C38755G5814P5774e9215j76118A50151
$$ 298027 85352 -336336 -460694 -185624 -135954 338755 75814 151588 -59215 -235333 150151
8875D8375c68099a36051m4877E9691g9602k49203D9312J83800f6930j3643E296
$$ 48375 -368099 -136051 -180928 59691 -79602 -328805 49312 233112 -66930 -80573 5296
$$ [...]
##END NTUPLES=NMR SPECTRUM
##END=
