
##TITLE=AC1343_NESKAZ160_6540833_UhumO3AfwI
##JCAMPDX= 6.0         $$ Bruker NMR JCAMP-DX V2.0
##DATA TYPE= NMR SPECTRUM
##DATA CLASS= NTUPLES
##ORIGIN= BRUKER
##OWNER= Administrator
$$ 1.72 TOPSPIN		Version 2.1
$$ 2012-07-18 03:03:11.468 -0500  Administrator@TOPSPIN
$$ Compression mode = diff/dup
##.OBSERVE FREQUENCY= 400.02188249412
##.OBSERVE NUCLEUS= ^1H
##.ACQUISITION MODE= SIMULTANEOUS (DQD)
##.ACQUISITION SCHEME= undefined
##.AVERAGES= 64
##.DIGITISER RES= 22
##SPECTROMETER/DATA SYSTEM= spect
##.PULSE SEQUENCE= noesygpps1d.comp
##.SOLVENT NAME= COFFEE_meoh
##.SHIFT REFERENCE= INTERNAL, COFFEE_meoh, 1, 14.96104
##AUDIT TRAIL= $$ (NUMBER, WHEN, WHO, WHERE, PROCESS, VERSION, WHAT)
$$ ##TITLE= Audit trail, TOPSPIN		Version 2.1
$$ ##JCAMPDX= 5.01
$$ ##ORIGIN= Bruker BioSpin GmbH
$$ ##OWNER= Administrator
$$ $$ C:\Bruker\TOPSPIN/data/COFFEE/nmr/AC1343_NESKAZ160_6540833_UhumO3AfwI/12/pdata/1/auditp.txt
$$ ##AUDIT TRAIL=  $$ (NUMBER, WHEN, WHO, WHERE, PROCESS, VERSION, WHAT)
(   1,<2012-07-18 03:03:06.718 -0500>,<Administrator>,<TOPSPIN>,<go>,<TOPSPIN 2.1>,
      <created by zg
	started at 2012-07-18 02:51:36.515 -0500,
	POWCHK enabled, PULCHK disabled,
       configuration hash MD5:
       6B 1B 68 BB D9 2E 58 E2 7F 35 AD 54 07 DF 0E 41
       data hash MD5: 64K
       4D 0B B5 2C CE A5 97 76 CE 29 1E CD EF D6 80 E0>)
(   2,<2012-07-18 03:03:09.578 -0500>,<Administrator>,<TOPSPIN>,<proc1d>,<TOPSPIN 2.1>,
      <Start of raw data processing
       efp LB = 0.3 FT_mod = 6 PKNL = 1 PHC0 = 0 PHC1 = 0 SI = 128K 
       data hash MD5: 128K
       DE EF D1 F6 41 43 F7 1E 7B 1D 1E 78 3F EE 6C C5>)
(   3,<2012-07-18 03:03:10.671 -0500>,<Administrator>,<TOPSPIN>,<proc1d>,<TOPSPIN 2.1>,
      <pk PHC0 = 3.779297 PHC1 = 0 
       data hash MD5: 128K
       9D B9 F0 38 AB AC 6B 02 E9 25 08 04 F2 F6 6F DF>)
(   4,<2012-07-18 03:03:10.906 -0500>,<Administrator>,<TOPSPIN>,<proc1d>,<TOPSPIN 2.1>,
      <abs ABSG = 1 
       data hash MD5: 128K
       31 C0 9D EF 52 44 8B 56 9D 49 77 61 CD 45 89 1C>)
(   5,<2012-07-18 03:03:10.984 -0500>,<Administrator>,<TOPSPIN>,<proc1d>,<TOPSPIN 2.1>,
      <abs ABSG = 2 
       data hash MD5: 128K
       EE 0B AB 49 2C 61 9A CA B8 F7 0F E5 56 1C 7E 80>)
(   6,<2012-07-18 03:03:11.093 -0500>,<Administrator>,<TOPSPIN>,<proc1d>,<TOPSPIN 2.1>,
      <abs ABSG = 3 
       data hash MD5: 128K
       1D 63 91 A6 9D 3F AE 92 8C BB 8D B1 41 6D 8F E2>)
(   7,<2012-07-18 03:03:11.312 -0500>,<Administrator>,<TOPSPIN>,<proc1d>,<TOPSPIN 2.1>,
      <abs ABSG = 4 
       data hash MD5: 128K
       8B 25 E1 74 3C AC AD 35 68 D7 CA B6 08 8C 22 64>)
(   8,<2012-07-18 03:03:11.359 -0500>,<Administrator>,<TOPSPIN>,<proc1d>,<TOPSPIN 2.1>,
      <abs ABSG = 5 
       data hash MD5: 128K
       E1 17 6C 57 D3 CC 65 54 3D 05 5E 56 51 F7 63 CE>)
$$ ##END=
$$ 
$$ $$ hash MD5
$$ $$ F3 FE 4B 8C 3A 46 9E 4D 50 75 33 47 70 A8 44 32
##$RELAX= 
##$RELAX= 
##$RELAX= 
##$RELAX= 
##$RELAX= 
##$RELAX= 
##$RELAX= 
##$RELAX= 
$$ Bruker specific parameters
$$ [...]
##$TP07= 0
##$TPNAME0= <>
##$TPNAME1= <>
##$TPNAME2= <>
##$TPNAME3= <>
##$TPNAME4= <>
##$TPNAME5= <>
##$TPNAME6= <>
##$TPNAME7= <>
##$TPOAL= (0..7)
0.5 0.5 0.5 0.5 0.5 0.5 0.5 0.5
##$TPOFFS= (0..7)
0 0 0 0 0 0 0 0
##$TUNHIN= 0
##$TUNHOUT= 0
##$TUNXOUT= 0
##$USERA1= <user>
##$USERA2= <user>
##$USERA3= <user>
##$USERA4= <user>
##$USERA5= <user>
##$V9= 5
##$VALIST= <valist>
##$VCLIST= <CCCCCCCCCCCCCCC>
##$VD= 0
##$VDLIST= <DDDDDDDDDDDDDDD>
##$VPLIST= <PPPPPPPPPPPPPPP>
##$VTLIST= <TTTTTTTTTTTTTTT>
##$WBST= 2048
##$WBSW= 25
##$XGAIN= (0..3)
0 0 0 0
##$XL= 0
##$YL= 0
##$YMAX_a= 11995481
##$YMIN_a= -8372165
##$ZGOPTNS= <>
##$ZL1= 120
##$ZL2= 120
##$ZL3= 120
##$ZL4= 120
##$ABSF1= 14.96104
##$ABSF2= -5.597142
##$ABSG= 5
##$ABSL= 3
##$ALPHA= 0
##$AQORDER= 0
##$ASSFAC= 0
##$ASSFACI= 0
##$ASSFACX= 0
##$ASSWID= 0
##$AUNMP= <proc_prof1d_extract.lims>
##$AXLEFT= 0
##$AXNAME= <>
##$AXNUC= <1H>
##$AXRIGHT= 0
##$AXTYPE= 0
##$AXUNIT= <>
##$AZFE= 0.1
##$AZFW= 0.1
##$BCFW= 0
##$BC_mod= 0
##$BYTORDP= 0
##$COROFFS= 0
##$CY= 15
##$DATMOD= 1
##$DC= 0
##$DFILT= <>
##$DTYPP= 0
##$F1P= 0
##$F2P= 0
##$FCOR= 0.5
##$FTSIZE= 131072
##$FT_mod= 6
##$GAMMA= 0
##$GB= 0
##$INTBC= 1
##$INTSCL= 1
##$ISEN= 128
##$LB= 0.3
##$LEV0= 0
##$LPBIN= 0
##$MAXI= 10000
##$MC2= 0
##$MEAN= 0
##$ME_mod= 0
##$MI= 0
##$NCOEF= 0
##$NC_proc= -2
##$NLEV= 6
##$NOISF1= 0
##$NOISF2= 0
##$NSP= 0
##$NTH_PI= 0
##$NZP= 0
##$OFFSET= 14.96104
##$PC= 1
##$PHC0= 3.779297
##$PHC1= 0
##$PH_mod= 1
##$PKNL= yes
##$PPARMOD= 0
##$PPDIAG= 0
##$PPIPTYP= 0
##$PPMPNUM= 2147483647
##$PPRESOL= 1
##$PSCAL= 4
##$PSIGN= 0
##$PYNMP= <proc.py>
##$REVERSE= no
##$SF= 400.020009622519
##$SI= 131072
##$SIGF1= 0
##$SIGF2= 0
##$SINO= 400
##$SIOLD= 131072
##$SPECTYP= <>
##$SREGLST= <1H.CDCl3>
##$SSB= 0
##$STSI= 131072
##$STSR= 0
##$SW_p= 8223.68421052631
##$SYMM= 0
##$S_DEV= 0
##$TDeff= 65536
##$TDoff= 0
##$TI= <>
##$TILT= no
##$TM1= 0
##$TM2= 0
##$TOPLEV= 0
##$USERP1= <user>
##$USERP2= <user>
##$USERP3= <user>
##$USERP4= <user>
##$USERP5= <user>
##$WDW= 1
##$XDIM= 131072
##$YMAX_p= 445922893
##$YMIN_p= -12923
##$CURPLOT= <Network HP LaserJet P1505>
##$CURPRIN= <$Network HP LaserJet P1505>
##$DFORMAT= <normdp>
##$LAYOUT= <+/1D_H.xwp>
##$LFORMAT= <normlp>
##$PFORMAT= <normpl>
##$SURQMSG= 1
$$ End of Bruker specific parameters
$$ ---------------------------------
##NTUPLES= NMR SPECTRUM
##VAR_NAME=  FREQUENCY,     SPECTRUM/REAL,   SPECTRUM/IMAG
##SYMBOL=    X,             R,               I
##VAR_TYPE=  INDEPENDENT,   DEPENDENT,       DEPENDENT
##VAR_FORM=  AFFN,          ASDF,            ASDF
##VAR_DIM=   131072,        131072,          131072
##UNITS=     HZ,            ARBITRARY UNITS, ARBITRARY UNITS
##FACTOR=    0.0627417313425164, 1,          1
##FIRST=     8223.62146879497, -134,         -49169
##LAST=      0,             26,              -49810
##MIN=       0,             -12923,          0
##MAX=       8223.62146879497, 445922893,    0
$$ Real data points
##PAGE= N=1
##DATA TABLE= (X++(R..R)), XYDATA
$$ [...]
63777D46414M96j677m185o544q800j0863j1969j1572j0292r195q507p740o687
63764C48879n549m427l430l001l416m159m478m278l891l350k597k064k191k497
63750B99551k037p49M26P49L83j54m98l70L25J207J728J885K109K450K459K090
63734C11554K041K867M097M698M270L409K884K725K357J563R51J211K183L128
63720C49938L736M282M816M932M553M166M000L639K884K223J921J309k07k046
63706C90146l183l529l720l889l594k792j991j436r65o39p11r09n36N04J423J562
63690C65741J144Q12Q08Q93P22J76m78p74o29o14j276k278k674k021p83L37R96
63673C60102J150Q83N35N68J178K181L329M447N248N407M957M282L660L039K360
$$ y = [446414, 446910, 445233, 441048, 434504, 425704, 414841, 402872, 391300, 381008, 371813, 363306, 355566, 348879, 343330, 338903, 335473, 332472, 329056, 324897, 320419, 316141, 312250, 308900, 306303, 304239, 302048, 299551, 297514, 296765, 297191, 297940, 298323, 298169, 297671, 297301, 297626, 298833, 300561, 302446, 304555, 307005, 309464, 311554, 313595, 316462, 320559, 325257, 329527, 332936, 335820, 338545, 340902, 342465, 343416, 344627, 346810, 349938, 353674, 357956, 362772, 367704, 372257, 376423, 380423, 384062, 386946, 389169, 391090, 392399, 392192, 390146, 386963, 383434, 379714, 375825, 372231, 369439, 367448, 366012, 365047, 364408, 363697, 362788, 362252, 362756, 364179, 365741, 366885, 367697, 368505, 369398, 370120, 370296, 369818, 369044, 368415, 367801, 366525, 364247, 361573, 359552, 358769, 359106, 360102, 361252, 362135, 362670, 363238, 364416, 366597, 369926, 374373, 379621, 385028, 389985, 394267, 397927, 400966, 403326]
63658D03326J732J166L81q95k544m133n262n793n794n432m899m348l776k979j791
63643C58959l88Q14J689K560L559M161L886L235L266M232N306N793N861N848N591
63628D14372M943M351M334M747N002M744M061L339L237M274O144P838Q810R517
63614D89713J0531J1735J2843J4081J5720J7550J9373K1425K3705K5535K6561
63603F88772K7556K9202L0598L0039K7013K2451J7192J1423N604Q14k242l775
63591H84647m276l966l132k404k408l494n781r014j2368j5010j6865j8432j9843
63578G67654k0589k0177j8599j6231j3678j1548r894q113n865l820k781k422j711
63565F32226m14P63J418J891K335K409K080J843J898J934K081L133N296P583R092
$$ y = [403326, 405058, 406224, 406605, 405710, 403166, 399033, 393771, 387978, 382184, 376752, 371853, 367505, 363729, 360750, 358959, 358571, 359385, 361074, 363634, 367193, 371354, 375240, 378475, 381741, 385973, 391279, 397072, 402933, 408781, 414372, 419315, 423666, 428000, 432747, 437749, 442493, 446554, 449893, 453130, 457404, 463548, 471386, 480196, 489713, 500244, 511979, 524822, 538903, 554623, 572173, 591546, 612971, 636676, 662211, 688772, 716328, 745530, 776128, 806167, 833180, 855631, 872823, 884246, 889850, 890664, 888422, 884647, 880371, 876405, 873273, 870869, 868461, 864967, 859186, 850172, 837804, 822794, 805929, 787497, 767654, 747065, 726888, 708289, 692058, 678380, 666832, 656938, 648825, 642960, 639140, 636359, 633937, 632226, 631812, 632575, 633993, 635884, 638219, 640628, 642708, 644551, 646449, 648383, 650464, 653597, 658893, 666476, 675568]
63550F75568J0236J2022J4747J8151K2448K8169L5184M2773N0756N9338O6985
63539A036377O9121O0553M0330J3980r801k5073l1427l1755k8792k4166j9250
63528A050097j5235j2372j0278r131r779j2572j6768k1279k5435k8880l1375l2909
63516H24084l3513l2931l0868k7698k4339k1368j8666j6007j3458j1195r386q304
63504E76351q002p934p482o872o822p283p315o430n206m272l497k687k310k736
63490D97503l352l157k056q78k82j73j30J07N65J115J553J818K106K549K884K707
63474E02879K107J791K432L888N236N648N142M292L319J920J08j426k217k790
63460E32329l888n218n743n152m237l810l931m355m933n331m999l884k680j930
$$ y = [675568, 685804, 697826, 712573, 730724, 753172, 781341, 816525, 859298, 910054, 969392, 1036377, 1105498, 1166051, 1206381, 1220361, 1210560, 1185487, 1154060, 1122305, 1093513, 1069347, 1050097, 1034862, 1022490, 1012212, 1003081, 993302, 980730, 963962, 942683, 917248, 888368, 856993, 824084, 790571, 757640, 726772, 699074, 674735, 653367, 634701, 618694, 605236, 594041, 584655, 576351, 568349, 560415, 552933, 546061, 539239, 531956, 524641, 518211, 513005, 508733, 505236, 502549, 500239, 497503, 494151, 490994, 488938, 488060, 487778, 487605, 487475, 487582, 488147, 489262, 490815, 492633, 494739, 497288, 500172, 502879, 504986, 506777, 509209, 513097, 518333, 523981, 529123, 533415, 536734, 538654, 538762, 537336, 535119, 532329, 528441, 523223, 517480, 512328, 508091, 504281, 500350, 495995, 491062, 485731, 480732, 476848, 474168, 472238]
63446D72238j279l8J874L882N448O460P196Q109R507J1313J3398J6206K0655K7208
63432F02177L5512M5207N6319O7889P6359P6593O5526M4952K0584j689j8644k9648
63420A041137l4945l4859l0303k3021j4783o549J336Q579J4921K0324K4591K6926
63408I93354K6369K2821J7298J1118N138k44m612p345p963o791n155m577n638
63395A033773p883j0846j4604j9073k3458k6902k9293l0828l1250l0228k8183
63384G81225k6001k4021k1889j9379j6741j4332j2332j0750r271p378n034k996
63372F11101j852j102J23J752L014L783M754O294P957R327J0576J2014J3711J5693
63358F97145J8019K0554K3109K5786K8642L1177L2834L3815L4673L5099L3943
$$ y = [472238, 470959, 470921, 472795, 476677, 482125, 488585, 495781, 503890, 513397, 524710, 538108, 554314, 574969, 602177, 637689, 682896, 739215, 807104, 883463, 960056, 1025582, 1070534, 1091118, 1089429, 1070785, 1041137, 1006192, 971333, 941030, 918009, 903226, 896677, 898013, 906592, 921513, 941837, 966428, 993354, 1019723, 1042544, 1059842, 1070960, 1076098, 1075854, 1071242, 1063897, 1055934, 1049143, 1043988, 1039411, 1033773, 1025890, 1015044, 1000440, 981367, 957909, 931007, 901714, 870886, 839636, 809408, 781225, 755224, 731203, 709314, 689935, 673194, 658862, 646530, 635780, 626509, 619131, 614097, 611101, 609249, 608147, 608270, 610022, 613036, 616819, 621573, 627867, 635824, 645151, 655727, 667741, 681452, 697145, 715164, 735718, 758827, 784613, 813255, 844432, 877266, 911081, 945754, 980853, 1014796]
63347A014796L0560K5385J9149J2295N393o56n094p640q254p194n359l975l849
63334A065557n250q328j2876j7888k2213k5703k8883l1497l2307l0645k7341k3796
63322G98830k0661j7568j3624q083q43P619J6820K5686L0814K6948J1664j0506
63310H47096l0618m2474m6056m4401l9750l3512k7457k2767j8933j5132j1828
63299E14168r900r062q412p838p691p666p183o391n807n425n081n146n860o425
63285D16281n834m280k828j984j519j332j555j927j942j670j618j911k126j924
63271C83831j334n91r4k53q80j130n09L57N47L7n16q01r56r52o16j18K19N14J163
63252C77918K076K610K327J464O56M03P08J099J169J065J170J372J212P83P62
$$ y = [1014796, 1045356, 1070741, 1089890, 1102185, 1107578, 1106922, 1101828, 1094188, 1085934, 1078740, 1073381, 1069406, 1065557, 1060307, 1051979, 1039103, 1021215, 999002, 973299, 944416, 912919, 880612, 849967, 822626, 798830, 778169, 760601, 746977, 738894, 738051, 745670, 762490, 788176, 818990, 845938, 857602, 847096, 816478, 774004, 727948, 683547, 643797, 610285, 582828, 560061, 541128, 525996, 514168, 504268, 495206, 486794, 478956, 471265, 463599, 456416, 450025, 444218, 438793, 433712, 428566, 422706, 416281, 410447, 406167, 403339, 401355, 399836, 398504, 396949, 395022, 393080, 391410, 389792, 387881, 385755, 383831, 382497, 381906, 381812, 381559, 380679, 379549, 379040, 379397, 379944, 379981, 379465, 378664, 377708, 376756, 376140, 376022, 376241, 376755, 377918, 379994, 382604, 384931, 386395, 387051, 387454, 388162, 389261, 390430, 391495, 392665, 394037, 395249, 396032, 396794]
63237C96794J363K043K510L143L972M189L426K677L080M337N271N476N522N787
63223D49590O033N992N751N578N772O512P502Q049P885P498P399P519P659P930
63209E46669Q280Q249P655O870N923M183J590o51j618k123l535n744p405p873
63195E60470p681p328o739n851m835l634k101n08P59J921L480N360P109Q749J0617
63180E59788J2442J3524J3838J4215J5181J6292J6789J6426J5467J4355J3431
63169G21748J2746J2039J1054R812Q515P394O678O303N594L869J414r57l468p381
63155G95360j2894j8191k1442k2828k3610k4113k3833k2826k1667k0433j8933
63144E64590j7574j6838j6214j4768j2503j0150p931n680l872l264l602l835l527
$$ y = [396794, 398157, 400200, 402710, 405853, 409825, 414014, 417440, 420117, 423197, 427534, 432805, 438281, 443803, 449590, 455623, 461615, 467366, 472944, 478716, 485228, 492730, 500779, 508664, 516162, 523561, 531080, 538739, 546669, 554949, 563198, 570853, 577723, 583646, 587829, 589419, 588768, 587150, 585027, 581492, 575748, 568343, 560470, 552789, 545461, 538722, 532871, 528036, 524402, 522301, 521793, 522552, 524473, 527953, 533313, 540422, 549171, 559788, 572230, 585754, 599592, 613807, 628988, 645280, 662069, 678495, 693962, 708317, 721748, 734494, 746533, 757587, 767399, 775914, 783308, 789986, 796289, 801883, 805752, 807166, 806209, 802741, 795360, 782466, 764275, 742833, 720005, 696395, 672282, 648449, 625623, 603956, 583523, 564590, 547016, 530178, 513964, 499196, 486693, 476543, 468612, 462932, 459060, 455796, 452194, 448359, 444832]
63131D44832l021k381j354l08L4j49R9J056K018K519K810L069L117L081L320L667
63115D62409L580L180L101L381L489L415L653M056L925L364L330M026M435L877
63101E13221K946K374K041J645J505J986K844L664M475N493O775Q327J0015J1182
63087E78493J1060R706P906O032L763J082j303k931m122n209n951o092n869n585
63073E80980n314n197n414n611n097l921l025k973l196k900k035r56K45J563K715
63058E39864L474L996M512N062N764O927Q613J0410J1856J2834J3446J3858J4296
63045F54912J4839J5257J5427J5766J6727J7984J8705J8617J8206J7909J7713
63034H42062J7545J7455J7444J7597J8158J8953J9084J7940J6108J4385J2351
$$ y = [444832, 441811, 439430, 438076, 437768, 437802, 437653, 437752, 438808, 440826, 443345, 446155, 449224, 452341, 455422, 458742, 462409, 465989, 469169, 472270, 475651, 479140, 482555, 486208, 490264, 494189, 497553, 500883, 504909, 509344, 513221, 516167, 518541, 520582, 522227, 523732, 525718, 528562, 532226, 536701, 542194, 548969, 557296, 567311, 578493, 589553, 599259, 607165, 613197, 616960, 618042, 616739, 613808, 609686, 604477, 598526, 592434, 586565, 580980, 575666, 570469, 565055, 559444, 554347, 550426, 547401, 544428, 541232, 538332, 536297, 535341, 535586, 537149, 539864, 543338, 547334, 551846, 556908, 562672, 569599, 578212, 588622, 600478, 613312, 626758, 640616, 654912, 669751, 685008, 700435, 716201, 732928, 750912, 769617, 788234, 806440, 824349, 842062, 859607, 877062, 894506, 912103, 930261, 949214, 968298, 986238, 1002346, 1016731, 1029082]
63023A029082R037M712O35k844o586j0925j5004j8089k0301k1745k2038k1153
63011I04781j9664j7862j5533j2842j0269p571m017J20L657O374R393J3195J6736
62998H66498J9150K0864K2257K2758K2242K1974K2863K3920K3700K2427K1453
62987A110106K1385K1892K2703K3609K3972K3271K1742J9653J6545J2044O809
62976A323731J705l433r288j5751k2066k7778l2696l6346l8439l9518m0284m0515
62964A019322l9468l7074l4022l0946k8187k5965k4140k2137j9804j7915j7149
62953G22515j7012j6498j5495j4750j4714j5061j5155j4492j2954j1051r569q658
62941E57106p803o929o696p223p535o955o099n672n234m225l300l347l916l949
$$ y = [1029082, 1038119, 1042831, 1043466, 1040622, 1034036, 1023111, 1008107, 990018, 969717, 947972, 925934, 904781, 885117, 867255, 851722, 838880, 828611, 821040, 817023, 817143, 820800, 827174, 836567, 849762, 866498, 885648, 906512, 928769, 951527, 973769, 995743, 1018606, 1042526, 1066226, 1088653, 1110106, 1131491, 1153383, 1176086, 1199695, 1223667, 1246938, 1268680, 1288333, 1304878, 1316922, 1323731, 1325436, 1322003, 1312715, 1296964, 1274898, 1247120, 1214424, 1178078, 1139639, 1100121, 1059837, 1019322, 979854, 942780, 908758, 877812, 849625, 823660, 799520, 777383, 757579, 739664, 722515, 705503, 689005, 673510, 658760, 644046, 628985, 613830, 599338, 586384, 575333, 565764, 557106, 549303, 542374, 535678, 528455, 520920, 513965, 507866, 502194, 496960, 492735, 489435, 486088, 482172, 478223]
62927D78223l489l280l214k618j793j690k195k234j616j321j727j917j204j13
62913D49812N86R13J195J450J728K290L019L366L158K856K677K210J331P83J239
62898D78613K342L260L843M595N691O552O434N141L040P30j167k014j431J46J499
62883E17274J713J211J083J488J500P86L51R67J740J285k94j776k777m035n785
62868E14731p064p038o075n079m437m039l817l827m079m502m855m673l666k259
62854D49321j311j169j368j347j059o96k32M68J295J881J926J458Q07L53K92N75
62838D51194J034J419J489J247J075J252J475J271Q16P49J146J398J324J521K321
62823D70731L175L639M101M876N292M634L349K365J663N39r97k139k456k291j939
$$ y = [478223, 474734, 471454, 468240, 465622, 463829, 462139, 459944, 457710, 456094, 454773, 453046, 451129, 449925, 449812, 450398, 451311, 452506, 453956, 455684, 457974, 460993, 464359, 467517, 470373, 473050, 475260, 476591, 477374, 478613, 480955, 484215, 488058, 492653, 498344, 504896, 511330, 516471, 519511, 520241, 519074, 517060, 515629, 515775, 517274, 518987, 520198, 521281, 522769, 524269, 525055, 525406, 526373, 528113, 529398, 529104, 527328, 524551, 520516, 514731, 507667, 500629, 494554, 489475, 485038, 480999, 477182, 473355, 469276, 464774, 459919, 455246, 451580, 449321, 448010, 446841, 445473, 444126, 443067, 442371, 442139, 442607, 443902, 445783, 447709, 449167, 449974, 450327, 450619, 451194, 452228, 453647, 455136, 456383, 457458, 458710, 460185, 461456, 462272, 463021, 464167, 465565, 466889, 468410, 470731, 473906, 477545, 481646, 486522, 491814, 496448, 499797, 502162, 503825, 504364, 503367, 501228, 498772, 496481, 494542]
62808D94542j321n43J3K63N07Q01Q12L68k43n52j46J203L160M727N098M488L720
62791E16897L147K540J844J505J939L193N014O948Q577J0001J1814J4255J6784
62778F04458J8894K0855K2994K4835K5733K5939K6125K6167K5385K3813K2303
62767H67501K1310K0462J9283J7599J5177J1832P950M223P36l008p208j1547j5797
62754I48513j9942k3672k6479k8283k9334k9595k8836k7287k5522k3843k2325
62743F63395k1213k0440j9155j6757j4106j2585j2088j1224r523p911o885n699
62731E05809l961k598k374k618k373j820j613j557j057k29L71P83J450K282K752
62716D93247K775K791L094L671M564N841P294Q665J0087J1842J3746J5247J6098
$$ y = [494542, 493221, 492678, 492691, 492954, 493461, 494262, 495074, 495442, 495199, 494647, 494501, 495704, 498864, 503591, 508689, 513177, 516897, 520044, 522584, 524428, 525933, 527872, 531065, 536079, 543027, 551604, 561605, 573419, 587674, 604458, 623352, 644207, 667201, 692036, 717769, 743708, 769833, 796000, 821385, 845198, 867501, 888811, 909273, 928556, 946155, 961332, 973164, 981114, 985337, 986073, 983065, 975857, 964310, 948513, 928571, 904899, 878420, 850137, 820803, 791208, 762372, 735085, 709563, 685720, 663395, 642182, 621742, 602587, 585830, 571724, 559139, 547051, 535827, 526304, 518393, 511508, 505809, 501848, 499250, 496876, 494258, 491885, 490065, 488452, 486895, 485838, 485609, 485980, 486763, 488213, 490495, 493247, 496022, 498813, 501907, 505578, 510142, 515983, 523277, 531942, 542029, 553871, 567617, 582864, 598962]
62703E98962J6658J7451J8752K0560K2739K5094K7392K9363L0797L1839L3124
62692H72731L5310L8327M1309M3518M5061M6508M7824M7932M5502M0271L3442
62681A337735K6468J9399J1003P29j0014j9228k6453l2746l8793m3996m7490m9104
62669A127510m9102m7791m5766m3854m2293m0417l7589l4080l0733k8090k6082
62658G01713k4298k2267j9828j7396j5521j4123j2544j0561q817q031q117q469
62646E31741q696q772q683q241p252n790m348l600l634l609k658j031K16P04J109
62631D67456J845K215J402k50j619k205k408k573k447j781r87p45j063j196o42
62616D55002J11K50j15n1P41J322Q59q5l00L87J057J081P03L29O5L8M42J135J808
$$ y = [598962, 615620, 633071, 651823, 672383, 695122, 720216, 747608, 776971, 807768, 839607, 872731, 908041, 946368, 987677, 1031195, 1076256, 1122764, 1170588, 1218520, 1264022, 1304293, 1337735, 1364203, 1383602, 1394605, 1395334, 1385320, 1366092, 1339639, 1306893, 1268100, 1224104, 1176614, 1127510, 1078408, 1030617, 984851, 940997, 898704, 858287, 820698, 786618, 755885, 727795, 701713, 677415, 655148, 635320, 617924, 602403, 588280, 575736, 565175, 556358, 548327, 540210, 531741, 523045, 514273, 505590, 497349, 490097, 484307, 479959, 476359, 472725, 469116, 466458, 465427, 465643, 466347, 467456, 469301, 471516, 472918, 472668, 471049, 468844, 466436, 463863, 461416, 459635, 458648, 457903, 456840, 455644, 455002, 455113, 455363, 455248, 455197, 455938, 457260, 458119, 458034, 457734, 458121, 459178, 460259, 460962, 461291, 461356, 461394, 461836, 462971, 464779]
62597D64779K604L879N325O127O129O144O871Q161R595J1048J2368J3224J3607
62584E69861J3902J4063J3451J1849J0036Q742P534N417K204j263m136o316q208
62571F37136j0112j1854j2982j3316j3281j3409j3629j3404j2518j1328j0212
62560E01091r208q279p429o511n351m187l422k990k448j774j503j911k602l057
62546D40419k978k115m37J330K082J613Q62O64R13J322K134L488M670M719L449
62531D62135J473m36j546j248M01K403L597L683L289L207L805M914O048O957Q040
62516E06722R859J2257J4461J6148J7831J9885K1902K3406K4753K6692K9313L1837
62504G55066L3319L3360L2277L0705K8873K6357K2834J8858J5236J1770P542K597
$$ y = [464779, 467383, 471262, 476587, 482714, 488843, 494987, 501858, 510019, 519614, 530662, 543030, 556254, 569861, 583763, 597826, 611277, 623126, 633162, 641904, 649438, 654855, 657059, 655796, 651660, 645344, 637136, 627024, 615170, 602188, 588872, 575591, 562182, 548553, 535149, 522631, 511303, 501091, 491883, 483604, 476175, 469664, 464313, 460126, 456704, 453714, 451266, 449492, 447989, 446078, 443476, 440419, 437441, 435326, 434889, 436219, 438301, 439914, 440776, 441440, 442353, 443675, 445809, 449297, 453967, 458686, 462135, 463608, 463172, 461626, 460378, 460779, 463182, 466779, 470462, 473751, 476958, 480763, 485677, 491725, 498682, 506722, 516581, 528838, 543299, 559447, 577278, 597163, 619065, 642471, 667224, 693916, 723229, 755066, 788385, 821745, 854022, 884727, 913600, 939957, 962791, 981649, 996885, 1008655, 1016197, 1018794]
62492A018794j548l479l264j874JK119M420P125J0541J4250J7183J8990K0738
62479A103996K3474K6500K7687K5263J9057J0630K683k527n190q177j4438k4155
62467A184803l4719m3132m7959m9570m9340m8601m7711m6075m3365m0276l7639
62456F96416l5177l1858k7413k2838j9309j7023j5203j3013j0387q025o535n687
62444D83948m781l665k777k231j538m79M90J039J447J865J915J543J489K142K600
62429D83007J806J42j125j578j852k245k311j906j725k373l467m106l877l060
62415D55330k078j042P6R91J115K62q44j208p09j13Mj57k77l85m85k98J92N89
62397D50963P41R84J407J616J635K239L751N321O008N950N766N498M993M663M900
$$ y = [1018794, 1017246, 1013767, 1010503, 1008629, 1008630, 1010749, 1015169, 1022294, 1032835, 1047085, 1064268, 1083258, 1103996, 1127470, 1153970, 1181657, 1206920, 1225977, 1236607, 1239290, 1236763, 1231573, 1223396, 1208958, 1184803, 1150084, 1106952, 1058993, 1009423, 960083, 911482, 863771, 817696, 774331, 734055, 696416, 661239, 629381, 601968, 579130, 559821, 542798, 527595, 514582, 504195, 496170, 489635, 483948, 479167, 475502, 472725, 470494, 468956, 468477, 468967, 470006, 471453, 473318, 475233, 476776, 478265, 480407, 483007, 484813, 484955, 483830, 482252, 480400, 478155, 475844, 473938, 472213, 469840, 466373, 462267, 458390, 455330, 453252, 452210, 452286, 453277, 454392, 454654, 453810, 452602, 451893, 451780, 451784, 451627, 451350, 450965, 450480, 450182, 450374, 450963, 451704, 452688, 454095, 455711, 457346, 459585, 463336, 468657, 474665, 480615, 486381, 491879, 496872, 501535, 506435]
62382E06435N235N049M752N246O493P653Q323Q753Q919Q533P924P901Q560R086
62368F08862Q983Q743R017R773J0625J1533J2854J4914J7655K0659K3588K6712
62356G83918L0739L5807M1044M5495M9078N2068N4132N4552N3201N0424M6080
62345A296538L9586L1071K1911J3738P308K309k114o781j2062j7733k3256k8102
62333A322413l1889l4525l6306l7541l7908l6754l4257l1673l0034k9141k8342
62322I54043k7631k7278k6993k6293k5349k4618k3930k2751k1138j9634j8416
62311F90012j7196j5898j4687j3473j1987j0283q609o976n392m226l757l582l134
62298E70812k460j907j327m00O10J199J498J991K591K828K774K931L360L714L936
$$ y = [506435, 511670, 516719, 521471, 526717, 533210, 540863, 549186, 557939, 566858, 575391, 583315, 591216, 599776, 608862, 617845, 626588, 635605, 645378, 656003, 667536, 680390, 695304, 712959, 733618, 757206, 783918, 814657, 850464, 891508, 937003, 986081, 1038149, 1092281, 1146833, 1200034, 1250458, 1296538, 1336124, 1367195, 1389106, 1402844, 1410152, 1412461, 1410347, 1403566, 1391504, 1373771, 1350515, 1322413, 1290524, 1255999, 1219693, 1182152, 1144244, 1107490, 1073233, 1041560, 1011526, 982385, 954043, 926412, 899134, 872141, 845848, 820499, 795881, 771951, 749200, 728062, 708428, 690012, 672816, 656918, 642231, 628758, 616771, 606488, 597879, 590903, 585511, 581285, 577528, 573946, 570812, 568352, 566445, 565118, 564718, 565328, 566527, 568025, 570016, 572607, 575435, 578209, 581140, 584500, 588214, 592150]
62283E92150M091L768K584J205P85J352J744J220K03o98j420j921j840j069k4
62268F02130R73J984L014L936N043O943R645J2368J4615J6931K0250K4828L0086
62255G52746L5188L9622M3509M7376N1513N5556N8679N9873N8004N2363M3661
62244A298090L3795K4101J4538N146k837q615j3614j9946k7551l4545m0047m4791
62232A183724m8915n1243n1292n0180m8665m5909m1161l5473l0503k6607k3137
62221G30639j9945j7550j6180j5448j4682j3214j0862q494p416p768q225p724
62209E83131o697o037n739n347m975m915m764l897k606j820j819j910j478p23
62195E30404k11j4M17J542L027M034M371M879O291Q112R321R785J0090J0302J0062
$$ y = [592150, 596241, 600009, 602593, 603798, 604583, 605935, 607679, 608899, 609102, 608404, 606984, 605063, 603223, 602154, 602130, 603103, 605087, 608101, 612037, 617080, 624023, 633668, 646036, 660651, 677582, 697832, 722660, 752746, 787934, 827556, 871065, 918441, 969954, 1025510, 1084189, 1144062, 1202066, 1254429, 1298090, 1331885, 1355986, 1370524, 1375670, 1372833, 1364218, 1350604, 1330658, 1303107, 1268562, 1228515, 1183724, 1134809, 1083566, 1032274, 982094, 933429, 887520, 846359, 810886, 780383, 753776, 730639, 710694, 693144, 676964, 661516, 646834, 633620, 622758, 614264, 606848, 599080, 590855, 583131, 576434, 570397, 564658, 559311, 554336, 549421, 544657, 540760, 538154, 536334, 534515, 532605, 531127, 530404, 530193, 530179, 530596, 532138, 535165, 539199, 543570, 548449, 554740, 562852, 572173, 581958, 592048, 602350, 612412]
62180F12412R786J0349J1478J1726J0510Q790P281N475L191J725K255M202O364
62167G05544Q778J2100J6001J9637K3184K7400L1920L5414L7384L8515L9049L8077
62155A033003L4741K9307K2655J5580Q782K835k255o948j1452j5620j9653k4151
62143A066824k9131l3517l6125l6828l6364l5286l3505l0770k7215k3373j9801
62132G24909j6766j4208j1984j0055q423o977n534m017k555j375n66M0P45J755
62118F44989L079M618O189P455Q101Q307Q752R889J1480J3123J4950J7210J9368
62105G77510K0202J8737J4804Q924K377k837n043m105j094L110P975J2156J3529
62092H66245J1191O668K473J2n74O71L717P982J2431J6396J9835K2889K5588K7975
$$ y = [612412, 622198, 632547, 644025, 655751, 666261, 675051, 682332, 687807, 690998, 692723, 694978, 699180, 705544, 714322, 726422, 742423, 762060, 785244, 812644, 844564, 879978, 917362, 955877, 994926, 1033003, 1067744, 1097051, 1119706, 1135286, 1144068, 1146903, 1144648, 1137700, 1126248, 1110628, 1090975, 1066824, 1037693, 1004176, 968051, 931223, 894859, 859573, 826068, 795298, 768083, 744710, 724909, 708143, 693935, 681951, 671896, 663473, 656496, 650962, 646945, 644390, 643015, 642449, 642489, 643234, 644989, 648068, 652686, 658875, 666330, 674431, 682738, 691490, 701379, 712859, 725982, 740932, 758142, 777510, 797712, 816449, 831253, 840177, 842554, 839717, 834674, 830569, 829475, 832585, 840560, 852716, 866245, 877436, 884104, 886577, 886589, 886015, 886686, 890403, 898385, 910816, 927212, 947047, 969936, 995524, 1023499]
62078A023499L0138L2133L4015L5820L7396L8414L8665L8095L6600L4097L0844
62067A409716K7259K3424J9213J4980J1438Q778O637N137N028O212P087O176L908
62054A554993J862P00j94j318k341k944l580n017p610j1177j5376j9945k4751
62041A463302k9640l4195l7813m0240m1823m3003m3763m3902m3570m3128m2527
62030A019698m1299l9215l6566l3716l0652k7174k3380j9738j6709j4515j3286
62019G23448j3097j3634j3958j3188j1550j0234r931j0014r571q668p916p234
62007E94453o021m350l009k265j485j74J453L175N230P642R708J0637J0277Q961
61993F34232P102N141L393J697l27k562m457n899p328q918j0256j1095j1630j1839
$$ y = [1023499, 1053637, 1085770, 1119785, 1155605, 1193001, 1231415, 1270080, 1308175, 1344775, 1378872, 1409716, 1436975, 1460399, 1479612, 1494592, 1506030, 1514808, 1521445, 1526582, 1531610, 1537822, 1544909, 1551085, 1554993, 1556855, 1557555, 1557361, 1556043, 1553702, 1550758, 1547178, 1542161, 1534551, 1523374, 1507998, 1488053, 1463302, 1433662, 1399467, 1361654, 1321414, 1279591, 1236588, 1192825, 1148923, 1105353, 1062225, 1019698, 978399, 939184, 902618, 868902, 838250, 811076, 787696, 767958, 751249, 736734, 723448, 710351, 696717, 682759, 669571, 658021, 647787, 637856, 627842, 618271, 609603, 601687, 594453, 588432, 584082, 581073, 578808, 577323, 577149, 578602, 581777, 587007, 594649, 604357, 614994, 625271, 634232, 641334, 646475, 649868, 651565, 651238, 648676, 644219, 638320, 630992, 622074, 611818, 600723, 589093, 577254]
61979E77254j1332j0188r159q598p899o465m522k608r70J20K90k17m63m0L40K9
61963E15572n92r29j117j409j359n82L09N14L14O01J444K059K016J685J609K102
61947E22237L291M966O556P766Q942J0420J1900J3002J4018J5528J7578J9875
61935F56079K2286K4551K5943K5929K4884K3554K2204K0892J9981J9576J8848
61924I04727J6833J3636J0057O386K390j726n355q316j0832j2763j3580j3125
61912H88332j1666r326o121k424J301N148R445J3870J7568K0062K1474K1908K1292
61899I90863J9655J6915J2607O626O9n508r689j3291j6893k0159k2635k4273k4939
61886I09348k4360k2885k1524k0724j9719j7674j4928j2606j1260j0475r612q531
$$ y = [577254, 565922, 555734, 546575, 537977, 530078, 523613, 519091, 516483, 515513, 515633, 515923, 515706, 515243, 515203, 515543, 515572, 514980, 514051, 512934, 511525, 510166, 509584, 509893, 510407, 510721, 511322, 512766, 514825, 516841, 518526, 520135, 522237, 525528, 530494, 537050, 544816, 553758, 564178, 576078, 589080, 603098, 618626, 636204, 656079, 678365, 702916, 728859, 754788, 779672, 803226, 825430, 846322, 866303, 885879, 904727, 921560, 935196, 945253, 951639, 954029, 952303, 946948, 938632, 927800, 915037, 901457, 888332, 876666, 867340, 861219, 858795, 860096, 865244, 874689, 888559, 906127, 926189, 947663, 969571, 990863, 1010518, 1027433, 1040040, 1046666, 1046735, 1041227, 1031538, 1018247, 1001354, 981195, 958560, 934287, 909348, 884988, 862103, 840579, 819855, 800136, 782462, 767534, 754928, 743668, 733193, 723581, 715050]
61874G15050p504o709n958m864l308j633l53L34O75J090J847K934M198N586P158
61859G08543Q819J0224J1299J2551J4411J6422J7818J8802K0366K2808K5439K7994
61847I15496L1158L5142L8771M0871M1647M1763M0840L8030L3552K8325K2433
61836A308028J5118O334k696j0553j6513k0371k2126k2041k0439j7467j3306q345
61824A175623k816L360R834J5420J9076K0818K1023J9423J5633J0113L617l882
61812A307242j2579k1457k8761l3851l7503m0320m1874m1674m0068l7838l5460
61801I35857l2956l0088k6583k2628j8994j6283j4274j2442j0712r162p495n575
61789G28665m008l307k908j946n46O64J865L562N125N243L876K424J781J397N66
$$ y = [715050, 707546, 700837, 694879, 690015, 686707, 685074, 684721, 685055, 685730, 686820, 688667, 691601, 695799, 701385, 708543, 717362, 727586, 738885, 751436, 765847, 782269, 800087, 818889, 839255, 862063, 887502, 915496, 946654, 981796, 1020567, 1061438, 1103085, 1144848, 1185688, 1223718, 1257270, 1285595, 1308028, 1323146, 1329480, 1326784, 1316231, 1299718, 1279347, 1257221, 1235180, 1214741, 1197274, 1183968, 1175623, 1172807, 1176167, 1186001, 1201421, 1220497, 1241315, 1262338, 1281761, 1297394, 1307507, 1311124, 1307242, 1294663, 1273206, 1244445, 1210594, 1173091, 1132771, 1090897, 1049223, 1009155, 971317, 935857, 902901, 872813, 846230, 823602, 804608, 788325, 774051, 761609, 750897, 741735, 734240, 728665, 724657, 721350, 718442, 716496, 715950, 716614, 718479, 722041, 727166, 732409, 736285, 738709, 740490, 741887, 742453]
61774G42453m57j039j013n90q4Q0k84p85j033j392k407l763m723n313o000o492
61758G07158o068m897l740k474m06J977L200L004K818L516M286M289M012M106
61744G20781M190L714L067K924L312L949M730N319N221M726M823N597N818M782
61730G82953L523L374M257N201N657N457M464L074K263K225J894O84k76K60J673
61715H26683K395K087J526R74L9j066j587j610k130l624n459o867p666p938p808
61700G87949p622p648p505o558m977l713l301l360l400l486l786m003l778l269
61686G21543k986l116l343l330l138l044l078k970k593k163j879j585j173j026
61672F86119j573k509k974k601j791j000l16J59J89p3m6M65R70J096J202J796
$$ y = [742453, 741996, 740957, 739944, 739354, 739270, 739350, 739066, 738281, 737248, 735856, 733449, 729686, 724963, 719650, 713650, 707158, 701090, 696193, 692453, 689979, 689573, 691550, 694750, 697754, 700572, 704088, 708374, 712663, 716675, 720781, 724971, 728685, 731752, 734676, 737988, 741937, 746667, 751986, 757207, 761933, 766756, 772353, 778171, 782953, 786476, 789850, 794107, 799308, 804965, 810422, 814886, 817960, 820223, 822448, 824342, 825026, 824750, 825010, 826683, 829078, 831165, 832691, 833665, 833704, 832638, 831051, 829441, 827311, 823687, 818228, 811361, 803695, 795757, 787949, 780327, 772679, 765174, 758616, 753639, 749926, 746625, 743265, 739865, 736379, 732593, 728590, 724812, 721543, 718557, 715441, 712098, 708768, 705630, 702586, 699508, 696538, 693945, 691782, 689903, 688318, 687145, 686119, 684546, 682037, 679063, 676462, 674671, 673671, 673355, 673514, 673703, 673630, 673584, 674049, 675019, 676115, 677317, 679113]
61656F79113K740L510L915M229M783N657O637P437Q074Q978J0369J1748J2514
61643G69704J2853J3307J3596J2811J0841Q622O767M947K958J366M80l44j699
61630H56209l205m333n377o740p931q252q078q427r445j0186r882q676p148n656
61616G52873m317l086j812m94M91O00l86k194m233n941p153q186r346j0382j0751
61601F85683j0331r447q350p200o422o311o339n723m645m052m080l838l020k572
61587F03353l214m349n132n627o076o003n016l818l394l714m072m264m571m978
61573E39125n215n242n051m426l455k812k862l059k830k471k390k234j627j118
61559D94333j320j655j182j69K85j5k96k62m02q28j010q39q68j284j552j382j192
$$ y = [679113, 681853, 685363, 689278, 693507, 698290, 703947, 710584, 718021, 726095, 735073, 745442, 757190, 769704, 782557, 795864, 809460, 822271, 833112, 841734, 848501, 853448, 856406, 857772, 858252, 857908, 856209, 853004, 848671, 843294, 836554, 828623, 820371, 812293, 803866, 794421, 784235, 774353, 765677, 758529, 752873, 748556, 745470, 743658, 743164, 743655, 744255, 743869, 741675, 737442, 731501, 724348, 716162, 706816, 696434, 685683, 675352, 665905, 657555, 650355, 643933, 637622, 631283, 625560, 620915, 616863, 612783, 608945, 605925, 603353, 600139, 595790, 590658, 585031, 578955, 572952, 567936, 564118, 560724, 557010, 552938, 548674, 544103, 539125, 533910, 528668, 523617, 519191, 515736, 512924, 510062, 507003, 504173, 501702, 499312, 497078, 495451, 494333, 493013, 491358, 490176, 490007, 490292, 490277, 489981, 489719, 489317, 488489, 487479, 486640, 485772, 484488, 482936, 481554, 480362]
61542D80362j223j011j95P31J038P60O78J390K616L465L358K734K558L041L311
61527E03613K542R79o31k050l363m231m175l394k583k018j497r76o54m78k38o5
61511D80781k16m74l82n9j51r38j979k672k660j896p68o6k29p87r72p04l72J6
61493D65472P15J401J417P83K79L20M80K11n18j406k052j998j113L0P26R54J094
61476D66795R86J99q39j010o5Q84Q63K38r2J9J50J94L58N47L85k23r71j553j873
61457D64992j926j767j507j275j128j148j395j678j580r01N7P98J134J204J139
61442D55019Q85M64J96M67J306K325L250M227N393O311O292N254L877K830K332
61427E00428K369K794L014K330R19j06j3O97J217J507J899K248K280K310K713
$$ y = [480362, 479139, 478128, 477933, 478664, 479702, 480462, 481140, 482530, 485146, 488611, 491969, 494703, 497261, 500302, 503613, 506155, 507134, 506503, 504453, 501090, 496859, 492684, 489290, 486707, 484689, 483192, 482216, 481562, 481084, 480846, 480781, 480565, 480091, 479709, 479650, 479499, 478561, 476582, 473910, 471250, 469354, 468586, 468520, 468291, 467504, 466532, 465828, 465456, 465472, 466187, 467588, 469005, 469788, 470067, 470387, 470867, 471078, 470560, 469154, 467102, 465104, 463991, 464021, 464747, 465701, 466795, 467781, 467980, 467141, 466131, 466066, 466950, 467813, 468051, 467959, 467978, 468128, 468322, 468680, 469227, 469612, 469389, 468418, 466865, 464992, 463066, 461299, 459792, 458517, 457389, 456241, 454846, 453168, 451588, 450687, 450744, 451542, 452676, 453880, 455019, 455904, 456368, 456564, 457031, 458337, 460662, 463912, 468139, 473532, 479843, 486135, 491389, 495266, 498096, 500428, 502797, 505591, 508605, 510935, 511854, 511748, 511735, 512432, 513649, 515156, 517055, 519303, 521583, 523893, 526606]
61412E26606L055K637J696J049P53O0j213k252k486k433k851l696m332m376l950
61397E08267l371k902k684k716k924l187l192k546j303j51L12K69K35J92k03p84
61381D83312r55o70n62r49j311j013j00Q69J447J552J427J478J900K373K396J937
61365D93131J466J327J371J270Q87L50RK99J331K680L797M570N138N396N130M594
61349E32746M406M814N487O114O814P883R403J1220J2986J4242J4721J4652J4448
61336F59936J4138J3328J1688R291O476L602Q36j910m639o783p567p171o882p530
61322F76813q243p672o043m878m774m655l543k039j348j590j867j646j305j348
61308F25862j697j854j451n36O30J851L141M543N933P145Q200R321J0632J1961
$$ y = [526606, 529661, 532298, 533994, 535043, 535796, 535856, 534643, 532391, 529905, 527472, 524621, 520925, 516593, 512217, 508267, 504896, 501994, 499310, 496594, 493670, 490483, 487291, 484745, 483442, 483291, 483603, 483872, 484107, 484299, 484096, 483312, 482357, 481687, 481125, 480176, 478865, 477852, 477752, 478621, 480068, 481620, 483047, 484525, 486425, 488798, 491194, 493131, 494597, 495924, 497295, 498565, 499452, 499802, 499811, 500110, 501441, 504121, 507918, 512488, 517626, 523022, 528152, 532746, 537152, 541966, 547453, 553567, 560381, 568264, 577667, 588887, 601873, 616115, 630836, 645488, 659936, 674074, 687402, 699090, 708381, 714857, 718459, 719295, 717385, 712746, 705963, 698396, 691225, 684343, 676813, 668570, 660898, 654855, 649977, 645203, 640548, 637005, 634966, 633618, 632028, 630161, 628515, 627210, 625862, 624165, 622311, 620860, 620324, 620954, 622805, 625946, 630489, 636422, 643567, 651767, 661088, 671720, 683681]
61294F83681J2893J3027J2214J0642Q548N924K693p94l850o066p551q429q571
61281G14361q048p355o758n904m500k974j918j172j40J282K617L540M134M427
61267F91592M309L943L806M212N022N895O617P229P949Q827R545R837J0131J1092
61253G90006J2520J3477J3816J4619J6474J8196J8239J6537J3925J0407N425n06
61241I43135n912j0093j3503j6265j7677j7489j6534j5609j4591j3165j1588j0185
61229G80524q707o746m368j980K8J343J893K144K714L563M203M773O101Q385J0603
61214H04473J1670J1577J0856R582P589N238L258J975J219Q78J033J596K269K930
61200H76143L754M882O191P495Q868J0675J3183J6213J9278K2068K4649K7085
$$ y = [683681, 696574, 709601, 721815, 732457, 741005, 746929, 749622, 748828, 744978, 738912, 731361, 722932, 714361, 706313, 698958, 692200, 686296, 681796, 678822, 676904, 675732, 675592, 676874, 679491, 683031, 687165, 691592, 695901, 699844, 703650, 707862, 712884, 718779, 725396, 732625, 740574, 749401, 758946, 768783, 778914, 790006, 802526, 816003, 829819, 844438, 860912, 879108, 897347, 913884, 927809, 938216, 943641, 943135, 937223, 927130, 913627, 897362, 879685, 862196, 845662, 830053, 815462, 802297, 790709, 780524, 771817, 765071, 760703, 758723, 758751, 760094, 761987, 764131, 766845, 770408, 774611, 779384, 785485, 793870, 804473, 816143, 827720, 838576, 848158, 855747, 860985, 864243, 866218, 867437, 868315, 869348, 870944, 873213, 876143, 879897, 884779, 890970, 898465, 907333, 918008, 931191, 947404, 966682, 988750, 1013399, 1040484]
61188A040484K9119L0479L1366L2325L3669L5123L6030L5831L4505L2467K9808
61177A401206K5897K0368J4476J0365Q577P187M241J51l313n707q242j1767j5891
61164A447548k0081k4303k8245l1161l2989l4636l6544l7840l7526l5837l3743
61153A094643l1697k9550k7212k4690k1730j8173j4563j1775j0019q632o904m751
61141H84947k493l44J715L710N576P182Q223Q189O709M171J722L93L07J033K515
61126I33555N029Q342J1637J4625J7989K2296K6937L0832L3806L6622L9816M3122
61114A224608M6007M8246M9877N1047N1952N2707N3167N2953N1643M8957M4979
61103A776143M0276L5496L0804K5970K1003J6186J1415O184M74n002r823j4619
$$ y = [1040484, 1069603, 1100082, 1131448, 1163773, 1197442, 1232565, 1268595, 1304426, 1338931, 1371398, 1401206, 1427103, 1447471, 1461947, 1472312, 1480889, 1488076, 1492317, 1492468, 1489155, 1483448, 1475206, 1463439, 1447548, 1427467, 1403164, 1374919, 1343758, 1310769, 1276133, 1239589, 1201749, 1164223, 1128386, 1094643, 1062946, 1033396, 1006184, 981494, 959764, 941591, 927028, 915253, 905234, 896602, 889698, 884947, 882454, 882110, 883825, 887535, 893111, 900293, 908516, 916705, 923414, 927585, 929307, 929700, 930007, 931040, 933555, 938584, 946926, 958563, 973188, 991177, 1013473, 1040410, 1071242, 1105048, 1141670, 1181486, 1224608, 1270615, 1318861, 1368738, 1419785, 1471737, 1524444, 1577611, 1630564, 1682207, 1731164, 1776143, 1816419, 1851915, 1882719, 1908689, 1929692, 1945878, 1957293, 1963477, 1963951, 1958949, 1949126, 1934507]
61091A934507k0249k6708l3250l9211m4320m8570n2139n5119n7040n7219n5800
61080A444882n3811n1804m9179m5335m0817l6646l3147l0078k7354k4867k2064
61069A029780j8526j4692j1420r002p148n595m306l266k466j867j181p6J314K535
61055I54084L624N073O991Q977J0894J2917J4785J6054J7203J9294K2308K5050
61043A117254K7033K9149L1991L4868L7031L8655M0107M1378M2653M4100M4922
61032A529141M4134M2506M1982M2825M3259M2399M1349M0928M0551M0083M0360
61021A989517M1107M0907M0040M0633M2984M4691M4456M3584M2719M0935L9585
61010B451158M2821N2116O4383P7640R3820J13250J31673J46572J61484J80320
$$ y = [1934507, 1914258, 1887550, 1854300, 1815089, 1770769, 1722199, 1670060, 1614941, 1557901, 1500682, 1444882, 1391071, 1339267, 1290088, 1244753, 1203936, 1167290, 1134143, 1104065, 1076711, 1051844, 1029780, 1011254, 996562, 985142, 976140, 968992, 963397, 959091, 955825, 953359, 951492, 950311, 950235, 951549, 954084, 957708, 962781, 969772, 978749, 989643, 1002560, 1017345, 1033399, 1050602, 1069896, 1092204, 1117254, 1144287, 1173436, 1205427, 1240295, 1277326, 1315981, 1356088, 1397466, 1440119, 1484219, 1529141, 1573275, 1615781, 1657763, 1700588, 1743847, 1786246, 1827595, 1868523, 1909074, 1949157, 1989517, 2030624, 2071531, 2111571, 2152204, 2195188, 2239879, 2284335, 2327919, 2370638, 2411573, 2451158, 2493979, 2546095, 2610478, 2688118, 2781938, 2895188, 3026861, 3173433, 3334917, 3515237]
61000C515237K03258K32846K77323L41539M21110N12789O23257P59291R19339
60991G805989J108350J351539J674846K078490K548545L072910L586372L884002
60983B7111043L666610K776376J415198P6691p86226j030887p86706k38300M63796
60974C2667595J098491J320025Q43846k85301j662353k796158l418528l553437
60966B4214180l365885l007492k580343k159207j791249j485397j229311j015633
60958G579663q42831p02673n83810m84013m06881l49545l03634k65429k35726
60949C405121k12013j89589j68625j52250j38965j24290j08497r5538q5606p5797
60939B053951o7168o3967o6068o8703o9631p0456p1022o8754o4046o0338n8233
$$ y = [3515237, 3718495, 3951341, 4228664, 4570203, 4991313, 5504102, 6127359, 6886650, 7805989, 8914339, 10265878, 11940724, 14019214, 16567759, 19640669, 23227041, 27111043, 30777653, 33554029, 34969227, 35045918, 34259692, 33228805, 32442099, 32203799, 32667595, 33766086, 35086111, 35929957, 35644656, 33982303, 31186145, 27767617, 24214180, 20848295, 17840803, 15260460, 13101253, 11310004, 9824607, 8595296, 7579663, 6736832, 6034159, 5450349, 4966336, 4559455, 4209910, 3906276, 3640847, 3405121, 3193108, 3003519, 2834894, 2682644, 2543679, 2419389, 2310892, 2215354, 2129748, 2053951, 1986783, 1922816, 1856748, 1788045, 1718414, 1647958, 1576936, 1508182, 1444136, 1383798, 1325565]
60928A325565n4825m9541m5261m2885l9965l5674l2331l0809k8988k5949k3460
60917I15877k2199k0530j8041j6351j5542j3673j0778r392j0028j0025q042n943
60905G55333n024m031k330j489k252l126l311l992n461o052n296n079o377p633
60891F93880p644p239o971n984m347l688m298m304k964j955k227k386j589j161
60877F37123j865k172r11P72J701K539L844M467L610K442K156K214J850J566J844
60862F61180K086J876J692J499M62j159j868j396j266k082k472j680r59j354k225
60847F52334k977m088n341n301l698k196j646q42P97J647M40j689l245m490n948
60832F13757o719n964m482l337k285q43N92J816L514N767P398P849Q099Q809R180
$$ y = [1325565, 1270740, 1221199, 1175938, 1133053, 1093088, 1057414, 1025083, 994274, 965286, 939337, 915877, 893678, 873148, 855107, 838756, 823214, 809541, 798763, 789371, 779343, 769318, 761276, 755333, 750309, 746278, 743948, 742459, 740207, 737081, 733770, 729778, 724317, 718265, 712969, 707890, 701513, 693880, 686236, 678997, 672026, 666042, 661695, 658007, 653709, 649405, 646441, 644486, 642259, 639873, 638284, 637123, 635258, 633086, 632175, 632947, 634648, 637187, 641031, 645498, 649108, 651550, 653706, 655920, 657770, 659336, 661180, 663266, 665142, 666834, 668333, 668795, 667636, 665768, 664372, 663106, 661024, 658552, 656872, 655913, 654559, 652334, 649357, 645269, 639928, 634627, 630929, 628733, 627087, 626245, 627042, 628689, 629129, 627440, 624195, 619705, 613757, 607038, 601074, 596592, 593255, 590970, 590127, 590719, 592535, 596049, 601816, 609214, 617063, 625162, 633971, 643151]
60817F43151Q627P781O980N574L771L142M138M992M287K800J699Q16m3j07P23
60802F98331J088L77j35K97K99j315l467m651n151n880o597o895p481q874j0152
60787F39794j0379r997r663r069q117p686q068q169p346o484o172n587m319l426
60773E35312l507l538k866k423k700k576j531q39j049n83J391L000K657J847K633
60758E25228M265M798M347M357M978N589O598Q384R689R356Q504Q784R636R544
60744F24057Q963R536J1201J2323J2087J0783Q472N317K511J006j7j661l274l603
60730F97701l046k812k784k175j464j695k564l125l572m528n386n323n162o196
60716F47869p890q749q768r012r429r069q059p347o942o182n380n315n569n064
$$ y = [643151, 651778, 659559, 666539, 672113, 675884, 679026, 683164, 688156, 692443, 695243, 696942, 697758, 697715, 697608, 698331, 699419, 699796, 699661, 699958, 700257, 698942, 695475, 690824, 685673, 679793, 673196, 666301, 658820, 649946, 639794, 629415, 619418, 609755, 600686, 592569, 584883, 576815, 568646, 561300, 554816, 548644, 543057, 538738, 535312, 531805, 528267, 525401, 522978, 520278, 517702, 516171, 515332, 514283, 513700, 515091, 518091, 520748, 522595, 525228, 529493, 534291, 538638, 542995, 547973, 553562, 560160, 568544, 578233, 587589, 596093, 604877, 614513, 624057, 633020, 642556, 653757, 666080, 678167, 688950, 697422, 702739, 705250, 706256, 706239, 704578, 701304, 697701, 694655, 691843, 689059, 686884, 685420, 683725, 681161, 678036, 674464, 669936, 664550, 659227, 654065, 647869, 639979, 631230, 622462, 613450, 604021, 594952, 586893, 579546, 572604, 566422, 561042, 555727, 550158, 545094]
60702E45094l865k854k162j457j171j718k183j475j06P97J488K773M115M551M746
60687E46573N984P700Q252P706P656Q510R101Q892Q552Q347P856P231O996O647
60673F56003N161K779O46j111l297n815p654q575r173r426q768p487o490n868
60659E90925n154m670m961n295m434k654j324p60j97M83Q00J157K359L857M333
60644E74465L935L978M501M195K798J621J333J074K07o48p90k59Q47K481L976
60629F03714M511M407M732N625O341O749P363P974P873P356P468Q156Q324P782
60615F98375P620Q421R528J0360J1053J1662J1976J2282J3099J4180J4875J5329
60603H38760J5998J6318J5357J3559J2238J1466J0086P832N761M578M115M473
$$ y = [545094, 541229, 538375, 536213, 534756, 533585, 531867, 529684, 528209, 528103, 528900, 530388, 533161, 537276, 541827, 546573, 552557, 560257, 568509, 576215, 583871, 592381, 601482, 610374, 618926, 627273, 635129, 642360, 649356, 656003, 661164, 663943, 664589, 663478, 660181, 654366, 646712, 638137, 628964, 619538, 610770, 603283, 596793, 590925, 585771, 581101, 576140, 570845, 566411, 563757, 562433, 561673, 561476, 561959, 562759, 563916, 566275, 570132, 574465, 578400, 582378, 586879, 591074, 593872, 595493, 596826, 597900, 598107, 597459, 596669, 596410, 597257, 599738, 603714, 608225, 612632, 617364, 622989, 629330, 636079, 643442, 651416, 659289, 666645, 674113, 682269, 690593, 698375, 705995, 714416, 723944, 734304, 745357, 757019, 768995, 781277, 794376, 808556, 823431, 838760, 854758, 871076, 886433, 899992, 912230, 923696, 933782, 941614, 947375, 951953, 956068, 960541]
60591I60541N966P901R071R671J1083J3598J6023J7741J9466K1616K3671K5546
60579A141894K7894L0552L2231L2389L2022L1920L1417K9530K6246K2159J7772
60568A456026J3546R705N792J322l042o107p867r384j0921j1601j1152j0647j1194
60555A404476j2968j5803j9569k3668k7213k9961l2184l3655l3710l2267k9739
60544A113739k6203k1813j7688j4909j2831r875n888k186O22L205N807P712Q610
60531A028302Q915Q396O053J792l143p727j1852j5200j6781j6092j3727j0578
60519I58358p419n120m042l309j910l71N8l58q2J364K983M215N448O553O747O196
60503I69311O002O324O201N544N542O826Q969J2117J7228K4137L1302L8087M5532
$$ y = [960541, 966507, 974408, 983479, 993150, 1004233, 1017831, 1033854, 1051595, 1071061, 1092677, 1116348, 1141894, 1169788, 1200340, 1232571, 1264960, 1296982, 1328902, 1360319, 1389849, 1416095, 1438254, 1456026, 1469572, 1479277, 1485069, 1486391, 1483349, 1477242, 1469375, 1459991, 1449070, 1437469, 1426317, 1415670, 1404476, 1391508, 1375705, 1356136, 1332468, 1305255, 1275294, 1243110, 1209455, 1175745, 1143478, 1113739, 1087536, 1065723, 1048035, 1033126, 1020295, 1010420, 1004532, 1002346, 1002968, 1006173, 1011980, 1019692, 1028302, 1037217, 1045613, 1051666, 1053458, 1050315, 1042588, 1030736, 1015536, 998755, 982663, 968936, 958358, 950939, 945819, 941777, 938468, 936558, 936187, 936245, 935887, 935805, 937169, 940152, 944367, 949815, 956368, 963115, 969311, 975313, 981637, 987838, 993382, 998924, 1005750, 1014719, 1026836, 1044064, 1068201, 1099503, 1137590, 1183122]
60490A183122N4163O2728O9834P5084P7620P5173O5927N0427L0768Q840j3978
60479A739708l6286n6524p2813q3059q6320q4116p9198p3026o5643n7661n0444
60468I94618m4214l7927l1454k6158k2794k0531j8527j6862j5511j4002j2539
60457G34099j1813j1396j0028p872o528o347n850m448l623m409n632n839n289
60444F45025m857m508l923l381l031k536k073k410l341l643l066k746l068k969
60430E99473k061j467j677j585p28m41j520k614k367j462j032p26J64J078J231
60415E84266R91Q43K86q93j544p53P22J778K485K988K512R11k03M49J788K086
60399E98712J510J293J426J095N66Q22J728K202J830J127N01J58M52J315J864
$$ y = [1183122, 1237285, 1300013, 1369847, 1444931, 1522551, 1597724, 1663651, 1714078, 1744846, 1753686, 1739708, 1703422, 1646898, 1574085, 1491026, 1404706, 1320590, 1241392, 1168366, 1102723, 1045062, 994618, 950404, 912477, 881023, 854865, 832071, 811540, 793013, 776151, 760640, 746638, 734099, 722286, 710890, 700862, 692990, 686462, 680115, 674265, 669817, 666194, 661785, 656153, 650314, 645025, 640168, 635660, 631737, 628356, 625325, 622789, 620716, 618306, 614965, 611322, 608256, 605510, 602442, 599473, 597412, 595945, 594268, 592683, 591955, 591514, 589994, 587380, 585013, 583551, 582519, 581793, 581957, 583035, 584266, 585257, 586100, 586386, 585493, 583949, 583196, 583918, 585696, 588181, 591169, 593681, 594592, 594389, 594838, 596626, 598712, 600222, 601515, 602941, 604036, 604602, 605424, 607152, 609354, 611184, 612311, 612812, 612970, 613422, 614737, 616601]
60384F16601J536R87R62J021M80k11j23O69J301J353J031O47N95J230K173K426
60368F32678J719R23O05K93l44p40n71m31o11m20M41J059P97L83O08J069J117
60351F38575Q77N07l12j274j228k1Q99P09N73J546K719K884K615L066L864L932
60335F59931L382L104L185L147K991K818K244J294Q61J270J446O35l61p35j108
60320F84104j974k209p90J264K354K593K918L057K308J451J983M009O511Q972
60306G16551J1236J2673J3211J4484J8100K3469K9086L5226M3198N1997N7715
60295A026946N6666M8091L3928J7072j35j6589l1592m3339m9350m9132m5128l9962
60283I07476l4083k7283k0922j6696j4298j2212j0105q636p713o740o026o140
$$ y = [616601, 618137, 619124, 620086, 621107, 621587, 621376, 621253, 621922, 623223, 624576, 625607, 626254, 626849, 628079, 630252, 632678, 634397, 635320, 635925, 636218, 635874, 635134, 634563, 634132, 633521, 633101, 633542, 634601, 635398, 635781, 636389, 637458, 638575, 639452, 639959, 639647, 638373, 637145, 637124, 638023, 638732, 639305, 640851, 643570, 646454, 649069, 652135, 655999, 659931, 663313, 666417, 669602, 672749, 675740, 678558, 680802, 682096, 682957, 684227, 685673, 686308, 685947, 685212, 684104, 682130, 679921, 679131, 680395, 682749, 685342, 688260, 691317, 693625, 695076, 697059, 701068, 707579, 716551, 727787, 740460, 753671, 768155, 786255, 809724, 838810, 874036, 917234, 969231, 1026946, 1083612, 1131703, 1165631, 1182703, 1182568, 1165979, 1134387, 1091048, 1041698, 992566, 947438, 907476, 873393, 846110, 825188, 808492, 794194, 781982, 771877, 763241, 755528, 748788, 742762, 736622]
60271G36622o375n534l821k392j566r53p57j367k129k136j753j922k421k303j575
60256F99618j004p61n90p06j185j211l17M44Q0n78l28K46n7o88l03O35N14o40
60238F93169j275r42o37o53j74R23J821K399L262M205M368L982M151M834M839
60223G24272L921L190L186L179K709K310K417K777L121L308K923J919J443K620
60209G63295M700N829N579N199N526O071O241N997N268L980K656J835J109p1j056
60194H22158q04K57P18K34l94r19j815k887l301l013k769k798k778k837l269l487
60178G92296k757j657j287j444j088k82J2j79M1O32P18L91O30J453J871J711J784
60161G92845K220K336K135K267K483J898Q20N32J103J257O25L77J158K169K734
$$ y = [736622, 730247, 724713, 720892, 718500, 716934, 715981, 715224, 713857, 711728, 709592, 707839, 705917, 703496, 701193, 699618, 698614, 697853, 697263, 696557, 695372, 694161, 693844, 694288, 694368, 693790, 693462, 693708, 693651, 692963, 692660, 693295, 693809, 693169, 691894, 690952, 690315, 689662, 689488, 690411, 692232, 694631, 697893, 702098, 706466, 710448, 714599, 719433, 724272, 728193, 731383, 734569, 737748, 740457, 742767, 745184, 747961, 751082, 754390, 757313, 759232, 760675, 763295, 767995, 773824, 779403, 784602, 790128, 796199, 802440, 808437, 813705, 817685, 820341, 822176, 823285, 823214, 822158, 821354, 821611, 822329, 822563, 822169, 821250, 819435, 816548, 813247, 810234, 807465, 804667, 801889, 799052, 795783, 792296, 789539, 787882, 786595, 785151, 784063, 783781, 783793, 783614, 783655, 784287, 785005, 785396, 786026, 787479, 789350, 791061, 792845, 795065, 797401, 799536, 801803, 804286, 806184, 807004, 807536, 808639, 809896, 810521, 810898, 812056, 814225, 816959]
60146H16959L247L994M440M325M311N055O457Q058R401J0038J0087J0486J1872
60133I08730J3645J5096J6533J8010J8012J5261J0974P228L779j114p123j1742
60121A007289j3644j3746j2774j0372p061m689m090m123l707l079k570j892j160
60108I24382j011j337j391j278j733k386k122j202j036j726j949j478j558k425
60094I01750k780k219j910k141j485O49K859M087N127O747Q259R117J0145J1887
60080I50092J3280J3164J1830J0130Q241O049L496Qn027j0637j4699j6490j7243
60067I52194j7748j7291j5608j3887j2852j1620r565p636o842o855p078p571q080
60054H09561p704o460n664n825n788m782l695l251k592r18R94K169K927L856M591
$$ y = [816959, 820206, 824200, 828640, 832965, 837276, 842331, 848788, 856846, 866247, 876285, 886372, 896858, 908730, 922375, 937471, 954004, 972014, 990026, 1005287, 1016261, 1023489, 1027268, 1026154, 1019031, 1007289, 993645, 979899, 967125, 956753, 949692, 945003, 940913, 936790, 933083, 930004, 927434, 925542, 924382, 923371, 922034, 920643, 919365, 917632, 915246, 913124, 911922, 910886, 909160, 907211, 905733, 904175, 901750, 898970, 896751, 894841, 892700, 891215, 891864, 894723, 898810, 903937, 910684, 918943, 928060, 938205, 950092, 963372, 976536, 988366, 998496, 1006737, 1012786, 1016282, 1016290, 1011263, 1000626, 985927, 969437, 952194, 934446, 917155, 901547, 887660, 874808, 863188, 853623, 845987, 839145, 832290, 825212, 817641, 809561, 801857, 795397, 789733, 783908, 778120, 773338, 769643, 766392, 763800, 762882, 763876, 766045, 768972, 772828, 777419]
60039G77419M846N412O868Q368Q858Q482P802O642M685K294l1k124l525l612k985
60024H29399l375n455p966r754j1201j2898j4327j4846j4722j4248j3103j1463
60012F96041j0411j0304r989q574o748n443m448l286k262j690j161m75k12n86
59998F30452q46n54k88l78j86O28J392J690K097K928L614L904M354M969M868M012
59982F62656L635M168M351L338K013J275N98o50j924k694l397m144m053k918k045
59967F60209k216k368j506m19j34j03O04J549J784J341O92j95j117j137qJ039
59951F58015R47K01l80q94j459j457o79RJ57M89J266J495O71k41o14j216k329
59934F53981k742j854j042j349j665q10L18M44J51N94J337J386J041J061J061
$$ y = [777419, 782265, 787677, 794545, 802913, 811771, 820253, 828055, 834697, 839382, 841676, 841645, 839521, 835996, 832384, 829399, 826024, 820569, 812603, 802849, 791648, 778750, 764423, 749577, 734855, 720607, 707504, 696041, 685630, 675326, 665337, 656763, 650015, 644572, 640124, 636838, 634576, 632886, 631725, 631250, 631038, 630452, 629606, 629052, 628764, 628386, 628200, 628828, 630220, 631910, 634007, 636935, 640549, 644453, 648807, 653776, 658644, 662656, 666291, 670459, 674810, 678148, 680161, 681436, 682034, 681384, 679460, 676766, 673369, 669225, 665172, 662254, 660209, 657993, 655625, 654119, 653700, 653566, 653463, 654067, 655616, 657400, 658741, 659433, 659238, 658121, 656984, 656976, 658015, 658962, 659163, 658783, 657889, 656430, 654973, 654294, 654303, 654460, 654949, 656215, 657710, 658381, 658140, 657526, 656310, 653981, 651239, 649385, 648343, 646994, 645329, 644519, 644837, 645281, 645432, 646026, 647363, 648749, 649790, 650851, 651912]
59919F51912N37K06P51J442J586K010L442M731M556L616L378L705L586L085K834
59904F91377K581J915J386J410J242N21M25J556K309J282j68L8J486K425K855
59889G12640L977N512O149O031O391P249P674P839Q609R535R437Q581Q293Q666
59875H16583Q631P946P139N879L324r5l045n290p551r716j0932j1209j1295j1096
59861G79273r878p829n895m354k945k038k132k564k236j320q27q37n48K86J311
59846G37467K582M349O210P681Q980J0254J0844J0586J0793J2601J5211J7112
59834H54670J7861J7261J4247Q708L269J014K150M807Q078J1820J4328J2960P170
59821I78343j051r557j7044k2326k4762k5261k5045k3744k0496j6278j3111j1374
$$ y = [651912, 652449, 652655, 653406, 654848, 656434, 658444, 661886, 666617, 671173, 674789, 678167, 681872, 685458, 688543, 691377, 693958, 695873, 697259, 698669, 699911, 700432, 700857, 702413, 704722, 706004, 705836, 705874, 707360, 709785, 712640, 716617, 722129, 728278, 734309, 740700, 747949, 755623, 763462, 772071, 781606, 791043, 799624, 807917, 816583, 825214, 833160, 840299, 846178, 849502, 849407, 846362, 841072, 833521, 823805, 812873, 801664, 790369, 779273, 769395, 761566, 755671, 751317, 748372, 746334, 744202, 741638, 739402, 738082, 737255, 736418, 735870, 736156, 737467, 740049, 744398, 750608, 758289, 767269, 777523, 788367, 798953, 809746, 822347, 837558, 854670, 872531, 889792, 904039, 912747, 916016, 917030, 919180, 923987, 932065, 943885, 958213, 971173, 978343, 977292, 967735, 950691, 928365, 903603, 878342, 853297, 829553, 809057, 792779, 779668, 768294]
59809G68294r959q603p909p495o329m734l823l265j809J29Q37K44L2O03K81j806
59793G14688m200n289n250n061m987m820m499m037l501l250l360l139k140j170
59779F59985j175j690j635j080q05p48l07L66Q80J686L041L754K739J097O83J270
59763F68061J202L02p0N27J252J812K603L208K785J788J480J910K205K414L114
59748F94593L646K881J445J076J970K869L411M194M825M170K484J123L21o29j266
59733G27113m22J352K260K056K017K300J798O84M28J103J181K67m02m50q45j572
59717G38868j368k49J86m42o57J00N45R8l0P95J432J106O89R06J163J024J056
59700G45222J438J416Q82P71J375J908K294L468N488P081P469O855M917J072l409
$$ y = [768294, 758335, 749732, 741823, 734328, 727999, 723265, 719442, 716177, 714368, 714497, 715334, 715578, 715610, 716213, 716494, 714688, 710488, 705199, 699949, 694888, 689901, 685081, 680582, 676545, 673044, 669794, 666434, 663295, 661155, 659985, 658810, 657120, 655485, 654405, 653600, 652852, 652545, 652911, 653791, 655477, 658518, 662272, 665011, 666108, 666791, 668061, 669263, 669565, 669495, 670022, 671274, 673086, 675689, 678897, 681682, 683470, 684950, 686860, 689065, 691479, 694593, 698239, 701120, 702565, 703641, 705611, 708480, 711891, 716085, 720910, 725080, 727564, 728687, 729008, 728379, 727113, 726691, 728043, 730303, 732359, 734376, 736676, 738474, 739158, 739586, 740689, 741870, 742137, 741735, 741285, 740440, 738868, 737500, 737251, 737437, 736995, 736338, 736438, 736983, 737081, 737051, 737846, 739278, 740384, 741073, 741979, 743142, 744166, 745222, 746660, 748076, 748958, 749729, 751104, 753012, 755306, 758774, 764262, 771343, 778812, 785667, 790584, 791656, 788247]
59685G88247n915n753m786m144k774n5K485L394L242L085K727J742O41j12q86
59670G81138j790k075j359k09J002K413L412K657j03l575o654r101j0488j0198
59656G45070q768p466o340m428j877J63J813M233O954P957O859N478M650L043
59642G57341L7k790m122m598m974m787l895l263l131k388p80L75N90J195K833
59627G27643M196M367M294M694M641L571K730L201M257M961N534N894M706J487
59613G86176k040m027m522m297l286j378O63K313L949N624O597O759O941P079
59599H06551N993L610J496L19j069l169m644m630m099l853l237k026j427j989
59585G87826k555k511k939m272n067m447l661l791m046l770l894m808n002l610
$$ y = [788247, 782332, 776579, 771793, 767649, 764875, 764820, 767305, 770699, 773941, 777026, 779753, 781495, 782136, 782024, 781138, 779348, 777273, 775914, 775705, 776707, 779120, 782532, 785189, 785086, 781511, 774857, 765756, 755268, 745070, 736302, 728836, 722496, 718068, 716191, 716354, 718167, 722400, 729354, 737311, 744170, 749648, 754298, 757341, 757378, 754588, 750466, 745868, 740894, 736107, 732212, 728949, 725818, 723430, 722650, 723025, 723615, 724810, 727643, 731839, 736206, 740500, 745194, 749835, 753406, 756136, 759337, 763594, 768555, 774089, 779983, 784689, 786176, 784136, 780109, 775587, 771290, 768004, 766626, 767289, 769602, 773551, 779175, 785772, 792531, 799472, 806551, 812544, 816154, 817650, 817969, 816900, 813731, 809087, 804457, 800358, 796505, 793268, 791242, 789815, 787826, 785271, 782760, 779821, 775549, 770482, 766035, 762374, 758583, 754537, 750767, 746873, 742065, 737063, 733453]
59571G33453k220k362l087k892k118j621q50Q24K463L062L185L510L421K531J908
59556G39207K213K370J730J557K713L745L229K233K383L191L249K632K179J853
59542G74484J580K242M102N785O485P538J0178J3666J7366K2268K7979L0287K5033
59529I48993J3605J958n113o801m541j34M719R041J2922J6348J8530J9156J9001
59516A047684J8206J5599J0945O112K489r30n284r551j2353j4235j6113j7183
59504A025386j6516j5147j4431j3713j1834r521q078p003n073k641q44L80J522
59491I22487K071J686J542K575L815M273M979P087R572J1061J2509J5677K0241
59478A019575K4697K8943L3705L8474M2278M5414M8335M9679M7234M0025K8118
$$ y = [733453, 731233, 728871, 725784, 722892, 720774, 719153, 718303, 719127, 721590, 724652, 727837, 731347, 734768, 737299, 739207, 741420, 743790, 745520, 747077, 749790, 753535, 756764, 758997, 761380, 764571, 767820, 770452, 772631, 774484, 776064, 778306, 782408, 788193, 794678, 802216, 812394, 826060, 843426, 865694, 893673, 923960, 948993, 962598, 964556, 959443, 952642, 948101, 947967, 952686, 961727, 974649, 990997, 1009527, 1028683, 1047684, 1065890, 1081489, 1092434, 1098546, 1101035, 1100105, 1094821, 1085270, 1072917, 1058682, 1042569, 1025386, 1008870, 993723, 979292, 965579, 953745, 944224, 936146, 929143, 924070, 921429, 920585, 920965, 922487, 924558, 926244, 927786, 930361, 934176, 938449, 943428, 950515, 960087, 971148, 983657, 999334, 1019575, 1044272, 1073215, 1106920, 1145394, 1187672, 1233086, 1281421, 1331100, 1378334, 1418359, 1446477]
59467A446477J2173n103j9029k6649k8993k8039k3731j5937o746K064J1553K2653
59455A340693L2932L9618M3857M8403N2949N5650N7775O2708P1173Q1180R1544
59444A978482J01161J05216R6507P1575L3134j2794n8892r6632j19153j25695
59434A972909j21028j10352r6854q3324p2513o5188o0199n6536n3345m8761m1497
59423A163312l3066k5664j8686j0239j145O099J1541J7202K2866K6498K8569L1702
59411A218989L6041L9402M2158M6510M9479M2390K0906q039l2608m6632n1207
59400A357389m9187m2431l2877k2036r545M608J5981J6822L256j9571m0813n2424
59388A129172n4056n0274m4692l8029l0729k4588k0740j8032j5057j2373j1080
$$ y = [1446477, 1458650, 1453547, 1434518, 1407869, 1378876, 1350837, 1327106, 1311169, 1304423, 1306487, 1318040, 1340693, 1373625, 1413243, 1457100, 1505503, 1558452, 1614102, 1671877, 1734585, 1805758, 1886938, 1978482, 2079643, 2184859, 2281366, 2352941, 2386075, 2373281, 2314389, 2217757, 2098604, 1972909, 1851881, 1741529, 1644675, 1561351, 1488838, 1423650, 1363451, 1306915, 1253570, 1204809, 1163312, 1130246, 1104582, 1085896, 1075657, 1074512, 1080611, 1092152, 1109354, 1132220, 1158718, 1187287, 1218989, 1255030, 1294432, 1336590, 1383100, 1432579, 1474969, 1495875, 1487836, 1455228, 1408596, 1357389, 1308202, 1265771, 1232894, 1210858, 1201313, 1205921, 1221902, 1238724, 1241980, 1222409, 1181596, 1129172, 1075116, 1024842, 980150, 942121, 911392, 886804, 866064, 848032, 832975, 820602, 809522]
59377H09522j0481r174p377o214n578m635l663l376l191k171r37o41p55m0J123
59362G52412J570J765K965M616N069M464M592O144Q320J0711J3425J5780J7080
59349H48913J8270K0740K4140K7405L0932L5287L8867L9720L8841L8636L8849
59338A200600L7155L3316K9245K5112J8866R981N07p999j5815k2969k8592l2743
59326A246664l6301l8804l8960l7389l6119l5306l3181k9388k5596k2546j9337
59315H93737j5913j3464j2042j0383q411p286o832n690m040l369l391k280j70
59302H00466P67N7m30L9J40l90L8J792L280M113N949R314J2558J4928J7873K2339
59286H92833K7330L1547L3620L0507J9548L256j1291j9283k1569k0593j6775j0470
$$ y = [809522, 799041, 789867, 782490, 776276, 770698, 766063, 762400, 759024, 755833, 753662, 752725, 752084, 751329, 751289, 752412, 753982, 755747, 758712, 763328, 768397, 772861, 777453, 783597, 791917, 802628, 816053, 831833, 848913, 867183, 887923, 912063, 939468, 970400, 1005687, 1044554, 1084274, 1123115, 1161751, 1200600, 1237755, 1271071, 1300316, 1325428, 1344294, 1354275, 1354782, 1346783, 1330968, 1307999, 1279407, 1246664, 1210363, 1171559, 1132599, 1095210, 1059091, 1023785, 990604, 961216, 935620, 913074, 893737, 877824, 864360, 852318, 841935, 833524, 826238, 819406, 813716, 809676, 806307, 802916, 800636, 800466, 801233, 801290, 800860, 800899, 801039, 800649, 800687, 802479, 805759, 809872, 815821, 825135, 837693, 852621, 870494, 892833, 920163, 951710, 985330, 1015837, 1035385, 1038641, 1027350, 1008067, 986498, 965905, 949130, 938660]
59274I38660l853J594O873J2831J8157K1744K4643K7896L0617L1799L1860L1012
59262A173833K8286K3480J7967J2327N493k616j0031j5575k0345k5041k8319k9225
59250A130234k8916k8493k7324k4938k2298j9893j6764j2755r455p580n635k522
59238I23661Q04L500O323R671J2486J4383J6474J8807J9503J7748J5173J2821
59226A071354R317L750k223o862j0747j4916j8814k1740k4211k6297k6651k4786
59214I07174k2279k0319j8215j5596j3681j2902j1725r428p677p672q099p596
59202G51985o887o695n955m006k316k068k076j011L13O89O17R27J252J393K213
59187G28375L730M480M154M487O058O815N483L796L502L720L330L323M599N889
$$ y = [938660, 934807, 936401, 943274, 956105, 974262, 996006, 1020649, 1048545, 1079162, 1110961, 1142821, 1173833, 1202119, 1225599, 1243566, 1255893, 1261386, 1258770, 1248739, 1233164, 1212819, 1187778, 1159459, 1130234, 1101318, 1072825, 1045501, 1020563, 998265, 978372, 961608, 948853, 939398, 931818, 926183, 923661, 924465, 927965, 934288, 943959, 956445, 970828, 987302, 1006109, 1025612, 1043360, 1058533, 1071354, 1080671, 1084421, 1082198, 1075336, 1064589, 1049673, 1030859, 1009119, 984908, 958611, 931960, 907174, 884895, 864576, 846361, 830765, 817084, 804182, 792457, 783029, 775352, 767680, 759581, 751985, 745098, 738403, 732448, 728442, 726126, 724058, 721982, 720971, 721284, 721973, 722590, 723517, 724769, 726162, 728375, 732105, 736585, 740739, 745226, 751284, 758099, 763582, 767378, 770880, 774600, 777930, 781253, 785852, 791741]
59173G91741O171O841R079J1480J2636J3859J6761K0188K2244K3445K5303K7361
59161I87109K8147K7540K6018K3045J8335J3200Q686L944j758p208j1237j4598
59149A101223j8016k0325k0599k0075k0067j9932j9038j8446j8633j7908j5361
59138H92823j3033j2656j2620j0798q181o891o588n705m507m079l882l001k277
59125G98605k562k498n09K457M618O172Q133J0084J1481J3384J6424J8908J9425
59112I04122J9378K0369K1173K0102J8329J7736J7328J5047J1549Q962P236M931
59100A086262K358Q08j79j872l708m423m643n631o653o300n214m827m768m107
59086A037103l698m491n141m207l226m408o845q232q958j0908j3445j4261j3406
$$ y = [791741, 797912, 804753, 813832, 825312, 837948, 851807, 868568, 888756, 911000, 934445, 959748, 987109, 1015256, 1042796, 1068814, 1091859, 1110194, 1123394, 1132080, 1136024, 1134266, 1127058, 1115821, 1101223, 1083207, 1062882, 1042283, 1022208, 1002141, 982209, 963171, 944725, 926092, 908184, 892823, 879790, 867134, 854514, 843716, 835535, 828644, 822056, 816351, 811844, 807765, 803883, 800882, 798605, 796043, 793545, 793036, 795493, 800111, 806283, 814416, 824500, 835981, 849365, 865789, 884697, 904122, 923500, 943869, 965042, 985144, 1003473, 1021209, 1038537, 1053584, 1065133, 1074095, 1081331, 1086262, 1088620, 1089428, 1089249, 1087377, 1083669, 1079246, 1074603, 1068972, 1062319, 1056019, 1050805, 1045978, 1041210, 1037103, 1033405, 1028914, 1023773, 1019566, 1016340, 1011932, 1005087, 996855, 987897, 976989, 963544, 949283, 935877]
59073I35877j2952j3224j2683j1128r853r062q011p224p681q363p415n175l403
59060H19703k212n62J043J167J49o10j248k611l765l292k281k900m675n250m383
59045G88273l985m615m873m124l066j837j02J312J430J235K338M139M841M515
59031G85481M544M840M329L525L817M889N598O556R110J2492J4957J6867J9649
59018H96654K2452K3039K1422J9381J6913J2457O382J053k575n485p856q679p967
59005I87191o724m908j925J364L705N972R739J4053J6560J7363J8676K1022K2806
58992A104894K3429K3768K3784K2472K0194J8198J6015J1858N447j989r829j7636
58980A240605k3418k5341k4543k3492k2279j9468j5642j2700j0358o794k294J183
$$ y = [935877, 922925, 909701, 897018, 885890, 876037, 866975, 858964, 851740, 844059, 835696, 828281, 823106, 819703, 817491, 816929, 817972, 819139, 819288, 818678, 817430, 814819, 811054, 807762, 805481, 802581, 797906, 792656, 788273, 784288, 779673, 774800, 770676, 767610, 765773, 765671, 766983, 768413, 769648, 771986, 776125, 780966, 785481, 790025, 794865, 799194, 802719, 806536, 811425, 817023, 823579, 832689, 845181, 860138, 877005, 896654, 919106, 942145, 963567, 982948, 999861, 1012318, 1018700, 1019753, 1017178, 1011693, 1003837, 995158, 987191, 980467, 975559, 973634, 974998, 978703, 984675, 994414, 1008467, 1025027, 1042390, 1061066, 1082088, 1104894, 1128323, 1152091, 1175875, 1198347, 1218541, 1236739, 1252754, 1264612, 1270059, 1268070, 1258241, 1240605, 1217187, 1191846, 1167303, 1143811, 1121532, 1102064, 1086422, 1073722, 1063364, 1056570, 1054276, 1055459]
58968A055459L638O792J0604J3489J5674J8853K2685K5147K6193K7586K9170K8695
58956A283985K5420K0579J4477O504k193r508j5713k2552k9190l2761l2867l1872
58944A174309l0752k8489k5554k3893k3056k0347j5466j1270r213p754o035n385
58932I67095o239p070p348q319r988j0523r581q951r171q641o958n888o109o027
58918H56282m755l349k331q06J237K558L196M558O533P416P033P028P767Q131
58904I00498Q580J1015J5170J8509K0298K2405K5466K7701K8242K8317K8301K6960
58892A161462K4504K3233K4272K6624L0038L5709M3437N1185N7980O4103O8121
58881A610668O7165O0874N1863M1806L0417J8441P805j866j3234k6840m0195n1664
$$ y = [1055459, 1059097, 1065889, 1076493, 1089982, 1105656, 1124509, 1147194, 1172341, 1198534, 1226120, 1255290, 1283985, 1309405, 1329984, 1344461, 1350965, 1348772, 1339264, 1323551, 1300999, 1271809, 1239048, 1206181, 1174309, 1143557, 1115068, 1089514, 1065621, 1042565, 1022218, 1006752, 995482, 986269, 978515, 972480, 967095, 960856, 953786, 946438, 938119, 928131, 917608, 908027, 899076, 889905, 881264, 874306, 868418, 862309, 856282, 851527, 848178, 845847, 845041, 846278, 848836, 852032, 856590, 863123, 870539, 877572, 884600, 892367, 900498, 909078, 920093, 935263, 953772, 974070, 996475, 1021941, 1049642, 1077884, 1106201, 1134502, 1161462, 1185966, 1209199, 1233471, 1260095, 1290133, 1325842, 1369279, 1420464, 1478444, 1542547, 1610668, 1677833, 1738707, 1790570, 1832376, 1862793, 1881234, 1889039, 1887173, 1873939, 1847099, 1806904, 1755240]
58869A755240o1502o8610p0446o7254o2417n7617n1482m3984l7874l4336l1196
58858A168522k7077k3592k1889k0624j8949j8001j7941j7022j4915j3480j3033
58847I61999j1522q668p033p524p799o714o303p559q237p019o001o870q110q239
58833H54401q414r585j0257r369q326q237p985o889o260o511n851l504j201J59
58819G62171K096N233P629Q142Q232Q867Q879P886P314P108N079J173j477j516
58805H36816j463l062m467m249m164n432o111m782l336l411l488k109p47r00j414
58790G87681j089q29j037q2K400M122M207N106Q138J0774J0949J0424J1094J1411
58776H63269R526O793N130L815J734kl62n57j500j918j209j138k480l152k038
$$ y = [1755240, 1693738, 1625128, 1554682, 1487428, 1425011, 1367394, 1315912, 1271928, 1234054, 1199718, 1168522, 1141445, 1117853, 1095964, 1075340, 1056391, 1038390, 1020449, 1003427, 988512, 975032, 961999, 950477, 941809, 934776, 927252, 919453, 912739, 906436, 898877, 890640, 883621, 877620, 870750, 862640, 854401, 845987, 836402, 826145, 816776, 808450, 800213, 792228, 785339, 779079, 772568, 766717, 763213, 762012, 762171, 764267, 769500, 777129, 785271, 793503, 802370, 811249, 819135, 826449, 833557, 838636, 839809, 838332, 836816, 835353, 832291, 827824, 823575, 819411, 813979, 807868, 803086, 799750, 796339, 792851, 790742, 789995, 789095, 787681, 786592, 785763, 784726, 784644, 787044, 791166, 795373, 800479, 808617, 819391, 830340, 840764, 851858, 863269, 872795, 879588, 884718, 888533, 890267, 890265, 889903, 889346, 887846, 885928, 884719, 883581, 881101, 877949, 875911]
58761H75911j314k582m041l930l333l106j593J810M410M390L917N222O903P028
58747H89692O590O924O968N981N840P711R594R842R867J0734J0701Q867P568Q226
58733A005105Q571P106O406Q575J1257J1757J1492J2587J3620J2589J0825J0060
58721A129950Q841N674K630J995K423K119K640N651R015J0098J0111J1210J2155
58708A214512J0674P527M501J148k999n921o485p367j1018j5771j9370k2992k7955
58695A118484l1878l2256l0722k9781k8471k5202k1548j9129j6147j1327p753
58684H64270q205j0141j0045r361j1133j3923j4408j3152j2549j1713q696n313
58672G35631m374m328j868K197M729N894Q012J0768J2484J4317J8308K2881K4880
$$ y = [875911, 874597, 872015, 867974, 864044, 860711, 857605, 856012, 857822, 862232, 866622, 870539, 875761, 882664, 889692, 896282, 903206, 910174, 916155, 921995, 929706, 939300, 949142, 959009, 969743, 980444, 989311, 996879, 1005105, 1013676, 1020782, 1027188, 1035763, 1047020, 1058777, 1070269, 1082856, 1096476, 1109065, 1119890, 1129950, 1138791, 1144465, 1147095, 1149090, 1151513, 1153632, 1156272, 1161923, 1170938, 1181036, 1191147, 1202357, 1214512, 1225186, 1232713, 1237214, 1238362, 1235363, 1229442, 1222957, 1215590, 1204572, 1188801, 1169431, 1146439, 1118484, 1086606, 1054350, 1023628, 993847, 965376, 940174, 918626, 899497, 883350, 872023, 864270, 856065, 845924, 835879, 826518, 815385, 801462, 787054, 773902, 761353, 749640, 740944, 735631, 731257, 726929, 725061, 727258, 731987, 737881, 745893, 756661, 769145, 783462, 801770, 824651, 849531]
58659H49531K4346K2988K0064J4326P967L975J483j890n214o327o417p854r584
58646I07394r315q109q211q517o933m882m673m709k240J373L102L649N506P808
58632H71243Q167P396P415O736L136j419l712m757p185r651r268p266o526n757
58618H48552j916L671P465J0077J4671K0798K5587K9242L3566L6742L5463L0682
58606A094600K5575J9678J0845J264m715p236r529j1575j1167r642j0200j1833
58594A076065j1068q547p765q599q112o494o037n519j863L741P503R656J3335
58581A046296J8141K0991K2101K3855K5011K2458J7533J4176J2031P860K552r2
58569A232913m69k086m322l290P61L828N433Q654J3376J6304J7367J9367K1621
$$ y = [849531, 873877, 896865, 916929, 931255, 939222, 943197, 944680, 942790, 937576, 931249, 924832, 916978, 907394, 898079, 889970, 881759, 873242, 866309, 861427, 856754, 852045, 849805, 851178, 854280, 857929, 863435, 871243, 879410, 886806, 894221, 900957, 904093, 902674, 898962, 894205, 887020, 877369, 868101, 860835, 854309, 848552, 846636, 850307, 857772, 867849, 882520, 903318, 928905, 958147, 991713, 1028455, 1063918, 1094600, 1120175, 1139853, 1150698, 1151962, 1147247, 1140011, 1130482, 1118907, 1107740, 1098098, 1087898, 1076065, 1064997, 1056450, 1048685, 1040086, 1031974, 1025480, 1019443, 1013924, 1012061, 1015802, 1023305, 1032961, 1046296, 1064437, 1085428, 1107529, 1131384, 1156395, 1178853, 1196386, 1210562, 1222593, 1230453, 1233005, 1232913, 1232444, 1230358, 1226036, 1222746, 1223507, 1227335, 1232768, 1241422, 1254798, 1271102, 1288469, 1307836, 1329457]
58556A329457K0630J6763J3598J1085O095o50n125p152j0203j4341j6196j5702
58544A328259j5981j6813j5186j2086j1732j4100j5185j4577j5690j8480j9141
58533A159288j7270j6292j6549j4879j1231q848p799n134j341K14J21K115N840
58520A068235P589P755R993J3405J3524J0857J0283J1943J1003O820M016L855
58508A179278K785L73M18L204M673M245N645R203J1229J1666J4154J7867J7680
58495A282420J3312R825Q230M325k235o656q100j1102j6386j9184j8334j8157
58483A217958j9523j8007j2872q949p495m098K186O521P370Q951J2340J3031R767
58470A207180O869N369R20o867j2253j3258j4633j8158j9253j6334j4267j5109
$$ y = [1329457, 1350087, 1366850, 1380448, 1391533, 1397628, 1396978, 1391853, 1384701, 1374498, 1360157, 1343961, 1328259, 1312278, 1295465, 1280279, 1268193, 1256461, 1242361, 1227176, 1212599, 1196909, 1178429, 1159288, 1142018, 1125726, 1109177, 1094298, 1083067, 1074219, 1066420, 1061286, 1059945, 1060159, 1060280, 1062395, 1068235, 1075824, 1083579, 1093572, 1106977, 1120501, 1131358, 1141641, 1153584, 1164587, 1171407, 1175423, 1179278, 1182063, 1182436, 1182854, 1186058, 1190731, 1194976, 1200621, 1209824, 1221053, 1232719, 1246873, 1264740, 1282420, 1295732, 1305557, 1313787, 1318112, 1315877, 1309221, 1301121, 1290019, 1273633, 1254449, 1236115, 1217958, 1198435, 1180428, 1167556, 1158607, 1151112, 1147014, 1149200, 1155721, 1163091, 1172042, 1184382, 1197413, 1207180, 1214049, 1219418, 1220338, 1213471, 1201218, 1187960, 1173327, 1155169, 1135916, 1119582, 1105315, 1090206]
58458A090206j4524j0810q466r072p758k469J965K837L914P106Q455O177M197
58445A071758M097K043k772n389m203l918o084n791j422J757J463K473O835R544
58431A070391Q102P048Q663Q668N487M258P088Q908P560Q344J3632J7713J6970
58418A192832J5640J6440J5211J0250P231R187J0922Q726O261N585K153n575j1328
58405A283535j1606j1503j4361j5408j1657q174q324p484k681J163P92P19L642
58392A198653M604R48j859o73q74n684r545q738q299j1625j3624j1153r760j2798
58378A109573j4283r999n295m458k929K422O078M630L929P684R954O987N292R410
58364A128995J2960J0722Q457J1557J4999J3940J3267J7077J9571J6079J2392
$$ y = [1090206, 1075682, 1064872, 1056406, 1047334, 1039576, 1037107, 1039072, 1041909, 1045823, 1052929, 1061384, 1067561, 1071758, 1075855, 1077898, 1075126, 1069737, 1065534, 1061616, 1055532, 1049741, 1048319, 1050076, 1051539, 1054012, 1060847, 1070391, 1078493, 1085541, 1094204, 1102872, 1108359, 1112617, 1119705, 1128613, 1136173, 1144517, 1158149, 1175862, 1192832, 1208472, 1224912, 1240123, 1250373, 1257604, 1266791, 1277713, 1286439, 1292700, 1298285, 1300438, 1294863, 1283535, 1271929, 1260426, 1246065, 1230657, 1219000, 1210826, 1202502, 1195018, 1192337, 1193500, 1194292, 1195011, 1198653, 1203257, 1204205, 1202346, 1201673, 1200799, 1195115, 1185570, 1176832, 1168533, 1156908, 1143284, 1132131, 1122371, 1109573, 1095290, 1085291, 1079996, 1075538, 1072609, 1075031, 1081109, 1085739, 1089668, 1097352, 1107306, 1114293, 1119585, 1128995, 1141955, 1152677, 1161134, 1172691, 1187690, 1201630, 1214897, 1231974, 1251545, 1267624, 1280016]
58353A280016J3450J3652Q140K714K657K817j236l537N95M625L014J814O373J0275
58339A345369P705N209R467J4774J4354J2881J6005J8838J6604J5334J9994K3648
58327A520182K0354J6885J9444K1101J5143Q492Q674R933N756K467O391J0200
58315A665022O544K671O748J2234J0901Q705J3214J7986J5355J2161J6545K1624
58303A809710J8777J4565J7717K1964J8904J5120J9005K3359J9076J3251J5534
58292B006982J9463J5964J2193J7723K5135K3906K0565K5144L0919K8055K4002
58281B250051K9261L6246L3677K8557L2049L7220L3286K8107L3396M1348L9522
58270B622720L5163M0596M8554M6778M2929M9670N9245N8755N6122O4245P4366
$$ y = [1280016, 1293466, 1307118, 1315258, 1317972, 1320629, 1323446, 1322210, 1318673, 1319268, 1323893, 1326907, 1328721, 1335094, 1345369, 1353074, 1358283, 1367750, 1382524, 1396878, 1409759, 1425764, 1444602, 1461206, 1476540, 1496534, 1520182, 1540536, 1557421, 1576865, 1597966, 1613109, 1621601, 1630275, 1640208, 1645964, 1648431, 1654822, 1665022, 1671566, 1674237, 1680985, 1693219, 1704120, 1712825, 1726039, 1744025, 1759380, 1771541, 1788086, 1809710, 1828487, 1843052, 1860769, 1882733, 1901637, 1916757, 1935762, 1959121, 1978197, 1991448, 2006982, 2026445, 2042409, 2054602, 2072325, 2097460, 2121366, 2141931, 2167075, 2197994, 2226049, 2250051, 2279312, 2315558, 2349235, 2377792, 2409841, 2447061, 2480347, 2508454, 2541850, 2583198, 2622720, 2657883, 2698479, 2747033, 2793811, 2836740, 2886410, 2945655, 3004410, 3060532, 3124777, 3199143]
58259C199143P2650O7987P4919Q4348Q0699P2586P6151Q3537P9298P2241P8519
58248D042078Q9031Q7112Q2469R2843J08378J10045J06967J18301J34847J37258
58238E109329J35456J49783J69973J74453J73393J89404K12729K20426K22611
58229F757557K43082K71528K83392K89422L15326L50439L68840L82592M19195
58220I681373M65716M92717N13736N60726O21323O64103P04347P77208Q68225
58211A5349474R42249J017959J137259J285422J423417J573705J786107K046448
58203B6562040K314835K625783L047093L571949M166737M891065N842243P018447
58195F0040192Q381897J0017750J2069834J4574788J7560549K1244182K5859311
$$ y = [3199143, 3271793, 3339780, 3414699, 3499047, 3579746, 3652332, 3728483, 3812020, 3891318, 3963559, 4042078, 4131109, 4218221, 4300690, 4393533, 4501911, 4611956, 4718923, 4837224, 4972071, 5109329, 5244785, 5394568, 5564541, 5738994, 5912387, 6101791, 6314520, 6534946, 6757557, 7000639, 7272167, 7555559, 7844981, 8160307, 8510746, 8879586, 9262178, 9681373, 10147089, 10639806, 11153542, 11714268, 12335591, 12999694, 13704041, 14481249, 15349474, 16291723, 17309682, 18446941, 19732363, 21155780, 22729485, 24515592, 26562040, 28876875, 31502658, 34549751, 38121700, 42288437, 47179502, 53021745, 60040192, 68422089, 78439839, 90509673, 105084461, 122645010, 143889192, 169748503]
58188A69748503L1294901L7127062M2787824M7058354M7344655M0478095K5333340
58181D41172734M750159j5699971l1142610l9739138m2325169m0730148l6663382
58174B39622475l1451329k6006170k0818961j6077375j1818297q071547n100941
58167A20277855l519173l845881n780207q137958r720100j0137069r709185q837272
58159F0591010p730476o561803n521725m672841l947632l316377k820689k449918
58151B3569549k127515j828563j593151j419715j253132j082867r53614q72501
58143A2438491p95367p10140o50366o20337n83957n33462m97829m78413m43528
58134G125092l91053l52764l32757l02120k57713k27737k15804j96050j67282
$$ y = [169748503, 201043404, 238170466, 280958290, 328016644, 375361299, 415839394, 441172734, 445922893, 430222922, 399080312, 359341174, 317016005, 276285857, 239622475, 208171146, 182164976, 161346015, 145268640, 133450343, 125378796, 120277855, 116758682, 112912801, 107132594, 98994636, 89274536, 79137467, 69428282, 60591010, 52860534, 46298731, 40777006, 36104165, 32156533, 28840156, 26019467, 23569549, 21442034, 19613471, 18020320, 16600605, 15347473, 14264606, 13310992, 12438491, 11643124, 10932984, 10282618, 9662281, 9078324, 8544862, 8047033, 7568620, 7125092, 6734039, 6381275, 6048518, 5746398, 5488685, 5260948, 5045144, 4849094, 4681812]
58125D681812j57251j68584j72619j61719j57830j64458j58954j38238j25765
58116C276394j26775j20557j02901r3665r6366r1475p5779o8836p4304p3157o1221
58105B291358n6286o2137o1601n1262m8081n5438n6548m7542m4141m9636m8558
58094A710128l8040l3921l9648l9815l0603k6627l1490l0978k1695j7746k2692
58083A376873k3022j5681j4489k2610k5774j9596j7286k3385k5550j9463j6897
58072A153120k1931k3379j7731j5976k0908k0978j3311r995j4871j6587j1144
58061I66309r011j3335j3266n810k539p558j0108n973n218j1444j4188r292o706
58048H51861j0627j1658o139l676p982r362l864j134n574q128m464l149q030j0290
$$ y = [4681812, 4524561, 4355977, 4183358, 4021639, 3863809, 3699351, 3540397, 3402159, 3276394, 3149619, 3029062, 2926161, 2832496, 2736130, 2644655, 2568876, 2500040, 2425736, 2352579, 2291358, 2235072, 2172935, 2111334, 2060072, 2011991, 1956553, 1900005, 1852463, 1808322, 1758686, 1710128, 1672088, 1638167, 1598519, 1558704, 1528101, 1501474, 1469984, 1439006, 1417311, 1399565, 1376873, 1353851, 1338170, 1323681, 1301071, 1275297, 1255701, 1238415, 1215030, 1189480, 1170017, 1153120, 1131189, 1107810, 1090079, 1074103, 1053195, 1032217, 1018906, 1008911, 994040, 977453, 966309, 957298, 943963, 930697, 924887, 922348, 914790, 904682, 898709, 893491, 882047, 867859, 858567, 851861, 841234, 829576, 823437, 819761, 811779, 802417, 798553, 797419, 791845, 783717, 779253, 776104, 768074, 757784]
58034G57784n868l451p315r313n527m102q811j1430q036o516j0393j1474o241
58021F59307l274o756q553m452k263n869p203k272N23l446o065k210P32k140l671
58006F02388Q44M195J535j1M555Q168N390K792O055R442P744O359R858J2398R030
57991F90742N251O055O608K641q04K39N03l752o628l807j195l895p042o008n211
57976F73697q348j0325p487n524q713j1332q465n313p086r368p357n065o602p572
57962E65140l893j46o10r30K836N830L508M08J295K294o46l150r47J479m99k659
57946E69310k52K726J370p98Q69L076J524l81J592L996K565O29K363M476K860
57931E95925Q68K690N033L425M07k93j151m772p127m702j703k544l841j681J94
$$ y = [757784, 751916, 748465, 741150, 731837, 726310, 722208, 713397, 701967, 693931, 687415, 677022, 665548, 659307, 656033, 649277, 640724, 636272, 634009, 628140, 620937, 618665, 619188, 615742, 609677, 607467, 608199, 606059, 602388, 603232, 607427, 608962, 608951, 613506, 621674, 627064, 629856, 635911, 645353, 653097, 659456, 669314, 681712, 690742, 695993, 702048, 708656, 711297, 710493, 710732, 711235, 707483, 700855, 697048, 695853, 691958, 684916, 678908, 673697, 665349, 655024, 647537, 642013, 633300, 621968, 613503, 608190, 601104, 591736, 584379, 579314, 572712, 565140, 561247, 561101, 560491, 559561, 562397, 568227, 571735, 572143, 573438, 575732, 575086, 571936, 570989, 572468, 571969, 569310, 569058, 571784, 573154, 572356, 573225, 576301, 577825, 577444, 579036, 583032, 585597, 586226, 588589, 593065, 595925, 596793, 599483, 604516, 607941, 608348, 608055, 606904, 602132, 595005, 590303, 588600, 586056, 582215, 580534, 580728]
57916E80728k413n598m394j957l259n878n428m125n660p409n972m587o839q960
57902E08249o685l854n760r563r920q560r672j1122r013n990o317p506n238j894
57888D07155j751k506QL342L141J780L692O528N599K979L599O124O211N067O292
57873D57260P927O011K628K233L319J856n46k8J423m02l515l230j021j641m236
57858D68038m466k906l214m476l231q26j043k716k198o41j433k871j064K305K708
57843D41966R99J350L300L380K504M079O710O366M033L804N098M145J528Q96J727
57828D91885N58j966k293r35j318l124l319k410l081m181k692o8n7j809j671n5
57812D63464P9l66J470L947L375J115J256K890J825j526l367m120p324j1982j3573
$$ y = [580728, 578315, 572717, 568323, 566366, 563107, 557229, 551801, 547676, 542016, 534607, 528635, 524048, 517209, 508249, 501564, 497710, 491950, 482387, 472467, 463907, 454235, 443113, 434100, 428110, 421793, 414287, 409049, 407155, 405404, 402898, 402906, 406248, 409389, 411169, 414861, 421389, 426988, 429967, 433566, 439690, 445901, 450968, 457260, 465187, 471198, 473826, 476059, 479378, 481234, 480688, 480660, 482083, 481681, 478166, 474936, 473915, 472274, 468038, 463572, 460666, 457452, 452976, 449745, 448919, 447876, 445160, 442962, 442321, 440888, 438017, 436953, 439258, 441966, 442965, 444315, 447615, 450995, 453499, 457578, 464288, 470654, 474687, 478491, 483589, 487734, 489262, 490158, 491885, 492443, 490477, 488184, 487249, 485931, 482807, 479488, 477078, 473997, 469816, 467124, 467056, 466999, 465190, 463519, 463464, 463543, 463177, 464647, 468594, 471969, 473084, 474340, 477230, 479055, 477529, 474162, 470042, 462718, 450736, 437163]
57797D37163j2052j1531j2529j1683q893p663q351p817n857n474o714o471m458
57784C27670l438l606k612q22p69j756q50J360J814J105K462N232N610L438K272
57769C37110K999L286K997M169O007N772M240M538O140N876M139L991M865L519
57755C99648O53RJ310O33k362m170m281n610p988p877n121l523m086l924k505
57740C50806k635m468m722k874k182l612m408l618l385l911k786k12O96l97m84
57725C11808Q94Q21j069j526M16J802J220P11J254J315P95J484K824K195q3r66
57709C23895k21n54k052j966l69k85j683j221J338K417J288J347L556M600L162
57694C33252K250L446M319L425K661K837J957l00j284k46K61o92q11P21J861K311
$$ y = [437163, 425111, 413580, 401051, 389368, 380475, 372812, 364461, 356644, 350787, 345313, 338599, 332128, 327670, 324232, 320626, 318014, 317192, 316423, 314667, 313817, 315177, 316991, 318096, 320558, 325790, 331400, 334838, 337110, 340109, 343395, 346392, 350561, 356568, 362340, 366580, 371118, 377258, 383134, 387273, 391264, 396129, 399648, 400301, 400310, 401620, 402253, 399891, 395721, 391440, 385830, 377842, 369965, 364844, 361321, 357235, 353311, 350806, 348171, 343703, 338981, 336107, 333925, 330313, 325905, 322287, 318902, 314991, 312205, 311993, 312689, 312292, 311808, 312702, 313523, 312454, 310928, 311344, 313146, 314366, 315077, 316331, 317646, 318441, 319925, 322749, 324944, 324861, 323895, 323674, 323120, 321068, 319102, 318733, 318448, 316765, 315544, 316882, 319299, 320587, 321934, 325490, 330090, 333252, 335502, 338948, 343267, 346692, 349353, 352190, 354147, 353847, 352563, 352317, 352578, 351886, 351075, 351796, 353657, 355968]
57678C55968M538Q812J2272J4433J8464K5454L2548L8607M6660N8732P3096Q8610
57666G78194J06697J26010J38829J35319J09486O1719M76n8242r9187j18372j22342
57655A058587j17548j05710q9262p3716o1863n1452m1097l3193k8693k4588j9255
57644D12210j5158j3606j1902q516o160o638p322n805l764l213k979j794r97j446
57630C22910j407k1P82j8o20j18k54j600k078j115j010k321k307n3J449M99n78
57613C12140j02J50q65j147N7J84j750k818j376m4p21j314k47L81p65j274L34
57596C00823J422N7j336n71L19p50j990j543j213k634l654k369j012j986l574
57581B79989l327k295k195j786R6J280j48k145k263j763k554l253k091o59r42
$$ y = [355968, 360506, 369318, 381590, 396023, 414487, 439941, 472489, 511096, 557756, 616488, 689584, 778194, 884891, 1010901, 1149730, 1285049, 1394535, 1456254, 1456730, 1398488, 1299301, 1180929, 1058587, 941039, 835329, 746067, 672351, 610488, 559036, 517939, 484746, 456053, 431465, 412210, 397052, 383446, 371544, 363028, 356868, 350230, 342908, 337103, 333339, 330126, 327147, 325353, 324356, 322910, 321503, 321482, 322264, 322246, 321626, 321508, 321254, 319654, 317576, 316461, 315451, 313130, 310823, 310770, 312219, 312718, 312140, 312038, 312188, 311323, 310176, 310233, 310417, 308667, 305849, 304473, 304429, 303708, 302394, 302147, 302528, 301763, 300489, 300823, 302245, 302302, 300966, 300395, 300714, 299964, 297974, 296431, 295218, 292584, 288930, 286561, 285549, 283563, 279989, 276662, 274367, 272172, 270386, 270482, 271762, 271614, 269469, 267206, 265443, 262889, 259636, 257545, 256886, 255944]
57566B55944j574p70k4j067k095r81N48l7j443r87O70J216R10J341J958J534J144
57549B56287K227L501L149K125K161K449J477K06L12J173J381J352J774J733R41
57534B82248J279L411M545K564l61j306j049j653k446j866r02j172j759j218m94
57519B79821o94l57J800L929M038L466M073M627L458K054K382L218K842K779M875
57504C22311P083O405L841K352J943Q97j68K93J076K09j024j18K043K681J745
57489C51569J151Q80k41j254n17P82M33p59n45N08K19r88r68J14L96n2J16L92
57471C51236l86r47N48K734K929J693J608K581K453J368J481K797L298K781K887
57456C79061L603L377K391K233K800K708K362L204M538M437L294L120L839L672
$$ y = [255944, 254370, 253600, 253576, 252509, 250414, 249433, 249981, 249944, 248501, 247514, 248184, 249400, 250310, 251651, 253609, 255143, 256287, 258514, 262015, 265164, 267289, 269450, 271899, 273376, 273582, 273894, 275067, 276448, 277800, 279574, 281307, 282248, 283527, 286938, 291483, 294047, 293686, 292380, 291331, 289678, 287232, 285366, 284464, 283292, 281533, 280315, 279821, 279127, 278770, 280570, 284499, 288537, 292003, 296076, 300703, 304161, 306215, 308597, 311815, 314657, 317436, 322311, 329394, 335799, 339640, 341992, 343935, 344832, 344664, 344957, 346033, 346242, 345218, 345100, 347143, 349824, 351569, 352720, 353600, 353359, 352105, 351588, 352370, 352803, 352044, 351499, 352007, 352226, 351238, 350270, 350384, 350780, 350728, 350844, 351236, 350850, 349903, 350451, 353185, 356114, 357807, 359415, 361996, 364449, 365817, 367298, 370095, 373393, 376174, 379061, 382664, 386041, 388432, 390665, 393465, 396173, 398535, 401739, 406277, 410714, 414008, 417128, 420967, 424639]
57442D24639K699K679L693M219M119M395M530L327J830K075L472L699K729K580
57428D70685L479L736L151L152L739L496K586K583L438L616L068L075L445K875
57414E16124J868K229L815M754M660M758N081M531L480L424M201M352L969M408
57400E71654N484N693M931M352M009L268K957M180N748N698M699M893O057O196
57386F39819N367N503O760P315O669O064N810N163M564N075O007N977N690O632
57372G22415P765O910M781M083N059N579N210N478O291N978M912N288P052P763
57358H04564O833O347P198P852P489P162P288P132P104Q439J0321J0421Q656P364
57344I14170P475P659P396P737Q698R137R360J0713J2437J2257J0334R252R768
$$ y = [424639, 427338, 430017, 433710, 437929, 442048, 446443, 450973, 454300, 456130, 458205, 461677, 465376, 468105, 470685, 474164, 477900, 481051, 484203, 487942, 491438, 494024, 496607, 500045, 503661, 506729, 509804, 513249, 516124, 517992, 520221, 524036, 528790, 533450, 538208, 543289, 547820, 551300, 554724, 558925, 563277, 567246, 571654, 577138, 582831, 587762, 592114, 596123, 599391, 602348, 606528, 612276, 617974, 622673, 627566, 633623, 639819, 645186, 650689, 657449, 664764, 671433, 677497, 683307, 688470, 693034, 698109, 704116, 710093, 715783, 722415, 730180, 737090, 741871, 745954, 751013, 756592, 761802, 767280, 773571, 779549, 784461, 789749, 796801, 804564, 811397, 817744, 824942, 832794, 840283, 847445, 854733, 861865, 868969, 877408, 887729, 898150, 906806, 914170, 921645, 929304, 936700, 944437, 953135, 962272, 971632, 982345, 994782, 1007039, 1017373, 1026625, 1036393]
57331A036393J0069R485R413J0091J0050R328R682J0967J0921R310Q696J0107
57319A154512J1470J1384J1058J1399J1499J1200J1914J3589J3987J2331J0759
57308A285102J0867J1616J1845J2052J2580J2705J2587J3445J4903J5006J3652
57297A426360J3061J3978J4502J3759J3463J4539J5345J4792J4308J5066J5970
57286A585143J5978J5877J6275J6250J5480J5258J6071J6552J6135J6304J7825
57275A763148J9114J8818J7860J7602J8057J9008K0773K2723K3257K2236K1376
57264A983972K1387K1043J9855J9222J9879K0631K0675K0845K1604K2048K1790
57253B212951K1601K1429K0250J8529J8229J9552K0460K0176K0315K1577K2326
$$ y = [1036393, 1046462, 1055947, 1065360, 1075451, 1085501, 1094829, 1104511, 1115478, 1126399, 1135709, 1144405, 1154512, 1165982, 1177366, 1188424, 1199823, 1211322, 1222522, 1234436, 1248025, 1262012, 1274343, 1285102, 1295969, 1307585, 1319430, 1331482, 1344062, 1356767, 1369354, 1382799, 1397702, 1412708, 1426360, 1439421, 1453399, 1467901, 1481660, 1495123, 1509662, 1525007, 1539799, 1554107, 1569173, 1585143, 1601121, 1616998, 1633273, 1649523, 1665003, 1680261, 1696332, 1712884, 1729019, 1745323, 1763148, 1782262, 1801080, 1818940, 1836542, 1854599, 1873607, 1894380, 1917103, 1940360, 1962596, 1983972, 2005359, 2026402, 2046257, 2065479, 2085358, 2105989, 2126664, 2147509, 2169113, 2191161, 2212951, 2234552, 2255981, 2276231, 2294760, 2312989, 2332541, 2353001, 2373177, 2393492, 2415069, 2437395]
57242B437395K1615K0802K0831K0713J9974J9896K0906K1459K0828K0483K1355
57231B666257K2393K3025K4285K6228K7031K6118K5372K5835K6102K5428K5437
57220B943511K6971K8206K7874K7531K8603K9800K9643K9093K9464K9977K9552
57209C260225K8898K8824K8509K7333K6460K6809K7420K7374K7341K7714K7511
57198C564418K6659K6933K8923L0579L0532L0310L1312L2197L1526L0530L0711
57187C894630L0852K9029K5851K3219K1344J9245J6884J4790J2790J0825R721
57176D109180R703R604Q919Q811R836J0629J0281R929J0423J0634R781R153R697
57163D236580J0021Q832P299O900O897O027M892M529M305L289K146J696J178k17
$$ y = [2437395, 2459010, 2479812, 2500643, 2521356, 2541330, 2561226, 2582132, 2603591, 2624419, 2644902, 2666257, 2688650, 2711675, 2735960, 2762188, 2789219, 2815337, 2840709, 2866544, 2892646, 2918074, 2943511, 2970482, 2998688, 3026562, 3054093, 3082696, 3112496, 3142139, 3171232, 3200696, 3230673, 3260225, 3289123, 3317947, 3346456, 3373789, 3400249, 3427058, 3454478, 3481852, 3509193, 3536907, 3564418, 3591077, 3618010, 3646933, 3677512, 3708044, 3738354, 3769666, 3801863, 3833389, 3863919, 3894630, 3925482, 3954511, 3980362, 4003581, 4024925, 4044170, 4061054, 4075844, 4088634, 4099459, 4109180, 4118883, 4128487, 4137406, 4146217, 4156053, 4166682, 4176963, 4186892, 4197315, 4207949, 4217730, 4226883, 4236580, 4246601, 4255433, 4262732, 4269632, 4276529, 4282556, 4287448, 4291977, 4296282, 4299571, 4301717, 4303413, 4304591, 4304374]
57149D304374j754k836m532p588j0647j2398j3821j6296j9101k0694k1073k0996
57137D152638k0277j8629j6921j5944j5131j3851j2518j1316r560p431o442o881
57125C997737o912n490m047l724l347j827l21N1N96L120P376J2199J7469K3248
57111D036128K8866L4562M2149N2551O4512P7304R2563J11872J34756J60840J92059
57100E028162K30951K78726L36662M07509M93944N97241P18587Q59542J019861
57091I971185J196579J385946J584152J785680J983278K169899K338986K484195
57083B4899900K600772K680902K697607K595736K316017J840940J215172N17752
57075D1364798j80575q32701j405601j874573k227719k465723k594833k624899
$$ y = [4304374, 4302620, 4299784, 4295252, 4287664, 4277017, 4264619, 4250798, 4234502, 4215401, 4194707, 4173634, 4152638, 4132361, 4113732, 4096811, 4080867, 4065736, 4051885, 4039367, 4028051, 4018491, 4011060, 4004618, 3997737, 3990825, 3985335, 3981288, 3977564, 3974217, 3972390, 3972069, 3972120, 3972716, 3975836, 3983212, 3995411, 4012880, 4036128, 4064994, 4099556, 4141705, 4194256, 4258768, 4336072, 4428635, 4540507, 4675263, 4836103, 5028162, 5259113, 5537839, 5874501, 6282010, 6775954, 7373195, 8091782, 8951324, 9971185, 11167764, 12553710, 14137862, 15923542, 17906820, 20076719, 22415705, 24899900, 27500672, 30181574, 32879181, 35474917, 37790934, 39631874, 40847046, 41364798, 41184223, 40351522, 38945921, 37071348, 34843629, 32377906, 29783073, 27158174]
57067B7158174k572516k458453k300559k113066j911104j709450j516726j335740
57059A1240560j169448j021836q93428p81241o83505o00243n29436m67295m12551
57050D681577l66308l27687k93686k63313k37792k16561j97072j78660j62907
57041B437591j49969j38197j27420j19061j12922j07234j01804r7703r4025q8527
57031A300729q1432p5177p0292o4797n7755n0320m3233l6094k8946k1980j4128
57020G56575m359O591J8143L1833M8878O8275R0135J16434J42359J50438J22635
57009A547937O0019j5358p9016j19697j37913j38112j26426j10250r4576q0067
56999G06541o6468n5120m6752l9981l3729k8569k4540k0465j6341j3530j1852
$$ y = [27158174, 24585658, 22127205, 19826646, 17713580, 15802476, 14093026, 12576300, 11240560, 10071112, 9049276, 8155848, 7374607, 6691102, 6090859, 5561423, 5094128, 4681577, 4315269, 3987582, 3693896, 3430583, 3192791, 2976230, 2779158, 2600498, 2437591, 2287622, 2149425, 2022005, 1902944, 1790022, 1682788, 1580984, 1483281, 1389256, 1300729, 1219297, 1144120, 1073828, 1009031, 951276, 900956, 857723, 821629, 792683, 770703, 756575, 752216, 758807, 776950, 808783, 857661, 925936, 1016071, 1132505, 1274864, 1425302, 1547937, 1607956, 1592598, 1513582, 1393885, 1255972, 1117860, 991434, 881184, 786608, 706541, 640073, 584953, 538201, 498220, 464491, 435922, 411382, 390917, 374576, 361046, 349194]
56988C49194r473o316m361l675j649K719O966Q699P956N076m29p594j3527j6692
56974C16894j8163j8763j7722j5062j2401j0383p946n063l298k868j933K45K323
56961B05860L909O557J0773J4866J7866K0681K3179K2879J8006R646l6r438j6823
56948C27925k0546k0986k0044j8357j5304j1735r613q654o438k421J351L989O902
56935B06069J0547J3488J5662J9133K4503K9555L2341L2407K8336J8012K866j1634
56923D21285k1433k7019l0041l0390k8189k5296k2739j9488j5330j2175j0895
56912A78290r806p853o427o415o325n039l762l547l506k964k675k585j235J236
56898A17387K455J706J350K887M642N176N752P505R186R942J1393J4784J8659
$$ y = [349194, 339721, 333405, 329044, 325369, 323720, 326439, 333405, 342104, 350060, 355136, 354707, 347113, 333586, 316894, 298731, 279968, 262246, 247184, 234783, 224400, 216454, 211391, 208093, 205225, 203292, 203537, 205860, 209769, 216326, 227099, 241965, 259831, 280512, 303691, 326570, 344576, 354222, 354186, 344748, 327925, 307379, 286393, 266349, 247992, 232688, 220953, 211340, 202686, 196248, 193827, 195178, 199167, 206069, 216616, 230104, 245766, 264899, 289402, 318957, 351298, 383705, 412041, 430053, 432919, 421285, 399852, 372833, 342792, 312402, 284213, 258917, 236178, 216690, 201360, 189185, 178290, 168484, 160631, 154204, 147789, 141464, 136425, 132663, 129116, 125610, 122646, 119971, 117386, 116151, 117387, 119842, 121548, 122898, 125785, 130427, 135603, 141355, 148860, 158046, 167988, 179381, 194165, 212824]
56885B12824K1424K3485K4762K2929J6508P440j458r168j4914j6896j4947j1948
56873B60041j0243q857o255l224p94K081O338J0621J3758J7156K2410K8676L4715
56860C66423M1339M9317N6524N9367N5442M3522K3682l27k1462l4827m1076m2930
56848E54994m1049l5568k8687k2536j6485r319k128L612Q902J5510K3250L1462
56836D81958M1245N3539O6752P8788Q9248R6483R4560P7184M4594M368l3868o2902
56824A031949p9310q3960q1069p4637o5928n5187m4026l4236k5694j7397r319
56813D61186j650O279J4750K2932L0900M0454N2163O3268O9878O9245N8807L6594
56801I24806N400k6082m9519o3004o9062o9376o4566n6757m8574m0504l2065k4297
$$ y = [212824, 234248, 257733, 282495, 305424, 321932, 329372, 327914, 318746, 303832, 286936, 271989, 260041, 249798, 240941, 234686, 231462, 230668, 232749, 239087, 249708, 263466, 280622, 303032, 331708, 366423, 407762, 457079, 513603, 572970, 628412, 671934, 695616, 695289, 673827, 639000, 597924, 554994, 513945, 478377, 449690, 427154, 410669, 401350, 399222, 402834, 411736, 427246, 450496, 481958, 523203, 576742, 643494, 722282, 811530, 908013, 1002573, 1079757, 1124351, 1128719, 1094851, 1031949, 952639, 868679, 787610, 712973, 647045, 591858, 547832, 513596, 487902, 470505, 461186, 459536, 465815, 480565, 503497, 534397, 574851, 627014, 690282, 760160, 829405, 888212, 924806, 930206, 904124, 854605, 791601, 722539, 653163, 588597, 531840, 483266, 442762, 410697, 386400]
56789C86400j8467j3624q077k153K940P700J3312J9384K4928L0166L4816L6084
56777E13409L0890J9255L649j3388k9014l9623m3537m2853m0408l6513l0812k5123
56765B65932k1494j9179j6403j3581j1973j0887r150p742p890q163o614m346l646
56752A24864l983l256j842j844l115l519k593j793j513q51j7r1p61q48o18j103
56736I7117j770j372m60n01j177j043k78k25q05p83p5L72M33N08J98p37j141j55
56718H8106J133J594K074L353L988K751J369J891L053K419O28R9Q42R13Q3k88
56702A14008j86n86r80l38L94k30j163n01R54J044J75M33J623J742P84N32J005
56685A18710N84o62j047m78m20r13o61K32M92L00P76J430J015K58P09J592J046
$$ y = [386400, 367933, 354309, 346232, 344079, 347019, 354719, 368031, 387415, 412343, 442509, 477325, 513409, 544299, 563554, 567203, 553815, 524801, 485178, 441641, 398788, 358380, 321867, 291055, 265932, 244438, 225259, 208856, 195275, 183302, 172415, 163265, 155523, 147633, 139470, 132856, 128510, 124864, 120881, 117625, 115783, 113939, 110824, 107305, 104712, 102919, 101406, 100555, 100538, 100447, 99686, 98838, 98220, 97117, 95347, 93975, 93515, 93014, 91837, 90794, 90516, 90291, 89486, 88703, 88628, 89000, 89433, 89941, 90139, 89402, 88261, 88106, 89239, 90833, 92907, 96260, 100248, 102999, 104368, 106259, 109312, 111731, 112359, 112458, 113300, 114213, 114296, 114008, 113822, 113236, 112256, 111918, 112312, 112082, 110919, 110418, 111372, 112416, 112591, 113024, 114647, 116389, 117173, 117705, 118710, 119294, 118632, 117585, 117107, 116687, 115774, 115113, 115345, 115837, 116137, 116913, 118343, 119358, 119616, 120325, 121917, 122963]
56668A22963k31R8J936K967K553K168K326K294K412L505M524L952K892L436M704
56653A62499M204K373J861K753K604J025J67M86Q9j409k167j740j754k571k768
56638A65652k325k805m010l950k566j966k548k411j113n04j191j535r42q59j798
56623A35129k367j922j416j139m44K29j92r16k85J039J057K15O10J842J600K05
56607A33245M50K650M053L525K776K471J318l31l06J246J574J46m37P82J550P28
56591A55440L3K67j24j371j343L19J065l5n62Q10K021J535Q71J260J406M62j10
56574A61944M60O77r8k42P58R35m80j330k97R52J155J645L249M314L863L615M829
56557A85949O108O252O289O800O228L901J814J492J785J518J488K112J972M80
$$ y = [122963, 122732, 122830, 124766, 127733, 130286, 132454, 134780, 137074, 139486, 142991, 147515, 151467, 154359, 157795, 162499, 166703, 169076, 170937, 173690, 176294, 177319, 177486, 177972, 178061, 176652, 174485, 172745, 170991, 168420, 165652, 163327, 160522, 156512, 152562, 149996, 148030, 145482, 143071, 141958, 141454, 140263, 138728, 137786, 136927, 135129, 132762, 130840, 129424, 128285, 127841, 128070, 127878, 126962, 126677, 127716, 128773, 128988, 129598, 131440, 133040, 133245, 133695, 136345, 140398, 143923, 146699, 149170, 150488, 150157, 149851, 151097, 152671, 152817, 152380, 153162, 154712, 155440, 155473, 155740, 155616, 154245, 152902, 153221, 154286, 154251, 153689, 154499, 156520, 158055, 158926, 160186, 161592, 162054, 161944, 162404, 163081, 162983, 162741, 163499, 164434, 163954, 162624, 162327, 163279, 164434, 166079, 169328, 173642, 177505, 181120, 185949, 192057, 198309, 204598, 211398, 217626, 221527, 223341, 224833, 226618, 228136, 229624, 231736, 233708, 234188]
56543B34188p92j001j421k520k687j426o49j199j332l21j02j542k453j428l90
56528B14925j064k157k187k050k623k806k109k136l390l700k015o03j227k177
56514A84681j468n4N21P54J164N65j319k311j158K83L04p7J27l13k020l104k440
56497A74135j805k422k562j051P5q06j852j092J09j29q04l43L19j07n93%N96K99
56479A61967M98J996K874J749L99M92O90l28r57K23J452R28J24Q30J729J067J08
56462A75841O02J414R17K52J004J957J390L22M40J024Q22P05J521J835N80n32
56446A90094j7N69l43j319p99q1m20k67J421K311O08j327r69o1j106k511j532
56429A84251O87J337Q78J374K156J434K21M88J290P53o8P53K077J818R66J521
$$ y = [234188, 233396, 232395, 230974, 228454, 225767, 224341, 223692, 222493, 221161, 220840, 220738, 219196, 216743, 215315, 214925, 213861, 211704, 209517, 207467, 204844, 202038, 199929, 197793, 194403, 190703, 188688, 188085, 186858, 184681, 183213, 183159, 183680, 184434, 185598, 186163, 184844, 182533, 181375, 181658, 181962, 181885, 182012, 181699, 179679, 176575, 174135, 172330, 169908, 167346, 166295, 166370, 165564, 163712, 162620, 162729, 162600, 161796, 161453, 161772, 161665, 161072, 161072, 161668, 161967, 162465, 164461, 167335, 169084, 169483, 169975, 170665, 170337, 169380, 169603, 171055, 171983, 172107, 172937, 174666, 175733, 175841, 176443, 177857, 178774, 179026, 180030, 181987, 183377, 183699, 184139, 185163, 185985, 186690, 188211, 190046, 190626, 190094, 190077, 190646, 190303, 188984, 188185, 188104, 187684, 187417, 188838, 191149, 191757, 190430, 189461, 189400, 188294, 185783, 184251, 184938, 186275, 187153, 188527, 190683, 192117, 192338, 192826, 194116, 194869, 194801, 195554, 197631, 199449, 200415, 201936]
56413B01936K393J533J53O84K268K435J546J494J752P59m32k4O72o06k640k624
56397B11299j001l92j043j286j200j905k585j894r02j169j624q17j92j375k472
56382A91442j190O18p7k109k313j099j033j618m77J679K207J525K193L992M484
56367A98224L579L175L241K412J458J983K884K131P80J035J947J237j69J18J305
56352B25340J079K84J187K735K333Q56R10J675N70j319q56J334J960R45Q86J656
56336B41575R00q43q33P00J172O85J438K891K702J615K212L654L008R67Q13K396
56320B65052K696J660J912L207K862J236J098J991R95j273j359N75R71n19o51
56305B80453J045J592N74R08L052M172L746M368O342O884N423M401M252K832K86
$$ y = [201936, 204329, 205862, 206015, 206699, 208967, 211402, 212948, 214442, 216194, 216953, 216521, 216497, 217169, 216563, 213923, 211299, 210298, 209906, 208863, 207577, 206377, 204472, 201887, 199993, 199091, 197922, 196298, 195481, 195289, 193914, 191442, 190252, 190870, 190793, 188684, 186371, 185272, 184239, 182621, 182144, 183823, 186030, 187555, 189748, 193740, 198224, 201803, 204978, 208219, 210631, 212089, 214072, 216956, 219087, 219867, 220902, 222849, 224086, 223917, 224035, 225340, 226419, 226703, 227890, 230625, 232958, 233814, 234724, 236399, 236969, 235650, 234794, 236128, 238088, 239033, 239919, 241575, 242475, 241632, 240799, 241499, 242671, 243356, 244794, 247685, 250387, 252002, 254214, 257868, 260876, 261843, 262656, 265052, 267748, 269408, 271320, 274527, 277389, 278625, 279723, 281714, 282709, 281436, 280077, 280652, 281623, 281104, 280453, 281498, 283090, 283664, 284572, 287624, 291796, 295542, 299910, 306252, 313136, 318559, 322960, 327212, 330044, 330330]
56290C30330o98J7j57j392j228L93J131J130K555M508M085K203K408M179L735
56275C53199J332J113L529M747M028M717P174P782O128O176Q824J0184Q849Q209
56261D35991R711J0413R137Q694J0018J0348R111R489J2147J3714J3323J4443
56249E66539J8202K1182K1988K3777K8113L2342L5263L9284M4802M8535M9617
56238I29644N1284N4411N5625N3919N2581N2257M8763M0500L1537K4466J6561
56227A411548O035m237j2378k0709l0115l7233m0459m3010m6767m8880m7648m6020
56215A040127m6052m5389m2384l9268l7286l4227k9541k6325k5583k4164k0934
56204F68974j8957j9075j7664j3511j0540j0671j0493q127o778q099q609o281
$$ y = [330330, 329632, 329649, 329492, 328100, 326872, 327265, 328396, 329526, 332081, 336589, 340674, 342877, 345285, 349464, 353199, 354531, 355644, 359173, 363920, 367948, 372665, 379839, 387621, 393749, 399925, 408749, 418933, 427782, 435991, 445702, 456115, 465252, 473946, 483964, 494312, 503423, 512912, 525059, 538773, 552096, 566539, 584741, 605923, 627911, 651688, 679801, 712143, 747406, 786690, 831492, 880027, 929644, 980928, 1035339, 1090964, 1144883, 1197464, 1249721, 1298484, 1338984, 1370521, 1394987, 1411548, 1417583, 1413346, 1400968, 1380259, 1350144, 1312911, 1272452, 1229442, 1182675, 1133795, 1086147, 1040127, 994075, 948686, 906302, 867034, 829748, 795521, 765980, 739655, 714072, 689908, 668974, 650017, 630942, 613278, 599767, 589227, 578556, 568063, 559936, 553158, 545059, 536450, 530169]
56192E30169m278m573m226j679k93j847k867j205Q3q67r68J354K557Q49J20K754
56176E15083M981L703J648J471J072r96j740L36J728N37J85K575M136K838K304
56161E39861M603N922L924K478M315N987M902M325O474P774O120N618Q791J1258
56147F22352R671P814R196J0748R635R140J1815J3804J2058J0262J1670J3143
56135G51308J2288J3249J9112K5795K9775L4683M3837N3767O1657P1524Q6014
56124A203009R9647J07328J11890J15845J13699J00752Q2455O6839N4468M3471
56114B099403L7006L7055L7535L2034K2455J2728J233j2747k2646k3527k0704
56103B199825k1536k5608l0799m0956n8424p6354q7497r3701r8351r7487q7746
$$ y = [530169, 525891, 521318, 517092, 515413, 515120, 513273, 510406, 509201, 509284, 508417, 507449, 508803, 511360, 512209, 512329, 515083, 520064, 523767, 525415, 526886, 527958, 526962, 525222, 525558, 527286, 527823, 528008, 530583, 534719, 537557, 539861, 544464, 550386, 554310, 556788, 561103, 567090, 571992, 576317, 582791, 590565, 596685, 602303, 611094, 622352, 632023, 639837, 649033, 659781, 669416, 678556, 690371, 704175, 716233, 726495, 738165, 751308, 763596, 776845, 795957, 821752, 851527, 886210, 930047, 983814, 1045471, 1116995, 1203009, 1302656, 1409984, 1521874, 1637719, 1751418, 1852170, 1934625, 2001464, 2055932, 2099403, 2136409, 2173464, 2210999, 2243033, 2265488, 2278216, 2279449, 2266702, 2244056, 2220529, 2199825, 2178289, 2152681, 2121882, 2080926, 2022502, 1946148, 1858651, 1764950, 1666599, 1569112, 1481366]
56092A481366p5159o6321n8267m6547l5316k9497k4977j6904r799q888r448n509
56080A094734j154j969l479L83N373N295M191Q015J2245J0454P361J0339J5470
56067A167258J5342J3233J6078K0578J9997J7741K0325K3913K1781J8029J9721
56056A373996K2592J9059J3359J3734J6691J4240R843J1573J6121J5420J2703
56045A539331J5911K1662K1841J9659K2869K7642K5824K1610K4043K9573K9302
56034A799267K6757L0740L7268L6898L3349L6344M2614M2741M0135M4039N0593
56023B220745N0398M7773N2333N8920N6771N1220N4577O2905O4140O1786O7338
56012B848906P6586P7462P4230P9316Q8408Q8846Q5461R1825J03258J05603J03385
$$ y = [1481366, 1406207, 1339886, 1281619, 1235072, 1199756, 1170259, 1145282, 1128378, 1118579, 1109691, 1100243, 1094734, 1093580, 1091611, 1088132, 1088515, 1093888, 1099183, 1103374, 1111389, 1123634, 1134088, 1141449, 1151788, 1167258, 1182600, 1195833, 1211911, 1232489, 1252486, 1270227, 1290552, 1314465, 1336246, 1354275, 1373996, 1396588, 1415647, 1429006, 1442740, 1459431, 1473671, 1483514, 1495087, 1511208, 1526628, 1539331, 1555242, 1576904, 1598745, 1618404, 1641273, 1668915, 1694739, 1716349, 1740392, 1769965, 1799267, 1826024, 1856764, 1894032, 1930930, 1964279, 2000623, 2043237, 2085978, 2126113, 2170152, 2220745, 2271143, 2318916, 2371249, 2430169, 2486940, 2538160, 2592737, 2655642, 2719782, 2781568, 2848906, 2925492, 3002954, 3077184, 3156500, 3244908, 3333754, 3419215, 3511040, 3614298, 3719901, 3823286]
56001C823286J11204J24525J28239J26909J36257J51879J57775J58790J71912
55992E090776J92379K02245K05631K20472K42413K53559K59738K80806L11099
55983G259118L29610L42163L71343M11993M41005M63922N04915N58027N98157
55974A1280253O33196O92600P71403Q41534R11359J014176J145055J273451J410982
55965A9974009J597595J828769K072609K351348K723113L192020L729491M376265
55957D1845219N218660O272076P507301Q985543J0833378J3099341J5807363J9141294
55949A28710175K3345640K8395781L3955908L9543656M4160735M5547418M0595958
55942C84255271K7628434Q592980j1467098k7508560l7171235m0895102m0340304
$$ y = [3823286, 3934490, 4059015, 4187254, 4314163, 4450420, 4602299, 4760074, 4918864, 5090776, 5283155, 5485400, 5691031, 5911503, 6153916, 6407475, 6667213, 6948019, 7259118, 7588728, 7930891, 8302234, 8714227, 9155232, 9619154, 10124069, 10682096, 11280253, 11913449, 12606049, 13377452, 14218986, 15130345, 16144521, 17289576, 18563027, 19974009, 21571604, 23400373, 25472982, 27824330, 30547443, 33739463, 37468954, 41845219, 47063879, 53335955, 60843256, 69828799, 80662177, 93761518, 109568881, 128710175, 152055815, 180451596, 214407504, 253951160, 298111895, 343659313, 384255271, 411883705, 420476685, 409009587, 381501027, 344329792, 303434690, 263094386]
55935B63094386l7154906l2696392k8001276k3647308j9803245j6502170j3775642
55928I1513447j1574593r763874q252583p026803o046785n222695m506555l912068
55920C5207491l429634l006282k620478k297885k040515j810440j593843j415420
55912A6992994j278595j151844j024433r19587q42639p68502o89752o27766n87035
55903I102841n44784m94475m55638m32216m03198l62993l31111l13449k92091
55894E472886k61633k39019k28970k14680j91237j74834j70404j62108j44260
55885C685741j31024j27160j18718j01084q7845q3530p4802n6807m2033l5011
55875B827727k3622l787J1700J6734K0639K5503J8085p100l7800o4641r1051j16039
$$ y = [263094386, 225939480, 193243088, 165241812, 141594504, 121791259, 105289089, 91513447, 79938854, 70174980, 61922397, 54895594, 48848809, 43626114, 39119559, 35207491, 31777857, 28771575, 26151097, 23853212, 21812697, 20002257, 18408414, 16992994, 15714399, 14562555, 13538122, 12618535, 11775896, 11007394, 10317642, 9689876, 9102841, 8558057, 8063582, 7607944, 7175728, 6772530, 6409537, 6078426, 5764977, 5472886, 5211253, 4972234, 4743264, 4528584, 4337347, 4162513, 3992109, 3830001, 3685741, 3554717, 3427557, 3308839, 3207755, 3119910, 3036380, 2961578, 2904771, 2862738, 2827727, 2804105, 2800318, 2812018, 2828752, 2849391, 2874894, 2892979, 2885879, 2848079, 2783438, 2692387, 2576348]
55863B576348j28300j25439j19498j16281j08000r2578q0659p6550p1114o0464
55853A597465n3376n3260n0984m2654l6943l7792l6940l0658k7060k9828l0961
55842A167009k6699k4601k7933k8784k3667k0456k2885k3332j8078j4775j7487
55831I18312j8921j4836j1996j4362j5261j0787p576r760j1210q178o968j1478
55819G76979j5420j4212j2791j4551j4383r840p386j0407j2342q896n797p281
55807F43673q033l971j77o61o74L459O946O190N884R289J1306Q310N250N814N133
55792F97738m53n787o442o815j1161j5270j4714j2955j3784j3648r052m027l008
55779E80622l505k625l478q286j2318j1512r230r012p733k523K699M342N987J1322
$$ y = [2576348, 2448048, 2322609, 2203111, 2086830, 1978830, 1886252, 1805593, 1729043, 1657929, 1597465, 1544089, 1490829, 1439845, 1397191, 1360248, 1322456, 1285516, 1254858, 1227798, 1197970, 1167009, 1140310, 1115709, 1087776, 1058992, 1035325, 1014869, 991984, 968652, 950574, 935799, 918312, 899391, 884555, 872559, 858197, 842936, 832149, 824573, 814813, 803603, 795425, 788457, 776979, 761559, 747347, 734556, 720005, 705622, 695782, 688396, 677989, 665647, 656751, 650954, 643673, 635640, 631669, 631492, 630831, 630157, 633616, 640562, 646752, 652636, 661925, 673231, 681541, 686791, 692605, 697738, 697285, 691498, 685056, 678241, 667080, 651810, 637096, 624141, 610357, 596709, 587657, 583630, 580622, 577117, 574492, 571014, 562728, 550410, 538898, 529668, 520656, 512923, 510400, 513099, 517441, 523428, 534750]
55765E34750J6586J6645J2620P497M38q558j4674j5105j3966j4891j5070j2111
55753D94161r888j1427j2755j0189p414q753j1530j1651j0899j2135j2902j0338
55741C64280p190o639o313l485r70j789l143j708J85n35j757r37n01k697m377
55726C22424k890j755m345p204o040l301l196m098k560l54p50k010j143l2j477
55711B81269k968r28K621L876M021N964P928O601L425J747Q12j666m225m639m843
55696B98995p251r477q330n744n200n573m201k632l470m784l492j219j031j475
55682B35116K87K501J946J79O95K517K505J478K125L230J871q03j648j283k296
55667B48420l819l318j785j847k715k095j006j567k296p26J562J788J380L180
$$ y = [534750, 551336, 567981, 580601, 588098, 588536, 579978, 565304, 550199, 536233, 521342, 506272, 494161, 484273, 472846, 460091, 449902, 442488, 433735, 422205, 410554, 399655, 387520, 374618, 364280, 357090, 350451, 344138, 340653, 339683, 337894, 334751, 333043, 333228, 332693, 330936, 329999, 329498, 326801, 322424, 319534, 317779, 313434, 306230, 300190, 296889, 293693, 289595, 287035, 286681, 285931, 283921, 282778, 282746, 281269, 278301, 277373, 279994, 283870, 287891, 293855, 301783, 308384, 311809, 313556, 314368, 312702, 308477, 303838, 298995, 291744, 282267, 273937, 268193, 262993, 257420, 253219, 250587, 247117, 242333, 238841, 237622, 236591, 235116, 235403, 237904, 239850, 240029, 240724, 243241, 245746, 247224, 249349, 252579, 254450, 253647, 251999, 250716, 248420, 244601, 241283, 239498, 237651, 234936, 232841, 231835, 230268, 227972, 227246, 228808, 230596, 231976, 235156]
55653B35156N649N515M050M814O994O874M505L108L012J718r09k694l549n005
55639B69238o350n851m663n067o105n418l973m344n819n739m291l478k910j172
55625B04058L37m52j912j264L29n5j598j473k88n84j500m07J476P37j957k772
55609A92675j244n18j498j969j303j157j568j068l96j610l722l697j516mM4K58
55593A71707P37J02r19k89J268J176l96r56k92m28j437j427m47l40j011p18L11
55576A66641L82j10N60J810J800J298K502M732N505N067N623O829O430M743M070
55561B17882M173K794J86j269j613k957m948n138l664l124l908m018l356l773
55547A87267m937m572k806j998k339j954j127j860l400k870m84O18j35j06J334
$$ y = [235156, 240805, 246320, 250370, 255184, 262178, 269052, 273557, 276665, 279677, 281395, 280486, 277792, 274243, 269238, 262888, 257037, 252374, 247307, 241202, 235784, 231811, 227467, 221648, 215909, 211618, 208140, 205230, 204058, 204395, 203943, 202031, 200767, 201096, 201041, 199443, 197970, 197682, 197098, 195598, 195191, 196667, 197404, 195447, 192675, 191431, 190913, 189415, 187446, 186143, 184986, 183418, 182350, 181954, 180344, 176622, 172925, 171409, 171405, 171449, 171707, 172444, 172546, 171627, 171338, 172606, 173782, 173386, 172430, 172138, 171710, 170273, 168846, 168399, 168059, 167048, 166330, 166641, 167023, 166913, 167473, 169283, 171083, 172381, 174883, 179615, 185120, 190187, 195810, 202639, 209069, 213812, 217882, 222055, 224849, 225035, 223766, 222153, 219196, 214248, 209110, 205446, 202322, 198414, 194396, 191040, 187267, 182330, 177758, 174952, 172954, 170615, 168661, 167534, 165674, 162274, 159404, 158920, 159538, 159403, 159297, 160631]
55532A60631J817P79N13J623J921P23o9mq91k699k947j195L0k36N9J817L170L005
55514A68047K411J719k6j957j747Q0K28k017l573k726j433j298j284p80j070k291
55498A52283k602j723j709k972l224j704p25j547k313j637p79p45n47J99K24m86
55482A29993m9J713K370R88l06k09k24j198j362L21K016K106J493J177M04j049
55466A38184j568l71R86J203Q55M13o23j643r60J011J684M93j06J039J846Q77
55450A43320k94k69k10j070j511n44N22N88O56J449J794R94K76L70J99o44q83
55433A44743k81m81j774k072o69K39n77j187j62P93R7q62m64K88Q4j13P85J619
55415A40006J161N04J048K062K385K456K798K488J104O8J87mj544k889k425j078
$$ y = [160631, 162448, 163227, 163740, 165363, 167284, 168007, 167938, 167934, 167043, 164344, 161397, 160202, 160232, 159996, 160055, 161872, 165042, 168047, 170458, 172177, 172151, 170194, 168447, 168527, 168755, 166738, 163165, 160439, 159006, 157708, 156424, 155644, 154574, 152283, 149681, 147958, 146249, 143277, 140053, 138349, 137624, 136077, 133764, 132127, 131348, 130603, 130056, 130255, 130479, 129993, 129944, 131657, 134027, 135015, 134709, 134500, 134276, 133078, 131716, 132037, 134053, 136159, 137652, 138829, 139233, 138184, 136616, 136245, 137231, 138434, 139289, 139702, 139079, 137436, 136476, 137487, 139171, 139664, 139558, 140597, 142443, 143320, 143026, 142757, 142547, 141477, 139966, 139422, 139944, 140532, 141188, 142637, 144431, 145425, 145701, 146071, 146270, 145626, 144743, 144462, 143981, 142207, 140135, 139466, 139705, 139128, 137941, 137779, 138572, 138669, 137807, 137343, 137631, 137715, 137602, 138387, 140006, 141167, 141671, 142719, 144781, 147166, 149622, 152420, 154908, 156012, 156080, 156267, 156263, 154719, 151830, 149405, 148327]
55399A48327m80n11n25r52j841j876o50R5o95j510r97k95p09j313r78o05j152
55382A33333j437j78J567K133J780J489R77j50r13n19J75L35N91J257J137j61
55366A41416q67J45J232O40p34j238j167j374j175J50J406J254L85K9j68q23j105
55349A38006k78O63P35O90J244J384L48o30m73k28q95j293k67Q77M97o57j133
55332A38590j380k262k746j597Q5N93M17Q76J379O11p85j200o73k36J79R87J295
55315A34133L33o71k57P50P15j8q4K84qn94l84K38J60l39k95K2j62m73l08l18
55295A32724j047j395m82L51l89j548j037P62J769J396N96k94j344j516Q3K152
55279A30781K694J922J426J299M57q21j206o91m15m57MP10P10K68L59O05j67j639
$$ y = [148327, 147847, 147336, 146811, 145859, 144018, 142142, 141492, 141587, 140892, 139382, 138385, 138090, 137381, 136068, 135090, 134485, 133333, 131896, 131718, 133285, 135418, 137198, 138687, 139664, 139514, 138601, 138082, 138257, 138592, 139183, 140440, 141577, 141416, 140549, 140694, 141926, 142566, 141832, 140594, 139427, 138053, 136878, 137028, 138434, 139688, 140073, 140102, 139934, 139111, 138006, 137728, 138391, 139126, 139816, 141060, 142444, 142792, 142162, 141689, 141461, 140566, 139273, 139006, 139883, 140380, 139723, 138590, 137210, 134948, 132202, 130605, 130690, 131283, 131700, 132576, 133955, 134566, 133781, 132581, 131908, 131672, 131851, 132838, 134133, 134466, 133795, 133538, 134288, 135003, 134985, 134901, 135185, 135177, 134583, 134199, 134437, 134597, 134258, 133963, 133985, 133823, 133350, 133042, 132724, 131677, 130282, 129800, 130151, 129762, 128214, 127177, 127939, 129708, 131104, 131700, 131406, 130062, 128546, 128629, 130781, 133475, 135397, 136823, 138122, 138579, 137758, 136552, 135861, 135446, 134989, 134993, 135703, 136413, 136681, 137040, 137645, 137478, 135839]
55261A35839k304j841j285j021m58M45R59Q78O48M84L94O04R03M57o73j016L3
55244A33046Q97K24q57p41JL5j74M32J053L44q71q46K8qq90r66M0Q18R54J225
55224A33744J699J657J209R91O38m80j530j246j66K01j49j20K39R9j80L17R97
55207A37920O33k49k00N14M81r7K32J393J886J505J370J377K47j694k397j210
55191A41711J34J98m35o47k23N55J287J235J11j059j175p94j039j513j122l28
55175A36896l49p41j00J151J229R6l84M78J333J291J021R87O91J12j6L32M08K63
55157A44698O01J106P36k53m90K31P69O81N97N73K0o62m25M17N34q3j09O49R60
55138A50550M50R1J92J4m51l48J20j98j122j150q6N12jm33r0J46j98k12M78P28
$$ y = [135839, 133535, 131694, 130409, 129388, 128930, 129375, 130334, 131212, 131860, 132344, 132738, 133342, 134245, 134702, 134029, 133013, 133046, 133943, 134167, 133310, 132569, 132570, 132605, 132431, 132863, 133916, 134260, 133389, 132543, 132571, 132563, 131673, 130707, 130747, 131565, 132519, 133744, 135443, 137100, 138309, 139300, 139938, 139458, 137928, 136682, 136516, 136717, 136568, 136448, 136687, 136786, 136606, 136923, 137920, 138553, 138304, 138104, 138618, 139099, 139002, 139234, 140627, 142513, 144018, 145388, 146765, 147012, 145318, 142921, 141711, 141845, 142043, 141608, 140961, 140738, 141293, 142580, 143815, 143926, 142867, 141692, 140898, 139859, 138346, 137224, 136896, 136547, 135806, 135706, 136857, 138086, 138182, 137798, 138276, 139609, 140900, 141921, 142908, 143599, 143711, 143695, 144027, 144435, 144698, 145299, 146405, 147141, 146888, 146398, 146629, 147398, 148079, 148676, 149249, 149269, 148607, 148182, 148599, 149133, 149050, 148941, 149590, 150550, 151000, 151091, 151283, 151297, 150846, 150498, 150618, 150420, 149298, 148148, 148062, 148574, 148573, 148140, 148050, 148196, 147998, 147786, 148264, 148992]
55118A48992j85j229j223m28K67N87O57N85O65J060J201N91k2L84J314J507J108
55101A55831J253J803J563O10K47N78L65n69r82n63l93p15m82M09O46j42p04m00
55083A58355m9P4Q05K008K133P77l79k76r6j008k120k012q50J82M61lr31j537
55065A55534j032J71Q22N96J82k84j215k001j423J44R01L59j54m3k34r13p88N18
55047A51140J475J114M66N91J025J191J519K072J856N49o40q13n04k09N03J556
55031A62891J839R92J37r1m27j189j435q30m72q49r09j52K05n97j416j187n73
55014A55937l77p2P55J206P23L42Q52J341R17L41M80O45N7m91m8O73N25j01j26
54995A63579L56M76J34j45j63Q5P10J303R96r4o62j05O09O62N05M99Q2p70q88
$$ y = [148992, 148807, 147578, 146355, 145927, 146194, 146781, 147438, 148023, 148688, 149748, 150949, 151540, 151518, 151902, 153216, 154723, 155831, 157084, 158887, 160450, 161060, 161307, 161885, 162250, 161681, 160699, 160136, 159743, 159028, 158546, 158955, 159601, 159459, 158755, 158355, 158306, 158380, 159185, 161193, 163326, 164103, 163724, 163448, 163352, 162344, 160224, 158212, 157362, 157544, 158005, 158002, 157071, 155534, 154502, 154673, 155495, 156091, 156273, 155989, 154774, 152773, 151350, 151494, 152395, 152754, 152600, 152557, 152323, 151410, 150622, 151140, 152615, 153729, 154195, 154786, 155811, 157002, 158521, 160593, 162449, 162998, 162358, 161545, 161041, 160832, 161335, 162891, 164730, 165722, 165859, 165768, 165341, 164152, 162717, 161887, 161415, 160566, 159657, 159505, 159710, 159113, 157697, 156510, 155937, 155560, 155488, 156243, 157449, 158172, 158514, 159366, 160707, 161624, 161965, 162445, 163090, 163147, 162656, 162608, 163281, 163806, 163705, 163579, 163935, 164411, 164545, 164400, 164237, 164322, 165032, 166335, 167331, 167237, 166575, 166470, 167079, 167741, 168246, 168745, 168827, 168057, 167169]
54976A67169J38R83O91J52K49K19p34j719j635r91p56o85k69m1m25n47L06J220
54958A63325J144O60P49R95O05J86P37J754J995J452J100J261J507J647J645J181
54942A81943K63m44o30q16j141q15L94J414J487J181J023O63K93J090L027M125
54926A93057L339K402L129M743N752O746R023J1845J3395J3506J3239J2557J0583
54913C03316P437L881k06n030r249j1133j0983j0597j0715j0549r443p528n203
54900B23998l274k908m057m777l609j718j071j486j288j71O63O81M96M64M48O86
54884B03077J480K312K639K967L945N114N920P010Q993J0851J1289J0825J0649
54871B87071J0232Q096M383O57k455n456q231j0004j0836j1311j1074r477p361
$$ y = [167169, 167307, 168290, 168981, 169133, 169382, 169601, 168867, 167148, 165513, 164522, 163766, 163081, 162812, 162771, 162346, 161799, 162105, 163325, 164469, 165129, 165878, 166873, 167478, 167664, 168401, 170155, 172150, 173602, 174702, 175963, 177470, 179117, 180762, 181943, 182206, 181762, 181132, 180316, 179175, 178360, 178754, 180168, 181655, 182836, 183859, 184522, 184815, 185905, 188932, 193057, 196396, 198798, 201927, 206670, 212422, 219168, 228191, 240036, 253431, 266937, 280176, 292733, 303316, 310753, 314634, 314428, 309398, 300149, 289016, 278033, 267436, 256721, 246172, 236729, 229201, 223998, 220724, 217816, 213759, 208982, 205373, 203655, 202584, 201098, 199810, 199639, 200302, 200983, 201479, 201943, 202391, 203077, 204557, 206869, 209508, 212475, 216420, 221534, 227454, 234464, 243457, 254308, 265597, 276422, 287071, 297303, 305399, 309782, 310439, 307984, 302528, 294297, 284293, 273457, 262146, 251072, 241595, 234234]
54858B34234o361o505o323n227m080l406k802k143j861j934j907j865k111k222
54844A85487j680j075j273j812j622q74n66o92m99j43l46p39l65M31M05m18p82
54827A73437l67r9k93j41O64J388J479J085L38o24j073n05K55J14m50j51R28J537
54809A77522J394J301J405J126P27J072J851J801P79p7l61p71j395j414p54l97
54793A83809p28j049r39o82k70N88J434J558J386J814K338J671J55m48K82Q95
54777A91814O27M86J246K205K613K733K928L115L679N373P847R739J0643J1520
54763B56568J2821J3664J3296J1931R757O637L131K23k286n467r023j1122j1055
54750B89075j0242r981r929r476q922q423p387n769m475l695k396l68Q88M30n09
$$ y = [234234, 227873, 221368, 215045, 209818, 205738, 202332, 199530, 197387, 195526, 193592, 191685, 189820, 187709, 185487, 183807, 182732, 181459, 179647, 178025, 177151, 176585, 175893, 175394, 175251, 174905, 174166, 173801, 174232, 174637, 174219, 173437, 173070, 172971, 172678, 172537, 173201, 174589, 176068, 177153, 177491, 176867, 175794, 175289, 175544, 175658, 175208, 175057, 175985, 177522, 178916, 180217, 181622, 182748, 183475, 184547, 186398, 188199, 188978, 188901, 188540, 187769, 186374, 184960, 184206, 183809, 183081, 182032, 181093, 180411, 180141, 180729, 182163, 183721, 185107, 186921, 189259, 190930, 191085, 190637, 190919, 191814, 192441, 192927, 194173, 196378, 198991, 201724, 204652, 207767, 211446, 216819, 224666, 234405, 245048, 256568, 269389, 283053, 296349, 308280, 318037, 324674, 327805, 328028, 325742, 320275, 311252, 300130, 289075, 278833, 268852, 258923, 249447, 240525, 232102, 224715, 218946, 214471, 210776, 208380, 208012, 208900, 209330, 208821]
54735B08821l75N10Q70N53L81P81J595K575L295L303L042L779N919Q319R794J0416
54719B63578J0716J0655R976Q669O509L089j157n008p930j0359j2159j2271j0584
54706B53724q675p766p248o232n162m770m578l735k492j650j274j072j257j974
54692A95839k529k259j529j022o67j83J2m75j046q89k50M7p5r5l8m30j268j898
54674A81245j908j444p14K35J228J864J856J328P82P09R81P94l66j807k328j724
54658A80731r35o80p41o71l95M5O36J107J190J137J281J242N01m01m00L98Q14
54641A84859M96L56Q59J250R76N97O68Q10N45M2m76j091j552j298n30k11n72p60
54623A84968l85j43m21n34o4L28J71L8L03K41o46j475j215j98N59P92Q39Q02O50
$$ y = [208821, 208446, 208956, 209826, 210379, 210760, 211541, 213136, 215711, 219006, 222309, 225351, 229130, 235049, 243368, 253162, 263578, 274294, 284949, 294925, 303594, 310103, 313192, 312035, 307027, 299097, 288738, 276579, 264308, 253724, 245049, 237283, 230035, 223803, 218641, 213871, 209293, 205558, 203066, 201416, 200142, 199070, 197813, 195839, 193310, 191051, 189522, 188500, 187833, 187650, 187662, 187187, 186141, 185252, 185002, 185049, 184974, 184879, 184841, 184411, 183143, 181245, 179337, 177893, 177179, 177414, 178642, 180506, 182362, 183690, 184472, 185181, 186162, 186956, 186590, 184783, 182455, 180731, 179796, 179116, 178375, 177704, 177309, 177354, 177990, 179097, 180287, 181424, 182705, 183947, 184448, 184047, 183647, 184045, 184859, 185355, 185711, 186570, 187820, 188796, 189393, 190061, 190871, 191416, 191458, 190982, 189891, 188339, 187041, 186511, 186300, 185728, 184968, 184583, 184440, 184019, 183485, 183421, 183749, 183920, 183958, 184261, 184502, 183856, 182381, 181166, 180968, 181527, 182319, 183158, 183960, 184610]
54604A84610N37L77j80q54p57J60P37L43j68K1L67J39j89J12O46O19K14R5K00
54585A87029J20J4J66J94k71o51k16O29R10N00J14P3J2l43p83r27o07o1Q6m42
54565A85546q80k35J095J634R34J86K07K97j96m97J95J093R56l7p68r44j136j497
54547A85953j596j231n67K58R86J173Q71Q12J288J575J091M10L31P56J209J662
54531A94981J996J534J60r34p01K63P30O48P91J169J064L45l16m42j09M04O76
54514B02259K86n57r68n94j15l1J13N78N35n13j348n52J305K277J556N7j149j779
54496B01360j883j522r49m22J01N83O51K36j01n4m3k10R1R95J384N15n12k76P93
54477B00737J202P12L80P19J269J742K206K337J710P22J66M4j34k29K24Q82R73
$$ y = [184610, 185147, 185524, 185344, 184490, 183733, 183893, 184630, 184973, 184805, 184826, 185193, 185332, 185143, 185255, 185901, 186520, 186734, 186829, 187029, 187149, 187163, 187329, 187523, 187252, 186601, 186385, 187014, 187924, 188424, 188538, 188611, 188623, 188280, 187497, 186570, 185963, 185902, 185988, 185546, 184666, 184431, 185526, 187160, 188094, 188280, 188487, 188784, 188588, 188091, 188286, 189379, 190335, 190298, 189530, 188586, 187450, 185953, 184357, 183126, 182559, 182817, 183803, 184976, 185847, 186659, 187947, 189522, 190613, 191023, 191354, 192110, 193319, 194981, 196977, 198511, 198671, 197737, 197036, 197299, 198029, 198677, 199468, 200637, 201701, 202046, 201730, 201288, 201179, 201583, 202259, 202545, 201988, 201020, 200426, 200311, 200280, 200393, 200971, 201506, 200993, 199645, 199093, 200398, 202675, 204231, 204288, 203139, 201360, 199477, 197955, 197006, 196584, 196685, 197268, 197919, 198155, 198054, 198000, 197957, 197747, 197838, 198833, 200217, 200732, 200220, 199944, 200737, 201939, 202651, 203031, 203750, 205019, 206761, 208967, 211304, 213014, 213736, 213902, 213946, 213812, 213583, 213807, 214689, 215662]
54460B15662N76M20N95N46J93o0k23o12j032j078j016j305j602j287o70m71m15
54443B08221L62J662K290J744O94k28r02j091n26J88k7j264k432k668k025q09
54427B03189P63K111K524K031J329Q19M31L40Q84J772K166J671O09n71j537j931
54411B16600j753j602j812j762q17M57J000P24K73j31n39m09O55J730J526L73
54395B14513k66m0K3m93p59l02K59M66O97J199J643J944K359K499J507m04j794
54378B23051j896j450j268j100o00k06l23n02k25K20L36J87Q1j5j87k44j05KQ
54359B15764J37L60L46J22R6K40N5m61o07j36K27r6o34o19n4M87O60M81O1l55
54339B16074m53k86k87o53j033j061q50p18p40p82p03m11J08O78J008R13L82l67
$$ y = [215662, 216238, 216658, 217253, 217799, 217992, 217932, 217709, 217097, 216065, 214987, 213971, 212666, 211064, 209777, 209107, 208636, 208221, 208583, 210245, 212535, 214279, 214973, 214745, 213843, 212752, 212226, 212414, 212387, 211123, 208691, 206023, 203998, 203189, 203952, 206063, 208587, 210618, 211947, 212766, 213197, 213537, 214421, 216193, 218359, 220030, 220639, 220068, 218531, 216600, 214847, 213245, 211433, 209671, 208854, 209311, 210311, 211035, 211308, 211177, 210638, 210229, 210884, 212614, 214140, 214513, 214247, 214207, 214230, 213737, 212978, 212676, 212935, 213401, 214098, 215297, 216940, 218884, 221243, 223742, 225249, 224845, 223051, 221155, 219705, 218437, 217337, 216737, 216531, 216208, 215706, 215481, 215701, 216037, 216224, 216305, 216290, 216103, 215859, 215754, 215756, 215764, 215901, 216261, 216607, 216729, 216825, 217065, 217120, 216659, 216052, 215916, 216143, 216047, 215413, 214794, 214740, 215227, 215887, 216368, 216429, 216074, 215621, 215335, 215048, 214395, 213362, 212301, 211451, 210733, 209993, 209211, 208508, 208097, 208205, 208883, 209891, 210804, 211186, 210819]
54321B10819q55o96k28k66r58j463j216p49o44m23N44J665J826J068M41M39O86
54304B09990R18J193J275R27O39R71J322O21q84j789j556j074j063j217j188j234
54288B07851j449j390q34j30M95J095J414J091N55O74J386J715J333R12P61L66
54272B15845l38n31Q8O36M07l3J25O65Q06L04m25q31m72O45J749J969J459J142
54254B23210J264J163O73O39J555K710L147K797K168J639J435J587J589Q45l53
54239B46068j160j602k538l956m578l718k383j776j698j326o43k03j18j91n60
54224B19618j297j822j449l47O11P90K49m42o69k94Q6j25o29o03L2M33O8o82j295
54205B12233j625j522p66K24N59P4k99J90J194J935K071J647Q41M5m04p23j293
$$ y = [210819, 209964, 209268, 209040, 208774, 207816, 206353, 205137, 204388, 203744, 203321, 203865, 205530, 207356, 208424, 208865, 209304, 209990, 210908, 212101, 213376, 214303, 214942, 215913, 217235, 217856, 216972, 215183, 213627, 212553, 211490, 210273, 209085, 207851, 206402, 205012, 204178, 204048, 204543, 205638, 207052, 208143, 208698, 209372, 210758, 212473, 213806, 214718, 215479, 215845, 215507, 214976, 215064, 215700, 216107, 216074, 216199, 216864, 217670, 217974, 217549, 216718, 216246, 216891, 218640, 220609, 222068, 223210, 224474, 225637, 226310, 226949, 228504, 231214, 234361, 237158, 239326, 240965, 242400, 243987, 245576, 246421, 246068, 244908, 243306, 240768, 236812, 232234, 228516, 226133, 224357, 222659, 221333, 220690, 220487, 220369, 220178, 219618, 218321, 216499, 215050, 214703, 215314, 216104, 216353, 215911, 215242, 214948, 215034, 214909, 214280, 213677, 213709, 214142, 214210, 213528, 212233, 210608, 209086, 208320, 208544, 209103, 209177, 208878, 209068, 210262, 212197, 214268, 215915, 216756, 216801, 216397, 215674, 214381]
54188B14381j750j372l34L80M14L18L21Pn58o65k86k43p16q54m05k74q33j055
54170B06476k75N70M45j54j85K71M69K65q6o09j158j059j69N35L45K1M76J146
54152B07324Q67k28r92j042r70j037p87l3P41J076J013Q16O33M75K24j44k74K11
54134B07873R20R13Qq50q24j25O42J281J652J389N39j75l00j99k33j64J50L02
54116B12799J21P8M12P23R52J704K942L469K622J405R73R47M09l61m31J10L59
54099B29233J00o4K07P00J219J634J624J116O01M87N38M89N29N97K7j316k320
54082B35401j961p37R5J04k75o28o67j82M03J40r72j521o44O09Q55L78K25K85
54064B30908j88q88r02m35m78j067j275p64l5O74J457J906J471N56J24L07M92
$$ y = [214381, 212631, 211259, 210925, 211305, 211719, 212037, 212358, 212365, 211807, 211142, 210856, 210613, 209897, 209043, 208638, 208364, 207531, 206476, 206201, 206771, 207216, 207062, 206877, 207148, 207617, 207882, 207796, 207187, 206029, 204970, 204801, 205336, 205681, 205702, 206178, 207324, 208191, 207963, 206971, 205929, 204959, 203922, 203135, 203102, 203843, 204919, 205932, 206748, 207381, 207856, 208080, 207936, 207662, 207873, 208793, 209706, 209714, 208864, 208040, 207915, 208557, 209838, 211490, 212879, 213418, 213243, 212943, 212744, 212511, 212347, 212497, 212799, 212920, 212998, 213410, 214133, 215085, 216789, 219731, 223200, 225822, 227227, 228200, 229147, 229556, 229195, 228764, 228874, 229233, 229333, 229269, 229476, 230176, 231395, 233029, 234653, 235769, 236370, 236857, 237395, 237884, 238413, 239010, 239037, 237721, 235401, 233440, 232703, 232798, 232902, 232627, 231999, 231332, 231150, 231553, 231693, 230721, 229200, 228556, 229165, 230020, 230398, 230623, 230908, 230720, 229832, 228930, 228495, 228017, 226950, 225675, 224911, 224876, 225550, 227007, 228913, 230384, 230940, 231064, 231371, 231863]
54047B31863N10O73Q76Q06Q11J360J939J760J287J615K565K864K297K123K991
54032B56340L938M050L879M466N720O599O438N612M991M964N015M401L252K436
54018C22101K158J568L28m36K13J323J257M4q80q79o79q72j204j423j710k143
54002C18766k589l125l794m209m139m046m161l651j959k69k09j455k267k109k005
53987B78779k368k278j291k57J14J49J61k21j126j939k202k125j851j198l82m4
53971B61921k16k50L4J00k38n08n64p94j195j271j037j048j202p10M38J200J047
53954B55707O51O25P11P01J000J699K100J804J334J156J000O67O35J219J916K196
53938B75121K219K284K277K111K078K249K293K100J993K033J945J938K636L867
$$ y = [231863, 232373, 233046, 233922, 234728, 235539, 236899, 238838, 240598, 241885, 243500, 246065, 248929, 251226, 253349, 256340, 260278, 264328, 268207, 272673, 278393, 284992, 291430, 297042, 302033, 306997, 312012, 316413, 319665, 322101, 324259, 325827, 326155, 325719, 325932, 327255, 328512, 328556, 327676, 326797, 326118, 325246, 324042, 322619, 320909, 318766, 316177, 313052, 309258, 305049, 300910, 296864, 292703, 289052, 287093, 286824, 286615, 285160, 282893, 280784, 278779, 276411, 274133, 272842, 272585, 272699, 272848, 273009, 272788, 271662, 269723, 267521, 265396, 263545, 262347, 261965, 261921, 261705, 261455, 261489, 261589, 261351, 260843, 260279, 259485, 258290, 257019, 255982, 254934, 253732, 253022, 253460, 254660, 255707, 256358, 256983, 257694, 258395, 259395, 261094, 263194, 264998, 266332, 267488, 268488, 269155, 269790, 271009, 272925, 275121, 277340, 279624, 281901, 284012, 286090, 288339, 290632, 292732, 294725, 296758, 298703, 300641, 303277, 307144]
53924C07144M513M035L229K935K919K672K416K691L481M406N147N406N077M785
53910C60856N419O748P422O805N932O004O771P120O574N539M519L695K947J889
53896D38240L95q27q62N6O20K14l85m58m26r45j837k652l447m228m396l516k044
53879D13502o26P45K254L684N022P047J0546J5360K0789K6363L1390L4193L2569
53866F02838K5165J2414l276j8128k8719l3942l5048l3720l0760k6787k2852j9639
53854C87546j6856j4145j1809j0041q314o401n012m559m142k829j195m29m94m74
53840C00846k71o51j672k363k069j243p38r73j801k557k411j276k19k86j130j567
53824B79619j248r64j250j662j595j164q31o97m95o5M11N60J28p11j396j406o20
$$ y = [307144, 311657, 315692, 318921, 321856, 324775, 327447, 329863, 332554, 336035, 340441, 345588, 350994, 356071, 360856, 366275, 373023, 380445, 387250, 393182, 399186, 405957, 413077, 419651, 425190, 429709, 433404, 436351, 438240, 438635, 437808, 436946, 437002, 437622, 437836, 437451, 436993, 436567, 435622, 433785, 431133, 427686, 423458, 419062, 415546, 413502, 412876, 413621, 415875, 419559, 424581, 431628, 442174, 457534, 478323, 504686, 536076, 570269, 602838, 628003, 640417, 637141, 619013, 590294, 556352, 521304, 487584, 456824, 430037, 407185, 387546, 370690, 356545, 344736, 334695, 326381, 319980, 314968, 310409, 306267, 303438, 302243, 301814, 301320, 300846, 300575, 299924, 298252, 295889, 293820, 292577, 291839, 290866, 289065, 286508, 284097, 282821, 282602, 282316, 281186, 279619, 278371, 277407, 276157, 274495, 272900, 271736, 270905, 270208, 269713, 269648, 270059, 270619, 270747, 270036, 268640, 267234, 266614]
53807B66614O83J991K724K636K180K077K469K879L094L519M380N155N223M628
53793C10252L887L391L317L716M317M658M589M320L892L158K379K040J920J221
53779C57057Mn53Q7P76K20j342k810l794m449m498l683k770k804l602m053l799
53763C19987l518l572l489l012k659k845l137k776j641m26j09j127k743l500k708
53748B82725j318p83j279j747j438o76p1K46M22N45P19J027J252J050N05J49K23
53731B81551L14n8p25j030o01K08P22O65M09M05O26Q41J158J802K435K343J452
53714B92517N14K3l30p94q77q2J198K160K565K629K410J942J594J682J979K197
53698C11327K621L601M741N262N013M402L578K437J350J060J737K656L046K819
$$ y = [266614, 267297, 269288, 272012, 274648, 276828, 278905, 281374, 284253, 287347, 290866, 295246, 300401, 305624, 310252, 314139, 317530, 320847, 324563, 328880, 333538, 338127, 342447, 346339, 349497, 351876, 353916, 355836, 357057, 357061, 356508, 356595, 357371, 357591, 356249, 353439, 349645, 345196, 340698, 337015, 334245, 331441, 327839, 323786, 319987, 316469, 312897, 309408, 306396, 303737, 300892, 297755, 294979, 293338, 292912, 292803, 291676, 288933, 285433, 282725, 281407, 280624, 279345, 277598, 276160, 275484, 275413, 275659, 276081, 276626, 277345, 278372, 279624, 280674, 281179, 281328, 281551, 281865, 281807, 281082, 280052, 279451, 279659, 280381, 281046, 281455, 281860, 282486, 283327, 284485, 286287, 288722, 291065, 292517, 293031, 293054, 292724, 291930, 291053, 290971, 292169, 294329, 296894, 299523, 301933, 303875, 305469, 307151, 309130, 311327, 313948, 317549, 322290, 327552, 332565, 336967, 340545, 342982, 344332, 345392, 347129, 349785, 352831, 355650]
53684C55650K476K660L796N739P726R090J0060J1561J4201J7699K1397K5038K8781
53671E15874L2223L3368K9128J7805J428j4943k6708l2376l3087l0678k6776k2765
53659D42493j9394j6515j3737j1138q886o778m783l524l432l824l690k999k415
53646C41378k033j415o64m32p88r95n73J35N70N31Q2n13p31k66M57Q51J179K185
53628C38958L725M580L951K371Q88j00p73j220j296r50l39K94P74J144J658K385
53612C56050K936K916K551K438K684K798K448J949J806K119K570K795K699K557
53598C91316K728L120L092K218R30O6q2O0O8p9k47m28o42q93j189j475j589j487
53580C95487j392j467j497j174n83j41j51o31j399k149k605k756k794k703k284
$$ y = [355650, 358126, 360786, 364582, 370321, 378047, 387137, 397197, 408758, 422959, 440658, 462055, 487093, 515874, 548097, 581465, 610593, 628398, 629826, 614883, 588175, 555799, 522712, 492034, 465258, 442493, 423099, 406584, 392847, 381709, 372823, 366045, 361262, 357738, 354306, 350482, 346792, 343793, 341378, 339345, 337930, 337266, 336834, 336046, 335051, 334478, 334613, 335183, 335714, 335796, 335283, 334552, 334286, 334743, 335594, 336773, 338958, 342683, 347263, 351214, 353585, 354473, 354373, 353600, 352380, 351084, 350134, 349795, 350089, 350863, 352007, 353665, 356050, 358986, 361902, 364453, 366891, 369575, 372373, 374821, 376770, 378576, 380695, 383265, 386060, 388759, 391316, 394044, 397164, 400256, 402474, 403404, 403470, 403388, 403448, 403516, 403437, 403190, 402762, 402120, 401227, 400038, 398563, 396974, 395487, 394095, 392628, 391131, 389957, 389374, 389233, 389082, 388451, 387052, 384903, 382298, 379542, 376748, 374045, 371761]
53565C71761j696j421j497j262l43O97J094P93J86n07j045q90P2J031J149O86
53549C68808M34M60J93m05o95k20Q57K188L384L955L787L472L566L778L592L390
53533D00544M035N534P031Q004Q543Q557P835P008P300Q999J1054J2579J3813
53520E10836J5234J6599J7567J8545K0071K1717K2377K1537J9841J8298J7318
53509G19940J6625J5889J5280J5221J5766J6522J7207J7853J8293J8046J7105
53498I03747J6279J6185J6396J6218J5804J5739J5892J5757J5561J6018J7012
53487A080608J7576J7320J6861J6690J6525J6066J5522J5018J4282J3338J2785
53476A252591J2885J2958J2197J0695R188Q065P018N559L576J405o01k558m928
$$ y = [371761, 370065, 368644, 367147, 365885, 365542, 366239, 367333, 368126, 368312, 367805, 366760, 365870, 365942, 366973, 368122, 368808, 369242, 369702, 369895, 369490, 368795, 368575, 369432, 371620, 375004, 378959, 382746, 386218, 389784, 393562, 397154, 400544, 404579, 410113, 417144, 425148, 433691, 442248, 450083, 457091, 464391, 473390, 484444, 497023, 510836, 526070, 542669, 560236, 578781, 598852, 620569, 642946, 664483, 684324, 702622, 719940, 736565, 752454, 767734, 782955, 798721, 815243, 832450, 850303, 868596, 886642, 903747, 920026, 936211, 952607, 968825, 984629, 1000368, 1016260, 1032017, 1047578, 1063596, 1080608, 1098184, 1115504, 1132365, 1149055, 1165580, 1181646, 1197168, 1212186, 1226468, 1239806, 1252591, 1265476, 1278434, 1290631, 1301326, 1310514, 1318579, 1325597, 1331156, 1334732, 1336137, 1335536, 1332978, 1328050]
53463A328050p712j0202j1863j3093j4525j5949j6650j6597j6501j6821j7423
53452A170714j8169j9064j9858k0274k0575k1143k1521k0795j8981j7141j5918
53441I57275j4943j3831j2797j1941j0771q988p038n344l656j611N40K297L577
53428H72769M558N178N137M308K954J800J762L168N226O745P450Q141R597J1868
53414I50661J4617J7463J9963K1830K3309K4843K6325K7331K7984K8876L0121
53403A213323L1293L2343L3729L5562L7375L8991M0770M2813M4736M6393M8027
53392A645355M9483N0118M9891M9654N0055N0812N1398N1591N1116M9626M7424
53381B196523M5324M3393M0708L6842L2739K9456K6816K3925K0375J6328J2050
$$ y = [1328050, 1320338, 1310136, 1298273, 1285180, 1270655, 1254706, 1238056, 1221459, 1204958, 1188137, 1170714, 1152545, 1133481, 1113623, 1093349, 1072774, 1051631, 1030110, 1009315, 990334, 973193, 957275, 942332, 928501, 915704, 903763, 892992, 884004, 876966, 871622, 867966, 866355, 866895, 869192, 872769, 877327, 882505, 887642, 891950, 894904, 896704, 898466, 901634, 906860, 913605, 921055, 929196, 938793, 950661, 965278, 982741, 1002704, 1024534, 1047843, 1072686, 1099011, 1126342, 1154326, 1183202, 1213323, 1244616, 1276959, 1310688, 1346250, 1383625, 1422616, 1463386, 1506199, 1550935, 1597328, 1645355, 1694838, 1744956, 1794847, 1844501, 1894556, 1945368, 1996766, 2048357, 2099473, 2149099, 2196523, 2241847, 2285240, 2325948, 2362790, 2395529, 2424985, 2451801, 2475726, 2496101, 2512429, 2524479]
53370B524479P946M492J572j625n623j0095j4701j9683k5202l0718l5729m0495
53358B354618m5334m9744n2922n4754n5752n6323n6592n6543n5917n4344n1949
53347A764444m9461m7391m5617m4037m2954m2472m2106m1464m0708m0021l9164
53336A289049l7921l6395l4570l2273k9825k7888k6349k4292k1441j8644j6500
53325I82951j4606j2738j1522j1127j0519r064p666p164o707n164l149k054j779
53312H79692j091K40J389K350L998O280P861Q045P706P905Q713R814J1301J3289
53298I67492J5428J7266J8675J9741K0647K1708K3050K4315K5140K5767K6573
53287A205802K7273K7239K6449K5359K4051K2339K0514J9065J7677J5520J2593
$$ y = [2524479, 2532425, 2536917, 2538489, 2536864, 2531241, 2521146, 2506445, 2486762, 2461560, 2430842, 2395113, 2354618, 2309284, 2259540, 2206618, 2151864, 2096112, 2039789, 1983197, 1926654, 1870737, 1816393, 1764444, 1714983, 1667592, 1621975, 1577938, 1534984, 1492512, 1450406, 1408942, 1368234, 1328213, 1289049, 1251128, 1214733, 1180163, 1147890, 1118065, 1090177, 1063828, 1039536, 1018095, 999451, 982951, 968345, 955607, 944085, 932958, 922439, 913375, 905709, 898545, 891838, 886674, 883525, 881471, 879692, 878601, 878841, 880230, 882580, 886578, 892858, 900719, 908764, 916470, 924375, 933088, 942902, 954203, 967492, 982920, 1000186, 1018861, 1038602, 1059249, 1080957, 1104007, 1128322, 1153462, 1179229, 1205802, 1233075, 1260314, 1286763, 1312122, 1336173, 1358512, 1379026, 1398091, 1415768, 1431288, 1443881]
53276A443881R874P868N985L583Q89j525l507n192o709q318j0341j2662j4783
53263A409043j6595j8489k0544k2196k3169k4143k5919k8168k9647k9657k8890
53252A141626k8714k9686l0939l1121k9867k8071k6722k5901k5167k4485k4117
53241H36836k3954k3603k3058k2661k2395k1757k0523j9130j8095j7398j6642
53230F07620j5548j4154j2632j1098r567q135p103o706o734o727o644o839p231
53217D88502p113o218n388n615o747p740p897p308o362n465n037n167n405n320
53203D01720n081n002m889m437l895l720l837l878l923m231m519m269l606l115
53189C43318k934k732k453k295k144j793j576j914k344k024j113o03p44p82m01
$$ y = [1443881, 1453755, 1461623, 1467608, 1471191, 1472080, 1470555, 1467048, 1461856, 1455147, 1446829, 1436488, 1423826, 1409043, 1392448, 1373959, 1353415, 1331219, 1308050, 1283907, 1257988, 1229820, 1200173, 1170516, 1141626, 1112912, 1083226, 1052287, 1021166, 991299, 963228, 936506, 910605, 885438, 860953, 836836, 812882, 789279, 766221, 743560, 721165, 699408, 678885, 659755, 641660, 624262, 607620, 592072, 577918, 565286, 554188, 544621, 536486, 529383, 522677, 515943, 509216, 502572, 495733, 488502, 481389, 475171, 469783, 464168, 457421, 449681, 441784, 434476, 428114, 422649, 417612, 412445, 407040, 401720, 396639, 391637, 386748, 382311, 378416, 374696, 370859, 366981, 363058, 358827, 354308, 350039, 346433, 343318, 340384, 337652, 335199, 332904, 330760, 328967, 327391, 325477, 323133, 321109, 319996, 319393, 318649, 317867, 317466]
53174C17466k97q31j314j156p51n82l36K22L41p14k187k435r34J127K233J898
53158C11750O39p62j671j777j187l88J12J66N7J38M12N43L75K06L94Q70J264J359
53140C12500J098M03n78j244j032j46P07J203J597K098K577K892L004K775K157
53125C30011J589J568J823J594Q35L89P20J262J442J563K043K404J884P93L18
53110C50238R25J686J445J67j239k090k464k686k744k484k084j912j967j892j660
53095C31239j744k335k796k377j292n48p65j583k213k243j822j376j228j334j349
53080C06234j085p32n58n40n54o23p68q02o09l35p7K86O51N64j9l34K02J031J169
53061C03101N69k1k66m18m76j35M82Q31P82N77M6j185k569k826j615j41M08J40
$$ y = [317466, 317169, 316338, 315024, 313868, 313117, 312535, 312199, 312421, 312762, 312048, 309861, 307426, 306492, 307619, 309852, 311750, 312389, 311627, 309956, 308179, 306992, 306604, 306716, 306882, 306939, 307077, 307489, 308032, 308407, 308613, 309007, 309877, 311141, 312500, 313598, 314001, 313423, 312179, 311147, 311001, 311708, 312911, 314508, 316606, 319183, 322075, 325079, 327854, 330011, 331600, 333168, 334991, 336585, 337420, 337809, 338529, 339791, 341233, 342796, 344839, 347243, 349127, 349920, 350238, 351163, 352849, 354294, 354461, 353222, 351132, 348668, 345982, 343238, 340754, 338670, 336758, 334791, 332899, 331239, 329495, 327160, 324364, 321987, 320695, 320147, 319382, 317799, 315586, 313343, 311521, 310145, 308917, 307583, 306234, 305149, 304417, 303859, 303319, 302765, 302142, 301374, 300572, 299963, 299628, 299551, 299837, 300488, 301052, 301033, 300699, 300901, 301932, 303101, 303670, 303649, 303383, 302965, 302489, 302354, 302836, 303667, 304449, 305026, 305072, 303887, 301318, 298492, 296877, 296736, 297144, 297284]
53043B97284k22n08q70j013n33K64N72L4r19j607j657j176o34n08q64j293j320
53026B85030p69J24Q15Q17K97Q5O64J439J577J279J434K118K400J821J118J139
53010C01388J754K215K000R97n07j719j840r98j48J91M20P90P32j90j326j712
52994C02047j262o47l37l55n94q34p55l82j49j77N9Q68J692J849J454R82L66o38
52976C03187j592j793j384j165j272r60J00J113J129K82m32k68P55K102L088L077
52960C05967J884J81q27n25L47N21k12p55l48J62n14k055k697j627j35R9r25j948
52942B96593k313k453k745k800k160j090k97j56l91m79j61L68P26P57N90L54O
52925B84349n09j071j490j653j531j121m79K34P03N45l14j237j225n7J209J322
$$ y = [297284, 297062, 296554, 295684, 294671, 294138, 294402, 294974, 295008, 294089, 292482, 290825, 289649, 289015, 288507, 287643, 286350, 285030, 284261, 284385, 285200, 286017, 286314, 286399, 287063, 288502, 290079, 291358, 292792, 294910, 297310, 299131, 300249, 301388, 303142, 305357, 307357, 308354, 307847, 306128, 304288, 303290, 303142, 303333, 303753, 304543, 305275, 305085, 303759, 302047, 300785, 300138, 299801, 299446, 298852, 298018, 297263, 296881, 296732, 296555, 296614, 297482, 299174, 301023, 302477, 303459, 303825, 303187, 301595, 299802, 298418, 297253, 295981, 295021, 295121, 296234, 297363, 297645, 297213, 296945, 297700, 299802, 302890, 305967, 307851, 308032, 307205, 306680, 307027, 307548, 307336, 306581, 306233, 306395, 305881, 303826, 301129, 299502, 299367, 299466, 298541, 296593, 294280, 291827, 289082, 286282, 284122, 283032, 282735, 282579, 282188, 281709, 281548, 281916, 282642, 283399, 283989, 284343, 284349, 283840, 282769, 281279, 279626, 278095, 276974, 276495, 276729, 277432, 277977, 277663, 276426, 275201, 275144, 276353, 277675]
52909B77675L46m59j78Q46J687J836J420Q11L05r8o19j240j469r29l4M41L34J27
52891B80802J46K73M39P03R17Q77P63P50M18o84j959k304j710j243j321j208n00
52874B75159J00N3j60p3j7j45K30J367K216J798P08K16N89J338K340L515M012
52857B93246L121J627R24J062R19J26n11n61n99j046j468j440j189j003p92n50
52841B91866n73q40q05j44Q24J668K263K457J961R00n4m21m47m96m59r5L53M52
52823B98410K34J17K00R1m63j101j351j343j584j942j461L28K424L355L023K645
52807C01582K975L656M505O154Q531R770P865L034k518o779r003r202p867o152
52793C06551n179n010m960m794m685m211k671n46N75Jj164j591j260p94k66M54
$$ y = [277675, 278021, 277562, 277384, 278230, 279917, 281753, 283173, 283984, 284289, 284191, 283572, 282332, 280863, 279934, 279900, 280341, 280675, 280802, 280948, 281221, 281660, 282363, 283280, 284157, 284920, 285670, 286088, 285404, 283445, 281141, 279431, 278188, 276867, 275659, 275159, 275259, 275312, 275152, 275079, 275062, 274917, 275147, 276514, 278730, 280528, 281236, 281452, 282041, 283379, 285719, 289234, 293246, 296367, 297994, 298918, 299980, 300899, 301025, 300514, 299953, 299354, 298308, 296840, 295400, 294211, 293208, 292416, 291866, 291293, 290453, 289648, 289504, 290328, 291996, 294259, 296716, 298677, 299577, 299523, 299102, 298655, 298159, 297700, 297605, 297958, 298410, 298644, 298761, 298961, 299052, 298589, 297488, 296137, 294794, 293210, 291268, 289807, 290135, 292559, 295914, 298937, 301582, 304557, 308213, 312718, 318872, 327403, 337173, 345038, 348072, 345554, 338775, 329772, 320570, 312703, 306551, 301372, 296362, 291402, 286608, 281923, 277712, 275041, 274495, 275070, 275071, 273907, 272316, 271056, 270262, 269996, 270450]
52777B70450Q57L66n81r07l39K94K52k18l89LN40O91L80k7j97j52m9J74O59J204
52757B73011J362J058P27O74O64L59q3k06J50O84J034J103J016R60R87R34N29
52740B84963k29r22j030m72K80O48M31j24o76j079j302j207o09M24J518K286K584
52723B85484K439J906J128L84m6p3J18J42l60j258j821j488o97m73j057j525j110
52706B81693l22k18r58j711j817j402r41p52r21j235j106o1J544K621K375J042
52690B77831m29j249j310j015p61n35m0P92J605K039K103K020J885J717J639J668
52674B87960J541J040L76p1k40l17k70J35Q84J541J616R70n8q33q56k44M20P29
52656B94323Q28R86J209J452J877K487K836K553J954J690J861J927J361R3j562
$$ y = [270450, 271307, 271673, 271092, 270185, 269846, 270140, 270392, 270174, 269785, 269788, 270328, 271019, 271399, 271372, 271175, 271023, 270974, 271148, 271807, 273011, 274373, 275431, 276158, 276832, 277496, 277855, 277772, 277566, 277716, 278400, 279434, 280537, 281553, 282513, 283500, 284434, 284963, 284734, 283812, 282782, 282310, 282590, 283238, 283669, 283545, 282869, 281790, 280488, 279281, 278672, 279096, 280614, 282900, 285484, 287923, 289829, 290957, 291341, 291295, 291222, 291340, 291482, 291122, 289864, 288043, 286555, 285858, 285385, 284328, 282803, 281693, 281371, 281153, 280195, 278484, 276667, 275265, 274324, 273572, 272651, 271416, 270310, 270249, 271793, 274414, 276789, 277831, 277402, 276153, 274843, 273828, 273067, 272532, 272492, 273284, 274889, 276928, 279031, 281051, 282936, 284653, 286292, 287960, 289501, 290541, 290917, 290846, 290606, 290289, 290019, 290154, 291038, 292579, 294195, 295165, 295107, 294274, 293418, 293174, 293594, 294323, 295151, 296137, 297346, 298798, 300675, 303162, 305998, 308551, 310505, 312195, 314056, 315983, 317344, 317437, 315875]
52641C15875l022l642l229k347j845k037k534k651j849j00J763K473J585J48l92
52626B98196K26J021J169P98M25K49J14j75p71j642k435k620j944o80N15J011
52610B93457O81N1k08n7m1m11p47o82m39l02r5K85M06m3n45m16J85N62N65O07
52590B92813Q87J282J790K371K551J907Q57K34J92K26J13N8M8j00o0P03J890K450
52572C10212J929J015N21N44P81R93Q82J96p83j320j081m53O0K81Q6o42j551j904
52554C09766j393m73K79P32R27Q52O66P34J185J715J973J891J555J085N97Q1o33
52537C21539j440j843j621j254j181j068n21Pq4l80j05M07K64k00K72J578K015
52520C16385Q35n10m70N42J246J493J931K447K307J493Q74J100K060L210L924
$$ y = [315875, 312853, 309211, 305982, 303635, 301790, 299753, 297219, 294568, 292719, 292619, 294382, 296855, 298440, 298588, 298196, 298422, 299443, 300612, 301410, 301835, 302084, 302198, 302023, 301252, 299610, 297175, 294555, 292611, 291931, 292446, 293457, 294138, 294189, 293981, 293924, 293883, 293472, 292725, 292043, 291604, 291302, 291207, 291492, 291898, 291855, 291310, 290894, 291079, 291641, 292206, 292813, 293700, 294982, 296772, 299143, 301694, 303601, 304458, 304692, 304884, 305110, 305223, 305281, 305329, 305229, 305169, 305872, 307762, 310212, 312141, 313156, 313677, 314221, 315002, 315995, 316877, 317073, 316290, 314970, 313889, 313436, 313496, 313777, 313863, 313221, 311670, 309766, 308373, 307900, 308179, 308911, 309838, 310690, 311356, 312090, 313275, 314990, 316963, 318854, 320409, 321494, 322091, 322172, 321539, 320099, 318256, 316635, 315381, 314200, 313132, 312611, 312618, 312534, 312154, 312049, 312456, 312720, 312520, 312792, 314370, 316385, 317220, 316710, 316240, 316782, 318028, 319521, 321452, 323899, 326206, 327699, 328573, 329673, 331733, 334943, 338867]
52505C38867L726K723J561O36l38j638k929l785m236m357l835k600j297n43j09
52490C21846M63Q96N68l97j097r46j83O37J227J695K246K748K649J738Q87J251
52474C36228K540L037J814Kq62q48r73j244o71R79K679L506L544L280K900K471
52458C58382K137J789J017l53j936l129l588l345k771k397k472k679k522j921
52444C36212j229p73o49q46j292j779k039j859j150q3P82R09N13M54J075J632
52428C29878J266K22n16n16k78l27n21m07L9L40R9m12m74J34O68L07o06q59O9
52409C28106J408K306K915L817N049O286P515Q921J0420J1834J3166J4154J3924
52396D29821J1664P462K101l611q777j2270j3440j2787j1300r362o961m621l207
$$ y = [338867, 342593, 345316, 346877, 347513, 347175, 345537, 342608, 338823, 334587, 330230, 326395, 323795, 322498, 321955, 321846, 322309, 323205, 323773, 323376, 322279, 321333, 321150, 321787, 323014, 324709, 326955, 329703, 332352, 334090, 334977, 336228, 338768, 341805, 343619, 343621, 342759, 341911, 340938, 339694, 339023, 340002, 342681, 346187, 349731, 353011, 355911, 358382, 360519, 362308, 363325, 362972, 361036, 357907, 354319, 350974, 348203, 345806, 343334, 340655, 338133, 336212, 334983, 334210, 333561, 332715, 331423, 329644, 327605, 325746, 324596, 324513, 325295, 326204, 326717, 327171, 328246, 329878, 331144, 331366, 330850, 330334, 330056, 329729, 329208, 328801, 328840, 329180, 329279, 328867, 328393, 328527, 329195, 329502, 328896, 328037, 328106, 329514, 331820, 334735, 338552, 343601, 349887, 357402, 366323, 376743, 388577, 401743, 415897, 429821, 441485, 448947, 451048, 447437, 438660, 426390, 412950, 400163, 388863, 379501, 372540, 367919, 364712]
52383C64712k803k633k187j719j433q79L61J859K645K261J269P14J140K083K618
52368C68008K371J804J525J609J762J642Q89p53k833m185m020k789j541p52k29
52353C62508J58L43M52P15J052J218J294J523J753J607J161Q94R44Q87L83l05
52337C76587o12j81R30K320L464M070M247M240M180M209M627N607O933Q229R307
52322D38157J0098J0425J0111R167P778O277N129M581M250L579K778K668L411
52309E18409M157M366M651N627O771P245P236P512Q079Q309Q138Q164Q591Q974
52295F16229Q935Q410P254N377L255J589M93m28j247j647j582j281p50J06Q86
52280F45599J012O08L99O76J103J499K108K905L394L236K642J955J377J086J179
$$ y = [364712, 361909, 359276, 357089, 355370, 353937, 353058, 353419, 355278, 357923, 360184, 361453, 362167, 363307, 365390, 368008, 370379, 372183, 373708, 375317, 377079, 378721, 379610, 378857, 376024, 371839, 367819, 365030, 363489, 362737, 362508, 362666, 363009, 363461, 364176, 365228, 366446, 367740, 369263, 371016, 372623, 373784, 374678, 375622, 376509, 376892, 376587, 375975, 375794, 376724, 379044, 382508, 386578, 390825, 395065, 399245, 403454, 408081, 413688, 420621, 428850, 438157, 448255, 458680, 468791, 477958, 485736, 492013, 497142, 501723, 505973, 509552, 512330, 514998, 518409, 522566, 526932, 531583, 537210, 543981, 551226, 558462, 565974, 574053, 582362, 590500, 598664, 607255, 616229, 625164, 633574, 640828, 646205, 649460, 651049, 651542, 651114, 649867, 648220, 646638, 645357, 644607, 644713, 645599, 646611, 647219, 647618, 648294, 649397, 650896, 653004, 655909, 659303, 662539, 665181, 667136, 668513, 669599, 670778]
52265F70778J506J872K316K826L142L337M099N749P479Q405Q863R574J0021R155
52251G49122P451O610P013P056N548L396K154K082K438K714K760K478K164K495
52237H05481L511M270M138L726L905M551M973M981M798M425L818L267K955K637
52223H61436K217K170K715L167K833K083J758J872J731J044J84m67p46m85L14
52208H81826J261K066L014M408N887O802P022O684N627L858K290J974K699L279
52194I38697L291L590M870O625P948Q660R098R294Q986Q201P340O630N795M397
52180A033422K367J70j656l074m449n802o542o244n423m914m749m231l199k496
52166I83180k845l746l942k812r63N18J094J120J208J431J303N51l58q62j167
$$ y = [670778, 672284, 674156, 676472, 679298, 682440, 685777, 689876, 695625, 703104, 711509, 720372, 729946, 739967, 749122, 756573, 763183, 770196, 777252, 782800, 786196, 788350, 790432, 792870, 795584, 798344, 800822, 802986, 805481, 808992, 813262, 817400, 821126, 825031, 829582, 834555, 839536, 844334, 848759, 852577, 855844, 858799, 861436, 863653, 865823, 868538, 871705, 874538, 876621, 878379, 880251, 881982, 883026, 883210, 882743, 881997, 881512, 881826, 883087, 885153, 888167, 892575, 898462, 905264, 912286, 918970, 924597, 928455, 930745, 932719, 935418, 938697, 941988, 945578, 950448, 957073, 965021, 973681, 982779, 992073, 1001059, 1009260, 1016600, 1023230, 1029025, 1033422, 1035789, 1035959, 1034303, 1031229, 1026780, 1020978, 1014436, 1008192, 1002769, 997855, 993106, 988875, 985676, 983180, 980335, 976589, 972647, 969835, 968872, 969390, 970484, 971604, 972812, 974243, 975546, 976097, 975739, 974877, 973710]
52151I73710j939l070l488k457o17P66J284J574K278L293M099M354M012L194K096
52136I89089Q64n17k048l405m088l890l110k201j444r74p32l18Q02K700M846O667
52120I82241P992Q812R117R225R702J0457J0436Q917O745N371N003M616L741L092
52106A085467L234L798M468N717P865J0287J2347J4381J6884J9341K0867K1514
$$ y = [973710, 971771, 968701, 965213, 962756, 962139, 962905, 964189, 965763, 968041, 971334, 975433, 979787, 983799, 986993, 989089, 989953, 989436, 987388, 983983, 979895, 976005, 972895, 970694, 969250, 968276, 967544, 967226, 968028, 970728, 975574, 982241, 990233, 999045, 1008162, 1017387, 1027089, 1037546, 1047982, 1056899, 1063644, 1069015, 1074018, 1078634, 1082375, 1085467, 1088701, 1092499, 1096967, 1102684, 1110549, 1120836, 1133183, 1147564, 1164448, 1183789, 1204656, 1226170]
$$ [...]
##END NTUPLES=NMR SPECTRUM
##END=
