
##TITLE=AC1344_CHILS11171_6647394_hvHdWUDuJO
##JCAMPDX= 6.0         $$ Bruker NMR JCAMP-DX V2.0
##DATA TYPE= NMR SPECTRUM
##DATA CLASS= NTUPLES
##ORIGIN= BRUKER
##OWNER= Administrator
$$ 1.72 TOPSPIN		Version 2.1
$$ 2012-08-11 00:28:24.234 -0500  Administrator@TOPSPIN
$$ Compression mode = diff/dup
##.OBSERVE FREQUENCY= 400.02188249412
##.OBSERVE NUCLEUS= ^1H
##.ACQUISITION MODE= SIMULTANEOUS (DQD)
##.ACQUISITION SCHEME= undefined
##.AVERAGES= 64
##.DIGITISER RES= 22
##SPECTROMETER/DATA SYSTEM= spect
##.PULSE SEQUENCE= noesygpps1d.comp
##.SOLVENT NAME= COFFEE_meoh
##.SHIFT REFERENCE= INTERNAL, COFFEE_meoh, 1, 14.96111
##AUDIT TRAIL= $$ (NUMBER, WHEN, WHO, WHERE, PROCESS, VERSION, WHAT)
$$ ##TITLE= Audit trail, TOPSPIN		Version 2.1
$$ ##JCAMPDX= 5.01
$$ ##ORIGIN= Bruker BioSpin GmbH
$$ ##OWNER= Administrator
$$ $$ C:\Bruker\TOPSPIN/data/COFFEE/nmr/AC1344_CHILS11171_6647394_hvHdWUDuJO/12/pdata/1/auditp.txt
$$ ##AUDIT TRAIL=  $$ (NUMBER, WHEN, WHO, WHERE, PROCESS, VERSION, WHAT)
(   1,<2012-08-11 00:28:19.171 -0500>,<Administrator>,<TOPSPIN>,<go>,<TOPSPIN 2.1>,
      <created by zg
	started at 2012-08-11 00:16:48.937 -0500,
	POWCHK enabled, PULCHK disabled,
       configuration hash MD5:
       6B 1B 68 BB D9 2E 58 E2 7F 35 AD 54 07 DF 0E 41
       data hash MD5: 64K
       68 BD 51 07 89 F9 CC 27 61 30 E1 0A E1 F8 AF 7E>)
(   2,<2012-08-11 00:28:22.265 -0500>,<Administrator>,<TOPSPIN>,<proc1d>,<TOPSPIN 2.1>,
      <Start of raw data processing
       efp LB = 0.3 FT_mod = 6 PKNL = 1 PHC0 = 0 PHC1 = 0 SI = 128K 
       data hash MD5: 128K
       7C 7C 17 4A 6D A5 86 AB 7A 99 CF 46 B1 EC 28 AE>)
(   3,<2012-08-11 00:28:23.328 -0500>,<Administrator>,<TOPSPIN>,<proc1d>,<TOPSPIN 2.1>,
      <pk PHC0 = 5.185547 PHC1 = 0 
       data hash MD5: 128K
       03 30 FB 8A 0B B3 C1 7D C4 69 1C 5E 57 0C 0A E8>)
(   4,<2012-08-11 00:28:23.906 -0500>,<Administrator>,<TOPSPIN>,<proc1d>,<TOPSPIN 2.1>,
      <abs ABSG = 1 
       data hash MD5: 128K
       00 BF A9 74 D9 93 AE DA E0 F6 32 5F FB B4 05 EE>)
(   5,<2012-08-11 00:28:23.984 -0500>,<Administrator>,<TOPSPIN>,<proc1d>,<TOPSPIN 2.1>,
      <abs ABSG = 2 
       data hash MD5: 128K
       FD 21 6C EF FD A5 F8 FD E1 BE 93 75 05 DF 2E 66>)
(   6,<2012-08-11 00:28:24.031 -0500>,<Administrator>,<TOPSPIN>,<proc1d>,<TOPSPIN 2.1>,
      <abs ABSG = 3 
       data hash MD5: 128K
       46 F9 EA 29 2F 8A 74 AD 34 49 AB 13 AA 73 95 5B>)
(   7,<2012-08-11 00:28:24.093 -0500>,<Administrator>,<TOPSPIN>,<proc1d>,<TOPSPIN 2.1>,
      <abs ABSG = 4 
       data hash MD5: 128K
       C0 59 AF 50 F6 25 60 89 B2 32 D1 6E 4B CA 15 AF>)
(   8,<2012-08-11 00:28:24.140 -0500>,<Administrator>,<TOPSPIN>,<proc1d>,<TOPSPIN 2.1>,
      <abs ABSG = 5 
       data hash MD5: 128K
       E6 E8 D8 24 93 A2 C9 65 F3 C1 6F 07 0C 77 25 46>)
$$ ##END=
$$ 
$$ $$ hash MD5
$$ $$ CA FC C5 E9 59 AB 54 3A EA 6F 01 EA CD B8 DD 9E
##$RELAX= 
##$RELAX= 
##$RELAX= 
##$RELAX= 
##$RELAX= 
##$RELAX= 
##$RELAX= 
##$RELAX= 
$$ Bruker specific parameters
$$ [...]
150 150 150 150 150 150 150 150
##$TP07= 0
##$TPNAME0= <>
##$TPNAME1= <>
##$TPNAME2= <>
##$TPNAME3= <>
##$TPNAME4= <>
##$TPNAME5= <>
##$TPNAME6= <>
##$TPNAME7= <>
##$TPOAL= (0..7)
0.5 0.5 0.5 0.5 0.5 0.5 0.5 0.5
##$TPOFFS= (0..7)
0 0 0 0 0 0 0 0
##$TUNHIN= 0
##$TUNHOUT= 0
##$TUNXOUT= 0
##$USERA1= <user>
##$USERA2= <user>
##$USERA3= <user>
##$USERA4= <user>
##$USERA5= <user>
##$V9= 5
##$VALIST= <valist>
##$VCLIST= <CCCCCCCCCCCCCCC>
##$VD= 0
##$VDLIST= <DDDDDDDDDDDDDDD>
##$VPLIST= <PPPPPPPPPPPPPPP>
##$VTLIST= <TTTTTTTTTTTTTTT>
##$WBST= 1024
##$WBSW= 4
##$XGAIN= (0..3)
0 0 0 0
##$XL= 0
##$YL= 0
##$YMAX_a= 12608362
##$YMIN_a= -9348115
##$ZGOPTNS= <>
##$ZL1= 120
##$ZL2= 120
##$ZL3= 120
##$ZL4= 120
##$ABSF1= 14.96111
##$ABSF2= -5.597072
##$ABSG= 5
##$ABSL= 3
##$ALPHA= 0
##$AQORDER= 0
##$ASSFAC= 0
##$ASSFACI= 0
##$ASSFACX= 0
##$ASSWID= 0
##$AUNMP= <proc_prof1d_extract.lims>
##$AXLEFT= 0
##$AXNAME= <>
##$AXNUC= <1H>
##$AXRIGHT= 0
##$AXTYPE= 0
##$AXUNIT= <>
##$AZFE= 0.1
##$AZFW= 0.1
##$BCFW= 0
##$BC_mod= 0
##$BYTORDP= 0
##$COROFFS= 0
##$CY= 15
##$DATMOD= 1
##$DC= 0
##$DFILT= <>
##$DTYPP= 0
##$F1P= 0
##$F2P= 0
##$FCOR= 0.5
##$FTSIZE= 131072
##$FT_mod= 6
##$GAMMA= 0
##$GB= 0
##$INTBC= 1
##$INTSCL= 1
##$ISEN= 128
##$LB= 0.3
##$LEV0= 0
##$LPBIN= 0
##$MAXI= 10000
##$MC2= 0
##$MEAN= 0
##$ME_mod= 0
##$MI= 0
##$NCOEF= 0
##$NC_proc= -2
##$NLEV= 6
##$NOISF1= 0
##$NOISF2= 0
##$NSP= 0
##$NTH_PI= 0
##$NZP= 0
##$OFFSET= 14.96111
##$PC= 1
##$PHC0= 5.185547
##$PHC1= 0
##$PH_mod= 1
##$PKNL= yes
##$PPARMOD= 0
##$PPDIAG= 0
##$PPIPTYP= 0
##$PPMPNUM= 2147483647
##$PPRESOL= 1
##$PSCAL= 4
##$PSIGN= 0
##$PYNMP= <proc.py>
##$REVERSE= no
##$SF= 400.020009593109
##$SI= 131072
##$SIGF1= 0
##$SIGF2= 0
##$SINO= 400
##$SIOLD= 131072
##$SPECTYP= <>
##$SREGLST= <1H.CDCl3>
##$SSB= 0
##$STSI= 131072
##$STSR= 0
##$SW_p= 8223.68421052631
##$SYMM= 0
##$S_DEV= 0
##$TDeff= 65536
##$TDoff= 0
##$TI= <>
##$TILT= no
##$TM1= 0
##$TM2= 0
##$TOPLEV= 0
##$USERP1= <user>
##$USERP2= <user>
##$USERP3= <user>
##$USERP4= <user>
##$USERP5= <user>
##$WDW= 1
##$XDIM= 131072
##$YMAX_p= 372945318
##$YMIN_p= -11556
##$CURPLOT= <Network HP LaserJet P1505>
##$CURPRIN= <$Network HP LaserJet P1505>
##$DFORMAT= <normdp>
##$LAYOUT= <+/1D_H.xwp>
##$LFORMAT= <normlp>
##$PFORMAT= <normpl>
##$SURQMSG= 1
$$ End of Bruker specific parameters
$$ ---------------------------------
##NTUPLES= NMR SPECTRUM
##VAR_NAME=  FREQUENCY,     SPECTRUM/REAL,   SPECTRUM/IMAG
##SYMBOL=    X,             R,               I
##VAR_TYPE=  INDEPENDENT,   DEPENDENT,       DEPENDENT
##VAR_FORM=  AFFN,          ASDF,            ASDF
##VAR_DIM=   131072,        131072,          131072
##UNITS=     HZ,            ARBITRARY UNITS, ARBITRARY UNITS
##FACTOR=    0.0627417313425164, 1,          1
##FIRST=     8223.62146879497, -648,         -66270
##LAST=      0,             1453,            -66418
##MIN=       0,             -11556,          0
##MAX=       8223.62146879497, 372945318,    0
$$ Real data points
##PAGE= N=1
##DATA TABLE= (X++(R..R)), XYDATA
$$ [...]
67864 59416 61314 62684 63083 62991 63074 63102 62398 61279 60945 61715 62398 61966 60951 60545 60998 61677 62191 62662 63117
67845 63117 63293 63055 62517 61813 61049 60364 59816 59363 59107 59325 60002 60656 60890 60911 61223 62049 63198 64260 64739
67826 64739 64336 63339 62467 62152 62268 62600 63071 63319 62776 61562 60686 60828 61422 61514 61044 60581 60200 59392 57933
67807 57933 56173 54595 53593 53423 53834 54005 53470 52814 52798 53159 53077 52552 52322 52526 52538 52191 52111 52562 52909
67788 52909 52583 51720 50438 48443 45911 43962 43429 43730 43703 43145 42785 43105 43915 44927 46018 46992 47678
67771 47678 48226 48858 49341 49208 48475 47720 47410 47516 47805 48168 48539 48754 48599 47980 47077 46411 46483 47170 47720
67752 47720 47596 47072 46677 46427 46016 45527 45310 45296 45020 44348 43599 42946 42302 41849 42013 42639 42834 42082 40982
67733 40982 40383 40221 39834 39115 38688 38954 39580 40024 40047 39552 38441 36977 35956 36051 37032 37931 37989 37285 36390
67714 36390 35700 35240 34979 35035 35487 36139 36598 36575 36049 35226 34467 34158 34448 35043 35460 35509 35432 35467 35516 35377 35150
67693 35150 35125 35358 35634 35851 36153 36534 36532 35630 33919 32182 31244 31342 32111 32992 33537 33532 33158 33017 33673 35015
67673 35015 36269 36833 36941 37257 37985 38737 39193 39491 39880 40406 41151 42390 44180 45996 47131 47375 47080
67656 47080 46650 46257 45992 45953 46115 46272 46140 45461 44160 42590 41428 41008 40896 40424 39573 38930 38854 39144 39540
67637 39540 40011 40405 40335 39773 39349 39669 40604 41600 42416 43151 43768 44085 44221 44632 45610 46967 48239 49010 49126
67618 49126 48808 48520 48547 48815 49315 50443 52507 54983 56753 57192 56685 55957 55261 54392 53192 51801 50512
67601 50512 49507 48648 47565 46144 44891 44489 44925 45423 45394 45100 45180 45787 46554 47161 47513 47477 46835 45646
67583 45646 44397 43612 43422 43587 43842 44117 44453 44788 44914 44674 44171 43732 43670 44137 45121 46405 47534 48028
67565 48028 47781 47168 46698 46617 46878 47352 47942 48577 49226 49953 50833 51736 52238 51886 50683 49264 48407 48319 48606
67546 48606 48983 49655 50826 52204 53398 54492 55660 56410 55926 54215 52296 51016 50282 49676 49197 48965
67530 48965 48666 47863 46605 45329 44436 44249 44951 46119 46759 46366 45595 45307 45357 45115 44832 45377 46619 47170
67512 47170 46160 44402 43237 42906 42753 42551 42788 43747 44914 45459 45074 44308 44198 45371 47339 48820 48934
67495 48934 47887 46347 44503 42190 39675 37797 37213 37852 39185 40792 42540 44388 46156 47466 47984
67480 47984 47783 47353 47136 47108 46956 46523 45914 45306 44881 44873 45419 46360 47324 48014 48249 47899 47006 45917 45018 44352
67460 44352 43761 43361 43524 44356 45591 47022 48609 49979 50400 49729 48996 49411 50808 51723 51139 49686 48869
67443 48869 49442 50927 52427 53451 53948 54012 53834 53729 53882 53998 53468 52028 50195 48847 48344 48249 47970 47463
67425 47463 47097 47040 47131 47294 47606 47825 47327 45894 44270 43462 43602 43963 44083 44361 45373 47004 48569 49532
67407 49532 49780 49378 48433 47205 46072 45301 44959 45073 45720 46890 48289 49385 49781 49650 49724 50595 52015
67390 52015 53141 53513 53496 53589 53704 53509 53194 53359 54170 55110 55681 55972 56379 57098 58044 59010 59697 59812 59338
67371 59338 58571 57804 57167 56834 57046 57695 58201 58196 58096 58542 59410 59885 59573 59063 59145 59853 60574 60785 60332 59192
67351 59192 57489 55737 54612 54308 54417 54651 55322 56841 58919 60672 61474 61408 60940 60470 60256 60341 60407 60025
67333 60025 59228 58586 58469 58531 58218 57513 56802 56255 55811 55686 56268 57436 58471 58888 58952 59171 59604 59962 60119
67314 60119 60177 60254 60501 61205 62559 64351 66126 67587 68661 69267 69255 68609 67574 66601 66184 66547 67329 67792
67296 67792 67586 67200 67360 68144 69029 69687 70310 71104 71831 72092 71783 71132 70446 69965 69803 69889 70056 70237 70476
67277 70476 70762 71059 71475 72118 72774 73058 72968 72925 73124 73312 73509 74385 76308 78335 78999 78125 77166 77537 79185
67258 79185 81101 82617 83679 84237 84073 83196 81924 80609 79595 79319 79928 80812 81070 80651 80553 81570 83241
67241 83241 84410 84509 83800 82628 81115 79737 79514 81088 83806 86190 87376 87802 88396 89375 90105 90011 89295
67224 89295 88589 88161 87798 87425 87549 88837 91397 94582 97461 99362 100110 99969 99358 98512 97388 95975 94618
67207 94618 93853 93899 94431 94873 94857 94456 94097 94225 94871 95576 95921 96098 96689 97880 99199 100163 100859 101606 102318
67188 102318 102611 102462 102346 102667 103277 103694 103615 103183 102893 103268 104407 105779 106641 106752 106545 106545 106856 107343 108063
67169 108063 109220 110806 112599 114431 116199 117630 118413 118670 118998 119842 120997 121959 122574 123096 123694 124238
67153 124238 124585 124869 125376 126294 127642 129247 130710 131515 131420 130794 130461 131081 132608 134325 135466 135871 136005
67136 136005 136357 136949 137534 138078 138800 139784 140851 141903 143148 144838 146914 148997 150640 151600 152072 152688
67120 152688 154051 156121 158276 160078 161704 163448 165157 166491 167498 168504 169561 170456 171216 172200 173546
67105 173546 174886 175752 176085 176253 176755 177916 179628 181311 182359 182759 183135 184160 186053 188623 191573 194620
67089 194620 197518 200063 202089 203578 204922 206866 209795 213151 215978 218050 220030 222460 225154 227720
67075 227720 230043 231871 232543 231836 230751 230769 232433 235205 238563 242464 246682 250479 253376 255705 257953
67060 257953 259959 261301 262191 263338 264933 266466 267756 269609 272908 277352 281708 285299 288730 292905
67046 292905 297820 302702 307010 310794 314184 317089 319548 321967 324764 327969 331326 334627 337879 341315
67032 341315 345313 350047 355156 360000 364323 368386 372396 376188 379731 383567 388378 394329 401096 408273
67018 408273 415433 422055 427869 433140 438285 443322 448087 452820 458033 463834 469880 475977 482290 488882
67004 488882 495551 502266 509322 516831 524406 531601 538406 545059 551668 558282 565130 572472 580292 588373
66990 588373 596626 605196 614244 623703 633226 642392 651125 659910 669394 679695 690287 700648 710793
66977 710793 721076 731692 742573 753576 764605 775744 787434 800295 814448 829134 843357
66966 843357 856922 870572 885053 900332 915823 931201 946759 962961 979784 996611 1012762
66955 1012762 1028141 1043320 1059100 1076050 1094393 1114031 1134507 1155099 1175200 1194719 1214048
66944 1214048 1233643 1253705 1274241 1295339 1317247 1340127 1363757 1387572 1411073 1434219 1457388
66933 1457388 1481052 1505544 1530955 1557042 1583262 1609137 1634621 1659949 1685181 1710205 1735245
66922 1735245 1760949 1787692 1814993 1841973 1868291 1894332 1920501 1946624 1972164 1996851 2020981
66911 2020981 2045138 2069661 2094345 2118659 2142236 2165127 2187527 2209371 2230322 2250164 2269092
66900 2269092 2287547 2305703 2323116 2338976 2352885 2365360 2377371 2389304 2400531 2410123 2417747 2423742
66888 2423742 2428520 2432169 2434545 2435524 2435145 2433668 2431336 2427942 2422761 2415267 2405870 2395580 2384923 2373500
66874 2373500 2360716 2346511 2331101 2314358 2295939 2276058 2255678 2235685 2216015 2195772 2174154
66863 2174154 2151122 2127231 2102994 2078510 2053602 2028149 2002321 1976581 1951422 1926946 1902629
66852 1902629 1877612 1851321 1823803 1795581 1767375 1739911 1713570 1687978 1662252 1635960 1609632
66841 1609632 1583950 1558749 1533427 1508231 1484313 1462157 1440683 1418434 1395235 1371993 1349236
66830 1349236 1326700 1304332 1282769 1262464 1242960 1223514 1204026 1184862 1166115 1147546 1129086
66819 1129086 1110829 1092662 1074431 1056448 1039237 1022704 1006128 989202 972491 956511 940894
66808 940894 925053 909262 894368 880578 867261 854005 841140 828948 816970 804564 791805
66797 791805 779288 767263 755434 743597 732000 720993 710610 700605 690680 680571 670150 659628
66785 659628 649562 640524 632721 625941 619655 613093 605418 596221 586004 575983 567160 559535 552356
66772 552356 545128 538147 531954 526553 521448 516300 511147 505960 500432 494364 487943 481386 474623 467671
66758 467671 461050 455328 450325 445285 439915 434776 430400 426411 421935 416681 411214 406177 401611 397146
66744 397146 392590 388112 383943 380111 376526 373172 370147 367473 364958 362262 359097 355346 351065 346497
66730 346497 342086 338331 335420 333052 330704 328150 325588 323232 320952 318446 315626 312625 309444 305959
66716 305959 302366 299298 297207 295781 294246 292198 289855 287617 285730 284349 283484 282723 281408 279314 276839
66701 276839 274332 271570 268280 264780 261620 258758 255651 252118 248567 245342 242412 239862 238102 237214
66687 237214 236556 235476 234186 233384 233140 232672 231333 229429 227849 227090 226825 226288 224880 222508 219558 216633
66671 216633 214174 212150 210090 207562 204665 201947 199756 197892 196085 194596 193909 193908 193847 193257 192409 191649
66655 191649 190759 189395 187765 186289 184828 182875 180539 178653 177734 177368 176875 176136 175352 174381 172873 170937
66639 170937 169198 168064 167202 165867 163663 160981 158801 157895 158071 158262 157609 156377 155504 155293 154962 153650
66623 153650 151500 149453 148283 148168 148948 150153 150820 149995 147809 145617 144586 144471 144289 143870 143881 144361 144242
66606 144242 142823 140905 139740 139368 138884 138064 137695 138213 138912 138849 137851 136306 134616 133298 132994 133735 134626
66589 134626 134844 134616 134606 134762 134584 134340 135044 137117 139877 142588 145308 148289 151163 153231 154255 154523
66573 154523 154401 154132 153799 153135 151656 149329 146911 145267 144521 144222 144040 143920 143748 143423 143164 143286 143623
66556 143623 143685 143427 143412 144044 145015 145700 145769 145150 143711 141362 138398 135435 132997 131260 130129 129377 128671
66539 128671 127619 125937 123657 121219 119274 118225 117906 117772 117317 116232 114348 111794 109242 107608 107226
66524 107226 107489 107489 106896 106040 105343 104984 104960 105097 104904 103806 101743 99361 97389 95952 94690 93466 92640
66507 92640 92532 92838 92815 92003 90619 89228 88197 87522 87020 86571 86260 86363 87107 88302 89284 89441 88749 87706
66489 87706 86726 85831 84940 84172 83715 83543 83443 83237 82861 82334 81828 81668 82015 82539 82616 81976 80991 80286 80207 80698
66469 80698 81460 82011 81801 80669 79189 78262 78181 78334 77966 77012 75963 75169 74604 74252 74294 74797 75481 75922 75844
66450 75844 75233 74412 74040 74709 76380 78405 80192 81610 82676 83281 83483 83727 84339 85027 85292 85192 85303
66433 85303 86018 87317 89147 91585 94563 97801 101031 103978 106159 107147 107143 106883 106808 106674 106058 104865 103126
66416 103126 100769 97959 95318 93399 92104 90926 89616 88304 87114 86000 84957 84109 83534 83179 82977
66401 82977 82955 83251 84020 85161 86134 86308 85676 84942 84636 84378 83372 81535 79683 78552 78008 77398 76409 75301
66383 75301 74414 73756 73163 72632 72218 71683 70602 68988 67571 67100 67504 68064 68326 68440 68629 68802 68835 68821 68834
66364 68834 68825 68916 69387 70139 70601 70462 70067 69717 69104 67891 66464 65443 64796 64131 63658 63976 64879 65193 64110
66345 64110 62119 60299 59215 58776 58706 58746 58678 58539 58626 59065 59564 59820 59929 60096 60131 59595 58421 57144 56473
66326 56473 56685 57352 57600 56807 55194 53679 53028 53220 53744 54369 55372 56962 58677 59575 59113 57756 56559
66309 56559 56182 56422 56688 56592 56014 54953 53651 52609 52109 51878 51539 51197 51182 51414 51575 51758 52353 53232 53723
66290 53723 53560 53234 53120 52835 51859 50390 49129 48542 48701 49534 50756 51777 52142 51995 51783 51656 51483 51300
66272 51300 51342 51709 52373 53473 55171 57121 58375 58144 56628 55016 54508 55241 56236 56516 56107 55679 55445
66255 55445 55015 54357 54071 54314 54207 52976 51194 50101 49953 49882 49305 48667 48641 49279 50179 50962 51308 50957 49986
66236 49986 48825 47830 47069 46585 46538 46954 47677 48643 49917 51381 52746 53945 55055 55776 55520 54275 52915
66219 52915 52260 52230 52260 52159 52031 51704 50814 49412 48034 47257 47510 49067 51641 54071 55061 54415 53136 52198
66201 52198 51680 51250 50931 50986 51422 52092 53069 54416 55610 55761 54638 53181 52658 53395 54559 55157 54998 54637
66183 54637 54667 55319 56607 58440 60456 62041 62809 62934 62780 62308 61176 59418 57667 56527 55951 55448 54706
66166 54706 53812 52929 52004 50855 49442 48042 47136 47035 47543 48111 48390 48532 48882 49549 50394 51238 51863 52033
66148 52033 51837 51852 52505 53345 53442 52590 51555 50941 50395 49440 48553 48705 49954 51272 51842 51939 52269 52958 53582
66129 53582 53866 53963 54121 54394 54641 54619 54136 53182 51890 50348 48709 47501 47451 48696 50364 51269 50918 49648
66111 49648 48054 46674 46003 46241 46926 47272 47064 46873 47222 47880 48250 48160 47968 48028 48360 48732 48791 48147 46616
66092 46616 44461 42265 40552 39564 39292 39501 39783 39826 39646 39447 39346 39484 40356 42495 45589 48274 49254
66075 49254 48574 47450 46913 46975 47127 47133 47049 46850 46519 46393 46919 47948 48618 48196 46830 45307 44263 43865 44048
66056 44048 44659 45335 45610 45382 45099 45267 45883 46525 46883 46943 46739 46226 45519 45031 45220 46323 48370 51191
66038 51191 54180 56362 57070 56585 55783 55206 54783 54384 54110 53850 53074 51517 49740 48558 48087 47857 47675
66021 47675 47761 48006 47830 47047 46307 46200 46320 45797 44534 43333 42819 42824 43004 43551 44867 46759 48372 48979
66003 48979 48621 47869 47108 46168 44667 42607 40500 38919 38052 37790 38135 39294 41322 43806 46005 47270
65987 47270 47406 46788 46177 46205 46854 47479 47456 46760 45818 44944 44151 43456 43034 43000 43300 43950 45080 46467 47285
65968 47285 46758 45110 43477 42801 43063 43651 44155 44602 45178 45949 46680 46816 45891 44189 42693 42071 41937 41520
65950 41520 40835 40673 41470 42735 43680 43981 43770 43323 42976 42991 43235 43242 42803 42257 42009 42017 41956 41669 41254 40951 41111
65929 41111 42004 43408 44679 45439 45962 46595 47185 47399 47291 47115 46903 46736 47097 48264 49519 49788 49071 48478
65911 48478 48666 49032 48838 48356 48321 48801 49310 49710 50245 50814 50933 50477 49884 49510 49271 49100 49237 49770 50311
65892 50311 50502 50539 50778 51026 50721 49745 48603 47710 46946 46119 45480 45430 45911 46396 46448 46041 45448 45031 45034 45239
65872 45239 44896 43476 41506 40268 40441 41447 42334 42889 43493 44232 44755 44846 44559 43790 42323 40481 39194
65855 39194 39030 39463 39528 39013 38613 39020 40219 41686 42875 43355 42854 41512 40048 39372 39858 41085 42315
65838 42315 43176 43857 44742 45963 47288 48375 49065 49443 49625 49515 48900 47820 46719 46088 46016 46249 46599 47070
65820 47070 47590 48007 48465 49476 51338 53622 55529 56685 57337 57826 58140 58058 57605 57200 57354 58190 59274
65803 59274 60041 60372 60602 60938 61129 60859 60200 59450 58737 58080 57625 57466 57344 56921 56338 56122 56524 57253 57892
65784 57892 58226 58156 57739 57414 57751 58700 59440 59282 58490 57887 57878 58204 58514 58791 59098 59256 58991 58389 58006 58362
65764 58362 59241 59698 58986 57466 56262 55983 56140 55952 55333 54692 54151 53511 52866 52613 52713 52435 51212 49405
65746 49405 47905 47162 46987 47079 47306 47452 47187 46491 45732 45040 43933 41965 39595 37917 37536 38152 39233
65729 39233 40561 41876 42572 42317 41734 41880 43047 44461 45255 45371 45412 45815 46315 46127 44689 42368 40357
65712 40357 39678 40290 41324 42057 42366 42376 42142 41800 41671 41965 42545 43074 43267 43001 42416 41932 41938 42410 43056 43820
65692 43820 44902 46291 47658 48875 50234 51901 53476 54379 54482 54142 53784 53680 53874 54109 53962 53266 52257
65675 52257 51201 50153 49258 48938 49473 50624 52017 53618 55472 57189 58210 58505 58587 58872 59464 60502
65659 60502 62189 64361 66515 68481 70640 73169 75440 76586 76535 76086 75978 76209 76280 75784 74628 72932
65643 72932 70971 69158 67817 66961 66371 65894 65504 65065 64297 63149 61992 61170 60483 59458 58117 57051
65627 57051 56597 56329 55653 54659 54012 54120 54809 55736 56738 57611 57954 57510 56526 55452 54353 52889 50945
65610 50945 48992 47638 46987 46685 46515 46608 47039 47568 47885 47909 47675 47238 46848 46860 47175 47086 46180 45116 44938
65591 44938 45724 46506 46591 46283 46096 45816 44781 42820 40651 39450 40069 42344 45091 47100 48219 49111 49998
65574 49998 50290 49590 48394 47447 46989 47032 47738 48962 49968 50305 50609 51778 53594 54877 54876 53897 52669 51765
65556 51765 51547 52000 52515 52374 51540 50570 49834 49386 49506 50626 52527 54229 54917 54602 53795 53047 52961 54051
65538 54051 56237 58860 61432 63968 66393 68157 68852 68894 69253 70704 73555 77712 82611 87293 90978
65523 90978 93570 95391 96533 96675 95442 92850 89485 86260 83825 82116 80667 79303 78230 77452 76677
65508 76677 75989 76121 77599 79934 82115 83729 85194 86965 88906 90449 91101 90735 89597 88096 86545
65493 86545 85097 83862 82884 81998 80921 79568 78038 76278 74137 71835 69977 68863 68200 67754 67800 68463
65477 68463 69075 68879 68089 67514 67264 66607 65198 63620 62398 61180 59435 57496 56289 56248 57083 58537 60712
65460 60712 63415 65659 66295 65085 62938 61025 59836 59189 58935 59314 60472 61900 62734 62736 62640 63278 64515
65443 64515 65374 65247 64593 64304 64638 65135 65447 65824 66628 67710 68564 68969 69192 69607 70335 71318 72518 73950
65425 73950 75624 77497 79430 81163 82484 83498 84682 86607 89540 93222 96977 100215 103034 106265
65411 106265 110727 116357 122263 127624 132337 136807 141340 145862 149933 152883 154090 153392 151175 147995
65397 147995 144195 140004 135765 131814 128141 124469 120689 117140 114378 112727 111985 111497 110591 109162 107877
65382 107877 107632 108702 110520 112365 114160 116409 119389 122686 125637 128009 129935 131326 131745 131026 129672
65367 129672 128327 127070 125491 123373 121008 118907 117540 117318 118441 120622 123221 125880 128844 132508
65353 132508 136721 140726 143756 145628 146767 147697 148505 148791 148105 146330 143598 140015 135730 131171 126957
65338 126957 123507 120807 118477 115959 112856 109394 106448 104741 104036 103401 102279 100865 99473 98004 96262
65323 96262 94376 92651 91277 90394 90179 90602 91338 92185 93395 95361 98066 101020 103628 105546 106927 108474
65307 108474 111089 115200 120589 126940 134377 143226 153430 164449 175758 187332 199708 213469 228496
65294 228496 243743 257983 270758 282287 292526 300839 306656 309865 310363 307853 302468 295087 286574
65281 286574 277220 267406 258251 250710 244314 237610 229825 221446 213241 205434 197894 190410 182572 173970
65267 173970 164840 156087 148410 141705 135473 129452 123649 118120 112993 108425 104364 100547 96892 93628
65253 93628 90911 88549 86312 84235 82430 80771 79058 77360 75993 75145 74599 73785 72187 69879 67664
65238 67664 66441 66315 66517 66273 65546 64798 64254 63674 62805 61865 61478 62059 63258 64130 64001 63089 62109 61420
65220 61420 60864 60390 60414 61342 62964 64469 65021 64318 62852 61666 61609 62629 63898 64721 65136 65614 66388 67272
65202 67272 67990 68518 69124 70134 71609 73225 74594 75674 76719 77853 78943 79888 80746 81491 81953 82222
65186 82222 82921 84845 88331 93030 98134 102801 106647 110075 114011 119086 125130 131560 138196 145474 153923
65171 153923 163568 173965 184730 195931 207859 220440 233027 244852 255428 264290 270612 273592
65159 273592 273206 270159 264985 257551 247631 235608 222419 209064 196265 184303 172949 161880 151317
65146 151317 141908 133787 126220 118582 111306 105382 101202 98405 96504 94950 92765 89034 84053 79288
65132 79288 75837 73425 71271 69368 68262 67844 67145 65479 63373 62103 62499 64277 66375 67799 68277
65117 68277 68270 68348 68613 68742 68535 68217 68133 68336 68635 68948 69411 70116 70961 71799 72598 73331 73843 74006 73999 74239 74956
65096 74956 75879 76351 75777 74050 71708 69641 68438 67936 67522 66910 66490 66855 68156 70027 71994 73763
65080 73763 75204 76251 76879 77107 77059 77127 77908 79752 82311 84801 86794 88568 90571 92779 94847 96773
65064 96773 99034 102012 105616 109589 113903 118563 123267 127613 131508 135000 137747 139138 139007 137777 135682
65049 135682 132373 127700 122491 117937 114373 111179 107799 104279 100804 97310 93814 90636 88031 85883
65035 85883 83971 82139 80022 77059 73214 69385 66714 65600 65648 66237 66737 66494 65256 63575 62268 61482
65019 61482 60738 59857 59235 59005 58593 57490 56054 55070 54752 54627 54276 53703 53030 52263 51542 51267 51690 52540
65001 52540 53269 53704 54272 55521 57469 59549 61221 62500 63766 65129 66273 67011 67708 68881 70500 71995
64985 71995 72970 73608 74246 74859 75185 75249 75432 76052 77078 78417 80222 82622 85146 86728 86570 84979 83086
64968 83086 81713 80745 79674 78421 77259 76153 74753 73121 71968 71792 72104 71895 70745 69093 67538
64953 67538 66336 65617 65576 66156 66750 66568 65319 63455 61823 61125 61527 62633 63832 64785 65583 66496 67668
64936 67668 69072 70632 72343 74368 76999 80375 84255 88253 92215 96083 99380 101241 101158 99416 96618
64921 96618 93046 88746 84002 79381 75429 72501 70688 69642 68676 67372 65969 64895 64128 63352 62512
64906 62512 61733 60782 59165 56805 54214 51941 50313 49745 50704 53009 55545 57122 57533 57525 57913 58901 60113
64889 60113 60984 61131 60555 59616 58799 58502 58904 59867 61010 61981 62664 63011 62853 62140 61236 60616 60296 59946 59502
64870 59502 59194 58918 58199 57102 56599 57514 59386 60964 61661 61989 62557 63183 63234 62483 61335 60345 59790 59701
64852 59701 60100 61002 62165 63004 62937 61905 60472 59435 59280 59866 60466 60276 59182 57989 57616 58074 58597
64835 58597 58774 59070 59956 60978 61146 60074 58354 56882 56100 55843 55616 55011 54055 53185 52736 52523 52150 51632
64817 51632 51411 51691 52002 51592 50119 47864 45410 43393 42483 43199 45361 47844 49292 49274 48487 47739 47121
64800 47121 46435 46010 46473 47874 49580 51051 52214 53101 53717 54374 55542 57112 58310 58651 58491 58340 58118
64783 58118 57549 56841 56468 56571 57001 57681 58449 58852 58601 58060 57831 58011 58321 58720 59322 59829 59721 59027 58357
64764 58357 58020 57595 56598 55187 54009 53602 54051 55007 55894 56319 56394 56579 57213 58301 59612 60741 61295 61327
64746 61327 61517 62464 63850 64659 64259 62895 61083 59026 56799 54782 53606 53716 55042 56893 58257 58502
64730 58502 57901 57248 56983 56922 56820 56806 57109 57675 58248 58612 58701 58621 58645 58925 59197 59056 58579 58345 58765 59716 60958
64709 60958 62487 64220 65685 66454 66688 66908 67306 67581 67430 66891 66168 65384 64631 64014 63457 62579 61142 59650
64691 59650 59200 60358 62279 63368 62907 61683 60917 60950 61258 61303 60928 60173 59287 58823 59190 60077 60751 60967
64673 60967 61190 61907 63097 64441 65610 66242 66010 64953 63488 61981 60518 59117 57905 56998 56471 56435
64657 56435 56898 57616 58345 59143 60018 60496 60088 59125 58487 58466 58551 58397 58280 58408 58594 58929 59970 61744 63290
64638 63290 63812 63687 63681 63713 63151 61894 60358 58823 57638 57717 59762 62955 65382 65979 65361 64647 64225 63962
64620 63962 63857 63974 64134 64101 63866 63542 63215 63024 63058 63015 62354 60976 59510 58685 58687 59234 60009 60805 61563 62449
64600 62449 63654 64994 66011 66631 67377 68639 70034 70815 70759 70342 70218 70770 72011 73553 74783 75392 75722
64583 75722 76327 77255 77973 77984 77274 76183 75126 74426 74135 73955 73532 72836 72072 71237 70090 68680 67534 67071
64565 67071 67090 67069 66814 66479 66127 65641 65043 64528 64043 63167 61636 59796 58379 57913 58425 59554 60785 61716
64547 61716 62258 62579 62772 62759 62596 62620 63078 63786 64403 64858 65225 65363 65075 64497 63902 63199 62131 60977 60445
64528 60445 60666 60839 60277 59362 59004 59431 60036 60226 60014 59753 59711 59912 60162 60222 60149 60390 61266 62457 63272 63380
64508 63380 62992 62380 61591 60702 60063 60059 60790 62038 63456 64744 65714 66215 66041 65151 64054 63607 64055 64546
64490 64546 64088 62789 61648 61235 61276 61505 62047 62658 62457 61058 59413 58741 58952 58944 58227 57406 57024 56801 56352
64471 56352 55969 56149 56733 57050 56801 56420 56580 57612 59293 61023 62210 62639 62535 62267 62142 62431 63237 64156
64453 64156 64394 63561 62211 61270 61057 61117 60913 60304 59416 58494 57908 57940 58464 59090 59692 60412 61070 61029 59958
64434 59958 58408 57251 56774 56697 56958 57961 59958 62462 64552 65670 65994 66017 65888 65362 64420 63654 63624 63949
64416 63949 63556 62054 60425 60040 61268 63326 65147 66007 65563 63982 62074 60860 60769 61414 62142 62568 62609
64399 62609 62296 61643 60623 59277 57900 56934 56521 56380 56272 56286 56404 56171 55279 54138 53339 52807 52130 51478
64381 51478 51356 51552 51275 50428 49833 49919 50084 49772 49299 49005 48483 47487 46977 48057 50142 51293 50582 49279
64363 49279 49278 50902 52753 53438 53006 52623 53146 54311 55357 56069 56806 57669 58263 58440 58691 59435 60354 60853
64345 60853 60859 60736 60711 60828 61193 61745 61967 61350 60155 59315 59538 60772 62437 63919 64905 65535 66171 66904 67441
64326 67441 67599 67516 67187 66271 64782 63457 62941 63073 63602 65022 67747 70815 72621 72980 73347 74730 76403
64309 76403 77138 76778 75964 75071 74215 73821 74328 75502 76711 77836 79374 81613 84128 86223 87631 88708
64293 88708 90055 91943 94055 95872 97378 99188 101917 105550 109541 113289 116410 118753 120382 121400
64279 121400 121648 120730 118456 115148 111351 107398 103378 99450 95945 93153 91033 89085 86619 83347 79759
64264 79759 76746 74804 73693 72834 71796 70424 68859 67527 66821 66641 66447 65880 65091 64358 63701 63063 62581
64247 62581 62407 62425 62455 62584 63056 63862 64684 65206 65327 65159 65000 65274 66272 67835 69429 70592 71309 71841 72224
64228 72224 72104 71289 70349 70332 71647 73500 74705 74839 74319 73598 72782 72020 71697 72053 72950 74107 75299 76293
64210 76293 76900 77173 77242 76934 75982 74693 73872 73848 74014 73656 72852 72174 71764 71198 70198 69099 68551 68910 69895
64191 69895 70823 71275 71540 72221 73382 74362 74510 73815 72749 71751 70981 70328 69617 69067 69439 71234 73755 75651
64173 75651 76568 77559 79556 82196 84723 87312 90695 94918 99325 103553 107728 111796 115403 118460 121176
64158 121176 123505 125097 125806 125695 124559 122104 118678 115227 112312 109640 106720 103468 99961 96105 91922
64143 91922 87875 84578 82309 80928 80052 79266 78414 77740 77511 77495 77182 76506 75937 75776 75838 75990 76461 77329
64125 77329 78140 78442 78383 78386 78475 78359 78055 78017 78647 79892 81299 82266 82406 81921 81546 81843 82538 82744 81892 80320
64105 80320 78983 78687 79553 81077 82745 84597 87087 90309 93592 96101 97719 99071 100761 102922 105559
64090 105559 108900 113061 117491 121089 123028 123332 122607 121371 119783 117902 115897 113924 112027 110284 108855
64075 108855 107632 106031 103497 100257 97328 95658 95361 95783 96133 95990 95410 94698 94023 93290 92461 91913 92218
64058 92218 93524 95412 97422 99548 102160 105665 110230 115543 120764 125025 128158 130753 133400 136124
64044 136124 138606 140495 141319 140623 138621 136356 134651 133155 130977 128082 125289 122975 120539 117444 114121
64029 114121 111441 109736 108731 108085 107536 106791 105785 104982 104983 105842 106998 107835 108096 107887 107595 107747 108570 109738
64011 109738 110811 111824 113052 114278 114824 114517 114092 114332 115113 115627 115359 114526 113777 113795 115033 117431 120326
63994 120326 122956 125125 127199 129522 132052 134591 137102 139702 142510 145594 148942 152435 155905 159264
63980 159264 162542 165985 170216 176035 183663 192305 200901 209360 218635 229452 241466 253888 266449
63967 266449 279344 292546 305795 319147 333004 347539 362545 378019 394571 413076 434126
63956 434126 458043 485296 516772 553680 597314 648851 709364 780019 862113 956630 1063680
63945 1063680 1182463 1311756 1450254 1596575 1749430 1907973 2071458 2237902 2403104
63936 2403104 2561346 2707203 2836591 2946470 3034421 3098969 3139858 3157357 3151191 3120408 3064280
63925 3064280 2983143 2878637 2753686 2612382 2459424 2299163 2135084 1970080 1806812 1647668
63915 1647668 1494736 1350112 1215921 1093587 983247 884349 796663 720238 654471 597907
63905 597907 549176 507533 472120 441263 413148 387023 363225 342148 323700 307691 294020
63894 294020 282133 270785 258885 246489 234614 224093 214861 206403 198503 191318 184824 178497 171691
63881 171691 164254 156708 149878 144379 140335 137389 134918 132409 129793 127409 125536 123958 122093 119591
63867 119591 116712 114015 111812 110114 109020 108804 109391 110041 109917 108930 107710 106791 106155 105576 104954 104108 102697
63850 102697 100687 98615 97036 95975 95235 94947 95221 95440 94558 92300 89613 87762 87236 87543 87742 87050
63834 87050 85348 83305 81839 81349 81604 82254 83043 83607 83614 83284 83246 83657 83865 83324 82404 81869 81843 81744 81174 80469
63814 80469 80320 81033 82186 82969 82947 82507 82397 82864 83546 84168 84838 85474 85471 84350 82441 80564 79230 78463
63796 78463 78156 78248 78727 79751 81631 84415 87661 90759 93272 94816 95044 94091 92681 91386 90036 88245
63780 88245 86163 84255 82657 81203 79909 78878 77980 77211 77163 78498 80927 83246 84472 84571 84124 83725
63764 83725 83644 83692 83458 83021 83210 84630 86660 88083 88632 89158 90256 91569 92648 93721 95131 96639 97802
63747 97802 98713 99892 101644 103868 106292 108640 110778 112948 115662 119155 123103 127081 131120 135727 141499
63732 141499 148821 157713 167801 178662 190298 203148 217512 233110 249265 265334 280951 295988
63720 295988 310239 322950 332767 338472 339780 337181 331133 321846 309740 295607 280204 264080 247885
63707 247885 232444 218467 206525 197180 190518 185504 180565 175183 170472 167851 167585 168887 170938 173334
63693 173334 175927 178701 181661 184606 187219 189479 191617 193450 194297 193955 193352 193750 195566 198427 202045
63678 202045 206519 211913 218083 225022 233032 242490 253551 266011 279375 293147 307048 320706 333101
63665 333101 342780 348829 351304 350512 346369 338718 327846 314304 298672 281929 265575 250753 237469
63652 237469 225161 213787 203835 195554 188815 183540 179632 176565 173705 171140 169661 169828 171381 173562
63638 173562 175594 176876 177260 177278 177734 179001 181016 183856 187814 192858 198556 204692 211568 219500 228419
63623 228419 238148 248742 260361 273136 287310 303130 320353 338257 356555 376038 397857 422227
63611 422227 448223 474849 501933 529705 557698 584260 607180 624725 636224 641965 642792 639806
63599 639806 634267 627560 621039 615625 611366 607512 603167 597759 590752 581208 568299 552300 534552
63586 534552 516241 497736 479324 461933 446474 432873 420492 409320 400091 393189 388146 384398
63574 384398 381911 380812 380907 382054 384756 389831 397419 406565 415929 424858 433658 442864 452459 461971 471291
63559 471291 481038 491984 504342 517781 531872 546349 561297 577447 595979 617577 641729 667388
63547 667388 694039 721449 748378 772394 791476 805450 815487 822639 827430 830783 834570 840730
63535 840730 849922 861277 873429 885528 897096 907157 913893 915279 909856 896938 876544 849513
63523 849513 817483 782338 745560 708235 671479 636495 604193 574947 548764 525516 505064
63512 505064 487330 472307 459952 450107 442535 436805 432127 427676 423328 419762 417505 416103 414622
63499 414622 412706 410644 408617 406445 404073 401767 399818 398504 398402 400164 403805 408658 414286 421030
63485 421030 429412 439388 450547 462770 476238 490846 505965 520873 535245 549003 561694 572122
63473 572122 578847 581150 579359 574148 565738 554056 539511 523260 506829 491711 479139 469689 463092
63460 463092 458795 456789 457571 461354 467759 476344 486923 499216 512638 526736 541466 556694 571735
63447 571735 585674 597976 608521 617159 623499 627043 627387 624419 618475 610238 600400 589560 578480
63434 578480 568246 559976 554482 552194 553184 557158 563636 572352 583392 596889 612795 631074 651892
63421 651892 675448 701749 730659 761946 794949 828211 859563 886647 907451 920677 925968 923988
63409 923988 916246 904794 891913 879664 869334 861034 853827 846334 837338 825944 811344 792827
63397 792827 770301 744760 717861 690952 664704 639588 616190 594842 575406 557794 542301
63386 542301 529141 518051 508848 501938 497660 495386 494029 493301 493837 496160 500193 505812 513093 521838
63372 521838 531499 541820 553115 565753 579811 595259 611932 629273 646746 664643 683932 705168
63360 705168 728204 753045 780149 809487 839969 870151 898789 924263 944291 957057 962336 961130
63348 961130 954835 945315 935050 926104 919053 913450 908981 905372 901523 895783 887271 876325 863657
63335 863657 849772 835286 821119 808044 796402 786471 778719 773526 770880 770423 771535 773290 774664
63322 774664 774996 774174 772308 769312 764650 757336 746287 731060 712357 691652 670247 648711 627060
63309 627060 605293 583725 562950 543455 525274 508100 491713 476137 461447 447753 435383
63298 435383 424604 415068 405997 397116 388940 381890 375718 370156 365539 362196 359663 357167 354496 351738
63284 351738 348544 344558 340428 337465 336075 335184 333453 330660 327771 326026 325980 327017 327757 327289 325963
63269 325963 324671 323647 322521 321324 320617 320565 320652 320488 320212 319907 319296 318390 317848 318273 319558 321245 323087
63252 323087 324937 326516 327707 328772 329969 331239 332555 334187 336236 338287 340009 341834 344522 348199
63238 348199 352294 356373 360562 365095 369863 374554 379008 383210 387071 390388 393055 395272 397433 399757
63224 399757 402060 404053 405795 407649 409753 411781 413307 414253 414911 415714 417059 419061 421264 422743 422730
63209 422730 421155 418574 415748 413289 411370 409530 406956 403257 398960 395107 392411 390898 390203 389988 390134
63194 390134 390732 391982 394014 396783 400139 403996 408412 413528 419393 425796 432365 438909 445629 452835
63180 452835 460574 468684 477121 485915 494834 503394 511285 518583 525512 532279 539071 545814 551819 556004
63166 556004 557739 557209 554878 550961 545645 539295 531990 523185 512415 500198 487762 475889 464436
63153 464436 452984 441478 430192 419516 409927 401756 394735 388078 381278 374600 368539 363077 357831
63140 357831 352764 348335 344877 342138 339522 336591 333259 329759 326543 324019 322198 320638 318857 316728
63126 316728 314425 312078 309644 306992 304009 300717 297438 294737 292972 291880 290759 289042 286562 283397
63112 283397 279795 276254 273377 271513 270674 270838 271998 273741 275045 274902 273226 271025 269594 269453 269966
63097 269966 270018 269112 267749 266644 265894 265184 264564 264440 264868 265467 266109 267019 268003 268253 267372 265981 264776 263572
63079 263572 261944 260346 259700 260020 260276 259678 258465 257369 256882 257141 258034 259223 260399 261535 262637 263414
63063 263414 263711 264124 265523 267947 270550 272833 275314 278767 283277 288283 293186 297669 301756 305747 309880
63048 309880 314026 317997 322071 326790 332257 338105 344122 350348 356558 362384 368011 374078 380645 386963
63034 386963 392488 397426 401968 405779 408712 411257 413614 414887 413912 410551 405645 400041 394215 388389
63020 388389 382446 376087 369569 363888 359658 356355 353327 351024 350368 351354 353333 356413 361415 368460 376680
63005 376680 385528 395339 406283 417732 429234 441286 454578 469010 484050 499543 515519 531569
62993 531569 547113 562152 577201 592494 607687 622325 636175 648968 660146 669091 675519 679493
62981 679493 680973 679419 673987 664207 650345 633014 612605 589436 564284 538324 512450 486961
62969 486961 462045 438177 415870 395320 376538 359584 344487 331121 319365 309176 300364 292560
62957 292560 285581 279549 274365 269448 264428 259858 256622 254631 252751 250182 247326 244877 242536 239305
62943 239305 234941 230430 226871 224389 222419 220595 218887 217144 215118 212928 211027 209621 208552 207884
62929 207884 208086 209379 211266 213081 214675 216136 217119 217041 215940 214634 213923 213989 214607 215532 216425 216744 216070
62912 216070 214531 212763 211414 210714 210445 210299 210276 210640 211440 212314 213002 213827 215289 217264 219044 220231 221118
62895 221118 222076 222990 223556 223774 223823 223756 223672 223945 224853 226092 227026 227394 227472 227551 227685 228000 228908 230724 233231
62876 233231 235775 237719 238707 238694 237960 237014 236218 235440 234262 232569 230793 229430 228475 227531 226406 225348
62860 225348 224630 224185 223806 223525 223529 223790 224104 224501 225314 226682 228164 229073 229115 228527 227669 226738 225886 225336 225160
62841 225160 225057 224634 223902 223267 222967 222784 222449 222104 222084 222465 223172 224397 226390 228759 230473 230869 230337 229776
62823 229776 229668 229986 230654 231575 232382 232658 232491 232417 232786 233452 234069 234377 234186 233479 232636 232217 232372 232675 232643
62804 232643 232202 231612 231221 231372 232222 233520 234780 235804 236815 238026 239433 241123 243328 245949 248418
62789 248418 250424 252426 255105 258665 263128 268983 276748 285911 295015 303137 310877 319605 330016 341699
62775 341699 353831 365902 377797 389475 400715 411103 420228 427821 433701 437660 439542 439364 437210
62762 437210 433051 426918 419200 410486 401071 390959 380481 370511 361659 353439 344673 334737 324157
62749 324157 313958 304779 296694 289536 283077 277035 271175 265447 259924 254691 249923 246015 243353 241850
62735 241850 240862 239714 238280 237004 236388 236608 237556 239016 240709 242323 243692 244918 246153 247304 248228
62720 248228 249236 251087 254212 258111 261867 265290 269235 274661 281633 289440 297540 306106 315641 326326
62706 326326 337882 350035 363021 377538 394136 412709 432716 453925 476723 501606 528555
62695 528555 557099 586778 617243 647966 678140 706848 733057 755504 773005 785083 792024 794136
62683 794136 791148 782535 768242 748935 725732 699892 672493 644034 614453 583841 553150 523892
62671 523892 497089 472780 450504 429931 410976 393669 378191 364726 353015 342270 331915
62660 331915 322311 314361 308324 303393 298586 293716 289259 285486 282189 279176 276544 274261 271875 269104
62646 269104 266536 265225 265418 266072 265914 264817 263770 263632 264303 265219 266207 267474 268925 269989 270237 269865
62630 269865 269388 269082 268998 269302 270233 271715 273379 275046 276867 278823 280454 281346 281656 281808 281831 281393 280463
62613 280463 279571 279312 279860 281005 282408 283760 284936 286160 287814 289976 292256 294239 295957 297859 300364
62598 300364 303496 306880 310144 313424 317347 322261 327667 332747 337369 342023 346718 350603 353031 354495
62584 354495 355997 357792 359247 359674 358760 356346 352446 347576 342502 337457 331979 325729 319104 312761 306807
62569 306807 300844 294717 288869 283904 280003 276886 274171 271613 269034 266275 263388 260742 258725 257337
62555 257337 256254 255254 254370 253571 252535 250959 248927 246857 245193 244224 244002 244281 244640 244887 245277 246242
62539 246242 247987 250397 253164 255940 258542 261107 263815 266411 268366 269754 271592 274927 279730 285055
62525 285055 290071 294656 299158 304050 309800 316652 324440 332875 342042 352382 364218 377530 392122
62512 392122 407771 424214 441230 458670 476188 492984 508097 520902 531157 538724 543470 545304
62500 545304 544026 539358 531476 521326 509972 497723 484374 470167 455950 442326 429190 416275
62488 416275 403739 392051 381596 372509 364610 357499 351003 345475 341277 338039 334941 331785 329231
62475 329231 327888 327677 328228 329255 330282 330576 329816 328559 327728 327871 329035 330933 332967 334493 335396 336156
62459 336156 337157 338287 339421 340834 342793 345059 347084 348446 349005 349135 349941 352551 356751 360920 363835
62444 363835 365946 368307 370936 373151 375012 377333 380376 383514 386240 388633 390711 392157 393004 393880 395268
62429 395268 397071 399134 401592 404354 406811 408496 409698 411079 413030 415678 419074 422947 426546 429256
62415 429256 431292 433450 436296 439858 443923 448226 452371 455976 459116 462445 466693 471993 477705 483010
62401 483010 487742 492592 498334 504898 511476 517531 523376 529690 536771 544421 552291 560123 567950 576250
62387 576250 585572 595698 605588 614626 623623 633998 646130 659259 672892 687415 703000 718805
62375 718805 733947 748753 764267 780831 797939 815415 833901 854006 875665 898705 923573
62364 923573 951086 981777 1015848 1053485 1094838 1139868 1188603 1241460 1298962 1361064 1426765
62353 1426765 1494168 1560705 1623623 1680670 1730367 1771559 1803136 1824686 1837205 1842519 1841921 1835696
62341 1835696 1823786 1806274 1783159 1754386 1720562 1683219 1644029 1604080 1564180 1525402 1488817
62330 1488817 1454861 1423448 1394564 1368374 1344820 1323569 1304358 1286978 1270893 1255290 1239764
62319 1239764 1224702 1210741 1197989 1186074 1174851 1164771 1156383 1149671 1144075 1139057 1134435 1130246
62307 1130246 1126611 1123833 1122213 1121515 1120861 1119576 1118014 1117186 1117648 1119189 1121510 1124634 1128460 1132399 1135825
62292 1135825 1138655 1141215 1143738 1146277 1148965 1152016 1155405 1158702 1161377 1163405 1165585 1169017 1174028 1179721
62278 1179721 1184870 1189158 1193267 1197949 1203492 1210007 1217624 1226262 1235675 1245946 1257592 1271117 1286849
62265 1286849 1305197 1326443 1350309 1376457 1405693 1439820 1479829 1525002 1574349 1628184 1687409
62254 1687409 1751757 1819570 1888779 1956919 2020298 2074396 2115663 2142581 2155035 2153412 2138635
62243 2138635 2112452 2077149 2034874 1987161 1934807 1878232 1818215 1756203 1693672 1631458 1570106
62232 1570106 1510631 1454306 1401792 1353055 1308103 1267170 1230131 1196412 1165732 1138347 1114190
62221 1114190 1092241 1071168 1050370 1030097 1010806 992678 975655 959649 944657 930716 917769
62210 917769 905648 894318 884008 874944 867038 860070 854015 848955 844757 841153 838025 835353 833120
62197 833120 831675 832028 835243 841574 850611 862165 876479 893541 912821 933838 956558 981101 1007487
62184 1007487 1035769 1065860 1096878 1126917 1153620 1174729 1188144 1192149 1186163 1171220 1149584 1124057
62172 1124057 1097599 1073131 1053210 1039684 1033483 1034595 1042466 1056795 1077763 1105051 1136812 1170173
62160 1170173 1202659 1232553 1258045 1277025 1288089 1291159 1286884 1276055 1259822 1239632 1216300 1189487
62148 1189487 1158519 1123342 1084399 1042203 997629 952295 908052 866195 827344 791701 759100
62137 759100 729170 701838 677343 655519 635576 617034 600393 586331 574658 564649 556026 548926
62125 548926 543065 537736 532579 527851 523978 521408 520909 523402 529265 538009 548579 559648 569651 577060
62111 577060 580909 581129 578546 574727 571540 570233 570664 571352 570265 565711 557077 545174 531714 518230
62097 518230 505617 494633 486093 480159 476047 473175 472172 474100 479035 486315 495952 508785 525183
62084 525183 544501 566141 590389 617802 648329 681461 716879 754605 794837 837857 883755
62073 883755 931846 980473 1027583 1071450 1110845 1144866 1172792 1194080 1208558 1216858 1220574 1221605
62061 1221605 1221253 1220057 1218203 1215425 1210434 1201225 1186557 1167031 1144444 1120192 1094413 1066390 1035456
62048 1035456 1001517 964903 925973 885140 843340 802037 762329 724314 687841 653619 622835
62037 622835 595682 571161 548634 528810 512811 500907 492713 487986 486442 487131 488823 491027 494024
62024 494024 497861 501801 504768 505909 504615 500545 493954 485762 477033 468405 460114 452451 446101 442056
62010 442056 441183 443891 450221 460204 473977 491559 512874 538168 568095 602858 641247 680770
61998 680770 718687 752669 780665 800866 812346 815590 812039 803088 789592 772090 751005 726536
61986 726536 698703 667897 635314 602623 571175 541708 514672 490481 469282 450812 434778
61975 434778 421219 410271 401731 395189 390395 387165 384983 383169 381547 380577 380737 382117 384728 388726
61961 388726 394031 400060 406271 412769 420019 428159 437073 447060 458939 473248 489643 507341 526119
61948 526119 546713 570299 597666 628965 664208 703816 748538 798857 854659 915360 980025
61937 980025 1047354 1116002 1185171 1254545 1323447 1390464 1454382 1515079 1572824 1626820 1675114
61926 1675114 1715960 1748607 1772590 1787012 1791135 1785387 1771419 1751549 1728539 1705579 1685760 1671433
61914 1671433 1664363 1666314 1678941 1702987 1738019 1783149 1837728 1901117 1971920 2047495 2124076 2197390
61902 2197390 2263709 2320821 2368235 2406545 2436762 2460157 2478297 2492905 2505901 2519668 2536730
61891 2536730 2558522 2584467 2612662 2641401 2669478 2694991 2714608 2724559 2722038 2705278 2672779 2623362
61879 2623362 2557194 2476204 2383261 2281294 2173410 2063317 1954923 1851354 1754479 1665274
61869 1665274 1584338 1512069 1448667 1394169 1348355 1310616 1280122 1256366 1239501 1230091 1228608 1235251
61857 1235251 1250178 1273747 1306451 1348635 1400272 1461010 1530433 1608195 1693747 1785838 1882405
61846 1882405 1980981 2079171 2174639 2264742 2346288 2415677 2469335 2504429 2519593 2515284 2493582
61835 2493582 2457825 2412389 2362296 2312427 2266914 2229312 2202946 2190451 2192765 2208815 2236176
61824 2236176 2271649 2311188 2350003 2383348 2407211 2418162 2413041 2389381 2346209 2284284 2205802
61813 2205802 2114110 2013329 1907557 1800123 1693565 1590001 1491183 1398343 1312351 1233965
61803 1233965 1163638 1101261 1046399 998617 957195 920910 888783 860975 838258 820531 806513
61792 806513 795047 786077 780057 777028 776641 778656 782967 789519 798522 810486 825757 844293 866052
61779 866052 891187 919612 950955 985323 1023650 1066809 1114826 1167502 1225382 1289512 1360573
61768 1360573 1438962 1525401 1620672 1724844 1837484 1958513 2087984 2224834 2366565 2510295
61758 2510295 2653355 2792541 2923383 3040583 3138813 3213021 3258894 3273913 3257880 3212219
61748 3212219 3139166 3042109 2926042 2796663 2658801 2516106 2372074 2230468 2094328 1965010
61738 1965010 1842671 1727520 1620289 1521649 1431611 1349641 1275112 1207536 1146518 1091733 1043006
61727 1043006 1000294 963488 932115 905243 881748 860911 842915 828689 819063 813966 812469 813446
61715 813446 815928 818767 820268 818413 811435 798240 778578 753177 723622 691720 658709 625059
61703 625059 591077 557673 526346 498255 473335 450621 429598 410918 395354 382295 369972
61692 369972 357303 344921 334106 325269 317913 311589 306210 301637 297560 293792 290300 287003 283822
61679 283822 280814 278002 275293 272865 271231 270416 269407 267159 263915 260782 258117 255276 252041 249275
61665 249275 247682 246727 245439 243776 242630 242768 244328 247008 250248 253415 256299 259387 263373 268580 275123
61650 275123 283263 293097 304084 315403 326757 338469 350863 363927 377468 391052 403716 414240
61638 414240 421908 426723 428759 427767 423730 417531 410598 403926 397731 392032 387177 383624 381533 380879 381929
61623 381929 385269 391400 400503 412633 427761 445435 464672 484427 503940 522312 537958 548892
61611 548892 553584 551313 541952 525961 504624 479779 453016 425433 398155 372640 350090 330810
61599 330810 314352 300159 287952 277720 269457 262782 256845 251009 245653 241824 239890 239010 238206 237480
61585 237480 237416 238111 239095 240093 241293 242929 245031 247540 250265 252853 255247 258079 262081 267105 272264
61570 272264 277096 282048 287592 293431 298972 304275 310093 317038 324982 333205 340955 347906 354288 360549
61556 360549 366899 373217 379368 385338 390975 395927 400125 404045 408157 412193 415409 417665 419841 423014
61542 423014 427461 432700 438289 444291 451091 459112 468674 479714 491403 502296 511073 517118 520322
61529 520322 520605 517920 512599 505379 496988 487863 478236 468394 458891 450619 444581 441313 440534 441532 443893
61514 443893 447654 452908 459644 468068 478624 491432 505926 521399 537797 555787 576147 599308
61502 599308 625409 654542 686817 722266 760647 801302 843255 885548 927436 968103 1006210
61491 1006210 1039896 1067377 1087564 1100136 1105134 1102663 1093076 1077311 1056763 1032740 1006159 977846
61479 977846 948918 920652 894035 869598 847585 828098 811170 796975 785922 778306 773804 771426
61467 771426 769991 768579 766747 764602 762609 761110 760017 759105 758465 758420 759205 761004 764081 768454 773640
61452 773640 779256 785809 794339 805282 818180 832460 847876 864163 881018 898627 917591 938126
61440 938126 959942 983012 1007552 1032785 1056635 1077380 1095041 1110488 1123819 1134382 1141829 1146113
61428 1146113 1146851 1143787 1137897 1131058 1124527 1118442 1112885 1108566 1106216 1105881 1106937 1108195 1107876 1104277 1096876
61413 1096876 1086409 1073728 1059145 1043031 1026243 1009397 992260 974476 956578 939670 924242
61402 924242 909797 895656 881722 868404 856121 844977 834870 825860 818408 813043 809775 808141
61390 808141 808023 810101 815192 823339 833972 846785 861982 879734 899944 922787 949045 979459
61378 979459 1013930 1051693 1092124 1134930 1179458 1224259 1267661 1308628 1346733 1381383 1411415
61367 1411415 1435567 1453196 1464345 1469240 1467937 1460580 1447893 1431145 1411397 1388868 1363377 1335554
61355 1335554 1307313 1280901 1257598 1237417 1219687 1203489 1187803 1171830 1155339 1138480 1121448
61344 1121448 1104725 1089394 1076527 1066230 1057868 1051168 1046375 1043246 1040729 1037978 1034886 1031264 1026296
61331 1026296 1019502 1011624 1003845 996567 989596 983026 977174 972026 967533 964196 962529 962104 961933 961710 961956
61316 961956 963004 964556 966227 967845 969178 970101 971140 973273 977065 982425 988977 995923 1001602 1004065
61302 1004065 1002348 996623 987133 973908 957740 940463 923719 908013 893362 880127 868677 858823
61290 858823 850221 842969 837272 832908 829534 827204 826088 825975 826490 827615 829581 832454 836213 841051 847241
61275 847241 854829 863644 873314 882978 891466 898226 903957 909943 917027 925562 935997 948971 964967
61262 964967 984335 1007404 1033942 1062538 1091078 1117979 1142719 1165416 1186483 1206724 1227128
61251 1227128 1248217 1269755 1291138 1311730 1330833 1347847 1362716 1375878 1387475 1396810 1402720 1404173
61239 1404173 1400285 1390084 1372799 1348444 1317939 1282698 1244313 1204501 1164867 1126458 1089597
61228 1089597 1054271 1020556 988677 958833 931082 905299 881140 858208 836366 815683 795920
61217 795920 776351 756504 736907 718566 701605 684933 667502 649512 632158 616629 603693
61206 603693 593814 586997 582595 579858 578752 579909 583754 590090 598644 609578 623248 639565 657637
61193 657637 675757 691747 703727 710999 714315 715224 715196 715210 715846 717431 719962 722933 725452 726867 727303
61178 727303 727372 727314 726778 725567 724120 722928 721898 720752 719718 719164 718727 717365 714311 709522 703327 696155
61162 696155 688624 681259 673957 666090 657268 647733 638126 629289 622182 617445 614980 614261 614846 615978 615846
61147 615846 612103 603377 589809 572169 551275 528401 505332 483374 462819 443733 426728 412396
61135 412396 400461 390076 380768 372692 366118 360990 356852 352992 348882 344634 340798 337571 334567 331506
61121 331506 328814 327259 327180 328194 329484 330413 331181 332794 336015 340491 345440 350961 357837 366082 374718
61106 374718 383217 392092 401455 409861 415375 417237 415889 412007 406378 400294 395071 391081 387731 384405
61092 384405 381164 378681 377751 378641 380717 382958 384978 387169 389778 392387 394526 396177 397385 397977 397996
61077 397996 397785 397337 396208 394420 392669 391189 389293 386645 384133 382687 381974 381145 380236 379892 380196 380712
61061 380712 381310 382120 383080 384248 386152 389025 392236 395276 398764 403505 409070 414414 419508 425252 431993
61046 431993 439211 446525 454049 461903 470258 479704 490646 502488 514258 525841 537812 550474 563995
61033 563995 579173 596977 617557 640628 666456 695486 727420 761662 798011 835738 872856
61022 872856 908126 943419 982382 1027176 1078341 1137280 1206303 1285927 1374314 1469888 1572812
61011 1572812 1684313 1807357 1948464 2116152 2316886 2555142 2837868 3175851 3581141
61002 3581141 4069183 4666564 5412850 6354669 7547362 9062301 10959508 13199022 15550485
60993 15550485 17616627 19008291 19553497 19371365 18769191 18083762 17596480 17515473 17930484
60984 17930484 18724166 19548300 19956860 19630621 18522038 16823399 14821627 12769997 10839731
60975 10839731 9125844 7664691 6451228 5458417 4653177 4002906 3477162 3050531 2704398
60966 2704398 2424231 2196087 2006980 1847135 1709920 1590164 1483743 1388004 1301285 1222261
60956 1222261 1150348 1085940 1029392 980285 938136 902898 873814 848467 823841 798002 770290
60945 770290 740671 709747 678848 649231 621359 595390 571740 550500 530846 511860 493552
60934 493552 476410 460400 445222 431193 418911 408168 398026 388083 378917 371146 364644 358913
60922 358913 353798 349479 345884 342320 337930 332740 328122 325636 325233 325232 324410 323397 323375 324138 324549 324573 325528
60905 325528 328105 331203 333193 333584 332866 331418 329306 326810 324421 322306 320226 317935 315315 312221 308570
60890 308570 304584 300551 296355 291635 286574 282174 279417 278325 278059 277801 277201 276070 274115 271233 267816
60875 267816 264490 261614 259231 257339 255956 254958 254222 254031 255028 257585 261383 265848 270854 276681 283333
60860 283333 290195 296418 301378 304566 305367 303474 299575 295259 291946 290101 289717 291202 295107 300885 306541
60845 306541 310058 310998 310335 308997 307042 304180 300511 296474 292407 288455 284704 281226 278063 275220 272553
60830 272553 269650 266184 262514 259565 257792 256479 254441 251319 247778 244534 241624 238757 235915 233298
60816 233298 230933 228686 226529 224527 222619 220682 218777 217048 215373 213426 211227 209337 208276 207886
60802 207886 207579 207093 206720 206700 206661 205854 203914 201350 199245 198388 198615 199038 199023 198837 199194 200290 201590 202519
60784 202519 203012 203207 202964 202051 200783 200195 201358 204483 208678 212603 215379 216857 217183 216536 215405 214652
60768 214652 214706 214893 214225 212835 211897 211966 212171 211473 210036 208701 207702 206746 206001 206049 206848 207642 208088 208751 210143
60749 210143 211938 213557 215055 216932 219359 222016 224515 226605 228077 228785 228752 228005 226457 224102 221236
60734 221236 218270 215426 212782 210439 208388 206372 204229 202320 201290 201296 201694 201626 200764 199474 198456 198252
60718 198252 198885 199776 200161 199810 199295 199430 200442 201795 202838 203437 203939 204670 205618 206555 207317 207902 208360 208671
60700 208671 208790 208806 208981 209511 210281 210980 211535 212260 213398 214614 215212 214915 214236 214001 214621 215848 217061 217693
60682 217693 217528 216766 215831 215070 214690 214861 215627 216642 217250 216981 215880 214293 212585 211185 210545 210668 210857
60665 210857 210353 209199 208151 207753 207850 208073 208390 208953 209724 210522 211342 212368 213702 215301 217169 219420 222097
60648 222097 225057 228123 231207 234238 237012 239330 241268 243110 244864 246009 245934 244604 242534 240169 237598
60633 237598 235002 233061 232593 233818 236113 238443 239977 240541 240691 241249 242589 244382 246115 247672 249203
60618 249203 250661 251800 252590 253305 254169 255176 256283 257496 258693 259715 260763 262481 265326 268983 272649
60603 272649 275828 278569 280867 282189 281928 280259 278147 276406 275017 273552 271993 270749 270094 270030 270662
60588 270662 272201 274478 276907 279063 280883 282196 282635 282343 282234 283063 284663 286589 289068 292576 296765
60573 296765 300644 303850 306989 310631 314604 318482 322135 325460 328178 330304 332555 335808 340296 345498
60559 345498 350682 355335 359331 362951 366722 371100 376328 382517 389630 397409 405570 414106 423097 432257
60545 432257 441132 449862 459196 469401 479614 488749 496854 505089 514442 524910 535943 547249 558920
60532 558920 571048 583599 596776 611273 627960 647231 668857 692591 718790 748286 781793
60521 781793 819748 862671 911431 967147 1030927 1103361 1183608 1268666 1353732 1433370 1502325
60510 1502325 1555724 1589497 1601252 1590753 1559719 1511652 1451843 1386659 1321962 1261978 1209419
60499 1209419 1166033 1132757 1110014 1098444 1099064 1112264 1136875 1170503 1210289 1252727 1293131 1326152
60487 1326152 1347072 1352510 1340460 1310668 1265214 1208130 1144017 1077056 1010996 949231 894284
60476 894284 847205 807560 773946 744753 718934 696305 677036 660968 647641 636787 628309 621799
60464 621799 616602 612566 610324 610551 613135 617287 622344 628406 636325 647102 661111 677796 696344
60451 696344 716707 739865 767150 799461 837070 879902 928077 982467 1044689 1116322 1198341
60440 1198341 1291844 1399134 1523278 1666344 1828598 2009390 2207582 2419937 2639156 2853967
60430 2853967 3050999 3216530 3337725 3404376 3410943 3357518 3249331 3095717 2908968 2702527
60420 2702527 2488804 2277789 2076853 1890940 1722659 1572784 1441094 1326755 1228072 1142610
60410 1142610 1068090 1003042 946441 897119 853907 816033 782913 753628 726994 702213 679196
60399 679196 658265 639712 623652 610049 598765 589641 582468 576931 572734 569895 568714 569287 571289
60386 571289 574428 578790 584261 589851 594115 596259 596360 594464 590156 583332 574862 565999 557387 549092
60372 549092 541378 534847 529800 525946 522925 520821 519950 520387 521926 524403 527796 532002 536722 541710 547076
60357 547076 553209 560316 568061 575772 583012 589900 596860 604226 612179 620878 630361 640301 650111 659454
60343 659454 668463 677294 685607 692764 698500 703029 706349 707851 707080 704778 702648 701951 702685 704353 707094
60328 707094 711650 718470 727286 737498 748501 759618 770071 779116 785959 789624 789252 784682 776512
60315 776512 765615 752812 738912 724620 710330 696388 683476 672282 662727 654091 646095 639261
60303 639261 633989 629871 626264 622924 619601 615595 610418 604465 598345 591907 584644 576745 568926 561328
60289 561328 553416 544939 536185 527225 517737 507825 498232 489403 480956 472511 464475 457564 451935 447210
60275 447210 443044 439272 435792 432705 430373 428951 428013 426975 425775 424848 424560 424939 425793 426764 427305 426966
60259 426966 425819 424420 423254 422273 421039 419266 417092 414779 412266 409323 406212 403860 403003 403384 404179
60244 404179 405099 406590 408958 411901 415110 418853 423644 429655 436738 444795 453821 463820 474919 487397
60230 487397 501285 516018 530769 545188 559715 575210 592345 611279 631822 653798 677096
60219 677096 701345 725746 749513 772343 794247 815024 834129 850958 864957 875702 883281 888414
60207 888414 891643 892513 890090 884229 875734 865409 853780 841751 830568 820759 811894 803830 797459
60194 797459 793655 792226 792560 794739 799316 806489 816249 829031 845424 865408 888466 914268 942641
60181 942641 973088 1004830 1037165 1069250 1099880 1128093 1153748 1176767 1196051 1210000 1218147 1221454
60169 1221454 1220869 1216284 1207180 1193655 1176499 1156685 1135188 1113043 1091324 1071049 1053046 1037664
60157 1037664 1024778 1014383 1006985 1003048 1002349 1004587 1010524 1021703 1038806 1060881 1086402 1114466
60145 1114466 1144481 1175261 1204990 1231961 1255002 1273408 1286892 1295653 1300241 1301272 1299227 1294420
60133 1294420 1287264 1278751 1270553 1264194 1260067 1257682 1256991 1258927 1264344 1272878 1283505 1296044 1311514
60120 1311514 1330858 1353805 1379301 1406814 1436812 1470042 1506844 1547460 1592636 1643348 1699892
60109 1699892 1761611 1827503 1896604 1967614 2038835 2108887 2177052 2242356 2302721 2355766 2400320
60098 2400320 2436470 2464175 2482539 2490578 2488052 2475335 2453030 2422076 2383851 2339860 2291625 2241024
60086 2241024 2190289 2141254 2094721 2050703 2008987 1969252 1931025 1894054 1858720 1825835 1796060
60075 1796060 1769739 1747268 1729389 1716940 1710295 1709028 1712110 1718448 1727195 1737656 1749218 1761542
60063 1761542 1774533 1787847 1800650 1812272 1823035 1833965 1845588 1857322 1868051 1876919 1883390 1886797
60051 1886797 1886045 1879754 1866782 1846886 1820989 1790751 1757912 1724067 1690672 1658808 1628869 1600718
60039 1600718 1574096 1548756 1524512 1501584 1480624 1461942 1444959 1429012 1414635 1403386 1396534
60028 1396534 1394464 1397343 1405508 1418961 1436996 1458487 1482102 1506263 1529564 1551346 1571265 1588283
60016 1588283 1600883 1608352 1610867 1607981 1598123 1580243 1555100 1524183 1488111 1447074 1402278 1355936
60004 1355936 1310014 1265811 1224529 1187271 1154475 1125998 1101836 1082190 1066905 1055481 1047762
59993 1047762 1044156 1045181 1051205 1062590 1079560 1101892 1129156 1161278 1198436 1240356 1286030 1334064
59981 1334064 1382866 1430502 1474907 1514495 1548402 1576170 1597501 1612269 1620397 1621691 1616067 1603933
59969 1603933 1586021 1562943 1535190 1503601 1469451 1434131 1399045 1365740 1335699 1309872 1288611
59958 1288611 1271944 1259542 1250579 1244165 1239963 1238031 1238197 1240232 1244641 1252572 1264556 1279836 1297253
59945 1297253 1316337 1337109 1359133 1381208 1401943 1420382 1436270 1449959 1461948 1472335 1480844
59934 1480844 1487376 1492241 1495666 1497493 1497625 1496599 1495482 1495481 1497968 1504507 1516359 1534002 1557507 1587270
59920 1587270 1623938 1667666 1717937 1774194 1836201 1903550 1975077 2048984 2123213 2195364 2262421
59909 2262421 2321024 2368247 2402120 2421520 2425750 2414349 2387280 2345411 2290904 2227055 2157438
59898 2157438 2084975 2011706 1939244 1869177 1802954 1741656 1686072 1636845 1594351 1558548 1529260
59887 1529260 1506595 1490836 1481916 1479300 1482488 1491367 1505866 1525427 1549046 1575765 1604926 1636002
59875 1636002 1668308 1700779 1731899 1759952 1783544 1801860 1814236 1819569 1816505 1804349 1783661 1755813
59863 1755813 1722117 1683527 1641083 1596299 1550923 1506342 1463241 1421758 1381775 1343062 1305398
59852 1305398 1268797 1233684 1200763 1170685 1143884 1120729 1101639 1086824 1075737 1066794 1057896 1047681
59840 1047681 1036473 1025802 1016898 1009854 1004305 1000286 997694 995189 990573 982577 971652 958768 944242
59827 944242 928382 912634 899052 888633 880942 875403 872185 871606 873381 876983 882275 889216 897142
59814 897142 904860 911418 916379 919410 920090 918326 914624 909762 904355 898846 893634 888926 884621 880587
59800 880587 876957 873946 871572 869862 869199 869970 871874 874145 876639 880139 885254 891447 897661 903466 908956
59785 908956 913785 917148 918858 919717 920528 921232 921387 921147 921408 923098 926553 931493 937559 945003 954813 967951
59769 967951 984525 1004062 1026478 1052234 1081557 1114171 1150083 1190139 1235529 1287272 1346399
59758 1346399 1413964 1490216 1574027 1663302 1755121 1844613 1924165 1985034 2020452 2027613 2007674
59747 2007674 1964945 1905894 1837605 1766174 1696183 1630999 1572673 1521569 1476943 1438315 1405963
59736 1405963 1380101 1360287 1345854 1336360 1331201 1329336 1329886 1332811 1338627 1347666 1359883 1375236 1393927
59723 1393927 1416343 1442863 1473562 1507994 1545531 1586144 1630701 1680381 1736019 1798154 1867383
59712 1867383 1944340 2029512 2123404 2226751 2340236 2463939 2597316 2739626 2890020 3047069
59702 3047069 3208357 3370672 3530453 3684064 3827993 3959337 4076501 4179534 4269673 4348516
59692 4348516 4417533 4478191 4532135 4580871 4625191 4664962 4699471 4727889 4749488 4763699 4770124
59681 4770124 4768519 4758841 4741459 4717416 4688387 4656256 4622713 4589262 4557517 4529305 4506413 4490236
59669 4490236 4481866 4482559 4493940 4517475 4553717 4602338 4663015 4736096 4822240 4921483 5032728 5153909
59657 5153909 5282413 5415399 5549891 5682486 5808833 5923456 6020298 6093571 6138197 6149920
59647 6149920 6125598 6063790 5965285 5833277 5673155 5491868 5296965 5095692 4894470 4698685
59637 4698685 4512663 4339851 4183061 4044430 3925035 3824516 3740793 3669507 3603567 3533937
59627 3533937 3452059 3352427 3233657 3097992 2950212 2796348 2642189 2492280 2350010 2218109
59617 2218109 2098407 1991122 1895054 1808848 1731924 1664108 1604770 1552620 1506196 1464342 1426284
59606 1426284 1391523 1359804 1331143 1305709 1283501 1264099 1246893 1231559 1218151 1206729 1197082
59595 1197082 1188805 1181273 1173500 1164546 1154337 1143669 1133074 1122078 1109967 1096817 1083199 1069225
59583 1069225 1054638 1039637 1024848 1010461 996076 981604 967732 955274 944450 934938 926286 918162
59571 918162 910552 903825 898380 894324 891761 891166 892889 896363 900391 904283 908191 912408 917037 922456
59557 922456 929369 938060 948166 959476 972416 987404 1004216 1022397 1041916 1063083 1086227 1111751
59545 1111751 1140119 1171368 1204961 1240434 1277966 1318226 1362269 1411809 1468632 1532433 1599110
59534 1599110 1661969 1715347 1757485 1790516 1818143 1843091 1866043 1886360 1903446 1917270 1927943
59523 1927943 1935457 1939992 1941841 1940659 1935221 1924363 1907877 1886207 1859818 1829375 1796179 1761728
59511 1761728 1726973 1692389 1658629 1626602 1597118 1570939 1549047 1532330 1521069 1515128 1514559 1519563
59499 1519563 1530042 1545820 1567323 1595521 1631124 1674299 1725160 1783965 1850602 1924213 2003402
59488 2003402 2086296 2170284 2252155 2328759 2397288 2454877 2498562 2526096 2536600 2530224 2507640
59477 2507640 2470258 2420583 2361716 2296450 2227154 2156337 2086730 2020585 1959215 1903418 1854161
59466 1854161 1812608 1779546 1755001 1738450 1729396 1727672 1733195 1745471 1763507 1786243 1812959 1843041
59454 1843041 1875461 1908693 1941184 1971708 1999204 2022505 2040425 2052107 2057183 2055740 2048215 2035219
59442 2035219 2017370 1995379 1970367 1943819 1916982 1890577 1865421 1843051 1825130 1812280 1804168
59431 1804168 1800988 1804329 1816399 1839041 1874058 1923888 1990986 2076104 2176894 2287160 2396338
59420 2396338 2490063 2553282 2575151 2552633 2490635 2399553 2292409 2182562 2081475 1996240 1927814
59409 1927814 1871570 1820640 1770125 1719152 1669782 1624725 1586094 1555283 1533109 1520125 1517022
59398 1517022 1523864 1537843 1552196 1558945 1553665 1537527 1515014 1490493 1466856 1445875 1428536 1415126
59386 1415126 1405594 1399801 1397283 1397120 1398484 1401150 1405264 1410831 1417638 1425449 1434125 1443621 1453850 1464346
59372 1464346 1474275 1483192 1491660 1500575 1509996 1519321 1528582 1538712 1550320 1563005 1576212 1590122 1605391
59359 1605391 1622757 1643340 1668598 1699465 1736151 1779244 1830328 1890872 1961203 2041293 2131944
59348 2131944 2234287 2348339 2472771 2605714 2745033 2887921 3030978 3170696 3303676
59339 3303676 3426770 3537677 3635136 3718170 3785582 3836838 3872891 3895297 3904644 3900455 3882202
59328 3882202 3849523 3801723 3738060 3658586 3564033 3455050 3332466 3198345 3055926 2908399
59318 2908399 2758485 2609215 2464161 2326410 2197778 2079193 1971212 1873889 1786726 1709151
59308 1709151 1640777 1581113 1529479 1485387 1448578 1418601 1394795 1376825 1364821 1358809 1358236 1361848
59296 1361848 1367407 1371561 1370992 1364366 1353062 1339870 1327254 1316666 1308652 1303046 1299478 1298130 1299734
59283 1299734 1304618 1312071 1320965 1330732 1341543 1353836 1367960 1384039 1401913 1421371 1442554 1465832
59271 1465832 1491079 1517337 1543465 1568975 1594076 1619141 1644301 1669270 1693210 1714842 1732918
59260 1732918 1746624 1755490 1759064 1756885 1748778 1735111 1716705 1694466 1669097 1641177 1611421 1580613
59248 1580613 1549242 1517541 1485981 1455351 1426106 1398076 1371202 1346114 1323471 1303123 1284568
59237 1284568 1267855 1253262 1240358 1228397 1217572 1208850 1202377 1197048 1192087 1188114 1185997 1185426 1185375
59224 1185375 1185485 1186176 1187620 1189343 1190803 1191788 1192197 1191844 1190574 1188373 1185326 1181662 1177841 1174484 1172160
59209 1172160 1171172 1171371 1172278 1173757 1176664 1182475 1192089 1205261 1221414 1240778 1264537 1294139 1330742
59196 1330742 1375092 1427483 1487764 1555528 1630347 1711756 1798839 1889603 1980621 2067542 2146348
59185 2146348 2214127 2268494 2306619 2325438 2322903 2298605 2253340 2188751 2107706 2014372 1913353
59174 1913353 1808732 1703822 1601253 1502895 1409936 1323297 1243785 1171736 1106904 1048907 997514
59163 997514 952369 912796 878090 847722 821193 798125 778667 763259 751661 742672 735161 728943
59151 728943 724216 720559 716986 712753 707605 701483 694551 687358 680454 673839 667168 660438 654155 648847
59137 648847 644763 641967 640335 639513 639249 639823 641867 645732 651292 658371 667036 677407 689455 703079
59123 703079 718141 734283 750941 767792 785175 803922 824750 847800 872718 899080 926680
59112 926680 955453 985280 1015944 1047177 1078678 1110161 1141523 1172859 1204158 1235036 1264940
59101 1264940 1293461 1320216 1344508 1365476 1382702 1396442 1407195 1415251 1420714 1423789 1424993 1425187
59089 1425187 1425377 1426223 1427713 1429355 1430558 1430601 1428540 1423713 1416395 1407597 1398092 1387958 1377082 1365709
59075 1365709 1354347 1343449 1333326 1324128 1315774 1308040 1300597 1292722 1283168 1270882 1255853 1238823
59063 1238823 1220172 1199644 1177223 1153587 1129389 1104599 1078875 1052269 1025329 998833 973565
59052 973565 950031 928288 908306 890412 874877 861192 848585 837414 829171 824722 823214 823169 823960
59039 823960 825681 828292 831700 836275 842530 850400 859406 869383 880686 893918 909869 929440 953201
59026 953201 981202 1013418 1050024 1090883 1135073 1181120 1227218 1270891 1309097 1339261 1359974
59015 1359974 1370559 1370797 1361789 1346368 1327709 1307779 1287666 1268682 1252063 1237978 1226019 1216542
59003 1216542 1210496 1207965 1207907 1209393 1212040 1214956 1216279 1214279 1208245 1198009 1183328 1164260 1141603
58990 1141603 1116453 1089676 1062150 1035059 1009407 985381 962594 940956 921175 904476 891778
58979 891778 882839 876185 870221 864587 860104 857384 855902 854577 852818 850648 848115 844935 840633 834793
58965 834793 827294 818586 809646 801399 794062 787195 780485 774362 769642 766515 764097 761292 758007 755202
58951 755202 753729 753561 754317 756072 759218 763838 769689 776706 785153 795427 808018 823432 841557 861070
58937 861070 879789 895741 907794 915533 919002 918645 915183 909486 902657 895945 890152 885203 880685 876777
58923 876777 874228 873436 874052 875721 878824 884148 891937 901545 912160 923752 937145 953023 971091
58910 971091 990529 1011145 1033554 1058157 1084533 1112047 1140481 1169722 1199436 1229675 1261275
58899 1261275 1294962 1330465 1367209 1405529 1446381 1490065 1536194 1584850 1636871 1692830 1752595
58888 1752595 1816115 1883885 1956197 2032484 2111813 2193559 2277205 2361883 2446581 2530574 2613271
58877 2613271 2693598 2769679 2839063 2899294 2948597 2986197 3011947 3025668 3026980 3015601 2991567
58866 2991567 2955222 2907332 2849248 2782736 2709681 2632052 2551851 2470698 2389594 2309418 2231453
58855 2231453 2156960 2086460 2019939 1957578 1899662 1845776 1794734 1745360 1696803 1648144 1598463
58844 1598463 1547632 1496603 1446695 1398960 1354287 1313470 1276869 1244299 1215471 1190229 1168303
58833 1168303 1149284 1132974 1119364 1108191 1099035 1091978 1087537 1085632 1085178 1085207 1086089 1089233 1095859 1106441
58819 1106441 1121186 1140621 1165723 1197727 1237989 1288158 1350538 1427959 1522545 1633868 1757707
58808 1757707 1885759 2006074 2104625 2168794 2191669 2174298 2124380 2052905 1971225 1889407 1815352
58797 1815352 1754309 1708859 1679287 1664268 1661832 1670244 1688334 1715369 1750933 1794811 1846546 1905049
58785 1905049 1968875 2036922 2108715 2184117 2263009 2344957 2428675 2511935 2592452 2668755 2739660
58774 2739660 2803159 2856671 2898377 2927515 2943240 2944157 2929477 2899972 2857333 2803168 2739061 2666983
58762 2666983 2588952 2506640 2421758 2336426 2252427 2170270 2089577 2010425 1933841 1860887 1791554
58751 1791554 1724723 1659287 1595392 1534569 1478498 1427654 1381348 1338877 1300195 1265576 1235308
58740 1235308 1209880 1189857 1175244 1165404 1159860 1158669 1161731 1168268 1177357 1188435 1200753 1212712
58728 1212712 1222238 1227477 1226724 1218275 1201232 1176464 1146240 1112953 1078588 1045100 1014370 987441
58716 987441 964183 943947 926333 911217 898351 887127 876542 865288 852070 836116 817473
58705 817473 796790 774803 751972 728538 704756 680937 657295 634034 611688 591101 572762
58694 572762 556375 541428 528013 516682 507543 500072 493851 489016 485782 483967 483279 483750 485585 488758
58680 488758 492880 497308 501287 504198 505772 505955 504700 502179 499083 496257 494034 492371 491621 492592 495681
58665 495681 500510 506620 514017 522768 532565 542994 553778 564346 573531 580241 584328 586525 587673
58652 587673 588202 588163 587492 586279 584827 583320 581490 578936 575763 572595 569941 567983 566934 567003 567730 567799
58636 567799 565848 561271 554204 545167 534841 523832 512436 500919 489955 480333 472261 465510 460236
58623 460236 456943 455528 455123 455138 455747 457114 458933 461133 464246 468528 473367 478116 482864 487858 492855
58608 492855 497794 503497 510824 519520 528645 537845 547434 557481 567665 577975 588781 600166 611760
58595 611760 623446 635805 649790 666142 685045 706151 729006 753615 780298 808859 838365
58584 838365 868108 898334 929483 960975 991241 1018723 1042377 1061549 1076029 1086195 1092527 1094922
58572 1094922 1092900 1086590 1077199 1066417 1055573 1045404 1036473 1029640 1026020 1026320 1030446 1038019 1049175
58559 1049175 1064363 1083514 1106090 1132001 1161667 1194708 1229094 1261812 1289755 1309661 1318166
58548 1318166 1312970 1293850 1262139 1219614 1168399 1111463 1052334 994179 939291 889100 844190
58537 844190 804471 769709 739779 714331 692664 674277 659178 647429 638798 633119 630429 630416 632187
58524 632187 634872 637858 640106 640004 636496 629853 620873 610006 597827 585620 574544 564602 555155
58511 555155 546103 537904 530820 524786 519672 515112 510525 505934 502298 500393 499843 499935 500869 503339 507335
58496 507335 512253 517851 524250 531292 538864 547662 558687 572036 586905 602655 619214 636631 655106
58483 655106 675383 698257 723589 750358 777643 804879 831227 855278 875508 890674 900020 903663
58471 903663 902597 897719 888834 875022 855833 831844 804414 775418 746855 720052 695284 672485
58459 672485 651929 633884 618123 604388 592900 583808 576587 570590 565820 562577 560773 560195 560962
58446 560962 563071 565968 569210 572970 577300 581570 585460 589844 595812 603417 612280 622767 635501 650303
58432 650303 666769 685460 707498 733555 764330 801481 846916 901771 967097 1044070 1130544
58421 1130544 1216914 1287673 1329023 1335668 1311548 1266053 1209608 1150511 1093663 1041433 995296
58410 995296 956152 923769 897205 875914 859680 847726 838985 833235 830963 832198 836463 843769 854570
58397 854570 868678 885154 903207 922206 940825 957177 969821 977851 980350 976925 968683 957494
58385 957494 944337 929408 913610 898546 884963 872429 860728 850301 841175 832608 824180 816314
58373 816314 809514 803887 799444 796093 793385 791080 789795 790185 791819 793830 796259 799632 803660 807681
58359 807681 811975 817177 822777 827823 832842 839319 847414 856027 865104 875921 888805 902473 916158
58346 916158 930699 946950 964619 983384 1003776 1026290 1050702 1076693 1104114 1132252 1159798
58335 1159798 1185638 1208676 1227141 1239551 1246397 1249446 1249388 1245721 1238938 1231041 1223657 1217283 1212585
58322 1212585 1210705 1211835 1215092 1220180 1227759 1237954 1249988 1263498 1278662 1295028 1311906 1330025
58310 1330025 1351010 1375098 1401213 1429288 1460399 1494434 1529741 1565282 1600906 1635258 1665885
58299 1665885 1691995 1714753 1734260 1748759 1757662 1762986 1766850 1769835 1772777 1777739 1785903 1796502 1808976
58286 1808976 1824232 1842757 1863497 1885722 1910113 1937129 1966280 1997884 2033418 2073188 2115703
58275 2115703 2160240 2207880 2259256 2313624 2371046 2433038 2500066 2570873 2645291 2725147 2811187
58264 2811187 2901633 2994911 3091094 3189289 3286248 3378957 3466202 3546457 3617180 3677751 3730620
58253 3730620 3778302 3821958 3863997 3908742 3958855 4014070 4074877 4144156 4223488 4311217 4406034
58242 4406034 4509283 4622035 4743349 4873330 5014336 5167217 5329979 5502085 5686287
58233 5686287 5884232 6094380 6316529 6554117 6809686 7082460 7372916 7685088 8021556
58224 8021556 8381004 8763793 9175019 9618935 10095623 10606806 11159632 11761017 12413662
58215 12413662 13121652 13894438 14741539 15669728 16690004 17821082 19081678 20486796 22057211
58206 22057211 23825703 25829050 28102590 30689537 33648100 37044286 40948548 45448270
58198 45448270 50655787 56700784 63732580 71945930 81601363 93024090 106610750 122849919
58190 122849919 142302900 165514620 192875762 224386036 259199748 295073385 328247825
58183 328247825 354252230 369380645 371902710 362277047 342518702 315405039 283931088
58176 283931088 250934097 218744909 188952358 162404764 139384691 119802008 103344904
58169 103344904 89605626 78170170 68649367 60680182 53941641 48178913 43204428 38879996
58161 38879996 35104206 31804443 28921204 26394660 24168232 22197898 20449285 18889439
58153 18889439 17488419 16225069 15084135 14050300 13110173 12256307 11483262 10782212 10143860
58144 10143860 9563254 9036977 8558709 8121928 7723681 7360994 7026357 6711199 6411480
58135 6411480 6126172 5853214 5591065 5341612 5107253 4886929 4678408 4482163 4299471
58126 4299471 4128818 3967656 3815742 3673524 3539263 3410927 3288997 3174352 3065388
58117 3065388 2960291 2860222 2767092 2679897 2596325 2516311 2441088 2370292 2302885 2239368 2180218
58106 2180218 2123599 2067451 2012513 1960539 1910891 1861683 1813101 1766854 1723361 1682072 1643650
58095 1643650 1609327 1578836 1551175 1526548 1505596 1487825 1472842 1461928 1456204 1454331 1454066 1454753
58083 1454753 1455964 1454951 1448120 1434255 1414093 1387691 1354752 1316821 1276615 1235526 1193834 1152821
58071 1152821 1114435 1079300 1047048 1018136 993294 971653 951572 932977 916935 903223 890406
58060 890406 878207 867846 859922 853508 847267 839997 830276 817251 801797 785711 769932 754667
58048 754667 740677 728853 718821 709428 700349 691920 683824 675435 667185 660101 654100 648077 641512
58035 641512 634803 628337 622420 617737 614496 611413 606836 600698 594187 587864 581419 574933 568937 563303
58021 563303 557366 551074 544958 539160 533572 528635 524848 521764 518583 515441 512892 510485 507194 503074
58007 503074 499243 496371 494377 493479 494277 496802 500533 505324 511319 518124 525126 532618 541661 552987
57993 552987 566754 582964 601031 619339 636318 651663 665492 676786 683994 686827 686128 682242
57981 682242 675009 665283 654976 645366 636516 628433 621652 616508 612898 610935 610917 612591 615318 618857
57967 618857 622975 626442 627501 625390 620401 612641 601961 589119 575704 562641 549660 536364 522837
57954 522837 509169 495404 482086 469909 458836 448525 439503 432679 427706 423199 418887 416255 416602
57941 416602 419601 424249 430193 437415 445529 454080 462952 471995 480735 488802 496055 501960 505432 505630
57927 505630 502465 496200 487126 475815 463118 449709 436062 422836 410725 399931 390395 382459
57915 382459 376601 372574 369667 367823 367654 369287 372037 375339 379094 382894 385822 387398 387931 387618 386033
57900 386033 382861 378455 373279 367476 361354 355668 350955 347074 343767 341184 339501 338425 337488 336554 335734
57885 335734 334997 333971 331956 328264 322901 316825 311118 305987 300986 295967 291196 286815 282992 280513
57871 280513 280298 282180 284957 287836 291112 295221 299863 304390 308512 312360 316362 321184 327251 334125
57857 334125 340833 346924 352701 358350 363432 367351 369836 370921 370945 370537 370019 368856 366283 362444 358226
57842 358226 354084 349809 345428 341460 338236 335806 334590 335086 336717 337967 338117 338028 338852 340790 343493
57827 343493 346752 350178 352900 354304 354596 354159 352880 350647 347978 345585 343692 342346 342022 343240 345479
57812 345479 346843 344942 338334 327439 314189 300639 287940 276667 267462 260640 255569 251416 248405
57799 248405 247400 248290 249843 251327 253186 255841 258903 262087 265942 271055 277265 284174 291648 299248
57785 299248 305950 311152 315348 319216 322615 325122 326997 328868 330850 332610 333945 334700 334399 332463 328621
57770 328621 322812 315009 305476 294843 283633 272124 260833 250576 241664 233586 225864 218749 212733
57757 212733 207947 204313 201657 199347 196595 193663 192048 192851 195513 198710 201721 204268 205765 205816 205038
57742 205038 204475 204382 204296 203938 203347 202483 201524 201303 202596 205114 207856 210276 212453 214369 215872 217248 219021
57725 219021 221197 223380 225565 228070 230672 232579 233416 233616 233681 233614 233292 232909 232765 232990 233581 234388 234999
57708 234999 235031 234692 234755 235795 237682 239905 242237 245076 249250 255419 263418 272261 280958 289108 296443
57693 296443 302032 304488 303089 298408 291855 284849 278388 272995 268840 265945 264319 263992 265149 268305
57679 268305 274041 282340 292485 303933 317152 333367 353825 379709 412455 453546 504095 565223
57667 565223 638668 725537 822792 920461 1003179 1056255 1072256 1053467 1009165 950751 888378
57656 888378 829864 780382 742130 714736 696721 686782 683824 686354 692436 700273 708687 717039 724745
57643 724745 730795 733821 732896 728167 720348 709619 695527 678030 658097 637040 615673 594346 573386
57630 573386 553186 534117 516503 500359 485127 470165 455628 442339 430658 420174 410757 403082
57618 403082 397564 393402 389370 385104 381037 377511 374728 373237 373601 375545 378052 380416 382849 386045
57604 386045 390423 395766 401456 407095 413008 419919 428148 437448 447620 458775 470898 483852 498020
57591 498020 514184 532369 551507 570658 589728 608418 625323 638973 649122 656106 659475 658271
57579 658271 652316 642204 628326 610872 590643 568905 546455 523537 500512 477782 455278 432916
57567 432916 411471 392069 374845 358971 343989 330219 317800 306291 295416 285391 276298 267909
57555 267909 260301 253895 248595 243677 238789 234419 230974 228024 224881 221479 218332 215940 214471 213708
57541 213708 213161 212570 212296 212800 213763 214335 214323 214485 215381 216531 217074 216865 216517 216570 216920 217052 216781 216777 218126
57522 218126 221169 225108 229115 233442 238868 245487 252812 260750 269436 278269 286259 293577 301641 311188
57508 311188 321100 329656 336287 341648 346687 352246 359055 367416 377042 387577 399068 411727 425560
57495 425560 440280 455203 469250 481641 492763 503631 514232 523084 528689 530705 529328 524407
57483 524407 515868 504382 490858 475720 459289 442427 425996 410003 394008 378229 363549 350482
57471 350482 338740 327842 317595 307989 299065 291000 283995 277983 272665 267811 263327 259157 255447
57458 255447 252739 251650 252194 253614 255050 256359 258201 261288 265601 270468 275466 280947 287501 295176
57444 295176 303624 312758 322704 333237 343929 354922 366890 380077 393899 407715 421433 435152
57432 435152 448799 462399 476027 489021 499705 506479 508922 507517 502674 494474 483075 468916
57420 468916 452734 435536 418228 400959 383225 364959 347075 330571 315553 301597 288617
57409 288617 276747 265691 254949 244522 234790 225702 216727 207683 199167 192000 186482 182246 178619
57396 178619 175122 171769 168879 166508 164272 161837 159322 157012 154897 152737 150417 148021 145746 143857
57382 143857 142497 141457 140470 139757 139793 140377 140585 139964 139165 138973 139331 139888 140843 142423 144023 144829 145081 145736
57364 145736 146895 147489 146739 145213 144137 144135 144892 145685 146002 145901 145872 146254 146921 147763 149176 151588 154597 157064
57346 157064 158123 157781 156662 155510 154765 154197 153120 151474 150425 151245 153706 156305 158030 159210 160562
57331 160562 162196 163810 165181 166117 166480 166589 167111 168239 169432 170252 170962 171964 173102 173950 174469 174926
57315 174926 175471 176180 177276 178881 180721 182437 184012 185582 187051 188306 189640 191512 193906 196306 198322
57300 198322 200065 201907 204169 207065 210608 214421 217893 220627 222698 224425 226085 227850 229729 231477
57286 231477 232830 234003 235797 238837 242827 246840 250450 254189 258795 264302 270191 276144 282150 287974
57272 287974 293119 297521 301821 306551 311339 315369 318493 321449 324803 328017 329818 329471 327599 325719
57258 325719 324954 325142 325187 324278 322681 321360 320971 321342 321895 322441 323410 325240 327658 329869 331574 333384 335893
57241 335893 338715 341099 343312 346550 351285 356497 360987 364808 368849 373564 378839 384720 391405 398604
57227 398604 405672 412486 419659 427743 436657 445992 455440 464853 474342 484482 496003 509003 522694
57214 522694 536078 548749 560954 573166 585776 599012 612972 627635 642874 658441 674055
57203 674055 689623 705340 721494 738281 755862 774369 793674 813391 833334 853837 875319
57192 875319 897655 920269 942750 965192 987988 1011470 1035584 1059821 1083723 1107576 1132194
57181 1132194 1157722 1183210 1207879 1232357 1257933 1284878 1312323 1339587 1366659 1393296 1418732
57170 1418732 1442819 1466692 1491571 1517246 1542336 1565900 1588296 1610511 1633154 1656254 1679770
57159 1679770 1703945 1729001 1754659 1780220 1805155 1829380 1852930 1875764 1898123 1920740 1944315
57148 1944315 1968980 1994540 2020827 2047521 2074065 2100289 2126717 2153687 2180645 2207106 2233937
57137 2233937 2262659 2293612 2325844 2358734 2392719 2428249 2465191 2503635 2544230 2587196 2631821
57126 2631821 2677601 2725130 2775184 2827579 2881629 2937333 2995418 3056553 3121102 3189392 3261717
57115 3261717 3338305 3419735 3507187 3602021 3705454 3818952 3944445 4083757 4238374 4410404
57105 4410404 4603548 4822734 5073222 5360732 5692262 6076350 6522954 7043812 7652815
57096 7652815 8365386 9197407 10164997 11284889 12574100 14048662 15722221 17604453 19698568
57087 19698568 21998154 24484516 27125023 29872324 32664825 35428954 38082672 40539277
57079 40539277 42711630 44517444 45885257 46759482 47103429 46900243 46152540 44882170 43131282
57070 43131282 40963728 38463586 35728751 32861413 29958947 27107022 24374929 21813385
57062 21813385 19455120 17317121 15402981 13705566 12210796 10901522 9759436 8765241
57054 8765241 7899322 7143616 6482939 5904569 5397233 4950824 4556615 4207202 3896344
57045 3896344 3619000 3371242 3149746 2951350 2773100 2612572 2468000 2338142 2221924
57036 2221924 2118074 2025181 1942276 1869235 1806428 1754194 1712910 1683426 1667381 1667473 1687125 1727594
57024 1727594 1782540 1835054 1862733 1848993 1791452 1700654 1591942 1478347 1368405 1267060
57014 1267060 1176810 1098439 1031547 974788 926044 883125 844731 810618 780755 754613 731328
57003 731328 710240 691016 673475 657510 643052 629821 617170 604435 591517 578944 567291
56992 567291 556741 547315 539302 533123 528840 526190 525206 526437 530290 536312 543252 549593 553783 554321
56978 554321 550208 541500 529256 514907 499737 484685 470250 456562 443797 432481 423146 415885
56966 415885 410558 407301 406311 407242 409480 413210 419605 429657 443205 459336 477073 495066 511032
56953 511032 522255 526742 523744 513655 498136 480111 462658 447434 434476 423482 414617 407937
56941 407937 402870 398971 396773 397235 400625 406602 415208 427030 442303 460531 481121 503615 526743
56928 526743 547740 563238 570752 569177 558525 540043 516430 491000 466165 442904 421611 402858
56916 402858 387162 374489 364353 356158 349277 343127 337395 332035 326936 321919 317240 313725 312055
56903 312055 312092 313110 314504 316109 318032 320484 323654 327598 332367 338268 345691 354551 364302 374780
56889 374780 386713 401063 418087 437284 457829 478525 497491 512436 521490 523780 519562 510087
56877 510087 497136 482325 466910 452240 439778 430252 423206 418057 415315 416196 421248 430144 442730
56864 442730 459599 481518 508887 541850 580274 623178 668279 712048 749978 777311 790613
56853 790613 789355 775971 754485 729354 705114 685867 674484 672693 682051 703813 736862 775948
56841 775948 812903 840526 856245 863185 868293 878926 900076 933625 979013 1033364 1090664 1141724
56829 1141724 1176376 1186941 1170701 1130200 1071727 1002979 931043 861463 798190 743552 698180
56818 698180 661503 632838 612013 599004 593446 594828 602970 618126 640797 671630 711121 758857
56806 758857 812562 867515 916776 952559 968650 962586 936098 893837 841747 785823 730922 679866
56794 679866 633773 593353 559479 532520 511948 497134 488064 484763 486506 492283 501910 516145
56782 516145 535692 560356 588775 618338 645306 665548 675598 673389 658673 633257 600568 564299
56770 564299 527132 490655 456020 424135 395342 369518 346663 327073 310835 297457 286158
56759 286158 276292 267373 258933 250618 242482 235029 228837 224033 220214 216906 213981 211446 209039 206435
56745 206435 203806 201764 200577 199859 199160 198511 198173 198256 198828 200011 201664 203301 204697 206271 208508 211229
56729 211229 213840 216143 218536 221468 224927 228362 230999 232516 233548 235108 237342 239348 240557 241739
56715 241739 244095 247882 252520 257550 262587 266761 269341 270939 273119 276546 280275 283072 284700 285601
56701 285601 286067 286134 285793 284857 283002 280311 277413 274783 272265 269542 266624 263507 259791 255136 249838
56686 249838 244486 239304 234266 229603 225597 221971 218037 213533 208872 204466 200310 196433 193347 191618
56672 191618 191162 191308 191455 191388 191038 190348 189484 188810 188433 187989 187144 186124 185411 185039 184590 183867 183104 182398 181388
56653 181388 179808 178030 176687 175919 175343 174688 174156 174168 174943 176270 177590 178432 178900 179582 180847 182445 183999
56636 183999 185518 187108 188420 188953 188768 188440 188321 188275 188137 187941 187612 186946 186047 185421 185382 185706 186097 186652
56618 186652 187592 188769 189828 190747 191884 193395 194874 195689 195597 194879 193954 193018 192160 191577 191363 191163 190443
56601 190443 189224 188193 187861 188010 188249 188698 189616 190690 191337 191620 192141 193030 193688 193710 193452 193398 193485 193491 193646
56582 193646 194375 195693 197314 199177 201339 203420 204738 205262 205982 207913 210775 213113 213889 213641 213796 215045
56566 215045 216886 218771 221044 224331 228414 232305 235319 237566 239490 241495 244103 247869 252800 258171
56552 258171 263165 267517 271392 274950 278252 281321 284001 285947 287008 287539 288071 288699 288978 288383 286702
56537 286702 283986 280405 276322 272366 269135 266618 264071 260711 256529 252159 248018 243993 240108 236982
56523 236982 235110 233981 232460 229992 227002 224214 222095 220970 221074 222207 223682 224896 225830 226949 228852
56508 228852 232003 236409 241395 246042 250177 254771 261195 270118 281154 293374 306046 319018 332440
56495 332440 346125 359245 370770 380040 386670 390154 390055 386574 380492 372398 362371 350484 337290
56482 337290 323657 310434 298369 287932 278982 270871 263101 255711 248999 243175 238409 234812 232105
56469 232105 229615 226917 224308 222393 221309 220625 219884 219047 218401 218198 218404 218718 218775 218397 217718 217228 217589
56452 217589 219045 220855 221710 221032 219641 218798 218860 219280 219571 219624 219262 218312 217138 216474 216615 217338 218648 220882
56434 220882 223914 226928 229230 230724 231414 231208 230519 230327 231108 232313 233419 234945 237764 241846 246344
56419 246344 250670 254822 258825 262427 265382 267726 269860 272611 276994 283527 291937 301770 313040 326048
56405 326048 340930 357826 377209 399587 424962 452967 483373 516053 550462 585371 619038
56394 619038 649426 674410 692085 700925 699851 688609 668358 641531 610748 577938 544498 511789
56382 511789 481074 453145 428269 406284 386695 369054 353494 340514 330137 321665 314432 308237
56370 308237 302843 297735 292791 288516 285119 281927 278300 274572 271452 269023 266971 265278 263882 262173
56356 262173 259709 257184 255741 255444 255259 254478 253391 252599 252407 252901 253935 255015 255719 256269 257229 258823
56340 258823 261049 264115 267977 271657 273916 274544 274196 273163 271289 269048 267509 266916 266359 265343 264697
56325 264697 265329 266892 268434 269791 271585 274187 277337 280604 283725 286688 289855 293819 298767 304236
56311 304236 309804 315750 322623 330425 338748 347607 357615 369269 382491 396990 412704 429551 446900
56298 446900 463640 478898 492476 504372 513978 520078 521683 518643 511465 500963 488298 474895
56286 474895 461808 449285 437217 425780 415263 405532 396229 387422 379600 372987 367287 362159 357666
56273 357666 354220 352223 351665 351853 351800 351216 350960 352143 354964 358674 362436 365813 368754 371635 375113 379451
56257 379451 384204 389074 394709 402001 410797 420089 429305 438629 448237 458088 468440 479654 491309
56244 491309 502363 512324 521553 530272 538100 544733 550293 554737 557766 559579 560835 561499 560624 557763
56230 557763 553742 549413 544482 538370 531565 525148 519257 512921 505339 496756 488077 480050 472775 465772
56216 465772 458628 451720 445969 441805 438832 436696 435562 435380 435395 435035 434737 435153 436036 436765 437560 439189
56200 439189 441594 443824 445527 447511 450487 454004 457199 460043 463217 466998 470953 474676 478264 481913
56186 481913 485457 488606 491362 493886 496133 498003 499842 502349 505857 510010 514345 518846 523712 528892
56172 528892 534191 539598 545230 551161 557538 564599 572266 580144 588250 597306 607786 619163 630765
56159 630765 642931 656482 671425 687276 704461 724235 747112 772541 800443 832020 868713
56148 868713 911447 961512 1021270 1093308 1179642 1282388 1404366 1547871 1712634 1894832
56138 1894832 2086911 2277617 2453597 2603548 2722561 2813242 2883394 2942706 2999804 3059334
56128 3059334 3119749 3173779 3212161 3228447 3222058 3198251 3165422 3131149 3098765 3065800 3024751
56117 3024751 2965798 2880411 2764379 2619141 2451323 2271131 2090015 1918012 1761880 1624892
56107 1624892 1507834 1409928 1329395 1264049 1211698 1170026 1136606 1109663 1088511 1072629 1060651
56096 1060651 1051122 1043936 1039874 1038717 1038891 1039168 1039676 1040928 1042896 1045525 1049258 1054451 1060867 1068197 1076456
56081 1076456 1085528 1095026 1105005 1116168 1128964 1143027 1157774 1172917 1188214 1203529 1219413 1236784
56069 1236784 1255658 1274962 1293897 1312587 1331081 1348779 1365451 1381853 1398668 1415624 1432241
56058 1432241 1448607 1464828 1480511 1495483 1510285 1525432 1540923 1556985 1574380 1593323 1613046
56047 1613046 1633121 1654299 1677290 1701633 1726658 1752652 1780162 1808933 1838593 1869598 1902483
56036 1902483 1936766 1971614 2007122 2044006 2082483 2122346 2163749 2207095 2252429 2299497 2348079
56025 2348079 2397810 2448184 2499256 2551812 2606552 2663647 2723277 2785735 2850782 2917892 2987431
56014 2987431 3060506 3137366 3217183 3299744 3385957 3476295 3570302 3668162 3771083 3879409 3992099
56003 3992099 4108874 4231100 4359667 4493947 4633986 4781770 4939047 5105759 5281943
55994 5281943 5469162 5668537 5879376 6101494 6337057 6588485 6856464 7141796 7447224
55985 7447224 7775460 8127292 8503515 8906890 9340458 9806137 10306956 10848399 11435630
55976 11435630 12071866 12761607 13512866 14334394 15234097 16222903 17316851 18532801 19886200
55967 19886200 21396849 23093542 25010281 27183409 29657889 32493099 35758869 39531403
55959 39531403 43898639 48965422 54850997 61693516 69671511 79024421 90058376 103154399
55951 103154399 118786208 137511481 159906399 186449406 217311574 251935538 288437766
55944 288437766 323260832 351659508 369112231 372945318 363178859 342180471 313551667
55937 313551667 280992263 247590077 215555461 186238112 160283775 137836032 118720816
55930 118720816 102591384 89037284 77656252 68086221 60012236 53168877 47340779
55923 47340779 42354374 38066201 34358239 31137048 28327738 25866156 23697697 21779348
55915 21779348 20076664 18558574 17197799 15973970 14871757 13876357 12973701 12153436
55907 12153436 11407855 10728449 10106481 9536050 9013441 8533975 8092087 7683817 7306547
55898 7306547 6956815 6630776 6326290 6042309 5776719 5526902 5291769 5071170 4863913
55889 4863913 4668423 4484686 4313370 4153618 4003873 3864481 3737202 3622000 3515898
55880 3515898 3414827 3315221 3214484 3111998 3009732 2910385 2814881 2722677 2633738 2548496
55870 2548496 2466273 2385570 2306050 2228880 2155164 2085292 2019620 1958459 1901390 1847664 1797087
55859 1797087 1749548 1704069 1659548 1616159 1574845 1535768 1498534 1463663 1432350 1404688 1379227
55848 1379227 1354275 1328678 1301566 1272603 1242634 1213093 1184622 1157016 1130335 1105100 1081454
55837 1081454 1058969 1037319 1016496 996576 977941 961385 947151 934238 921547 909314 898410
55826 898410 888677 879111 869426 860043 850626 840051 828109 815965 804512 793305 781669 769960
55814 769960 759122 749603 741302 734163 728389 724254 721964 721456 722188 723330 724315 725081 725844 726725 727456 727309
55798 727309 725591 722344 718096 712653 704700 693169 678656 662962 647603 633303 620507 609667
55786 609667 601199 595703 593839 595240 597662 597945 593994 585666 574251 561729 550251 541454 536007 534080
55772 534080 536100 542739 554317 570185 588004 603264 610555 606648 592475 571752 548133 524137
55760 524137 501757 482439 466338 452641 440805 430826 422414 414896 408027 401986 396307 389636 381030
55747 381030 371045 361184 352532 345088 338181 331341 324884 319588 315804 313129 311012 309226 307454 304985
55733 304985 301360 296963 292433 287938 283514 279641 276705 274193 271164 267308 262925 258152 252992 247903
55719 247903 243558 240076 237111 234581 232742 231750 231804 233457 237084 242154 247672 253051 257902 261345 262547
55704 262547 261805 260191 258113 255098 250939 246095 240837 234927 228401 221921 216049 210722 205646 200715
55690 200715 195949 191520 187893 185448 183923 182707 181618 180868 180398 179864 179281 179100 179692 181222 183787 187048
55674 187048 189980 191678 192228 192112 191123 188806 185674 182849 180601 178341 176040 174442 173798 173620 173965 175649
55658 175649 178717 181853 184019 185719 187956 190794 193658 196317 198718 200367 200621 199367 196906 193490
55644 193490 189404 185146 181180 177746 175110 173540 172766 171960 170555 168738 166957 165395 164082 163029 162040
55629 162040 160924 160014 159935 160756 162015 163609 165793 168062 169062 168117 166044 163892 161669 158951 155961
55614 155961 153159 150330 147037 143695 141287 140057 139183 137802 135899 134119 133021 132531 131981 130772 129016
55599 129016 127258 125624 123676 121200 118589 116238 114067 111939 110041 108565 107419 106561 106168 106234 106479
55584 106479 106904 107932 109768 112138 114905 118329 122422 126743 131205 136485 143231 151531 161591 174118
55570 174118 189247 205637 221192 234194 243231 246873 244472 236963 226074 212968 198304 183119
55558 183119 168658 155475 143410 132361 122388 113260 104618 96491 89113 82435 76484 71927 69479
55545 69479 68816 68828 68877 69108 69474 69393 68605 67757 67730 68688 70024 71003 71335 71337 71564 72162 72680 72689 72279 71665 70616
55524 70616 68848 66795 65393 65044 65225 65092 64128 62306 60069 58112 56778 55697 54403 53232 53115 54453
55508 54453 56577 58427 59458 59814 59945 60188 60627 61257 62219 63675 65389 66781 67549 67945 68261 68464 68597
55491 68597 69060 70079 71318 72481 73847 75680 77542 78834 79666 80493 81232 81499 81452 81538 81512 80549 78330
55474 78330 75301 71886 68245 64799 62136 60174 58126 55546 52777 50242 48051 46513 46240 47245 48533
55459 48533 49107 48957 48669 48504 48318 48020 47600 46922 45867 44618 43496 42651 42055 41649 41310 40854 40214 39520
55441 39520 38886 38311 37809 37482 37427 37704 38319 39088 39660 39967 40453 41445 42438 42586 41871 41197 41226 41678 41985 42069
55421 42069 42167 42369 42656 43150 44030 45370 47157 49208 51086 52423 53365 54215 54624 53796 51686 49358 47770
55404 47770 46809 45961 45377 45579 46435 47119 47032 46331 45624 45514 46275 47557 48536 48692 48359 48164 48175 48055 47863
55385 47863 48031 48486 48466 47500 46112 45148 44711 44196 43220 42029 41027 40368 40246 41105 43094 45525 47384
55368 47384 48389 49085 49819 50217 49911 49236 48675 48041 46850 45287 44075 43461 42973 42239 41425 40759 40174 39598
55350 39598 39070 38421 37410 36375 36092 36670 37138 36592 35288 34095 33324 32676 31978 31314 30582 29584 28621 28413
55332 28413 29294 30808 32206 33088 33518 33792 34211 34817 35237 34918 33638 31802 30179 29365 29409 29915 30560 31438
55314 31438 32795 34447 35730 36119 35756 35270 35224 35757 36527 36946 36769 36520 37019 38356 39652 40019 39468 38645
55296 38645 37995 37503 36992 36324 35447 34562 34109 34285 34710 34773 34255 33386 32485 31746 31253 30944 30694 30526 30574 30715
55276 30715 30600 30207 30008 30319 30877 31394 32048 32892 33241 32369 30636 29192 28647 28687 28864 29044 28982 28276 27002
55257 27002 25789 24975 24282 23556 23145 23136 22886 21991 21273 21955 23943 25729 26191 25853 26024 27118 28343 28948
55239 28948 29199 29828 30841 31416 31067 30452 30606 31609 32477 32381 31541 30818 30798 31478 32492 33379 33773 33640 33261
55220 33261 32875 32414 31730 30904 30199 29769 29516 29188 28581 27749 27019 26643 26453 26152 25897 26216 27173 28072 28351
55201 28351 28420 29124 30538 31839 32383 32458 32805 33657 34442 34345 33102 31328 30066 29887 30492 31238 31857 32445
55183 32445 33002 33404 33766 34353 35080 35501 35416 35090 34708 33990 32624 30759 28849 27269 26358 26461 27565 29127
55165 29127 30624 32078 33642 34980 35571 35533 35529 35818 35939 35467 34611 33888 33640 34040 35083 36343 37144 37328
55147 37328 37451 37900 38225 37857 37064 36564 36354 35656 34102 32361 31360 31293 31646 31843 31645 31253 31272 32303
55129 32303 34229 36070 36877 36699 36414 36677 37338 37906 38255 38644 39243 39872 40228 40192 39859 39404 38994 38687 38343
55110 38343 37724 36892 36361 36596 37390 38085 38430 38762 39185 39076 37903 36197 35113 35088 35487 35592 35380 35159
55092 35159 34988 34853 35051 35932 37298 38427 38740 38263 37435 36574 35602 34200 32218 29909 27814 26466 26188
55075 26188 26943 28244 29370 29939 30197 30561 31032 31339 31521 31898 32452 32690 32273 31439 30639 30082 29791 29796 30015
55056 30015 30232 30417 30800 31418 31865 31751 31194 30575 30029 29469 28978 28818 29123 29776 30527 31073 31166 30869 30587
55037 30587 30703 31252 32112 33249 34589 35854 36791 37392 37677 37489 36813 36065 35692 35581 35269 34647 34082 33802
55019 33802 33595 33178 32569 31968 31500 31151 30784 30181 29243 28203 27501 27388 27791 28511 29442 30586 31935 33369
55001 33369 34634 35514 36038 36334 36309 35780 34997 34616 34886 35270 35238 35052 35239 35694 35979 36313 37435 39468 41679
54982 41679 43558 45428 47677 50011 51927 53415 54711 55694 56088 56062 56165 56650 57231 57511 57403 57085 56731
54965 56731 56392 56093 55987 56296 56970 57550 57603 57253 56986 56984 56988 56762 56290 55456 54091 52496 51348 50765 50000 48507
54945 48507 46874 46114 46375 46962 47451 48047 48909 49771 50415 50935 51378 51600 51759 52521 54393 57164 60333 63846
54927 63846 68022 72909 78146 83536 89375 96084 103662 111605 119162 125579 130255 132906 133554 132304 129153
54912 129153 124112 117420 109460 100542 91003 81525 73119 66587 62073 59131 57040 55052 52712 50304
54898 50304 48727 48520 49156 49627 49652 49822 50576 51614 52528 53466 54820 56594 58543 60661 63149 66083 69550
54881 69550 74006 79945 87166 94769 102041 108966 115652 121558 125614 127000 125555 121574 115559 108284
54867 108284 100769 93866 87843 82455 77428 72793 68838 65951 64465 64336 64845 64924 64108 62951 62168 61562
54851 61562 60286 58147 56074 55083 55209 55713 55967 55737 54940 53629 52201 51174 50685 50417 50077 49768 49787
54834 49787 50202 50680 50633 49579 47432 44561 41621 39360 38362 38652 39537 40124 40067 39601 38874 37752 36454
54817 36454 35798 36310 37404 38008 37822 37470 37519 37870 38158 38277 38382 38718 39548 40949 42585 43844 44237 43523
54799 43523 41656 39047 36770 35899 36461 37441 38019 38438 39501 41531 44087 46419 47931 48494 48551 48838 49723
54782 49723 50964 52160 53287 54622 56354 58470 60882 63500 66342 69704 74091 79769 86512 93878
54768 93878 101588 109573 117859 126571 135735 144760 152301 157008 158465 157289 154405 150486 145988 141409
54754 141409 137317 134167 132091 130777 129546 127633 124515 120177 115225 110664 107184 104519 101707 98134
54740 98134 94123 90387 87187 84272 81521 79250 77858 77359 77390 77633 78201 79550 81923 85036 88546 92758
54724 92758 98426 105709 113649 120870 126491 130249 132154 132362 131067 128157 123301 116692 109376 102447 96239
54709 96239 90707 86180 82973 80566 77994 75087 72625 71221 70716 70717 71004 71215 70879 70082 69446 69100 68297
54692 68297 66514 64365 62824 61974 61158 60071 59034 58339 57955 57932 58538 59822 61342 62494 63039 63355 64270
54675 64270 66444 69634 72693 74486 74753 74021 72985 72192 71982 72364 73067 73972 75186 76450 76866 75883 74240
54658 74240 73313 73587 74428 75293 76394 78023 79980 82077 84633 88005 91980 96134 100545 105748 112047
54643 112047 119177 126523 133426 139299 143689 146244 146697 145076 141946 138116 133909 128980 123080 116724
54629 116724 110846 105953 101916 98429 95361 92711 90507 88828 87748 87262 87316 87824 88547 89158 89561 90030
54613 90030 90793 91648 92220 92531 93035 94085 95575 97080 98221 98889 99286 99732 100343 101017 101761 102817 104267
54596 104267 105741 106821 107583 108411 109372 110174 110678 111068 111497 111955 112565 113574 114898 116034 116660 116995 117349
54579 117349 117639 117671 117643 117989 118812 119820 120810 121934 123438 125351 127422 129275 130697 131944 133607 135916
54563 135916 138207 139449 139370 138802 138763 139435 140191 140428 140088 139445 138665 137719 136620 135569 134820 134385 133980 133386
54545 133386 132868 133041 134219 136029 137892 139810 142409 146109 150512 154759 158364 161445 164242 166762 168978
54530 168978 171068 173193 175125 176342 176445 175422 173569 171404 169549 168340 167473 166263 164421 162365 160623
54515 160623 159124 157385 155273 153290 152076 151887 152581 153857 155327 156561 157362 158045 159350 161917 165743
54500 165743 170054 173811 176506 178519 180626 183193 186009 188828 191691 194552 196936 198353 198976 199575 200763
54485 200763 202501 204316 205719 206397 206348 206030 206156 207074 208454 209668 210369 210595 210527 210395 210479 210878 211287 211272
54467 211272 210827 210414 210348 210396 210130 209544 209055 208952 209065 209009 208593 207857 206817 205325 203199 200463 197445 194653
54449 194653 192455 190744 188916 186385 183199 180004 177299 174984 172845 171220 170656 170964 171160 170611 169769
54434 169769 169454 169801 170375 170989 171792 172662 173202 173372 173541 173683 173083 171237 168641 166281 164602 163332 162056
54417 162056 160543 158645 156389 154216 152745 152194 152282 152786 153890 155793 158167 160289 161708 162655 163713
54402 163713 165147 166663 167871 168803 169684 170260 169764 167853 165316 163461 162879 163112 163384 163226 162399 160808
54386 160808 158819 157332 157040 157688 158363 158417 157840 156823 155440 153921 152823 152553 152818 152938 152672 152404 152434
54369 152434 152539 152446 152392 152770 153405 153690 153421 153000 152708 152298 151607 151086 151227 151736 151772 150947 149619 148258 146946
54350 146946 145545 143943 141981 139561 136997 134963 133815 133207 132574 131819 131266 131088 131099 131071 130999 130933 130656 129650
54332 129650 127508 124448 121399 119427 118913 119342 119836 119796 119108 117981 116743 115555 114137 111942 108884 105815
54316 105815 103980 103864 104738 105446 105496 105313 105510 106168 106861 107256 107442 107712 108180 108775 109446 110150 110631 110434 109298
54297 109298 107423 105283 103168 100937 98233 94927 91414 88400 86305 84910 83714 82480 81259 79980
54283 79980 78475 77008 76335 76845 77855 78167 77325 76031 75284 75385 75899 76328 76582 76848 77226 77634 78059 78721
54265 78721 79764 80861 81391 81196 80902 81268 82397 83878 85536 87520 89584 90854 90650 89275 87639 86304
54249 86304 85219 84280 83623 83300 83036 82551 81892 81274 80742 80219 79744 79428 79187 78742 77952 77056 76536 76759 77724
54230 77724 78992 79860 79735 78496 76551 74535 72918 71763 70777 69602 68206 66984 66402 66538 67027 67429
54214 67429 67566 67496 67216 66451 64839 62490 60382 59837 61267 63595 65266 65717 65474 65011 64205 63106 62436
54197 62436 62723 63364 63240 62075 60629 59585 58881 58202 57543 57037 56685 56560 56947 57907 58882 59135 58513 57520
54179 57520 56603 55615 54106 52058 50137 49189 49440 50310 50958 51022 50808 50885 51544 52552 53357 53609 53502 53457 53494
54160 53494 53206 52538 52175 52769 54003 54886 54895 54355 53729 53076 52370 51889 51915 52359 52949 53639 54600 55898 57340
54141 57340 58538 59067 58709 57710 56683 56143 56182 56578 57049 57328 57261 56930 56605 56452 56395 56230 55772 54964 54078
54122 54078 53714 54301 55549 56674 57153 56967 56212 54972 53631 52779 52593 52747 53104 53958 55269 56202 56000
54105 56000 55026 54414 54836 55982 57054 57403 56824 55591 54156 52644 50881 49110 48233 48861 50456 51924
54089 51924 52814 53362 53630 53381 52800 52630 53342 54652 55985 56957 57299 56891 56168 56080 57232 59331 61698 64068
54071 64068 66544 69027 71072 72316 72753 72592 72047 71364 70867 70747 70771 70423 69610 69128 69974 72072 74089
54054 74089 74884 74793 75063 76301 78073 79876 81777 83965 86294 88601 91075 94002 97389 101103 105161
54039 105161 109703 114821 120542 126734 132968 138679 143626 147976 151939 155612 159192 162944 166777 170235
54025 170235 173123 175722 178139 179811 180125 179204 177673 175837 173656 171412 169735 168736 167602 165415 162155
54010 162155 158553 155044 151268 146673 141301 135747 130554 126008 122424 120063 118518 116652 113721 110358
53996 110358 107857 106577 105639 104306 102932 102217 102075 101774 100889 99583 98096 96525 95019 93746 92616
53981 92616 91434 90412 90123 90748 91696 92226 92223 92061 91862 91279 90135 88956 88587 89314 90620 91814 92670 93405
53963 93405 94337 95824 98260 101672 105332 108227 110015 111206 112298 113174 113620 114067 115305 117533 120131
53948 120131 122428 124405 126455 128682 130673 132030 132942 134055 135813 138099 140652 143599 147304 151803
53934 151803 156695 161611 166477 171366 176394 181735 187327 192520 196591 199783 203318 207997 213304 218330
53920 218330 223072 228170 233751 239407 245205 251809 259412 267208 274254 280282 285334 289155 291438 292323
53906 292323 292176 291116 289200 286907 284927 283446 281987 279983 277220 273715 269478 264540 258992 252869
53892 252869 246176 239090 232015 225267 218827 212452 205968 199391 192897 186743 181132 176078 171469 167252
53878 167252 163429 159859 156259 152560 149012 145808 142797 139839 137263 135581 134788 134245 133254 131425 128622
53863 128622 125073 121601 119107 117530 115824 113412 111134 110201 110560 111128 111396 111915 113046 114095 114153 113220
53847 113220 111955 110707 109340 107865 106705 106285 106639 107428 108138 108325 107902 107216 106719 106598 106826 107392 108284
53830 108284 109267 109982 110338 110641 111202 111876 112114 111565 110581 110036 110503 111656 112600 112788 112556 112851 114538 117835
53812 117835 122145 126480 130319 134108 138664 144139 149878 155319 160564 165935 171422 176887 182421 188026
53798 188026 193212 197405 200670 203571 206351 208671 210254 211378 212500 213679 214656 215403 216289 217568 218861
53783 218861 219358 218583 216833 214703 212357 209505 206023 202253 198636 195355 192456 189974 187715 185205 182208
53768 182208 179184 176926 175749 175163 174311 172611 170064 167084 164015 160835 157450 154163 151483 149435 147480
53753 147480 145276 143154 141612 140669 139977 139198 138039 136320 134380 133033 132643 132567 131989 131010 130396 130507 131121
53736 131121 132053 133178 133903 133459 131942 130427 129847 130181 130934 131864 132985 134388 136409 139592 143992 148677
53720 148677 152287 154162 154876 155733 157693 160552 163184 164741 165536 166527 168159 170140 172219 174598 177536
53705 177536 181089 185293 190025 194592 198176 200970 204195 208591 213519 218045 222297 227029 232336 237630
53691 237630 242721 248018 253628 258960 263489 267367 270986 274264 276709 278093 278888 279966 281844 284170
53677 284170 286134 287384 288276 289081 289423 288942 288169 288045 288650 289030 288402 286993 285492 284200 283050 282030
53661 282030 281134 280112 278675 276903 275116 273384 271438 269082 266497 264065 262019 260330 258816 257284
53647 257284 255540 253375 250691 247764 245275 243809 243228 242755 241804 240581 239704 239378 239185 238693 238015 237710
53631 237710 238273 239739 241683 243559 245167 246854 249104 251883 254580 256777 258914 261971 266499 272221
53617 272221 278555 285157 291761 297787 302577 306121 309272 313027 317636 322535 327097 331300 335618 340427
53603 340427 345691 351145 356531 361605 366170 370364 374759 379855 385498 391012 395921 400213 403899 406733
53589 406733 408579 409705 410395 410565 410073 409199 408331 407300 405503 402760 399626 396707 394015 391197 388149
53574 388149 385147 382484 380107 377573 374331 370193 365629 361409 357872 354613 350958 346674 342204 338395
53560 338395 336011 335212 335323 335241 334322 332890 331762 331350 331303 331030 330359 329636 329241 329205 329368 329739 330432 331276 331913
53541 331913 332498 333971 337223 342094 347625 353210 359120 365848 373447 381698 390570 400254 411004 423105
53527 423105 436819 452093 468501 485627 503347 521622 540314 559405 579181 599919 621566
53516 621566 644046 667785 693595 722032 753057 786303 821404 857967 895465 933397 971602
53505 971602 1010299 1049663 1089295 1128250 1165825 1202340 1239025 1277124 1317241 1359443 1403618
53494 1403618 1449582 1496985 1545314 1593881 1641846 1688362 1732698 1774045 1811418 1844210 1872866
53483 1872866 1898490 1921708 1942477 1961258 1979698 1999641 2021895 2046463 2073382 2102382 2131949
53472 2131949 2159763 2184377 2205882 2224742 2240585 2252386 2259283 2260767 2256513 2246526 2231327 2211674
53460 2211674 2188207 2161525 2132369 2101354 2068579 2033721 1996417 1956380 1913380 1867461 1819229
53449 1819229 1769679 1719804 1670520 1622788 1577275 1533639 1490488 1446385 1400969 1355070 1309968
53438 1309968 1266778 1226347 1189268 1155756 1125724 1099159 1076357 1057614 1042829 1031566 1023484
53427 1023484 1018611 1017367 1020455 1028551 1041696 1059019 1079402 1102462 1128556 1157728 1189108 1221686
53415 1221686 1255351 1290729 1328184 1367449 1408177 1450411 1494394 1540251 1588061 1638016 1690387
53404 1690387 1745451 1803539 1865013 1930200 1999586 2074096 2154797 2241892 2334137 2429500 2526356
53393 2526356 2623972 2722117 2820811 2920614 3022601 3127465 3234588 3342214 3448564 3552518
53383 3552518 3653263 3749633 3840182 3923988 4001395 4074002 4143881 4212498 4280123 4346209 4410292
53372 4410292 4472418 4532791 4591290 4647342 4699793 4746363 4783296 4805864 4809452 4790520 4747460
53361 4747460 4681402 4596119 4496417 4386246 4268326 4145116 4019162 3892233 3764781 3636737
53351 3636737 3508600 3381514 3256622 3134582 3015281 2897713 2780541 2663222 2546404
53342 2546404 2431026 2317456 2205884 2097113 1992384 1892646 1798487 1710453 1628755 1552786
53332 1552786 1481704 1415662 1355923 1303561 1258481 1219880 1187115 1159770 1137225 1118635 1103334
53321 1103334 1090999 1081451 1074470 1069776 1067114 1066258 1066937 1068789 1071542 1075372 1080948 1088932 1099385 1111755
53307 1111755 1125378 1139889 1155316 1172002 1190450 1211106 1234271 1260173 1288934 1320439 1354493
53296 1354493 1391184 1430749 1472911 1516780 1561773 1608276 1656942 1707735 1760156 1813978 1868883
53285 1868883 1923554 1976079 2025553 2072616 2118275 2162960 2207020 2251300 2296463 2342048 2386663
53274 2386663 2428823 2467155 2500196 2526727 2546416 2559774 2567390 2569333 2565075 2553654 2533916 2504951
53262 2504951 2466489 2419000 2363593 2301869 2235549 2165880 2093369 2018201 1940829 1862214 1783809
53251 1783809 1707477 1635088 1567814 1505811 1448629 1395605 1345626 1296876 1247355 1195741 1141636
53240 1141636 1085136 1026525 966283 905117 843990 784258 727526 674980 626941 583365 544595
53229 544595 511158 482921 458998 438517 420993 405851 392239 379731 368764 359898 352886 346775
53217 346775 340685 334083 326655 318565 310730 304189 299016 294316 289427 284510 279792 274836 269135 262965
53203 262965 257016 251379 245551 239400 233444 228123 223374 219065 215288 211897 208395 204637 201196 198453
53189 198453 195745 192079 187547 183354 180375 178242 176024 173362 170721 168786 167801 167370 166804 165822 164855
53174 164855 164446 164429 164075 162989 161429 159677 157617 155210 152937 151325 150259 149213 148065 147266 147162 147439
53158 147439 147418 146757 145725 144787 144036 143122 141796 140380 139544 139617 140259 140812 140829 140262 139372 138606 138412 138991 140199
53139 140199 141691 143101 144136 144663 144788 144807 145026 145651 146693 147841 148575 148659 148442 148428 148594 148507 148070 147709
53121 147709 147709 147793 147610 147294 147181 147187 146776 145436 143007 139683 135938 132299 128955 125627 122004 118252 114931
53104 114931 112552 111334 111226 111825 112337 111998 110754 109397 108860 109345 110214 110676 110462 109737 108592 107052 105660
53087 105660 105523 107247 110055 112496 113950 114834 115420 115272 114214 113103 113012 113984 115227 116248 117193 118148
53071 118148 118769 118752 118222 117484 116717 116034 115609 115499 115500 115315 114839 114182 113463 112646 111649 110598 109850 109632 109731 109779
53051 109779 109791 110094 110706 111171 111171 110913 110653 110272 109649 109074 108800 108527 107921 107361 107416 107671 106985 105195 103799
53032 103799 104369 106697 109080 110191 110095 109616 109319 109331 109654 110265 111034 111848 112853 114363 116468 118819 120861
53015 120861 122233 122944 123253 123487 123884 124488 125212 126073 127255 128776 130266 131409 132600 134742 138218 142338
52999 142338 146071 149123 152020 155247 158610 161475 163471 164910 166545 168827 171408 173531 174935 176142
52985 176142 177728 179643 181444 182892 183983 184614 184724 184671 184966 185572 185891 185652 185459 186188 187979 190074 191613
52968 191613 192409 192965 193897 195449 197523 199981 202782 205827 208908 211898 214818 217574 219756 220940 221213
52953 221213 221244 221768 222980 224409 225371 225602 225447 225468 225968 226994 228604 230806 233273 235446 237009 238083
52937 238083 238948 239885 241205 243033 244981 246461 247441 248408 249522 250411 250985 251757 252924 253849 254100 254372 255518
52920 255518 257042 257582 256742 255562 255100 255398 256002 256731 257544 258214 258541 258564 258376 258008 257673 257759 258443 259527
52902 259527 260690 261627 262032 261878 261713 262163 263093 263822 264204 264836 266023 267204 267797 267942 267905 267282 265497 262823
52884 262823 260298 258664 257846 257344 256695 255553 253785 251693 249938 249129 249518 250949 252935 254833 256198
52869 256198 257027 257574 257970 258166 258262 258733 260124 262437 264822 266061 265464 263284 260250 256934 253672 250745
52853 250745 248256 246007 243897 242271 241445 240994 240109 238718 237641 237471 237817 237921 237541 236891 236084 234949
52837 234949 233216 230642 227251 223629 220622 218533 216939 215431 214114 213085 211950 210272 208166 205996
52823 205996 203802 201479 199262 197494 196082 194620 192949 191189 189354 187397 185544 184126 183049 181850
52809 181850 180363 178971 178081 177536 176719 175169 173102 171240 170033 169104 167819 166303 165316 164952 164240 162532
52793 162532 160635 159707 159529 158862 157398 156248 156290 156919 156845 155474 153154 150593 148447 146989 145738 143783
52777 143783 140878 137831 135491 133755 132118 130787 130481 131233 132089 132227 131843 131631 131758 131769 131368 130862 130704
52760 130704 130890 131009 130780 130231 129316 127751 125499 123164 121485 120521 119789 119203 119309 120301 121318 121261 120041
52743 120041 118534 117442 116794 116517 116826 117771 118887 119713 120307 120881 121261 121251 121361 122495 124761 127199 129018
52726 129018 130682 133310 137221 141540 145226 148087 150662 153366 155957 157686 157886 156437 153769 150458
52712 150458 146912 143408 140178 137294 134647 132280 130569 129837 129886 130165 130264 129966 129022 127400 125734 124947
52696 124947 125274 126097 126922 127965 129597 131647 133648 135427 137081 138592 139831 140741 141274 141404 141488 142319
52680 142319 144398 147321 150186 152385 153777 154402 154538 154740 155321 155891 155912 155509 155194 154971 154453 153826 153894 154883
52662 154883 155856 155705 154298 152356 150624 149570 149480 150266 151295 151833 151698 151294 151092 151241 151539 151580 151055 150122
52644 150122 149410 149445 150132 150965 151604 152127 152802 153811 155097 156264 156721 156176 155017 154052 153792 154053 154231 153844
52626 153844 152877 151746 150922 150538 150296 149811 148985 148029 147200 146584 146112 145674 145253 144956 144857 144837 144742 144768 145508 147389
52606 147389 150212 153413 156698 160144 163762 167317 170669 173972 177327 180520 183334 185925 188544 191036
52592 191036 192995 194416 195777 197359 198842 199832 200513 201443 202851 204494 206144 207830 209520 210847 211354
52577 211354 210905 209821 208766 208439 209114 210341 211287 211488 211151 210666 210108 209348 208482 207836 207618 207756 208010 208111
52559 208111 207778 206807 205179 203061 200733 198549 196934 196239 196520 197332 197755 196876 194574 191838 189950 189231
52543 189231 188763 187420 184922 181733 178314 174784 171173 167673 164567 161993 159723 157220 154240 151481
52529 151481 150220 150960 152723 154011 154275 154075 154036 154200 154394 154684 155224 155958 156698 157369 158020 158648 159085 159140
52511 159140 158913 158912 159582 160676 161425 161421 160968 160325 159187 157426 155854 155509 156375 157543 158586 159915 161649
52494 161649 162943 162876 161450 159340 157042 154727 152654 151279 150988 151823 153308 154551 154872 154485 154207 154345
52478 154345 154292 153421 151962 150628 149750 149259 149251 149991 151333 152549 152929 152445 151780 151682 152157 152301 151184 148976
52460 148976 146857 145653 144940 143824 142202 140723 139674 138528 136724 134491 132642 131694 131354 130745 129123
52445 129123 126504 123621 121264 119702 118747 118188 117935 117847 117657 117145 116270 115161 114060 113230 112752 112414 111881
52428 111881 110967 109687 108160 106581 105229 104339 103934 103829 103738 103388 102649 101709 101019 100916 101357 102064 102783 103297
52410 103297 103378 102990 102414 101904 101289 100245 98993 98362 98911 100211 101247 101432 101020 100539 100212 100059 100286 101206
52392 101206 102757 104369 105425 105733 105466 104824 103920 102832 101613 100326 99230 98784 99285 100541 102055 103438
52376 103438 104494 105062 105103 104903 104947 105553 106728 108247 109699 110665 111241 112174 114048 116419 118281 119368 120386
52359 120386 121868 123421 124399 124756 124792 124471 123510 121988 120419 119253 118594 118342 118394 118722 119322 120042 120532 120589
52341 120589 120525 120833 121533 122245 122861 123586 124300 124621 124825 125897 128211 130904 133172 135435 138378 141540 143935
52324 143935 145746 148244 152091 156727 161478 166251 170910 174932 178152 181195 184745 188867 193363 198192
52310 198192 203168 207757 211652 215150 218590 221770 224319 226312 228107 229809 231229 232177 232491 232081 231286
52295 231286 230950 231681 233090 234065 233747 232130 229927 228078 227170 226929 226400 224903 222779 220984 220061 219726
52279 219726 219384 218749 218022 217653 217965 218930 220393 222501 225556 229319 232876 235663 238349 242119 247120 252148
52263 252148 255982 258606 260922 263632 266700 269668 272169 274170 275911 277674 279601 281749 284212 287000
52249 287000 289800 292113 293714 294738 295255 295069 294174 293140 292683 292957 293562 294207 294954 295745 296126 295771 295064
52232 295064 294791 295262 295995 296307 296044 295643 295647 296222 297062 297681 297916 298244 299524 302290 306283 310655 314589 317744
52214 317744 320317 322840 325851 329538 333623 337603 341094 343977 346318 348326 350318 352559 354993 357223
52200 357223 358830 359738 360235 360693 361294 362072 363132 364676 366687 368665 369861 369871 368973 367834 366891 366020 364757
52183 364757 362854 360631 358709 357398 356468 355624 354924 354488 353961 352739 350712 348433 346484 345125 344528 344824
52167 344824 345669 346329 346513 346629 346850 346512 345055 343000 341169 339338 336706 333539 331187 330171 329334 327440
52151 327440 324846 322843 321938 321550 321084 320469 319736 318765 317571 316356 315146 313709 311916 309909 307889 306006
52135 306006 304478 303511 303062 302919 303089 303771 304883 305908 306456 306716 307126 307751 308258 308478 308711 309471 311101
52118 311101 313666 316979 320650 324254 327629 330945 334390 337885 341266 344595 348088 351749 355324 358621
52104 358621 361672 364531 367182 369740 372414 375138 377491 379193 380395 381243 381515 381100 380580 380776 381802
52089 381802 383006 383807 384108 383988 383578 383330 383802 384905 385852 386168 386260 386738 387659 388915 390864 393897 397595
52072 397595 401013 403725 406021 408114 409909 411732 414543 418861 423865 428178 431393 434249 437293 439972
52058 439972 441418 441694 441719 442044 442213 441547 440148 438756 437780 436840 435307 432980 430099 426885 423279 419130
52042 419130 414571 410050 405886 401861 397459 392631 387998 384115 380761 377285 373428 369428 365469 361521
52028 361521 357698 354300 351397 348766 346281 344021 341928 339745 337347 334686 331473 327484 323241 319685
52014 319685 316909 313903 309977 305750 302163 299073 295575 291321 286777 282383 278212 274301 270644 266805
52000 266805 262194 256808 251286 246191 241574 237122 232347 226840 220856 215479 211613 208885 206162 203015
51986 203015 199902 196993 193823 190347 187355 185309 183531 181189 178526 176449 175293 174694 174388 174452 174849
51971 174849 175341 175814 176183 175957 174428 171484 167903 164671 162123 159848 157317 154569 152247 150854 149987
51956 149987 148631 146353 143842 141983 140675 138969 136256 132946 130101 128718 129166 130838 132353 132611 131786
51941 131786 130992 130945 131369 131775 132284 133295 134711 135890 136324 136041 135378 134666 134150 134002 134246 134742 135336 135989
51923 135989 136739 137537 138140 138230 137663 136588 135275 133919 132682 131789 131410 131443 131582 131623 131512 131118 130239 128996
51905 128996 127986 127789 128397 129333 130227 131016 131633 131880 131784 131839 132594 134113 136070 138285 140852 143700 146371
51888 146371 148467 150154 152000 154449 157627 161518 165970 170647 175329 180386 186647 194702 204500 215737
51874 215737 228300 242272 257939 276120 298191 325301 357661 394722 435532 478131 518644
51863 518644 551784 572722 578567 568644 544515 510171 471182 432433 396362 363464 333937 308242
51851 308242 286506 268374 253544 241772 232249 223744 215773 209034 204227 200917 198123 195669 194202
51838 194202 193934 194041 193535 192282 190889 189896 189423 189444 190056 191359 193233 195353 197427 199365 201219 202981
51822 202981 204503 205629 206285 206434 206047 205181 204001 202631 201035 199165 197124 195139 193501 192626 192909 194251
51806 194251 195931 197279 198417 199938 201924 203783 205175 206628 208888 212031 215544 219012 222310 225322
51792 225322 228018 230805 234343 238797 243553 247838 251398 254422 256975 258732 259237 258341 256410 254152 252102
51777 252102 250212 248042 245367 242491 239839 237449 235084 232761 230851 229605 228859 228452 228688 229967 231921
51762 231921 233394 233545 232742 232035 231936 232147 232306 232373 232108 230877 228524 226052 224732 224621 224559 223722 222633 222384
51744 222384 223283 224639 225640 226114 226459 227111 228115 229166 230067 231107 232825 235398 238571 242255 246847
51729 246847 252634 259129 265405 270984 276034 280722 284801 287926 289986 290848 290115 287525 283485 278843 274118
51714 274118 269231 264023 258669 253365 247952 242245 236657 232052 228868 226759 225348 224894 225796 227646 229409
51699 229409 230700 232364 235505 240344 246399 253491 261936 271767 282331 292903 303358 313833 323857
51686 323857 332269 338094 341338 342733 342820 341542 338724 334654 329909 324707 318825 312286 305786 300149 295541
51671 295541 291574 288134 285743 284965 285711 287335 289263 291410 294047 297374 301151 304644 307042 308020 307852
51656 307852 306961 305512 303509 301131 298733 296577 294694 293041 291654 290669 290162 289962 289616 288687 287141 285324
51640 285324 283471 281458 279182 276975 275374 274560 274363 274784 276188 278882 282726 287289 292281 297768 304039
51625 304039 311228 318879 325920 331303 334697 336317 336102 333516 328316 321112 312837 303896 294150 283608
51611 283608 272815 262666 254027 247375 242505 238727 235604 233363 232287 231962 231685 231544 232516 235289 239422
51596 239422 243876 248027 251937 255956 260349 265061 269579 273212 275748 277687 279658 281755 283655 285120
51582 285120 286125 286588 286247 284776 281905 277634 272454 267158 262180 257332 252438 247912 244312 241577 239251
51567 239251 237351 236375 236387 236704 236695 236418 236214 236144 236195 236612 237554 238628 239234 239280 239141 239006 238625 237753 236449 234883
51547 234883 233126 231283 229558 228025 226471 224595 222309 219806 217437 215580 214429 213879 213725 214056 215259
51532 215259 217529 220518 223645 226618 229514 232470 235510 238603 241550 243743 244346 242930 239832 235752
51518 235752 231085 225857 220204 214554 209168 203738 197762 191345 185378 180806 177764 175525 173115 169925
51504 169925 165897 161492 157555 154866 153525 152843 152035 151003 150273 150223 150633 151098 151580 152308 153251 153944 153986
51487 153986 153521 153094 153053 153188 153028 152388 151454 150314 148676 146278 143430 140828 138802 137078 135342 133696
51471 133696 132365 131327 130581 130519 131467 132973 134072 134426 134705 135617 136860 137380 136495 134513 132345 130760
51455 130760 129904 129293 128270 126634 124861 123540 122723 122003 121199 120632 120583 120753 120504 119540 118075 116372 114459
51438 114459 112446 110785 109847 109361 108644 107467 106352 105963 106511 107870 109786 111708 112837 112931 112846 113721 115648
51421 115648 117629 118781 119031 118616 117592 116164 114943 114403 114346 114212 113710 112867 111768 110594 109745 109500 109650
51404 109650 109724 109490 109045 108536 108056 107729 107672 107869 108180 108346 107986 106811 104975 102997 101263 99862 98902 98511
51386 98511 98353 97706 96410 95224 94815 94874 94825 94889 95638 96738 97063 96073 94340 92650 91271 90266 89834 90114
51368 90114 91072 92752 95156 97790 99834 100950 101410 101359 100559 99084 97627 96781 96523 96702 97458 98673 99603
51351 99603 99668 99312 99462 100331 101249 101528 100982 99676 97764 95666 94057 93439 93811 94749 95717 96393 96817 97185
51333 97185 97443 97248 96465 95502 94970 95094 95577 95959 95986 95733 95450 95201 94780 94189 94032 94943 96635 98028 98509
51314 98509 98531 98832 99576 100548 101570 102298 102212 101396 100845 101343 102384 102845 102421 101661 100839 99681 98185 96921
51296 96921 96303 96141 96111 96165 96317 96426 96330 95885 94921 93571 92599 92848 94236 95801 96837 97559 98513 99870
51278 99870 101458 103022 104221 104826 105179 105979 107305 108276 108065 106919 105779 105164 104838 104369 103616 102733 102022
51261 102022 101767 101981 102358 102597 102709 102913 103379 104164 105197 106233 106999 107523 108055 108553 108550 107784 106686 105962
51243 105962 105871 106193 106708 107380 108202 109144 110153 111021 111430 111413 111538 112240 113151 113599 113701 114348 115956 117761
51225 117761 118731 118788 118723 119136 119983 121068 122390 123854 125093 126014 127175 129161 131661 133711 134946 136055
51209 136055 137759 139810 141463 142560 143522 144446 144905 144710 144217 143673 142850 141637 140499 139924 139775 139616 139371
51192 139371 139221 139098 138811 138475 138312 138095 137302 135914 134589 133924 133938 134396 135232 136396 137530 138132 137990 137299
51174 137299 136457 135859 135810 136390 137321 138058 138174 137772 137535 138221 140031 142519 145111 147509 149498 150681 150743
51157 150743 149899 148793 147927 147410 147179 147193 147373 147630 148010 148591 149216 149503 149226 148555 147974 148051 149202 151358
51139 151358 153901 156216 158292 160431 162450 163698 163990 164043 164655 165816 166958 167730 168124 168154 167895 167710 167917
51122 167917 168329 168543 168709 169472 171112 173146 174943 176358 177513 178334 178677 178716 178842 179217 179702 180223 180945
51105 180945 181959 182950 183390 183093 182499 182348 183034 184334 185773 187136 188572 190288 192330 194603 196960 199250
51089 199250 201412 203557 205834 208235 210616 212882 214999 216853 218335 219532 220664 221724 222467 222777 222791
51074 222791 222548 221857 220736 219694 219178 218860 217906 215947 213477 211174 209155 207105 205004 203397 202775 202805
51058 202805 202465 201159 199564 198938 199615 200589 200792 200298 199850 199637 199225 198552 198234 198681 199441 199684 198988 197474
51040 197474 195537 193738 192616 192313 192527 192929 193344 193424 192614 190830 188825 187503 187098 187383 188350 190095 192099
51023 192099 193291 192977 191481 189762 188596 188099 187779 187079 186085 185556 185990 186805 186946 186170 185182 184495 183886
51006 183886 183224 183167 184455 186880 189445 191373 192560 193264 193831 194679 196125 198137 200491 203103 205943 208775
50990 208775 211323 213687 216212 218985 221797 224593 227535 230528 233189 235526 238165 241491 244955 247787
50976 247787 250229 253395 257846 262874 267538 271944 277036 283357 290536 298003 305710 313946 322864 332475
50962 332475 342904 354240 366229 378498 391069 404270 417988 431371 443587 454677 465296
50951 465296 475784 485902 495481 504874 514505 524281 533794 543038 552624 563266 575199 588101 601341
50938 601341 614221 626172 636933 646544 655062 662268 667706 671018 672175 671309 668328 662775 654153 642410
50924 642410 628112 612176 595452 578442 561267 543860 526308 509066 492774 477856 464446
50913 464446 452668 442702 434476 427528 421423 416084 411538 407591 404167 401732 400804 401061 401498 401642 402058
50898 402058 403416 405587 407992 410392 412856 415287 417468 419334 420848 421853 422494 423410 424910 426211 426258
50883 426258 425161 424161 424201 425285 427234 430154 433817 437331 439903 441463 442217 442171 441444 440436 439189 437210
50867 437210 434502 432172 431250 431325 431235 430849 431272 433408 437225 442535 449541 458267 468153 478762 490441
50852 490441 503838 519041 535607 553291 572381 593361 616436 641354 667594 694722 722562
50841 722562 750989 779638 807930 835245 860916 884223 904840 923253 940415 956936 972866
50830 972866 988285 1003688 1019679 1036628 1054777 1074528 1096455 1121149 1148948 1179559 1211918
50819 1211918 1244647 1276571 1306445 1332338 1352033 1364423 1370032 1369767 1363483 1350273 1330005 1304020
50807 1304020 1274244 1242125 1208696 1175348 1144036 1116527 1093716 1075958 1063951 1058874 1061575 1072115
50795 1072115 1090474 1117289 1153368 1198710 1252541 1314182 1383134 1458141 1536783 1616234 1693986
50784 1693986 1767729 1835241 1895047 1946929 1991421 2028946 2059720 2084152 2102816 2115936 2123043
50773 2123043 2123099 2114887 2097448 2070270 2033020 1985269 1926830 1858491 1782120 1699996 1614328 1527365
50761 1527365 1441312 1357866 1278113 1203053 1133758 1070849 1014335 964181 920424 882395 848579
50750 848579 817919 790841 768356 750560 736737 726570 720362 718138 719326 723432 730492 740761
50738 740761 754433 771672 792505 816699 844157 875164 909614 946050 982217 1016609 1048861
50727 1048861 1078593 1104765 1126536 1144057 1158001 1168807 1176869 1182898 1187445 1190238 1190536 1188070 1183283
50714 1183283 1176784 1168967 1160235 1151338 1143401 1137672 1135121 1136102 1140416 1147736 1157889 1170690 1185687
50701 1185687 1202144 1219139 1235587 1250421 1262882 1272505 1278751 1280941 1278865 1273340 1265940 1258158 1250963
50688 1250963 1245113 1241670 1242058 1247626 1259291 1277640 1303387 1337548 1381223 1435440 1501389 1580447
50676 1580447 1673591 1780881 1901856 2036294 2184005 2343696 2512283 2685356 2857935 3024909
50666 3024909 3181591 3324668 3452724 3565790 3664666 3750761 3825968 3891859 3948750 3995625
50656 3995625 4030770 4052167 4057517 4044540 4011745 3959038 3887833 3800855 3701794 3594760 3483753
50645 3483753 3372537 3264752 3163742 3072146 2991777 2923862 2868943 2826223 2793305 2767079 2745140
50634 2745140 2726235 2709404 2693101 2675429 2655002 2631226 2603868 2572782 2538188 2500848 2461743
50623 2461743 2421896 2382712 2346254 2314816 2290298 2274174 2267683 2271505 2285148 2307019 2335156 2367637
50611 2367637 2402449 2437528 2471233 2502480 2530179 2552722 2568103 2574359 2569736 2552745 2522363 2478207
50599 2478207 2420599 2350769 2271114 2184883 2095143 2003923 1912385 1821673 1733496 1649932 1572702
50588 1572702 1502464 1438703 1380455 1327226 1279160 1236453 1198973 1166483 1138779 1115443 1095843
50577 1095843 1079664 1067120 1058330 1052792 1049891 1049619 1052256 1057567 1064973 1074574 1087369 1104210 1125010
50564 1125010 1149238 1176852 1208409 1244644 1286432 1335021 1391779 1457549 1532546 1616895 1710892
50553 1710892 1814485 1926723 2045872 2169710 2295256 2418402 2534652 2640925 2736694 2823404
50543 2823404 2903144 2978164 3051174 3125056 3201563 3280265 3358873 3434523 3504835 3568200 3623662
50532 3623662 3670904 3710532 3744434 3775740 3808114 3844700 3887393 3936757 3992420 4053588 4119355
50521 4119355 4188398 4258262 4325155 4384826 4433743 4469274 4489018 4490573 4472173 4433218 4373990
50510 4373990 4295226 4198198 4085003 3958562 3822562 3681536 3540638 3404924 3278788 3166020
50500 3166020 3069989 2993413 2938026 2904557 2892746 2901148 2927205 2967817 3019674 3078859 3140453
50489 3140453 3198902 3248641 3284235 3300488 3293298 3260678 3202821 3121463 3019629 2901766 2773247
50478 2773247 2639167 2503560 2369472 2239210 2114286 1995481 1883255 1778038 1680138 1589643
50468 1589643 1506548 1430787 1362113 1300134 1244497 1194905 1151041 1112701 1079847 1052146 1028576
50457 1028576 1007958 989912 974742 962339 951896 942986 936222 932231 930398 929332 928334 927759 927969
50444 927969 928676 929493 930617 932713 936474 942533 951400 963155 977403 993899 1013139 1036042 1063144
50431 1063144 1094388 1129703 1169379 1213654 1262186 1314208 1369209 1427134 1487788 1550269 1613364
50420 1613364 1676618 1740855 1807435 1877006 1949153 2023161 2098764 2175880 2253748 2330732 2405197
50409 2405197 2476387 2544208 2608111 2666383 2716716 2757523 2788713 2811217 2825860 2832591 2830597 2818809
50397 2818809 2796140 2761449 2713747 2652774 2579404 2495399 2402863 2304041 2201581 2098669 1998664
50386 1998664 1904536 1818565 1742378 1677077 1623271 1581143 1550621 1531515 1523438 1525595 1536766 1555590
50374 1555590 1580727 1610477 1642193 1672294 1697101 1713755 1720572 1716933 1703124 1680184 1649694 1613669
50362 1613669 1574426 1534018 1493396 1452352 1410517 1368195 1325913 1283503 1240213 1195598 1149888
50351 1149888 1103704 1058100 1014751 975162 939428 906442 875593 847544 823037 801711 782773
50340 782773 766073 751715 739089 727282 716235 706581 698346 690702 683138 676110 670241 665511 661578
50327 661578 658400 656142 654828 654422 654964 656421 658624 661624 665895 671982 680108 690175 701907 714897
50313 714897 728921 744379 762039 782124 803955 826756 850383 874845 899493 923259 945529
50302 945529 966228 985124 1001669 1015802 1028464 1041016 1054239 1067844 1080518 1090183 1094554 1092066
50290 1092066 1082479 1066608 1045580 1020494 992577 963228 933678 904733 876983 851151 828086
50279 828086 808369 792013 778568 767530 758682 752084 747756 745361 744223 743680 743419 743500 744174 745727
50265 745727 748354 752010 756413 761320 766845 773410 781461 791310 803198 817225 833172 850549 868949
50252 868949 888281 908633 930020 952221 974526 995557 1013574 1027264 1036263 1040917 1041730 1039148
50240 1039148 1033744 1026463 1018709 1012090 1007699 1005570 1005076 1006009 1008881 1014112 1021422 1030449 1041476 1054999
50226 1054999 1070958 1089192 1110649 1137363 1170977 1211754 1259311 1313953 1377081 1450769 1537467
50215 1537467 1639964 1761145 1903412 2068128 2255350 2463769 2690429 2929921 3173658
50206 3173658 3410540 3629405 3821726 3982918 4112368 4213224 4291681 4354838 4407962 4453136
50196 4453136 4489433 4512928 4516339 4490226 4426254 4319945 4170931 3982148 3760097 3515118
50186 3515118 3259524 3004315 2757483 2524755 2310534 2117462 1945765 1793946 1660254
50177 1660254 1543313 1441649 1353282 1276089 1208494 1149583 1098516 1054061 1015026 981012 952201
50166 952201 928118 907150 887803 870142 855275 843509 833862 825629 819556 816818 817239 819289 821721
50153 821721 824468 827787 831162 833539 834371 833922 832578 830398 827522 824734 823189 823588 825925 830034 835987
50138 835987 843732 852686 862168 872185 883341 895865 909199 922783 936884 952128 968406 984868
50126 984868 1001163 1018187 1037208 1058475 1081097 1104156 1127618 1152243 1179030 1208742 1241529
50115 1241529 1276812 1313916 1353027 1395147 1440821 1489270 1539302 1590965 1645901 1706271 1773949
50104 1773949 1850795 1939083 2041329 2160074 2298143 2458931 2646210 2863795 3115385 3404105
50094 3404105 3731396 4095789 4492033 4910337 5335982 5750740 6136864 6481786 6780603
50085 6780603 7035449 7253355 7443968 7616997 7779119 7931296 8067799 8177279 8245222 8257079
50075 8257079 8201412 8072306 7870353 7602163 7278753 6913366 6519392 6109039 5692911 5280129
50065 5280129 4878408 4494016 4131796 3795289 3486778 3207291 2956758 2734380 2538877
50056 2538877 2368455 2220786 2093360 1983946 1890610 1811308 1743731 1685740 1635860 1593130
50046 1593130 1556640 1525369 1498423 1475105 1454687 1436279 1418925 1401635 1383361 1363232 1340960
50035 1340960 1316924 1291754 1265990 1240099 1214494 1189353 1164624 1140395 1117102 1095178 1074672
50024 1074672 1055443 1037611 1021512 1007224 994413 982781 972423 963471 955425 947130 937738 927660
50012 927660 918287 910616 904374 898799 893959 890779 889759 890210 891004 891701 892652 894366 897249 901835 908865
49997 908865 919004 932568 949462 969325 991869 1017140 1045157 1075183 1105754 1135834 1165779
49986 1165779 1196890 1230262 1266493 1306419 1351692 1404676 1468098 1544825 1637502 1748271 1879011
49975 1879011 2031811 2208735 2410661 2635881 2879199 3131810 3382211 3618107 3828593
49966 3828593 4005835 4146380 4252289 4331070 4393330 4449075 4504946 4563095 4620483 4668165 4692123
49955 4692123 4676754 4609492 4484115 4301769 4070248 3802087 3512056 3214812 2923206 2647116
49945 2647116 2392766 2163047 1958664 1779012 1622334 1486110 1368089 1266732 1180284 1106017
49935 1106017 1041207 984634 936250 895397 860224 829030 801352 777305 756504 738131 721609
49924 721609 706664 693057 680749 670033 661025 653288 646413 640733 636827 634461 632665 630909 629635
49911 629635 629333 629508 628754 625626 619366 610195 599111 587213 575083 562952 551301 540750 531378
49898 531378 522753 514860 508313 503241 498629 493424 487881 483004 478962 474885 470237 465591 461842 459264
49884 459264 457599 456456 455301 453550 451103 448583 446685 445487 444593 443722 442964 442633 443074 444405 446291
49869 446291 448137 449634 450942 452388 454284 457033 460858 465191 468892 471480 473711 476479 479542 481954
49855 481954 483508 485071 487523 490954 494948 499182 503547 508087 513012 518552 524676 531139 537790 544541
49841 544541 551006 556454 560212 561962 561680 559572 556142 552047 547725 543248 538560 533755 529186 525420
49827 525420 522977 521851 521379 520866 520378 520623 522053 524317 526577 528109 528595 528172 527298 526419 525684 525158 525151
49810 525151 525979 527427 528858 529900 530664 531239 531455 531330 531291 531667 532270 532837 533598 535034 537256 539908 542518
49793 542518 544614 545689 545517 544580 543842 543921 544601 545174 545096 544293 543022 541602 540256 539075 538051 537100 536157
49776 536157 535346 534984 535287 536090 537029 538003 539233 540830 542497 543786 544447 544467 544020 543547 543633 544525 545862 547129
49758 547129 548328 549985 552500 555715 559144 562419 565423 568121 570436 572300 573759 574995 576270 577872
49744 577872 580020 582638 585203 587009 587823 588178 588836 590029 591477 593008 594768 596783 598748 600494 602336
49729 602336 604678 607455 610262 612899 615501 618118 620470 622216 623417 624614 626363 628589 630502 631388
49715 631388 631512 631957 633472 635774 638143 640347 642633 645112 647587 649923 652060 653637 654167 653814 653605
49700 653605 654464 656195 657836 658916 659888 661198 662425 662776 662233 661657 661783 662549 663581 664759 665913 666432
49684 666432 665796 664313 662737 661280 659653 657967 656812 656276 655697 654765 654107 654235 654578 654257 653269 652069
49668 652069 650431 647765 644468 641889 640688 640031 638750 636633 634200 631863 629848 628464 627839 627611 627349
49653 627349 627114 627229 627688 628246 628955 630078 631503 632754 633780 635244 637672 640598 642998 644507 645731
49638 645731 647226 648582 648947 648348 647935 648764 650685 652731 654323 655638 656970 658237 659235 659982 660636 661373
49622 661373 662453 664086 666026 667637 668588 669239 670080 671059 671865 672646 673953 675955 678123 679833 681003 682057
49606 682057 683480 685528 688160 691134 694195 697199 700001 702384 704354 706428 709302 713175 717640 722244
49592 722244 726841 731348 735583 739552 743530 747590 751351 754490 757230 759920 762417 764324 765708 767086
49578 767086 768734 770512 772417 774798 777861 781362 784971 788662 792608 796965 801908 807531 813545 819405
49564 819405 824946 830596 836724 843056 848986 854179 858644 862566 866319 870320 874500 878331 881756 885692
49550 885692 890998 897256 903276 908630 913956 919731 925566 930937 935940 940973 946157 951395 956626 961779
49536 961779 966797 971938 977669 984017 990399 996336 1001958 1007549 1013024 1018177 1023124 1028100 1033106 1038088
49522 1038088 1043228 1048706 1054431 1060323 1066611 1073476 1080670 1087847 1095072 1102597 1110281 1117580 1123946 1128997
49508 1128997 1132672 1135496 1138279 1141041 1142610 1141935 1139453 1136429 1133238 1129257 1124307 1119094 1114032 1108668
49494 1108668 1102770 1097084 1092354 1088265 1084119 1080016 1076554 1073669 1070602 1066903 1062787 1058489 1053931 1049091
49480 1049091 1044094 1038823 1032943 1026541 1020244 1014386 1008462 1001756 994272 986646 979330 972173 964688 956413
49466 956413 947142 937159 927216 917845 908661 898797 888195 877943 868890 860311 850624 839451 828339
49453 828339 819227 812583 807239 801636 794895 787074 778968 771598 765465 760206 755095 749795 744411 739012
49439 739012 733553 728285 723771 720297 717491 714721 711733 708821 706452 704806 703609 702420 701186 700367
49425 700367 700373 701123 702541 705363 710803 719054 728347 735805 739269 738476 734896 730668 727442 725853 725832 727169
49409 727169 729610 732726 736295 740808 747017 754849 763366 772066 781578 792551 804354 815633 825894
49396 825894 835824 846118 856636 866771 876043 884102 890691 895886 900080 903497 905926 907041 906717 905020
49382 905020 902221 898925 895786 892925 889951 886731 883730 881303 879137 876803 874521 872742 871167 868857
49368 868857 865450 861695 858502 855926 853435 850843 848473 846470 844464 842114 839758 838236 838069 838954 840169
49353 840169 841360 842780 844744 847013 848913 850016 850571 851290 852820 855346 858494 861541 863888 865517 866946
49338 866946 868776 871369 874893 879366 884487 889662 894472 899082 904050 909789 916298 923206 929906 935861
49324 935861 941168 946723 953457 961407 969870 978377 987013 995743 1004011 1011380 1018141 1024973 1032300 1040350
49310 1040350 1049428 1059497 1069669 1078821 1086863 1094915 1104024 1114097 1124222 1133674 1142359 1150557 1158576
49297 1158576 1166517 1174117 1180880 1186483 1191070 1195064 1198837 1202611 1206501 1210523 1214635 1218878 1223416 1228393
49283 1228393 1233912 1240117 1247077 1254466 1261698 1268595 1275695 1283619 1292308 1301169 1309804 1318205 1326281 1333649
49269 1333649 1340008 1345369 1349728 1352798 1354299 1354280 1352849 1349671 1344079 1335838 1325740 1315271 1305645 1297070
49255 1297070 1288927 1280627 1272255 1264442 1257793 1252585 1248787 1246012 1243406 1240020 1235566 1230591 1225717 1220907
49241 1220907 1215745 1210127 1204198 1197679 1189836 1180322 1169658 1158657 1147668 1136624 1125562 1114693
49229 1114693 1104110 1093735 1083524 1073488 1063629 1054146 1045623 1038643 1033207 1028763 1024791 1021004 1017074
49216 1017074 1012709 1008186 1004335 1001576 999264 996346 992493 988259 984316 980981 978403 976699 975765 975259
49202 975259 975005 975185 976019 977455 979313 981536 984048 986486 988351 989531 990568 992277 995062 998635 1002395
49187 1002395 1005997 1009453 1012840 1016202 1019856 1024438 1030249 1036667 1042649 1047868 1053076 1059171 1066263 1073763
49173 1073763 1081095 1087979 1094285 1100003 1105293 1110173 1114167 1116648 1117673 1118067 1118502 1118804 1118480 1117599 1116748
49158 1116748 1116233 1115884 1115671 1116024 1117317 1119386 1121831 1124478 1127314 1130295 1133591 1137747 1143184 1149685 1156747
49143 1156747 1164270 1172451 1181219 1190360 1200103 1210844 1222170 1232918 1242457 1251241 1259647 1266993 1272380
49130 1272380 1275994 1278787 1281157 1282770 1283576 1284248 1285460 1287341 1289763 1292650 1295833 1299149 1302838 1307340
49116 1307340 1312388 1316735 1319191 1319810 1319779 1320368 1322143 1324867 1327759 1329922 1330924 1331066 1330984 1331027 1331119 1331122 1331093 1331132
49098 1331132 1331114 1330720 1329794 1328622 1327805 1327787 1328594 1330051 1332090 1334710 1337775 1341055 1344367 1347526 1350282 1352529
49082 1352529 1354483 1356411 1358287 1360075 1362157 1365060 1368714 1372504 1376151 1380021 1384336 1388569 1392098 1395145
49068 1395145 1398613 1403121 1408644 1414990 1422097 1429726 1437220 1443945 1449906 1455735 1462142 1469531 1478137 1488219
49054 1488219 1499877 1512779 1526403 1540564 1555424 1570938 1586732 1602786 1619868 1638813 1659542
49043 1659542 1681152 1702866 1724522 1746368 1768888 1792688 1817949 1843968 1869784 1895288 1921114
49032 1921114 1947447 1973704 1999559 2025527 2052139 2079194 2106353 2133852 2162031 2190615 2219047
49021 2219047 2247115 2274650 2301041 2325863 2349776 2374037 2399190 2424956 2451341 2479027 2508490
49010 2508490 2539402 2571189 2603692 2637053 2671465 2707311 2745116 2784923 2825972 2867277 2908304
48999 2908304 2948810 2988242 3025697 3060493 3092503 3121860 3148429 3171677 3191161 3207238 3221276
48988 3221276 3234958 3249258 3264002 3278186 3290470 3299555 3304589 3305488 3302681 3296418 3286543 3273042 3256620
48975 3256620 3238560 3220102 3202123 3185135 3169320 3154581 3140781 3127967 3116259 3105681 3096307
48964 3096307 3088462 3082389 3077681 3073424 3069131 3065256 3062555 3061228 3061097 3062343 3065430 3070198 3075696 3081253
48950 3081253 3087281 3094684 3103890 3114891 3127925 3143469 3161736 3182772 3206971 3234932 3266751 3301964
48938 3301964 3340190 3381308 3424971 3470721 3518779 3570132 3625396 3684062 3745162 3808202 3873051
48927 3873051 3939446 4007165 4076396 4147480 4220520 4295612 4373128 4453314 4535848 4620158 4705898
48916 4705898 4792760 4880332 4968701 5058793 5151299 5245444 5339535 5432653 5525093 5617299 5709195
48905 5709195 5800665 5891835 5982496 6071803 6158888 6243403 6325295 6404516 6481145 6555295 6626635
48894 6626635 6694419 6758297 6818657 6875796 6929060 6977128 7018881 7053707 7081289 7101543 7114612
48883 7114612 7120441 7118434 7107903 7089006 7063002 7031417 6994988 6953455 6906246 6853239 6794800 6731231
48871 6731231 6662465 6588359 6509100 6425232 6337566 6247203 6155266 6062176 5967528 5871148 5774073
48860 5774073 5677882 5583208 5489602 5396763 5305097 5214951 5126297 5039679 4956628 4878413 4804902
48849 4804902 4735470 4670597 4611611 4558940 4511591 4468548 4429891 4396143 4367193 4342527 4322193
48838 4322193 4306910 4297248 4293203 4294598 4301390 4313350 4329826 4350265 4374822 4404036 4437920 4475758
48826 4475758 4516876 4561184 4608735 4659144 4711828 4766611 4823655 4882871 4943741 5005778 5068827
48815 5068827 5132894 5197869 5263421 5328984 5393929 5457999 5521536 5585004 5648321 5710982 5772830
48804 5772830 5834379 5896396 5959452 6023934 6090083 6157806 6226666 6296134 6365710 6434754 6502512
48793 6502512 6568438 6632372 6694356 6754343 6812000 6866594 6917266 6963686 7006281 7045443 7080703
48782 7080703 7111162 7136574 7157424 7174014 7186163 7193925 7197879 7198405 7195311 7188530 7178631 7166191 7151070
48769 7151070 7132629 7110132 7082415 7047613 7003858 6950132 6886027 6811007 6724506 6626790 6519276
48758 6519276 6404020 6283106 6158407 6031593 5904322 5778456 5655758 5537062 5422004
48749 5422004 5309810 5200200 5093286 4989043 4887343 4788300 4692091 4598603 4507678 4419590
48739 4419590 4334803 4253428 4175382 4101041 4031152 3966035 3905252 3848201 3794665 3744781 3698905
48728 3698905 3657625 3621489 3590405 3563485 3539772 3519018 3501549 3487412 3475913 3466129 3457824 3451628
48716 3451628 3448174 3447237 3448007 3450023 3453376 3458056 3463737 3470504 3479177 3490389 3503654 3517909 3532731
48703 3532731 3548529 3565742 3584343 3604005 3624227 3644358 3664029 3683531 3703302 3723075 3742091
48692 3742091 3760204 3778272 3797242 3817248 3837795 3858427 3878967 3899420 3919967 3940981 3962770
48681 3962770 3985287 4008164 4031098 4054237 4078186 4103375 4129336 4154792 4178675 4200800 4221363
48670 4221363 4240157 4256645 4270433 4281100 4287813 4289796 4287122 4280437 4269883 4254872 4234913 4209955
48658 4209955 4179831 4144095 4102759 4056582 4006222 3951668 3892993 3831332 3768631 3706574 3645975
48647 3645975 3586868 3528875 3471749 3415907 3362183 3310808 3260989 3211764 3162867 3114285 3065449
48636 3065449 3015678 2965358 2915990 2868867 2824162 2781467 2740685 2702032 2665442 2630421 2596495
48625 2596495 2563594 2531976 2501965 2473779 2447492 2423044 2400316 2379312 2360334 2343867 2330206
48614 2330206 2319218 2310632 2304434 2300802 2299704 2300820 2303868 2308680 2314839 2321563 2328294 2335305 2343463 2353373
48600 2353373 2364887 2377419 2390514 2404015 2417796 2431558 2445103 2458777 2473290 2488847 2504689
48589 2504689 2519881 2534388 2548814 2563047 2575947 2586830 2596691 2607218 2618811 2630236 2640192 2648500
48577 2648500 2655563 2661381 2665695 2668735 2671172 2673259 2674523 2674508 2673550 2672551 2672029 2671556 2670008 2666231 2659593
$$ [...]
##END NTUPLES=NMR SPECTRUM
##END=
