
##TITLE=AC1344_CHILS11171_7433130_S2orzwPgDc
##JCAMPDX= 6.0         $$ Bruker NMR JCAMP-DX V2.0
##DATA TYPE= NMR SPECTRUM
##DATA CLASS= NTUPLES
##ORIGIN= BRUKER
##OWNER= Administrator
$$ 1.72 TOPSPIN		Version 2.1
$$ 2013-01-29 20:32:32.011 -0500  Administrator@X
$$ Compression mode = diff/dup
##.OBSERVE FREQUENCY= 400.02188249412
##.OBSERVE NUCLEUS= ^1H
##.ACQUISITION MODE= SIMULTANEOUS (DQD)
##.ACQUISITION SCHEME= undefined
##.AVERAGES= 64
##.DIGITISER RES= 22
##SPECTROMETER/DATA SYSTEM= spect
##.PULSE SEQUENCE= noesygpps1d.comp
##.SOLVENT NAME= COFFEE_meoh
##.SHIFT REFERENCE= INTERNAL, COFFEE_meoh, 1, 14.96092
##AUDIT TRAIL= $$ (NUMBER, WHEN, WHO, WHERE, PROCESS, VERSION, WHAT)
$$ ##TITLE= Audit trail, TOPSPIN		Version 2.1
$$ ##JCAMPDX= 5.01
$$ ##ORIGIN= Bruker BioSpin GmbH
$$ ##OWNER= Administrator
$$ $$ E:\/data/COFFEE/nmr/AC1344_CHILS11171_7433130_S2orzwPgDc/12/pdata/1/auditp.txt
$$ ##AUDIT TRAIL=  $$ (NUMBER, WHEN, WHO, WHERE, PROCESS, VERSION, WHAT)
(   1,<2013-01-29 20:32:26.027 -0500>,<Administrator>,<X>,<go>,<TOPSPIN 2.1>,
      <created by zg
	started at 2013-01-29 20:20:55.555 -0500,
	POWCHK enabled, PULCHK disabled,
       configuration hash MD5:
       86 BA 57 50 F2 9D 5C 9B 26 00 A9 28 5F 66 2E 89
       data hash MD5: 64K
       F3 83 67 DA 2C DF 7F 22 29 0D C0 07 6F DB 98 7D>)
(   2,<2013-01-29 20:32:29.246 -0500>,<Administrator>,<X>,<proc1d>,<TOPSPIN 2.1>,
      <Start of raw data processing
       efp LB = 0.3 FT_mod = 6 PKNL = 1 PHC0 = 0 PHC1 = 0 SI = 128K 
       data hash MD5: 128K
       1F AA 0F B3 66 AA 2B C8 CB B1 08 54 1F 02 93 6E>)
(   3,<2013-01-29 20:32:30.293 -0500>,<Administrator>,<X>,<proc1d>,<TOPSPIN 2.1>,
      <pk PHC0 = -78.06885 PHC1 = 0 
       data hash MD5: 128K
       31 B3 87 14 96 CB 6B 2B AD F9 0E 73 34 A5 79 43>)
(   4,<2013-01-29 20:32:30.964 -0500>,<Administrator>,<X>,<proc1d>,<TOPSPIN 2.1>,
      <abs ABSG = 1 
       data hash MD5: 128K
       47 39 0A 43 A9 5E E7 46 CA 40 22 83 CE F7 2F F9>)
(   5,<2013-01-29 20:32:31.152 -0500>,<Administrator>,<X>,<proc1d>,<TOPSPIN 2.1>,
      <abs ABSG = 2 
       data hash MD5: 128K
       D2 A8 33 85 69 D0 29 03 33 FC 7B 51 EB F8 72 BF>)
(   6,<2013-01-29 20:32:31.324 -0500>,<Administrator>,<X>,<proc1d>,<TOPSPIN 2.1>,
      <abs ABSG = 3 
       data hash MD5: 128K
       F7 7C 17 C1 FE 4A 92 36 FA 9D 1C FD F8 45 36 AF>)
(   7,<2013-01-29 20:32:31.480 -0500>,<Administrator>,<X>,<proc1d>,<TOPSPIN 2.1>,
      <abs ABSG = 4 
       data hash MD5: 128K
       A0 63 49 AD E3 BA 8F 69 E3 A1 9F 26 F7 A2 6A 94>)
(   8,<2013-01-29 20:32:31.668 -0500>,<Administrator>,<X>,<proc1d>,<TOPSPIN 2.1>,
      <abs ABSG = 5 
       data hash MD5: 128K
       0C 9F 9A 38 81 FC 71 B4 57 2C 6F 03 15 E7 B0 43>)
$$ ##END=
$$ 
$$ $$ hash MD5
$$ $$ FE 6A DA B6 9F 54 34 75 8C AC 08 FA 7B 4A C5 BC
##$RELAX= 
##$RELAX= 
##$RELAX= 
##$RELAX= 
##$RELAX= 
##$RELAX= 
##$RELAX= 
##$RELAX= 
$$ Bruker specific parameters
$$ --------------------------
##$DU= <E:\>
##$EXPNO= 12
$$ [...]
##$TP07= 0
##$TPNAME0= <>
##$TPNAME1= <>
##$TPNAME2= <>
##$TPNAME3= <>
##$TPNAME4= <>
##$TPNAME5= <>
##$TPNAME6= <>
##$TPNAME7= <>
##$TPOAL= (0..7)
0.5 0.5 0.5 0.5 0.5 0.5 0.5 0.5
##$TPOFFS= (0..7)
0 0 0 0 0 0 0 0
##$TUNHIN= 0
##$TUNHOUT= 0
##$TUNXOUT= 0
##$USERA1= <user>
##$USERA2= <user>
##$USERA3= <user>
##$USERA4= <user>
##$USERA5= <user>
##$V9= 5
##$VALIST= <valist>
##$VCLIST= <CCCCCCCCCCCCCCC>
##$VD= 0
##$VDLIST= <DDDDDDDDDDDDDDD>
##$VPLIST= <PPPPPPPPPPPPPPP>
##$VTLIST= <TTTTTTTTTTTTTTT>
##$WBST= 1024
##$WBSW= 4
##$XGAIN= (0..3)
0 0 0 0
##$XL= 0
##$YL= 0
##$YMAX_a= 6470286
##$YMIN_a= -13453969
##$ZGOPTNS= <>
##$ZL1= 120
##$ZL2= 120
##$ZL3= 120
##$ZL4= 120
##$ABSF1= 14.96092
##$ABSF2= -5.597261
##$ABSG= 5
##$ABSL= 3
##$ALPHA= 0
##$AQORDER= 0
##$ASSFAC= 0
##$ASSFACI= 0
##$ASSFACX= 0
##$ASSWID= 0
##$AUNMP= <proc_prof1d_extract.lims>
##$AXLEFT= 0
##$AXNAME= <>
##$AXNUC= <1H>
##$AXRIGHT= 0
##$AXTYPE= 0
##$AXUNIT= <>
##$AZFE= 0.1
##$AZFW= 0.1
##$BCFW= 0
##$BC_mod= 0
##$BYTORDP= 0
##$COROFFS= 0
##$CY= 15
##$DATMOD= 1
##$DC= 0
##$DFILT= <>
##$DTYPP= 0
##$F1P= 0
##$F2P= 0
##$FCOR= 0.5
##$FTSIZE= 131072
##$FT_mod= 6
##$GAMMA= 0
##$GB= 0
##$INTBC= 1
##$INTSCL= 1
##$ISEN= 128
##$LB= 0.3
##$LEV0= 0
##$LPBIN= 0
##$MAXI= 10000
##$MC2= 0
##$MEAN= 0
##$ME_mod= 0
##$MI= 0
##$NCOEF= 0
##$NC_proc= -2
##$NLEV= 6
##$NOISF1= 0
##$NOISF2= 0
##$NSP= 0
##$NTH_PI= 0
##$NZP= 0
##$OFFSET= 14.96092
##$PC= 1
##$PHC0= -78.06885
##$PHC1= 0
##$PH_mod= 1
##$PKNL= yes
##$PPARMOD= 0
##$PPDIAG= 0
##$PPIPTYP= 0
##$PPMPNUM= 2147483647
##$PPRESOL= 1
##$PSCAL= 4
##$PSIGN= 0
##$PYNMP= <proc.py>
##$REVERSE= no
##$SF= 400.020009670066
##$SI= 131072
##$SIGF1= 0
##$SIGF2= 0
##$SINO= 400
##$SIOLD= 131072
##$SPECTYP= <>
##$SREGLST= <1H.CDCl3>
##$SSB= 0
##$STSI= 131072
##$STSR= 0
##$SW_p= 8223.68421052631
##$SYMM= 0
##$S_DEV= 0
##$TDeff= 65536
##$TDoff= 0
##$TI= <>
##$TILT= no
##$TM1= 0
##$TM2= 0
##$TOPLEV= 0
##$USERP1= <user>
##$USERP2= <user>
##$USERP3= <user>
##$USERP4= <user>
##$USERP5= <user>
##$WDW= 1
##$XDIM= 131072
##$YMAX_p= 411487916
##$YMIN_p= -11939
##$CURPLOT= <Network HP LaserJet P1505>
##$CURPRIN= <$Network HP LaserJet P1505>
##$DFORMAT= <normdp>
##$LAYOUT= <+/1D_H.xwp>
##$LFORMAT= <normlp>
##$PFORMAT= <normpl>
##$SURQMSG= 1
$$ End of Bruker specific parameters
$$ ---------------------------------
##NTUPLES= NMR SPECTRUM
##VAR_NAME=  FREQUENCY,     SPECTRUM/REAL,   SPECTRUM/IMAG
##SYMBOL=    X,             R,               I
##VAR_TYPE=  INDEPENDENT,   DEPENDENT,       DEPENDENT
##VAR_FORM=  AFFN,          ASDF,            ASDF
##VAR_DIM=   131072,        131072,          131072
##UNITS=     HZ,            ARBITRARY UNITS, ARBITRARY UNITS
##FACTOR=    0.0627417313425164, 1,          1
##FIRST=     8223.62146879497, -982,         -71800
##LAST=      0,             1568,            -72298
##MIN=       0,             -11939,          0
##MAX=       8223.62146879497, 411487916,    0
$$ Real data points
##PAGE= N=1
##DATA TABLE= (X++(R..R)), XYDATA
$$ [...]
61644D50945J3793J4725J5906J6792J6489J4708J2284J0365R016P097L747m48
61632E85419m136o699q553j0187j1458j1948j1545j0500r083p377n353l092q36
61619D84652J191K962M499N657O255O394O295N722M064J229j985m759p145r658
61605E05373j2207j4078j4894j5012j4911j4616j3972j2965j1645r995q238o898
61593C55942o238n775m751l111j687j279j775k317k298j988k081k766l437l352
61579C13087k468j500j234j792k530k609j835q46l91m40m06j66k79q98j161l74
61563B94158P34Q02k11r49n62K55N46M83P75J440J939K123K234K226J895J506
61547C09394J567J987K157J885J615J691J976K351K986L949N052O224P492Q485
$$ plain form
61644 450945 464738 479463 495369 512161 528650 543358 555642 566007 575023 582120 585867 585419
61632 585419 581283 574584 566031 555844 544386 532438 520893 510393 501310 493933 488580 485488 484652
61619 484652 485843 488805 493304 498961 505216 511610 517905 523627 527691 528920 526935 522176 515031 505373
61605 505373 493166 479088 464194 449182 434271 419655 405683 392718 381073 371078 362840 355942
61593 355942 349704 343929 339178 336067 334380 333101 331326 329009 326711 324723 322642 319876 316439 313087
61579 313087 310619 309119 307885 306093 303563 300954 299119 298273 297882 297442 297036 296870 296591 295693 294532 294158
61563 294158 294892 295694 295483 294534 293972 294227 294773 295256 296031 297471 299410 301533 303767 305993 307888 309394
61547 309394 310961 312948 315105 316990 318605 320296 322272 324623 327609 331558 336610 342834 350326 358811
61533C58811Q570P744O797O221N530M071K027N1j643l211m565n460o045o622o964
61518C65312o432m948l270k209j956k259k833l376l424k607r99P89J925J836P17
61503C36266n10r37m70K25N14L02j61o74j099j207q17j15L31L7q51j585j529q04
61485C26916m2M16P62J163J407J307J113J184J522J846J990J954J774J579J525
61470C46416J491J171O61N00Q04Q73K07n81n94j1K48nJ3P63J748K283K209J711
61452C59907J089R01J517K379K466J732J364K203L678M750N185N334N304N103
61438D02912N177O051P639R402J0961J2121J2602J2246J1289J0024Q505O905N726
61425E21560N164M643L640K619K512L497M913O212P251P817P650O950O196N291
$$ plain form
61533 358811 367381 375125 381922 388143 393673 397744 399771 399822 398179 394968 390403 384943 378898 372276 365312
61518 365312 358880 353932 350662 348453 346497 344238 341405 338029 334605 331998 330999 331788 333713 335549 336266
61503 336266 335756 334819 334349 334574 335088 335390 335229 334555 333456 332249 331432 331317 331648 331685 330834 329249 327720 326916
61485 326916 326874 327290 328052 329215 330622 331929 333042 334226 335748 337594 339584 341538 343312 344891 346416
61470 346416 347907 349078 349739 350239 351043 351916 352123 351542 350948 350937 351185 351180 351193 351956 353704 355987 358196 359907
61452 359907 360996 361897 363414 365793 368259 369991 371355 373558 377236 381986 387171 392505 397809 402912
61438 402912 408089 414140 421779 431181 442142 454263 466865 479111 490400 500424 508929 515834 521560
61425 521560 526724 531367 535007 537626 540138 543635 548548 554760 562011 569828 577478 584428 590624 595915
61411E95915L556P63k372m929o643p830q877r969j1037j1732j1720j1087j0197
61398E03841r173p847o354n324n162n402n100l801k004o39k41n16p42n04NM02
61382D51439N77N67L42k0j13M46J473K367K723K568K106J593J350J495J769J919
61366D72601K140K653L053K760K140K333L752N426O320O648P304Q518R815J1026
61352E46489J2477J4246J5952J7495J9274K1402K3254K4229K4548K4780K4936
61341G69082K4596K3785K2987K2270K1092J9221J7182J5291J2861R070M255m55
61329I61237m640q834j3197j6878j9096k0058k0355k0066j9085j7804j6680j5462
61317G69082j3655j1611j0415j0553j1249j1325j0365q907p780p320p054o147
$$ plain form
61411 595915 599471 600234 597862 592933 586290 578460 569583 559614 548577 536845 525125 514038 503841
61398 503841 494668 486821 480467 475143 469981 464579 459479 455678 453674 453035 452794 452278 451536 451032 451037 451439
61382 451439 452016 452583 452925 452905 452792 453238 454711 457078 459801 462369 464475 466068 467418 468913 470682 472601
61366 472601 474741 477394 480447 483207 485347 487680 491432 496858 503178 509826 517130 525648 535463 546489
61352 546489 558966 573212 589164 606659 625933 647335 670589 694818 719366 744146 769082
61341 769082 793678 817463 840450 862720 883812 903033 920215 935506 948367 957437 961692 961237
61329 961237 956597 947763 934566 917688 898592 878534 858179 838113 819028 801224 784544 769082
61317 769082 755427 743816 733401 722848 711599 700274 689909 681002 673222 665902 658848 652701
61305F52701m334k204m07J082K525L557L393J835m77k841m981o750p907q390q355
61290F18447p822o691n253m165l675l191k008j55J627K668K872K715K816L495
61276F01680M595N812P106Q549R957J0995J1635J2124J2539J2770J2933J3306
61264G24001J3779J3973J4091J5051J7436K0753K4197K7660L1447L5256L8124
61253I75768L9372L9055L7396L4256K9488K3515J7122J0651L757l865j1683j8648
61241A176184k4245k8814l2607l5079l5603l4571l3112l1730k9960k7470k4801
61230H38192k2595k0722j8663j6412j4327j2335r957p225n019m162m445m841m608
61217F92881l989l766m302n084n230m335k817j493r04j020j476k065k908m040
$$ plain form
61305 652701 648367 646163 645756 646838 649363 652920 656313 658148 657671 654830 649849 643099 635192 626802 618447
61290 618447 610625 603934 598681 594516 590841 587650 585642 585487 587114 589782 592654 595369 598185 601680
61276 601680 606275 612087 619193 627742 637699 648694 660329 672453 684992 697762 710695 724001
61264 724001 737780 751753 765844 780895 798331 819084 843281 870941 902388 937644 975768
61253 975768 1015140 1054195 1091591 1125847 1155335 1178850 1195972 1206623 1210380 1206515 1194832 1176184
61241 1176184 1151939 1123125 1090518 1055439 1019836 985265 952153 920423 890463 862993 838192
61230 838192 815597 794875 776212 759800 745473 733138 723181 715956 710937 706775 702330 697489 692881
61217 692881 688892 685126 680824 675740 670510 666175 663358 661865 660961 659941 658465 656400 653492 649452
61203F49452m938m827l513j596K91K132M120O088P829R737J2443J5868J9191K1792
61189G34069K3633K4643K4374K2575J9728J6672J4008J2087J1139J1062J1317
61178I25307J1359J1126J0857J0589J0074R149P977O872N965N070L933K569J176
61165A022023l60k574n761r452j2911j5943j8761k1216k2794k3365k3337k2925
61153H42624k1787j9655j6848j3940j1231q731o397m291k747k417l744o335r244
61140G15257j1851j4012j5442j5663j4779j3630j2751j1719r869p261m492k059
61128E81729k26Q23J265J744K778M289N992Q017J0633J3599J6184J7873J8787
61115F83487J9478K0443K1690K2675K2818K2144K1279K0775K0678K0685K0386
$$ plain form
61203 649452 644514 639687 636174 634578 634869 637001 641121 647209 655038 664775 677218 693086 712277 734069
61189 734069 757702 782345 806719 829294 849022 865694 879702 891789 902928 913990 925307
61178 925307 936666 947792 958649 969238 979312 988461 996438 1003310 1009275 1014345 1018278 1020847 1022023
61165 1022023 1021663 1019089 1013328 1003876 990965 975022 956261 935045 912251 888886 865549 842624
61153 842624 820837 801182 784334 770394 759163 750432 744035 739744 736997 734580 730836 724501 715257
61140 715257 703406 689394 673952 658289 643510 629880 617129 605410 595541 588280 583788 581729
61128 581729 581503 582326 583591 585335 588113 592402 598394 606411 617044 630643 646827 664700 683487
61115 683487 702965 723408 745098 767773 790591 812735 834014 854789 875467 896152 916538
61104I16538J9397J7711J5897J4478J3104J0888P572L730k28m441q773j2483j5152
61091I78238j7232j9212k0845k1683k1744k1160j9833j7994j6534j6076j6165
61080G69760j5958j5261j4403j3571j2864j2566j2685j2607j1802j0453q983p467
61068F21140o024n131m843m320k935j332m87k85Q3Q14J555K379L621N034O147
61053F15416P155Q437R517R668R356R865J1534J3571J5599J8022K0669K2469K3035
61040G94313K3438K4801K6909K8879L0448L1982L3650L5232L6556L7770L9278
61029A143256M1319M3419M4582M4456M4024M4471M5813M7584N0337N5182O1971
61018A666414O9380P6976Q5925R7391J11521J28266J47932J70771J97528K30664
$$ plain form
61104 916538 935935 953646 969543 984021 997125 1008013 1015585 1019315 1019087 1014646 1005873 993390 978238
61091 978238 961006 941794 920949 899266 877522 856362 836529 818535 802001 785925 769760
61080 769760 753802 738541 724138 710567 697703 685137 672452 659845 648043 637590 628607 621140
61068 621140 615116 609985 605142 600822 597887 596555 596068 595783 595866 596680 598235 600614 604235 609269 615416
61053 615416 622571 631008 640525 650193 659549 669414 680948 694519 710118 728140 748809 771278 794313
61040 794313 817751 842552 869461 898340 928788 960770 994420 1029652 1066208 1103978 1143256
61029 1143256 1184575 1227994 1272576 1317032 1361056 1405527 1451340 1498924 1549261 1604443 1666414
61018 1666414 1735794 1812770 1898695 1996086 2107607 2235873 2383805 2554576 2752104 2982768
61008B982768K73318L26780L91382M70881N73270P05291Q68127J059339J273165
60999H924321J491068J672944J767514J739242J585076J325287R87072O07640
60991B0100164K49228r483j17065r0079n614M8823J7763j19806l67183p09620
60981A8997128j098632j454502j700242j798789j760717j623915j430792j217847
60973F911692j012482q30529o76705n49663m46841l65144l00300k48228k06648
60964B275152j74333j49588j30400j15348j03306r2805q2633p2803o4031n6429
60954A233476m9420m2738l6742l1779k7779k4672k2646k1761k1551k1269k0447
60943I12672j9117j7551j5909j4222j2667j1641j1390j1655j1899j1872j1702
$$ plain form
61008 2982768 3256086 3582866 3974248 4445129 5018399 5723690 6591817 7651156 8924321
60999 8924321 10415389 12088333 13855847 15595089 17180165 18505452 19492524 20100164
60991 20100164 20349392 20339909 20222844 20132765 20127151 20175974 20193737 20073931 19706748 18997128
60981 18997128 17898496 16443994 14743752 12944963 11184246 9560331 8129539 6911692
60973 6911692 5899210 5068681 4391976 3842313 3395472 3030328 2730028 2481800 2275152
60964 2275152 2100819 1951231 1820831 1705483 1602177 1509372 1426739 1353936 1289905 1233476
60954 1233476 1184056 1141318 1104576 1072797 1045018 1020346 997700 975939 954388 933119 912672
60943 912672 893555 876004 860095 845873 833206 821565 810175 798520 786621 774749 763047
60932G63047j1534j1327j1117j1118j1406j1662j1371j0263q522o714n439m860
60920F47714m521l799k573j237k5J368L313N626P660Q995R843J0772J2182J4034
60906G09352J5968J7579J8672J9364K0010K0954K2144K3014K2883K1630J9822
60895I31392J8078J6324J3853J0141N520R70k690n456p984j0802j3749j6233j7924
60882I21440j8979j9644j9944j9864j9569j9191j8627j7741j6657j5636j4744
60871G20844j3832j2789j1617j0376r134p916o582m925l089j697j341j998l245
60858F32303m826o705q614j0018j0624j0656j0456j0100r494q699p965p534p505
60845E19107p779q141q426q641q820q805q366p569o815o387o130n765n279m826
$$ plain form
60932 763047 751513 740186 729069 717951 706545 694883 683512 673249 664727 658013 652574 647714
60920 647714 643193 639394 636821 635584 635559 636927 640240 645866 653526 662521 672364 683136 695318 709352
60906 709352 725320 742899 761571 780935 800945 821899 844043 867057 889940 911570 931392
60895 931392 949470 965794 979647 989788 995308 996278 993588 988132 980148 969346 955597 939364 921440
60882 921440 902461 882817 862873 843009 823440 804249 785622 767881 751224 735588 720844
60871 720844 707012 694223 682606 672230 663096 655180 648598 643673 640584 638887 637546 635548 632303
60858 632303 627477 620772 612158 602140 591516 580860 570404 560304 550810 542111 534146 526612 519107
60845 519107 511328 503187 494761 486120 477300 468495 460129 452560 445745 439358 433228 427463 422184 417358
60831D17358m306l446k302j376j056j095r05k62N33J096J320J298J168J202J688
60816D10915K528L165L192K887K795K935K830K324J880J929K251K260J710Q91
60802D44492L06K94Q12J376J369N93m55j032q54l31q3l65r21j387j729k178k753
60785D37154l163l333l741m837o210o854o301n048l835k947k454k577l325m077
60771C78452m070l299k521k321k487k391j770r07j63M19Q69R48M01l49l37P85
60755C61259K107K562K314K367K961L349L224L334M205N166N370N114N285N882
60741D14499N989N032L316J370n36k216l448m215m707n027n215n407n614n536
60727C88285n027m542m556m702m222l238k814l495m489m676l966l171k866k839
$$ plain form
60831 417358 413052 409606 407304 405928 404872 403777 402872 402610 403143 404239 405559 406857 408025 409227 410915
60816 410915 413443 416608 419800 422687 425482 428417 431247 433571 435451 437380 439631 441891 443601 444492
60802 444492 444798 445092 445904 447280 448649 449242 448787 447755 446901 446570 446487 446122 445201 443814 442085 439907 437154
60785 437154 433991 430658 426917 422080 415870 409016 402715 397667 393832 390885 388431 385854 382529 378452
60771 378452 374382 371083 368562 366241 363754 361363 359593 358686 358523 358942 359811 360759 361160 360811 360474 361259
60755 361259 363366 365928 368242 370609 373570 376919 380143 383477 387682 392848 398218 403332 408617 414499
60741 414499 420488 425520 428836 430206 429670 427454 424006 419791 415084 410057 404842 399435 393821 388285
60727 388285 383258 378716 374160 369458 365236 361998 359184 355689 351200 346524 342558 339387 336521 333682
60713C33682k559j856j082o87p02o72k99J09N3l76n86l50j15l33q63j202r93j55
60695C21014J039J913J821R03N3q3K63O23J033J655K162K141J937K350L490M564
60679C46878M925M799M715M736M658M580M758N020M851M100L259K850K805K653
60665D05587K156J539J127R82Q95O76K79k53q95j593k130k203j734j060o48o18
60649D02107o82n92m65n17p28r28j097j308j582k028k945m375n630n779m733l426
60633C65292k673k340j857j176p05n05j48N77J206J080J56q23r93k61N64O78K85
60616C58357L50J274K254K278J472R35J337K186K573K188J470R99J021J352J542
60601C81588J213M24l13n01k17n0m17r92r72J1J349K033J657P72K82O83J746K771
$$ plain form
60713 333682 331123 329267 328185 327498 326796 326124 325825 325934 325987 325611 325025 324675 324560 324227 323364 322162 321169 321014
60695 321014 322053 323966 325787 326690 326743 326660 326923 327546 328579 330234 332396 334537 336474 338824 342314 346878
60679 346878 351803 356602 361317 366053 370711 375291 380049 385069 389920 394020 397279 400129 402934 405587
60665 405587 407743 409282 410409 411391 412286 412962 413241 412988 412093 410500 408370 406167 404433 403373 402725 402107
60649 402107 401425 400833 400368 399851 399123 398195 397098 395790 394208 392180 389235 384860 379230 373451 368718 365292
60633 365292 362619 360279 358422 357246 356541 356036 355888 356465 357671 358751 358907 358084 357091 356830 357394 358072 358357
60616 358357 358707 359981 362235 364513 365985 366920 368257 370443 373016 375204 376674 377673 378694 380046 381588
60601 381588 382801 383225 382912 382411 382194 382144 381727 380735 379763 379774 381123 383156 384813 385585 385867 386550 388296 391067
60583C91067L154K916K724L101L816M278M387M493M636M449L963L852M661O295
60569D47792Q482J1135J3943J6300J8060J9714K1282K1718K0216J7462J4635J1642
60557F42381P483K148l049p031r848j1761j2493j1784r924p303m148j002J284
60544E74953K507L474M932O758Q606J0703J3333J6147J8694K1275K4373K7603
60532G33358K9969L1080L1301L0742K8909K5479K0685J4817Q031J007n001r314
60520I41063j2502j5311j7414j7983j7135j5856j4487j2341r129n838l531j956
60508G97580j86J883L626N064P026R883J3091J6342K0223K5260L1003L6735M2456
60495A009986M8479N4481N9641O3363O5157O4171N9628N1676M1303K9595J7701
$$ plain form
60583 391067 394221 397137 399861 402962 406778 411056 415443 419936 424572 429021 432984 436836 441497 447792
60569 447792 456274 467409 481352 497652 515712 535426 556708 578426 598642 616104 630739 642381
60557 642381 649864 652012 648963 641932 632084 620323 607830 596046 586122 578819 574671 573669 574953
60544 574953 577460 580934 585866 592624 601230 611933 625266 641413 660107 681382 705755 733358
60532 733358 763327 794407 825708 856450 885359 910838 931523 946340 954371 955378 950377 941063
60520 941063 928561 913250 895836 877853 860718 844862 830375 818034 808905 803067 799536 797580
60508 797580 797394 799277 802903 807967 814993 824876 837967 854309 874532 899792 930795 967530 1009986
60495 1009986 1058465 1112946 1172587 1235950 1301107 1365278 1424906 1476582 1517885 1547480 1565181
60484A565181P023j476q148j4000j9242k3302k6330k9616l4216l9969m6143n2208
60472A277554n7577o1374o3082o2944o1239n7822n2869m7457m2708l8708l4886
60461F96888l1024k7302k3689k0118j6982j4780j3335j2035j0783r959r450q485
60449D98946o714m847l841l822m129m082l440k371j367j018j473k085j962r50
60435D56845Q9J61q14j971k455k217j826j685j625j263n89r1l00j216k237k695
60419D36111k429j772j014k12M76O68L33P4M54J184J490J124N51J51j45m05m48
60402D36191k96l46q08j333j494j260p78o4P72J406J707J979K419K621K120J169
60386D44005N39O32J193J751J968J659J007O80J236K338K995K729K075J780J913
$$ plain form
60484 1565181 1572204 1570728 1562580 1548580 1529338 1506036 1479706 1450090 1415874 1375905 1329762 1277554
60472 1277554 1219977 1158603 1095521 1032577 971338 913516 860647 813190 770482 731774 696888
60461 696888 665864 638562 614873 594755 577773 562993 549658 537623 526840 516881 507431 498946
60449 498946 492232 487385 483544 479722 475593 471511 468071 465700 464333 463315 461842 459757 457795 456845
60435 456845 456934 457095 456281 454310 451855 449638 447812 446127 444502 443239 442650 442559 442259 441043 438806 436111
60419 436111 433682 431910 430896 430684 431160 431828 432161 432235 432689 433873 435363 436487 437038 437189 437044 436639 436191
60402 436191 435895 435549 434741 433408 431914 430654 429876 429812 430584 431990 433697 435676 438095 440716 442836 444005
60386 444005 444544 445176 446369 448120 450088 451747 452754 453434 454670 457008 460003 462732 464807 466587 468500
60371D68500K080K125K167K113J767J320J264J601J721J387J327K254L605M090
60357D97321L450K836L133L794L924L832M575O270P819Q322P978P449P028O661
60343E74392O211N471M301K958J945J412J098Q36O37K54o54j814k445k288j914
60328E90400j696j301n81j90o50j384j489r77n32l52k5O20J319J908K447K852
60312E90369L121L776N412P682R551J0690J1999J4375J7533K0394K2310K3411
60300G40623K3942K3631K1740J7644J1426L950l728j1013j7717k3482k7599k9569
60288G29848k9540k8019k5373k1830j7847j4112j1119q925p389o426n904n459
60276E47905m809m192m086m388m334l584k889l037l538l189j865p40n53o35j97
$$ plain form
60371 468500 470580 472705 474872 476985 478752 480072 481336 482937 484658 486045 487372 489626 493231 497321
60357 497321 500771 503607 506740 510534 514458 518290 522865 529135 536954 545276 553254 560703 567731 574392
60343 574392 580603 586074 590375 593333 595278 596690 597788 598624 599261 599515 598861 597047 594602 592314 590400
60328 590400 588704 587403 586822 586632 585982 584598 583109 582132 581600 581248 581223 581843 583162 585070 587517 590369
60312 590369 593490 597266 602678 610360 619911 630601 642600 656975 674508 694902 717212 740623
60300 740623 764565 788196 809936 827580 839006 842956 839228 828215 810498 787016 759417 729848
60288 729848 700308 672289 646916 625086 607239 593127 582008 573083 565694 559268 553364 547905
60276 547905 543096 538904 534818 530430 526096 522512 519623 516586 513048 509859 507994 507254 506701 506066 505869
60261E05869L76K83l15o57o08n49l63L71J226J075l32j813k208j656j027p15n89
60244D98368o85j164j747j772r73J72R81J241J244J303J415J439J477J847K643
60229E05789L495L966M034L966L828L427K718J948J330P93J69n56j209j508j219
60214E30971m12M15P60O87P22J127J532J486J083Q46J076J599K067K239J960J181
60198E49339J23o76p68k22N30J235J958K658K910K432J635J157R38K29j307k955
60182E59216l669l177k051j003l92k99o58j264j853k202k128j483l73P93J590
60167E41047J876J755J390R74O97N86N06M82P79J513K349K825K869K799K881L087
60151E68415L194L028K626K266K230K560L195M232N735P369Q683R741J0968J2303
$$ plain form
60261 505869 506245 506528 506213 505556 504948 504399 504036 504407 505633 506708 506376 504563 502355 500699 499672 498957 498368
60244 498368 497683 496519 494772 493000 492027 492199 493180 494421 495665 496968 498383 499822 501299 503146 505789
60229 505789 509284 513250 517284 521250 525078 528505 531223 533171 534501 535294 535463 534907 533698 532190 530971
60214 530971 530559 530974 531734 532421 533143 534270 535802 537288 538371 539217 540293 541892 543959 546198 548158 549339
60198 549339 549462 548786 548018 547796 548326 549561 551519 554177 557087 559519 561154 562311 563249 563478 562171 559216
60182 559216 555547 552370 550319 549316 548924 548625 547967 546703 544850 542648 540520 539037 538664 539457 541047
60167 541047 542923 544678 546068 547042 547739 548325 548831 549313 550092 551605 553954 556779 559648 562447 565328 568415
60151 568415 571609 574637 577263 579529 581759 584319 587514 591746 597481 604850 613533 623274 634242 646545
60137F46545J3172J3447J3691J4091J3954J2813J1262R857P852M102j073n952
60125G53761r297j1285j2616j3610j4283j4463j3682j1713r363p951p732p559
60113F20207o494m957l914l532l227k581j641o51N1J01m68j143j510j748k136
60098E86357k444k198j336j59J166K546L608M002M109M825O418Q038Q691Q408
60084F32031P954P658P027N650L919K539J647Q43m2p36j121j538k335l421m508
60069F55567n492o398p199p903q510q768q356p500o962p074p243o844o107n629
60055E55582n403n033m499l988l250j994p72m62q71q35Q0R59R99O45O77R24P73
60038E33532M38P90J948K915K787J794Q84N23K51o25k110l485m138m273m561n334
$$ plain form
60137 646545 659717 673164 686855 700946 714900 727713 738975 748832 756684 760786 759713 753761
60125 753761 744464 733179 720563 706953 692670 678207 664525 652812 643449 635498 627766 620207
60113 620207 613713 608756 604842 601310 598083 595502 593861 593210 593261 593362 592894 591751 590241 588493 586357
60098 586357 583913 581715 580379 580220 581386 583932 587540 591542 595651 600476 606894 614932 623623 632031
60084 632031 639985 647643 654670 660320 664239 666778 668425 669268 669226 668490 667369 665831 663496 660075 655567
60069 655567 650075 643677 636478 628575 620065 611297 602941 595441 588479 581405 574162 567318 561211 555582
60055 555582 550179 545146 540647 536659 533409 531415 530643 530181 529310 528475 528555 529514 530513 531158 531835 532759 533532
60038 533532 533970 534760 536708 539623 542410 544204 545088 545611 545862 545237 543127 539642 535504 531231 526670 521336
60022E21336o346p253p878q086p735o940o044n265m601m097l852l699l291k659
60008D43590k275k297k136j197J28P23P8j036j425q34p1K47N91J732L322M046
59992D43186L288K005J541K136L145M156N110N693N493M770M215L990L543K547
59978D94818J397O95P27J425K325K640J962R11N01R14J537K077K748L350L181
59963E21208K148J104P70J051J680K613L475L503K595J612J057M28n91j190o92
59948E40771J18k6j108k092k573l003l592m072m502n206n864n619m387l197k857
59933D92791l059l074k742k328j932j501j136r18o56k11J53N3l51l82L90J611
59917D76708K507K705K569K666L154L805M422N015N553N932O130O160N818M863
$$ plain form
60022 521336 514990 507737 499859 491773 484038 477098 471054 465789 461188 457091 453239 449540 446249 443590
60008 443590 441315 439018 436882 435685 435813 436536 436614 435578 434153 433319 433248 433495 434086 435818 439140 443186
59992 443186 446474 448479 450020 452156 455301 459457 464567 470260 475753 480523 484738 488728 492271 494818
59978 494818 496215 496910 497637 499062 501387 504027 505989 506900 507401 508315 509852 511929 514677 518027 521208
59963 521208 523356 524460 525230 526281 527961 530574 534049 537552 540147 541759 542816 543244 542653 541463 540771
59948 540771 540889 540863 539755 537663 535090 532087 528495 524423 519921 514715 508851 503232 498845 495648 492791
59933 492791 489732 486658 483916 481588 479656 478155 477019 476101 475445 475234 475387 475440 475089 474707 475097 476708
59917 476708 479215 481920 484489 487155 490309 494114 498536 503551 509104 515036 521166 527326 533144 538007
59903E38007L485K282J581J152O49K7o28j281j783j932j906k186k789l007k318
59888E29353j134k53J70N66J202J967K773L666M580N319N791O057O207O289O213
59873E78766N616M125J983M3j146j841k494l004l052k737k369j938j323q19q40
59858E68970j225j396j109n69J10J023K136L299M564N964P044P140O235M986L803
59843F10975K400N55j203k043j800j115o79o62r18j442k380l650m860n726o328
59828E81124o659o278m899l216k430k837l595m029m469n273n843n353m041k996
59814E19206k828l205l447l040j748P6J426J552Q93N10O98Q06L87k64q65j626
59798E08531k605l254l074k436k243k912l930m410l928k873j996j656j563j384
$$ plain form
59903 538007 541492 543774 545355 546507 547156 547183 546555 545274 543491 541559 539653 537467 534678 531671 529353
59888 529353 528219 527966 528136 528702 529904 531871 534644 538310 542890 548209 554000 560057 566264 572553 578766
59873 578766 584382 588507 590490 590533 589387 587546 585052 582048 578996 576259 573890 571952 570629 569810 568970
59858 568970 567745 566349 565240 564671 564781 565804 567940 571239 575803 581767 588811 595951 602186 607172 610975
59843 610975 613375 613930 612727 610684 608884 607769 607090 606428 605510 604068 601688 598038 593178 587452 581124
59828 581124 574465 568187 563288 560072 557642 554805 551210 547181 542712 537439 531596 526243 522202 519206
59814 519206 516378 513173 509726 506686 504938 505014 506440 507992 508885 509395 510093 510899 511286 511022 510157 508531
59798 508531 505926 502672 499598 497162 494919 492007 488077 483667 479739 476866 474870 473214 471651 470267
59784D70267j275j573k121k340j978j373j000j030j363j761j876j483p41m7M07
59769D50713P21J016J294J564J846K094K246K383K614K939L300L640L811L654
59755D83835L372L491M196N006N460N790O412P109P279O884O498O459O505O293
59741E64589N844N399N149N107M938M153K779J624J333J426R43j40q42n55K78
59726F02025R45J237J228R24M38P4n5r0qM36J121J503J370J238J630K364K943
59709F19323L314L831M575N155N169M672M164M133M515M698M139K994J880J192
59695F73754Q58O34K95l50j193j642j211k97J22l78j284j925k166k103j760j265
59679F60089r86j053j164j128j306k134l443m577n054m887m380l865l539l393
$$ plain form
59784 470267 468992 467419 465298 462958 460980 459607 458607 457577 456214 454453 452577 451094 450353 450306 450713
59769 450713 451434 452450 453744 455308 457154 459248 461494 463877 466491 469430 472730 476370 480181 483835
59755 483835 487207 490698 494894 499900 505360 511150 517562 524671 531950 538834 545332 551791 558296 564589
59741 564589 570433 575832 580981 586088 591026 595179 597958 599582 600915 602341 603284 603144 602302 601747 602025
59726 602025 602970 604207 605435 606359 606797 606871 606816 606726 606718 607154 608275 609778 611148 612386 614016 616380 619323
59709 619323 622637 626468 631043 636198 641367 646039 650203 654336 658851 663549 667688 670682 672562 673754
59695 673754 674612 675246 675541 675191 673998 672356 671145 670848 670970 670592 669308 667383 665217 663114 661354 660089
59679 660089 659103 658050 656886 655758 654452 652318 648875 644298 639244 634357 629977 626112 622573 619180
59665F19180l361l504l876m235m165l603l013k901l268l650l555k845j803q81
59651E74520k88J59P05J248J405R14j80j514k527k821k631k671l225l719l561
59636E55814k983k554k224j532n05M06J145K017K808K753J614J40p89r47o48l40
59620E54175m73j235k247k933l215l353l271k685j922j754k247k494j824o08L66
59605E24280P14M61j68o64n79j90k55r58j789k467l125l414k626j118m17j176
59589E06509k049j556j13Q40R87J087J290Q62m25j792k468k469k212k026k104
59574D94361k387k455k036j551j707k580l541l914l368j952k92O10M19O7N50J451
59558D71675J502N10k73J26J261K167K555K678K621K365K183K417L072L901M729
$$ plain form
59665 619180 615819 612315 608439 604204 600039 596436 593423 590522 587254 583604 580049 577204 575401 574520
59651 574520 574232 574391 575096 576344 577749 578663 578483 576969 574442 571621 568990 566319 563094 559375 555814
59636 555814 552831 550277 548053 546521 546016 546422 547567 549584 552392 555145 556759 556899 556110 555163 554515 554175
59620 554175 553702 552467 550220 547287 544072 540719 537448 534763 532841 531087 528840 526346 524522 523914 524280
59605 524280 524994 525455 525287 524623 524044 523854 523599 522641 520852 518385 515260 511846 509220 508102 507685 506509
59589 506509 504460 502904 502791 503631 504618 505705 506995 507857 507432 505640 503172 500703 498491 496465 494361
59574 494361 491974 489519 487483 485932 484225 481645 478104 474190 470822 468870 468578 469188 469607 469674 470224 471675
59558 471675 473177 473687 473414 473540 474801 476968 479523 482201 484822 487187 489370 491787 494859 498760 503489
59543E03489N401N690N576N594O532Q770J1964J5284J7856J9044J8483J6024J1790
59530F51497O358Q54l369n281m640k122J001L559N160O124O793P049O598N366
59516F84947L537J323j020l257n353p426r322j0575j0955j0775j0366r673q657
59503F02428p675o987o244n059l783l038k665j937q16j29l24p01l93N12J312J766
59487E66267K229K846L207K934K206J595J501J907K520L042L301L295L192L199
59473F03241L360L464L288K840K359K064K027K133K027J291Kr61o33R38K678L753
59457F33871M386N242O440P641Q765J0059J1539J2800J3453J3483J3200J2955
59445G53834J2912J2938J2916J3222J4661J7669K1903K6876L2753M0001M8298
$$ plain form
59543 503489 508890 514580 520156 525750 532282 541052 553016 568300 586156 605200 623683 639707 651497
59530 651497 657855 658709 655340 650059 645419 643297 644298 647857 653017 659141 665934 672983 679581 684947
59516 684947 688484 689807 688787 685530 680177 672751 663429 652854 641899 631124 620758 611085 602428
59503 602428 594753 587766 581522 576463 572680 569642 566977 565040 564224 564095 563771 563070 562677 563189 564501 566267
59487 566267 568496 571342 574549 577483 579689 581284 582785 584692 587212 590254 593555 596850 600042 603241
59473 603241 606601 610065 613353 616193 618552 620616 622643 624776 626803 628094 628096 627135 626502 627440 630118 633871
59457 633871 638257 643499 649939 657580 666345 676404 687943 700743 714196 727679 740879 753834
59445 753834 766746 779684 792600 805822 820483 838152 860055 886931 919684 959685 1007983
59434A007983N6215O1997O4353O2554N6280M5580L0883J2937p081k7352m5484
59423A318865n9106o6573o7539o3056n5045m5436l5601k6391j8268j1122m371
59412H66357K301Q231J2067J2798J0312N126j963r745j6474k0430k0856j8355
59400H29369j4200r284l906J429N390O483M207p11p051j3575j8945k1956k2289
59387G34961k0733j8403j5995j3791j1900j0197q427o648n246m393l939l842m125
59374F07322m183l044q40P67M35j087j839r20Q59K251K642K104J269J121K095
59359F08952L408L942L721L777M581N585O429P607R545J1758J3531J4830J6023
59346G13689J7137J7921J8346J8489J8171J7142J5585J3976J2448J0599P998M714
$$ plain form
59434 1007983 1064198 1126195 1190548 1253102 1309382 1354962 1385845 1398782 1391701 1364349 1318865
59423 1318865 1259759 1193186 1125647 1062591 1007546 962110 926509 900118 881850 870728 866357
59412 866357 868658 876889 888956 901754 912066 917192 915229 905484 889010 868580 847724 829369
59400 829369 815169 805885 801979 803408 808798 815281 819488 818777 811726 798151 779206 757250 734961
59387 734961 714228 695825 679830 666039 654139 643942 635515 628867 623621 619228 615289 611447 607322
59374 607322 603139 600095 599255 600022 600457 599370 597531 596611 597470 599721 602363 604467 605736 606857 608952
59359 608952 612360 616302 620023 623800 628381 633966 640395 648002 657547 669305 682836 697666 713689
59346 713689 730826 748747 767093 785582 803753 820895 836480 850456 862904 873503 881501 886215
59334H86215J316j595l843n837q212j1260j4637j7588j9446j9968j9410j8316
59322G47419j7162j6107j5061j3914j2664j1392j0129q741p070n299m024l653
59310F22203l746l354k085m46R69K210L673N533P721J0030J1869J2353J1080Q538
59296F86548N304J347l398q175j1908j4233j5343j5085j3179j0274p786o413n565
59283E81840m501l271k145q56R22K786M000M485M923N950P633R630J1495J2800
59269F35691J3394J3592J3831J4012J3449J1679R133O670M503K050j018m026o043
59256G26917p084p957q984r570r194q211p240o317n129l698k327j066K07J368
59242F51715K143K604L146L980M924N641N867N565N051M768M727M396L372J879
$$ plain form
59334 886215 887531 885936 882093 876256 868044 856784 842147 824559 805113 785145 765735 747419
59322 747419 730257 714150 699089 685175 672511 661119 650990 642249 635179 629880 625856 622203
59310 622203 618457 615103 613018 612572 613541 615751 619424 624957 632678 642708 654577 666930 678010 686548
59296 686548 691852 693199 689801 681626 669718 655485 640142 625057 611878 601604 593818 587405 581840
59283 581840 577339 574068 571923 571067 571989 574775 578775 583260 588183 594133 601766 611396 622891 635691
59269 635691 649085 662677 676508 690520 703969 715648 724781 731451 735954 738004 736986 732960 726917
59256 726917 719833 711876 702892 693322 684128 675917 668677 662360 657231 653533 651206 650140 650347 651715
59242 651715 653858 656462 659608 663588 668512 674153 680020 685585 690636 695404 700131 704527 707899 709778
59228G09778L48j132k618m001n312o945r058j1010j1933j1639j0519q919p189
59215F19851n931n415n037m045k654j702j346r71l34J22J78J62J33m40j724k932
59199E87915l195k574j779j203p14j77L06N87O97P74R62J320J821K417L019L464
59183E93640L691L904M276M467L892K599J369P26L72L9J79J223K697L809M484
59168F31367N074N481N403N147N266N606N533M956M270L489K296Q24n21j927l874
59153F78390o066p585q154q315q406q334q314q728r162q732p565o768o658o267
59139E69336m996l559k730k289j889j845k251k332j543m81J85Q96K344M191N690
59124E58727P094R205J1852J3920J4846J5142J5397J5620J5826J6517J8119K0291
$$ plain form
59228 709778 710126 708994 706376 702375 697063 690118 681060 670050 658117 646478 635959 627040 619851
59215 619851 613920 608505 603468 599423 596769 595067 593721 592750 592416 592538 592716 592878 593011 592571 590847 587915
59199 587915 584720 582146 580367 579164 578450 578273 578579 579166 579863 580637 581599 582919 584740 587157 590176 593640
59183 593640 597331 601235 605511 609978 613870 616469 617838 618564 618936 618975 619154 620377 623074 626883 631367
59168 631367 636441 641922 647325 652472 657738 663344 668877 673833 678103 681592 683888 684712 684191 682264 678390
59153 678390 672324 664739 656585 648270 639864 631530 623216 614488 605326 596594 589029 582261 575603 569336
59139 569336 564340 560781 558051 555762 553873 552028 549777 547445 545902 545421 545606 546502 548846 553037 558727
59124 558727 565821 575026 586878 600798 615644 630786 646183 661803 677629 694146 712265 732556
59112G32556K2118K3022K3305K3785K4884K6198K7086K7453K7635K7716K7502
59101A013260K7048K6454K5131K2101J7311J2028P495L839O24k091l769m126l442
59088A141863k407j819k136l108m310o021q958j3059j7298k0894k3941k6559k8338
59075I83015k9070k9183k8938k7922k5952k3709k1771j9774j7256j4694j2802
59064G31944j1440j0061q808q216q127p850p199o499n778m727l508k764k699k807
59050F41461k552j958j370j047j019j134j173j049p86l20L99J108J538K004L079
59035F37181M534N384N367N518O729Q582J0330J2200J4778J7689K0058K1981K4454
59022G94785K7851L1384L4122L5818L6597L6447L5108L2071K6814J9468J1207
$$ plain form
59112 732556 754674 777696 801001 824786 849670 875868 902954 930407 958042 985758 1013260
59101 1013260 1040308 1066762 1091893 1113994 1131305 1143333 1150828 1154667 1155291 1153200 1149431 1145305 1141863
59088 1141863 1139456 1137637 1135501 1132393 1128083 1122062 1113104 1100045 1082747 1061853 1037912 1011353 983015
59075 983015 953945 924762 895824 867902 841950 818241 796470 776696 759440 744746 731944
59064 731944 720504 710443 701635 693419 685292 677442 670243 663744 657966 653239 649731 646967 644268 641461
59050 641461 638909 636951 635581 634534 633515 632381 631208 630159 629373 629053 629452 630560 632098 634102 637181
59035 637181 641715 647099 652466 657984 664713 673295 683625 695825 710603 728292 748350 770331 794785
59022 794785 822636 854020 888142 923960 960557 997004 1032112 1064183 1090997 1110465 1121672
59011A121672L496k858p684j0839j2255j2311j1464r618o493k484J380M389O566
58998A061497Q256R592J0284R600O869K384k534o816j0594j4434j8116k0983k3022
58985A011983k4700k5892k5903k4619k2786k1084j9512j7801j5878j3797j1656
58974G88355r615p647n471l139j397q92j200j313q71k41M34J390K469L071L081
58959G67014L067L305L324K601J183o69k899n366p644r409j0693j1519j1626j0830
58945G09839r333p489n465l252p91K002N039P704Q976Q156N433J718k007n186
58931G15344p734r711j1042j1652j1757j1709j1529j0973j0118r390q813p910
58919E93006o622n732n763o043n617m591l752l164k130m56J166K152K655L077
$$ plain form
59011 1121672 1125168 1122310 1114626 1103787 1091532 1079221 1067757 1058139 1051646 1049162 1050542 1054931 1061497
58998 1061497 1069753 1079345 1089629 1099229 1106098 1108482 1105948 1099132 1088538 1074104 1055988 1035005 1011983
58985 1011983 987283 961391 935488 910869 888083 866999 847487 829686 813808 800011 788355
58974 788355 778740 771093 765622 762483 761086 760194 758994 757681 756810 756569 757003 758393 760862 763933 767014
58959 767014 770081 773386 776710 779311 780494 779825 776926 771560 763916 754507 743814 732295 720669 709839
58945 709839 700506 693017 687552 684300 683509 685511 690550 698254 707230 715386 720819 722537 720530 715344
58931 715344 707610 697899 686857 675205 663448 651739 640210 629237 619119 609729 600916 593006
58919 593006 586384 580652 574889 568846 563229 558638 554886 551722 549592 549136 550302 552454 555109 558186
58905E58186L602M352N427O582P426Q053Q969J0222J1151J1290J0932J0522R909
58892F66623Q714P241O579P689J0497J4002J7113J9324K0525K0482J8937J6186
58880H33912J3010R812O312K375j388m331o647q963j1390j3557j5246j6400j6687
58867G70812j5790j4095j2520j1542j0859j0000q881p737o840o364o236o183o059
58854F47706n956n926n858n762n740n463m317k395o62L23J114K143K641J805L50
58839F14003m20o00j355k648k885j151J447L346M386N464P070R053J1333J4131
58825F61174J7563K1509K5900L0885L6781M3852N1866N9728O5717O8286O6665
58814A149926O0807N0951L7291K0100L01k0086l8499n3034o2933o7996o8187o4206
$$ plain form
58905 558186 561788 566140 571567 578149 585575 593628 602597 612819 623970 635260 646192 656714 666623
58892 666623 675337 682578 689157 696846 707343 721345 738458 757782 778307 798789 817726 833912
58880 833912 846922 856734 863046 865421 864033 859702 853055 844092 832702 819145 803899 787499 770812
58867 770812 755022 740927 728407 716865 706006 696006 687125 679388 672548 666184 659948 653765 647706
58854 647706 641750 635824 629966 624204 618464 613001 608684 606289 605627 605950 607064 609207 611848 613653 614003
58839 614003 613583 612983 611628 608980 606095 604944 606391 609737 614123 619587 626657 635710 647043 661174
58825 661174 678737 700246 726146 757031 793812 837664 889530 949258 1014975 1083261 1149926
58814 1149926 1210733 1261684 1298975 1319075 1319376 1299290 1260791 1207757 1144824 1076828 1008641 944435
58802I44435n7792n0733m3837l7231l1172k5977k1517j7533j4193j1744r871q087
58790F14748o503n520m884l781j868K89J823K303J996J679J959K536K562J885
58776F09224J305J271J192N89m6l49j107l019n204o245o146o046o285o259n782
58761E67093n339m959m133k927j980j413o98M01J719L239M759N342M394K994K739
58746E71231L414L427K481K078L034M260M672M754N367O273O794P015P409Q078
58732F40287Q977J0245J1692J2600J2515J1682J0405Q625O461M356K414L35j731
58719G38863l047l324l020k363j012R69K698L534L789L938L895L445K672J521
58705G52558k79k537m564o140p828r956j2126j3984j5676j7122j7723j7241j6240
$$ plain form
58802 944435 886643 835910 792073 754842 723670 697693 676176 658643 644450 632706 622835 614748
58790 614748 608245 602725 597841 594060 592192 592481 594304 596607 598603 600282 602241 604777 607339 609224
58776 609224 610529 611800 612992 613581 613535 613186 612079 609060 603856 597611 591465 585419 579134 572875 567093
58761 567093 561754 556795 552662 549735 547755 546342 545644 546045 547764 551003 555762 561104 565498 568492 571231
58746 571231 574645 578072 580553 582631 585665 589925 594597 599351 604718 610991 617785 624800 632209 640287
58732 640287 649264 659509 671201 683801 696316 707998 718403 727028 733489 737845 740259 740594 738863
58719 738863 735816 732492 729472 727109 726097 727066 729764 733298 737087 741025 744920 748365 751037 752558
58705 752558 752279 749742 745178 739038 731210 721254 709128 695144 679468 662346 644623 627382 611142
58692F11142j5215j3986j2356j0621r001p345n763m849m762m819m394l633k934
58679E11464k385j993j802j500o35N60J308J441J655K345L162L954N105O572P575
58664E36826P769P900Q680R758J0310R933Q540O176L320P19j446l485n165n649
58650E94186m858l872l543l575l444l251l139k750j891r82l58J78O60O15q3p35
58634E63158o31K21J415K480K819K217J491J655K372K405J637J270J730K001J496
58619E87736J088J537K402L294M757O923Q585Q734P853O783N384L372J354r3j377
58604F48332k846l764l437k469j869j687j578j827k717l677m102m302m667m625
58590F04765l515j787k69J152L043N202O920Q044Q886R486R674R490Q935P871
$$ plain form
58692 611142 595927 581941 569585 558964 549963 542618 536855 532006 527244 522425 518031 514398 511464
58679 511464 509079 507086 505284 503784 503149 503709 505017 506458 508113 510458 513620 517574 522679 529251 536826
58664 536826 544595 552495 561175 570933 581243 591176 599716 605892 609212 609931 608485 605000 599835 594186
58650 594186 589328 585456 581913 578338 574894 571643 568504 565754 563863 562881 562523 562701 563361 563976 563893 563158
58634 563158 562527 562748 564163 566643 569462 571679 573170 574825 577197 579602 581239 582509 584239 586240 587736
58619 587736 588824 590361 592763 596057 600814 607737 616322 625056 632909 639692 645076 648448 649802 649709 648332
58604 648332 645486 641722 638285 635816 633947 632260 630682 628855 626138 622461 618359 614057 609390 604765
58590 604765 601250 599463 599194 600346 603389 608591 615511 623555 632441 641927 651601 661091 670026 677897
58576F77897O556N642N181M466L307K494K498K803L110M122O278Q862J1113J3191
58562G57520J5305J6989J8067J9110K0148K0118J8522J6349J4444J2325R619P178
58550I45694N543L744J016j678l413n183q224j1592j3401j3683j4061j5112j5883
58537H53767j5720j4970j4077j3200j2539j1912j0503p966n240l239j563M67K350
58524G45655L254L517L951M380M169L537L023K277O63j450l120l977m103l588
58510G58188l029l438m693n339m882m760n761o260m844l007k956m083m113k793
58496F98230j860j894j795j204j065j581j640o10Q25J943K773L555M376N289O050
58481G11392O259O354P532R813J1455J1397J0835J0959J0757Q869O065L773J569
$$ plain form
58576 677897 684453 690095 695276 699742 703049 705543 708041 710844 713954 718076 724354 733216 744329 757520
58562 757520 772825 789814 807881 826991 847139 867257 885779 902128 916572 928897 938516 945694
58550 945694 951237 954981 955997 954319 950906 945723 937499 925907 912506 898823 884762 869650 853767
58537 853767 838047 823077 809000 795800 783261 771349 760846 752880 747640 744401 742838 743305 745655
58524 745655 748909 752426 756377 760757 764926 768463 771486 773763 774426 772976 769856 765879 761776 758188
58510 758188 755159 751721 747028 741689 736807 732047 726286 720026 715182 712175 709219 705136 701023 698230
58496 698230 696370 694476 692681 691477 690412 688831 687191 686581 687406 689349 692122 695677 700053 705342 711392
58481 711392 717651 724005 731537 741350 752805 764202 775037 785996 796753 805622 811687 815460 817029
58468H17029j549m599n973o300p356q883r111p938o921o484n536l735j853j10
58454G40681J762L261L921M766O743Q503Q075O090M725M216L162J698J295J827
58440H00725J920K008L894P201R554J0571J2490J6285K0255K3257K6519L1321
58428I66000L7414M4465N2399N9479O2594O0549N4712M5721L2203J4013n657k2858
58416A401034l5875m4643m9232n0174m8716m5666m1114l5773l1043k7256k3461
58405I68081j9367j5841j3132j0403p403m844k731j32L093O038Q446J0799J2662
58392I35266J2952J1956J0959R698O556J616k789n171o393p557q470q832q966
58379I40825q765p762o518o165o348n607l851k417j655o83M45P81O80J492L020
$$ plain form
58468 817029 815480 810881 804908 798608 791252 782369 773258 765320 758399 751915 746379 742644 740791 740681
58454 740681 742443 745704 749625 754391 761134 769637 777712 783802 788527 792743 795905 797603 798898 800725
58440 800725 802645 804653 808547 815748 825302 835873 848363 864648 884903 908160 934679 966000
58428 966000 1003414 1047879 1100278 1159757 1222351 1282900 1337612 1383333 1415536 1429549 1423892 1401034
58416 1401034 1365159 1320516 1271284 1221110 1172394 1126728 1085614 1049841 1018798 991542 968081
58405 968081 948714 932873 919741 909338 901935 897091 894360 894228 897321 903359 911805 922604 935266
58392 935266 948218 960174 971133 980831 987387 989003 986214 981043 974650 967093 958623 949791 940825
58379 940825 932060 924298 917780 911615 905267 899660 895809 893392 891737 891054 891499 892280 892960 894452 897472
58364H97472L793L898M805O366O928O614P335R188J0034R255Q722R273R337Q091
58350A001111O931O752O639O299O950Q770J0169J0686J1804J3994J5745J6486
58338A122336J7622J9586K0792K0576K0372K0763K0177J7705J4548J1548Q046
58327A314071M150J434K62q31k284k791k210k148k843k519p15R02J816L488O131
58312A315913Q067R136J1219J4470J6720J7533J9030K1681K3260K3137K3521K5079
58300A528766K5505K3849K2076K0905J8390J4247J1124R907Q243N525M651O752
58288A699940Q883R217R864J2190J4006J4020J4434J6557J8394J9052K0856K4486
58276A881899K7018K7408K8844L2770L5883L6234L6885M0050M2932M3232M3551
$$ plain form
58364 897472 901265 905163 909968 916334 923262 929876 937211 946399 956433 965688 974410 983683 993020 1001111
58350 1001111 1008042 1014794 1021433 1027732 1034682 1043452 1053621 1064307 1076111 1090105 1105850 1122336
58338 1122336 1139958 1159544 1180336 1200912 1221284 1242047 1262224 1279929 1294477 1306025 1314071
58327 1314071 1318221 1319655 1319917 1319086 1316802 1314011 1311801 1309653 1306810 1304291 1303576 1304478 1306294 1309782 1315913
58312 1315913 1323980 1333116 1344335 1358805 1375525 1393058 1412088 1433769 1457029 1480166 1503687 1528766
58300 1528766 1554271 1578120 1600196 1621101 1639491 1653738 1664862 1674769 1683012 1688537 1693188 1699940
58288 1699940 1708823 1718040 1727904 1740094 1754100 1768120 1782554 1799111 1817505 1836557 1857413 1881899
58276 1881899 1908917 1936325 1965169 1997939 2033822 2070056 2106941 2146991 2189923 2233155 2276706
58265B276706M6278M9148M9978N0963N4124N7277N8506N9831O2498O3719O2014
58254B891042O0638O1699O2257O0361N9291O1442O3872O4410O6239P1635P7310
58243C600196Q0885Q5702R4023J01987J06751J12121J21388J31261J38687J46805
58233D719806J58126J69111J77666J88443K04166K19688K31614K45393K65270
58224F579283K86035L03120L21926L48251L78396M08108M42165M85208N32489
58215A0084981N80011O34180P00916P75565Q54848R47744J062790J196736J348878
58206A8186649J534209J769016K056954K402287K819221L311527L862938M469671
58198D0412472N165954N999938P011469Q260236R845852J1863291J4366018J7410800
$$ plain form
58265 2276706 2322984 2372132 2422110 2473073 2527197 2584474 2642980 2702811 2765309 2829028 2891042
58254 2891042 2951680 3013379 3075636 3135997 3195288 3256730 3320602 3385012 3451251 3522886 3600196
58243 3600196 3681081 3766783 3860806 3962793 4069544 4181665 4303053 4434314 4573001 4719806
58233 4719806 4877932 5047043 5224709 5413152 5617318 5837006 6068620 6314013 6579283
58224 6579283 6865318 7168438 7490364 7838615 8217011 8625119 9067284 9552492 10084981
58215 10084981 10664992 11299172 12000088 12775653 13630501 14578245 15641035 16837771 18186649
58206 18186649 19720858 21489874 23546828 25949115 28768336 32079863 35942801 40412472
58198 40412472 45578426 51578364 58589833 66850069 76695921 88559212 102925230 120336030
58190A20336030K1093862K5460143L0352758L5322020L9527978M1587444L9692531
58183C53372766L2400036J9781121L899808j2016755k5112366l3926256l8379656
58176C00018698l9190996l7362336l3902340k9661080k5245858k1049038j7314978
58169I6292072j4158915j1573201r483575p814779o500071n462885m629102l951600
58161C2717944l401927k948378k561572k230669j954287j722285j521047j347531
58153A5030248j202701j078526r64950q62447p75192o98860o26863n61536n07631
58144G751542m61237m16041l74336l41370l14584k88622k65443k49599k38407
58135D801903k26160k13436k03506j94000j80821j66218j54878j45751j35308
$$ plain form
58190 120336030 141429892 166890035 197242793 232564813 272092791 313680235 353372766
58183 353372766 385772802 405553923 409453731 397436976 372324610 338398354 300018698
58176 300018698 260827702 223465366 189563026 159901946 134656088 113607050 96292072
58169 96292072 82133157 70559956 61076381 53261602 46761531 41298646 36669544 32717944
58161 32717944 29316017 26367639 23806067 21575398 19621111 17898826 16377779 15030248
58153 15030248 13827547 12749021 11784071 10921624 10146432 9447572 8820709 8259173 7751542
58144 7751542 7290305 6874264 6499928 6158558 5843974 5555352 5289909 5040310 4801903
58135 4801903 4575743 4362307 4158801 3964801 3783980 3617762 3462884 3317133 3181825
58126C181825j24980j17932j12266j04538r6469r1344q7367q1284p4885p1363
58116B219397o8715o3408n7261n4158n3150n0995m8555m8408m9101m7806m5924
58105A631916m6173m6890m4984m1907m0946m1170l9573l6819l5303l3992l0661
58094A193498k6841k5212k4381k1625j8417j7771j8358j6753j3567j1903j1554
58083I87116j0219q752r707j2076j2804j2326j3447j5886j7002j6938j8008j9772
58071H20179j9638j7715j6422j5873j4161j1678j0613j0553q922n626l170k333
58059F83475j601p24j132k934m837o830r670j2180j2313j0542r147q657p941p013
58045E87954o751o571n487m539n164o214n714m430m365m925m142k646k662l978
$$ plain form
58126 3181825 3056845 2938913 2826647 2722109 2625640 2534296 2446929 2365645 2290760 2219397
58116 2219397 2150682 2087274 2030013 1975855 1922705 1871710 1823155 1774747 1725646 1677840 1631916
58105 1631916 1585743 1538853 1493869 1451962 1411016 1369846 1330273 1293454 1258151 1224159 1193498
58094 1193498 1166657 1141445 1117064 1095439 1077022 1059251 1040893 1024140 1010573 998670 987116
58083 987116 976897 968145 958438 946362 933558 921232 907785 891899 874897 857959 839951 820179
58071 820179 800541 782826 766404 750531 736370 724692 714079 703526 694604 688978 685808 683475
58059 683475 681874 681150 680018 677084 672247 665417 655747 643567 631254 620712 611565 602908 594967 587954
58045 587954 581203 574632 569145 564606 559442 553228 547514 543084 538719 533794 529652 527006 524344 520366
58031E20366m641m814o120p793p549n920n726p339q282p652p139p381o962n526
58017D27522m614m680m359l236k602k874k904k145j245l57P81J271J50j261p91
58002C98656J010J583M79j48Q36K332L545M875O059O147N556N622O043N287L577
57987D51459K711K903K550J280M02J47o92k115k743k644l488n432o579o119n357
57972D26283n011m211k799k001k075j751p95o28j611k154j402n30m62n07j83k51
57956C99912j019j522j303j220j787k437k966l789m416l642j709k59K76J064K354
57941C77537K987K969L982O431Q445Q939R360J1071J3215J4476J5080J5549J5337
57928E05378J4049J2476J1069Q926N478J741j317m164p283r836j1016j1538j2442
$$ plain form
58031 520366 515725 510911 504791 496998 489449 483529 477803 470464 462182 454530 447391 440010 433048 427522
58017 427522 422908 418228 413869 410633 408031 405157 402253 400108 398863 398506 399287 400558 400708 399447 398656
58002 398656 399666 401249 401728 401580 402416 404748 408293 413168 419227 425374 430930 436552 442595 447882 451459
57987 451459 454170 457073 459623 460903 461305 461452 460760 458645 455902 453258 449770 444338 437759 431640 426283
57972 426283 421272 417061 414262 412261 410186 408435 407640 407012 405401 403247 401845 401315 400853 400346 400163 399912
57956 399912 398893 397371 396068 394848 393061 390624 387658 383869 379453 375811 374102 373843 374119 375183 377537
57941 377537 380524 383493 387475 393906 402351 411290 420650 431721 444936 459412 474492 490041 505378
57928 505378 519427 531903 542972 551898 557376 559117 557800 553636 546353 536517 525501 513963 501521
57915E01521j3524j4042j3966j3525j2485j0856r354q351p304n886m632l831k916
57902C80849j738j232k014l270l831l460k557j528r81j429k263k117o58R91K052
57887C56814K969M097M933N276N807O702O957N826L904K080N69n33r47j087j999
57872D01368l730m971n012m804n329o158o464o298n991n346m300l446l067k536
57858C33916j392j15P94J604K548L289L705M272N054N329M879M496M543M145K613
57843C79680O66o79j468k279l104l606l761l624l166k728k806k984k154l14J032
57828C48705R37K87L00Q50J243J607K409L382L958M289M961O090P238P799P107
57813D01162M862J801q23k732m767p218r118r635r172q496p729o800n914n040
$$ plain form
57915 501521 487997 473955 459989 446464 433979 423123 413769 405418 398114 392228 387596 383765 380849
57902 380849 379111 377879 375865 372595 368764 365304 362747 361219 360238 358809 356546 354429 353771 354762 356814
57887 356814 359783 363880 368813 374089 379896 386598 393555 399381 403285 405365 405934 405401 404454 403367 401368
57872 401368 397638 392667 387655 382851 377522 371364 364900 358602 352611 347265 342965 339519 336452 333916
57858 333916 332524 332409 333203 334807 337355 340644 344349 348621 353675 359004 363883 368379 372922 377067 379680
57843 379680 380346 379667 378199 375920 372816 369210 365449 361825 358659 355931 353125 350141 347987 347673 348705
57828 348705 349642 349929 350229 351079 352322 353929 356338 359720 363678 367967 372928 379018 386256 394055 401162
57813 401162 406024 407825 407002 404270 399503 392285 383167 373532 364360 355864 348135 341335 335421 330381
57799C30381l798k445j918k390k799k411j799j655j683j441j240j389j511j314
57785C02588j185j284r67J93J664K912M084N165N497M977M623N071N523N057M038
57770C47956L258K624J712P82J81n21j778l093l772m023m413m848n000n073n287
57755C18705n112l959k150m55Q72J928K616K936L263L651L508K534J351N79j5
57740C30252q23j583j980k340k968l544l847m365n421o378o489n939n290m555
57726B74730l514k444j760j448j349j488j692j581j272j355j814j911j503j368
57712B50231j812k094j832j717k130k391k149k194k849k937j537L94J384J410
57698B29777J250R20J10o78p63l86q5K44P14P93L43K41Q65J148M34J2J164K927
$$ plain form
57799 330381 326583 324138 322220 319830 317031 314620 312821 311166 309483 308042 306802 305413 303902 302588
57785 302588 301403 300119 299152 299345 301009 303921 308005 313170 318667 323644 328267 333338 338861 343918 347956
57770 347956 351214 353838 355550 356332 356513 355992 354214 351121 347349 343326 338913 334065 329065 323992 318705
57755 318705 313593 309634 307484 307029 307901 309829 312445 315381 318644 322295 325803 328337 329688 330267 330252
57740 330252 329429 327846 325866 323526 320558 317014 313167 308802 303381 297003 290514 284575 279285 274730
57726 274730 271216 268772 267012 265564 264215 262727 261035 259454 258182 256827 255013 253102 251599 250231
57712 250231 248419 246325 244493 242776 240646 238255 236106 233912 231063 228126 226589 226983 228367 229777
57698 229777 231027 231947 232057 231379 230616 230230 230145 230389 231103 231896 232239 232480 233345 234493 234927 234939 236103 239030
57680B39030L617L643M706O956R066J0734J3043J6412K0138K4066K9081L5751
57668D16243M3736N2355O0396O5444O4870N7618M4089K4949J637k2264m2155n5334
57656G11584o1750o2304n8012n0788m3132l6377l0349k4910k0640j7735j5471
57645B90116j3072j0343p332m386k426k066k467k176j029j33Ko2J1k03q19j249
57629B42366j128p58m92n10j053j962k284j454n21q47j951k193j402j002j533
57614B23276j977j826j880k441k548j753r75p33j82J100J939J394M05K40M53j50
57598B14342j353j898j469r07p56q18j066j772k706l061k454j418p59q02j310
57583A91793j849k127k122j879j308m31K76K45m06r37r46p39o82p36p86r48j251
$$ plain form
57680 239030 242647 246290 250996 257952 267018 277752 290795 307207 327345 351411 380492 416243
57668 416243 459979 512334 572730 638174 703044 760662 804751 829700 831337 809073 766918 711584
57656 711584 649834 587530 529518 478730 435598 399221 368872 343962 323322 305587 290116
57645 290116 277044 266701 259369 254983 252557 250491 248024 245848 244819 244686 244688 244626 244637 244434 243615 242366
57629 242366 241238 240480 239988 239478 238425 236463 234179 232725 232204 231357 229406 227213 225811 224809 223276
57614 223276 221299 219473 217593 215152 212604 210851 209876 209143 208961 210061 212000 213394 213799 214039 214492 214342
57598 214342 212989 211091 209622 208715 207959 207141 206075 204303 201597 198536 196082 194664 193905 193103 191793
57583 191793 189944 187817 185695 183816 182508 182077 182353 182598 182192 181255 180309 179570 178888 178152 177366 176418 175167
57566A75167j462j411j156p84l91k51m35m21L26J342J553P40j21j93L21Q68J284
57549A74976J507J215L10p20j312j319q06J40J187J910K414L188M162M564M036
57534A95452L162K514J891R72P6l95o54j043j284r36k82l7m05r28j187j134p74
57517A95008q5P69J495J988K314K454K387K359K654L036K837J818O80K96N91O00
57501B21201j67j005j014m91n41j461k302k256j692j375j429j587j910k435k629
57486A98907j975q72k10j70k32j20j16m03p84j044j130j026q81j022j463j652
57470A85807j215o23m99o91o72m42k94k0O56J240J029L26Q5M89Q55Q92R96J263
57452A89182J278R95Q27P07Q3r65j566j304p14k78J76P74J159J118Q96O07J35
$$ plain form
57566 175167 173705 172294 171138 170354 169963 169712 169277 168856 169182 170524 172077 172817 172696 172503 172824 173692 174976
57549 174976 176483 177698 178008 177288 175976 174657 173851 173991 175178 177088 179502 182690 186852 191416 195452
57534 195452 198614 201128 203019 203991 204067 203672 203018 201975 200691 199755 199473 199436 199031 198103 196916 195782 195008
57517 195008 194923 195692 197187 199175 201489 203943 206330 208689 211343 214379 217216 219034 219714 220010 220601 221201
57501 221201 221034 220029 219015 218524 217983 216522 214220 211964 210272 208897 207468 205881 203971 201536 198907
57486 198907 196932 196060 195850 195680 195448 195328 195212 194809 194025 192981 191851 190825 189944 188922 187459 185807
57470 185807 184592 183969 183470 182779 182107 181665 181371 181351 182007 183247 184276 184602 184687 185176 186031 186923 187919 189182
57452 189182 190460 191455 192282 192989 193072 192107 190541 189237 188523 188245 188421 189195 190354 191472 192368 192975 193110
57435A93110k23J52J112J616J148M05J36J20j52m42j25P89J574J490L80j151j996
57418A97943j492k14N79M11o2j82p2r1j31J33O91J242J468J243P53L82J91j70
57400B02622p22p67R6J076J117L65j90j43K42R11J814K149J248k7j86O54R92M32
57382B11683K18R96J788J819J731K126K335J592L63m39o38m56L5N69O11K65L13
57365B24911Q77J066M45k94o14q72j144o87N96J456J091M30O18J283J465J215
57349B31842J143J228J232J432J873J777P87j8M35J550K020J739J486J394R98
57334B50918M26K23L20K03j71n04q31j168j108n07J2R3M36J551K436J843K13q60
57316B53525p50j52K59L96K32j37j56M72J062Q57K69K13O48Q89R00J181J677J925
$$ plain form
57435 193110 192887 193039 194151 195767 196915 197320 197456 197576 197424 196982 196857 197646 199220 200710 201090 199939 197943
57418 197943 196451 196237 196816 197227 197165 196983 196911 196820 196689 196822 197513 198755 200223 201466 202219 202601 202792 202622
57400 202622 201900 201133 201229 202305 203422 203787 203597 203454 203696 204607 206421 208570 209818 209791 209605 210259 211251 211683
57382 211683 211901 212897 214685 216504 218235 220361 222696 224288 224651 224212 223574 223118 223153 223722 224333 224598 224911
57365 224911 225788 226854 227299 227005 226391 225519 224375 223688 224284 225740 226831 227261 227879 229162 230627 231842
57349 231842 232985 234213 235445 236877 238750 240527 241314 241296 241731 243281 245301 247040 248526 249920 250918
57334 250918 251344 251567 251887 252090 251919 251415 250584 249416 248308 247801 247813 247906 248342 249893 252329 254172 254385 253525
57316 253525 252775 252623 252882 253278 253510 253373 253217 253689 254751 255608 255877 256090 256738 257627 258527 259708 261385 263310
57298B63310J986K130J982J145L42O91K030L164L529L488L223K669K373L113M592
57283B99767N705O145O608P322P646P279O800O705O817O861O757O266N139L697
57269C89514K545J711Q82K24P7O6m63j199j251o73m29p77r54o19m28p92j106p03
57251C85625K25J068J513J526J261J163J581K267K754L090L510L694L163K236
57237D14676J659J545J574J901K760L440L006J952J648K227K487K059J999K920
57223D45853M045M700N217N684N284L866K815L224M236M346L577L161L649M514
57209E04171N200N607N700N477N230N271N524N796O207O935P783Q379Q616Q561
57195E94457Q242P769P351P011O571O038N698N688N939O624Q129J0446J2974J5061
$$ plain form
57298 263310 265296 267426 269408 270553 270895 271586 273616 276780 280309 283797 287020 289689 292062 295175 299767
57283 299767 305472 311617 318225 325547 333193 340472 347272 353977 360794 367655 374412 380678 385817 389514
57269 389514 392059 393770 394652 394876 394953 395019 394556 393357 392106 391433 391004 390227 389273 388654 388226 387434 386328 385625
57251 385625 385850 386918 388431 389957 391218 392381 393962 396229 398983 402073 405583 409277 412440 414676
57237 414676 416335 417880 419454 421355 424115 427555 430561 432513 434161 436388 438875 440934 442933 445853
57223 445853 449898 454598 459815 465499 470783 474649 477464 480688 484924 489270 492847 496008 499657 504171
57209 504171 509371 514978 520678 526155 531385 536656 542180 547976 554183 561118 568901 577280 585896 594457
57195 594457 602699 610468 617819 624830 631401 637439 643137 648825 654764 661388 669517 679963 692937 707998
57181G07998J6339J6569J5780J4557J3654J3186J2806J2574J2867J3524J3963
57170H63817J4241J5075J6561J7860J8507J9085K0197K1637K3118K4928K7247
57159A082273K9457L0867L1642L2448L3560L4747L5669L6065L5916L5660L5795
57148A454099L6191L6406L6620L7483L8811L9512L9153L8776L9566M1496M3765
57137A881878M5831M7392M8143M8292M8840N0692N3763N7334O0831O3985O6846
57126B473827P0057P4418P9856Q5393R0468R5540J01063J06848J13011J20608
57116C411089J30436J42012J54503J68101J83586K01235K21088K43854K70589
57107E126493L01810L37787L79503M28626M86911N56507O40795P44212Q71207
$$ plain form
57181 707998 724337 740906 756686 771243 784897 798083 810889 823463 836330 849854 863817
57170 863817 878058 893133 909694 927554 946061 965146 985343 1006980 1030098 1055026 1082273
57159 1082273 1111730 1142597 1174239 1206687 1240247 1274994 1310663 1346728 1382644 1418304 1454099
57148 1454099 1490290 1526696 1563316 1600799 1639610 1679122 1718275 1757051 1796617 1838113 1881878
57137 1881878 1927709 1975101 2023244 2071536 2120376 2171068 2224831 2282165 2342996 2406981 2473827
57126 2473827 2543884 2618302 2698158 2783551 2874019 2969559 3070622 3177470 3290481 3411089
57116 3411089 3541525 3683537 3838040 4006141 4189727 4390962 4612050 4855904 5126493
57107 5126493 5428303 5766090 6145593 6574219 7061130 7617637 8258432 9002644 9873851
57098I873851J025670J211002J430124J685926J982543K326206K723564L177372
57090B5436258L681707M219664M765304N288916N761564O156187O447861O616839
57082F8374300O650077O532651O231941N694060M867659L742917K373872Q64843
57074A05332320o66824k123924l441585m581781n521988o246326o741877p000439
57066F9007576p024503o833636o465724n970661n400022m799142m204286l642281
57058B4667321l129918k674332k276171j933847j645224j406513j211201j050985
57050I339130r17701q04814p07953o24527n52584m89924m34327l84341l39502
57041D083457k99788k65066k34851k08247j84309j62641j43263j25640j08348
$$ plain form
57098 9873851 10899521 12110523 13540647 15226573 17209116 19535322 22258886 25436258
57090 25436258 29117965 33337629 38102933 43391849 49153413 55309600 61757461 68374300
57082 68374300 75024377 81557028 87788969 93483029 98350688 102093605 104467477 105332320
57074 105332320 104665496 102541572 99099987 94518206 88996218 82749892 76008015 69007576
57066 69007576 61983073 55149437 48683713 42713052 37313030 32513888 28309602 24667321
57058 24667321 21537403 18863071 16586900 14653053 13007829 11601316 10390115 9339130
57050 9339130 8421429 7616615 6908662 6284135 5731551 5241627 4807300 4422959 4083457
57041 4083457 3783669 3518603 3283752 3075505 2891196 2728555 2585292 2459652 2351304
57032B351304r0163p1052n1711l2744j5199j469N546M409m467k0252m2380o9110
57020A962712r6092j17478j28947j29841j22698j11099r7883q4760p2716o2199
57010I38999n3158m5420l9170l4704l1742k9473k7385k5521k3880k2155k0367
56999E86024j9099j8737j8877j8888j8547j7846j6681j5172j3801j2728j1397
56988D04251r226o308l052L70L776O600Q302Q699P431L718k659j0499j7845k3249
56974C70309k6068k6205k4248k1417j8571j5582j2121q608n733l473j281J185
56962B08187M137P932J2490J6900K0398K3269K5780K6741K4190J7459P656l472
56950C91667j4201k2655k7430k8715k7862k5737k2370j8190j4379j1486q670m907
$$ plain form
57032 2351304 2261141 2190089 2138378 2105634 2090435 2088966 2094512 2098921 2094454 2074202 2031822 1962712
57020 1962712 1866620 1749142 1620195 1490354 1367656 1256557 1158674 1073914 1001198 938999
57010 938999 885841 840421 801251 766547 734805 705332 677947 652426 628546 606391 586024
56999 586024 566925 548188 529311 510423 491876 474030 457349 442177 428376 415648 404251
56988 404251 395025 388717 385665 386035 389811 396411 404713 413412 420843 424561 421902 411403 393558 370309
56974 370309 344241 318036 293788 272371 253800 238218 226097 217489 211756 208283 207002 208187
56962 208187 212324 220256 232746 249646 270044 293313 319093 345834 370024 387483 395139 391667
56950 391667 377466 354811 327381 298666 270804 245067 222697 204507 190128 178642 169972 165065
56938A65065m14L757P169J0526J4827K0357K6456L2102L6412L8339L6209K8568
56926D19373J5911R88j3177k4996l3729l8409l8600l5660l1837k8208k4515k0691
56914A46450j7310j4566j2113j0025q765q079p053n586m651m685m840m260l198
56901D1319k223j228K3J083J394J281J735L306N694Q279J0740J3294J6431K0292
56887A21420K4340K7865L0584L2247L1808K7781J9817R516n04q165j2744j4783
56875B89182j5277j4723j2863r584n640j968J373M951Q953J3203J7975K3861L0891
56862C30334L8598M6853N5604O3644O8481O7603N9445M3699K2068j177k0869l3913
56850G40370m0072m0088l4538k4965j4445n694O92N396Q597J0136J0894J2915
$$ plain form
56938 165065 164651 168408 175577 186103 200930 221287 247743 279845 316257 354596 390805 419373
56926 419373 435284 436272 423095 398099 364370 325961 287361 251701 219864 191656 167141 146450
56914 146450 129140 114574 102461 92436 83671 75592 68539 62953 58302 53617 48777 44517 41319
56901 41319 39096 37868 37891 38974 40368 41649 43384 46690 52384 60663 71403 84697 101128 121420
56887 121420 145760 173625 204209 236456 268264 296045 315862 325378 324874 316709 303965 289182
56875 289182 273905 259182 246319 236735 231095 229127 230500 235451 244404 257607 275582 299443 330334
56862 330334 368932 415785 471389 535033 603514 671117 730562 774261 796329 795152 774283 740370
56850 740370 700298 660210 625672 600707 586262 580568 581260 586656 595253 605389 616283 629198
56838F29198J7994K6668L8394N2214O7159Q1895R3639R7607Q8764O5157K9769
56827A288458j0734m8758p8032r5178j00591r7531q9627p9054o6838n3901m1175
56816E27039k9243j8372q599N48R998K0371L1574M3280N5180O6423P5086P8362
56804H51647P3092N6851L0082k429l3394n7271p2450p9627p9723p4092o5189n5472
56792D92025m6025l7026k8763k1244j3677n619J960P956J2984J8716K5628L2560
56780D39475L8150M1344M0478L3455J9692J425j7293l2712m2813m7606m8438m6674
56768C78483m2949l7778l2304k7715k4065k0530j6806j3559j1441j0315r612q839
56756A22570p650n997m408l628l760m139m195m030l967l889l345k118n92M51L82
$$ plain form
56838 629198 647192 673860 712254 764468 831627 913522 1007161 1104768 1193532 1258689 1288458
56827 1288458 1277724 1228966 1150934 1055756 955165 857634 768007 688953 622115 568214 527039
56816 527039 497796 479424 470825 471373 481371 501742 533316 576596 631776 698199 773285 851647
56804 851647 924739 981590 1011672 1009243 975849 918578 846128 766501 686778 612686 547497 492025
56792 492025 446000 408974 380211 358967 345290 339671 341631 349587 362571 381287 406915 439475
56780 439475 477625 518969 559447 592902 612594 614019 596726 564014 521201 473595 425157 378483
56768 378483 335534 297756 265452 237737 213672 193142 176336 162777 151336 141021 131409 122570
56756 122570 114920 108923 104515 100887 97127 92988 88793 84763 80796 76907 73562 71444 70852 71303 71685
56741G1685o53j757k051j490p58m88p25r86o93K56J230J414Q34M85J104K168K599
56724G2174K092J247O05K02M1K45O71R17R73J317K105K693K426J628J252J665
56708I2253K219K199J805J785K309K707K372J498O75J53j03j0M16P23M59r1k52
56691A11117K0J19k12n39n20l64k96k65l24o68j038q40j75M1n96j319j359j054
56673A01728j116j509j767j831j796j380m83J78K9k78L00J472J871R99j89p79
56657I5449r30j019p32L62J835K709K480J476L71k74j53N97J360J511J075P44
56641A06861J096J915K465K379J975J645J378J130J214J779K246J928J107P22
56627A29840R93J172P62J71k10p23j700k704l058k789k387k096j847j634j457
$$ plain form
56741 71685 71032 69275 67224 65734 64976 64488 63763 62777 62084 62340 63570 64984 65818 66303 67407 69575 72174
56724 72174 74266 75513 76118 76320 76361 76606 77277 78194 79167 80484 82589 85282 87708 89336 90588 92253
56708 92253 94472 96671 98476 100261 102570 105277 107649 109147 109822 109975 109872 109862 110278 111001 111460 111369 111117
56691 111117 111137 111256 111044 110505 109985 109621 109325 109060 108736 108068 107030 106190 106015 106056 105460 104141 102782 101728
56673 101728 100612 99103 97336 95505 93709 92329 91846 92024 92053 91775 92075 93547 95418 96417 96228 95449
56657 95449 94519 93500 92768 93130 94965 97674 100154 101630 102001 101727 101574 102171 103531 105042 106117 106861
56641 106861 107957 109872 112337 114716 116691 118336 119714 120844 122058 123837 126083 128011 129118 129840
56627 129840 130833 132005 132767 132938 132728 132005 130305 127601 124543 121754 119367 117271 115424 113790 112333
56612A12333j233j042j146j413j244m55K45J14o49j243j284j029q91r99j067o16
56596I8381L85J170J030M39M64J035R84O4m21L30J261J161N77P34J484J704J227
56579A12009R26J163J398J250Q84M84J96M49J438K505K909K869L022L205K843
56564A37550K203K154K852L739M656N801O769O852O277N980O076N728M710L880
56550B05227L747L677K987J951J164O49J26m27q96j301j674j940k102k206k109
56535B06873j726j390j514j975k391k812l525m311m658m604m668m889m679l678
56521A60053k190p72R8P4p00j414j413j001q22q29o10m20q23j493j487o81P7K70
56503A45917J15k72j063j886j987j368q29o22j61O91J134O78o6m29n70q65j072
$$ plain form
56612 112333 111100 110058 108912 107499 106255 105800 106045 106159 105510 104267 102983 101954 101063 100064 98997 98381
56596 98381 98766 99936 100966 101405 101869 102904 103888 103952 103531 103861 105122 106283 106860 107594 109078 110782 112009
56579 112009 112935 114098 115496 116746 117630 118114 118310 118759 120197 122702 125611 128480 131502 134707 137550
56564 137550 139753 141907 144759 148498 153154 158955 165724 172576 178853 184833 190909 196637 201347 205227
56550 205227 208974 212651 215638 217589 218753 219402 219528 219101 218205 216904 215230 213290 211188 208982 206873
56535 206873 205147 203757 202243 200268 197877 195065 191540 187229 182571 177967 173299 168410 163731 160053
56521 160053 157863 157091 157189 157263 156563 155149 153736 152735 151913 151084 150474 150054 149231 147738 146251 145570 145647 145917
56503 145917 146032 145760 144697 142811 140824 139456 138627 138005 137844 138535 139669 140347 140281 139852 139282 138417 137345
56486A37345p59PQ54J544J926J847J360O86j9n32l92M92J327J235M51j26k77l73
56468A46596k51N77J635J800J020L89K91q0r74j313m27Q08J332J284J192Q46K
56451A54727p48q28o95j038j545j410o29R3M11N26N24K97l6j03L08J039J597J386
56433A53876L59n87l86Q68J962K093J627J269J197J323J593J757J437P49K31N6
56417A69424l5M4O25J377J521J149J206J859K057J250L27J73L61J25l52m18l1
56400A80662M43Q06P99k3j500k681k959k723k348j499l4J300J847J943K067J978
56384A78078J477J216J807K731L069K803K595K801L379M254N073N170M355L213
56370B22021K115P54q30j735j554j279j882k793k846k026j203p49m97n47r32r71
$$ plain form
56486 137345 136586 136593 137447 138991 140917 142764 144124 144810 144791 144259 143867 144359 145686 146921 147372 147246 146969 146596
56468 146596 146345 146922 148557 150357 151377 151766 152057 151977 151003 149690 149263 150071 151403 152687 153879 154725 154727
56451 154727 153979 153151 152456 151418 149873 148463 147834 147927 148338 148864 149388 149685 149649 149546 149854 150893 152490 153876
56433 153876 154235 153648 153262 154130 156092 158185 159812 161081 162278 163601 165194 166951 168388 169137 169368 169424
56417 169424 169389 169433 170058 171435 172956 174105 175311 177170 179227 180477 180804 180977 181338 181463 181111 180693 180662
56400 180662 181105 181911 182710 182687 181187 178506 175547 172824 170476 168977 168943 170243 172090 174033 176100 178078
56384 178078 179555 180771 182578 185309 188378 191181 193776 196577 199956 204210 209283 214453 218808 222021
56370 222021 224136 224890 224060 222325 220771 219492 217610 214817 211971 209945 208742 207993 207496 206949 206017 205046
56354B05046j16R37J008J58m39j53M97Q30O83J64m82p56k65P42J666K232K529
56337B14281K661K714K810K854K497J721J003O82O14O94J069J618J919K009K353
56322B41499K817K637J768J157J146Q09m05j608j939j868k034j918r54O6Qq58
56306B40323j440j406j053k61J060K107K120J718K047K965L281K544J386M48l4
56291B55805J95J152K154K434K012J348N91j23l55m3J95K43R44K503L492K771
56275B75318J328P61Q96N75OL95J613K206J650J016J218J985K682L028K978K776
56259C00431K962L519L516K520J669K152L408M189M634N605O711O886O559P219
56245C61980Q943J0242J0483J0590J1156J1517J1157J0525J0051R559Q991Q521
$$ plain form
56354 205046 204930 205867 206875 207033 206594 206441 206938 207768 208451 208615 208133 207377 207112 207854 209520 211752 214281
56337 214281 216942 219656 222466 225320 227817 229538 230541 231223 231837 232531 233600 235218 237137 239146 241499
56322 241499 244316 246953 248721 249878 251024 251833 251428 249820 247881 246013 243979 242061 241107 241173 241181 240323
56306 240323 238883 237477 236424 236163 237223 239330 241450 243168 245215 248180 251461 254005 255391 255839 255805
56291 255805 256000 257152 259306 261740 263752 265100 265691 265568 265213 265170 265365 265608 266552 269055 272547 275318
56275 275318 276646 277407 278303 278878 278884 279279 280892 283098 284748 285764 286982 288967 291649 294677 297655 300431
56259 300431 303393 306912 310428 312948 314617 316769 320177 324366 329000 334605 341316 348202 354761 361980
56245 361980 370923 381165 391648 402238 413394 424911 436068 446593 456644 466203 475194 483715
56233D83715P809O244M147K592J878J281L02q96k290m023n646o450o545o598o659
56218D68861o329n872n888o101n716m812m077l474k539j714j821k411k275j422
56204D14410q31m48O70K146K281P36o77n73L04P32Q42J342K102K509K470K351
56188D30366K405K685L023L005K570K393K964L599L357K582K376K893L375L591
56174D71184L895M065L564K813K791L437L818L777M001M593M974N209N984P262
56160E31367Q281Q780R051R089Q949R468J1169J2984J3685J3961J5318J7650J9931
56147F89683K2653K7186L3041L8364M3031M8864N6737O5985P6692Q9852J04772
56136A296860J18761J29893J37855J41753J39572J30713J16989J00731Q3876O8983
$$ plain form
56233 483715 491524 497768 501915 504507 506385 507666 507968 507072 504782 500759 495113 488663 482118 475520 468861
56218 468861 462532 456660 450772 444671 438955 434143 430066 426592 424053 422339 420518 418107 415832 414410
56204 414410 413579 413131 413801 415947 418228 418964 418287 417714 418018 418750 419592 420934 423036 425545 428015 430366
56188 430366 432771 435456 438479 441484 444054 446447 449411 453010 456367 458949 461325 464218 467593 471184
56174 471184 475079 479144 482708 485521 488312 491749 495567 499344 503345 507938 512912 518121 524105 531367
56160 531367 539648 548428 557479 566568 575517 584985 596154 609138 622823 636784 652102 669752 689683
56147 689683 712336 739522 772563 810927 853958 902822 959559 1025544 1102236 1192088 1296860
56136 1296860 1415621 1545514 1683369 1825122 1964694 2095407 2212396 2313127 2397003 2465986
56126B465986N8457N1842M6112L9223L1317K2314J1126j827j3903k3219l0364
56115B657064l6641m2828n0374o1264p5652r1441j06689j20175j29499j31730
56105A810771j26942j18386j08215r5845q1335o7219n5377m4980l5217k7380k2401
56094A027474j8718j4662j0809q208o210l833j525O1J341K568L033K658K589L211
56080I78970L518L330L874N323O105N698N667O881Q239R148J0592J2621J3601
56067A073567J3239J3471J5039J6126J5759J5541J6454J7065J6635J6773J8126
56056A247795J8576J6800J4654J3966J3886J3402J3448J4457J4854J4077J4036
56045A409951J5555J6616J6196J6325J8094J9334J8766J8800K1283K4133K5268
$$ plain form
56126 2465986 2524443 2576285 2622397 2661620 2692937 2715251 2726377 2724550 2710647 2687428 2657064
56115 2657064 2620423 2577595 2527221 2465957 2390305 2298864 2192175 2072000 1942501 1810771
56105 1810771 1683829 1565443 1457228 1361383 1280048 1212829 1157452 1112472 1077255 1049875 1027474
56094 1027474 1008756 994094 983285 975077 968867 965034 963509 963570 964911 967479 970512 973170 975759 978970
56080 978970 982488 985818 989692 995015 1001120 1006818 1012485 1019366 1027605 1036753 1047345 1059966 1073567
56067 1073567 1086806 1100277 1115316 1131442 1147201 1162742 1179196 1196261 1212896 1229669 1247795
56056 1247795 1266371 1283171 1297825 1311791 1325677 1339079 1352527 1366984 1381838 1395915 1409951
56045 1409951 1425506 1442122 1458318 1474643 1492737 1512071 1530837 1549637 1570920 1595053 1620321
56034A620321K6245K8787L1190L1713L2254L4982L8274L9522L9228L9094L8899
56023B000509L8382L9154M1657M3411M3292M4118M7849N2064N4501N7081O1655
56012B523673O5936O7788O9510P3499P7560P9095Q0108Q3442Q7721R0651R3648
56001C392631R8659J04147J08690J14502J22907J30811J36320J43110J54172J66299
55991D672248J76065J85915J98697K11800K22972K36100K54521K74453K92160
55982F724931L11474L36839L65325L93602M26020M66950N12031N56558O05761
55973A0699491O66734P37253Q13347R00836J008068J134879J280972J457963J681259
55964B0380802J958312K296197K708337L198379L751024M358886N048481N864203
$$ plain form
56034 1620321 1646566 1675353 1706543 1738256 1770510 1805492 1843766 1883288 1922516 1961610 2000509
56023 2000509 2038891 2078045 2119702 2163113 2206405 2250523 2298372 2350436 2404937 2462018 2523673
56012 2523673 2589609 2657397 2726907 2800406 2877966 2957061 3037169 3120611 3208332 3298983 3392631
56001 3392631 3491290 3595437 3704127 3818629 3941536 4072347 4208667 4351777 4505949 4672248
55991 4672248 4848313 5034228 5232925 5444725 5667697 5903797 6158318 6432771 6724931
55982 6724931 7036405 7373244 7738569 8132171 8558191 9025141 9537172 10093730 10699491
55973 10699491 11366225 12103478 12916825 13817661 14825729 15960608 17241580 18699543 20380802
55964 20380802 22339114 24635311 27343648 30542027 34293051 38651937 43700418 49564621
55956D9564621O846619Q052443R575431J1512238J3922729J6859462K0409974
55949A36743517K4640433K9464473L4531704L9099762M1852004M0943832L4691437
55942C81967162K2739533O781221r967792k4250584l4080496l9081240m0004651
55935B64103153l8055468l4420242l0036968k5537998k1307091j7562020j4394296
55928H2789070j1789631r676290p977882o625295n546226m674561l967583l397710
55920B9133892k933821k545401k217204j943555j712920j511193j334314j184017
55912A3751467j055180r39232q35625p48351o74641o07834n47915m98903m58790
55903G384996m21628l86939l57984l33193l07994k82905k61730k43754k25288
$$ plain form
55956 49564621 56411240 64463683 74039114 85551352 99474081 116333543 136743517
55949 136743517 161383950 190848423 225380127 264479889 306331893 347275725 381967162
55942 381967162 404706695 411487916 401520124 377269540 343189044 304107804 264103153
55935 264103153 226047685 191627443 161590475 136052477 114745386 97183366 82789070
55928 82789070 70999439 61323149 53345267 46719972 41173746 36499185 32531602 29133892
55920 29133892 26200071 23654670 21437466 19493911 17780991 16269798 14935484 13751467
55912 13751467 12696287 11757055 10921430 10173079 9498438 8890604 8342689 7843786 7384996
55903 7384996 6963368 6576429 6218445 5885252 5577258 5294353 5032623 4788869 4563581
55894D563581k06983j92247j80258j67481j54382j44012j35601j25915j15425
55885C141277j07092j00597r3507q6590q2435q0291p7557p4729p3675p2879o9622
55874B222303o5205o2859o2154o0484n8467n8618o0201o0488n9682n9629n9075
55863A555441n5414m9901m6073m3974m0862l6708l3918l2388k9842k6560k5005
55852A134796k4946k3682k1078j9924k1119k2581k3179k3906k4925k4978k3967
55841H80511k3009k1977j9997j7911j7193j6925j5083j2288j0947j1257j1337
55830G02587j0789j0670j0466q665o097n157n850n976n112n076o412p770q794
55817F05753j0373j1882j1468r375p892p692p150n663m649m733m693l804k745
$$ plain form
55894 4563581 4356598 4164351 3984093 3816612 3662230 3518218 3382617 3256702 3141277
55885 3141277 3034185 2933588 2840081 2753491 2671056 2590765 2513208 2438479 2364804 2291925 2222303
55874 2222303 2157098 2094239 2032085 1971601 1913134 1854516 1794315 1733827 1674145 1614516 1555441
55863 1555441 1500027 1450126 1404053 1360079 1319217 1282509 1248591 1216203 1186361 1159801 1134796
55852 1134796 1109850 1086168 1065090 1045166 1024047 1001466 978287 954381 929456 904478 880511
55841 880511 857502 835525 815528 797617 780424 763499 748416 736128 725181 713924 702587
55830 702587 691798 681128 670662 661997 655900 650743 644893 638917 633805 628729 622317 614547 605753
55817 605753 595380 583498 572030 562655 554763 547071 539921 534258 529609 524876 520183 516379 513634
55804E13634j724o2J961L180L754N075P244Q672Q419O916M491J254j735l361m373
55789E53345o259q514r335q616p858p415o487n603o310q371r955j0685j1857j3536
55775D32544j4070j2765j0529p735m010l16J444J358J420K173J963Lk361m047
55761C85072n416o469o346n257m670m924m867m349m667n960o651o206o024o757
55747C06509p168o613o262o724o775n682m644m607m563l449j976j226r85o78n15
55732B44642n60j46P63R66j60j616k422k973l828m587m918n330n939n782m310
55717B03800k488j402r19m81j48K8N19J520K464L004L397L592L093K187J976K601
55701B22743K753J565k81j929l490n140o374o852o919o658n634m051k906k522
$$ plain form
55804 513634 511910 511848 513809 516989 520743 525818 533062 541734 550153 557069 561560 562814 561079 557718 553345
55789 553345 547086 538572 529237 520621 512763 505348 498861 493258 486948 478577 468622 457937 446080 432544
55775 432544 418474 405709 395180 387445 383435 383119 384563 385921 387341 389514 391477 391480 389119 385072
55761 385072 379656 373187 366841 361584 356914 351990 347123 342774 338107 332147 325496 319290 313266 306509
55747 306509 299341 292728 286466 279742 272967 267285 262641 258034 253471 250022 248046 246820 245835 245157 244642
55732 244642 244082 243936 244699 245665 245505 243889 241467 238494 234666 230079 225161 219831 213892 208110 203800
55717 203800 201312 199910 198991 198510 198362 198390 198909 200429 202893 205897 209294 212886 215979 218166 220142 222743
55701 222743 225496 227061 226780 224851 221361 216221 209847 202995 196076 189418 183784 179733 176827 174305
55687A74305k169j582j363j455p89Q43K134K321K395L303M437M806M479L833K595
55672A98093P21r01j611j920k470l034l241l240k943j800m1J045Q79N03R10J646
55656A82596J891J769J728J658J501J675K174K267J813J632J904J617L58p85j088
55641B02710j465k775m254m922n202n758n981n178m130l912m120l770l164l120
55627A44959l186k270o53K59l6p38j164j306j168p01k97l81o89p37o65q67j149
55610A29211j166j159j434j601j249q73j192j872k034j573j072p07l06j15o00
55595A12258j543k222k320j999j333m14K92M44L67N13O67L73k39p74j280j896
55579A00894k178j509k1J567K711L212L054K634K606K921K632J326L0j46M24O24
$$ plain form
55687 174305 172136 170554 169191 167736 166947 167790 169924 172245 174640 177943 182380 187186 191665 195498 198093
55672 198093 198814 197913 196302 194382 191912 188878 185637 182397 179454 177654 177613 178658 179537 180040 180950 182596
55656 182596 184487 186256 187984 189642 191143 192818 194992 197259 199072 200704 202608 204225 204583 203798 202710
55641 202710 201245 198470 194216 189294 184092 178334 172353 167175 163045 159133 155013 151243 148079 144959
55627 144959 141773 139503 138850 139109 139073 138335 137171 135865 134697 133996 133699 133318 132629 131892 131227 130360 129211
55610 129211 128045 126886 125452 123851 122602 121729 120537 118665 116631 115058 113986 113279 112973 112858 112258
55595 112258 110715 108493 106173 104174 102841 102427 102719 103163 103530 104043 104710 105083 104844 104070 102790 100894
55579 100894 98716 97207 97186 98753 101464 104676 107730 110364 112970 115891 118523 119849 119879 119733 120157 120781
55563A20781L64L95P90P61l5j080j840k236k255j877j439j392j659j779j578j282
55547A04639j000o53k74O3M50R23J265J361J399J451J238O78K07O4j96j003k020
55530A08592k624k697k421j841j174j054j836l020l855m100l815l101k443k540
55516G2071l138k831q29J801L475M020M311M644M540L813K850K036J575J617J879
55501A01834J690R71N70Q66R15j07j442j968k057k779l775l601k024m05L40P30
55485H9758J345J776J420M42n20j021q85k50K81J17n91j131j118p32k58Q9Q2k09
55467H8595k65J45L88k12j281j859j640r71LJ205J978J614M94k84l78l34l88j37
55449H6673M23O82M00M9q5l74j066j730j793j213m11R0nm26m41K24Q89Q68M87
$$ plain form
55563 120781 121145 121540 122330 123091 123056 121976 120136 117900 115645 113768 112329 110937 109278 107499 105921 104639
55547 104639 103639 102986 102712 102775 103225 104148 105413 106774 108173 109624 110862 111540 111747 111811 111615 110612 108592
55530 108592 105968 103271 100850 99009 97835 96781 94945 91925 88070 83970 80155 77054 74611 72071
55516 72071 68933 66102 65273 67074 70549 74569 78880 83524 88064 91877 94727 96763 98338 99955 101834
55501 101834 103524 104495 105065 105931 106846 106739 105297 103329 101272 98493 94718 91117 89093 88688 89028 89758
55485 89758 91103 92879 94299 94741 94221 93200 92315 92065 92346 92463 91872 90741 89623 88891 88633 88722 88804 88595
55467 88595 88330 88475 88863 88651 87370 85511 83871 82900 82903 84108 86086 87700 88194 87910 87532 87198 86810 86673
55449 86673 87096 87778 88178 88227 88142 87768 86702 84972 83179 81966 81555 81645 81640 81214 80773 80997 81886 82754 83241
55430H3241M55O10L13k06m0Q24J357J042N46N07O06L16j30r6N87J473J991J940
55412I5336J650J558J441N31j194k428k024o27J64j29o24o59m04q4K69K60m46
55395I2590j141p47L93P01l61j510j584j064r42j213j281j059q20n35k7O28J270
55378H3298J763J703P24o50j257p77j52j44l03oM36M14J06J02L95N47M90M75M93
55359H7657L23l6l91o80q74q78p27n85m19j06Ro14j601j679l44J212J567Q44K05
55340H2883R1L7o0L82J461K258J949R67M79Q97J421J069j01j093j207p47m44n21
55322H9721p18r19j184j301r14j25N03O22L33j75p06q24k13P09J153J020R27J050
55304H8959Q83K93k9K87N89K67k18o9N86R79Q24M09r3o66r58m85O05J522J646
$$ plain form
55430 83241 83696 84306 84619 84413 84373 85197 86554 87596 88142 88649 89255 89571 89441 89345 89932 91405 93396 95336
55412 95336 96986 98544 99985 100516 99322 96894 94870 94243 94407 94278 93654 92995 92591 92507 92776 93036 92590
55395 92590 91449 90702 91095 91796 91435 89925 88341 87277 86335 85122 83841 82782 81962 81427 81400 82028 83298
55378 83298 85061 86764 87488 86838 85581 84804 84652 84508 84205 84199 84635 85049 85155 85257 85652 86199 86689 87164 87657
55359 87657 87980 87944 87553 86873 85999 85121 84394 83809 83390 83284 83293 82679 81078 79399 79055 80267 81834 82678 82883
55340 82883 82974 83011 82951 83333 84794 87052 89001 89968 90447 91344 92765 93834 93733 92640 91433 90686 90242 89721
55322 89721 89003 88084 86900 85599 84685 84560 85063 85685 86018 85843 85137 84313 84100 84809 85962 86982 87909 88959
55304 88959 89842 90135 90106 90393 90982 91249 91031 90962 91548 92527 93351 93760 93667 93001 92043 91558 92163 93685 95331
55285I5331R99L9p00q62n72l99o90j093j021n11j49k54n43o06l47J33P24J233
55267I0712J339R21L02RK19N88O64M02O7j90m15n30l40j6n5n26q05m61M2Q7j09
55246I1905OK11k00j088j445q17J02N12M09J64j01l50m21k90j24P1L81N19R0n94
55226H8940p01p6N52P55R52J367J339L48j025j801j768j335p86k77q4j98p6O46
55208H6772J474J696J308P92L14k17o24n71o7N65J062J273J080N76L3n04j150
55191I3812j511q56P10J900J764R23N78Q71J008O34J34j56k37j00K26M23L15L48
55173A00786R20J492J095l03j690k236j991j366n60L42J253K083K595K395J481
55158A06296N64K91L78J71k62k72J98N08L95L45O43Q10K86q26j899k356j967j049
$$ plain form
55285 95331 96330 96369 95669 94807 94235 93836 93146 92053 91032 90521 90372 90118 89575 88969 88622 88755 89479 90712
55267 90712 92051 92972 93274 93283 93502 94090 94754 95156 95223 95033 94618 94088 93748 93732 93677 93151 92346 91885 91927 92014 91905
55246 91905 91911 92122 91922 90834 89389 88572 88674 89186 89595 89759 89658 89308 88887 88597 88473 88544 88925 89444 89534 88940
55226 88940 88239 88163 88715 89470 90422 91789 93128 93476 92451 90650 88882 87547 86761 86484 86400 86202 86126 86772
55208 86772 88246 89942 91250 92042 92356 92139 91515 90944 90877 91442 92504 93777 94857 95433 95466 94962 93812
55191 93812 92301 91445 92155 94055 95819 96742 97320 98191 99199 99833 99967 99811 99574 99474 99700 100123 100438 100786
55173 100786 101706 103198 104293 103990 102300 100064 98073 96707 96147 96489 97742 99825 102420 104815 106296
55158 106296 106860 107151 107529 107700 107438 107166 107364 107872 108267 108612 109255 110065 110351 109525 107626 105270 103303 102254
55140A02254l66m21q29q63n13l44m02q8O36Q89J32q80j068m62mk49p82r06m21
55121I5313K81O19L39k99q05r80r79r04o33j44L63P49J039J123P86K33Q9N62R90
55102I7742P09J1k52J20M88L55k8j40J57O57J105J220Q11J56n7M37R13M59p05
55083A04158j356q27J09K90l81j002r59m90j34q7k11k73p2L38N55L05m3J14O59
55064A00693Q12K01o43j080j089q89m64O9J68l83q51m11N79R71M72K4M04J098
55046I9681J086L04l22j36M72P45N31K44L5l59r05r76k30O72Q32L04j42k31l47
55027A01258n56m38q9k25q53r00J57J195R31k25q66o08k39j55J16P33J080P75
55009A01091K88J50K21J47N5L68J205K163K550J864L96p46o67K57P57J71q41j112
$$ plain form
55140 102254 101888 101467 100638 99775 99262 98918 98516 98428 99064 99953 100085 99205 98137 97675 97671 97422 96640 95734 95313
55121 95313 95594 96213 96552 96253 95448 94468 93489 92585 91952 91808 92171 92920 93959 95082 95868 96101 96190 96752 97742
55102 97742 98451 98462 98210 98330 98818 99173 99145 99005 99162 99819 100924 102144 102955 103111 103054 103491 104404 104863 104158
55083 104158 102802 101975 102084 102374 101993 100991 100032 99542 99408 99321 99110 98837 98765 99103 99658 99963 99920 100034 100693
55064 100693 101505 101706 101063 99983 98894 98005 97541 97610 97778 97395 96544 96133 96712 97683 98155 98179 98583 99681
55046 99681 100767 101071 100749 100613 101085 101830 102361 102605 102640 102281 101376 100400 100170 100842 101674 101978 101836 101605 101258
55027 101258 100702 100264 100175 99950 99097 98197 98354 99549 100480 100255 99389 98781 98542 98387 98503 99236 100316 101091
55009 101091 101379 101529 101750 101897 101952 102320 103525 105688 108238 110102 110498 109752 109085 109342 110099 110270 109429 108317
54991A08317j39J517K616K182N09q57p58K00N84K29K72J104J527N95q10j152l57
54974A15579L37K88R5L74Q16Q14M65L98Q22J218R53O6p40q33k68M13Q57J133J401
54955A24188J539J277N20m98j254j245m63M51P75M82J56J58K55J65M2J16K00p2
54937A26792n79p52l23K25K22l22o64k40N97J033Q43O54J044J852K591L198L927
54920A40098M755N407N859O358O916P150O687N468L676J671j02j493k852m497
54906A85101o056o791o557n968n571n295m799l895k602j161j80j34o87r20m75
54891A34010M1km87r53j228j249p59K83J286J649J642K127L441M944N805N881
54875A56431N734N928O441O779O583N877M656K569m45l439n090n207m948n258
$$ plain form
54991 108317 108178 109695 112311 114493 115002 114145 113387 113587 114171 114400 114672 115776 117303 117898 117088 115936 115579
54974 115579 115916 116204 116299 116673 117489 118303 118768 119166 119988 121206 122159 122225 121485 120652 120384 120797 121654 122787 124188
54955 124188 125727 127004 127524 127026 125772 124527 124064 124515 125290 125772 125928 126086 126341 126506 126548 126664 126864 126792
54937 126792 126213 125461 125138 125363 125585 125263 124599 124359 124956 125989 126832 127486 128530 130382 132973 136171 140098
54920 140098 144853 150260 156119 162477 169393 176543 183230 188698 192374 194045 193943 192450 189598 185101
54906 185101 179045 172254 165697 159729 154158 148863 144064 140169 137567 136406 136226 136092 135405 134485 134010
54891 134010 134051 134049 133562 132609 131381 130132 129373 129656 130942 132591 134233 136360 139801 144745 150550 156431
54875 156431 162165 168093 174534 181313 187896 193773 198429 200998 200553 197114 192024 186817 181869 176611
54861A76611n798n811n386n140n101m721l849k929k288j811j451j418j726j989
54847A27193j869j428r15n02l38n24q48q80n16j98l80r58j446j598j611j737j839
54830A09606j483m79P51J504J521J255J279J551J530R16J2o52q29o28k68R3L99
54813A16078O36O84L58k63o69m00L21P41N09O4k4K53N54P40Q55P86M21rj72j42
54793A21321k09k44J38P68R14L77j00Q4M36J83m15l93M59J318J530J347J291J459
54775A30264J749K151K474K321J732J419J920K928L876M745N815O962P801Q256
54761A84413Q488Q402P714O326M167R62l129o843q585q087o685n793n630n661
54747A70059n508n092m288l079j843j094r19r32p30k34L19O06N14K88K83M81N15
$$ plain form
54861 176611 170813 165002 159616 154476 149375 144654 140805 137876 135588 133777 132326 130908 129182 127193
54847 127193 125324 123896 122981 122479 122141 121617 120769 119889 119373 119175 118795 117837 116391 114793 113182 111445 109606
54830 109606 108123 107644 108395 109899 111420 112675 113954 115505 117035 117951 117963 117311 116482 115854 115586 115679 116078
54813 116078 116714 117398 117756 117493 116824 116424 116745 117486 117995 118059 118035 118288 118842 119582 120437 121223 121644 121635 121463 121321
54793 121321 121112 120868 121006 121774 122688 123065 122965 123049 123485 123668 123253 122860 123319 124637 126167 127514 128805 130264
54775 130264 132013 134164 136638 138959 140691 142110 144030 146958 150834 155579 161394 168356 176157 184413
54761 184413 192901 201303 209017 215343 219510 220472 217343 210500 201915 193828 187143 181350 175720 170059
54747 170059 164551 159459 155171 152092 150249 149155 148236 147304 146574 146340 146659 147265 147779 148067 148350 148831 149346
54730A49346J83k47m11k88k0N75J864L773N518O312O178N884N936N990N412M162
54714B00167K716J268m43k454m289n576o419o859o588n642m831m782m944m333
54700A46991l001j946j654j581j205p17m45k99p6J79M20O89P35J28r53j596j218
54683A34451l08L11N06O77R23Q91L45n31j299j577j294q08n75n77l51K94R37J112
54665A33127Q19K67m82j278j698j474q53j34P57J892K806K877K107J036M5q42
54649A38972j535j753j382n85M70J603K374K243J176j11p71n38J97Q63J129R70
54633A43322N33L1k86k80q2m8l22o33o45m75n14p85q26l24M55J041J246J156R00
54614A43464O34M99L83K5m71n40P9P90Q28K79j3M42J202J519J269R69J113J601
$$ plain form
54730 149346 149529 149282 148871 148583 148563 149138 151002 154775 160293 166605 172783 178667 184603 190593 196005 200167
54714 200167 202883 204151 203708 201254 196965 191389 184970 178111 171523 165881 161050 156268 151324 146991
54700 146991 143990 142044 140390 138809 137604 136887 136442 136143 136067 136246 136666 137355 138090 138218 137265 135669 134451
54683 134451 134143 134454 134960 135637 136560 137451 137796 137265 135966 134389 133095 132287 131712 131135 130784 131078 132015 133127
54665 133127 133946 134213 133731 132453 130755 129281 128428 128294 129051 130943 133749 136626 138733 139769 139814 138972
54649 138972 137437 135684 134302 133717 134187 135790 138164 140407 141583 141472 140701 140163 140360 141223 142352 143322
54633 143322 143855 143886 143600 143320 143238 143190 142868 142235 141590 141115 140601 139816 138990 138666 139121 140162 141408 142564 143464
54614 143464 144098 144597 144980 145005 144534 143994 144073 144863 145691 145970 145957 146399 147601 149120 150389 151358 152471 154072
54596A54072J897J616R35M04L92P73J135J244J186J153J157J028P82Q10J449K362
54580A72395K722K214J455J141J142R21M89K93L63L05M4j27k13n00p80m13O02
54563A82053J420J496J158P45mj086j644r98K59R81Q44L03l18q06n75P00K103
54546A86631K175P88n06l30J005K133K263J736J300J258J343J226J039J172J591
54531B04824J687J118M08K39M50L19l07q57r64r10j036j261j453j700j940j765
54515A96852j048l90m39r49j000j92Q14J114O05k9k44j63j10m9K80Q32J242J285
54497A98411J039O42K30N9L76J000J479J681J858K036J912J551J620K456L432
54482B19782L656L113K521K326K326K165J788J364J095J066J205J446J916K611
$$ plain form
54596 154072 155969 157585 158520 158924 159316 160089 161224 162468 163654 164807 165964 166992 167774 168584 170033 172395
54580 172395 175117 177331 178786 179927 181069 181990 182479 182772 183135 183440 183484 183357 183144 182644 181864 181451 182053
54563 182053 183473 184969 186127 186872 186868 185782 184138 183140 183399 184380 185224 185527 185209 184403 183828 184528 186631
54546 186631 188806 189594 189088 188758 189763 191896 194159 195895 197195 198453 199796 201022 202061 203233 204824
54531 204824 206511 207629 208037 208276 208726 209045 208738 207881 206917 206007 204971 203710 202257 200557 198617 196852
54515 196852 195804 195414 194975 194026 193026 192834 193648 194762 195367 195338 195094 194931 194821 194772 195052 195884 197126 198411
54497 198411 199450 200092 200322 200381 200757 201757 203236 204917 206775 208811 210723 212274 213894 216350 219782
54482 219782 223438 226551 229072 231398 233724 235889 237677 239041 240136 241202 242407 243853 245769 248380
54468B48380K973K321R26q3j66l7m18r54j028r42j270j653j304m44j9j65j14L40
54450B46343M72k0m13j79J80L1l60l94j48j92p50j564k333k854k961k672k238
54433B29948j834j396q77m43k37k23l48o02q36q72q01p74n88N8Q33J002M77rq3
54414B22395l34j250k230k291j353k02M80N33J17l48k49N20J149Q19j35o42l44
54397B16635J19K49L44P00R37O25N6j82r5j10k59j86J07J30k38l95J44J017J439
54378B21037J133L73n18j196j073J62J770K383J559L46L5P63J692K137K028J607
54362B34238J101O23R5o07j255j429j218j273j782j951j192k91n28j889l053l122
54346B16467k410j525o04K24M58j60j181j952k229j981j220l38p0o07j159r60
$$ plain form
54468 248380 251353 253674 254600 254517 254351 254314 253896 252942 251914 250972 249702 248049 246745 246301 246282 246117 246003 246343
54450 246343 246815 246795 246382 246203 246383 246414 246054 245660 245512 245320 244570 243006 240673 237819 234858 232186 229948
54433 229948 228114 226718 225841 225398 225161 224938 224590 223988 223152 222280 221479 220705 220117 220175 221008 222010 222487 222478 222395
54414 222395 222061 220811 218581 216290 214937 214735 215215 215748 215865 215517 215268 215788 216937 217756 217621 216979 216635
54397 216635 216754 217003 217347 218047 218984 219609 219665 219483 219388 219278 219019 218833 218940 219070 218832 218437 218581 219598 221037
54378 221037 222170 222543 222025 220829 219756 219918 221688 224071 225630 225976 226011 226774 228466 230603 232631 234238
54362 234238 235339 235962 236057 235450 234195 232766 231548 230275 228493 226542 225350 225059 224531 222642 219589 216467
54346 216467 214057 212532 211928 212152 212610 212450 211269 209317 207088 205107 203887 203549 203479 202872 201713 200753
54330B00753l34k29q54j440j289n81N7L52M94O31N98K40k29l71r0K06R6l72q69
54311A96769j181j179o87K08Q83P11q8o64n75j78J24M64J012J370R41k52j475
54294A96203k021j834j412j230j337j501j577j566j390r48n05n92j208j539r86
54279A76557k3M59L60K49L06K16KR0M28M02j84p76r80j089j342j375q41NP22J213
54259A74399J430J158N18J77N59J179J308Q42J26o38j217j063L6J256J470O19
54243A82159k49l64l5P8j02k36k58m35q06r89p45m09m84q05o66Q0N78K4j149j797
54223A73390j534r74o28l34J28N72Q29R97J046P73K86n1l33r98j789j722n75N09
54205A69592N57J16K28P69Q53M08K25N65P86M65J1j39j41l28n96o44m42k53k92
$$ plain form
54330 200753 200419 200190 199336 197896 196607 196026 196083 196435 196929 197560 198158 198398 198169 197798 197708 197914 198010 197638 196769
54311 196769 195588 194409 193722 193930 194813 195524 195436 194772 194197 194019 194143 194607 195619 196989 197930 197678 196203
54294 196203 194182 192348 190936 189706 188369 186868 185291 183725 182335 181387 180882 180290 179082 177543 176557
54279 176557 176534 176993 177353 177602 177908 178124 178126 178216 178644 179046 178862 178086 177106 176017 174675 173300 172459 172464 173186 174399
54259 174399 175829 176987 177505 177682 178241 179420 180728 181570 181696 181058 179841 178778 178814 180070 181540 182159
54243 182159 181910 181546 181511 181589 181487 181251 180993 180558 179752 178763 178018 177609 177125 176320 175654 175734 176312 176336 175187 173390
54223 173390 171856 170882 170254 169920 170048 170620 171449 172446 173492 174265 174551 174500 174167 173169 171380 169658 169083 169592
54205 169592 170149 170265 170493 171262 172115 172523 172748 173313 174099 174564 174575 174436 174295 173967 173371 172727 172285 172032 171740
54186A71740n66q87r88p35l10n3j58m66n71j46O05J020P47L44N64J164J088N3
54168A72445r30r53m44l66q07j141j159j204j369j265p06l2K95J92l0P2O18J149
54150A64365J144Q52J049J800K175J672J086J384K347L115L469L652L475K646
54136A94231J661J277J283Q47n6o73q16j123j856k505k830l220l735l755k988
54121A75742k012j388r92o11m48n50m45J01N61L85k05o65p98o02K7Q76J289R63
54103A71228M52K92J66m30j127j126m89q2k86n52l59J10N12Q88J284J288N17o54
54085A71632j282q93L9P01Q38Q28J007J198J008M28q9j55J17L33L54M11O33O95
54067A77803K34m43m84M28J534J920J790K105L028L587L099K287K369L646N540
$$ plain form
54186 171740 171174 170287 169299 168564 168254 168201 168043 167577 167006 166860 167465 168485 169232 169576 170140 171304 172392 172445
54168 172445 171515 170562 170118 169752 168945 167804 166645 165441 164072 162807 162101 162069 162364 162556 162526 162598 163216 164365
54150 164365 165509 166361 167410 169210 171385 173057 174143 175527 177874 180989 184458 188110 191585 194231
54136 194231 195892 197169 198452 199299 199243 198570 197754 196631 194775 192270 189440 186220 182485 178730 175742
54121 175742 173730 172342 171350 170739 170291 169741 169296 169397 169958 170343 170138 169473 168675 168073 168100 168976 170265 171228
54103 171228 171680 171972 172138 171708 170581 169455 168966 168884 168598 168046 167687 167797 168309 169197 170481 171769 172286 171632
54085 171632 170350 169457 169496 170197 171035 171863 172870 174068 175076 175504 175415 175260 175377 175710 176064 176475 177108 177803
54067 177803 178037 177594 177110 177538 179072 180992 182782 184887 187915 191502 194601 196888 199257 202903 208443
54052B08443P606R715J1523J2584J2982J3133J2866J1452Q642N132J647j798n312
54039C08615q231r450q627o692m960l931l153k108r31o2N22J220K012K365K067
54024B68656J648J547J470R50J06o63j304j854k026j722j609k297l220l245k333
54009B54104j695k160l194l798l715l379l151k954k444j512o84p72j776k566k263
53994B18041j465j281j577j338n72m61j462k522k591j840q83M2N78P8j268k062
53978A99417j384j46J72n49j350j680j627j132j08Q49R69M87M12J055J639J423
53962A98447N95j71m26o7P54J634K204K483K696K774K474J954J798K318L115L521
53946B26103L341L081L434M476N391N235M037K756K075J664R88K69J55O79J256
$$ plain form
54052 208443 216049 225764 237287 249871 262853 275986 288852 300304 308946 314078 315725 313927 308615
54039 308615 300384 290934 282307 275615 270655 266724 263571 261463 260532 260470 260992 262212 264224 266589 268656
54024 268656 270304 271851 273321 274271 274377 273714 272410 270556 268530 266808 265199 262902 259682 256437 254104
54009 254104 252409 250249 247055 243257 239542 236163 233012 230058 227614 226102 225418 224646 222870 220304 218041
53994 218041 216576 215295 213718 212380 211808 211347 209885 207363 204772 202932 202049 202091 202669 202747 201479 199417
53978 199417 198033 197887 198059 197510 196160 194480 192853 191721 191613 192462 193431 193918 194330 195385 197024 198447
53962 198447 199042 198871 198445 198378 199132 200766 202970 205453 208149 210923 213397 215351 217149 219467 222582 226103
53946 226103 229444 232525 235959 240435 245826 251061 255098 257854 259929 261593 262581 262850 263005 263684 264940
53931B64940J538J710J946K107K041J861J775J910K293K811L269L655M198M946
53917C01000N479N384M818M343M289M576M960N168M981M523M249M249L874K570
53903C64463R41K87J034K243K837K835L086M076N309N784M899K947P26j280l337
53888C96850n961r200j2471j4880j5637j4478j2124r969q877q374p415n811m327
53875B67326l554l251k919k436j931j517j420j923k852l384k823j477m15l78j149
53860B35897j983k390k398k185j760j057k19M14N83K86k98r16j286j257q88l43
53844B20200L08R33J187Q62L73M01R84J467J428J140Q40K47p77j657j818j578
53828B24540j637j996k045j516p08J05Q15J164R38N23N53R69J022L94k75k16N69
$$ plain form
53931 264940 266478 268188 270134 272241 274282 276143 277918 279828 282121 284932 288201 291856 296054 301000
53917 301000 306479 311863 316681 321024 325313 329889 334849 340017 344998 349521 353770 358019 361893 364463
53903 364463 365404 365691 366725 368968 371805 374640 377726 381802 387111 392895 397794 400741 401467 400187 396850
53888 396850 390889 381689 369218 354338 338701 324223 312099 302130 293253 284879 277464 271653 267326
53875 267326 263772 260521 257602 255166 253235 251718 250298 248375 245523 242139 239316 237839 237424 237046 235897
53860 235897 233914 231524 229126 226941 225181 224124 223905 224319 224902 225188 224890 223974 222688 221431 220543 220200
53844 220200 220508 221441 222628 223490 223863 224264 225248 226715 228143 229283 230123 230370 229593 227936 226118 224540
53828 224540 222903 220907 218862 217346 216638 216743 217558 218722 219660 220183 220736 221705 222727 223121 222846 222630 223199
53811B23199J484K027K077J842J756K220L237M362N110N224M751M093L853M256
53797B69491M733M553L766L128L086L377L590L569L236K553J858J679K005K184
53783C12808J781R97J18r52k228l288l749l764l687l630l615l764l944l670k798
53768B76615j953j783k093k257k162k172k326k262j898j595j540j490j236r55
53754B50893r14j116j413j675j768j590j209q19m72j00K28L21K01J23J57R4j13
53737B40828j05L87J022J186P41J36k34l90m02l2R23K072K694K587K353K613L144
53720B59523L156K311J212P38J113J741J878J422R64J130J851K478K600K537K788
53705B87442L199L167K632K345K873L743M050L689L514M192N313N890N505M713
$$ plain form
53811 223199 224683 226710 228787 230629 232385 234605 237842 242204 247314 252538 257289 261382 265235 269491
53797 269491 274224 278777 282543 285671 288757 292134 295724 299293 302529 305082 306940 308619 310624 312808
53783 312808 314589 315586 315704 314752 312524 309236 305487 301723 298036 294406 290791 287027 283083 279413 276615
53768 276615 274662 272879 270786 268529 266367 264195 261869 259607 257709 256114 254574 253084 251848 250893
53754 250893 249979 248863 247450 245775 244007 242417 241208 240389 239917 239817 240045 240366 240567 240690 240847 240941 240828
53737 240828 240723 241110 242132 243318 244059 244195 243961 243571 243169 243137 244060 246132 248826 251413 253766 256379 259523
53720 259523 262679 264990 266202 266940 268053 269794 271672 273094 274058 275188 277039 279517 282117 284654 287442
53705 287442 290641 293808 296440 298785 301658 305401 309451 313140 316654 320846 326159 332049 337554 342267
53691C42267M310M431M520M093L303K673K404K201J722R94L18p4j91k02l14o06
53675C71849r42j097r69o13j60J89J50l12p49o35r6J55k31p69r26r46j371k041
53657C60486k178j508p04m90q34j236j485j746k115k424k512k365k022j483q15
53642C36569k53q6m00q78r46l15O36J208J155R21R95J264J261Q91O26R62J907
53625C45517L013L751L870L531L135K925K873L021L671M919O144O469N825N050
53611D03714M773M718M419M126M443N339O138O366O065N323M161K976K478K825
53597D67864L328L352L080K985K923K351J321N77N95R94J088O32q9o78q65o02
53581D88856k01j91q86k042l126l834m253m574m844n004m979m738m302l759l169
$$ plain form
53691 342267 346577 351008 355528 359621 362924 365597 368001 370202 371924 372918 373236 373162 372971 372769 372455 371849
53675 371849 370907 369810 368841 368228 368068 368257 368407 368095 367346 366711 366615 366770 366539 365770 364844 363898 362527 360486
53657 360486 358308 356800 356096 355606 354772 353536 352051 350305 348190 345766 343254 340889 338867 337384 336569
53642 336569 336316 336230 335830 334952 334006 333691 334327 335535 336690 337611 338606 339870 341131 342022 342648 343610 345517
53625 345517 348530 352281 356151 359682 362817 365742 368615 371636 375307 380226 386370 392839 398664 403714
53611 403714 408487 413205 417624 421750 426193 431532 437670 444036 450101 455424 459585 462561 465039 467864
53597 467864 471192 474544 477624 480609 483532 485883 487204 487781 488376 489370 490458 491090 491001 490323 489458 488856
53581 488856 488655 488464 487578 485536 482410 478576 474323 469749 464905 459901 454922 450184 445882 442123 438954
53566D38954k539j930j581j725k255k731k780k330j455k87P70J077M00n99r48
53551D20041m09M00Q84J068J185J197J058J040J462K278L220M138M923N357N449
53536D53291N674O475P683Q792R667J0535J1415J2069J2549J3244J4341J5603
53524E81338J6745J7690J8487J9327K0534K2114K3453K4069K4553K6048K8712
53513H23070L1462L3376L4593L5537L6135L6308L6496L7001L7382L7215L7003
53502A215578L7588L8929M0181M0821M1031M1150M1356M1797M2364M2355M0992
53491A664142L8371L5495L3198L1457K9778K7886K5872K3945K2242K0866K0096
53480A973348K0449K2200K4676K6414K6350K4623K2055J9257J6541J4078J1603
$$ plain form
53566 438954 436415 434485 432904 431179 428924 426193 423413 421083 419628 419341 420111 421188 421588 420989 420041
53551 420041 419632 420032 420916 421984 423169 424366 425424 426464 427926 430204 433424 437562 442485 447842 453291
53536 453291 458965 465440 473123 481915 491582 502117 513532 525601 538150 551394 565735 581338
53524 581338 598083 615773 634260 653587 674121 696235 719688 743757 768310 794358 823070
53513 823070 854532 887908 922501 958038 994173 1030481 1066977 1103978 1141360 1178575 1215578
53502 1215578 1253166 1292095 1332276 1373097 1414128 1455278 1496634 1538431 1580795 1623150 1664142
53491 1664142 1702513 1738008 1771206 1802663 1832441 1860327 1886199 1910144 1932386 1953252 1973348
53480 1973348 1993797 2015997 2040673 2067087 2093437 2118060 2140115 2159372 2175913 2189991 2201594
53469B201594Q341L908j046n659r984j4569j9267k3360k6654k9499l1811l3152
53457B018842l3924l5387l8072m0973m2881m3750m4193m4320m3789m2664m1549
53446A567340m0956m0978m1353m1564m0946l9153l6491l3609l0979k8633k6208
53435A166470k3117j9056j4464j0312p218n021l158j048J888O014J0851J5133
53423A116962J7958J9735K1648K4335K7409L0109L2066L3529L5067L7040L9267
53412A435125M1300M3100M5129M7702N0515N3099N5514N8234O1447O4814O7997
53401B023976P1168P4786P8907Q2919Q6098Q8361R0238R2152R4038R5720R7234
53390B975597R8470R8996R8604R7697R6524R4471R0824Q5993Q1164P6884P2888
$$ plain form
53469 2201594 2209935 2213843 2212797 2207138 2197154 2182585 2163318 2139958 2113304 2083805 2051994 2018842
53457 2018842 1984918 1949531 1911459 1870486 1827605 1783855 1739662 1695342 1651553 1608889 1567340
53446 1567340 1526384 1485406 1444053 1402489 1361543 1322390 1285899 1252290 1221311 1192678 1166470
53435 1166470 1143353 1124297 1109833 1099521 1092303 1087282 1084124 1083076 1084964 1090978 1101829 1116962
53423 1116962 1134920 1154655 1176303 1200638 1228047 1258156 1290222 1323751 1358818 1395858 1435125
53412 1435125 1476425 1519525 1564654 1612356 1662871 1715970 1771484 1829718 1891165 1955979 2023976
53401 2023976 2095144 2169930 2248837 2331756 2417854 2506215 2596453 2688605 2782643 2878363 2975597
53390 2975597 3074067 3173063 3271667 3369364 3465888 3560359 3651183 3737176 3818340 3895224 3968112
53379C968112O9239O6525O4636O2467N9278N5519N1759M7613M2382L5880K7900
53368D551310J7506L983j1904k8490m4758o0518p5308q8068r8042j05293j10281
53357C950137j13555j15804j17566j18711j18747j17709j16212j14573j12502
53348B904758j09902j07378j05582j04380j03083j01308r9206r6935r4164r0312
53338A892508q5177p9312p3630o8614o3903n8725n2690m6150l9905l4582l0182
53327A259638k6196k2262j8591j5585j3114j0660q144o018m393k684n51J418K584
53314A135442L422N013P539J0053J1861J3366J5304J7621J9545K0581K1114K2079
53302A302940K4089K6906K9711L2000L4008L6258L8824M1348M3586M5648M7699
$$ plain form
53379 3968112 4037351 4103876 4168512 4230979 4290257 4345776 4397535 4445148 4487530 4523410 4551310
53368 4551310 4568816 4572799 4560895 4532405 4487647 4427129 4351821 4263753 4165711 4060418 3950137
53357 3950137 3836582 3720778 3603212 3484501 3365754 3248045 3131833 3017260 2904758
53348 2904758 2794856 2687478 2581896 2477516 2374433 2273125 2173919 2076984 1982820 1892508
53338 1892508 1807331 1728019 1654389 1585775 1521872 1463147 1410457 1364307 1324402 1289820 1259638
53327 1259638 1233442 1211180 1192589 1177004 1163890 1153230 1145086 1139068 1134675 1131991 1131440 1132858 1135442
53314 1135442 1138864 1143877 1151416 1161469 1173330 1186696 1202000 1219621 1239166 1259747 1280861 1302940
53302 1302940 1327029 1353935 1383646 1415646 1449654 1485912 1524736 1566084 1609670 1655318 1703017
53291A703017M9625N1045N1548N1029M9880M8693M7706M6716M5664M4882M4493
53280B234298M3983M2744M0745L8167L4677K9804K3869J7901J2413O949J005n152
53268B521403j0957j6490k2407k9159l6523m3862n0531n6105o0468o3802o6379
53257B064720o8249o9158o8888o7554o5514o2948n9873n6666n4190n2920n2212
53246A386548n1142m9974m9994n1640n3582n4246n3533n2416n1366n0026m8052
53235H20577m5439m2086l7905l3348k9184k5645k2434j9504j7157j5335j3549
53224E18991j1679j0192r318q677p962p405p199p035o666o398o579o986p156p069
53210D08670o970o827o444n967n781n883n792n190m381l949m076m291l984l125
$$ plain form
53291 1703017 1752642 1803687 1855235 1906264 1956144 2004837 2052543 2099259 2144923 2189805 2234298
53280 2234298 2278281 2321025 2361770 2399937 2434614 2464418 2488287 2506188 2518601 2525550 2526555 2521403
53268 2521403 2510446 2493956 2471549 2442390 2405867 2362005 2311474 2255369 2194901 2131099 2064720
53257 2064720 1996471 1927313 1858425 1790871 1725357 1662409 1602536 1545870 1491680 1438760 1386548
53246 1386548 1335406 1285432 1235438 1183798 1130216 1075970 1022437 970021 918655 868629 820577
53235 820577 775138 733052 695147 661799 632615 606970 584536 565032 547875 532540 518991
53224 518991 507312 497120 487802 479125 471163 463758 456559 449524 442858 436460 429881 422895 415739 408670
53210 408670 401700 394873 388429 382462 376681 370798 365006 359816 355435 351486 347410 343119 339135 336010
53196C36010k416k510l181l601l424l206l536m112m124l362k487k199k449k651
53182B92752k433j987j700j661j610j290o85L8O31P64K56n80j013p22k69m45j225
53165B78821j806j677j192r66j103j244j153j007j172j772k409k437j688p68l33
53150B58094k19K54J146J714J423O20r0o13j078j281r42l22j8j63k74Q6Q39J585
53132B60761K056K205K091J763J221N09j30l10P4O11P38M05J00K47P35J205J569
53115B75850J923J993J116q88l048l953l272k091j551j573j315n63Qj39p18j099
53099B60680j035o79k89p7j26k66k66k11l79p10p98n30l47n86r58r61n28R2P67
53080B52793J436J844J777J470J358J421J216N62j35l64o6M67R29J133R30L09
$$ plain form
53196 336010 333594 331084 327903 324302 320878 317672 314136 310024 305900 302538 300051 297852 295403 292752
53182 292752 290319 288332 286632 284971 283361 282071 281386 281424 282055 282819 283075 282495 281482 280760 280491 280046 278821
53165 278821 277015 275338 274146 273180 272077 270833 269680 268673 267501 265729 263320 260883 259195 258427 258094
53150 258094 257875 258129 259275 260989 262412 263032 262942 262329 261251 259970 259028 258706 258688 258525 258251 258337 259176 260761
53132 260761 262817 265022 267113 268876 270097 270606 270476 270166 270240 270851 271589 271994 272094 272341 273076 274281 275850
53115 275850 277773 279766 280882 279994 276946 272993 269721 267630 266079 264506 263191 262628 262636 262497 261779 260680
53099 260680 259645 258966 258677 258600 258474 258208 257942 257731 257352 256642 255844 255314 254967 254381 253423 252462 251934 252026 252793
53080 252793 254229 256073 257850 259320 260678 262099 263315 263877 263742 263378 263312 263779 264708 265841 266771 267080
53064B67080m60r83j084r48q06o64m47l36n99j073j142m79M47R19Q18N34K87K3
53046B61087j29P4M21L72o7k56M8K73nl50l14l39j032j997k292j789j147o20J02
53027B52040Q40Q33J20j00Q93K139K288J454Q51R53J099Q49O69J016J551J672
53011B69167J307Q05M58M73R81J694J999J700J317J236J071M72N8O71J931K557
52995B87897K185J805K102K382J790P63K77L01Kp05q85pJ255J969K039J982K112
52978C07264K315K378K121J496P79M61O86R93R09N62M47P38J153J437J615J743
52962C27097J721J472J104Q05O60O74Q50J100J118N99l55j168j275p04m6R0m27
52945C33315j238j793j756j292r32r86j182j096q27p74q37m54M16J001P95L25
$$ plain form
53064 267080 266620 265637 264553 263605 262799 262135 261688 261352 260753 259680 258538 258059 258506 259425 260243 260777 261064 261087
53046 261087 260958 261032 261453 261825 261758 261502 261550 261823 261818 261468 261154 260815 259783 257786 255494 253705 252558 251938 252040
53027 252040 252880 253713 253833 253733 254626 256765 259053 260507 261358 262311 263410 264259 264928 265944 267495 269167
53011 269167 270474 271279 271737 272210 273191 274885 276884 278584 279901 281137 282208 282680 282738 283409 285340 287897
52995 287897 290082 291887 293989 296371 298161 298924 299201 299502 299504 298799 297914 297907 299162 301131 303170 305152 307264
52978 307264 309579 311957 314078 315574 316353 316814 317500 318493 319402 319964 320411 321149 322302 323739 325354 327097
52962 327097 328818 330290 331394 332199 332859 333533 334383 335483 336601 337200 336845 335677 334402 333698 333652 333742 333315
52945 333315 332077 330284 328528 327236 326304 325318 324136 323040 322213 321439 320602 320148 320564 321565 322360 322685
52929C22685L01N07K64l73o79l86P3M37R12J438J399M83p54j480j411p85O2Q01
52911C23494J176J183J022O86n0j092j922k183k043j754j258n53n2j50o49r47
52895C14908o76O1Q87J402J429J233J249J461J358P38J09p0j56p99j853k417j992
52878C16872j127o75p85q82m93J29K86l60j395k089k153j896j663j376o67O44
52862C02370K253L484L733L036K064J390Q53k3j234k319l159l967m512m066k579
52847B97324j203j069j924k658k814k840k956k628j465k9P15M85j68o78r85j205
52831B75902j158o14J72O21N52L53K79J5o56j253j170o01k57l04k53J24M65M94
52813B72711M39O16J114K013L291M437M751M143L080J687k68k361l457l182k566
$$ plain form
52929 322685 322986 323493 323757 323384 322705 322319 322392 322829 323741 325179 326578 327061 326307 324827 323416 322631 322693 323494
52911 323494 324670 325853 326875 327561 327511 326419 324497 322314 320271 318517 317259 316706 316654 316504 315855 314908
52895 314908 314232 314293 315180 316582 318011 319244 320493 321954 323312 324050 324159 324089 323933 323134 321281 318864 316872
52878 316872 315745 315070 314285 313403 312910 313039 313325 312965 311570 309481 307328 305432 303769 302393 301726 302370
52862 302370 304623 308107 311840 314876 316940 318330 319183 319160 317926 315607 312448 308481 303969 299903 297324
52847 297324 296121 295052 293128 290470 287656 284816 281860 279232 277767 277738 278453 278938 278770 278092 277107 275902
52831 275902 274744 274130 274302 274923 275475 275828 276107 276122 275466 274213 273043 272442 272185 271881 271628 271752 272217 272711
52813 272711 273150 273766 274880 276893 280184 284621 289372 293515 296595 298282 298014 295653 292196 289014 286448
52798B86448k660l259l638l744l867l760l032k020j366j115r08p92r41r65m03
52783B53978L38M17j73o19n00j24K53O97R98P10m3n06l41m2r2l46n23p76j299
52764B52007j791j668p40N13J237Q87j98j008r67n43m18m61j22M15L81l29r01
52747B46294p42j43M10Q26J074R57O30P07J447K283K579K311J721Q77k0l73J27
52730B60965R12J256J256J532K130K378J852R33J74l95j060j786k109j720r35
52715B65383m38n36q50q11l40J36K56L1l00n10m03P5O74R94R15P39Q08J139J508
52696B68470J694J557J066L73j45j47L74J041J401J320J070R96J149J390J668
52681B83277J910J744Q52l39q54l47M23N51Ro34r87r21l61M51Q85P13N04P08Q48
$$ plain form
52798 286448 283788 280529 276891 273147 269280 265520 262488 260468 259102 257987 257079 256287 255346 254381 253978
52783 253978 254316 254733 254560 253941 253441 253317 253570 254267 255265 255975 255932 255426 255085 255043 254951 254605 254082 253306 252007
52764 252007 250216 248548 247808 248321 249558 250445 250247 249239 248272 247729 247311 246850 246728 247143 247524 247195 246294
52747 246294 245552 245409 245819 246645 247719 248676 249306 250013 251460 253743 256322 258633 260354 261231 261211 260838 260965
52730 260965 261877 263133 264389 265921 268051 270429 272281 273214 273388 272993 271933 270147 268038 266318 265383
52715 265383 264945 264409 263559 262748 262408 262544 262800 262831 262531 262021 261618 261693 262367 263361 264276 265015 265823 266962 268470
52696 268470 270164 271721 272787 273160 273015 272868 273242 274283 275684 277004 278074 279070 280219 281609 283277
52681 283277 285187 286931 287783 287444 286590 286243 286666 287217 287226 286592 285605 284684 284323 284774 285659 286372 286876 287584 288432
52662B88432L78j86M4Q45J279J238J461K014K056J348Q01J061J634J871J803J405
52646C07484J41j996l821m263l699l174k877k339j602j184j091p44M4Q55J327
52631B83061J481J340Q49K34q2M0L85P86J142J165O10k11n63j56M98P61N75M05
52613B92320O13J107J495J485J155Q91R67J289J531J486J201Q42N13K24k%L60
52596C07477Q52R55M60j44k44J20M11M01L54L86K36k23o54o74k81K66O63O14J15
52577C11090k63J46J121J628J054p0q34r80q06n88n02p53j297j714j637j158n75
52560C03862j12m0n53j268j380p12j17l26r67j259j180j278j636j860j844j858
52544B87472j957j925j774j720j690j436j103j109j414j492j085n09q1K41M84
$$ plain form
52662 288432 288810 288624 288668 289513 290792 292030 293491 295505 297561 298909 299710 300771 302405 304276 306079 307484
52646 307484 307625 305629 301808 297545 293846 290672 287795 285456 283854 282670 281579 280835 280879 281734 283061
52631 283061 284542 285882 286731 286965 286883 286923 287308 288094 289236 290401 291011 290800 290237 290081 290579 291340 291915 292320
52613 292320 292933 294040 295535 297020 298175 299066 300033 301322 302853 304339 305540 306382 306895 307119 307117 307117 307477
52596 307477 308329 309284 309744 309600 309356 309476 309887 310288 310642 311028 311264 311041 310387 309713 309432 309698 310361 310975 311090
52577 311090 310827 310973 312094 313722 314776 314706 313872 312892 312086 311498 310996 310243 308946 307232 305595 304437 303862
52560 303862 303750 303710 303157 301889 300509 299797 299680 299354 298387 297128 295948 294670 293034 291174 289330 287472
52544 287472 285515 283590 281816 280096 278406 276970 275867 274758 273344 271852 270767 270258 270177 270418 270902
52529B70902M00q0m76k00P17J621J970J832J572J206M00p50j362p10O56J389J037
52512B80124N51Q60J680K278K657L252L880L915L281K432J450j8j816l080l234
52497B98212k648k024j631j411j374j530j683j590j271r32o85m52n2N89J284J680
52481B84482J627J324J054Q55O25L82J99P0N8L72J073J797K114K032J895J884
52465C01843J868J618J001L1r71j481j260o23l8K89K79j93j078k059k963l901
52449B92362m690m654l543k237j839k301k642k321j696j264j092j065j093j018
52435B60907p85o74r53j394j541j348j083p66l04Q6J38O5K09M11M11N59J255J894
52417B57087J508M09N2J041K328K776K488K217K325K931M227N977P392Q004Q091
$$ plain form
52529 270902 271302 271222 270746 270546 271263 272884 274854 276686 278258 279464 279864 279114 277752 277042 277698 279087 280124
52512 280124 280675 281535 283215 285493 288150 291402 295282 299197 302478 304910 306360 306342 304526 301446 298212
52497 298212 295564 293540 291909 290498 289124 287594 285911 284321 283050 282118 281433 280981 280929 281518 282802 284482
52481 284482 286109 287433 288487 289342 289967 290349 290548 290618 290676 291048 292121 293918 296032 298064 299959 301843
52465 301843 303711 305329 306330 306361 305390 303909 302649 302026 301988 302277 302556 302363 301285 299226 296263 292362
52449 292362 287672 283018 279475 277238 275399 273098 270456 268135 266439 265175 264083 263018 261925 260907
52435 260907 260122 259448 258495 257101 255560 254212 253129 252363 252059 252145 252283 252348 252557 252968 253379 253938 255193 257087
52417 257087 258595 259004 259056 260097 262425 265201 267689 269906 272231 275162 279389 285366 292758 300762 308853
52402C08853P756O403L705M41k356m481o098o904o643n930n635n630n083l754
52388B74644k225r76j9N74N66M3n87j105j489j442o43N68J334J364J234J451J756
52371B75048J708J492J711K485L207L214K474J560R85O73J92n77j241j400j131
52356B90400q05o87q72j291j553j159j74O39P88P31J094J558J351N64R0K11K54
52339B91139p7o7P74J704J882J846K745M377N195M434L209K969L684M204L918
52324C31936L263K889L025L655M671N661O090N865N380M859M113L132K430K412
52310C89381K729K791K639K749L119L115K367J376R25J252J912K315K208J829
52296D20707J641J827K053J860J260O54K03l56j178j970k366k332k046j556q84
$$ plain form
52402 308853 316609 323012 326717 327158 324802 320321 314223 307319 300676 294746 289111 283481 278398 274644
52388 274644 272419 271443 271424 271998 272564 272607 272020 270915 269426 267984 267341 267909 269243 270607 271841 273292 275048
52371 275048 276756 278248 279959 282444 285651 288865 291339 292899 293884 294557 294749 294172 292931 291531 290400
52356 290400 289595 288908 288036 286745 285192 284033 283859 284498 285286 286017 287111 288669 290020 290584 290674 290885 291139
52339 291139 291062 290995 291769 293473 295355 297201 299946 304323 309518 313952 317161 320130 323814 328018 331936
52324 331936 335199 338088 341113 344768 349439 355100 361190 367055 372435 377294 381407 384539 386969 389381
52310 389381 392110 394901 397540 400289 403408 406523 408890 410266 411191 412443 414355 416670 418878 420707
52296 420707 422348 424175 426228 428088 429348 430002 430205 429849 428671 426701 424335 422003 419957 418401 417517
52281D17517k42J08K24M60J105K079L007L480L366K919K585K589K755K782K590
52266D47324K426K611L187L753L767L099K192J585J381J347J357J480J708J978
52252D79195K379L026L671L807L239K335J619J338J399J426R15l84k069l364l762
52237D94770l247k038n03P18J058O90M07P03J345J961K534L036L068K357J328
52222E08187P96J133J985K733L082L276L761M583N143M914M290M234N077O107
52208E59301O505O179N490M729M075L653L301K722K024J664J639J466J189J625
52194F05562L022M264M184L036J953J378R99P55R09J240J169O47Q6n38j608k893
52178F24165l507l124k418k085k100k208k463k857k989k530j665p96j39J86Q5
$$ plain form
52281 417517 417275 417383 417607 418067 419172 421251 424258 427738 431104 434023 436608 439197 441952 444734 447324
52266 447324 449750 452361 455548 459301 463068 466167 468359 469944 471325 472672 474029 475509 477217 479195
52252 479195 481574 484600 488271 492078 495317 497652 499271 500609 502008 503434 504349 503965 501896 498532 494770
52237 494770 491523 489485 488982 489700 490758 491448 491855 492558 493903 495864 498398 501434 504502 506859 508187
52222 508187 508983 510116 512101 514834 517916 521192 524953 529536 534679 539593 543883 548117 553194 559301
52208 559301 565806 571985 577475 582204 586279 589932 593233 595955 597979 599643 601282 602748 603937 605562
52194 605562 608584 612848 617032 620068 622021 623399 624398 625153 626062 627302 628471 629118 629204 628666 627058 624165
52178 624165 620658 617534 615116 613031 610931 608723 606260 603403 600414 597884 596219 595423 595284 595470 595555
52163E95555k28k77J86R92J910K723K989K366J318Q49J163J332P40J32N39J651
52147F13940K180J646R45J033J717K108J829J345J155J067M73o49j476j380r10
52132F25023j115j908j942l93J856L406M106M859O060P169P773Q174Q755R413
52118F81236R926J0311J0490J0081Q875P251N752M456L077J467k06j669k655l002
52104G45390k894k878l259l581l074j636LJ200K069K940L538L224J985O33j97
52089G43463q27j977l632m963n318m882m226l568k755j737p00K17J058J869K532
52074G14554K867K868K757K847L283L858M164L997L457K643J479Q8r54j175r24
52059G45809j027j643j934j195J39R88Q88K40m67j136j779k277k623l072l783
$$ plain form
52163 595555 595327 595050 595236 596228 598138 600861 603850 606216 607534 608383 609546 610878 611618 611750 612289 613940
52147 613940 616120 617766 618711 619744 621461 623569 625398 626743 627898 628965 629438 628789 627313 625933 625023
52132 625023 623908 622000 620058 619665 621521 624927 629033 633892 639952 647121 654894 663068 671823 681236
52118 681236 691162 701473 711963 722044 730919 738170 743922 748378 751455 752922 752716 751047 748392 745390
52104 745390 742496 739618 736359 732778 729704 728068 728071 729271 731340 734280 737818 741042 743027 743660 743463
52089 743463 742636 740659 737027 732064 726746 721864 717638 714070 711315 709578 708878 709095 710153 712022 714554
52074 714554 717421 720289 723046 725893 729176 733034 737198 741195 744652 747295 748774 748862 747908 746733 745809
52059 745809 744782 743139 741205 740010 740149 741137 742025 742265 741798 740662 738883 736606 733983 730911 727128
52044G27128m606n313n825n994n536m469l316k584k157j508l90J036K496L644
52030F92606L965L219K013J383J604J890J547R79R84J501J620Q96M2L1R02J747
52014G16929J814J314J029J349J854J870J228K74p96k210m138o164p659q551r361
51999F88782j0413j1394j1887j1994j2045j1910j1109r680q379p788p569o992
51987E67622n950n000m547m496m707n241n942o294o026n568n567o166p044p839
51973D87235q223p836o615m969l289j470O14K515L683M359N251O346O831O365
51959D90797N681N542N761N624M758L162R38j491l267l853l634l404l392l240
51945D99982k595j282Q21L546O160P983R162J0374J1801J2948J3424J3373J3018
$$ plain form
52044 727128 722522 717209 711384 705390 699854 695385 692069 689485 687328 685820 685430 686466 688962 692606
52030 692606 696571 699790 701803 703186 704790 706680 708227 709206 710190 711691 713311 714207 714249 714280 715182 716929
52014 716929 718743 720057 721086 722435 724289 726159 727387 727661 726865 724655 720517 714353 706694 698143 688782
51999 688782 678369 666975 655088 643094 631049 619139 608030 598350 589971 582183 574614 567622
51987 567622 561672 556672 552125 547629 542922 537681 531739 525445 519419 513851 508284 502118 495074 487235
51973 487235 479012 471176 464561 459592 456303 454833 455447 457962 461645 466004 471255 477601 484432 490797
51959 490797 496478 502020 507781 513405 518163 521325 522263 520772 517505 513652 510018 506614 503222 499982
51945 499982 497387 496105 496926 500472 506632 514615 523777 534151 545952 558900 572324 585697 598715
51932E98715J2337J1284R871P796M549K32m187p828j0748j3423j5648j6676j6362
51919E59912j5540j4920j4205j2740j0712r011p919o658m524j977l0J055J952
51906D64683L259M985P021R519J2581J5913J9144K2166K5023K7691L0022L1566
51894F73573L1413K8641K3087J5267N589n626j7104k6504l2029l3778l2948l0294
51882E99287k6108k1207j6785j3241r990o529l104j79K122L817M838N236N226
51869E23383M859L903K236P2k253m472o369p835q942r685r727q730o884m829l047
51854D61680j672p16j55J77L52J62m97j232j608j799k174k528k442k236k625l392
51838D39295l463k552j735j897k392k017o11R27J785J801J261P29P39J182J272
$$ plain form
51932 598715 611052 622336 632207 640003 644552 644784 640597 632769 622021 608598 592950 576274 559912
51919 559912 544372 529452 515247 502507 491795 482784 474865 468207 463683 461706 461676 462731 464683
51906 464683 467942 472927 479948 489467 502048 517961 537105 559271 584294 611985 642007 673573
51894 673573 704986 733627 756714 771981 777570 771944 754840 728336 696307 662529 629581 599287
51882 599287 573179 551972 535187 521946 511956 505427 502323 502144 504266 508083 512921 518157 523383
51869 523383 528242 532145 534381 534453 532200 527728 521359 513524 504582 494897 485170 476440 469556 464727 461680
51854 461680 460008 459292 459137 459314 459666 459828 459331 458099 456491 454692 452518 449990 447548 445312 442687 439295
51838 439295 435832 433280 431545 429648 427256 425239 424628 425555 427340 429141 430402 431131 431870 433052 434324
51823D34324N39n54j326j750k095k192j786j217r69q05j41R43J830K404L112L970
51807D34287M333L844K876J752L14j382k604k801k405k260k481k465j904j218
51793D27886r89j391k227l166l789l701k884j854j175q72m47M00J268J432P13
51778D09204l14r87j251j445j610j368m87O76J501J760J866K462L794N430O633
51763D25864P027O842O439N799M585K664K67k187m242n390n396m734m285m389
51749D28864m484m019l285k880k658j908n27P28J397K012L284N115O984Q771J0480
51734D47874J1496J1088R599Q289P704P007N332L111J520J056J337J907K479K501
51720E22300J247j362m432o740p584p026n608l977k593j730j668k642m417o179
$$ plain form
51823 434324 434863 434309 432983 431233 429138 426946 425160 423943 422974 422169 422028 422971 424801 427205 430317 434287
51807 434287 438620 442464 445340 447092 447406 446024 443420 440619 438214 435954 433473 431008 429104 427886
51793 427886 426897 425506 423279 420113 416324 412623 409739 407885 406710 405838 405391 405791 407059 408491 409204
51778 409204 408890 407903 406652 405207 403597 402229 401742 402418 403919 405679 407545 410007 413801 419231 425864
51763 425864 432891 439733 446172 451971 456556 459220 459487 457300 453058 447668 442272 437538 433253 428864
51749 428864 424380 420361 417076 414196 411538 409630 409103 409831 411228 413240 416524 421639 428623 437394 447874
51734 447874 459370 470458 480057 488346 496050 503057 508389 511500 513020 514076 515413 517320 519799 522300
51720 522300 523547 522185 517753 511013 503429 496403 490795 486818 484225 482495 480827 478185 473768 467589
51706D67589p074o733n145k463O37K860L253K206R24L7p02j427j679j126j34P45
51690D51768J409J954K144J496j40k289m035m599l950k873k151j795j300n08L37
51675D35468J181K177L059L298L082L447M998P089Q711R682J0527J1455J1969
51662E16143J1228Q624M316m93m262o412p587q388q389o913m229j271J412L736
51648D97515N319N459L957J366j667m823p817j0173j1556j2031j1817j0973r439
51635D33320p340n142l459k582k120j414l41N10O34L10K03N15Q20N92l34j645
51619D12527k710l041k793k632k886l131k850k109j325o36M1O16Q93Q66O37L38
51603C91805L66J292L013M473M880M903N889Q040J0176J1253J1316J0788R577
$$ plain form
51706 467589 460515 453782 448637 446174 446811 449671 452924 455130 456054 456091 455389 453962 452283 451157 451023 451768
51690 451768 453177 455131 457275 458771 458631 456342 452307 447708 443758 440885 438734 436939 435639 435131 435468
51675 435468 436649 438826 441885 445183 448265 451712 456710 463799 472510 482192 492719 504174 516143
51662 516143 527371 535995 540311 539818 535556 529144 521557 513169 504780 497867 493638 492367 493779 497515
51648 497515 502834 508293 512250 513616 511949 507126 499309 489136 477580 465549 453732 442759 433320
51635 433320 425980 420838 417379 414797 412677 411263 410922 411432 412066 412376 412579 413094 413914 414506 414172 412527
51619 412527 409817 406776 403983 401351 398465 395334 392484 390375 389050 388414 388455 389071 389964 390830 391467 391805
51603 391805 392171 393463 396476 400949 405829 410732 416621 424661 434837 446090 457406 468194 477771
51590D77771P377M375J227j462l426m686n328n291m339k470k17J690L001M063
51576D72285N394P276R650J2052J3856J4888J5670J6716J7860J8647J9057J9290
51564F42641J9098J8159J7026J6981J8828K2376K7096L2516L7776M1568M2980
51553I37045M1911L8458L2438K3904J3721L157o928j6258k4790l2382l8585m2753
51541I28938m4627m4815m4202m2913m0413l6683l2543k8609k4688k0671j7229
51530E51545j4947j3331j1458r298p581o606n894n087m451m253m229l914l283
51517D57213k665k259j957j703j780k461l387l633k736j432r38j496k143k034
51503D26589j415j062j178j295r72k50N21J079J503K093K845L187K661J734J319
$$ plain form
51590 477771 485148 489523 490750 489288 485862 481176 475848 470557 466218 463748 463531 465221 468222 472285
51576 472285 477679 484955 494605 506657 520513 535401 551071 567787 585647 604294 623351 642641
51564 642641 661739 679898 696924 713905 732733 755109 782205 814721 852497 894065 937045
51553 937045 978956 1017414 1049852 1073756 1087477 1090634 1083706 1067448 1042658 1010276 971691 928938
51541 928938 884311 839496 795294 752381 711968 675285 642742 614133 589445 568774 551545
51530 551545 536598 523267 511809 502511 494930 488324 482430 477343 472892 468639 464410 460496 457213
51517 457213 454548 452289 450332 448629 446849 444388 441001 437368 434632 433200 432262 430766 428623 426589
51503 426589 425174 424112 422934 421639 420667 420417 420938 422017 423520 425613 428458 431645 434306 436040 437359
51488D37359J449J221K74n34m54l6l03j340k472l376m142m615m636m679n295o020
51472D02401n785m488l259k981l389l820m050m023l512k576j753j372j094n82
51458C59717q2Q8K31P97J612K147K374K793L637M548N169N596O259P505R386J1585
51442D23362J3553J4866J5445J5265J3971J1199P279L354N51q34j253j253j154
51429E14351j315k283m361p080r447j0799j1253j1183j0552r115p043m958l292
51416D21670k057j252r97j106r85l30M28P51Q33J302K251L122L463L394L179K885
51400D36551K623K679L083L380L185K808K929L717M735N634O526P559Q536R315
51386E03260J0341J2281J5163J8266K1028K3825K7527L2467L8025M3235M7586
$$ plain form
51488 437359 438808 440029 440303 439769 439315 439279 438976 437636 435164 431788 427646 423031 418395 413716 408421 402401
51472 402401 396616 392128 388869 385888 382499 378679 374629 370606 367094 364518 362765 361393 360299 359717
51458 359717 359635 359723 359954 360751 362363 364510 366884 369677 373314 377862 383031 388627 394886 402391 411777 423362
51442 423362 436915 451781 467226 482491 496462 507661 514940 518294 518845 518011 516758 515505 514351
51429 514351 513036 510753 506392 499312 489865 479066 467813 456630 446078 436963 429920 424962 421670
51416 421670 419613 418361 417364 416258 415273 414943 415371 416122 416955 418257 420508 423630 427093 430487 433666 436551
51400 436551 439174 441853 444936 448316 451501 454309 457238 460955 465690 471324 477850 485409 493945 503260
51386 503260 513601 525882 541045 559311 580339 604164 631691 664158 702183 745418 793004
51375G93004N1196N4319N6680N7221N4639M8351L9011K7958J6291M603o682j7207
51363A179384k6972l6228m4773n1707n6125n7856n7288n4846n1009m6500m1810
51352F54270l6747l0967k5006k0131j6959j4810j2703j0513q723p470o428n510
51340D58303n058n248n689n800n307m240k695r15N00P72l88k301l772m121l698
51325D10343l273l123l063l093l472m022l984k955j528n91k55L0M64N63j07j308
51309C80626k324k554j836m54J061K253K913K962K478J947K120L177M314M585
51295D01268L962L091K190J008k89r41o79k85o35j635k454k558k086j470r67n49
51279C96971r7K75J85m44j024r64n61n83j031j071l58M56Q14J033J433J567J028
$$ plain form
51375 793004 844200 898519 955199 1012420 1067059 1115410 1154421 1182379 1198670 1203273 1196591 1179384
51363 1179384 1152412 1116184 1071411 1019704 963579 905723 848435 793589 742580 696080 654270
51352 654270 617523 586556 561550 541419 524460 509650 496947 486434 477711 470241 463813 458303
51340 458303 453245 447997 442308 436508 431201 426961 424266 423351 423851 424623 424235 421934 418162 414041 410343
51325 410343 407070 403947 400884 397791 394319 390297 386313 383358 381830 381239 380984 381014 381478 382041 381934 380626
51309 380626 378302 375748 373912 373458 374519 376772 379685 382647 385125 387072 389192 392369 396683 401268
51295 401268 405230 408321 410511 411519 411230 410289 409610 409325 408690 407055 404601 402043 399957 398487 397520 396971
51279 396971 396874 397149 397334 396890 395866 394902 394341 393758 392727 391656 391298 391754 392568 393601 395034 396601 397629
51262C97629L51K52N09M65J90J79J89m79j632k101j267J98J297J653J284K49j008
51245C97958j548q01P17J855J920J132K29j26K42R82J662K143K436K402J948J413
51229D14564J255J340J036J09q94j318j139q19p41q85r17n38Q1K67m06j458j942
51212D07595j528p42j88Ln3j91q5N95J706K708L330L686L730L177K238J746K117
51195D29844K677K538J816J397J681K076J767O46o45j443j720j979k461k670k018
51180D31506p64J52K69J09L37Q54J029M97n51j621k203k039j315n00Q3M10N20
51163D26773M50M15O47J039J356J702K288K757K476J605J040J023O67n61j804
51148D41873k075j786k053k899l303k824k031j262k8J899L680M325L890L209K797
$$ plain form
51262 397629 397980 398232 398741 399206 399396 399575 399764 399285 397653 395552 394285 394483 395780 397433 398717 398966 397958
51245 397958 396410 395609 396326 398181 400101 401233 401462 401336 401578 402560 404222 406365 408801 411203 413151 414564
51229 414564 415819 417159 418195 418304 417410 416092 414953 414134 413393 412508 411591 411053 411134 411401 410995 409537 407595
51212 407595 406067 405325 405137 405140 405087 404896 404811 405406 407112 409820 413150 416836 420566 423743 425981 427727 429844
51195 429844 432521 435059 436875 438272 439953 442029 443796 444442 443797 442354 440634 438655 436194 433524 431506
51180 431506 430742 430894 431163 431272 431609 432463 433492 433989 433438 431817 429614 427575 426260 425760 425843 426253 426773
51163 426773 427223 427638 428285 429324 430680 432382 434670 437427 439903 441508 442548 443571 444238 443677 441873
51148 441873 439798 438012 435959 433060 429757 426933 424902 423640 423612 425511 429191 433516 437406 440615 443412
51133D43412K569K417K371K177J286l78k044k840k786k592k602k419j713p26L08
51118D36440J609L150M074L654K508J956K282K625K569K696L351L917L834L411
51104D78076L100K800K434K389K721K782K330K118K498K414R50r07j506j019j143
51089E00037k455l667l699k987k320j716j155j220k136k947k663j626r50r42r48
51074D68606n92k97m79q10n96L83J657K553K758K497K254K415L115M261N556O665
51058D99946P451P986Q295Q242P829P331P020P006P525Q955J1201J3366J4555
51045F16708J4753J4473J3775J2260R843O900L717L52k845n292o876q111r499
51032F60158j1055j2613j4062j5160j5526j5006j3813j2172j0204q120o183m371
$$ plain form
51133 443412 445981 448398 450769 452946 454232 453854 451810 448970 446184 443592 440990 438571 436858 436132 436440
51118 436440 438049 441199 445273 448927 451435 453391 455673 458298 460867 463563 466914 470831 474665 478076
51104 478076 481176 483976 486410 488799 491520 494302 496632 498750 501248 503662 504612 503705 502199 501180 500037
51089 500037 497582 493915 490216 487229 484909 483193 482038 480818 478682 475735 473072 471446 470496 469554 468606
51074 468606 468014 467717 467238 466428 465832 466215 467872 470425 473183 475680 477934 480349 483464 487725 493281 499946
51058 499946 507397 515383 523678 531920 539749 547080 554100 561106 568631 577586 588787 602153 616708
51045 616708 631461 645934 659709 671969 681812 688712 692429 692781 689936 684644 677768 669657 660158
51032 660158 649103 636490 622428 607268 591742 576736 562923 550751 540547 532427 526244 521873
51020E21873k469n90P69J401J730K335L350M444N247N698O111O870P981R073R985
51005E83808J1002J2230J3169J3402J3371J3800J4617J5122J5088J4880J4632
50994G35121J4092J3263J2312J0909Q600N971M356M004L553J879m56k261l429
50981H07914m732o518q549j0736j3174j5533j7155j7728j7359j6020j3551j0243
50969F56616o934m292k232k31J875L644M593M985N662O996Q389R220R846J0998
50955G09135J2456J3238J3101J2879J3154J3601J4021J4999J6896J9111K1046
50944H73637K3179K6218K9798L2724L4107L3434L0092K3860J5768P609O62m609
50932A126479p956r347r454r241r042q684q449r072j0701j2592j4060j5141j6063
$$ plain form
51020 521873 519404 518814 519583 520984 522714 525049 528399 532843 538090 543788 549899 556769 564750 573823 583808
51005 583808 594810 607040 620209 633611 646982 660782 675399 690521 705609 720489 735121
50994 735121 749213 762476 774788 785697 794297 800268 804624 808628 812181 814060 813604 811343 807914
50981 807914 803182 796664 788115 777379 764205 748672 731517 713789 696430 680410 666859 656616
50969 656616 649682 645390 643158 642927 644802 648446 653039 658024 663686 670682 679071 688291 698137 709135
50955 709135 721591 734829 747930 760809 773963 787564 801585 816584 833480 852591 873637
50944 873637 896816 923034 952832 985556 1019663 1053097 1083189 1107049 1122817 1130426 1131088 1126479
50932 1126479 1118523 1109176 1099722 1090481 1081439 1072755 1064306 1055234 1044533 1031941 1017881 1002740 986677
50919I86677j6717j6960j7014j7209j7576j7875j7765j6867j4990j2503j0219
50908H10982q703p833p157o487o077o216o735p000o587n912n764o102n910m620
50894G19879l155k886l915n027n186m309k832j220LM91N11N76O54L54j12k3O47
50877F94450R37L25m15l35L19O54N65P01J236J527J219R44J529K926M362N314
50861G16258N920O489P025P455P985Q929J0168J1197J1727J1993J2295J2606J2928
50848H42975J3692J5292J7343J8893J9440J9387J9439J9916K0786K1929K3137
50837A052229K4090K4550K4495K4007K3166K2184K1386K0998K1082K1684K2810
50826A302681K4199K5432K6417K7518K9111L1171L3409L5456L6806L6853L5279
$$ plain form
50919 986677 969960 953000 935986 918777 901201 883326 865561 848694 833704 821201 810982
50908 810982 802279 794446 787289 780802 774725 768509 761774 754774 748187 742275 736511 730409 724499 719879
50894 719879 716724 713838 709923 704896 699710 695401 692569 691349 691352 691843 692354 692930 693584 693938 693826 693803 694450
50877 694450 695387 695712 695297 694962 695281 695935 696500 697201 698437 699964 701183 702127 703656 706582 710944 716258
50861 716258 722178 728667 735692 743147 751132 760061 770229 781426 793153 805146 817441 830047 842975
50848 842975 856667 871959 889302 908195 927635 947022 966461 986377 1007163 1029092 1052229
50837 1052229 1076319 1100869 1125364 1149371 1172537 1194721 1216107 1237105 1258187 1279871 1302681
50826 1302681 1326880 1352312 1378729 1406247 1435358 1466529 1499938 1535394 1572200 1609053 1644332
50815A644332L2241K7997K2585J6110R140K388l920j0066j6176k1747k5983k8340
50803A648561k8765k7582k5253k2058j7822j2112m950K887J0542J8141K6694L6710
50791A604993M7252N6800O4840P1958P8413Q3232Q5141Q3834P9969P4213O6930
50780B397575N8526M9547M0301L0869K1509J2789N112j682q271j5566k4270l4327
50768B532112m4821n4765o4032p3012q1462q8181r2180r3664r3521r2133q9130
50757A665211q4154p7457o9760o1862n4392m7607m1313l5184k9299k4256k0529
50746A119398j7811j5139j1852q226m993k304N45M174Q315J2157J5315J8071K0834
50733A138484K3696K6518K9002L0629L0933L0033K8579K6945K4808K1797J8264
$$ plain form
50815 1644332 1676573 1704570 1727155 1743265 1752405 1754793 1750873 1740807 1724631 1702884 1676901 1648561
50803 1648561 1619796 1592214 1566961 1544903 1527081 1514969 1510019 1512906 1523448 1541589 1568283 1604993
50791 1604993 1652245 1709045 1773885 1845843 1924256 2007488 2092629 2176463 2256432 2330645 2397575
50780 2397575 2456101 2505648 2545949 2576818 2598327 2611116 2616228 2614546 2606275 2590709 2566439 2532112
50768 2532112 2487291 2432526 2368494 2295482 2214020 2125839 2033659 1939995 1846474 1754341 1665211
50757 1665211 1581057 1503600 1433840 1371978 1317586 1269979 1228666 1193482 1164183 1139927 1119398
50746 1119398 1101587 1086448 1074596 1066370 1061377 1059073 1059618 1063792 1072107 1084264 1099579 1117650 1138484
50733 1138484 1162180 1188698 1217700 1248329 1279262 1309295 1337874 1364819 1389627 1411424 1429688
50722A429688J5033J2444J0171P949O056M842M096L160J596n33k865m879n817
50709A480941n054k767J3K388M480O981J0031J3032J5501J7511J9112J9870J9330
50696A601369J7580J5059J2089Q887N744K894N07r29o59J508M833Q610J3124J9101
50682A709717K6511L4750M3799N4340O6657Q0216R4468J09413J24980J40537J55296
50671B640684J68726J80162J88497J92726J92409J87337J77284J62717J45458
50662D236000J27862J11267R5563Q0304O5758N2629M0982K9690J7064K023j5226
50651D843916l3594n1887o9190q4802r8128j08722j16048j19341j17977j12171
50641C932056j02998r1659p8967o5551n2178l9695k8695j9404j1629m959P99N513
$$ plain form
50722 1429688 1444721 1457165 1467336 1475285 1481341 1486183 1490279 1493439 1495035 1494502 1491637 1486758 1480941
50709 1480941 1475887 1473120 1473133 1475521 1480001 1486982 1497013 1510045 1525546 1543057 1562169 1582039 1601369
50696 1601369 1618949 1634008 1646097 1654984 1660728 1663622 1664129 1663200 1662541 1664049 1668882 1677492 1690616 1709717
50682 1709717 1736228 1770978 1814777 1869117 1935774 2015990 2110458 2219871 2344851 2485388 2640684
50671 2640684 2809410 2989572 3178069 3370795 3563204 3750541 3927825 4090542 4236000
50662 4236000 4363862 4475129 4570692 4650996 4716754 4769383 4810365 4840055 4857119 4859142 4843916
50651 4843916 4810322 4758435 4689245 4604443 4506315 4397593 4281545 4162204 4044227 3932056
50641 3932056 3829058 3737399 3658432 3592881 3540703 3501008 3472313 3452909 3441280 3436321 3437120 3442633
50629C442633R411J3530J8703K3872K6020K2086J0694p733l1288n6370p8052r2036
50617C301470r6632r2777q2519o8051n1675l5613k1417r705n15O331J1005J3383
50605B873285J2983R481L246m933j4456k5009l6133m7154n7517o6861p4774q0719
50593B491439q4263q5276q3986q0991p7019p2465o7294o1497n5390m9229m3007
50582A731022l6933l1707k7819k4855k2038j9194j6648j4410j2178r962q017o112
50570A501149l567j07L943Q350J3180J8236K3001K7455L2333L8317M5447N3555
50558A761292O2685P2734Q3283R4065J05078J15848J25222J32352J37232J39706
50548B829497J38622J33052J23944J13581J03457R3654Q4310P6625P1818O9767
$$ plain form
50629 3442633 3452044 3465574 3484277 3508149 3534169 3556255 3566949 3559216 3527928 3471558 3393506 3301470
50617 3301470 3204838 3112061 3029542 2961491 2909816 2874203 2852786 2843081 2842566 2848897 2859902 2873285
50605 2873285 2886268 2895749 2898995 2894062 2879606 2854597 2818464 2771310 2713793 2646932 2572158 2491439
50593 2491439 2407176 2321900 2237914 2156923 2079904 2007439 1940145 1878648 1823258 1774029 1731022
50582 1731022 1694089 1662382 1634563 1609708 1587670 1568476 1551828 1537418 1525240 1515278 1507261 1501149
50570 1501149 1497582 1497475 1501418 1509768 1522948 1541184 1564185 1591640 1623973 1662290 1707737 1761292
50558 1761292 1823977 1896711 1979994 2074059 2179137 2294985 2420207 2552559 2689791 2829497
50548 2829497 2968119 3101171 3225115 3338696 3442153 3535807 3620117 3696742 3768560 3838327
50538C838327O9219O8926O8123O6262O2949N8187N2334M5862L9478L4367L1869
50527D435903L2611L6085M1240M7372N4219O1282O7407P1333P2428P0574O5458
50516E055912N6469M3505K7434R483r627k9601m9980p0119q9567j07860j23892
50505D712157j36126j43623j46451j44889j38720j27752j12658r4744p5016n4007
50495C538171l2445j1590P246K3208L5789M4524M8902M8370M2241L0065J2455
50484C786936q611l0751n2513p3469r3084j09978j22672j30749j34992j36478
50474B893639j35914j33695j30057j25020j18493j10758j02542r4397q6245p7875
50464A778643o9736o2708n7038n1923m6304m0016l3936k9101k5695k2838j9495
$$ plain form
50538 3838327 3907546 3976472 4044595 4110857 4173806 4231993 4284327 4330189 4369667 4404034 4435903
50527 4435903 4468514 4504599 4545839 4593211 4647430 4708712 4776119 4847452 4919880 4990454 5055912
50516 5055912 5112381 5155886 5183320 5192803 5183176 5153575 5103595 5033476 4943909 4836049 4712157
50505 4712157 4576031 4432408 4285957 4141068 4002348 3874596 3761938 3667194 3592178 3538171
50495 3538171 3505726 3494136 3501382 3524590 3560379 3604903 3653805 3702175 3744416 3774481 3786936
50484 3786936 3778325 3747574 3695061 3621592 3528508 3418530 3295858 3165109 3030117 2893639
50474 2893639 2757725 2624030 2493973 2368953 2250460 2139702 2037160 1942763 1856518 1778643
50464 1778643 1708907 1646199 1589161 1537238 1490934 1450918 1416982 1387881 1362186 1339348 1319853
50453A319853j5645j2364j0489r428p853n279k438k7K058M019N471N999N942N983
50439A285802O384P082Q172R691J1389J3362J6524K1555K7562L2770L6497L9595
50427A516385M2915M6341M9526N2508N5146N6859N7532N8011N9037O0334O1280
50416B115874O1930O2728O3750O4868O6077O7049O6938O5438O3560O2391O1450
50405B822053N9270N5331N0330M4688L8075L0465K2536J4535N724m571j6032k8012
50393C094392m0368n3044o5359p6287q5080r1209r4106r3528q9916q3963p6049
50382B245483o6446n5703m4491l3201k2114j1683k327N800J2469J7015J8786J7784
50370B081372J4561R590L098m644j3242k2269l1115l8885m4845m8968n1732n3424
$$ plain form
50453 1319853 1304208 1291844 1281355 1271927 1264074 1258795 1256357 1256330 1258388 1262407 1267878 1273877 1279819 1285802
50439 1285802 1292186 1299268 1307440 1317131 1328520 1341882 1358406 1379961 1407523 1440293 1476790 1516385
50427 1516385 1559300 1605641 1655167 1707675 1762821 1819680 1877212 1935223 1994260 2054594 2115874
50416 2115874 2177804 2240532 2304282 2369150 2435227 2502276 2569214 2634652 2698212 2760603 2822053
50405 2822053 2881323 2936654 2986984 3031672 3069747 3100212 3122748 3137283 3143007 3138436 3122404 3094392
50393 3094392 3054024 3000980 2935621 2859334 2774254 2683045 2588939 2495411 2405495 2321532 2245483
50382 2245483 2179037 2123334 2078843 2045642 2023528 2011845 2009518 2015318 2027787 2044802 2063588 2081372
50370 2081372 2095933 2105523 2108621 2103977 2090735 2068466 2037351 1998466 1953621 1904653 1852921 1799497
50358A799497n4027n3755n3250n3001n2809n2106n0669m8790m6783m4566m1873
50347A247868l8731l5503l2434k9447k6516k3888k1651j9366j6616j3763j1669
50336I78284j0542r605q049n862l542j467K08J424K367L515N218P402R753J1831
50322I80935J2860J1963R084N313J980l54j689j847n96J777M558P280R928J2591
50308A053783J5256J7792J9784K0533J9689J7730J5436J3007J0200P211M848L627
50296A218896L138K528J398O4r32j563k570m804q117j1171j2688j2753j2508j2842
50282A146076j3748j4858j5888j6479j6149j4747j2696j0515q255n571k329R67
50270A015808L382M442M781N639P501R537J0654J0755J0504J0253R865R468R682
$$ plain form
50358 1799497 1745470 1691715 1638465 1585464 1532655 1480549 1429880 1381090 1334307 1289741 1247868
50347 1247868 1209137 1173634 1141200 1111753 1085237 1061349 1039698 1020332 1003716 989953 978284
50336 978284 967742 958137 950088 944226 940684 939217 939425 940849 943216 946731 951949 959351 969104 980935
50322 980935 993795 1005758 1014842 1020155 1022135 1021781 1020092 1018245 1017649 1019426 1023984 1031264 1041192 1053783
50308 1053783 1069039 1086831 1106615 1127148 1146837 1164567 1180003 1193010 1203210 1210421 1215269 1218896
50296 1218896 1222034 1224562 1225960 1226024 1225092 1223529 1220959 1216155 1208038 1196867 1184179 1171426 1158918 1146076
50282 1146076 1132328 1117470 1101582 1085103 1068954 1054207 1041511 1030996 1022741 1017170 1014841 1015808
50270 1015808 1019190 1023632 1028413 1034052 1041553 1051090 1061744 1072499 1083003 1093256 1103121 1112589 1122271
50257A122271J0886J2751J4664J6229J7291J7921J8503J9543K1228K3366K5780
50246A320433K8438L1298L4342L7877M2446M8437N5995O5263P6287Q8752J02095
50235A931663J15729J28690J39262J45617J46923J43358J35216J22842J07559
50226C116859R1796P7785O6537N8107N2048M7013M0588L0181J4090q231l6099
50215C550674o7261r8252j25930j48487j64816j73670j74414j68156j57152j43124
50205B129412j26873j09458r2777p8580o7531n9547n4560n2412n2222n2421n1633
50194A331398m9503m6593m3518m0231l6232l1505k6853k3183k0590j8419j6108
50183I78663j3720j1711j0367r548q894q231p689p284o582n186l533k636k747
$$ plain form
50257 1122271 1133157 1145908 1160572 1176801 1194092 1212013 1230516 1250059 1271287 1294653 1320433
50246 1320433 1348871 1380169 1414511 1452388 1494834 1543271 1599266 1664529 1740816 1829568 1931663
50235 1931663 2047392 2176082 2315344 2460961 2607884 2751242 2886458 3009300 3116859
50226 3116859 3208655 3286440 3352977 3411084 3463132 3510145 3550733 3580914 3595004 3586773 3550674
50215 3550674 3483413 3385161 3259231 3110744 2945928 2772258 2597844 2429688 2272536 2129412
50205 2129412 2002539 1893081 1800304 1721724 1654193 1594646 1540086 1487674 1435452 1383031 1331398
50194 1331398 1281895 1235302 1191784 1151553 1115321 1083816 1056963 1033780 1013190 994771 978663
50183 978663 964943 953232 942865 933317 924423 916192 908503 901219 894637 889451 885918 883282 880535
50170H80535k860j970l82Q28J335J841K943M481O051P475Q562Q989Q816Q690R233
50155I44567J0438J1965J3748J5907J8238K0138K1067K0904J9910J8502J7064
50144A132448J5817J4815J4108J3764J3722J3749J3859J4622J6768K0411K4895
50133A308978K9505L4152L9250M5102N1628N8583O5846P3580Q2426R3424J07455
50122A989929J24594J44244J65833J88942K12659K35202K54436K68363K75049
50113C859251K72976K62340K45817K27222K09355J93471J80149J69488J60123
50104E780192J49066J32973J09240P6084L2914j8476p3726j27878j77499k20732
50094E662158k56049k81919k97610l03662l01572k93268k80493k64216k44744
$$ plain form
50170 880535 877675 875705 875323 876151 877486 879327 882270 886751 892802 900277 908839 917828 926644 935334 944567
50155 944567 955005 966970 980718 996625 1014863 1035001 1056068 1076972 1096882 1115384 1132448
50144 1132448 1148265 1163080 1177188 1190952 1204674 1218423 1232282 1246904 1263672 1284083 1308978
50133 1308978 1338483 1372635 1411885 1456987 1508615 1567198 1633044 1706624 1789050 1882474 1989929
50122 1989929 2114523 2258767 2424600 2613542 2826201 3061403 3315839 3584202 3859251
50113 3859251 4132227 4394567 4640384 4867606 5076961 5270432 5450581 5620069 5780192
50104 5780192 5929258 6062231 6171471 6247555 6280469 6261993 6188267 6060389 5882890 5662158
50094 5662158 5406109 5124190 4826580 4522918 4221346 3928078 3647585 3383369 3138625
50085C138625k22819k00173j78518j58374j39521j22281j07489r5316q4966p5682
50075A753486o7397o0286n4241m9037m4523m0503l6807l3571l1036k9067k7259
50064A279759k5539k4175k3210k2394k1658k1155k0772k0182j9414j8783j8143
50053A044334j6966j5248j3678j2515j1069q800o261m336l035j737k17J224K456
50040I54152L624M674N322N562N738O133O841P898R106R848R620Q782Q261Q382
50026A053943Q473P839O778O200O492P075P148O634O279O850Q303R896J1110J2307
50012A165327J4267J7180K0445K3549K6871L1370L7568M5152N3675O3372P4974
50001A573750Q8721J04029J20186J36939J53875J69359J80733J85817J84023J75991
$$ plain form
50085 3138625 2915806 2715633 2537115 2378741 2239220 2116939 2009450 1914134 1829168 1753486
50075 1753486 1686089 1625803 1571562 1522525 1478002 1437499 1400692 1367121 1336085 1307018 1279759
50064 1279759 1254220 1230045 1206835 1184441 1162783 1141628 1120856 1100674 1081260 1062477 1044334
50053 1044334 1027368 1012120 998442 985927 974858 966058 959797 955461 952426 950689 950472 951696 954152
50040 954152 957776 962450 967772 973334 979072 985205 992046 999944 1009050 1018898 1028518 1037300 1045561 1053943
50026 1053943 1062416 1070255 1077033 1083233 1089725 1096800 1103948 1110582 1116861 1123711 1132014 1141910 1153020 1165327
50012 1165327 1179594 1196774 1217219 1240768 1267639 1299009 1336577 1381729 1435404 1498776 1573750
50001 1573750 1662471 1766500 1886686 2023625 2177500 2346859 2527592 2713409 2897432 3073423
49991C073423J62682J45214J25385J05782Q9039P6637O8099O1083N2437L9426
49981C999207K0232o075l9286p7441j16952j53766j84567k07077k19938k22912
49971B791425k17201k05102j89117j71256j52763j34377j16830j01088q7803p6624
49961A339264o6556n7153m8863m1949l5785k9648k3699j8514j4093j0023o353
49950I86628l541j602n6J283K009J713L30j927m508o477p294p582q451j0083j1732
49935I28710j3142j4932j7282j9234j9935j9752j9541j9310j8459j6849j4877
49924G35397j2780j0554q415o679n306m099l150k569j919o65Q94J836J865J679
49910F85535J929K524L193M192N862P859R323R818R782J0019J0957J2365J3620
$$ plain form
49991 3073423 3236105 3381319 3506704 3612486 3701525 3778162 3846261 3907344 3959781 3999207
49981 3999207 4019439 4013364 3974078 3896637 3779685 3625919 3441352 3234275 3014337 2791425
49971 2791425 2574224 2369122 2180005 2008749 1855986 1721609 1604779 1503691 1415888 1339264
49961 1339264 1272708 1215555 1166692 1124743 1088958 1059310 1035611 1017097 1003004 992981 986628
49950 986628 983087 981485 981429 982712 984721 986434 986764 984837 980329 973852 966558 958976 950525 940442 928710
49935 928710 915568 900636 883354 864120 844185 824433 804892 785582 767123 750274 735397
49924 735397 722617 712063 703648 696969 691663 687564 684414 681845 679926 679261 680155 681991 683856 685535
49910 685535 687464 689988 693181 697373 703235 711094 720417 730235 740017 750036 760993 773358 786978
49897G86978J4176J3791J2417J0049O891L533O41j614l675n979q421j0502j1916
49884H06369j2805j3507j4156j4694j5107j5492j5738j5365j4011j2059j0389
49873F53046r381q538p267n629m021k535j167k15O7J10O69J842L101M265N761
49858F30108P777R809J1370J2644J4013J5462J6760J7826J8446J8031J6126J3119
49846H01491J0049P777O457N520M008J189k710o611r641j1808j3470j4566j4869
$$ plain form
49897 786978 801154 814945 827362 837411 844302 847835 848476 846862 843187 837208 828787 818285 806369
49884 806369 793564 780057 765901 751207 736100 720608 704870 689505 675494 663435 653046
49873 653046 643665 635127 627860 622231 618210 615675 614508 614293 614360 614470 615139 616981 620082 624347 630108
49858 630108 637885 647694 659064 671708 685721 701183 717943 735769 754215 772246 788372 801491
49846 801491 811540 819317 825774 831294 835302 836491 833781 827170 817529 805721 792251 777685 762816
$$ [...]
##END NTUPLES=NMR SPECTRUM
##END=
