
##TITLE=AC1345_GUAAH12163_7155106_2wqzkNcoBV
##JCAMPDX= 6.0         $$ Bruker NMR JCAMP-DX V2.0
##DATA TYPE= NMR SPECTRUM
##DATA CLASS= NTUPLES
##ORIGIN= BRUKER
##OWNER= Administrator
$$ 1.72 TOPSPIN		Version 2.1
$$ 2012-12-01 04:05:22.705 -0500  Administrator@X
$$ Compression mode = diff/dup
##.OBSERVE FREQUENCY= 400.02188249412
##.OBSERVE NUCLEUS= ^1H
##.ACQUISITION MODE= SIMULTANEOUS (DQD)
##.ACQUISITION SCHEME= undefined
##.AVERAGES= 64
##.DIGITISER RES= 22
##SPECTROMETER/DATA SYSTEM= spect
##.PULSE SEQUENCE= noesygpps1d.comp
##.SOLVENT NAME= COFFEE_meoh
##.SHIFT REFERENCE= INTERNAL, COFFEE_meoh, 1, 14.96099
##AUDIT TRAIL= $$ (NUMBER, WHEN, WHO, WHERE, PROCESS, VERSION, WHAT)
$$ ##TITLE= Audit trail, TOPSPIN		Version 2.1
$$ ##JCAMPDX= 5.01
$$ ##ORIGIN= Bruker BioSpin GmbH
$$ ##OWNER= Administrator
$$ $$ E:\/data/COFFEE/nmr/AC1345_GUAAH12163_7155106_2wqzkNcoBV/12/pdata/1/auditp.txt
$$ ##AUDIT TRAIL=  $$ (NUMBER, WHEN, WHO, WHERE, PROCESS, VERSION, WHAT)
(   1,<2012-12-01 04:05:16.674 -0500>,<Administrator>,<X>,<go>,<TOPSPIN 2.1>,
      <created by zg
	started at 2012-12-01 03:53:48.796 -0500,
	POWCHK enabled, PULCHK disabled,
       configuration hash MD5:
       86 BA 57 50 F2 9D 5C 9B 26 00 A9 28 5F 66 2E 89
       data hash MD5: 64K
       5C AF 92 44 CB 51 F4 80 28 C7 E0 3E 59 C5 59 8B>)
(   2,<2012-12-01 04:05:19.861 -0500>,<Administrator>,<X>,<proc1d>,<TOPSPIN 2.1>,
      <Start of raw data processing
       efp LB = 0.3 FT_mod = 6 PKNL = 1 PHC0 = 0 PHC1 = 0 SI = 128K 
       data hash MD5: 128K
       89 07 EB 09 59 36 80 36 DE B5 D1 A3 52 D7 08 A9>)
(   3,<2012-12-01 04:05:20.939 -0500>,<Administrator>,<X>,<proc1d>,<TOPSPIN 2.1>,
      <pk PHC0 = -82.66663 PHC1 = 0 
       data hash MD5: 128K
       45 3A AB 76 88 9A 3A 84 64 EC 93 F3 02 7F 06 C1>)
(   4,<2012-12-01 04:05:21.642 -0500>,<Administrator>,<X>,<proc1d>,<TOPSPIN 2.1>,
      <abs ABSG = 1 
       data hash MD5: 128K
       99 F1 F8 C0 D4 B6 A9 2E B6 75 E6 C4 FD 51 FB 7F>)
(   5,<2012-12-01 04:05:21.846 -0500>,<Administrator>,<X>,<proc1d>,<TOPSPIN 2.1>,
      <abs ABSG = 2 
       data hash MD5: 128K
       D0 37 A1 56 24 01 C5 9A 97 1E FB 9F 99 F0 74 42>)
(   6,<2012-12-01 04:05:22.033 -0500>,<Administrator>,<X>,<proc1d>,<TOPSPIN 2.1>,
      <abs ABSG = 3 
       data hash MD5: 128K
       C0 39 A6 2A AC 41 9F 63 80 80 9B 8C A6 10 10 51>)
(   7,<2012-12-01 04:05:22.221 -0500>,<Administrator>,<X>,<proc1d>,<TOPSPIN 2.1>,
      <abs ABSG = 4 
       data hash MD5: 128K
       00 97 4D AB A0 E1 F2 FB 90 8A C1 8E C4 93 DE 70>)
(   8,<2012-12-01 04:05:22.377 -0500>,<Administrator>,<X>,<proc1d>,<TOPSPIN 2.1>,
      <abs ABSG = 5 
       data hash MD5: 128K
       9D 9C 95 C4 2D 51 A6 CB D7 12 87 1D 83 BA 92 F6>)
$$ ##END=
$$ 
$$ $$ hash MD5
$$ $$ DD 17 DE E4 65 6D 6E CB 78 1D E6 9C E3 0A 34 97
##$RELAX= 
##$RELAX= 
##$RELAX= 
##$RELAX= 
##$RELAX= 
##$RELAX= 
##$RELAX= 
##$RELAX= 
$$ Bruker specific parameters
$$ --------------------------
##$DU= <E:\>
##$EXPNO= 12
$$ [...]
##$TP07= 0
##$TPNAME0= <>
##$TPNAME1= <>
##$TPNAME2= <>
##$TPNAME3= <>
##$TPNAME4= <>
##$TPNAME5= <>
##$TPNAME6= <>
##$TPNAME7= <>
##$TPOAL= (0..7)
0.5 0.5 0.5 0.5 0.5 0.5 0.5 0.5
##$TPOFFS= (0..7)
0 0 0 0 0 0 0 0
##$TUNHIN= 0
##$TUNHOUT= 0
##$TUNXOUT= 0
##$USERA1= <user>
##$USERA2= <user>
##$USERA3= <user>
##$USERA4= <user>
##$USERA5= <user>
##$V9= 5
##$VALIST= <valist>
##$VCLIST= <CCCCCCCCCCCCCCC>
##$VD= 0
##$VDLIST= <DDDDDDDDDDDDDDD>
##$VPLIST= <PPPPPPPPPPPPPPP>
##$VTLIST= <TTTTTTTTTTTTTTT>
##$WBST= 1024
##$WBSW= 4
##$XGAIN= (0..3)
0 0 0 0
##$XL= 0
##$YL= 0
##$YMAX_a= 6089227
##$YMIN_a= -11863536
##$ZGOPTNS= <>
##$ZL1= 120
##$ZL2= 120
##$ZL3= 120
##$ZL4= 120
##$ABSF1= 14.96099
##$ABSF2= -5.597192
##$ABSG= 5
##$ABSL= 3
##$ALPHA= 0
##$AQORDER= 0
##$ASSFAC= 0
##$ASSFACI= 0
##$ASSFACX= 0
##$ASSWID= 0
##$AUNMP= <proc_prof1d_extract.lims>
##$AXLEFT= 0
##$AXNAME= <>
##$AXNUC= <1H>
##$AXRIGHT= 0
##$AXTYPE= 0
##$AXUNIT= <>
##$AZFE= 0.1
##$AZFW= 0.1
##$BCFW= 0
##$BC_mod= 0
##$BYTORDP= 0
##$COROFFS= 0
##$CY= 15
##$DATMOD= 1
##$DC= 0
##$DFILT= <>
##$DTYPP= 0
##$F1P= 0
##$F2P= 0
##$FCOR= 0.5
##$FTSIZE= 131072
##$FT_mod= 6
##$GAMMA= 0
##$GB= 0
##$INTBC= 1
##$INTSCL= 1
##$ISEN= 128
##$LB= 0.3
##$LEV0= 0
##$LPBIN= 0
##$MAXI= 10000
##$MC2= 0
##$MEAN= 0
##$ME_mod= 0
##$MI= 0
##$NCOEF= 0
##$NC_proc= -2
##$NLEV= 6
##$NOISF1= 0
##$NOISF2= 0
##$NSP= 0
##$NTH_PI= 0
##$NZP= 0
##$OFFSET= 14.96099
##$PC= 1
##$PHC0= -82.66663
##$PHC1= 0
##$PH_mod= 1
##$PKNL= yes
##$PPARMOD= 0
##$PPDIAG= 0
##$PPIPTYP= 0
##$PPMPNUM= 2147483647
##$PPRESOL= 1
##$PSCAL= 4
##$PSIGN= 0
##$PYNMP= <proc.py>
##$REVERSE= no
##$SF= 400.020009640165
##$SI= 131072
##$SIGF1= 0
##$SIGF2= 0
##$SINO= 400
##$SIOLD= 131072
##$SPECTYP= <>
##$SREGLST= <1H.CDCl3>
##$SSB= 0
##$STSI= 131072
##$STSR= 0
##$SW_p= 8223.68421052631
##$SYMM= 0
##$S_DEV= 0
##$TDeff= 65536
##$TDoff= 0
##$TI= <>
##$TILT= no
##$TM1= 0
##$TM2= 0
##$TOPLEV= 0
##$USERP1= <user>
##$USERP2= <user>
##$USERP3= <user>
##$USERP4= <user>
##$USERP5= <user>
##$WDW= 1
##$XDIM= 131072
##$YMAX_p= 443856364
##$YMIN_p= -11753
##$CURPLOT= <Network HP LaserJet P1505>
##$CURPRIN= <$Network HP LaserJet P1505>
##$DFORMAT= <normdp>
##$LAYOUT= <+/1D_H.xwp>
##$LFORMAT= <normlp>
##$PFORMAT= <normpl>
##$SURQMSG= 1
$$ End of Bruker specific parameters
$$ ---------------------------------
##NTUPLES= NMR SPECTRUM
##VAR_NAME=  FREQUENCY,     SPECTRUM/REAL,   SPECTRUM/IMAG
##SYMBOL=    X,             R,               I
##VAR_TYPE=  INDEPENDENT,   DEPENDENT,       DEPENDENT
##VAR_FORM=  AFFN,          ASDF,            ASDF
##VAR_DIM=   131072,        131072,          131072
##UNITS=     HZ,            ARBITRARY UNITS, ARBITRARY UNITS
##FACTOR=    0.0627417313425164, 1,          1
##FIRST=     8223.62146879497, 1099,         -55061
##LAST=      0,             2090,            -56178
##MIN=       0,             -11753,          0
##MAX=       8223.62146879497, 443856364,    0
$$ Real data points
##PAGE= N=1
##DATA TABLE= (X++(R..R)), XYDATA
$$ [...]
$$ plain form
63949 846014 910186 984398 1069848 1166960 1275973 1397606 1532591 1680693 1840646 2010872
63939 2010872 2189788 2375424 2565179 2756106 2945108 3128628 3302279 3461060 3600226
63930 3600226 3716236 3807185 3872382 3911437 3923606 3907870 3863553 3790962 3691797 3569192 3427329
63919 3427329 3270785 3104085 2931555 2757078 2583555 2412667 2245427 2083044 1927258
63910 1927258 1780060 1643376 1518836 1407375 1308848 1222216 1146197 1079672 1021623 971121
63900 971121 927560 890592 859623 833578 811343 792168 775362 759874 744645 729362 714414
63889 714414 700117 686406 673382 661614 651488 642586 634270 626788 621267 618532 618404 620354 624413
63876 624413 631012 640244 651824 665740 682349 701709 723256 746497 771677 799309 829190 860300
$$ packed form
63949H46014O4172P4212Q5450R7112J09013J21633J34985J48102J59953J70226
63939B010872J78916J85636J89755J90927J89002J83520J73651J58781J39166
63930C600226J16010R0949O5197L9055J2169j5736m4317p2591r9165j22605j41863
63919C427329j56544j66700j72530j74477j73523j70888j67240j62383j55786
63910A927258j47198j36684j24540j11461r8527q6632p6019o6525n8049n0502
63900I71121m3561l6968l0969k6045k2235j9175j6806j5488j5229j5283j4948
63889G14414j4297j3711j3024j1768j0126q902q316p482n521k735j28J950M059
63876F24413O599R232J1580J3916J6609J9360K1547K3241K5180K7632K9881L1110
$$ plain form
63864 860300 891685 923051 954437 985651 1016221 1045577 1073039 1097799 1119257 1137343 1152236
63853 1152236 1163795 1171468 1174780 1173696 1168457 1159271 1146263 1129488 1108882 1084390 1056374 1025743
63841 1025743 993380 959528 924043 887260 850158 813408 776651 739240 701649 665572 632377
63830 632377 601851 572854 544968 518922 495334 473627 452667 432314 413752 398107 385002
63819 385002 372845 360443 348066 336862 327527 319734 312710 306033 299796 294254 289468 285211 281090
63806 281090 276800 272425 268413 265189 262766 260788 258865 256737 254232 251288 248091 245023 242395 240299
63792 240299 238715 237515 236244 234141 230728 226413 222317 219350 217538 216269 215048 213886 213036 212562 212242
63777 212242 211811 211242 210832 211017 212018 213544 214893 215473 215231 214568 213923 213538 213488 213617 213447 212535 211090 209927
$$ packed form
63864H60300L1385L1366L1386L1214L0570K9356K7462K4760K1458J8086J4893
63853A152236J1559P673L312j084n239r186j3008j6775k0606k4492k8016l0631
63841A025743l2363l3852l5485l6783l7102l6750l6757l7411l7591l6077l3195
63830F32377l0526k8997k7886k6046k3588k1707k0960k0353j8562j5645j3105
63819C85002j2157j2402j2377j1204r335p793p024o677o237n542m786m257m121
63806B81090m290m375m012l224k423j978j923k128k505k944l197l068k628k096
63792B40299j584j200j271k103l413m315m096k967j812j269j221j162q50m74l20
63777B12242m31n69m10J85J001J526J349N80k42o63o45l85n0J29j70r12j445j163
$$ plain form
63759 209927 209552 209627 209640 209729 210238 210711 210218 208803 207776 208052 208844 208686 207367 206077 205894 206859 208578 210911
63741 210911 213731 216578 218933 220583 221494 221743 221806 222455 223956 225674 226930 228017 229881 232925 236597
63726 236597 240145 243291 246109 248744 251494 254801 258857 263322 267614 271365 274512 277127 279300 281014
63712 281014 282017 281922 280566 278150 275036 271639 268578 266436 265069 263491 261004 258279 256760 256946 257867
63697 257867 258444 258819 259913 262090 264825 267529 270136 272810 275616 278672 282256 286402 290604 294231 297113
63682 297113 299494 301492 302925 303676 303883 303667 302902 301529 299932 298794 298526 298908 299322 299303 299010 299146 300261
63665 300261 301987 303236 303369 302912 302680 302368 300696 297069 292487 288337 284801 281024 276589 272115 268415
63650 268415 265697 263701 262094 260504 258673 256855 255701 255519 256024 257103 259266 262810 266937 270415 272989
$$ packed form
63759B09927l75P5J3Q9N09M73m93j415j027K76P92j58j319j290j83R65J719K333
63741B10911K820K847K355J650R11K49O3O49J501J718J256J087J864L044L672
63726B36597L548L146K818K635K750L307M056M465M292L751L147K615K173J714
63712B81014J003r5j356k416l114l397l061k142j367j578k487k725j519J86R21
63697B57867N77L75J094K177K735K704K607K674K806L056L584M146M202L627K882
63682B97113K381J998J433P51K07k16p65j373j597j138k68L82M14j9k93J36J115
63665C00261J726J249J33m57k32l12j672l627m582m150l536l777m435m474l700
63650B68415k718j996j607j590j831j818j154j82N05J079K163L544M127L478K574
$$ plain form
63635 272989 275490 278529 281805 284850 287810 291050 294518 298014 301896 306967 313686 321860 331135 341424
63621 341424 352695 364603 376524 388019 399245 411040 424634 441084 460687 482828 506519
63610 506519 531286 557564 586067 616721 648355 679497 709160 736582 760493 779241 791851
63599 791851 798623 800525 798311 792465 783803 773718 763734 754751 746554 737991 727769 715273 700514
63586 700514 683469 663935 642125 618931 595209 571233 547289 524457 504107 486711 471736
63575 471736 458737 447915 439460 432926 427646 423456 420706 419794 420892 423872 428299 433701 440029 447626
63561 447626 456602 466506 476810 487419 498526 510347 523306 538099 555060 573693 593387 614558
63549 614558 638686 667236 700902 739606 782402 826930 869321 905080 930371 943091 943597 934689
$$ packed form
63635B72989K501L039L276L045K960L240L468L496L882N071O719Q174R275J0289
63621C41424J1271J1908J1921J1495J1226J1795J3594J6450J9603K2141K3691
63610E06519K4767K6278K8503L0654L1634L1142K9663K7422K3911J8748J2610
63599G91851O772J902k214n846q662j0085r984q983q197q563j0222j2496j4759
63586G00514j7045j9534k1810k3194k3722k3976k3944k2832k0350j7396j4975
63575D71736j2999j0822q455o534n280m190k750r12J098K980M427N402O328P597
63561D47626Q976R904J0304J0609J1107J1821J2959J4793J6961J8633J9694K1171
63549F14558K4128K8550L3666L8704M2796M4528M2391L5759K5291J2720N06q908
$$ plain form
63537 934689 920291 903585 886348 869820 855388 843975 835305 828350 822150 815619 806960 794270
63525 794270 776889 755584 731277 704263 674878 644197 613480 583380 554245 526872 502196
63514 502196 480216 459898 440423 422104 405782 391568 378652 366273 354553 344188 335562 328371
63502 328371 322121 316713 312394 309227 306851 304795 302837 301011 299473 298496 298351 298929 299595 299666 299009 297992
63486 297992 296919 295868 295094 295187 296554 298891 301459 303915 306703 310553 315614 321116 325977 329783 333008
63471 333008 336076 338366 338573 336166 332086 327768 323749 319601 314988 310266 305985 302315 299179 296677
63457 296677 295017 294106 293481 292754 292016 291716 292196 293456 295414 298253 302365 307920 314695 322395 331012 340758
63441 340758 351832 364445 378984 395964 415929 439584 467825 500982 537716 574771 608174
$$ packed form
63537I34689j4398j6706j7237j6528j4432j1413q670o955o200o531q659j2690
63525G94270j7381k1305k4307k7014k9385l0681l0717l0100k9135k7373k4676
63514E02196k1980k0318j9475j8319j6322j4214j2916j2379j1720j0365q626p191
63502C28371o250n408m319l167k376k056j958j826j538r77j45N78O66P1o57j017
63486B97992j073j051p74R3J367K337K568K456K788L850N061N502M861L806L225
63471C33008L068K290K07k407m080m318m019m148m613m722m281l670l136k502
63457B96677j660r11o25p27p38l00M80J260J958K839M112N555O775P700Q617R746
63441C40758J1074J2613J4539J6980J9965K3655K8241L3157L6734L7055L3403
$$ plain form
63430 608174 634890 653682 664902 669871 670377 668446 666282 666091 669608 677670 690396 707846 730373
63417 730373 758215 790933 827390 866077 905148 942175 974262 998799 1014394 1021262 1020826 1014895
63405 1014895 1005042 992609 979011 965687 953522 942349 931050 918088 902065 882115 858096
63394 858096 830444 799823 766978 732896 698810 665840 634729 605960 579792 555988 533926
63383 533926 513443 495375 480762 469545 460555 452857 446614 442461 440531 440455 442012 445369 450704 457780
63369 457780 465914 474358 482982 492660 504814 520341 539103 560435 583883 609348 636926 666895
63357 666895 699583 734880 771972 809749 847223 883254 916178 944170 965872 980430 987294 986679
63345 986679 980212 970388 959126 947187 935008 923397 912947 903057 891930 877494 858337 834244
$$ packed form
63430F08174K6716J8792J1220M969N06j931k164j91L517Q062J2726J7450K2527
63417G30373K7842L2718L6457L8687L9071L7027L2087K4537J5595O868m36n931
63405A014895r853j2433j3598j3324j2165j1173j1299j2962j6023j9950k4019
63394H58096k7652l0621l2845l4082l4086l2970l1111k8769k6168k3804k2062
63383E33926k0483j8068j4613j1217q990p698o243m153j930p6J557L357N335P076
63369D57780Q134Q444Q624R678J2154J5527J8762K1332K3448K5465K7578K9969
63357F66895L2688L5297L7092L7777L7474L6031L2924K7992K1702J4558O864o15
63345I86679o467r824j1262j1939j2179j1611j0450r890j1127j4436j9157k4093
$$ plain form
63333 834244 806209 775759 744011 711547 679161 648192 619760 594151 571453 552347 537677
63322 537677 527529 521455 519257 520400 522467 521358 513934 500166 482302 462574 442430 423282 406568
63309 406568 392696 380740 369683 359485 350572 342840 335722 328910 322440 316292 310602 306098 303529
63296 303529 302432 301208 298864 296134 294279 293220 291639 288752 285187 282013 279631 277996 277212 277320 277764
63281 277764 277698 276849 275710 274867 274439 274165 273774 273215 272697 272576 273089 274166 275511 276814 277819 278381 278584
63264 278584 278722 279026 279585 280613 282475 285193 288143 290633 292691 294912 297653 300768 304025 307297 310345
63249 310345 312974 315622 319261 324400 330465 336497 342217 348143 354900 362764 371723 381708 392720 404872
63235 404872 418242 432632 447680 463333 479967 497827 516520 535346 553945 572339 590449
$$ packed form
63333H34244k8035l0450l1748l2464l2386l0969k8432k5609k2698j9106j4670
63322E37677j0148o074k198J143K067j109p424j3768j7864j9728k0144j9148j6714
63309D06568j3872j1956j1057j0198q913p732p118o812o470o148n690m504k569
63296C03529j097j224k344k730j855j059j581k887l565l174k382j635p84J08M44
63281B77764o6q49j139q43m28k74l91n59n18j21N13J077J345J303J005N62K03
63264B78584J38L04N59J028J862K718K950K490K058K221K741L115L257L272L048
63249C10345K629K648L639N139O065O032N720N926O757P864Q959R985J1012J2152
63235D04872J3370J4390J5048J5653J6634J7860J8693J8826J8599J8394J8110
$$ plain form
63224 590449 607970 624770 641161 657630 674438 691506 708580 725430 741970 758238 774217
63213 774217 789684 804157 816941 827238 834391 838057 838008 833790 824820 811033 793308 773151 752001
63200 752001 730802 709997 689725 670154 651703 634870 619954 607219 597283 590857 587925 587619
63188 587619 589227 592929 599210 608018 618989 632117 647498 664582 682392 700528 719358 739116
63176 739116 759367 779500 799263 818548 837079 854637 871414 887857 904209 920144 934650
63165 934650 946381 954415 958633 959079 955130 945826 930963 911300 887682 860641 830974 799904 768215
63152 768215 735866 702953 670528 639883 611499 585330 561726 541241 523661 508015 493658
63141 493658 480810 469934 461077 453915 447949 442463 436665 430232 423643 417877 413786 411531 410449 409634
$$ packed form
63224E90449J7521J6800J6391J6469J6808J7068J7074J6850J6540J6268J5979
63213G74217J5467J4473J2784J0297P153L666m9m218q970j3787j7725k0157k1150
63200G52001k1199k0805k0272j9571j8451j6833j4916j2735r936o426k932l06
63188E87619J608L702O281Q808J0971J3128J5381J7084J7810J8136J8830J9758
63176G39116K0251K0133J9763J9285J8531J7558J6777J6443J6352J5935J4506
63165I34650J1731Q034M218M46l949r304j4863j9663k3618k7041k9667l1070l1689
63152G68215l2349l2913l2425l0645k8384k6169k3604k0485j7580j5646j4357
63141D93658j2848j0876q857p162n966n486n798o433o589n766m091k255j082q15
$$ plain form
63127 409634 408959 409250 411059 413592 415547 416851 418696 421724 425183 428315 431605 435774 440169 443354 445179
63112 445179 447180 450674 455275 459664 463081 465511 466991 467562 467743 468364 469755 471485 472938 473806 474010
63097 474010 473604 472921 472375 471852 470649 468387 465723 463690 462495 461484 460306 459516 459797 461007 462434 463765
63081 463765 465398 467790 470906 474434 478291 482704 487845 493601 499747 506209 513047 520250 527744 535644
63067 535644 544313 554034 564699 576024 587961 600750 614654 629814 646290 663968 682545 701993
63055 701993 723075 746973 774262 804613 837629 873479 912288 953305 995231 1037259 1079313
63044 1079313 1121380 1163142 1204332 1245005 1285278 1325132 1364610 1403964 1443493 1483443 1524093
63033 1524093 1565569 1607358 1648185 1686509 1720964 1750288 1773270 1789061 1797320 1797763 1789713 1772479
$$ packed form
63127D09634o75K91J809K533J955J304J845L028L459L132L290M169M395L185J825
63112D45179K001L494M601M389L417K430J480N71J81O21J391J730J453Q68K04
63097D74010m06o83n46n23j203k262k664k033j195j011j178p90K81J210J427J331
63081D63765J633K392L116L528L857M413N141N756O146O462O838P203P494P900
63067E35644Q669R721J0665J1325J1937J2789J3904J5160J6476J7678J8577J9448
63055G01993K1082K3898K7289L0351L3016L5850L8809M1017M1926M2028M2054
63044A079313M2067M1762M1190M0673M0273L9854L9478L9354L9529L9950M0650
63033A524093M1476M1789M0827L8324L4455K9324K2982J5791Q259M43q050j7234
$$ plain form
63021 1772479 1746079 1711398 1669709 1622444 1571378 1518597 1465996 1414899 1366305 1321336 1281286
63010 1281286 1247245 1219735 1198599 1183235 1173152 1168474 1169882 1177908 1192342 1212374 1237129 1265869
62998 1265869 1297831 1332201 1368314 1405564 1443091 1479906 1515574 1550460 1585009 1619056 1652200
62987 1652200 1684559 1716442 1747254 1775330 1799122 1818003 1831513 1838290 1836467 1825093 1804673 1776269
62975 1776269 1740425 1697134 1646579 1589784 1528675 1465532 1402225 1339904 1279405 1221761 1168016
62964 1168016 1118649 1073481 1032120 994223 959397 927302 897969 871623 847957 825904 804397
62953 804397 783168 762633 743243 725182 708390 692481 676840 661223 646208 632649 620656
62942 620656 609464 598321 587176 576417 566348 557096 548780 541454 535033 529417 524568 520370 516612
$$ packed form
63021A772479k6400l4681m1689m7265n1066n2781n2601n1097m8594m4969m0050
63010A281286l4041k7510k1136j5364j0083m678J408Q026J4434K0032K4755K8740
62998A265869L1962L4370L6113L7250L7527L6815L5668L4886L4549L4047L3144
62987A652200L2359L1883L0812K8076K3792J8881J3510O777j823j1374k0420k8404
62975A776269l5844m3291n0555n6795o1109o3143o3307o2321o0499n7644n3745
62964A168016m9367m5168m1361l7897l4826l2095k9333k6346k3666k2053k1507
62953H04397k1229k0535j9390j8061j6792j5909j5641j5617j5015j3559j1993
62942F20656j1192j1143j1145j0759j0069r252q316p326o421n616m849m198l758
$$ plain form
62929 516612 513243 510413 508089 505895 503623 501684 500626 500308 499973 499160 498170 497553 497505 497862 498321 498482 498031
62912 498031 497080 496042 494880 492902 489662 485804 482486 480111 478145 476124 474239 472786 471548 470068
62898 470068 468234 466372 464983 464573 465469 467495 469953 472098 473560 474230 474015 472945 471357 469766 468644
62883 468644 468386 469187 470701 472096 472846 473368 474539 476649 479163 481434 483260 484641 485353 485050 483662 481530
62867 481530 479169 476926 474816 472664 470434 468370 466771 465700 465006 464563 464370 464514 465086 466054 467132 468014
62851 468014 468799 469964 471670 473421 474719 475754 476910 477841 477710 476421 474976 474353 474596 475213 475902 476366
62835 476366 475923 474054 471317 469045 467959 467467 466566 465115 463884 463455 463477 463181 462432 461978 462597 464256 466274
62818 466274 468102 469688 471182 472677 474303 476223 478412 480692 483172 486372 490695 495895 501279 506345
$$ packed form
62929E16612l369k830k324k194k272j939j058l18l35q13r90o17m8L57M59J61m51
62912D98031r51j038j162j978l240l858l318k375j966k021j885j453j238j480
62898D70068j834j862j389m10Q96K026K458K145J462O70k15j070j588j591j122
62883D68644k58Q01J514J395P50N22J171K110K514K271J826J381P12l03j388k132
62867D81530k361k243k110k152k230k064j599j071o94m43j93J44N72R68J078Q82
62851D68014P85J165J706J751J298J035J156R31j31j289j445o23K43O17O89M64
62835D76366m43j869k737k272j086m92r01j451j231m29K2k96p49m54O19J659K018
62818D66274J828J586J494J495J626J920K189K280K480L200M323N200N384N066
$$ plain form
62804 506345 511084 515807 520882 526575 532929 539746 546715 553551 560093 566464 573219 581055 590230 600502
62790 600502 611842 625010 641114 660686 683440 708873 736896 767959 802854 842425 887189
62779 887189 937079 991634 1050415 1113165 1179592 1249100 1320616 1392500 1462714 1529310 1590739
62768 1590739 1645554 1692016 1728431 1753880 1768218 1771218 1762125 1740427 1706889 1663540 1612694 1556188
62756 1556188 1495451 1431923 1367144 1302411 1238411 1175324 1113458 1053784 997611 945671 897772
62745 897772 853516 813002 776473 743550 713437 685907 661486 640480 622317 606201 591919
62734 591919 579532 568576 558267 548448 539751 532712 527213 522940 519873 518027 517082 516695 516990 518404
62720 518404 521182 525234 530336 536204 542566 549464 557401 566865 577820 589991 603558 619146 637144
$$ packed form
62804E06345M739M723N075N693O354O817O969O836O542O371O755P836R175J0272
62790F00502J1340J3168J6104J9572K2754K5433K8023L1063L4895L9571M4764
62779H87189M9890N4555N8781O2750O6427O9508P1516P1884P0214O6596O1429
62768A590739N4815M6462L6415K5449J4338L000r093k1698l3538m3349n0846n6506
62756A556188o0737o3528o4779o4733o4000o3087o1866n9674n6173n1940m7899
62745H97772m4256m0514l6529l2923l0113k7530k4421k1006j8163j6116j4282
62734E91919j2387j0956j0309r819q697p039n499m273l067j846r45l87K95J414
62720E18404K778M052N102N868O362O898P937R464J0955J2171J3567J5588J7998
$$ plain form
62707 637144 657425 679894 704939 733193 765109 800978 841111 885744 934828 988057 1045050
62696 1045050 1105460 1169074 1235940 1306218 1379695 1455322 1531156 1604599 1672773 1733068 1783622
62685 1783622 1823221 1850645 1864350 1863178 1847343 1818453 1778438 1728603 1669859 1603664 1532403
62674 1532403 1458691 1384395 1310441 1237482 1166533 1098970 1036103 978802 927281 881005 838947
62663 838947 800152 764129 730773 700172 672557 648121 626604 607328 589872 574363 560726
62652 560726 548036 535304 522782 511703 502617 494670 486756 478782 471390 464943 459248 454011 449163
62639 449163 444931 441784 440061 439383 438759 437476 435639 433640 431596 429640 428269 427788 427666 427006 425570
62624 425570 423924 422687 422092 422116 422577 423165 423846 425135 427553 430883 434448 438013 441897 446254 450863 455684
$$ packed form
62707F37144K0281K2469K5045K8254L1916L5869M0133M4633M9084N3229N6993
62696A045050O0410O3614O6866P0278P3477P5627P5834P3443O8174O0295N0554
62685A783622L9599K7424J3705j172j5835k8890m0015m9835n8744o6195p1261
62674A532403p3712p4296p3954p2959p0949o7563o2867n7301n1521m6276m2058
62663H38947l8795l6023l3356l0601k7615k4436k1517j9276j7456j5509j3637
62652E60726j2690j2732j2522j1079r086p947p914p974p392o447n695n237m848
62639D49163m232l147j723o78o24j283j837j999k044j956j371m81j22o60j436
62624D25570j646j237n95K4M61N88O81J289K418L330L565L565L884M357M609M821
$$ plain form
62608 455684 460973 466702 472476 478334 485022 493086 502154 511626 521697 533189 546617 562064 579873
62595 579873 600866 625645 653955 684946 717838 752186 787582 823216 857761 889794 918399
62584 918399 943194 963637 978542 986667 987736 982461 971548 955166 933682 908374 880771 851416
62572 851416 819930 786411 752179 718924 687602 658572 632239 608812 587644 567626 548415
62561 548415 530752 515435 502538 491767 482910 475500 468623 461714 455212 449813 445330 440952 436541
62548 436541 432913 430655 429274 427854 426141 424664 424039 424477 425735 427234 428328 428792 429063 429754 430853
62533 430853 431623 431432 430649 430508 432002 435078 439022 443497 448881 455643 463844 473460 484829 498410 514255
62518 514255 532124 552049 574465 599786 628140 659508 693899 731294 771628 814730 859991
$$ packed form
62608D55684N289N729N774N858O688Q064R068R472J0071J1492J3428J5447J7809
62595E79873K0993K4779K8310L0991L2892L4348L5396L5634L4545L2033K8605
62584I18399K4795K0443J4905Q125J069n275j0913j6382k1484k5308k7603k9355
62572H51416l1486l3519l4232l3255l1322k9030k6333k3427k1168k0018j9211
62561E48415j7663j5317j2897j0771q857p410o877o909o502n399m483m378m411
62548D36541l628k258j381j420j713j477o25M38J258J499J094M64K71O91J099
62533D30853P70j91p83j41J494L076L944M475N384O762Q201R616J1369J3581J5845
62518E14255J7869J9925K2416K5321K8354L1368L4391L7395M0334M3102M5261
$$ plain form
62507 859991 906041 950985 993059 1030962 1063652 1090189 1109929 1122627 1128216 1126680 1118290 1103873
62495 1103873 1084632 1061737 1036157 1008949 981599 955909 933287 914127 898032 884769 874820
62484 874820 868956 867577 870704 878302 890201 905781 924093 944200 965004 984851 1001819 1014599
62472 1014599 1022816 1026523 1025757 1020643 1011403 997873 979266 954857 924902 890770 854196 816524
62460 816524 778572 741025 704767 670739 639490 611051 585336 562506 542722 525733 510986
62449 510986 498158 487374 478940 473026 469505 467878 467447 467871 469494 472877 478040 484390 491235 498164
62435 498164 505069 512205 520030 528469 536326 541876 544069 542870 538589 531579 522575 512592 502139 491057
62421 491057 479441 468184 458186 449423 441209 433085 425092 417418 410237 403832 398526 394433 391378 388940
$$ packed form
62507H59991M6050M4944M2074L7903L2690K6537J9740J2698N589j536q390j4417
62495A103873j9241k2895k5580k7208k7350k5690k2622j9160j6095j3263r949
62484H74820n864j379L127P598J1899J5580J8312K0107K0804J9847J6968J2780
62472A014599Q217L707p66n114r240j3530j8607k4409k9955l4132l6574l7672
62460H16524l7952l7547l6258l4028l1249k8439k5715k2830j9784j6989j4747
62449E10986j2828j0784q434n914l521j627m31M24J623L383N163O350O845O929
62435D98164O905P136P825Q439P857N550K193j199m281p010r004r983j0453j1082
62421D91057j1616j1257r998q763q214q124p993p674p181o405n306m093l055k438
$$ plain form
62407 388940 386570 383898 381040 378423 376274 374530 373096 371813 370237 368113 366179 365807 367451 370010
62393 370010 372158 373735 375368 377254 379048 380659 382434 384653 387353 390509 393931 397162 399975 402812
62379 402812 406234 410115 414021 418224 423637 430656 438711 447087 455650 464545 473813 483702 494923 508113
62365 508113 523184 539535 556887 575723 597025 621704 650163 682277 717883 757344 801471
62354 801471 850717 904466 961093 1018479 1074349 1126384 1172451 1210964 1241033 1262328 1274958
62343 1274958 1279511 1277000 1268495 1254678 1235775 1211863 1183079 1149666 1112184 1071911 1030697 990108
62331 990108 950887 913611 879565 850287 826187 806186 788873 773544 759936 747615 736090
62320 736090 725072 714071 701991 687686 670914 652425 633194 613855 594793 576425 559273
$$ packed form
62407C88940k370k672k858k617k149j744j434j283j576k124j934l72J644K559
62393C70010K148J577J633J886J794J611J775K219K700L156L422L231K813K837
62379D02812L422L881L906M203N413P019Q055Q376Q563Q895R268R889J1221J3190
62365E08113J5071J6351J7352J8836K1302K4679K8459L2114L5606L9461M4127
62354H01471M9246N3749N6627N7386N5870N2035M6067L8513L0069K1295J2630
62343A274958M553k511q505j3817j8903k3912k8784l3413l7482m0273m1214m0589
62331I90108l9221l7276l4046k9278k4100k0001j7313j5329j3608j2321j1525
62320G36090j1018j1001j2080j4305j6772j8489j9231j9339j9062j8368j7152
$$ plain form
62309 559273 543780 529974 517311 505170 493648 483521 475247 468366 462154 456460 451555 447544 444354
62296 444354 442010 440459 439376 438595 438459 439247 440497 441443 441945 442439 443176 444110 445405 447342 449727 452007
62280 452007 454073 456396 459273 462522 466026 469986 474444 479062 483672 488552 493920 499623 505696 512783
62266 512783 521547 531944 543621 556971 573301 593787 618586 647162 679297 715393 755779 800232
62254 800232 848606 901627 960159 1023320 1087877 1149948 1206957 1257624 1300760 1335083 1360146
62243 1360146 1376659 1385782 1388526 1385640 1377234 1362399 1339893 1309635 1273135 1232369 1188709 1143137
62231 1143137 1096882 1051368 1007738 966606 928092 892003 858264 827225 799253 774028 750642
62220 750642 728390 707064 686503 666486 647206 629263 612870 597497 582550 568019 554233
$$ packed form
62309E59273j5493j3806j2663j2141j1522j0127q274o881o212n694m905m011l190
62296D44354k344j551j083p81j36P88J250R46N02M94P37R34J295J937K385K280
62280D52007K066K323K877L249L504L960M458M618M610M880N368N703O073P087
62266E12783Q764J0397J1677J3350J6330K0486K4799K8576L2135L6096M0386M4453
62254H00232M8374N3021N8532O3161O4557O2071N7009N0667M3136L4323K5063
62243A360146J6513R123K744k886q406j4835k2506l0258l6500m0766m3660m5572
62231A143137m6255m5514m3630m1132l8514l6089l3739l1039k7972k5225k3386
62220G50642k2252k1326k0561k0017j9280j7943j6393j5373j4947j4531j3786
$$ plain form
62209 554233 541380 529558 518913 509513 501394 494788 489776 485575 480875 475347 470307 467369 466762 467396
62195 467396 468245 469199 470853 473943 478857 485243 492235 499298 506708 514983 524154 533895 544070 554697
62181 554697 565550 576213 586389 595902 604523 612068 618514 623832 627957 631257 634884 640393 649114
62168 649114 661890 679039 700300 725208 753902 787171 825274 866965 910097 952863 993967
62157 993967 1031819 1064269 1089330 1106021 1114723 1117000 1114795 1109239 1100111 1086608 1068362 1045558
62145 1045558 1018572 988101 955461 922140 889125 857073 826919 799711 775917 755473 738473
62134 738473 725207 715479 708492 703597 700682 699649 699931 700772 701694 702553 703521 705210 708529 714049 721515
62119 721515 729941 738039 744664 749183 751640 752508 752325 751679 751305 751728 752691 753143 751880 748127 741689 732881
$$ packed form
62209E54233j2853j1822j0645r400q119o606n012m201m700n528n040k938o07O34
62195D67396Q49R54J654L090M914O386O992P063P410Q275R171R741J0175J0627
62181E54697J0853J0663J0176R513Q621P545O446N318M125L300L627N509Q721
62168F49114J2776J7149K1261K4908K8694L3269L8103M1691M3132M2766M1104
62157I93967L7852L2450K5061J6691Q702K277k205n556r128j3503j8246k2804
62145A045558k6986l0471l2640l3321l3015l2052l0154k7208k3794k0444j7000
62134G38473j3266r728o987m895k915j033K82Q41R22Q59R68J689L319N520P466
62119G21515Q426Q098O625M519K457Q68j83o46l74M23R63M52j263l753o438q808
$$ plain form
62103 732881 722382 711005 699558 688932 679951 672894 667471 663603 661919 662967 666238 670603 675549
62090 675549 681327 687938 694810 701605 708569 715797 722851 729540 736497 744469 753419 762809 772526 783138
62076 783138 795496 810337 827971 847969 869332 891264 913530 935890 957738 978822 999863
62065 999863 1021722 1044142 1066137 1087663 1110064 1134439 1160068 1184875 1207053 1225767 1240520
62054 1240520 1250524 1254988 1253831 1247997 1239040 1228219 1215659 1200272 1180722 1156628 1128806 1098368
62042 1098368 1065832 1031223 994762 957166 919305 881880 845377 810082 776095 743560 712898
62031 712898 684576 658775 635597 615565 599307 586562 576011 566494 557986 551028 545621 541215
62019 541215 537476 534406 531750 528902 525424 521287 516634 511744 507169 503447 500642 498524 497131 496651
$$ packed form
62103G32881j0499j1377j1447j0626q981p057n423l868j684J048L271M365M946
62090F75549N778O611O872O795O964P228P054O689O957P972Q950R390R717J0612
62076G83138J2358J4841J7634J9998K1363K1932K2266K2360K1848K1084K1041
62065I99863K1859K2420K1995K1526K2401K4375K5629K4807K2178J8714J4753
62054A240520J0004M464j157n834q957j0821j2560j5387j9550k4094k7822l0438
62042A098368l2536l4609l6461l7596l7861l7425l6503l5295l3987l2535l0662
62031G12898k8322k5801k3178k0032j6258j2745j0551r517q508o958n407m406
62019E41215l739l070k656k848l478m137m653m890m575l722k805k118j393m80
$$ plain form
62005 496651 496870 497326 498067 499629 502129 504966 507583 509941 511958 513116 512999 511774 509705 506665 502632
61990 502632 498273 494465 491391 488489 485095 480799 475387 468926 461794 454296 446375 438016 429685 421999
61976 421999 415139 409026 403903 400208 397903 396422 395396 394969 395267 395954 396573 397054 397600 398184 398456 398239
61960 398239 397998 398642 400673 403590 406285 408121 409412 410833 412671 414833 417234 419799 422286 424546 426936
61945 426936 430126 434525 440203 447286 456000 466277 477724 490168 503926 519333 536199 553892
61933 553892 571761 589350 606381 622731 638289 652695 665324 675672 683688 689637 693744 696099
61921 696099 696801 695959 693545 689427 683698 676954 670179 664280 659685 656432 654658 654923 657914 663812 672131
61906 672131 682263 694117 708025 723941 740795 756733 770057 779895 786022 788277 786454 780755
$$ packed form
62005D96651K19M56P41J562K500K837K617K358K017J158j17j225k069l040m033
61990E02632m359l808l074k902l394m296n412o461p132p498p921q359q331p686
61976D21999o860o113n123l695k305j481j026m27K98O87O19M81N46N84K72k17
61960C98239k41O44K031K917K695J836J291J421J838K162K401K565K487K260K390
61945D26936L190M399N678P083Q714J0277J1447J2444J3758J5407J6866J7693
61933E53892J7869J7589J7031J6350J5558J4406J2629J0348Q016N949M107K355
61921F96099P02q42k414m118n729o744o775n899m595l253j774K65K991N898Q319
61906F72131J0132J1854J3908J5916J6854J5938J3324R838O127K255j823n699
$$ plain form
61894 780755 771992 761093 748548 734550 719518 704160 688986 674052 659325 645086 631812 619761
61882 619761 608859 598955 590027 582065 574806 567713 560297 552511 544813 537779 531695 526512 522161 518784
61868 518784 516656 515957 516639 518419 520898 523725 526724 529919 533457 537551 542357 547823 553792 560484 568853
61853 568853 580188 595204 613643 634786 658112 683310 709972 737660 766140 795112 823713
61842 823713 850728 875355 897279 915753 929237 936584 938287 935844 929993 920398 907230 892275
61830 892275 877986 865916 856561 850182 847053 847195 850628 857828 869151 883656 899147 913618 926089
61817 926089 935805 941320 941120 934834 923252 907201 886956 862809 835758 807323 778813 750923
61805 750923 723961 698323 674562 652982 633312 615036 598072 582881 569825 558704 549044 540545
$$ packed form
61894G80755q763j0899j2545j3998j5032j5358j5174j4934j4727j4239j3274j2051
61882F19761j0902r904q928p962p259p093p416p786p698p034o084n183m351l377
61868E18784k128o99O82J780K479K827K999L195L538M094M806N466N969O692Q369
61853E68853J1335J5016J8439K1143K3326K5198K6662K7688K8480K8972K8601
61842H23713K7015K4627K1924J8474J3484P347J703k443n851r595j3168j4955
61830H92275j4289j2070r355o379l129J42L433P200J1323J4505J5491J4471J2471
61817I26089R716N515k00o286j1582j6051k0245k4147k7051k8435k8510k7890
61805G50923k6962k5638k3761k1580j9670j8276j6964j5191j3056j1121r660q499
$$ plain form
61793 540545 533032 526248 520000 514353 509344 504638 499830 494949 490337 486042 481760 477416 473410 470155
61779 470155 467689 465892 464699 463784 462359 459764 456251 452824 450209 448218 446235 444041 441903 440020
61765 440020 438237 436319 434236 432081 429993 428335 427676 428238 429464 430478 430980 431368 431958 432471 432425 431728
61749 431728 430733 429951 429880 430708 431872 432236 431147 429162 427317 425838 424089 421759 419507 418224 418091 418679
61733 418679 419647 420923 422314 423391 423876 424004 424350 425375 427139 429428 432031 434798 437483 439744 441500
61718 441500 443155 445211 447596 449692 451109 452250 453813 455883 457790 458895 459218 459105 458526 457066 454630
61703 454630 451759 449018 446306 443099 439241 435111 431027 426956 422952 419402 416473 413631 410203 406243
61689 406243 402380 398861 395235 391066 386543 382202 378417 375432 373548 372882 372935 372769 371693 369733 367474
$$ packed form
61793E40545p513o784o248n647n009m706m808m881m612m295m282m344m006l255
61779D70155k466j797j193r15j425k595l513l427k615j991j983k194k138j883
61765D40020j783j918k083k155k088j658o59N62J226J014N02L88N90N13m6o97
61749D31728r95p82p1Q28J164L64j089j985j845j479j749k330k252j283j33N88
61733D18679R68J276J391J077M85J28L46J025J764K289K603K767K685K261J756
61718D41500J655K056K385K096J417J141J563K070J907J105L23j13n79j460k436
61703D54630k871k741k712l207l858m130m084m071m004l550k929k842l428l960
61689D06243l863l519l626m169m523m341l785k985j884o66N3j66j076j960k259
$$ plain form
61674 367474 365543 364185 363159 362001 360475 358783 357263 355939 354504 352781 351027 349623 348614 347789
61660 347789 347122 346798 346655 346015 344459 342623 341755 342475 344337 346623 349110 351877 354798 357620 360209 362409
61644 362409 363948 364881 365924 367871 370760 374026 377314 380597 383580 385564 386097 385320 383504 380691 377003
61629 377003 372882 368732 364626 360600 356918 353743 350853 348045 345620 343999 343024 342045 340736 339435 338646
61614 338646 338512 338913 339764 340961 342161 342869 342758 341750 339768 336572 332049 326681 321457 317133 313651
61599 313651 310406 306949 303202 299131 294696 290264 286597 284086 282217 280134 277627 275246 273516 272415
61585 272415 271654 271091 270629 269953 268712 266985 265307 264095 263173 262050 260621 259339 258589 258163 257634 257086
61569 257086 257065 257733 258445 258372 257384 256142 255503 255945 257375 259251 260971 262308 263421 264385 264953 264922 264563 264436
$$ packed form
61674C67474j931j358j026j158j526j692j520j324j435j723j754j404j009q25
61660C47789o67l24j43o40j556j836q68P20J862K286K487K767K921K822K589K200
61644C62409J539R33J043J947K889L266L288L283K983J984N33p77j816k813l688
61629C77003m121m150m106m026l682l175k890k808k425j621r75r79j309j301p89
61614C38646j34M01Q51J197J200P08j11j008j982l196m523n368n224m324l482
61599C13651l245l457l747m071m435m432l667k511j869k083k507k381j730j101
61585B72415p61n63m62o76j241j727j678j212r22j123j429j282p50m26n29n48
61569B57086k1O68P12p3r88j242o39M42J430J876J720J337J113R64N68l1l59j27
$$ plain form
61551 264436 264878 265902 267453 269460 271689 273794 275598 277140 278450 279458 280141 280607 281061 281749 282846
61536 282846 284234 285512 286468 287477 289128 291476 293906 295791 296996 297735 298241 298723 299351 300070 300569 300604
61520 300604 300250 299751 299262 298790 298215 297218 295400 292690 289561 286738 284785 283995 284386 285529 286560 286766
61504 286766 286198 285516 285190 285067 284710 283869 282551 280886 279131 277663 276730 276201 275763 275411 275611 276812 278828
61487 278828 280815 281943 282090 281884 282072 282922 284170 285357 286141 286435 286483 286804 287821 289379 290783 291564 292181
61470 292181 293648 296274 299029 300552 300683 300528 300902 301277 300733 299484 298697 298840 299052 298457 297435 297060 297695
61453 297695 298793 299790 300532 300899 300700 300089 299619 299647 300047 300621 301340 302082 302640 303266 304746 307552 311219 314905
61435 314905 318178 320912 322940 324436 326369 329733 334340 338992 342857 346016 348604 350305 351086 351760 353194
$$ packed form
61551B64436M42J024J551K007K229K105J804J542J310J008O83M66M54O88J097
61536B82846J388J278R56J009J651K348K430J885J205P39N06M82O28P19M99L5
61520C00604l54m99m89m72n75r97j818k710l129k823j953p90L91J143J031K06
61504B86766n68o82l26j23l57q41j318j665j755j468r33n29m38l52K00J201K016
61487B78828J987J128J47k06J88Q50J248J187P84K94M8L21J017J558J404P81O17
61470B92181J467K626K755J523J31j55L74L75n44j249p87J43K12n95j022l75O35
61453B97695J098R97P42L67j99o11m70K8M00N74P19P42N58O26J480K806L667L686
61435C14905L273K734K028J496J933L364M607M652L865L159K588J701P81O74J434
$$ plain form
61420 353194 355352 357622 359734 361787 363657 365040 366007 366940 367850 368299 368042 367332 366415 365182 363485 361425
61404 361425 359109 356421 353367 350378 347925 345961 344031 341889 339695 337624 335589 333501 331604 330345
61390 330345 329910 330009 330129 329922 329345 328533 327656 326869 326266 325837 325531 325430 325709 326339 326964 327229 327215 327388 328221
61371 328221 329933 332414 335149 337367 338686 339611 341002 342964 344686 345620 346354 347914 350514 353482 356266
61356 356266 358935 361733 364752 368227 372650 378265 384764 391747 399069 406371 412761 417699 422024 427292
61342 427292 433830 440170 444794 447969 451308 455874 461314 466668 471289 474885 477277 478499 478811 478409 477345
61327 477345 475881 474525 473485 472357 470658 468438 466081 463763 461433 459193 457348 456169 455823 456382 457690
61312 457690 459435 461682 465013 469772 475473 481550 488400 496976 507505 519367 532189 546001 560128
$$ packed form
61420C53194K158K270K112K053J870J383R67R33R10M49k57p10r17j233j697k060
61404C61425k316k688l054k989k453j964j930k142k194k071k035k088j897j259
61390C30345m35R9J20k07n77q12q77p87o03m29l06j01K79O30O25K65j4J73Q33
61371C28221J712K481K735K218J319R25J391J962J722R34P34J560K600K968K784
61356C56266K669K798L019L475M423N615O499O983P322P302O390M938M325N268
61342D27292O538O340M624L175L339M566N440N354M621L596K392J222L12m02j064
61327D77345j464j356j040j128j699k220k357k318k330k240j845j179l46N59J308
61312D57690J745K247L331M759N701O077O850Q576J0529J1862J2822J3812J4127
$$ plain form
61299 560128 572988 583627 592613 600666 607154 610908 611971 611412 609670 606275 601292 595855 590786 585516
61285 585516 578962 570892 561843 552161 541865 531327 521526 513441 507393 502939 499329 496188 493873 492969
61271 492969 493338 493980 494096 494023 494750 496691 499292 501780 503929 506031 508509 511722 515964 521435 528178 536007
61255 536007 544418 552647 560025 566331 571773 576675 581264 585635 589675 593038 595375 596648 597026 596450 594522
61240 594522 590976 586145 580824 575721 571106 566911 563061 559661 556894 554715 552737 550545 548216 546441
61226 546441 546074 547570 550853 555594 561496 568288 575598 583015 590378 597958 606210 615310 625028 635026
61212 635026 645075 654849 663760 671283 677364 682320 686455 690015 693391 697017 701053 705507 710576 716493
61198 716493 723100 730122 737952 747482 758889 771261 783911 797359 812221 827535 841193 851979
$$ packed form
61299E60128J2860J0639Q986Q053O488L754J063n59j742l395m983n437n069n270
61285E85516o554q070r049r682j0296j0538r801q085o048m454l610l141k315r04
61271D92969L69O42J16p3P27J941K601K488K149K102K478L213M242N471O743P829
61255E36007Q411Q229P378O306N442M902M589M371M040L363K337J273L78n76j928
61240E94522l546m831n321n103m615m195l850l400k767k179j978k192k329j775
61226E46441l67J496L283M741N902O792P310P417P363P580Q252R100R718R998
61212F35026J0049R774Q911P523O081M956M135L560L376L626M036M454N069N917
61198G16493O607P022P830R530J1407J2372J2650J3448J4862J5314J3658J0786
$$ plain form
61186 851979 860309 866928 871863 875012 876900 878191 878852 878385 876571 873542 869377 864128 858098 851671 844868
61171 844868 837353 828792 819029 808141 796627 785302 774555 763807 752076 739016 725059 710691
61159 710691 696074 681426 667289 654204 642384 631852 622616 614502 607077 600056 593820 589256 586955
61146 586955 586508 586671 586204 584541 581630 577497 572313 566687 561279 556003 550273 544273 539323 536437 535158
61131 535158 534600 535106 537776 542504 547730 552445 557482 564306 573349 584173 596621 611007 627450 645746
61117 645746 665741 687315 710073 733539 757638 782643 808669 835506 862883 890473 917632
61106 917632 943464 967293 988883 1008176 1024996 1039094 1050343 1058787 1064459 1067202 1066712 1062819 1055581
61093 1055581 1045002 1030845 1013119 992677 970838 948311 924847 900164 874814 849881 826106
$$ packed form
61186H51979Q330O619M935L149J888J291O61m67j814l029m165n249o030o427o803
61171H44868p515q561r763j0888j1514j1325j0747j0748j1731j3060j3957j4368
61159G10691j4617j4648j4137j3085j1820j0532r236q114p425p021o236m564k301
61146E86955m47J63m67j663k911m133n184n626n408n276n730o000m950k886j279
61131E35158n58N06K670M728N226M715N037O824R043J0824J2448J4386J6443J8296
61117F45746J9995K1574K2758K3466K4099K5005K6026K6837K7377K7590K7159
61106I17632K5832K3829K1590J9293J6820J4098J1249Q444N672K743m90l893p238
61093A055581j0579j4157j7726k0442k1839k2527k3464k4683k5350k4933k3775
$$ plain form
61082 826106 803553 781866 760665 739979 720504 703118 687949 674298 661644 650254 640482 632089
61070 632089 624796 618969 614988 612299 609916 607740 606558 606772 607875 609378 611546 614980 619918 626138
61056 626138 633167 640470 647883 655964 665521 676667 688753 701318 714706 729611 746438 765210
61044 765210 785697 807521 830597 855590 883442 914248 947089 981207 1016852 1054653 1094643
61033 1094643 1136369 1179656 1224773 1271935 1320899 1370965 1421244 1471230 1521406 1573240 1628597
61022 1628597 1689277 1756910 1832655 1916782 2008973 2109266 2218672 2339394 2475583 2634159
61012 2634159 2824186 3055322 3337704 3683186 4105099 4616383 5230031 5962992 6839156
61003 6839156 7889232 9150623 10663109 12443030 14430721 16448050 18224912 19507288
$$ packed form
61082H26106k2553k1687k1201k0686j9475j7386j5169j3651j2654j1390r772q393
61070F32089p293n827l981k689k383k176j182K14J103J503K168L434M938O220
61056F26138P029P303P413Q081R557J1146J2086J2565J3388J4905J6827J8772
61044G65210K0487K1824K3076K4993K7852L0806L2841L4118L5645L7801L9990
61033A094643M1726M3287M5117M7162M8964N0066N0279M9986N0176N1834N5357
61022A628597O0680O7633P5745Q4127R2191J00293J09406J20722J36189J58576
61012B634159J90027K31136K82382L45482M21913N11284O13648P32961Q76164
61003F839156J050076J261391J512486J779921J987691K017329J776862J282376
$$ plain form
60995 19507288 20178988 20306318 20084116 19745060 19497265 19489489 19767460 20226947 20621754 20660754
60985 20660754 20144216 19045582 17492675 15684898 13814269 12025334 10406891 8998138
60977 8998138 7801613 6799504 5967058 5279003 4711472 4243494 3858087 3541480 3281419
60968 3281419 3066652 2887548 2736612 2608466 2499561 2407424 2329532 2262869 2204693 2153419
60958 2153419 2108457 2069319 2035017 2003981 1974191 1943498 1910084 1872774 1831129 1785539 1737121
60947 1737121 1687067 1636023 1584461 1533437 1484216 1436983 1390764 1344998 1300401 1257654 1216025
60936 1216025 1174223 1132194 1091064 1051505 1013209 976023 940635 907776 877419 849113 822525
60925 822525 797258 772751 748909 726549 706672 689358 673729 658934 644896 632075 620745
$$ packed form
60995A9507288O71700J27330k22202l39056k47795p776K77971M59487L94807L9000
60985B0660754n16538j098634j552907j807777j870629j788935j618443j408753
60977H998138j196525j002109q32446o88055n67531m67978l85407l16607k60061
60968C281419k14767j79104j50936j28146j08905r2137p7892o6663n8176n1274
60958B153419m4962l9138l4302l1036k9790l0693l3414l7310m1645m5590m8418
60947A737121n0054n1044n1562n1024m9221m7233m6219m5766m4597m2747m1629
60936A216025m1802m2029m1130l9559l8296l7186l5388l2859l0357k8306k6588
60925H22525k5267k4507k3842k2360j9877j7314j5629j4795j4038j2821j1330
$$ plain form
60914 620745 610611 601148 592332 584827 579244 575280 571969 568827 566283 564772 563836 562582 560849 559465
60900 559465 559312 560487 562434 564631 566980 569572 572174 574024 574349 573209 571661 570793 570617 570148 568562
60885 568562 566001 563139 560252 556980 552855 547732 541721 535038 528096 521503 515666 510472 505538 500692
60871 500692 495927 491014 485613 479893 474585 470103 465936 461293 456134 451155 446913 443430 440554 438152
60857 438152 435877 433251 430215 427297 425048 423581 422731 422310 422050 421571 420631 419205 417361 415371 413938
60842 413938 413685 414243 414401 413500 412165 411261 410637 409506 407617 405360 403014 400640 398583 397350 396989 397238
60826 397238 398333 400925 405024 409609 413602 416758 419363 421531 423143 424122 424382 423770 422309 420386 418485
60811 418485 416933 415966 415759 416171 416725 417064 417248 417445 417568 417349 416600 415176 412941 410005 406838 403929 401378
$$ packed form
60914F20745j0134r463q816p505n583l964l311l142k544j511r36j254j733j384
60900E59465j53J175J947K197K349K592K602J850L25j140j548q68j76m69j586
60885E68562k561k862k887l272m125n123o011o683o942o593n837n194m934m846
60871E00692m765m913n401n720n308m482m167m643n159m979m242l483k876k402
60857D38152k275k626l036k918k249j467q50m21k60m79r40j426j844j990j433
60842D13938k53N58J58r01j335r04o24j131j889k257k346k374k057j233l61K49
60826C97238J095K592M099M585L993L156K605K168J612R79K60o12j461j923j901
60811D18485j552r67k07M12N54L39J84J97J23k19p49j424k235k936l167k909k551
$$ plain form
60794 401378 398911 396155 392833 388933 384815 380931 377314 373594 369669 366062 363273 360930 357999 353930
60780 353930 349406 345788 343786 342725 341229 338638 335576 333109 331683 331190 331650 333209 335637 338469 341671
60765 341671 345504 349685 353422 356479 359493 362909 366348 369448 372598 376203 379824 382772 385149 387569
60751 387569 390222 392896 395551 398057 399722 400051 399878 400746 402977 405099 405416 403481 399861 395181 389856
60736 389856 384250 378579 372796 366746 360298 353344 345991 338785 332392 327030 322511 318757 315843 313568
60722 313568 311490 309476 307746 306336 305050 304005 303686 304261 305299 306252 306755 306378 304828 302567 300596
60707 300596 299294 298155 297018 296717 297895 299871 301509 302735 304247 306036 307276 307754 308459 310365 313213
60692 313213 315878 317613 318679 320047 322593 326354 330438 333934 336945 340422 344951 350145 355383 360608
$$ packed form
60794D01378k467k756l322l900m118l884l617l720l925l607k789k343k931m069
60780C53930m524l618k002j061j496k591l062k467j426m93M60J559K428K832L202
60765C41671L833M181L737L057L014L416L439L100L150L605L621K948K377K420
60751C87569K653K674K655K506J665L29j73Q68K231K122L17j935l620m680n325
60736C89856n606n671n783o050o448o954p353p206o393n362m519l754k914k275
60722C13568k078k014j730j410j286j045l19N75J038R53N03l77j550k261j971
60707C00596j302j139j137l01J178J976J638J226J512J789J240M78P05J906K848
60692C13213K665J735J066J368K546L761M084L496L011L477M529N194N238N225
$$ plain form
60678 360608 366048 371539 376639 381270 385719 390075 394098 397691 400938 403511 404538 403479 400821 397466
60664 397466 393722 389457 385005 381109 377829 374320 370099 365953 362979 361187 359692 358015 356536 355727
60650 355727 355635 356156 357297 359060 361393 364212 367058 368951 369209 368364 367611 367225 366229 363754 360036 355767
60634 355767 351206 346431 341900 338184 335450 333603 332619 332348 332376 332524 333124 334374 335771 336663 337143 337885
60618 337885 339304 341260 343374 345142 345977 345609 344365 342706 340772 338756 337373 337207 337782 337971 337435 336948
60602 336948 337181 337739 337773 337179 336786 337398 338807 339875 339702 338761 338522 339775 341750 343259 344218 345331 346570
60585 346570 346958 345973 344365 343210 342753 342553 342277 341949 341743 341924 342777 344311 346314 348883 352578 357720
60569 357720 363863 370395 377497 385982 396104 406827 416478 424048 429835 434798 439262 442379 443021 441132
$$ packed form
60678C60608N440N491N100M631M449M356M023L593L247K573J027j059k658l355
60664C97466l744m265m452l896l280l509m221m146k974j792j495j677j479q09
60650C55727r2N21J141J763K333K819K846J893K58q45p53l86r96k475l718m269
60634C55767m561m775m531l716k734j847r84k71K8J48O00J250J397Q92M80P42
60618C37885J419J956K114J768Q35l68j244j659j934k016j383j66N75J89n36m87
60602C36948K33N58L4n94l93O12J409J068j73r41k39J253J975J509R59J113J239
60585C46570L88r85j608j155m57k00k76l28k06J81Q53J534K003K569L695N142
60569C57720O143O532P102Q485J0122J0723R651P570N787M963M464L117O42j889
$$ plain form
60555 441132 437906 434541 431218 427479 423298 419381 416587 415389 415768 417270 419187 421067 423187 426333
60541 426333 431034 437152 444213 451895 460131 469056 478951 489950 501503 512368 521448 528492 533659
60528 533659 536644 536839 534401 530545 526489 522536 518498 514448 510540 506511 502099 497785 494435 492269
60514 492269 490877 490190 490615 492038 493558 494652 495979 498488 502245 506668 511540 517293 524618 534310 547163
60499 547163 563520 583164 606022 632555 662856 695799 729802 764195 798990 833388 865298
60488 865298 892387 912849 925044 927348 918980 900739 874572 842658 806971 769253 730990 693486
60476 693486 657983 625505 596495 570806 548010 527559 508877 491793 476809 464429 454164
60465 454164 444722 435295 426181 418043 411123 405322 400454 396044 391405 386350 381581 377995 375803 374549
$$ packed form
60555D41132l226l365l323l739m181l917k794j198L79J502J917J880K120L146
60541D26333M701O118P061P682Q236Q925R895J0999J1553J0865R080P044N167
60528E33659K985J95k438l856m056l953m038m050l908m029m412m314l350k166
60514D92269j392o87M25J423J520J094J327K509L757M423M872N753P325R692J2853
60499E47163J6357J9644K2858K6533L0301L2943L4003L4393L4795L4398L1910
60488H65298K7089K0462J2195K304q368j8241k6167l1914l5687l7718l8263l7504
60476F93486l5503l2478k9010k5689k2796k0451j8682j7084j4984j2380j0265
60465D54164r442r427r114q138o920n801m868m410m639n055m769l586k192j254
$$ plain form
60451 374549 373678 372769 371537 369947 368167 366177 363658 360583 357601 355479 354326 353714 353373 353364 353617 353730
60435 353730 353325 352363 351029 349529 348125 347234 347232 348007 348741 348427 346832 344835 343573 343292 343385 343508 344206 346217
60417 346217 349501 353206 356426 358767 360333 361353 361893 361897 361557 361449 362002 362898 363375 363150 362675 362492 362786
60400 362786 363644 365149 366929 368166 368556 368888 370186 372520 375160 377661 380230 383056 385883 388433 390876
60385 390876 393592 396657 399714 402313 404240 405592 406613 407516 408509 409899 412008 414876 418142 421273 423925
60370 423925 426148 428360 431057 434326 437593 440050 441368 441879 442118 442446 443101 444318 446218 448741 451747
60355 451747 455097 458737 463026 468846 476943 487024 497902 508559 518653 527868 535371 540253 542147
60342 542147 541067 537035 530383 522209 514010 506771 500575 494994 489695 484721 480361 476758 473724 471070
$$ packed form
60451C74549q71r09j232j590j780j990k519l075k982k122j153o12l41rK53J13
60435C53730m05r62j334j500j404q91kP75P34l14j595j997j262k81R3J23O98K011
60417C46217L284L705L220K341J566J020N40Ml40j08N53Q96M77k25m75j83K94
60400C62786Q58J505J780J237L90L32J298K334K640K501K569K826K827K550K443
60385C90876K716L065L057K599J927J352J021R03R93J390K109K868L266L131K652
60370D23925K223K212K697L269L267K457J318N11K39L28O55J217J900K523L006
60355D51747L350L640M289N820Q097J0081J0878J0657J0094R215P503M882J894
60342E42147j080m032o652q174q199p239o196n581n299m974m360l603l034k654
$$ plain form
60328 471070 468939 467386 465703 462744 458169 452892 448063 444034 440525 437276 434158 431137 428589 427329
60314 427329 427928 430238 433928 439063 445775 453764 462704 472875 484863 498802 514368 531282 549212
60301 549212 567200 583676 597119 606576 611681 612382 608508 599522 585189 566663 546329 526230 507208
60288 507208 489989 476103 466633 460608 455888 451549 448267 446426 445065 443081 440476 437897 435623 433556
60274 433556 431685 430024 428388 426515 424240 421486 418475 415936 414580 414167 413607 412231 410533 409454 409322
60259 409322 409696 409828 409050 407161 404790 403010 402368 402513 402903 403475 404343 405308 406105 406917 408275 410508 413450
60242 413450 416543 419053 420405 420533 419821 418674 417276 415752 414301 413110 412369 412392 413422 415279 417464
60227 417464 419581 421375 422514 422899 423155 424145 425846 427318 428067 428847 430702 433774 437491 441506 445905
$$ packed form
60328D71070k131j553j683k959m575n277m829m029l509l249l118l021k548j260
60314D27329N99K310L690N135O712P989Q940J0171J1988J3939J5566J6914J7930
60301E49212J7988J6476J3443R457N105P01l874q986j4333j8526k0334k0099j9022
60288E07208j7219j3886r470o025m720m339l282j841j361j984k605k579k274k067
60274D33556j871j661j636j873k275k754l011k539j356m13n60j376j698j079j32
60259D09322L74J32p78j889k371j780o42J45L90N72Q68R65P97Q12J358K233K942
60242D13450L093K510J352J28p12j147j398j524j451j191p41K3J030J857K185
60227D17464K117J794J139L85K56R90J701J472P49P80J855L072L717M015M399
$$ plain form
60212 445905 450729 455821 461005 466106 470930 475545 480348 485579 490994 496272 501432 506554 511438 515947
60198 515947 520391 525044 529556 533346 536387 539072 541422 542995 543596 543536 543134 542471 541655 540836 539751 537815
60182 537815 534928 531790 529024 526308 522852 518535 514119 510303 506975 503552 499758 495842 492212 489103
60168 489103 486586 484681 483383 482682 482592 483033 483672 484036 483868 483293 482652 482317 482646 483828 485639 487606 489514
60151 489514 491491 493449 494873 495543 496059 497132 498667 500181 501857 504363 507647 510845 513646 516936 521597
60136 521597 527310 533144 538866 544964 551628 558347 564521 569942 574580 578196 580355 580824 580003 578874 578238
60121 578238 577919 577055 575312 573456 572517 572777 573822 575178 576439 577095 576811 575798 574552 573299 571997 570693
60105 570693 569482 568230 566745 565176 563884 562913 561895 560472 558522 556030 553075 549946 547013 544418
$$ packed form
60212D45905M824N092N184N101M824M615M803N231N415N278N160N122M884M509
60198E15947M444M653M512L790L041K685K350J573O01o0m02o63q16q19j085j936
60182E37815k887l138k766k716l456m317m416l816l328l423l794l916l630l109
60168D89103k517j905j298p01r0M41O39L64j68n75o41l35L29J182J811J967J908
60151D89514J977J958J424O70N16J073J535J514J676K506L284L198K801L290M661
60136E21597N713N834N722O098O664O719O174N421M638L616K159M69q21j129o36
60121E78238l19q64j743j856r39K60J045J356J261O56k84j013j246j253j302j304
60105E70693j211j252j485j569j292r71j018j423j950k492k955l129k933k595
$$ plain form
60091 544418 542138 540351 539491 539839 541189 542957 544585 545975 547569 549822 552508 554800 556197 557063 557996
60076 557996 559070 560086 561161 562377 563011 561853 558449 553474 547727 541356 534339 527135 520312 513810
60062 513810 507088 500024 493217 487294 482199 477396 472636 468253 464678 461911 459643 457730 456273 455327
60048 455327 454901 455237 456667 459045 461764 464535 467736 471653 475791 479415 482410 485084 487391 489064 490419
60033 490419 492272 494894 497572 499414 500145 499915 498702 496236 492321 487094 481117 475218 470006 465427 461000
60018 461000 456409 451599 446392 440573 434436 428799 424218 420466 416928 413210 409253 405241 401593 398714
60004 398714 396474 394222 391549 388804 386666 385431 384936 384912 385179 385664 386452 387705 389397 391316 393390 395740
59988 395740 398247 400419 401950 403172 404678 406694 408993 411168 412757 413386 413105 412435 411825 411250 410509 409630
$$ packed form
60091E44418k280j787q60L48J350J768J628J390J594K253K686K292J397Q66R33
60076E57996J074J016J075J216O34j158l404m975n747o371p017p204o823o502
60062E13810o722p064o807n923n095m803m760m383l575k767k268j913j457r46
60048D55327m26L36J430K378K719K771L201L917M138L624K995K674K307J673J355
60033D90419J853K622K678J842P31k30j213k466l915n227n977n899n212m579m427
60018D61000m591m810n207n819o137n637m581l752l538l718l957m012l648k879
60004C98714k240k252k673k745k138j235m95k4K67M85P88J253J692J919K074K350
59988C95740K507K172J531J222J506K016K299K175J589O29k81o70o10n75p41q79
$$ plain form
59972 409630 408726 407796 406948 406506 406467 406220 405333 404368 404347 405531 407271 408930 410327 411387 412101 412938 414602
59955 414602 417104 419570 421220 422087 422602 423029 423532 424209 424694 424265 422795 421123 419988 419084 417739 416089
59939 416089 414800 413861 412481 410171 407250 404212 401262 398627 396698 395560 394926 394765 395536 397462 400021
59924 400021 402539 404944 407570 410565 413953 418082 423471 430183 437618 444970 451669 457436 462190 465916
59910 465916 468568 470211 471305 472592 474467 476649 478721 480709 482806 484722 485833 485938 485509 485164 485245
59895 485245 485854 486896 487959 488511 488432 488157 488257 489012 490419 492309 494388 496443 498577 501083 504078 507494
59879 507494 511403 516026 521359 527008 532409 536967 540167 541987 543138 544246 544756 543320 539537 534638
59865 534638 530098 526208 522598 519482 517534 516867 517046 517988 520009 522856 525546 527541 529584 533006 538558
$$ packed form
59972D09630r04r30q48m42l9k47q87r65k1J184J740J659J397J060P14Q37J664
59955D14602K502K466J650Q67N15M27N03O77M85m29j470j672j135r04j345j650
59939D16089j289r39j380k310k921l038k950k635j929j138o34j61P71J926K559
59924D00021K518K405K626K995L388M129N389O712P435P352O699N767M754L726
59910D65916K652J643J094J287J875K182K072J988K097J916J111J05m29l45Q1
59895D85245O09J042J063N52p9k75J00P55J407J890K079K055K134K506K995L416
59879E07494L909M623N333N649N401M558L200J820J151J108N10j436l783m899
59865E34638m540l890l610l116j948o67J79R42K021K847K690J995K043L422N552
$$ plain form
59850 538558 546144 555168 564574 572745 578005 579623 578270 575474 572586 570250 568649 567866 567680 567079 564530
59835 564530 559155 551552 543236 535433 528652 523040 518567 514845 511357 508022 505162 502797 500389 497503
59821 497503 494349 491412 488880 486750 485158 484170 483428 482460 481385 480910 481485 482686 483572 483440 482127 479769
59805 479769 476592 473013 469702 467247 465719 464701 463858 463311 463266 463407 462980 461555 459441 457177 454868 452289
59789 452289 449530 447152 445617 444793 444157 443347 442336 441220 440075 439021 438142 437257 435952 434067 432053
59774 432053 430638 430197 430584 431523 432840 434242 435217 435430 435142 435044 435646 436930 438589 440483 442818 445873
59758 445873 449580 453471 457143 460715 464641 469143 474040 479143 484472 489979 495321 500185 504648 509057
59744 509057 513664 518576 523831 529277 534502 539173 543392 547458 551314 554461 556516 557686 558601 559677
$$ packed form
59850E38558P586R024R406Q171N260J618j353k796k888k336j601p83j86o01k549
59835E64530n375p603q316p803o781n612m473l722l488l335k860k365k408k886
59821D97503l154k937k532k130j592r88p42r68j075m75N75J201Q86j32j313k358
59805D79769l177l579l311k455j528j018q43n47m5J41m27j425k114k264k309k579
59789D52289k759k378j535q24o36q10j011j116j145j054q79q85j305j885k014
59774D32053j415m41L87R39J317J402R75K13k88r8O02J284J659J894K335L055
59758D45873L707L891L672L572L926M502M897N103N329N507N342M864M463M409
59744E09057M607M912N255N446N225M671M219M066L856L147K055J170R15J076
$$ plain form
59730 559677 560657 560849 559876 558110 556196 554280 552052 549435 546727 544021 541176 538567 537108 536906 536521
59715 536521 534488 531233 528501 527002 525658 523404 520700 518696 517596 516632 515300 513880 512733 511705
59701 511705 510455 509073 508054 507613 507270 506376 505093 504494 505427 507501 509579 511069 512195 513060 513104 511805
59685 511805 509431 506758 504289 502123 500362 499218 498655 498133 496903 494588 491508 488330 485326 482167 478539
59670 478539 474638 470733 466534 461618 456296 451422 447318 443611 440251 437848 436620 435790 434632 433535
59656 433535 433333 433995 434806 435563 436749 438590 440720 442955 445684 449177 452986 456340 458844 460483 461321
59641 461321 461541 461574 461768 461964 461732 461068 460556 460699 461261 461578 461474 461579 462527 464026 465073 465074 464425 463820 463318
59622 463318 462422 460908 459208 457856 456857 455702 453915 451438 448534 445479 442411 439443 436814 434876 433940
$$ packed form
59730E59677R80J92r73j766j914j916k228k617k708k706k845k609j459k02l85
59715E36521k033l255k732j499j344k254k704k004j100r64j332j420j147j028
59701E11705j250j382j019m41l43q94j283n99R33K074K078J490J126Q65M4j299
59685E11805k374k673k469k166j761j144n63n22j230k315l080l178l004l159l628
59670D78539l901l905m199m916n322m874m104l707l360k403j228q30j158j097
59656D33535k02O62Q11P57J186J841K130K235K729L493L809L354K504J639Q38
59641D61321K20L3J94J96k32o64n12J43N62L17j04J05R48J499J047Jo49o05n02
59622D63318q96j514j700j352r99j155j787k477k904l055l068k968k629j938r36
$$ plain form
59607 433940 434140 435388 437369 439637 441845 443913 445908 447807 449461 450787 451902 453067 454576 456646
59593 456646 459287 462224 464964 466916 467570 466873 465483 464340 463744 463105 461831 460149 458679 457559 456503
59578 456503 455420 454306 452745 450354 447747 446182 446065 446567 446925 447197 447360 446718 445041 443522 443548 444943
59562 444943 446366 447187 447971 449241 450764 452173 453395 454175 453965 452737 451385 450887 451392 452414 453610 455080
59546 455080 457200 460410 464967 470703 477226 484460 492739 502351 513477 526822 543698 564616 587518
59533 587518 607789 620469 622993 616370 604172 590317 577396 566561 558402 553411 551584 552088 553746
59520 553746 555800 558019 560229 562054 563080 563071 561991 559986 557349 554333 550935 546870 541761 535349 527697
59505 527697 519333 511096 503625 497030 491149 486026 481792 478116 474220 469749 465383 462213 460539 459601
$$ packed form
59607D33940K00J248J981K268K208K068J995J899J654J326J115J165J509K070
59593D56646K641K937K740J952O54o97j390j143n96o39j274j682j470j120j056
59578D56503j083j114j561k391k607j565j17N02L58K72J63o42j677j519K6J395
59562D44943J423Q21P84J270J523J409J222P80k10j228j352m98N05J022J196J470
59546D55080K120L210M557N736O523P234Q279R612J1126J3345J6876K0918K2902
59533E87518K0271J2680K524o623j2198j3855j2921j0835q159m991j827N04J658
59520E53746K054K219K210J825J026rj080k005k637l016l398m065n109o412p652
59505E27697q364q237p471o595n881n123m234l676l896m471m366l170j674r38
$$ plain form
59491 459601 458493 457047 455745 455085 455221 455982 456952 457665 458057 458754 460627 463933 468046 472183 476317 481215
59475 481215 487582 495286 503491 511454 518981 526049 532215 536712 539090 539582 538839 537593 536529 536118 536407
59460 536407 537273 539018 542284 547110 552527 557610 562693 568936 576763 585357 593733 601746 609774 617891
59446 617891 625783 633301 640589 647489 652949 655285 653320 647316 638659 628662 618089 607750 598778 591693
59432 591693 585736 579880 574179 569401 565656 562373 559567 558050 558207 559624 562267 567132 575101 585954
59418 585954 599177 615033 634022 655656 678635 702280 727420 755682 787586 820520 848359
59407 848359 864178 864621 851957 831879 809717 788721 770732 757236 749869 750317 759041 773115 785841
59394 785841 790001 782210 764108 739874 713343 687047 662465 640323 621029 605075 592785 583675
$$ packed form
59491D59601j108j446j302o60J36P61R70P13L92O97J873L306M113M137M134M898
59475D81215O367P704Q205P963P527P068O166M497K378M92p43j246j064m11K89
59460E36407Q66J745L266M826N417N083N083O243P827Q594Q376Q013Q028Q117
59446F17891P892P518P288O900N460K336j965o004q657r997j0573j0339q972p085
59432E91693n957n856n701m778l745l283k806j517J57J417K643M865P969J0853
59418E85954J3223J5856J8989K1634K2979K3645K5140K8262L1904L2934K7839
59407H48359J5819M43j2664k0078k2162k0996j7989j3496p367M48Q724J4074J2726
59394G85841M160p791j8102k4234k6531k6296k4582k2142j9294j5954j2290r110
$$ plain form
59382 583675 576566 570477 565101 560525 556958 554708 553877 553982 554301 554608 555202 556222 557349 558163 558393 557940
59366 557940 557150 556946 558051 560046 561832 563045 564399 566511 569171 572124 575910 581390 588721 597250 606256
59351 606256 615547 625463 636519 648958 662559 676952 691996 707628 723502 739176 754579 769801
59339 769801 784392 797312 807757 815673 821338 824783 825726 823732 818356 809517 797924 784858 771337
59326 771337 757633 743538 728828 713482 697737 682008 666569 651512 637269 624846 614972 607146
59314 607146 600162 593478 587456 582405 578280 575422 574705 576516 580334 585791 593536 604421 618081 632532
59300 632532 644776 651662 651058 643069 629996 614698 599060 584039 570439 558880 549241 540795 532998
59287 532998 525907 519998 515808 513560 512877 513006 513492 514407 515785 517304 518852 520956 524223 528636 533917
$$ packed form
59382E83675p109o089n376m576l567k250q31J05L19L07N94J020J127Q14K30m53
59366E57940p90k04J105J995J786J213J354K112K660K953L786N480P331Q529R006
59351F06256R291R916J1056J2439J3601J4393J5044J5632J5874J5674J5403J5222
59339G69801J4591J2920J0445P916N665L445R43j994n376q839j1593j3066j3521
59326G71337j3704j4095j4710j5346j5745j5729j5439j5057j4243j2423r874p826
59314F07146o984o684o022n051m125k858p17J811L818N457P745J0885J3660J4451
59300F32532J2244O886o04p989j3073j5298j5638j5021j3600j1559r639q446p797
59287E32998p091n909m190k248o83J29M86R15J378J519J548K104L267M413N281
$$ plain form
59272 533917 540353 548669 559066 570746 582508 593624 604196 614856 626036 637382 647924 656929
59260 656929 664319 670162 674034 675269 673697 669892 664766 659057 653083 646760 639952 632914 626243 620328
59246 620328 615085 610320 606105 602604 599845 597890 597009 597460 599297 602585 607498 613901 620961 627466 632596
59231 632596 636381 639532 642833 646426 649640 651706 652557 652585 651713 649320 645175 639829 633803 626944 618933
59216 618933 609925 600288 590163 579753 569667 560480 552186 544427 537021 529995 523505 518011 514031
59203 514031 511326 508812 505778 502705 500336 498530 496754 495270 494875 495689 497025 498368 499673 500770 501325
59188 501325 501528 502068 503252 504749 506357 508436 511345 514967 518994 523288 527771 532339 536953 541487 545558
59173 545558 548991 552387 556573 561489 566342 571005 576415 583174 590562 597557 604204 611141 618183 624287
$$ packed form
59272E33917O436Q316J0397J1680J1762J1116J0572J0660J1180J1346J0542R005
59260F56929P390N843L872J235j572l805n126n709n974o323o808p038o671n915
59246F20328n243m765m215l501k759j955q81M51J837L288M913O403P060O505N130
59231F32596L785L151L301L593L214K066Q51K8q72k393m145n346o026o859q011
59216F18933r008r637j0125j0410j0086r187q294p759p406p026o490n494l980
59203E14031k705k514l034l073k369j806j776j484l95Q14J336J343J305J097N55
59188E01325K03N40J184J497J608K079K909L622M027M294M483M568M614M534M071
59173E45558L433L396M186M916M853M663N410O759P388O995O647O937P042O104
$$ plain form
59159 624287 628890 632431 635307 636972 636526 633803 629427 623889 617042 608647 599131 589496 580499 572118
59145 572118 563834 555260 546436 537766 529856 523273 518142 513965 509971 505668 500982 495993 490817 485769
59131 485769 481435 478425 476974 476730 476905 476827 476437 476187 476408 477098 478459 481237 486044 492500 499525 506496
59115 506496 513709 521650 530277 539200 548184 557178 566073 574698 582986 590900 598289 605022 611234 617227
59101 617227 623090 628537 633185 636875 639598 641194 641354 640051 637808 635375 633172 631217 629520 628271
59087 628271 627644 627623 628015 628380 627954 626039 622645 618472 614077 609283 603585 596899 589725 582807 576845 572225
59071 572225 568691 565485 562074 558598 555376 552229 548667 544655 540797 537720 535432 533335 530786 527719
59057 527719 524680 522137 519869 517442 515174 513949 513834 513585 512053 509542 507227 505695 504774 504341 504401 504544
$$ packed form
59159F24287M603L541K876J665m46k723m376n538o847q395r516r635q997q381
59145E72118q284q574q824q670p910o583n131m177l994m303m686m989n176n048
59131D85769m334l010j451k44J75p8l90k50K21O90J361K778M807O456P025O971
59115E06496P213P941Q627Q923Q984Q994Q895Q625Q288P914P389O733O212N993
59101F17227N863N447M648L690K723J596J60j303k243k433k203j955j697j249
59087F28271o27k1L92L65m26j915l394m173m395m794n698o686p174o918n962m620
59071E72225l534l206l411l476l222l147l562m012l858l077k288k097k549l067
59057E27719l039k543k268k427k268j225j15k49j532k511k315j532r21m33O0J43
$$ plain form
59041 504544 504251 503764 503827 504389 504321 502788 500332 498281 497488 497924 499095 500485 501869 503485 505892 509572
59025 509572 514782 521636 529986 539247 548738 558336 568483 579557 591468 603833 616046 627137 636069
59012 636069 642384 646268 647901 647268 644780 641549 638570 635892 633015 629907 627228 625646 625299 626025 627884
58997 627884 631239 636326 642844 650108 657564 664934 671797 677456 681662 685209 689142 693340 696486 697627
58983 697627 697216 696300 695178 693456 691126 688965 687820 688004 689606 692977 698557 706266 715372 725054 734999
58968 734999 745381 756435 768188 780521 793216 805917 818259 830145 841717 852916 863267
58957 863267 872263 879801 886026 890800 893454 893074 888967 881000 869599 855434 839169 821634 804022
58944 804022 787430 772113 757580 743540 730286 718027 706440 695327 685278 677140 671061 666361
$$ packed form
59041E04544k93m87O3N62o8j533k456k051p93M36J171J390J384J616K407L680
59025E09572N210O854Q350R261R491R598J0147J1074J1911J2365J2213J1091Q932
59012F36069O315L884J633o33k488l231k979k678k877l108k679j582l47P26J859
58997F27884L355N087O518P264P456P370O863N659M206L547L933M198L146J141
58983F97627m11r16j122j722k330k161j145J84J602L371N580P709R106R682R945
58968G34999J0382J1054J1753J2333J2695J2701J2342J1886J1572J1199J0351
58957H63267Q996P538O225M774K654l80m107p967j1401j4165j6265j7535j7612
58944H04022j6592j5317j4533j4040j3254j2259j1587j1113j0049q138o079m700
$$ plain form
58932 666361 662116 657634 652801 648311 645190 643688 643036 642647 642894 644129 645615 646315 646282 646224 646039 644890
58916 644890 642701 640507 639147 638461 637979 637626 637533 637843 638890 640930 643607 646425 649898 655456 663940 674848
58900 674848 687299 700955 715639 730692 745280 758947 771621 783545 795482 808497 823236
58889 823236 839744 857996 878025 899398 921349 943672 966696 989974 1011724 1030203 1045090
58878 1045090 1056899 1065518 1070036 1069787 1064977 1056277 1044200 1028828 1010023 988040 964002 939498
58866 939498 915673 893076 872357 854441 839790 827984 818259 809939 802244 794417 786402 778781 771605
58853 771605 763953 755120 745646 736603 728374 720720 713523 706814 700442 694318 688671 683555 678446 672857
58839 672857 666935 660875 654249 646636 638506 630642 622996 615041 607052 600051 594429 589596 585285 582249
$$ packed form
58932F66361m245m482m833m490l121j502o52l89K47J235J486P00l3n8j85j149
58916F44890k189k194j360o86m82l53r3L10J047K040K677K818L473N558Q484J0908
58900F74848J2451J3656J4684J5053J4588J3667J2674J1924J1937J3015J4739
58889H23236J6508J8252K0029K1373K1951K2323K3024K3278K1750J8479J4887
58878A045090J1809Q619M518k49m810q700j2077j5372j8805k1983k4038k4504
58866I39498k3825k2597k0719j7916j4651j1806r725q320p695p827q015p621p176
58853G71605p652q833r474r043q229p654p197o709o372o124n647n116n109n589
58839F72857n922o060o626p613q130p864p646p955p989p001n622m833m311l036
$$ plain form
58825 582249 581151 581379 581714 581896 582957 586027 591168 597452 603837 609840 615578 621385 627480 633796 640005
58810 640005 645714 650710 654955 658315 660502 661411 661278 660222 657966 654362 650003 645730 641691 637426 632782
58795 632782 627999 622889 616672 608905 599940 590289 580284 570631 562500 556489 552031 548349 545581 544424
58781 544424 545080 547039 549628 552336 554882 557327 559915 562609 565126 567467 569835 571785 572185 570400 566913
58766 566913 562414 557024 551003 545457 541448 538735 536081 532555 528133 523523 519916 518333 518574 519309 519838
58751 519838 521084 524114 528353 532283 535391 538286 541242 543842 545958 547946 549835 551360 552929 555547
58737 555547 559498 563925 567965 571632 575352 579314 583533 587986 592453 596739 601144 606148 611596 616820
58723 616820 621722 626994 632934 638683 643114 646117 648598 651481 655125 659565 664985 671738 679850 688574
$$ packed form
58825E82249j098K28L35J82J061L070N141O284O385O003N738N807O095O316O209
58810F40005N709M996M245L360K187R09j33j056k256l604m359m273m039m265m644
58795F32782m783n110o217p767q965r651j0005r653q131o011m458l682k768j157
58781E44424O56J959K589K708K546K445K588K694K517K341K368J950M00j785l487
58766E66913m499n390o021n546m009k713k654l526m422m610l607j583K41P35N29
58751E19838J246L030M239L930L108K895K956K600K116J988J889J525J569K618
58737E55547L951M427M040L667L720L962M219M453M467M286M405N004N448N224
58723F16820M902N272N940N749M431L003K481K883L644M440N420O753Q112Q724
$$ plain form
58709 688574 696719 703619 709492 714642 718655 720732 720470 717833 712688 705067 695632 685166 673572 660055
58695 660055 644384 627443 610513 594489 579850 566810 555339 545348 536851 529666 523114 516525
58683 516525 509976 504048 498943 494356 490103 486287 482946 480176 478518 478483 479549 480402 480460 480624 482242 485828
58667 485828 491002 497178 504049 511776 520993 532300 545491 559507 573136 585423 595444 602278 605570
58654 605570 605765 603560 599311 593181 585589 577330 569363 562425 556620 551377 546065 540664 535635 531302
58640 531302 527705 524886 522802 521054 519241 517638 517021 517658 518963 520291 521684 523614 526294 529391 532164
58625 532164 533785 533862 532810 531514 530625 530414 531286 533991 539136 546640 555789 565669 575532 584900 593448
58610 593448 600854 606945 611988 616441 620198 622438 622582 621119 619128 617226 615357 613310 610885 607722
$$ packed form
58709F88574Q145O900N873N150M013K077k62k637n145p621r435j0466j1594j3517
58695F60055j5671j6941j6930j6024j4639j3040j1471r991q497p185o552o589
58683E16525o549n928n105m587m253l816l341k770j658l5J066Q53N8J64J618L586
58667D85828N174O176O871P727R217J1307J3191J4016J3629J2287J0021O834L292
58654F05570J95k205m249o130p592q259p967o938n805n243n312n401n029m333
58640E31302l597k819k084j748j813j603o17O37J305J328J393J930K680L097K773
58625E32164J621P7j052j296q89k11Q72K705N145P504R149R880R863R368Q548
58610E93448P406O091N043M453L757K240J44j463j991j902j869k047k425l163
$$ plain form
58596 607722 603510 598426 593062 588005 583705 580471 578239 576568 575250 574726 575611 578109 582184 587791 594474
58581 594474 601301 607858 614914 623389 633017 642713 651877 660518 668418 675201 681155 687180 693881 701431
58567 701431 710149 720428 732080 744526 757700 772102 788062 805628 825058 846542 869331 891858
58555 891858 912825 931627 947750 960438 969094 973570 974162 971726 967498 962234 955852 948512 941461
58542 941461 935889 931342 926241 919567 910996 899902 885776 869531 852977 836832 820576 804409
58530 804409 789945 778527 770025 763700 759217 756346 754721 754300 755242 757039 758682 759905 761224 762509
58516 762509 762665 761131 758575 755647 752139 747908 743614 739869 736505 733223 730183 727462 724649 721384
58502 721384 717604 713068 707594 702020 697810 695254 693109 690443 687763 685816 684460 683429 683039 683308 683381
$$ packed form
58596F07722m212n084n364n057m300l234k232j671j318n24Q85K498M075N607O683
58581E94474O827O557P056Q475R628R696R164Q641P900O783N954O025O701P550
58567G01431Q718J0279J1652J2446J3174J4402J5960J7566J9430K1484K2789K2527
58555H91858K0967J8802J6123J2688Q656M476N92k436m228n264o382p340p051
58542I41461n572m547n101o674q571j1094j4126j6245j6554j6145j6256j6167
58530H04409j4464j1418q502o325m483k871j625m21R42J797J643J223J319J285
58516G62509J56j534k556k928l508m231m294l745l364l282l040k721k813l265
58502G21384l780m536n474n574m210k556k145k666k680j947j356j031l90K69P3
$$ plain form
58487 683381 682749 682240 682907 684734 687210 690422 694670 699691 705182 711647 719919 730215 742215 755528
58473 755528 769492 782920 794631 803812 809656 811343 808921 803600 796737 789048 781045 773356 766250
58460 766250 759692 754288 751292 751134 752813 755313 758800 763934 770836 779299 789084 799386 808810 816491
58446 816491 822445 826379 827188 824354 818974 812737 806650 801191 796668 792754 788690 784702 782237 782106 783470
58431 783470 785366 788045 791899 796285 800596 805555 812232 820451 829188 837852 846320 854418 862183 869808
58417 869808 876522 880495 880789 878501 875114 870663 864588 857372 850129 843346 837066 831494 826355 820552
58403 820552 813587 806518 800480 795237 790314 786527 784961 785244 786229 787726 790210 793469 796893 800518 804541
58388 804541 808329 811119 813195 815222 817081 818439 819803 821770 823833 825162 826000 827206 829029 831340
$$ packed form
58487F83381o32n09O67J827K476L212M248N021N491O465Q272J0296J2000J3313
58473G55528J3964J3428J1711R181N844J687k422n321o863p689q003p689p106
58460G66250o558n404k996j58J679K500L487N134O902Q463R785J0302R424P681
58446H16491N954L934Q09k834n380o237o087n459m523l914m064l988k465j31J364
58431G83470J896K679L854M386M311M959O677Q219Q737Q664Q468Q098P765P625
58417H69808O714L973K94k288l387m451o075p216p243o783o280n572n139n803
58403H20552o965p069o038n243m923l787j566K83R85J497K484L259L424L625M023
58388H04541L788K790K076K027J859J358J364J967K063J329Q38J206J823K311
$$ plain form
58374 831340 834440 838561 843342 848718 855389 863422 871565 879174 887565 897851 908637 917639 924736 931628
58360 931628 939370 948125 958579 971449 985847 999843 1012456 1023706 1033262 1040606 1046111 1050448 1053492
58347 1053492 1055245 1057101 1060585 1065408 1070416 1075715 1082216 1089830 1097939 1107002 1117763 1129547 1141316
58334 1141316 1153810 1168557 1185243 1202145 1218768 1235920 1253479 1270298 1286132 1301508 1315710
58323 1315710 1326981 1334899 1340716 1345320 1348680 1351346 1354624 1359065 1364254 1370117 1377003 1384713 1392902 1402104
58309 1402104 1412891 1424501 1435963 1447946 1461713 1476816 1491782 1506547 1522229 1539010 1556285
58298 1556285 1574422 1594256 1615210 1635940 1656413 1677344 1698289 1718498 1738993 1761383 1785164
58287 1785164 1808640 1831959 1856669 1882777 1908992 1935512 1963767 1993571 2023296 2052900 2084182
$$ packed form
58374H31340L100M121M781N376O671Q033Q143P609Q391J0286J0786R002P097O892
58360I31628P742Q755J0454J2870J4398J3996J2613J1250R556P344N505M337L044
58347A053492J753J856L484M823N008N299O501P614Q109R063J0761J1784J1769
58334A141316J2494J4747J6686J6902J6623J7152J7559J6819J5834J5376J4202
58323A315710J1271P918N817M604L360K666L278M441N189N863O886P710Q189R202
58309A402104J0787J1610J1462J1983J3767J5103J4966J4765J5682J6781J7275
58298A556285J8137J9834K0954K0730K0473K0931K0945K0209K0495K2390K3781
58287A785164K3476K3319K4710K6108K6215K6520K8255K9804K9725K9604L1282
$$ plain form
58276 2084182 2118077 2154087 2192156 2232545 2274132 2315414 2356962 2400489 2445992 2492420 2540470
58265 2540470 2591799 2646083 2701812 2759305 2819822 2882490 2945554 3009937 3077908 3148863 3220254
58254 3220254 3292056 3366209 3442125 3517225 3591856 3669323 3750982 3835639 3923873 4018419 4119919
58243 4119919 4226668 4338874 4458754 4586181 4718785 4856799 5003362 5159828 5325285
58234 5325285 5500649 5688337 5887919 6097245 6317782 6553467 6804624 7069011 7348796
58225 7348796 7650019 7975039 8322304 8693947 9096426 9533002 10002977 10509334 11059660
58216 11059660 11658724 12308120 13014421 13789721 14643375 15581932 16618133 17770744 19054820
58207 19054820 20482462 22074729 23863443 25882691 28172943 30796497 33837872 37391027
$$ packed form
58276B084182L3895L6010L8069M0389M1587M1282M1548M3527M5503M6428M8050
58265B540470N1329N4284N5729N7493O0517O2668O3064O4383O7971P0955P1391
58254C220254P1802P4153P5916P5100P4631P7467Q1659Q4657Q8234R4546J01500
58243D119919J06749J12206J19880J27427J32604J38014J46563J56466J65457
58234E325285J75364J87688J99582K09326K20537K35685K51157K64387K79785
58225G348796L01223L25020L47265L71643M02479M36576M69975N06357N50326
58216A1059660N99064O49396P06301P75300Q53654R38557J036201J152611J284076
58207A9054820J427642J592267J788714K019248K290252K623554L041375L553155
$$ plain form
58199 37391027 41564358 46502972 52394521 59458659 67953444 78189960 90512267 105261887
58191 105261887 122796423 143554944 168087257 197027825 231015111 270358468 314193679
58184 314193679 359411082 400378357 430314953 443856364 439163654 418239747 385580348
58177 385580348 346347663 305068676 265066792 228385634 195982306 168051101 144340066
58170 144340066 124374423 107601824 93495063 81603555 71550898 63019501 55750689
58163 55750689 49541251 44222208 39643532 35679993 32235680 29231442 26594538 24265027
58155 24265027 22201349 20371062 18741980 17286531 15986018 14823711 13779446 12835746
58147 12835746 11983082 11214125 10518027 9884254 9306384 8777822 8288765 7831445 7403934
$$ packed form
58199C7391027M173331M938614N891549P064138Q494785J0236516J2322307J4749620
58191A05261887J7534536K0758521K4532313K8940568L3987286L9343357M3835211
58184C14193679M5217403M0967275K9936596J3541411m692710k0923907l2659399
58177C85580348l9232685m1278987m0001884l6681158l2403328k7931205k3711035
58170A44340066j9965643j6772599j4106761j1891508j0052657q531397p268812
58163E5750689o209438n319043m578676l963539l444313l004238k636904k329511
58155B4265027k063678j830287j629082j455449j300513j162307j044265r43700
58147A2835746q52664p68957o96098o33773n77870n28562m89057m57320m27511
$$ plain form
58138 7403934 7005476 6632637 6283204 5959018 5661187 5386360 5130805 4894203 4676399
58129 4676399 4474281 4284897 4108166 3943740 3788726 3641182 3502529 3373843 3252992
58120 3252992 3137819 3028905 2926760 2829479 2735732 2646957 2564130 2485273 2408664 2335668 2267865
58109 2267865 2203984 2142158 2082761 2026592 1972527 1919388 1868115 1819888 1773997 1729459 1686804
58098 1686804 1646383 1606949 1567696 1529840 1494485 1460848 1428199 1397492 1369380 1342554 1315760
58087 1315760 1289664 1265205 1241972 1219698 1199290 1180754 1162041 1141613 1120362 1099514 1078649
58076 1078649 1057409 1037096 1018681 1001021 982861 964918 948188 931965 915455 899710 885961
58065 885961 873391 860439 847091 834199 821840 810022 799687 791293 783531 775030 766118 757428
$$ packed form
58138G403934l98458l72839l49433l24186k97831k74827k55555k36602k17804
58129D676399k02118j89384j76731j64426j55014j47544j38653j28686j20851
58120C252992j15173j08914j02145r7281r3747q8775q2827p8857p6609p2996o7803
58109B267865o3881o1826n9397n6169n4065n3139n1273m8227m5891m4538m2655
58098A686804m0421l9434l9253l7856l5355l3637l2649l0707k8112k6826k6794
58087A315760k6096k4459k3233k2274k0408j8536j8713k0428k1251k0848k0865
58076A078649k1240k0313j8415j7660j8160j7943j6730j6223j6510j5745j3749
58065H85961j2570j2952j3348j2892j2359j1818j0335q394p762q501q912q690
$$ plain form
58053 757428 748185 737580 726565 716493 707165 697974 689759 683508 678238 672128 665077 658282 651974
58040 651974 645420 638622 632195 625875 618762 610904 603243 596150 589223 582360 575948 570073 564366 558390
58026 558390 551644 543745 535157 527045 519762 512384 504432 496962 490985 485869 480485 475016 470294 466101
58012 466101 461514 456494 451931 448398 445814 444022 442859 442015 441470 441556 442035 441857 440526 438930 438076 437822
57996 437822 437665 437870 438822 440059 440924 441445 441580 440368 437035 432427 428266 425349 423313 421716 420403 419188
57980 419188 417927 416570 414644 411256 406267 400785 395955 391870 388214 385023 382103 378662 374481 370760
57966 370760 368856 368703 369183 369413 369051 368182 367603 368433 370700 373162 375001 376617 378124 378544 377528 376450
57950 376450 376407 376339 374682 371889 369637 368275 366769 364666 362523 360792 359719 360012 362227 365751 369661
$$ packed form
58053G57428r243j0605j1015j0072r328r191q215o251n270o110p051o795o308
58040F51974o554o798o427o320p113p858p661p093o927o863o412n875n707n976
58026E58390o746p899q588q112p283p378p952p470n977n116n384n469m722m193
58012D66101m587n020m563l533k584j792j163q44n45Q6M79j78j331j596q54k54
57996D37822j57K05R52J237Q65N21J35j212l333m608m161k917k036j597j313j215
57980D19188j261j357j926l388m989n482m830m085l656l191k920l441m181l721
57966C70760j904j53M80K30l62q69n79Q30K267K462J839J616J507M20j016j078
57950C76450m3o8j657k793k252j362j506k103k143j731j073K93K215L524L910
$$ plain form
57935 369661 374228 380271 387396 394310 400689 407401 414828 422141 428234 432455 434536 434689 433572 431418
57921 431418 427611 421910 415454 409474 403712 397313 390694 385039 380403 375902 371609 368687 367641 367864
57907 367864 368960 371152 374247 377555 381115 385690 391149 395900 398431 398614 397152 394579 391181 387332
57893 387332 383533 380364 378263 376969 375488 373167 370414 367783 364976 361606 358345 356074 354377 352160
57879 352160 349493 347457 346266 344974 343095 341174 339462 337362 334581 331709 329160 326521 323471 320499
57865 320499 318212 316593 315327 314310 313596 313419 314448 317409 322240 328073 334073 339786 344822 348988 352764
57850 352764 356908 361498 365937 369794 372922 374913 375321 374402 372785 370427 366825 362227 357656 353570 349442
57835 349442 344849 340091 335501 330997 326605 322631 319043 315396 311646 308365 305976 304412 303624 303699 304338
$$ packed form
57935C69661M567O043P125O914O379O712P427P313O093M221K081J53j117k154
57921D31418l807n701o456n980n762o399o619n655m636m501m293k922j046K23
57907C67864J096K192L095L308L560M575N459M751K531J83j462k573l398l849
57893C87332l799l169k101j294j481k321k753k631k807l370l261k271j697k217
57879C52160k667k036j191j292j879j921j712k100k781k872k549k639l050k972
57865C20499k287j619j266j017p14j77J029K961M831N833O000N713N036M166L776
57850C52764M144M590M439L857L128J991M08r19j617k358l602m598m571m086m128
57835C49442m593m758m590m504m392l974l588l647l750l281k389j564p88P5O39
$$ plain form
57820 304338 305013 305791 307288 309652 312263 314458 315736 315257 312180 306824 300601 294466 288256 281743 275389
57805 275389 269657 264483 259937 256583 254592 253165 251437 249500 248131 247999 249358 251947 254853 257105
57791 257105 258722 260621 263263 266123 268778 271702 275420 279566 283439 287012 290790 294995 299399 303748
57777 303748 308037 312560 317863 324254 331215 337667 342934 347035 350003 351602 351847 351125 349514 346599 342281
57762 342281 337164 331831 326263 320291 314024 307593 301113 295197 290820 288246 286756 285926 286539 289624 295084
57747 295084 301886 309202 316721 324087 330652 335814 339361 341610 343346 345284 347441 349291 350586 351577
57733 351577 352391 352836 353086 353888 355686 358017 360096 361476 361857 360951 359128 357581 357160 357367 357126 356244 355431
57716 355431 355003 354286 352401 349232 345397 341494 337557 333266 328624 324135 320095 316018 311231 305920 301014
$$ packed form
57820C04338O75P78J497K364K611K195J278m79l077n356o223o135o210o513o354
57805B75389n732n174m546l354j991j427j728j937j369j32J359K589K906K252
57791B57105J617J899K642K860K655K924L718M146L873L573L778M205M404M349
57777C03748M289M523N303O391O961O452N267M101K968J599K45p22j611k915m318
57762C42281n117n333n568n972o267o431o480n916m377k574j490q30O13L085N460
57747B95084O802P316P519P366O565N162L547K249J736J938K157J850J295R91
57733C51577Q14M45K50Q02J798K331K079J380L81r06j823j547m21K07k41q82q13
57716C55431m28p17j885l169l835l903l937m291m642m489m040m077m787n311m906
$$ plain form
57701 301014 297159 294417 292885 292750 293568 294345 294762 295541 297127 298662 298804 297093 293934 289776 284919 279832
57685 279832 275040 270804 267254 264576 262782 261605 260991 261486 263813 268321 275062 284139 295705 309955
57671 309955 327358 348637 374398 405252 442381 487181 539462 595755 649446 692565 718113
57660 718113 722263 705640 672694 629512 581910 534692 491264 453132 420230 392124 368613 349182
57648 349182 332821 318936 307783 299375 292644 286350 280409 275611 272375 270378 269111 268195 267315 266411
57634 266411 265800 265752 266127 266663 267254 267641 267340 266295 265151 264394 263647 262314 260547 258967 257767 256625 255287
57617 255287 253750 252087 250602 249875 250221 251207 252008 252051 251124 249336 247250 245555 244227 242520 240184 238037
57601 238037 236789 235994 234899 233725 233113 232708 231333 228593 225410 222889 221288 220200 219189 218108 217146
$$ packed form
57701C01014l855k742j532j35Q18P77M17P79J586J535J42j711l159m158m857n087
57685B79832m792m236l550k678j794j177o14M95K327M508O741R077J1566J4250
57671C09955J7403K1279K5761L0854L7129M4800N2281N6293N3691M3119K5548
57660G18113M150j6623l2946m3182m7602m7218m3428l8132l2902k8106k3511j9431
57648C49182j6361j3885j1153q408o731o294n941m798l236j997j267r16q80r04
57634B66411o11m8L75N36N91L87l01j045j144p57p47j333j767j580j200j142j338
57617B55287j537j663j485p27L46R86Q01M3r27j788k086j695j328j707k336k147
57601B38037j248p95j095j174o12m05j375k740l183k521j601j088j011j081r62
$$ plain form
57586 217146 216598 216430 216210 215611 214650 213252 211131 208524 206441 205567 205346 204795 203765 202713 201642 200105
57570 200105 198020 195756 193596 191789 190831 190901 191198 190668 189332 188224 188072 188701 189589 190292 190368 189617 188485
57553 188485 187717 187633 188135 189179 190639 192017 192964 193818 194936 195867 196106 196342 197820 200468 202811 203972
57537 203972 204737 206277 208722 211426 213879 215828 217003 217235 216649 215618 214746 214772 215978 217759 219395 221140
57521 221140 223869 227701 231787 235477 238799 241672 243640 244721 245709 247152 248762 250269 252071 254489
57507 254489 256999 258782 259537 259292 257962 255732 253458 252036 251520 251297 250890 250182 249094 247526 245561 243458
57491 243458 241484 239875 238694 237598 236005 233721 231163 228834 226948 225680 225316 225853 226767 227541 228243
57476 228243 229266 230772 232621 234639 236604 238140 238942 239121 239225 239902 241511 243866 246311 248207 249391
$$ packed form
57586B17146n48j68k20n99r61j398k121k607k083q74k21n51j030j052j071j537
57570B00105k085k264k160j807r58P0K97n30j336j108j52O29Q88P03P6p51j132
57553A88485p68q4N02J044J460J378R47Q54J118R31K39K36J478K648K343J161
57537B03972P65J540K445K704K453J949J175K32n86j031q72K6J206J781J636J745
57521B21140K729L832M086L690L322K873J968J081R88J443J610J507J802K418
57507B54489K510J783P55k45j330k230k274j422n16k23m07p08j088j568j965k103
57491B43458j974j609j181j096j593k284k558k329j886j268l64N37R14P74P02
57476B28243J023J506J849K018J965J536Q02J79J04O77J609K355K445J896J184
$$ plain form
57461 249391 250068 250428 250575 250657 250650 250161 248925 247458 246692 246923 247642 248436 249419 250612 251527 251755 251558 251497 251879
57442 251879 252839 254578 257067 259754 261986 263640 265059 266471 267716 268568 269211 270297 272336 274946 277004
57427 277004 277860 278145 278978 280640 282607 284553 286531 288204 288877 288504 287939 287844 288014 288020 287897 287871 288091 288955
57409 288955 291027 294164 297333 299728 301490 302902 303640 303463 303046 303341 304487 306000 307655 309468 311163
57394 311163 312449 313679 315521 318065 320831 323573 326432 329329 331858 333863 335679 337739 340315 343544
57380 343544 347283 350924 353826 356071 358506 361985 366731 372313 377921 382778 386688 390163 393778 397449
57366 397449 400671 403288 405669 408124 410573 412794 414697 416312 417817 419618 422121 425365 429028 432761
57352 432761 436356 439700 442914 446472 450837 455864 460777 464862 468100 471122 474647 478893 483392 487425
$$ packed form
57461B49391O77L60J47Q2pm89j236j467p66K31P19P94R83J193R15K28j97o1L82
57442B51879R60J739K489K687K232J654J419J412J245Q52O43J086K039K610K058
57427B77004Q56K85Q33J662J967J946J978J673O73l73n65r5J70Oj23k6K20Q64
57409B88955K072L137L169K395J762J412P38j77m17K95J146J513J655J813J695
57394C11163J286J230J842K544K766K742K859K897K529K005J816K060K576L229
57380C43544L739L641K902K245K435L479M746N582N608M857L910L475L615L671
57366C97449L222K617K381K455K449K221J903J615J505J801K503L244L663L733
57352D32761L595L344L214L558M365N027M913M085L238L022L525M246M499M033
$$ plain form
57338 487425 490783 494003 497769 502222 506974 511602 515932 520000 524033 528374 533166 538166 543060 547891
57324 547891 553027 558742 564948 571168 576735 581272 585189 589447 594593 600244 605773 611128 616577 622020
57310 622020 627176 632329 638240 645184 652566 659595 665959 671767 677328 683197 690037 698073 706896 716018
57296 716018 725431 735374 745742 756051 765913 775278 784223 792756 800986 809333 818330 828135 838320
57283 838320 848271 857707 866692 875171 882783 889238 894648 899354 903646 907856 912538 918124 924382 930517
57269 930517 935909 940631 945204 950131 955799 962587 970724 980046 990172 1001012 1012848 1025707 1038894
57256 1038894 1051586 1063890 1076834 1091079 1106063 1120801 1135139 1149662 1164617 1179675 1194768
57245 1194768 1210396 1226776 1243230 1258887 1273683 1288338 1303578 1319635 1336238 1352790 1368793
$$ packed form
57338D87425L358L220L766M453M752M628M330M068M033M341M792N000M894M831
57324E47891N136N715O206O220N567M537L917M258N146N651N529N355N449N443
57310F22020N156N153N911O944P382P029O364N808N561N869O840Q036Q823R122
57296G16018R413R943J0368J0309R862R365Q945Q533Q230Q347Q997R805J0185
57283H38320R951R436Q985Q479P612O455N410M706M292M210M682N586O258O135
57269I30517N392M722M573M927N668O788Q137R322J0126J0840J1836J2859J3187
57256A038894J2692J2304J2944J4245J4984J4738J4338J4523J4955J5058J5093
57245A194768J5628J6380J6454J5657J4796J4655J5240J6057J6603J6552J6003
$$ plain form
57234 1368793 1384402 1400391 1417287 1434758 1452032 1468701 1484888 1500943 1517294 1534342 1552085
57223 1552085 1569996 1587600 1604987 1622452 1639874 1656971 1674054 1692046 1711634 1732592 1753930
57212 1753930 1774444 1793306 1810549 1827070 1843904 1861465 1879672 1898618 1918646 1939702 1961033
57201 1961033 1981773 2001686 2021229 2041068 2061628 2082987 2105032 2127636 2150643 2173705 2196365
57190 2196365 2218459 2240284 2262201 2284184 2305988 2327601 2349289 2371293 2393796 2417084 2441357
57179 2441357 2466263 2490868 2514266 2536164 2556895 2577036 2597021 2616873 2636179 2654364 2671126
57168 2671126 2686635 2701405 2715946 2730429 2744570 2758006 2770882 2783980 2798026 2812954 2828083
57157 2828083 2843045 2858357 2874944 2893181 2912486 2931889 2950979 2970170 2989963 3010090 3029653
$$ packed form
57234A368793J5609J5989J6896J7471J7274J6669J6187J6055J6351J7048J7743
57223A552085J7911J7604J7387J7465J7422J7097J7083J7992J9588K0958K1338
57212A753930K0514J8862J7243J6521J6834J7561J8207J8946K0028K1056K1331
57201A961033K0740J9913J9543J9839K0560K1359K2045K2604K3007K3062K2660
57190B196365K2094K1825K1917K1983K1804K1613K1688K2004K2503K3288K4273
57179B441357K4906K4605K3398K1898K0731K0141J9985J9852J9306J8185J6762
57168B671126J5509J4770J4541J4483J4141J3436J2876J3098J4046J4928J5129
57157B828083J4962J5312J6587J8237J9305J9403J9090J9191J9793K0127J9563
$$ plain form
57146 3029653 3048072 3065556 3082440 3098395 3112610 3124615 3134616 3143023 3149940 3155205 3158784 3160989
57134 3160989 3162279 3162862 3162549 3161108 3158810 3156499 3155083 3155087 3156786 3160618 3167233 3177079 3190032 3205531 3223223
57119 3223223 3243467 3267131 3294789 3326179 3360527 3397344 3436960 3480593 3530034 3587039 3652739
57108 3652739 3727802 3813283 3911076 4023449 4152804 4302568 4478251 4687221 4937818 5239332
57098 5239332 5602860 6041855 6572114 7211754 7980745 8899323 9985814 11254607 12713809
57089 12713809 14362462 16189316 18174241 20290193 22503653 24775145 27060848 29311776
57081 29311776 31468920 33461878 35218774 36680405 37802553 38544753 38863900 38725966
57073 38725966 38124573 37086259 35660241 33907508 31897774 29708205 27417400 25097678
$$ packed form
57146C029653J8419J7484J6884J5955J4215J2005J0001Q407O917N265L579K205
57134C160989J290N83l13j441k298k311j416MJ699L832O615R846J2953J5499J7692
57119C223223K0244K3664K7658L1390L4348L6817L9616M3633M9441N7005O5700
57108C652739P5063Q5481R7793J12373J29355J49764J75683K08970K50597L01514
57098E239332L63528M38995N30259O39640P68991R18578J086491J268793J459202
57089A2713809J648653J826854J984925K115952K213460K271492K285703K250928
57081B9311776K157144J992958J756896J461631J122148P42200L19147j37934
57073C8725966o01393j038314j426018j752733k009734k189569k290805k319722
$$ plain form
57065 25097678 22810829 20606638 18521664 16579222 14791780 13163870 11693728 10374886
57057 10374886 9198765 8156499 7238569 6433874 5730265 5115949 4580211 4113359 3706562
57048 3706562 3351656 3041185 2768950 2530329 2321437 2138081 1976136 1832678 1705795
57039 1705795 1593318 1492704 1402265 1321597 1250579 1188881 1136765 1095706 1067806 1054545 1054985
57028 1054985 1063505 1069393 1060833 1031019 980745 915722 842673 767688 695710 629601 570029 516946
57016 516946 470639 430952 396629 366410 340128 317991 299461 283615 270029 258521 248575 239766
57004 239766 232268 226228 221056 215959 210765 205629 200398 194888 189378 184249 179526 175262 171873 169559
56990 169559 167937 166789 166623 167909 170416 174032 179574 187793 197971 208415 217956 226033 231591 233039
$$ packed form
57065B5097678k286849k204191k084974j942442j787442j627910j470142j318842
57057A0374886j176121j042266r17930q04695p03609o14316n35738m66852m06797
57048C706562l54906l10471k72235k38621k08892j83356j61945j43458j26883
57039A705795j12477j00614r0439q0668p1018o1698n2116m1059k7900j3261M40
57028A054985Q520N888q560k9814n0274o5023p3049p4985p1978o6109n9572n3083
57016E16946m6307l9687l4323l0219k6282k2137j8530j5846j3586j1508r946q809
57004B39766p498o040n172n097n194n136n231n510n510n129m723m264l389k314
56990A69559j622j148j66J286K507L616N542Q219J0178J0444R541Q077N558J448
$$ plain form
56976 233039 229517 221514 210267 197194 183804 171312 160002 149480 139716 131471 125680 122778 122661
56963 122661 124898 128947 134467 141559 150617 162039 176165 193112 212264 231916 249549 262448
56951 262448 268288 265906 255952 240518 221850 201665 181621 163565 148685 136892 127548 120455
56939 120455 115794 113668 114274 118015 124940 134576 146920 162972 183552 207968 234486 261425 286722
56926 286722 306922 318064 318029 307558 289151 265723 240068 214436 190099 167747 148194 132033
56914 132033 118643 106503 94797 84092 75209 68063 61941 56334 51052 45935 40938 36350 32627
56901 32627 30037 28548 27926 27868 28179 28894 30184 32196 35057 38893 43764 49781 57407 67365 80064
56886 80064 95409 113306 133797 156221 178576 198210 213045 221967 224631 221625 214634 205770 196662
$$ packed form
56976B33039l522q003j1247j3073j3390j2492j1310j0522r764q245n791k902j17
56963A22661K237M049N520P092R058J1422J4126J6947J9152J9652J7633J2899
56951B62448N840k382r954j5434j8668k0185k0044j8056j4880j1793r344p093
56939A20455m661k126O06L741O925R636J2344J6052K0580K4416K6518K6939K5297
56926B86722K0200J1142l5j0471j8407k3428k5655k5632k4337k2352j9553j6161
56914A32033j3390j2140j1706j0705q883p146o122n607n282n117m997m588l723
56901C2627k590j489o22n8L11P15J290K012K861L836M871O017P626R958J2699
56886H0064J5345J7897K0491K2424K2355J9634J4835Q922K664l006o991q864r108
$$ plain form
56873 196662 188393 181903 177843 176281 177148 180925 188386 199833 215151 234468 258232 286779 320476
56860 320476 360260 407252 461298 519669 576867 625610 658929 672679 666801 644435 610228 569474
56848 569474 527576 488769 455090 427119 405505 391172 384458 385167 393468 409854 434209 465928
56836 465928 505347 554304 614880 687949 772592 865387 959029 1042062 1101457 1127240 1116319
56825 1116319 1073207 1007335 929012 846836 767450 695821 634585 583765 542288 509806 486500
56814 486500 471818 464710 465041 473593 490717 516197 550635 595586 651427 715399 781566 841687
56802 841687 886311 907215 900772 869235 818609 755792 687519 620136 558405 504399 458191 419504
56790 419504 388269 364133 346356 334301 327708 326622 331343 342189 358956 380809 406919 436689
$$ packed form
56873A96662q269o490m060j562Q67L777P461J1447J5318J9317K3764K8547L3697
56860C20476L9784M6992N4046N8371N7198M8743L3319J3750n878k2366l4207m0754
56848E69474m1898l8807l3679k7971k1614j4333o714P09Q301J6386K4355L1719
56836D65928L9419M8957O0576P3069Q4643R2795R3642Q3033N9395K5783j0921
56825A116319m3112o5872p8323q2176p9386p1629o1236n0820m1477l2482k3306
56814D86500j4682p108L31Q552J7124K5480L4438M4951N5841O3972O6167O0121
56802H41687M4624K0904o443l1537n0626o2817o8273o7383o1731n4006m6208l8687
56790D19504l1235k4136j7777j2055o593j086M721J0846J6767K1853K6110K9770
$$ plain form
56778 436689 468753 499778 524655 538149 536844 520420 491654 454993 414660 373771 334655 299065
56766 299065 267777 240569 216943 196572 178953 163302 149211 136966 126832 118441 111169 104696
56754 104696 98864 93413 88248 83604 79633 76137 72951 70120 67468 64550 61396 58724 56971 55630
56740 55630 54109 52702 51999 51732 50991 49442 47690 46471 45992 46035 46271 46488 46815 47594 48760 49583 49440
56723 49440 48631 48023 48071 48578 49234 49907 50487 50908 51286 51660 51652 50886 49742 49229 49941 51455 52945 54155 55512
56704 55512 57346 59247 60349 60229 59300 58142 56674 54376 51254 48099 45653 43939 42646 41690 41067
56689 41067 40486 39669 38864 38638 39128 39784 39950 39584 39320 39805 40925 41852 42008 41817 42162 43280 44649 45990
56671 45990 47716 50172 52992 55611 58044 60690 63589 66304 68508 70427 72585 75212 77930 80148
$$ packed form
56778D36689L2064L1025K4877J3494j305j6424k8766l6661m0333m0889l9116l5590
56766B99065l1288k7208k3626k0371j7619j5651j4091j2245j0134q391p272o473
56754A04696n832n451n165m644l971l496l186k831k652k918l154k672j753j341
56740E5630j521j407p03k67p41j549j752j219m79M3K36K17L27P79J166Q23j43
56723D9440q09o08M8N07O56O73N80M21L78L74qp66j144n13P12J514J490J210J357
56704E5512J834J901J102j20r29j158j468k298l122l155k446j714j293r56o23
56689D1067n81q17q05k26M90O56J66l66k64M85J120R27J56j91L45J118J369J341
56671D5990J726K456K820K619K433K646K899K715K204J919K158K627K718K218
$$ plain form
56657 80148 81802 83433 85337 87060 88219 89417 91605 94781 98206 101769 106065 110979 115325 118345
56643 118345 120545 122566 124225 125413 126999 129845 133532 136978 139710 141640 142089 140298 136767 133073
56629 133073 130362 128747 128085 128412 129444 130458 130972 131062 130922 130538 129902 129031 127697 125594 122898 120277
56613 120277 118250 116835 115812 114948 113984 112833 111922 111928 112970 114266 114732 113833 111889 109739 108132 107240
56597 107240 106685 106045 105265 104525 103937 103487 103117 102736 102314 102028 102051 102138 101796 101030 100504 100713 101418 102241 103323
56578 103323 104910 106572 107460 107289 106648 106383 106992 108483 110524 112711 114918 117299 119938 122763 125884
56563 125884 129577 133745 137877 141896 146551 152496 159363 166179 172321 177516 181296 183233 183663 183562 183627
56548 183627 183837 183860 183539 183006 182590 182544 182630 182187 180843 178990 177334 176194 175444 174772 173738 171962 169619
$$ packed form
56657H0148J654J631J904J723J159J198K188L176L425L563M296M914M346L020
56643A18345K200K021J659J188J586K846L687L446K732J930M49j791l531l694
56629A33073k711j615o62L27J032J014N14R0j40l84o36q71j334k103k696k621
56613A20277k027j415j023q64r64j151r11OJ042J296M66q99j944k150j607q92
56597A07240n55o40p80p40n88m50l70l81m22k86K3Q7l42p66n26K09P05Q23J082
56578A03323J587J662Q88j71o41k65O09J491K041K187K207K381K639K825L121
56563A25884L693M168M132M019M655N945O867O816O142N195L780J937M30j01O5
56548A83627K10K3l21n33m16m6Q6m43j344j853j656j140p50o72j034j776k343
$$ plain form
56531 169619 167461 166030 165185 164648 164494 164704 164727 164044 162802 161407 159912 158251 156653 155275 153847 152243
56515 152243 150938 150278 149767 148816 147754 147255 147141 146615 145483 144298 143420 142813 142616 143067 143805 144064 143643
56498 143643 143088 142907 143181 143796 144407 144271 142935 141122 140134 140273 140553 140078 139015 138007 137351 137079 137265
56481 137265 137872 138585 139153 139677 140406 141394 142439 143247 143666 143810 143862 143742 143287 142808 142942 143770 144662 145283 146071
56462 146071 147317 148514 149270 150098 151513 153058 154130 155120 156596 157956 158165 157476 157142 157603 158263 158907
56446 158907 159950 161147 161412 160337 158876 158136 158359 159322 160806 162358 163386 163871 164350 165097 165901 166657
56430 166657 167393 167820 167681 167465 167757 168001 167061 165128 163797 163953 164767 165176 165253 165577 166331 167615 169692 172224
56412 172224 174027 174279 173410 172347 171495 170842 170387 169968 169294 168554 168385 168899 169366 169181 168477 167525 166304 165006
$$ packed form
56531A69619k158j431q45n37j54K10K3o83j242j395j495j661j598j378j428j604
56515A52243j305o60n11r51j062m99j14n26j132j185q78o07j97M51P38K59m21
56498A43643n55j81K74O15O11j36j336j813r88J39K80m75j063j008o56k72J86
56481A37265O07P13N68N24P29R88J045Q08M19J44N2j20m55m79J34Q28Q92O21P88
56462A46071J246J197P56Q28J415J545J072R90J476J360K09o89l34M61O60O44
56446A58907J043J197K65j075j461p40K23R63J484J552J028M85M79P47Q04P56
56430A66657P36M27j39k16K92K44r40j933j331J56Q14M09P7L24P54J284K077K532
56412A72224J803K52q69j063q52o53m55m19o74p40j69N14M67j85p04r52j221j298
$$ plain form
56394 165006 164160 163814 163290 162198 160988 160093 159240 158055 156699 155465 154399 153637 153374 153112 151827 149511
56378 149511 147861 148858 153119 159998 168502 177498 185746 192531 197985 202443 205930 208556 210742 212699
56364 212699 214267 215560 217013 218518 219363 219435 219581 220307 221053 221394 221968 223382 225083 226250 227105 228312
56348 228312 229627 230247 230161 230162 230662 231344 231934 232609 233596 234892 236363 237777 238835 239494 240200 241634 244300
56331 244300 248274 253011 257519 261264 264799 268802 272628 274820 275209 275379 276694 278863 280927 282574 283855
56316 283855 284574 284834 285417 286823 288523 289837 290946 292414 294341 296624 299387 302551 305561 308177 310894
56301 310894 314076 317416 320832 325041 330479 336375 341656 346124 350058 353406 356195 359050 362500 366357
56287 366357 370456 375277 381092 387332 393670 400921 409834 419669 429030 437577 445940 454486 463280 472795
$$ packed form
56394A65006q46l46n24j092j210q95q53j185j356j234j066p62k63k62j285k316
56378A49511j650R97M261O879Q504Q996Q248O785N454M458L487K626K186J957
56364B12699J568J293J453J505Q45P2J46P26P46L41N74J414J701J167Q55J207
56348B28312J315O20q6JN00O82N90O75R87J296J471J414J058O59P06J434K666
56331B44300L974M737M508L745L535M003L826K192L89J70J315K169K064J647J281
56316B83855P19K60N83J406J700J314J109J468J927K283K763L164L010K616K717
56301C10894L182L340L416M209N438N896N281M468L934L348K789K855L450L857
56287C66357M099M821N815O240O338P251Q913R835R361Q547Q363Q546Q794R515
$$ plain form
56273 472795 483563 495384 507781 521017 535883 552795 571782 592864 615699 639336 663238
56262 663238 688162 715336 745244 777960 814086 854507 899706 950151 1006895 1070967 1142727
56251 1142727 1222558 1311655 1411315 1522073 1644303 1778863 1925965 2083922 2249977 2421899
56241 2421899 2597922 2775798 2952868 3126302 3292044 3444142 3576476 3684873 3766685 3819167
56231 3819167 3839895 3828562 3787093 3718171 3624657 3510074 3378370 3233281 3078727 2919263
56221 2919263 2758868 2599582 2442403 2289234 2142840 2005177 1876832 1757747 1647476
56212 1647476 1545095 1450009 1362570 1283096 1210832 1144824 1084976 1031043 981493 934974 892295
56201 892295 855177 823444 795125 769059 745647 725141 706886 690375 675548 661965 649052
$$ packed form
56273D72795J0768J1821J2397J3236J4866J6912J8987K1082K2835K3637K3902
56262F63238K4924K7174K9908L2716L6126M0421M5199N0445N6744O4072P1760
56251A142727P9831Q9097R9660J10758J22230J34560J47102J57957J66055J71922
56241B421899J76023J77876J77070J73434J65742J52098J32334J08397Q1812N2482
56231C819167K0728j1333m1469o8922r3514j14583j31704j45089j54554j59464
56221B919263j60395j59286j57179j53169j46394j37663j28345j19085j10271
56212A647476j02381r5086q7439p9474p2264o6008n9848n3933m9550m6519m2679
56201H92295l7118l1733k8319k6066k3412k0506j8255j6511j4827j3583j2913
$$ plain form
56190 649052 637204 627289 619080 611443 603965 597058 590658 584308 578445 574057 571000 568137 565107 562517
56176 562517 560396 558114 555988 555298 556356 557978 559215 560264 561408 562433 563470 565132 567480 569980
56162 569980 572706 576332 580783 585172 589380 594400 600788 607965 615348 623100 631460 640459 650533 662443
56148 662443 676363 692023 709742 730317 754030 780946 812138 849357 893560 944928 1004076
56137 1004076 1071610 1146395 1225579 1306255 1385600 1459689 1524385 1578202 1623164 1662560 1699048
56126 1699048 1734601 1770123 1804231 1833615 1855329 1868088 1871765 1867229 1856741 1842790 1825923 1804631
56114 1804631 1777115 1741837 1696903 1641159 1576301 1506256 1434339 1362624 1293954 1232105 1179188
56103 1179188 1134634 1097229 1066481 1041588 1021051 1004107 991025 981418 973874 967769 963856 962522
$$ packed form
56190F49052j1848r915q209p637p478o907o400o350n863m388l057k863l030k590
56176E62517k121k282k126o90J058J622J237J049J144J025J037J662K348K500
56162E69980K726L626M451M389M208N020O388P177P383P752Q360Q999J0074J1910
56148F62443J3920J5660J7719K0575K3713K6916L1192L7219M4203N1368N9148
56137A004076O7534P4785P9184Q0676P9345P4089O4696N3817M4962L9396L6488
56126A699048L5553L5522L4108K9384K1714J2759L677m536j0488j3951j6867k1292
56114A804631k7516l5278m4934n5744o4858p0045p1917p1715o8670o1849n2917
56103A179188m4554l7405l0748k4893k0537j6944j3082r607p544o105l913j334
$$ plain form
56091 962522 962938 964416 967044 970634 974594 979134 984995 991690 997853 1003607 1010723 1019959 1030010 1039548
56077 1039548 1048584 1057448 1066243 1075654 1086554 1098515 1110405 1122503 1136011 1150540 1164379 1177372
56065 1177372 1191029 1205592 1219707 1233456 1248914 1266919 1285882 1304638 1323886 1343964 1363805
56054 1363805 1383073 1402838 1423208 1442803 1461451 1480797 1501318 1521455 1540731 1560984 1583305
56043 1583305 1606408 1629222 1652471 1676616 1700991 1726188 1754391 1786014 1818776 1851404 1885410
56032 1885410 1921965 1960051 1999090 2040318 2084024 2128501 2173313 2220449 2270606 2321474 2371402
56021 2371402 2421642 2473313 2525485 2578068 2633219 2691996 2752915 2815586 2882186 2953438 3026982
56010 3026982 3101890 3180927 3266007 3355292 3447305 3543967 3646929 3754735 3866414 3984022
$$ packed form
56091I62522M16J478K628L590L960M540N861O695O163N754P116R236J0051R538
56077A039548R036Q864Q795R411J0900J1961J1890J2098J3508J4529J3839J2993
56065A177372J3657J4563J4115J3749J5458J8005J8963J8756J9248K0078J9841
56054A363805J9268J9765K0370J9595J8648J9346K0521K0137J9276K0253K2321
56043A583305K3103K2814K3249K4145K4375K5197K8203L1623L2762L2628L4006
56032A885410L6555L8086L9039M1228M3706M4477M4812M7136N0157N0868M9928
56021B371402N0240N1671N2172N2583N5151N8777O0919O2671O6600P1252P3544
56010C026982P4908P9037Q5080Q9285R2013R6662J02962J07806J11679J17608
$$ plain form
56000 3984022 4108930 4239527 4375310 4519189 4672936 4834503 5002551 5179202 5365599
55991 5365599 5559662 5761312 5974908 6203348 6445104 6700358 6974275 7270411 7587017
55982 7587017 7924125 8288053 8684257 9112084 9571541 10068839 10610156 11196844 11832420
55973 11832420 12527380 13291556 14129391 15048968 16067926 17204569 18472503 19891454 21494250
55964 21494250 23316441 25391142 27764452 30506420 33699948 37435060 41828726 47040765
55956 47040765 53263791 60718171 69670489 80433900 93331861 108687620 126875647
55949 126875647 148364480 173693468 203413685 237916120 276875073 318286675 357814218
55942 357814218 389441463 407547079 409172370 394963508 368385736 334083042 296474591
$$ packed form
56000C984022J24908J30597J35783J43879J53747J61567J68048J76651J86397
55991E365599J94063K01650K13596K28440K41756K55254K73917K96136L16606
55982G587017L37108L63928L96204M27827M59457M97298N41317N86688O35576
55973A1832420O94960P64176Q37835R19577J018958J136643J267934J418951J602796
55964B1494250J822191K074701K373310K741968L193528L735112M393666N212039
55956D7040765O223026P454380Q952318J0763411J2897961J5355759J8188027
55949A26875647K1488833K5328988K9720217L4502435L8958953M1411602L9527543
55942C57814218L1627245J8105616J625291j4208862k6577772l4302694l7608451
$$ plain form
55935 296474591 259019473 224008219 192657500 165374552 142062430 122354524 105765321
55928 105765321 91798960 80018031 70056197 61602373 54397256 48236382 42955761 38412250
55920 38412250 34482702 31070919 28100185 25501118 23214238 21197101 19417467 17842175
55912 17842175 16439713 15187985 14070492 13068366 12163402 11344689 10604736 9932316 9315620
55903 9315620 8748875 8229391 7751272 7308012 6897915 6520950 6173104 5849356 5549213
55894 5549213 5273898 5020843 4786163 4569732 4372629 4192113 4024136 3868366 3725725
55885 3725725 3593122 3465371 3340401 3218312 3097618 2977057 2859185 2747687 2642667
55876 2642667 2542501 2448215 2361727 2281452 2203988 2128807 2057391 1989201 1922490 1857855 1797178
$$ packed form
55935B96474591l7455118l5011254l1350719k7282948k3312122j9707906j6589203
55928A05765321j3966361j1780929r961834q453824p205117o160874n280621m543511
55920C8412250l929548l411783k970734k599067k286880k017137j779634j575292
55912A7842175j402462j251728j117493j002126r04964q18713p39953o72420o16696
55903I315620n66745n19484m78119m43260m10097l76965l47846l23748l00143
55894E549213k75315k53055k34680k16431j97103j80516j67977j55770j42641
55885C725725j32603j27751j24970j22089j20694j20561j17872j11498j05020
55876B642667j00166r4286q6488q0275p7464p5181p1416o8190o6711o4635o0677
$$ plain form
55865 1797178 1740155 1685509 1634435 1589163 1548905 1510543 1472470 1434795 1397021 1358753 1321689
55854 1321689 1287771 1256276 1225544 1196306 1170200 1146257 1122060 1097320 1073122 1048755 1022646
55843 1022646 995596 969769 945148 920233 895565 873222 853222 833717 814569 797554 782997
55832 782997 769216 755533 743043 732108 721595 710953 700823 691351 681909 672606 664092 655819
55820 655819 646387 635593 624365 612824 600311 587225 574984 564179 554353 545427 537696 530726
55808 530726 523912 517793 513195 509476 505304 500792 497275 495512 495726 498666 504573 511657 517606 522273
55794 522273 526949 531504 534407 535249 535032 534042 531625 528095 524890 522660 520905 519340 517698 514298 507017
55779 507017 496097 484280 473921 465596 459537 456571 457302 462109 472149 488472 509367 529820 544149
$$ packed form
55865A797178n7023n4646n1074m5272m0258l8362l8073l7675l7774l8268l7064
55854A321689l3918l1495l0732k9238k6106k3943k4197k4740k4198k4367k6109
55843A022646k7050k5827k4621k4915k4668k2343k0000j9505j9148j7015j4557
55832G82997j3781j3683j2490j0935j0513j0642j0130r472r442r303q514q273
55820F55819r432j0794j1228j1541j2513j3086j2241j0805r826q926p731o970
55808E30726o814o119m598l719m172m512l517j763K14K940N907P084N949M667
55794E22273M676M555K903Q42k17r90k417l530l205k230j755j565j642l400p281
55779E07017j0920j1817j0359q325o059k966P31M807J0040J6323K0895K0453J4329
$$ plain form
55766 544149 548462 541235 523655 499832 474909 451972 431486 413511 398875 387896 379565 372664
55754 372664 366696 361305 355810 349720 342865 334893 325474 315033 304481 294346 285006 277380 272201
55741 272201 268911 266461 264910 264909 265902 266328 265424 263384 259913 254347 247353 240893 236157 232777 230139 228016
55725 228016 225715 222147 217209 211944 207078 202531 198454 195397 193281 191577 190786 192378 196825 202929
55711 202929 209455 216200 223048 229171 233680 236104 235940 232887 227929 223117 219736 217428 215208 212333
55697 212333 208058 201868 194377 187025 180481 174305 168390 163566 160357 158193 156356 154808 153688 152895
55683 152895 152545 153017 154200 155525 156972 159209 162488 166273 170110 173962 177493 180036 181504 182377 182601
55668 182601 181504 179016 175968 172948 169915 167126 165281 164386 163646 162935 163253 165155 167730 169761 171045
$$ packed form
55766E44149M313p227j7580k3823k4923k2937k0486j7975j4636j0979q331o901
55754C72664n968n391n495o090o855p972r419j0441j0552j0135r340p626n179
55741B72201l290k450j551jR93M26r04k040l471n566o994o460m736l380k638k123
55725B28016k301l568m938n265m866m547m077l057k116j704p91J592M447O104
55711B02929O526O745O848O123M509K424j64l053m958m812l381k308k220k875
55697B12333m275o190p491p352o544o176n915m824l209k164j837j548j120p93
55683A52895l50M72J183J325J447K237L279L785L837L852L531K543J468Q73K24
55668A82601j097k488l048l020l033k789j845q95p40p11L18J902K575K031J284
$$ plain form
55653 171045 172047 173056 174254 175890 177931 180105 182463 185201 187800 189285 189463 188973 187979 185879 182561
55638 182561 178736 174638 169536 163010 155704 148384 141328 135090 130636 128017 125934 123344 120634 118663
55624 118663 117598 117374 118233 119970 121505 122072 122142 122456 122819 122545 121452 119738 117533 115142 113056 111150
55608 111150 108612 105255 102121 100121 98824 97350 95725 94538 93860 93326 92797 92185 91108 89447 87813
55593 87813 86843 86392 85927 85276 84482 83487 82500 82132 82604 83376 84091 85279 87439 90011 92073 93635 95458
55576 95458 97938 100916 104404 108806 114413 121129 128640 136588 144722 152973 161101 168177 172923 174757
55562 174757 174052 171330 166857 161195 155334 149856 144611 139510 134929 130957 127032 122755 118426 114381
55548 114381 110519 106921 104126 102269 100693 98956 97465 96552 95721 94441 92942 91572 90133 88585 87722
$$ packed form
55653A71045J002J009J198J636K041K174K358K738K599J485J78m90r94k100l318
55638A82561l825m098n102o526p306p320p056o238m454k619k083k590k710j971
55624A18663j065k24Q59J737J535N67P0L14L63k74j093j714k205k391k086j906
55608A11150k538l357l134k000j297j474j625j187o78n34n29o12j077j661j634
55593H7813r70m51m65o51p94r95r87l68M72P72P15J188K160K572K062J562J823
55576I5458K480K978L488M402N607O716P511P948Q134Q251Q128P076M746J834
55562A74757p05k722m473n662n861n478n245n101m581l972l925m277m329m045
55548A14381l862l598k795j857j576j737j491r13q31j280j499j370j439j548q63
$$ plain form
55533 87722 88268 89800 91251 91959 91732 90567 89012 88078 88018 87747 86169 83479 80539 77742 75221 73349
55517 73349 72091 70586 68317 66014 64461 63240 61795 60959 61993 64649 67665 70834 75014 80159 84861
55502 84861 88052 89923 90880 90855 90063 89424 89649 90548 91579 92473 92995 92736 91537 89773 87998 86644 86056
55485 86056 86410 87439 88514 88983 88337 86373 83630 81277 80035 79457 78794 78162 78102 78370 78132 77319 76804
55468 76804 77078 77562 77455 76610 75306 73761 72238 71201 70982 71474 72283 73029 73481 73663 73840 74213 74629 74781
55450 74781 74575 74157 73712 73396 73264 73147 72863 72650 72957 73653 74032 73865 73808 74319 74831 74623 73927 73495 73504 73603
55430 73603 73639 73653 73537 73363 73618 74488 75433 76175 77485 80020 82962 84983 86180 87801 90308 93038 95733
55413 95733 99020 103058 106922 109742 111508 112371 112083 110608 108567 106521 104354 101650 98196 93955 89135
$$ packed form
55533H7722N46J532J451P08k27j165j555r34o0k71j578k690k940k797k521j872
55517G3349j258j505k269k303j553j221j445q36J034K656L016L169M180N145M702
55502H4861L191J871R57k5p92o39K25Q99J031Q94N22k59j199j764j775j354n88
55485H6056L54J029J075M69o46j964k743k353j242n78o63o32o0K68k38q13n15
55468G6804K74M84j07q45j304j545j523j037k19M92Q09P46M52J82J77L73M16J52
55450G4781k06m18m45l16j32j17k84k13L07O96L79j67n7N11N12k08o96m32RR9
55430G3603L6J4j16j74K55Q70R45P42J310K535K942K021J197J621K507K730K695
55413I5733L287M038L864K820J766Q63k88j475k041k046k167k704l454m241m820
$$ plain form
55398 89135 84483 80876 78351 76112 73678 71440 69895 68974 68462 68467 69079 69937 70459 70309 69537 68612 68251
55381 68251 68791 69695 70170 70232 70603 71619 72851 73835 74422 74377 73453 72069 71123 70759 70035 68219 65781 63582
55363 63582 61641 59362 56703 54553 53943 55100 57180 58832 59182 58401 57242 56262 55725 55936 56985 58265
55347 58265 58948 59058 59481 60776 62525 63968 64741 64865 64615 64560 65173 66227 67076 67589 68211 69012 69452 69284
55329 69284 68902 68457 67413 65542 63747 63189 63988 65293 66353 67075 67793 68850 70196 71135 70791 69117
55313 69117 67139 65975 65890 66429 67011 67129 66477 65265 64061 63034 61763 60141 58991 59310 61192 63885
55297 63885 66623 68998 70780 71901 72559 73032 73414 73650 73636 73205 72318 71450 71413 72496 74059 75209 75606
55280 75606 75438 74961 74443 74208 74337 74458 74104 73156 71796 70297 69094 68689 69168 69986 70533 70727 70881 71204
$$ packed form
55398H9135m652l607k525k239k434k238j545r21n12NO12Q58N22j50p72r25l61
55381F8251N40R04M75O2L71J016J232R84N87m5r24j384r46l64p24j816k438k199
55363F3582j941k279k659k150o10J157K080J652L50p81j159r80n37K11J049J280
55347E8265O83J10M23J295J749J443P73J24k50n5O13J054Q49N13O22Q01M40j68
55329F9284l82m45j044j871j795n58P99J305J060P22P18J057J346R39l44j674
55313F9117j978j164q5N39N82J18o52j212j204j027j271j622j150L19J882K693
55297F3885K738K375J782J121O58M73L82K36j4m31q87q68l7J083J563J150L97
55280G5606j68m77n18k35J29J21l54r48j360j499j203m05M79Q18N47J94J54L23
$$ plain form
55262 71204 71666 72189 72748 73427 74416 75713 76801 77043 76457 75697 75125 74474 73610 72949 72675 72158 70822 69208
55244 69208 68446 68832 69583 69939 69926 69936 70055 70015 69593 68928 68505 68719 69347 69637 69111 68117 67384 67267 67710 68640
55224 68640 69949 71208 71872 71849 71524 71143 70486 69303 67885 66966 67016 67767 68484 68726 68704 68841 69117 69127 68719
55205 68719 68244 68088 68232 68444 68758 69542 71126 73336 75357 76212 75600 74247 73208 72897 73049 73381 73854
55188 73854 74333 74569 74635 74955 75760 76864 78011 79017 79550 79299 78498 77783 77338 76692 75520 74142 73037
55171 73037 72446 72687 74113 76268 77737 77494 76081 74873 74558 74867 75439 76162 76793 76906 76330 75243 73859
55154 73859 72384 71248 70964 71711 73246 75118 76718 77378 76870 75796 75127 75265 75757 75944 75673 75340 75386
55137 75386 75825 76289 76540 76774 77167 77308 76555 75005 73632 73285 73957 75162 76483 77490 77688 77040 76213
$$ packed form
55262G1204M62N23N59O79R89J297J088K42n86p60n72o51q64o61k74n17j336j614
55244F9208p62L86P51L56j3J0J19m0m22o65m23K14O28K90n26r94p33j17M43R30
55224F8640J309J259O64k3l25l81o57j183j418r19N0P51P17K42k2J37K76J0m08
55205F8719m75j56J44K12L14P84J584K210K021Q55o12j353j039l11J52L32M73
55188G3854M79K36O6L20Q05J104J147J006N33k51q01p15m45o46j172j378j105
55171G3037n91K41J426K155J469k43j413j208l15L09N72P23O31J13n76j087j384
55154G3859j475j136k84P47J535J872J600O60n08j074o69J38M92J87k71l33M6
55137G5386M39M64K51K34L93J41p53j550j373l47O72J205J321J007J98o48q27
$$ plain form
55120 76213 75887 76099 76589 77332 78284 78977 78956 78414 77905 77617 77392 77243 77351 77670 78008 78436 79217 80403 81832
55101 81832 83374 84825 85719 85710 85010 84146 83378 82717 82289 82226 82328 82289 82214 82489 83172 83880 84324 84581 84883 85358
55081 85358 85960 86398 86261 85484 84575 84143 84356 85121 86512 88590 90989 93112 94682 95746 96227 95936 95014
55064 95014 94004 93429 93504 94110 94786 94892 94182 93120 92324 91843 91313 90682 90310 90433 90884 91331 91437 90892 89714
55045 89714 88495 87962 88207 88618 88571 87964 87158 86643 86696 87076 87145 86549 85648 85051 84914 85009 85267 85813 86534 87060
55025 87060 87166 86906 86399 85699 84835 83788 82646 81922 82261 83458 84224 83608 82309 81855 82652 83675 84105
55008 84105 84379 85266 86595 87450 87304 86541 85946 85974 86480 87024 87353 87535 87665 87762 88035 88841 90114 91131 91269
54989 91269 90702 89994 89333 88668 88254 88436 89021 89478 89667 89858 90143 90465 91068 92266 93740 94667 94623 93902 93006
$$ packed form
55120G6213l26K12M90P43R52O93k1n42n09k88k25j49J08L19L38M28P81J186J429
55101H1832J542J451Q94rp00q64p68o61m28o3J02l9p5K75O83P08M44K57L02M75
55081H5358O02M38j37p77r09m32K13P65J391K078K399K123J570J064M81k91r22
55064I5014j010n75P5O06O76J06p10j062p96m81n30o31l72J23M51M47J06n45j178
55045H9714j219n33K45M11m7o07q06n15N3L80O9n96r01n97j37R5K58N46P21N26
55025H7060J06k60n07p00q64j047j142p24L39J197P66o16j299m54P97J023M30
55008H4105K74Q87J329Q55j46p63n95K8N06N44L29J82J30R7K73Q06J273J017J38
54989I1269n67p08o61o65m14J82N85M57J89J91K85L22O03J198J474R27m4p21q96
$$ plain form
54970 93006 92340 92295 92925 93560 93404 92608 92111 92332 92722 92727 92541 92658 93262 94331 95783 97253 98221 98640 99037
54951 99037 99762 100559 101049 101215 101231 101195 101191 101266 101181 100574 99385 97806 95872 93606 91484 90152 89642 89475 89518
54932 89518 90008 90733 91079 91176 92112 94565 97890 100978 103425 105489 107541 110033 113378 117435 121597 125710
54916 125710 130271 135359 140158 144113 147758 151589 154789 155986 154860 152111 148204 143121 137187 131178
54902 131178 125515 120131 115210 111397 109053 107853 107300 107182 107350 107458 107206 106621 105953 105446 105257 105446 105972
54885 105972 106818 108031 109559 111107 112315 113069 113565 114175 115308 117248 120003 123456 127722 133079 139407
54870 139407 145858 151249 154725 156032 155443 153529 150755 147172 142647 137364 131882 126751 122391 119191
54856 119191 117198 115757 114111 112416 111484 111369 111003 109597 107646 106033 104772 103282 101401 99503 97909
$$ packed form
54970I3006o66m5O30O35j56p96m97K21L90Nj86J17O04J069J452J470R68M19L97
54951I9037P25P97M90J66J6l6mP5q5o07j189j579j934k266k122j332n10j67M3
54932H9518M90P25L46R7R36K453L325L088K447K064K052K492L345M057M162M113
54916A25710M561N088M799L955L645L831L200J197j126k749l907n083n934o009
54902A31178n663n384m921l813k344j200n53j18J68J08k52n85o68n07j89J89N26
54885A05972Q46J213J528J548J208P54M96O10J133J940K755L453M266N357O328
54870A39407O451N391L476J307n89j914k774l583m525n283n482n131m360l200
54856A19191j993j441j646j695r32j15l66j406j951j613j261j490j881j898j594
$$ plain form
54841 97909 96734 95981 95343 94285 92799 91699 91693 92529 93509 94348 94961 94990 94312 93636 93767 94543 95257 95836 96760
54822 96760 97966 98705 98529 97691 96561 95309 94242 93799 94110 94952 96082 97191 97721 97294 96184 94858
54806 94858 93407 92043 91663 92931 95028 96477 97112 98092 99871 101492 102155 102213 102070 101328 99882 98774
54790 98774 98907 99666 99921 99802 100300 101484 102327 102342 102232 102682 103389 103710 103657 103815 104680 106401 108865 111694
54772 111694 114416 116919 119570 122660 125938 128970 131831 135068 139036 143642 148845 154942 161925 168804
54758 168804 174068 176955 177871 177434 175523 171634 165894 159271 152756 146660 140740 134851 129444 125446 123466
54743 123466 122971 122473 120873 118443 116289 115071 114644 114635 114771 114692 114135 113446 113378 114106 114869 114860 114138 113398 113155
54724 113155 113520 114616 116840 120601 125843 131837 137588 142615 147257 151990 156538 159990 161747 161899 160672
$$ packed form
54841I7909j175p53o38j058j486j100oQ36R80Q39O13K9o78o76J31P76P14N79R24
54822I6760J206P39j76q38j130j252j067m43L11Q42J130J109N30m27j110j326
54806I4858j451j364l80J268K097J449O35R80J779J621O63N8j43p42j446j108
54790I8774J33P59K55j19M98J184Q43J5j10M50P07L21n3J58Q65J721K464K829
54772A11694K722K503K651L090L278L032K861L237L968M606N203O097O983O879
54758A68804N264K887R16m37j911l889n740o623o515o096n920n889n407l998j980
54743A23466m95m98j600k430k154j218m27rJ36p9n57o89o8P28P63rp22p40k43
54724A13155L65J096K224L761N242N994N751N027M642M733M548L452J757J52j227
$$ plain form
54709 160672 157927 153452 147482 140794 134513 129793 127203 126213 125592 124509 122999 121338 119445 117179 114793
54694 114793 112717 111125 109993 109316 108964 108598 108031 107447 106998 106457 105589 104603 103832 103203 102458 101762 101600 102107
54676 102107 102920 103691 104345 104755 104625 103903 103028 102536 102529 102688 102733 102701 102808 103094 103280 103033 102368 101672 101314 101373
54656 101373 101766 102381 102940 103007 102544 102265 102999 104584 105780 105475 103825 102066 101347 101907 103191 104479 105347
54639 105347 105743 105907 106262 107156 108465 109452 109279 107806 105753 103963 102723 101958 101756 102264 103157 103736 103707
54622 103707 103464 103424 103456 103290 103159 103561 104471 105245 105338 104798 103990 103213 102743 102825 103384 103950 104178 104254 104506 104822
54602 104822 104754 104083 102963 101663 100517 100040 100584 101824 103046 103996 105040 106358 107529 108150 108395 108576
54586 108576 108596 108288 107930 107839 107662 106729 105051 103448 102593 102426 102639 103253 104409 105843 106946 107294 107030 106674
$$ packed form
54709A60672k745m475n970o688o281m720k590r90o21j083j510j661j893k266k386
54694A14793k076j592j132o77l52l66n67n84m49n41q68r86p71o29p45o96j62N07
54676A02107Q13P71O54M10j30p22q75m92pJ59M5l2J07K86J86k47o65o96l58N9
54656A01373L93O15N59O7m63k79P34J585J196l05j650j759p19N60J284J288Q68
54639A05347L96J64L55Q94J309R87j73j473k053j790j240p65k02N08Q93N79k9
54622A03707k43m0L2j66j31M02R10P74R3n40q08p77m70Q2N59N66K28P6K52L16
54602A04822o8o71j120j300j146m77N44J240J222R50J044J318J171O21K45J81
54586A08576K0l08l58r1j77r33j678j603q55j67K13O14J156J434J103L48k64l56
$$ plain form
54568 106674 106611 106803 107056 107482 108421 109870 111308 112298 112914 113294 113138 112154 110733 109672 109301 109346 109530 109796
54550 109796 110055 110232 110515 111065 111585 111754 111939 112777 114096 115094 115634 116442 117776 118888 119252 119368 119708 119771
54532 119771 119090 118414 118788 119858 120278 119621 118767 118341 117810 116468 114476 112520 111073 110413 110771 111886 112784
54515 112784 112533 111186 109672 108843 108788 108945 108683 107898 107156 107133 107868 108779 109486 110283 111570 113079 114070 114195
54497 114195 113785 113300 112835 112301 111808 111589 111665 111847 112085 112548 113269 113910 114104 113931 113862 114226 114946 115766 116529
54478 116529 117148 117568 117840 118154 118659 119344 120088 120678 120801 120274 119371 118673 118505 118738 119201 119912 120740 121218 121063
54459 121063 120621 120440 120619 120890 121093 121153 120813 119991 119258 119378 120263 120975 120926 120560 120530 120700 120390 119373 118138
54440 118138 117242 116757 116415 116068 115894 116194 117003 117928 118498 118706 118996 119639 120347 120706 120814 121174 121951 122627 122538
$$ packed form
54568A06674o3J92K53M26R39J449J438R90O16L80j56r84j421j061l71M5J84K66
54550A09796K59J77K83N50N20J69J85Q38J319R98N40Q08J334J112L64J16L40O3
54532A19771o81o76L74J070M20o57q54m26n31j342j992j956j447o60L58J115Q98
54515A12784k51j347j514q29n5J57k62p85p42k3P35R11P07P97J287J509R91J25
54497A14195m10m85m65n34m93k19P6J82K38M63P21O41J94j73o9L64P20Q20P63
54478A16529O19M20K72L14N05O85P44N90J23n27r03o98j68K33M63P11Q28M78j55
54459A21063m42j81J79K71K03O0l40q22p33J20Q85P12m9l66l0J70l10j017j235
54440A18138q96m85l42l47j74L00Q09R25N70K08K90O43P08L59J08L60P77O76q9
$$ plain form
54421 122538 121666 120767 120666 121469 122505 123056 123081 123163 123836 125100 126550 127793 128687 129348 129964 130507 130620 129986
54403 129986 128881 128087 128119 128766 129554 130410 131586 133106 134648 135888 136633 136697 136048 135134 134632 134732 135014 135170
54385 135170 135435 136059 136722 136906 136537 135877 135063 134250 133977 134652 135679 135896 135091 134413 134908 136249 137459 138315
54367 138315 139304 140521 141490 142080 142865 144371 146536 149105 152072 155487 159253 163348 167931 172970 178097
54352 178097 182950 187339 190891 193035 193618 193121 191819 189136 184400 177970 171054 164604 158998 154664 152166
54337 152166 151409 151384 151066 150246 149220 148050 146508 144522 142300 140119 138216 136764 135663 134503 132989
54322 132989 131329 129953 129016 128501 128668 129885 131844 133408 133620 132708 131796 131714 132311 132902 133076 133001 133104 133568
54304 133568 134086 134108 133416 132484 132088 132523 133257 133464 132849 131920 131529 132149 133486 134675 134915 134048 132617 131387
$$ packed form
54421A22538q72q99j01Q03J036N51K5Q2O73J264J450J243Q94O61O16N43J13o34
54403A29986j105p94L2O47P88Q56J176J520J542J240P45O4o49r14n02J00K82J56
54385A35170K65O24O63J84l69o60q14q13k73O75J027K17q05o78M95J341J210Q56
54367A38315R89J217R69N90P85J506K165K569K967L415L766M095M583N039N127
54352A78097M853M389L552K144N83m97j302k683m736o430o916o450n606m334k498
54337A52166p57k5l18q20j026j170j542j986k222k181j903j452j101j160j514
54322A32989j660j376r37n15J67J217J959J564K12r12r12q2N97N91J74p5J03M64
54304A33568N18K2o92r32l96M35P34K07o15r29l91O20J337J189K40q67j431j230
$$ plain form
54286 131387 130770 130603 130418 130012 129760 130191 131174 131823 131529 130806 130642 131142 131456 131085 130521 130340 130348 130164 130028
54267 130028 130386 131074 131626 132120 132970 134005 134553 134438 134262 134605 135532 136922 138623 140169 140993 141142 141278
54250 141278 141779 142382 142851 143360 143962 144286 144143 143878 143791 143708 143465 143249 143014 142137 140265 138056 136524 135977
54232 135977 136109 136676 137484 138038 137954 137531 137279 137129 136765 136479 136919 138031 139083 139779 140558 141599 142300 142123
54214 142123 141410 140898 140806 140754 140297 139225 137613 135865 134542 133819 133249 132262 130871 129686 129285 129718 130600
54197 130600 131600 132741 134189 135776 136937 137280 137074 136960 137242 137704 138065 138354 138726 139079 139040 138400 137521
54180 137521 137196 137849 138955 139527 139212 138634 138536 138965 139464 139659 139381 138630 137754 137367 137657 138077 138084 137801 137545
54161 137545 137118 136222 135289 135152 135990 137153 137965 138123 137532 136416 135541 135646 136625 137848 139111 140502 141456
$$ packed form
54286A31387o17j67j85m06k52M31R83O49k94p23j64N00L14l71n64j81Qj84j36
54267A30028L58O88N52M94Q50J035N48j15j76L43R27J390J701J546Q24J49J36
54250A41278N01O03M69N09O02L24j43k65q7q3k43k16k35q77j872k209j532n47
54232A35977J32N67Q08N54q4m23k52j50l64k86M40J112J052O96P79J041P01j77
54214A42123p13n12r2n2m57j072j612j748j323p23n70r87j391j185m01M33Q82
54197A30600J000J141J448J587J161L43k06j14K82M62L61K89L72L53l9o40q79
54180A37521l25O53J106N72l15n78r8M29M99J95k78p51q76l87K90M20Pk83k56
54161A37545m27q96r33j37Q38J163Q12J58n91j116q75J05R79J223J263J391R54
$$ plain form
54144 141456 141013 139257 137614 137306 138187 139416 140435 140817 139998 137992 135931 135089 135577 136501 137254 138042 139209
54127 139209 140513 141243 140922 139883 139125 139419 140592 141962 143313 144906 146639 147953 148802 149929 151716
54112 151716 153395 153977 153487 152690 151994 151247 150325 149323 148313 147425 147032 147406 148320 149328 150226 150946 151310
54095 151310 151387 151774 152995 154773 156369 157466 158269 158970 159724 160963 163120 166054 169294 172871 177309 182800
54079 182800 188958 195560 203035 211921 222096 232631 242103 248957 251983 250767 245736 237889 228602 219384
54065 219384 211265 204288 197862 191667 185936 180995 176919 173695 171315 169620 168398 167744 168004 169238 170968
54050 170968 172577 173764 174613 175461 176757 178753 181271 183990 186967 190575 194935 199770 204862 210253 215924
54035 215924 221673 227491 233641 240111 246339 251801 256575 261058 265408 269659 274150 279213 284516 289254
$$ packed form
54144A41456m43j756j643l08Q81J229J019L82q19k006k061q42M88R24P53P88J167
54127A39209J304P30l21j039p58K94J173J370J351J593J733J314Q49J127J787
54112A51716J679N82m90p97o96p47r22j002j010q88l93L74R14J008Q98P20L64
54095A51310P7L87J221J778J596J097Q03P01P54J239K157K934L240L577M438N491
54079A82800O158O602P475Q886J0175J0535R472O854L026j216n031p847r287r218
54065B19384q119o977o426o195n731m941m076l224k380j695j222o54K60J234J730
54050A70968J609J187Q49Q48J296J996K518K719K977L608M360M835N092N391N671
54035B15924N749N818O150O470O228N462M774M483M350M251M491N063N303M738
$$ plain form
54021 289254 293203 297144 301874 307080 311568 314464 315764 315721 314184 310824 305721 299316 291896 283453 274097
54006 274097 264327 254865 246398 239428 234037 229745 225899 222282 219044 216058 212823 209232 205964 203688
53992 203688 202200 200787 199199 197768 196682 195660 194453 193272 192541 192371 192353 191869 190655 189108 187846
53977 187846 186885 185561 183455 181117 179524 179089 179527 180394 181304 181833 181834 181846 182683 184442 186274 187221 187072 186391
53959 186391 185992 186403 187583 189088 190616 192206 193827 195073 195708 196215 197362 199359 201950 205089 208940
53944 208940 213384 218193 223610 230013 237023 243824 250582 258778 269731 283420 299033 315950 333517
53931 333517 350279 364111 373073 376071 373255 366246 357542 349097 341503 334747 329346 326184 325467 326395
53917 326395 327949 329741 332116 335625 340409 346022 351883 357747 363407 368140 371071 372193 372339 371900 370306
$$ packed form
54021B89254L949L941M730N206M488K896J300m3j537l360n103o405p420q443r356
54006B74097r770r462q467o970n391m292l846l617l238k986l235l591l268k276
53992B03688j488j413j588j431j086j022j207j181p31j70j8m84j214j547j262
53977A87846r61j324k106k338j593m35M38Q67R10N29JJ2Q37J759J832R47j49o81
53959A86391l99M11J180J505J528J590J621J246O35N07J147J997K591L139L851
53944B08940M444M809N417O403P010O801O758Q196J0953J3689J5613J6917J7567
53931C33517J6762J3832Q962K998k816p009q704q445p594o756n401l162p17R28
53917C26395J554J792K375L509M784N613N861N864N660M733K931J122J46m39j594
$$ plain form
53902 370306 367262 363771 361180 359611 358080 355864 353009 349705 345899 341496 336316 329904 322045 313430
53888 313430 305191 297703 290466 283217 276481 270783 265965 261622 257709 254277 251018 247609 244328 241848
53874 241848 240309 238957 236868 233872 230607 227679 225060 222466 220056 218225 216749 214788 212042 209325
53860 209325 207449 206033 204111 201644 199559 198402 197764 197168 196676 196283 195453 193813 191884 190589 190229 190376
53844 190376 190530 190554 190542 190621 190853 191205 191588 191958 192229 192175 191687 191104 190898 190985 190739 189830 188632 187656 187043 186859
53824 186859 187391 188716 190296 191469 192111 192511 192879 193340 194149 195469 197152 199071 201396 204105 206611 208537
53808 208537 210642 214149 219075 224004 227764 230700 233906 237733 241580 244907 247932 251311 255352 259648
53794 259648 263412 266257 268596 271136 274010 276661 278557 279712 280510 281363 282572 284034 284906 284096 281451
$$ packed form
53902C70306l044l491k591j569j531k216k855l304l806m403n180o412p859q615
53888C13430q239p488p237p249o736n698m818m343l913l432l259l409l281k480
53874B41848j539j352k089k996l265k928k619k594k410j831j476j961k746k717
53860B09325j876j416j922k467k085j157o38n96m92l93q30j640j929j295l60J47
53844A90376J54K4j2P9K32L52L83L70K71n4m88n83k06Q7k46r09j198r76o13j84
53824A86859N32J325J580J173O42M00L68M61Q09J320J683J919K325K709K506J926
53808B08537K105L507M926M929L760K936L206L827L847L327L025L379M041M296
53794B59648L764K845K339K540K874K651J896J155P98Q53J209J462Q72q10k645
$$ plain form
53779 281451 278042 274813 271382 266757 260986 255350 250866 247311 243861 240115 236106 231805 227163 222537
53765 222537 218630 215910 214246 213094 211858 210141 207864 205254 202635 200195 197973 196004 194379 193113
53751 193113 192051 190999 189907 188917 188228 187955 188104 188595 189242 189750 189881 189746 189868 190830 192761 195163 197230
53734 197230 198377 198554 198136 197531 196905 196300 195920 196071 196805 197849 198999 200342 201907 203386 204535 205685
53718 205685 207418 209811 212376 214730 216896 218915 220647 222136 223671 225254 226434 227005 227419 228137 228998
53703 228998 229758 230950 233436 237222 241370 245171 248820 252786 257066 261302 265195 268548 271266 273579
53689 273579 275878 278111 279637 280005 279525 278717 277557 275743 273513 271673 270721 270301 269588 267992 265601 263187
53673 263187 261699 261431 261722 261742 261496 261627 262319 262906 262715 261821 260742 259832 259282 259319 259867 260267 259846 258748
$$ packed form
53779B81451l409l229l431m625n771n636m484l555l450l746m009m301m642m626
53765B22537l907k720j664j152j236j717k277k610k619k440k222j969j625j266
53751A93113j062j052j092r90o89k73J49M91O47N08J31j35J22R62J931K402K067
53734A97230J147J77m18o05o26o05l80J51P34J044J150J343J565J479J149J150
53718B05685J733K393K565K354K166K019J732J489J535J583J180N71M14P18Q61
53703B28998P60J192K486L786M148L801L649L966M280M236L893L353K718K313
53689B73579K299K233J526L68m80q08j160j814k230j840r52m20p13j596k391k414
53673B63187j488k68K91K0k46J31O92N87j91q94j079r10n50L7N48M00m21j098
$$ plain form
53655 258748 257738 257177 256677 255894 255176 255077 255556 256093 256511 257225 258565 260194 261449 262170 262900 264239 266137
53638 266137 267963 269199 269883 270367 270889 271535 272490 273981 275950 278031 279972 281943 284276 287011 289842
53623 289842 292423 294598 296409 298085 300051 302791 306623 311541 317203 323061 328695 334184 340070 346837
53609 346837 354480 362678 371116 379389 386761 392449 396213 398401 399449 399611 399170 398432 397362 395640 393324
53594 393324 391116 389634 388663 387455 385612 383406 381364 379870 379083 378896 378931 378732 377963 376436 374177 371626
53578 371626 369483 368064 366956 365540 363631 361350 358722 355868 353394 352008 351706 351761 351463 350518 348890
53563 348890 346877 345358 345324 346872 349055 350911 352234 353273 354252 355458 357291 359753 362234 364151 365563
53548 365563 366860 368216 369692 371521 373767 375941 377508 378744 380595 383648 387649 392147 397175 402994
$$ packed form
53655B58748j010n61n00p83p18r9M79N37M18P14J340J629J255P21P30J339J898
53638B66137J826J236O84M84N22O46R55J491J969K081J941J971K333K735K831
53623B89842K581K175J811J676J966K740L832M918N662N858N634N489N886O767
53609C46837P643Q198Q438Q273P372N688L764K188J048J62m41p38j070j722k316
53594C93324k208j482r71j208j843k206k042j494p87j87L5j99p69j527k259k551
53578C71626k143j419j108j416j909k281k628k854k474j386l02N5k98r45j628
53563C48890k013j519l4J548K183J856J323J039R79J206J833K462K481J917J412
53548C65563J297J356J476J829K246K174J567J236J851L053M001M498N028N819
$$ plain form
53534 402994 409331 415300 420334 425077 430957 438640 447229 455404 463153 471702 481778 492746 503767
53521 503767 514997 527034 539741 552477 565180 578490 592919 608612 625809 644750 665012
53510 665012 685655 706335 727741 750643 774952 799942 824977 849605 873287 895544 916424
53499 916424 936567 956713 977135 997494 1017234 1036232 1054960 1073864 1092706 1110881 1128362
53488 1128362 1145914 1164216 1183039 1201540 1219189 1236220 1253233 1270532 1287888 1304956 1321829
53477 1321829 1338914 1356071 1372127 1385627 1396030 1403904 1410045 1414732 1417733 1418535 1416560 1411538 1403769
53464 1403769 1393713 1381431 1366948 1351127 1335467 1320750 1306413 1291480 1275551 1258575 1240332
53453 1240332 1220763 1200421 1180041 1159884 1139985 1120635 1102010 1083585 1064626 1045221 1026200
$$ packed form
53534D02994O337N969N034M743N880P683Q589Q175P749Q549J0076J0968J1021
53521E03767J1230J2037J2707J2736J2703J3310J4429J5693J7197J8941K0262
53510F65012K0643K0680K1406K2902K4309K4990K5035K4628K3682K2257K0880
53499I16424K0143K0146K0422K0359J9740J8998J8728J8904J8842J8175J7481
53488A128362J7552J8302J8823J8501J7649J7031J7013J7299J7356J7068J6873
53477A321829J7085J7157J6056J3500J0403P874O141M687L001Q02j975n022p769
53464A403769j0056j2282j4483j5821j5660j4717j4337j4933j5929j6976j8243
53453A240332j9569k0342k0380k0157j9899j9350j8625j8425j8959j9405j9021
$$ plain form
53442 1026200 1008080 990775 974409 959803 947777 938393 931112 925425 921072 917907 915818 914658 914149
53429 914149 913953 913995 914605 916281 919410 924174 930578 938509 947847 958538 970461 983382 997277 1012620
53415 1012620 1030026 1049571 1070672 1092710 1115597 1139710 1165524 1193306 1223013 1254411 1287419
53404 1287419 1322205 1358795 1396756 1435635 1475637 1517493 1561724 1608391 1657408 1708498 1760813
53393 1760813 1813342 1866001 1919747 1975278 2032096 2089150 2145787 2201521 2255469 2306894 2356081
53382 2356081 2403883 2450438 2494945 2536670 2575465 2611214 2643433 2671736 2696231 2717116 2734139
53371 2734139 2746677 2754129 2756156 2752736 2743970 2729459 2707976 2678384 2641109 2598233 2551896 2503039
53359 2503039 2451899 2399047 2345355 2291317 2237085 2182997 2129601 2077236 2026080 1976514 1928926
$$ packed form
53442A026200j8120j7305j6366j4606j2026r384p281n687m353l165k089j160n09
53429I14149j96M2O10J676L129M764O404P931R338J0691J1923J2921J3895J5343
53415A012620J7406J9545K1101K2038K2887K4113K5814K7782K9707L1398L3008
53404A287419L4786L6590L7961L8879M0002M1856M4231M6667M9017N1090N2315
53393A760813N2529N2659N3746N5531N6818N7054N6637N5734N3948N1425M9187
53382B356081M7802M6555M4507M1725L8795L5749L2219K8303K4495K0885J7023
53371B734139J2538P452K027l420q766j4511k1483k9592l7275m2876m6337m8857
53359B503039n1140n2852n3692n4038n4232n4088n3396n2365n1156m9566m7588
$$ plain form
53348 1928926 1883185 1838700 1795013 1751961 1709257 1666458 1623468 1580777 1539067 1498902 1460764
53337 1460764 1424963 1391289 1359179 1328580 1300443 1276014 1255691 1238705 1223819 1210111 1197125
53326 1197125 1184511 1171740 1158273 1143995 1129346 1114925 1101091 1088066 1076144 1065462 1055701
53315 1055701 1046536 1038514 1032966 1030684 1030926 1032062 1033128 1034528 1037271 1041835 1047835 1054642 1062106 1070581
53301 1070581 1080414 1091701 1104604 1119534 1136697 1155719 1176153 1198185 1222322 1248438 1275715
53290 1275715 1303527 1331811 1360453 1388958 1417006 1444649 1471532 1496543 1518835 1538764 1557204
53279 1557204 1574198 1588903 1600638 1609380 1615277 1618265 1618176 1614840 1608156 1598429 1586547 1573344 1558783
53266 1558783 1542131 1522832 1500863 1476514 1450376 1423404 1396301 1368745 1339839 1309461 1278638
$$ packed form
53348A928926m5741m4485m3687m3052m2704m2799m2990m2691m1710m0165l8138
53337A460764l5801l3674l2110l0599k8137k4429k0323j6986j4886j3708j2986
53326A197125j2614j2771j3467j4278j4649j4421j3834j3025j1922j0682r761
53315A055701r165q022n548k282K42J136J066J400K743M564O000O807P464Q475
53301A070581R833J1287J2903J4930J7163J9022K0434K2032K4137K6116K7277
53290A275715K7812K8284K8642K8505K8048K7643K6883K5011K2292J9929J8440
53279A557204J6994J4705J1735Q742N897K988q9l336o684r727j1882j3203j4561
53266A558783j6652j9299k1969k4349k6138k6972k7103k7556k8906l0378l0823
$$ plain form
53255 1278638 1248366 1218608 1188676 1158206 1127505 1097335 1068588 1041827 1016765 992394 967847
53244 967847 942986 918134 893579 869462 845809 822458 799252 776511 755061 735536 717785
53233 717785 701100 684850 668878 653541 639491 627122 616161 606028 596558 587966 580051 571991
53221 571991 563136 553565 543545 532825 520871 507569 493472 479585 467010 456388 447383 439027
53209 439027 430770 422852 415525 408523 401678 395482 390423 386087 381468 375886 369218 361600 353495 345732
53195 345732 338895 332834 327302 322682 319389 316809 313741 309901 306159 303192 300627 297725 294326 290840
53181 290840 287842 285835 284908 284394 283311 281413 279398 277948 276965 275936 274605 273078 271689 270876 270725
53166 270725 270458 268989 266305 263742 262478 262245 261985 261196 260047 258620 256857 255099 253925 253348 252689 251334
$$ packed form
53255A278638l0272k9758k9932l0470l0701l0170k8747k6761k5062k4371k4547
53244I67847k4861k4852k4555k4117k3653k3351k3206k2741k1450j9525j7751
53233G17785j6685j6250j5972j5337j4050j2369j0961j0133r470q592p915q060
53221E71991q855r571j0020j0720j1954j3302j4097j3887j2575j0622r005q356
53209D39027q257p918p327p002o845o196n059m336m619n582o668p618q105p763
53195C45732o837o061n532m620l293k580l068l840l742k967k565k902l399l486
53181B90840k998k007r27n14j083j898k015j450r83j029j331j527j389q13j51
53166B70725k67j469k684k563j264k33k60p89j149j427j763j758j174n77o59j355
$$ plain form
53150 251334 249249 246844 244753 243690 243958 245009 245879 246157 246139 246064 245687 244815 243756 242950 242489 242250 242177 242141
53132 242141 241866 241373 241274 242164 243779 245146 245615 245422 245230 245424 245979 246738 247603 248474 249141 249246 248530 247241
53114 247241 246174 245951 246258 246138 245145 243857 243068 242878 242889 242912 242895 242398 240912 238787 237203 236832 237006 236573
53096 236573 235208 233450 231760 230156 228691 227733 227602 228173 228995 229625 229907 230074 230549 231403 232116 232130 231550
53079 231550 230951 230599 230318 230141 230491 231465 232380 232438 231585 230355 229094 227734 226246 224923 224136 223982 224164
53062 224164 224130 223456 222237 221024 220224 219699 219147 218636 218441 218526 218580 218585 218960 220038 221661 223369 224701 225281
53044 225281 224964 224055 223127 222402 221561 220365 219184 218588 218587 218607 218164 217298 216385 215830 215911 216622 217617 218575 219588
53025 219588 220877 222116 222515 221782 220629 220029 220232 220839 221491 221999 222033 221349 220403 220167 221125 222809 224476
$$ packed form
53150B51334k085k405k091j063K68J051Q70K78j8p5l77q72j059q06m61k39p3l6
53132B42141k75m93r9Q90J615J367M69j93j92J94N55P59Q65Q71O67J05p16j289
53114B47241j067k23L07j20r93j288p89j90J1K3j7m97j486k125j584l71J74m33
53096B36573j365j758j690j604j465r58j31N71Q22O30K82J67M75Q54P13J4n80
53079B31550n99l52k81j77L50R74R15N8q53j230j261j360j488j323p87j54J82
53062B24164l4o74j219j213q00n25n52n11j95Q5N4NL75J078J623J708J332N80
53044B25281l17r09r28p25q41j196j181n96jK0m43q66r13n55Q1P11R95R58J013
53025B19588J289J239L99p33j153o00K03O07O52N08L4o84r46k36R58J684J667
$$ plain form
53008 224476 225799 226658 226740 225882 224555 223506 222952 222516 221922 221340 220992 220789 220543 220283 220201 220416 220908 221615
52990 221615 222515 223628 224937 226276 227435 228431 229472 230488 230982 230727 230357 230667 231371 231274 229941 228511
52974 228511 228325 229257 230098 230308 230556 231480 232732 233635 234241 235213 236875 238874 240653 241875 242418 242331 241878
52957 241878 241343 240660 239464 237578 235254 232883 230694 228859 227548 226645 225682 224408 223221 222656 222578 222394
52941 222394 221980 221850 222239 222623 222432 221793 221176 220704 220274 220027 220156 220460 220569 220483 220439 220382 220149 220005 220290 220549
52921 220549 219796 217913 216082 215450 215946 216847 217988 219729 222047 224298 225796 226190 225401 223682 221679 219977
52905 219977 218579 217133 215567 214124 212847 211546 210318 209616 209676 210251 211061 212092 213232 214028 214145 213876
52889 213876 213841 214302 215021 215694 216277 216938 217862 219078 220320 221134 221221 220652 219726 218767 218179 218386 219429 220758
$$ packed form
53008B24476J323Q59Q2q58j327j049n54m36n94n82l48k03k46k60q2K15M92P07
52990B21615R00J113J309J339J159R96J041J016M94k55l70L10P04r7j333j430
52974B28511j86R32Q41K10K48R24J252R03O06R72J662J999J779J222N43q7m53
52957B41878n35o83j196j886k324k371k189j835j311r03r63j274j187n65p8j84
52941B22394m14j30L89L84j91o39o17m72m30k47J29L04J09q6m4n7k33j44K85K59
52921B20549p53j883j831o32M96R01J141J741K318K251J498L94p89j719k003j702
52905B19977j398j446j566j443j277j301j228p02O0N75Q10J031J140P96J17k69
52889B13876l5M61P19O73N83O61R24J216J242Q14Q7n69r26r59n88K07J043J329
$$ plain form
52871 220758 221768 222516 223609 225433 227817 230502 233444 236448 238896 240246 240620 240520 240080 239003 237201
52856 237201 235134 233274 231540 229467 226915 224424 222830 222423 222502 221916 220193 217959 215999 214198 211936
52841 211936 209372 207614 207314 207730 207674 206944 206265 206116 206305 206592 207137 208178 209670 211334 212808 213745 214072
52824 214072 214082 214042 213818 213253 212671 212518 212671 212722 212838 213628 215067 216406 217324 218361 219800 221015 221542 222070
52806 222070 223478 225337 226234 225357 223022 219919 216665 213986 212380 211443 210254 208605 207258 206863 207247
52791 207247 207951 208729 209193 208605 206616 203915 201708 200774 201188 202521 203971 204731 204766 204963 206025 207436 208024
52774 208024 207414 206332 205528 205016 204560 204321 204591 205176 205571 205689 206039 206999 208170 208710 208263 207365 206856 207050
52756 207050 207572 207838 207575 206944 206444 206609 207533 208616 209028 208627 208194 208672 210285 212548 214935 217277 219629
$$ packed form
52871B20758J010P48J093J824K384K685K942L004K448J350L74j00m40j077j802
52856B37201k067j860j734k073k552k491j594m07P9n86j723k234j960j801k262
52841B11936k564j758l00M16n6p30o79j49J89K87N45J041J492J664J474R37L27
52824B14072J0m0k24n65n82j53J53N1J16P90J439J339R18J037J439J215N27N28
52806B22070J408J859Q97q77k335l103l254k679j606r37j189j649j347l95L84
52791B07247P04P78M64n88j989k701k207r34M14J333J450P60L5J97J062J411N88
52774B08024o10j082q04n12m56k39K70N85L95J18L50R60J171N40m47q98n09J94
52756B07050N22K66k63o31n00J65R24J083M12m01m33M78J613K263K387K342K352
$$ plain form
52739 219629 222019 224392 226702 228936 231054 232858 234020 234457 234644 235264 236435 237612 238417 239176 240216
52724 240216 240976 240466 238561 236247 234463 233228 232110 230979 229866 228558 226950 225563 225106 225496 225834
52709 225834 225452 224527 223551 222675 221901 221491 221745 222533 223426 224191 224809 225098 224795 224055 223464 223362 223443 223194 222520
52690 222520 221726 221122 220923 221363 222536 224147 225663 226730 227296 227363 226928 226263 225930 226325 227234 228017 228169 227666
52672 227666 226825 225957 225145 224288 223324 222355 221538 220957 220770 221428 223404 226460 229439 231128 231409 231307 231909
52655 231909 233476 235691 238353 241383 244288 246085 246053 244431 242260 240579 239738 239335 238648 237275 235466
52640 235466 233888 233068 233119 233912 235209 236566 237435 237614 237399 237091 236587 235799 235244 235717 237393 239629 241625
52623 241625 242889 243116 242206 240645 239347 238769 238489 237909 237067 236412 236083 235833 235541 235393 235580 236088 236771 237468
$$ packed form
52739B19629K390K373K310K234K118J804J162M37J87O20J171J177Q05P59J040
52724B40216P60n10j905k314j784j235j118j131j113j308j608j387m57L90L38
52709B25834l82r25r76q76p74m10K54P88Q93P65O18K89l03p40n91j02Q1k49o74
52690B22520p94o04j99M40J173J611J516J067N66O7m35o65l33L95R09P83J52n03
52672B27666q41q68q12q57r64r69q17n81j87O58J976L056K979J689K81j02O02
52655B31909J567K215K662L030K905J797l2j622k171j681q41m03o87j373j809
52640B35466j578q20N1P93J297J357Q69J79k15l08n04p88n55M73J676K236J996
52623B41625J264K27r10j561j298n78k80n80q42o55l29k50k92j48J87N08O83O97
$$ plain form
52605 237468 238086 238672 239283 239723 239715 239453 239607 240470 241437 241748 241516 241539 242264 243374 244284 244618 244320 243765 243691 244511
52585 244511 245739 246533 246756 247001 247594 248215 248556 248721 248760 248470 247975 247914 248550 249154 248827 247633 246441 245841
52567 245841 245707 245712 245710 245589 245189 244553 243988 243667 243327 242543 241264 239938 239048 238626 238359 238124 238192 238848 240086
52548 240086 241755 243681 245362 245976 245202 243778 242651 241804 240610 239239 238746 239584 240917 241850 242581 243737
52532 243737 245168 246087 246080 245427 244684 244397 244907 245931 246614 246529 246300 246746 247716 248396 248548 248748 249397 250163 250488
52513 250488 250259 249859 249857 250601 251904 253275 254687 256801 260024 263648 266425 267719 267627 266357 264261 262237
52497 262237 261193 261028 260817 259989 258665 256955 254816 252707 251427 250958 250297 248814 247058 245838 245277 245282
52481 245282 246237 248453 251367 253999 255934 257366 258418 258932 258766 257901 256527 255321 255217 256461 258261
$$ packed form
52605B37468O18N86O11M40qk62J54Q63R67L11k32K3P25J110R10L34k98n55p4Q20
52585B44511J228P94K23K45N93O21L41J65L9k90m95o1O36O04l27j194j192o00
52567B45841j34Nkj21m00o36n65l21l40p84j279j326q90m22k67k35O8O56J238
52548B40086J669J926J681O14p74j424j127q47j194j371m93Q38J333R33P31J156
52532B43737J431R19po53p43k87N10J024O83q5k29M46R70O80J52K00O49P66L25
52513B50488k29m00kP44J303J371J412K114L223L624K777J294r2j270k096k024
52497B62237j044j65k11q28j324j710k139k109j280m69o61j483j756j220n61N
52481B45282R55K216K914K632J935J432J052N14j66q65j374j206j04J244J800
$$ plain form
52466 258261 259772 260963 262007 262415 261696 260574 260493 261927 263980 265788 267456 269330 271118 272198 272351
52451 272351 271737 270551 269066 267687 266520 265092 262932 260315 258051 256534 255310 253673 251507 249342
52437 249342 247710 246616 245729 244954 244588 244859 245628 246729 248346 250588 252779 253689 252806 251108 250235 250976
52421 250976 252764 254618 256191 257743 259400 260906 262222 263902 266476 269670 272780 275923 280399 287514
52407 287514 297394 309209 322159 335688 348894 360230 367924 370526 367341 358912 347188 334768
52395 334768 323660 314650 307543 301622 296101 290742 286147 283025 281132 279453 277568 276257 276471 278143
52381 278143 280399 282513 284230 285468 286268 286938 287838 289039 290538 292658 295828 299936 304283 308278 311884
52366 311884 315301 318490 321168 323153 324579 325826 327200 328602 329472 329243 327901 326102 324784 324679 325991
$$ packed form
52466B58261J511J191J044M08p19j122q1J434K053J808J668J874J788J080J53
52451B72351o14j186j485j379j167j428k160k617k264j517j224j637k166k165
52437B49342j632j094q87p75l66K71P69J101J617K242K191R10q83j698q73P41
52421B50976J788J854J573J552J657J506J316J680K574L194L110L143M476P115
52407B87514R880J1815J2950J3529J3206J1336P694K602l185q429j1724j2420
52395C34768j1108r010p107n921n521n359m595l122j893j679j885j311K14J672
52381B78143K256K114J717J238Q00O70R00J201J499K120L170M108M347L995L606
52366C11884L417L189K678J985J426J247J374J402Q70k29j342j799j318j05J312
$$ plain form
52351 325991 328258 330570 332201 333156 334000 335150 336498 337778 339091 340881 343507 346963 351025 355560 360672
52336 360672 366538 373170 380356 387850 395515 403283 411125 419264 428279 438726 450619 463486 476956
52323 476956 491062 505936 521524 537772 554840 572775 591089 608968 625893 641787 656589
52312 656589 670076 682324 694101 706407 719619 733225 746366 758497 769626 780152 790491
52301 790491 800639 809990 817768 823767 828533 832724 836418 839167 840502 840129 837809 833477 827534 820730
52287 820730 813599 806262 798850 791810 785526 779891 774643 770117 767304 767053 769381 773623 779026 785090
52273 785090 791540 798305 805614 813920 823511 834150 845187 856074 866728 877337 887906 898173
52261 898173 907997 917626 927441 937508 947543 957283 966712 975918 984890 993558 1001897 1009786 1016784 1022221
$$ packed form
52351C25991K267K312J631R55Q44J150J348J280J313J790K626L456M062M535N112
52336C60672N866O632P186P494P665P768P842Q139R015J0447J1893J2867J3470
52323D76956J4106J4874J5588J6248J7068J7935J8314J7879J6925J5894J4802
52312F56589J3487J2248J1777J2306J3212J3606J3141J2131J1129J0526J0339
52301G90491J0148R351P778N999M766M191L694K749J335l73k320m332n943o804
52287H20730p131p337p412p040o284n635n248m526k813k51K328M242N403O064
52273G85090O450O765P309Q306R591J0639J1037J0887J0654J0609J0569J0267
52261H98173R824R629R815J0067J0035R740R429R206Q972Q668Q339P889O998N437
$$ plain form
52247 1022221 1025635 1027054 1026709 1024568 1020365 1014164 1006701 998958 991440 983952 975981 967217 957864 948711
52233 948711 940730 934270 928656 922905 916854 911227 906602 902829 899684 897521 896762 897114 897906 899012 900835
52218 900835 903366 905920 908046 910214 913298 917729 923393 930036 937316 944571 951020 956316 960709 964612
52204 964612 968177 971360 974242 977115 980266 983784 987629 991762 996113 1000490 1004751 1009095 1013957 1019477
52190 1019477 1025224 1030622 1035445 1039669 1043025 1045059 1045569 1044670 1042450 1038899 1034196 1028645 1022214 1014510
52176 1014510 1005483 995874 986734 978678 971772 965880 960822 956354 952339 948969 946638 945557 945554 946161 946877
52161 946877 947534 948495 950257 952671 954836 956071 956810 958138 960477 963097 964937 965576 965285 964508 963621 963068
52145 963068 963350 964648 966550 968296 969390 969917 970225 970395 970121 969088 967304 965152 963370 962966 964829 969183
$$ packed form
52247A022221L414J419l45k141m203o201p463p743p518p488p971q764r353r153
52233I48711p981o460n614n751o051n627m625l773l145k163p59L52P92J106J823
52218I00835K531K554K126K168L084M431N664O643P280P255O449N296M393L903
52204I64612L565L183K882K873L151L518L845M133M351M377M261M344M862N520
52190A019477N747N398M823M224L356K034N10q99k220l551m703n551o431p704
52176A014510r027r609r140q056o906n892n058m468m015l370k331j081lO07P16
52161I46877O57R61J762K414K165J235P39J328K339K620J840O39k91p77q87n53
52145I63068K82J298J902J746J094N27L08J70k74j033j784k152j782m04J863M354
$$ plain form
52129 969183 975544 983353 992603 1003779 1017356 1033400 1051462 1070890 1091491 1113842 1138516 1164856
52117 1164856 1191024 1215594 1238642 1260903 1282383 1302408 1320729 1337762 1353755 1368340 1380977
52106 1380977 1391311 1399119 1404472 1408071 1410864 1413132 1414464 1414745 1414638 1414781 1414951 1414371 1412385 1408498 1402192
52091 1402192 1393263 1382168 1369611 1355892 1340972 1325120 1309121 1293960 1280580 1269834 1262207 1257450
52079 1257450 1254797 1253740 1254458 1257324 1262083 1267799 1273717 1280126 1288101 1298351 1310503 1323630 1337188
52066 1337188 1351083 1365069 1378582 1391198 1402814 1413324 1422564 1430745 1438464 1446012 1452972 1458700
52054 1458700 1462867 1465322 1465853 1464396 1461119 1456005 1448724 1439315 1428505 1416799 1403576 1387834 1369691
$$ packed form
52129I69183O361P809R250J1176J3577J6044J8062J9428K0601K2351K4674K6340
52117A164856K6168K4570K3048K2261K1480K0025J8321J7033J5993J4585J2637
52106A380977J0334P808N353L599K793K268J332K81j07J43J70n80j986l887o306
52091A402192q929j1095j2557j3719j4920j5852j5999j5161j3380j0746p627m757
52079A257450k653j057P18K866M759N716N918O409P975J0250J2152J3127J3558
52066A337188J3895J3986J3513J2616J1616J0510R240Q181P719P548O960N728
52054A458700M167K455N31j457l277n114p281r409j0810j1706j3223j5742j8143
$$ [...]
##END NTUPLES=NMR SPECTRUM
##END=
