
##TITLE=AC1348_GUAAH12166_6647719_L7WRAV9tdh
##JCAMPDX= 6.0         $$ Bruker NMR JCAMP-DX V2.0
##DATA TYPE= NMR SPECTRUM
##DATA CLASS= NTUPLES
##ORIGIN= BRUKER
##OWNER= Administrator
$$ 1.72 TOPSPIN		Version 2.1
$$ 2012-08-10 18:25:15.500 -0500  Administrator@TOPSPIN
$$ Compression mode = diff/dup
##.OBSERVE FREQUENCY= 400.02188249412
##.OBSERVE NUCLEUS= ^1H
##.ACQUISITION MODE= SIMULTANEOUS (DQD)
##.ACQUISITION SCHEME= undefined
##.AVERAGES= 64
##.DIGITISER RES= 22
##SPECTROMETER/DATA SYSTEM= spect
##.PULSE SEQUENCE= noesygpps1d.comp
##.SOLVENT NAME= COFFEE_meoh
##.SHIFT REFERENCE= INTERNAL, COFFEE_meoh, 1, 14.96263
##AUDIT TRAIL= $$ (NUMBER, WHEN, WHO, WHERE, PROCESS, VERSION, WHAT)
$$ ##TITLE= Audit trail, TOPSPIN		Version 2.1
$$ ##JCAMPDX= 5.01
$$ ##ORIGIN= Bruker BioSpin GmbH
$$ ##OWNER= Administrator
$$ $$ C:\Bruker\TOPSPIN/data/COFFEE/nmr/AC1348_GUAAH12166_6647719_L7WRAV9tdh/12/pdata/1/auditp.txt
$$ ##AUDIT TRAIL=  $$ (NUMBER, WHEN, WHO, WHERE, PROCESS, VERSION, WHAT)
(   1,<2012-08-10 18:25:10.703 -0500>,<Administrator>,<TOPSPIN>,<go>,<TOPSPIN 2.1>,
      <created by zg
	started at 2012-08-10 18:13:40.437 -0500,
	POWCHK enabled, PULCHK disabled,
       configuration hash MD5:
       6B 1B 68 BB D9 2E 58 E2 7F 35 AD 54 07 DF 0E 41
       data hash MD5: 64K
       58 87 D1 72 4C 3B 3C 29 72 51 0A D8 52 F3 34 9B>)
(   2,<2012-08-10 18:25:13.500 -0500>,<Administrator>,<TOPSPIN>,<proc1d>,<TOPSPIN 2.1>,
      <Start of raw data processing
       efp LB = 0.3 FT_mod = 6 PKNL = 1 PHC0 = 0 PHC1 = 0 SI = 128K 
       data hash MD5: 128K
       F1 FC 39 8D 7B 7D 11 3B 85 C3 B4 ED A1 18 7B CE>)
(   3,<2012-08-10 18:25:14.703 -0500>,<Administrator>,<TOPSPIN>,<proc1d>,<TOPSPIN 2.1>,
      <pk PHC0 = 3.812256 PHC1 = 0 
       data hash MD5: 128K
       37 AA 25 07 42 1B 3E CD 2A FD 79 62 0F F5 CE A4>)
(   4,<2012-08-10 18:25:15.171 -0500>,<Administrator>,<TOPSPIN>,<proc1d>,<TOPSPIN 2.1>,
      <abs ABSG = 1 
       data hash MD5: 128K
       57 D9 DE C8 A5 25 49 57 DE 6F BA FE D9 19 BD 28>)
(   5,<2012-08-10 18:25:15.250 -0500>,<Administrator>,<TOPSPIN>,<proc1d>,<TOPSPIN 2.1>,
      <abs ABSG = 2 
       data hash MD5: 128K
       50 B9 91 52 1F A3 2B B5 24 6E C0 44 86 6C 91 6F>)
(   6,<2012-08-10 18:25:15.296 -0500>,<Administrator>,<TOPSPIN>,<proc1d>,<TOPSPIN 2.1>,
      <abs ABSG = 3 
       data hash MD5: 128K
       8A E5 4B 2E 01 C7 C4 6E 80 2A 52 BA 8A 42 7F EC>)
(   7,<2012-08-10 18:25:15.375 -0500>,<Administrator>,<TOPSPIN>,<proc1d>,<TOPSPIN 2.1>,
      <abs ABSG = 4 
       data hash MD5: 128K
       A0 E4 45 29 53 CF 6B 4F 60 DB 00 F2 A1 A3 7B 77>)
(   8,<2012-08-10 18:25:15.421 -0500>,<Administrator>,<TOPSPIN>,<proc1d>,<TOPSPIN 2.1>,
      <abs ABSG = 5 
       data hash MD5: 128K
       A5 D5 37 C9 3C CC 2B 58 97 14 CC AB 0F 46 BF 69>)
$$ ##END=
$$ 
$$ $$ hash MD5
$$ $$ 71 B0 E6 BB 9C 31 F9 A9 5E BB A7 49 37 03 A6 41
##$RELAX= 
##$RELAX= 
##$RELAX= 
##$RELAX= 
##$RELAX= 
##$RELAX= 
##$RELAX= 
##$RELAX= 
$$ Bruker specific parameters
$$ [...]
150 150 150 150 150 150 150 150
##$TP07= 0
##$TPNAME0= <>
##$TPNAME1= <>
##$TPNAME2= <>
##$TPNAME3= <>
##$TPNAME4= <>
##$TPNAME5= <>
##$TPNAME6= <>
##$TPNAME7= <>
##$TPOAL= (0..7)
0.5 0.5 0.5 0.5 0.5 0.5 0.5 0.5
##$TPOFFS= (0..7)
0 0 0 0 0 0 0 0
##$TUNHIN= 0
##$TUNHOUT= 0
##$TUNXOUT= 0
##$USERA1= <user>
##$USERA2= <user>
##$USERA3= <user>
##$USERA4= <user>
##$USERA5= <user>
##$V9= 5
##$VALIST= <valist>
##$VCLIST= <CCCCCCCCCCCCCCC>
##$VD= 0
##$VDLIST= <DDDDDDDDDDDDDDD>
##$VPLIST= <PPPPPPPPPPPPPPP>
##$VTLIST= <TTTTTTTTTTTTTTT>
##$WBST= 1024
##$WBSW= 4
##$XGAIN= (0..3)
0 0 0 0
##$XL= 0
##$YL= 0
##$YMAX_a= 15183734
##$YMIN_a= -8897757
##$ZGOPTNS= <>
##$ZL1= 120
##$ZL2= 120
##$ZL3= 120
##$ZL4= 120
##$ABSF1= 14.96263
##$ABSF2= -5.595551
##$ABSG= 5
##$ABSL= 3
##$ALPHA= 0
##$AQORDER= 0
##$ASSFAC= 0
##$ASSFACI= 0
##$ASSFACX= 0
##$ASSWID= 0
##$AUNMP= <proc_prof1d_extract.lims>
##$AXLEFT= 0
##$AXNAME= <>
##$AXNUC= <1H>
##$AXRIGHT= 0
##$AXTYPE= 0
##$AXUNIT= <>
##$AZFE= 0.1
##$AZFW= 0.1
##$BCFW= 0
##$BC_mod= 0
##$BYTORDP= 0
##$COROFFS= 0
##$CY= 15
##$DATMOD= 1
##$DC= 0
##$DFILT= <>
##$DTYPP= 0
##$F1P= 0
##$F2P= 0
##$FCOR= 0.5
##$FTSIZE= 131072
##$FT_mod= 6
##$GAMMA= 0
##$GB= 0
##$INTBC= 1
##$INTSCL= 1
##$ISEN= 128
##$LB= 0.3
##$LEV0= 0
##$LPBIN= 0
##$MAXI= 10000
##$MC2= 0
##$MEAN= 0
##$ME_mod= 0
##$MI= 0
##$NCOEF= 0
##$NC_proc= -2
##$NLEV= 6
##$NOISF1= 0
##$NOISF2= 0
##$NSP= 0
##$NTH_PI= 0
##$NZP= 0
##$OFFSET= 14.96263
##$PC= 1
##$PHC0= 3.812256
##$PHC1= 0
##$PH_mod= 1
##$PKNL= yes
##$PPARMOD= 0
##$PPDIAG= 0
##$PPIPTYP= 0
##$PPMPNUM= 2147483647
##$PPRESOL= 1
##$PSCAL= 4
##$PSIGN= 0
##$PYNMP= <proc.py>
##$REVERSE= no
##$SF= 400.020008983338
##$SI= 131072
##$SIGF1= 0
##$SIGF2= 0
##$SINO= 400
##$SIOLD= 131072
##$SPECTYP= <>
##$SREGLST= <1H.CDCl3>
##$SSB= 0
##$STSI= 131072
##$STSR= 0
##$SW_p= 8223.68421052631
##$SYMM= 0
##$S_DEV= 0
##$TDeff= 65536
##$TDoff= 0
##$TI= <>
##$TILT= no
##$TM1= 0
##$TM2= 0
##$TOPLEV= 0
##$USERP1= <user>
##$USERP2= <user>
##$USERP3= <user>
##$USERP4= <user>
##$USERP5= <user>
##$WDW= 1
##$XDIM= 131072
##$YMAX_p= 441634270
##$YMIN_p= -11780
##$CURPLOT= <Network HP LaserJet P1505>
##$CURPRIN= <$Network HP LaserJet P1505>
##$DFORMAT= <normdp>
##$LAYOUT= <+/1D_H.xwp>
##$LFORMAT= <normlp>
##$PFORMAT= <normpl>
##$SURQMSG= 1
$$ End of Bruker specific parameters
$$ ---------------------------------
##NTUPLES= NMR SPECTRUM
##VAR_NAME=  FREQUENCY,     SPECTRUM/REAL,   SPECTRUM/IMAG
##SYMBOL=    X,             R,               I
##VAR_TYPE=  INDEPENDENT,   DEPENDENT,       DEPENDENT
##VAR_FORM=  AFFN,          ASDF,            ASDF
##VAR_DIM=   131072,        131072,          131072
##UNITS=     HZ,            ARBITRARY UNITS, ARBITRARY UNITS
##FACTOR=    0.0627417313425164, 1,          1
##FIRST=     8223.62146879497, 378,          -58976
##LAST=      0,             1852,            -58874
##MIN=       0,             -11780,          0
##MAX=       8223.62146879497, 441634270,    0
$$ Real data points
##PAGE= N=1
##DATA TABLE= (X++(R..R)), XYDATA
$$ [...]
64535 63116 63872 64973 65632 65633 65220 64781 64729 65207 65931 66692 67720 68968 69416 68032 65313 62955 62000 62120
64517 62120 62670 63387 63944 63870 63304 62926 62803 62188 60863 59734 59542 59831 59902 59984 60601 61358 61338 60410 59366
64498 59366 58882 59042 59684 60567 61209 61178 60613 59985 59398 58597 57655 57124 57345 57987 58489 58739 59163 60202 61748
64479 61748 63051 63279 62323 60980 60186 60146 60393 60576 60852 61454 62237 62876 63341 63832 64248 64059 62991 61656
64461 61656 61078 61501 62099 62092 61815 62240 63622 65154 65983 66085 66055 66353 66979 67589 67767 67328 66494 65667 65086
64442 65086 64877 65293 66480 67990 68950 68870 68018 66910 65819 64907 64343 63978 63257 61884 60346 59459 59526 60208
64424 60208 61111 62144 63365 64732 66037 66989 67452 67724 68391 69700 71182 72118 72276 71974 71499 70792 69751
64407 69751 68562 67527 66652 65617 64219 62732 61667 61199 61030 60928 61140 62028 63450 64855 65939 66830
64391 66830 67641 68257 68686 69198 69848 70254 70121 69716 69441 69237 68808 68279 68070 68177 68076 67490 66815 66536 66603
64372 66603 66685 66775 67097 67502 67497 66956 66439 66506 66985 67272 67180 67091 67329 67817 68491 69631 71414 73368 74634 74717
64352 74717 73776 72313 70881 69997 69963 70529 70962 70613 69449 68016 66961 66623 66946 67699 68722 69956 71267
64335 71267 72379 73036 73186 73025 72932 73316 74284 75446 76292 76787 77331 78047 78529 78513 78419 78836 79752 80705 81506
64316 81506 82368 83391 84316 84865 85011 84941 84918 85160 85649 86117 86353 86357 86145 85734 85551 86395 88524 91049 92793
64297 92793 93553 94037 94765 95673 96669 97866 99180 100274 101094 101994 103224 104726 106588 109213 112762 116751
64281 116751 120404 123323 125756 128314 131350 134458 136781 138030 138882 140039 141249 141719 141117 139582 137151
64266 137151 133998 130966 128871 127335 125224 122251 119227 116723 114536 112633 111490 111169 111048 110940 111425
64251 111425 112602 113548 113710 113824 114665 115764 116281 116377 116653 116907 116573 115966 116005 116936 118363 120262 122969 126305
64233 126305 129787 133610 138375 143717 148252 151251 153561 156413 159888 162898 164263 163532 161159 158135
64219 158135 155207 152319 149031 145377 141881 138753 135601 132086 128426 125088 122372 120459 119518 119558 120374
64204 120374 121700 123168 124187 124290 123745 123455 124021 125220 126521 127865 129633 132022 134674 136908 138203
64189 138203 138498 138114 137445 136826 136579 136943 137820 138807 139670 140526 141389 141866 141696 141300 141333 141823 142256 142429 142638
64170 142638 143033 143364 143571 144169 145741 148351 151664 155434 159632 164247 169153 174154 179171 184479 190584
64155 190584 197589 204758 211196 217104 223989 233359 245377 258938 272796 286332 299419 311933 323499
64142 323499 333589 341744 347691 351238 352074 349780 344146 335528 324864 313246 301389 289524 277804
64129 277804 266645 256434 247002 237810 228813 220804 214561 209871 205684 201221 196705 193068 191101 190755
64115 190755 191101 191083 190462 189957 190360 191757 193757 196117 198755 201399 203747 205941 208486 211615 215097 218728
64099 218728 222658 227115 232072 237414 243271 250021 257933 266904 276604 286822 297572 308736 319741
64086 319741 329812 338502 345650 350886 353670 353921 352202 349061 344619 338992 332575 325536 317606 308783
64072 308783 299798 291344 283344 275612 268679 263102 258408 253749 249423 246639 245751 245864 246385 247834 250588
64057 250588 253843 256603 259033 262022 265839 270004 274238 278823 284087 290113 296988 304874 313761 323477
64043 323477 333982 345436 357952 371434 385611 400124 414651 429053 443258 456873 469033
64032 469033 478887 486198 491458 495527 499215 502940 506560 509631 512060 514484 517866 522764 529018 535967
64018 535967 542784 548667 552971 555290 555445 553476 549726 544820 539393 533737 527785 521523 515448 510496
64004 510496 507341 505861 505468 506010 508016 511951 517531 524047 531125 538840 547350 556864 567898 581051
63990 581051 596415 613585 632305 652783 675284 699805 726343 755238 786977 821774 859394
63979 859394 899270 940782 983691 1028476 1076127 1127481 1182767 1241853 1304925 1373067 1448228
63968 1448228 1532504 1627248 1733030 1850653 1982172 2130854 2300569 2495622 2720971 2982165
63958 2982165 3285188 3636672 4043925 4513840 5051255 5658146 6333759 7074673 7874854
63949 7874854 8726708 9622557 10554580 11512642 12481921 13442023 14367663 15230747 16004026
63940 16004026 16665172 17198728 17595054 17848277 17955152 17914347 17725342 17388153 16905403
63931 16905403 16285750 15545918 14709867 13805605 12860936 11899729 10940412 9997087 9081663
63922 9081663 8205071 7377388 6607581 5902876 5267606 4702413 4204734 3770065 3392816
63913 3392816 3066722 2785428 2543020 2334000 2153140 1995970 1859301 1740658 1637160
63904 1637160 1545440 1462810 1388001 1320594 1259994 1205089 1154541 1107189 1062390 1020134 980583
63893 980583 943323 907267 871425 835543 799828 764333 728989 694102 660459 628808 599392
63882 599392 572011 546343 522129 499279 478019 458812 441870 426733 412534 398793 385749
63871 385749 373781 362770 352308 342387 333464 325790 319013 312712 307102 302939 300634 299634 298769 297296
63857 297296 295533 294397 294421 295478 297435 300545 304818 309424 313351 316539 319783 323454 326910 329293 330333
63842 330333 330027 328081 324152 318412 311471 303882 296002 288142 280480 272860 264920 256445 247465 238165
63828 238165 228821 219782 211355 203726 196956 190896 185193 179656 174593 170441 167045 163761 160333 157141
63814 157141 154380 151574 148324 145064 142569 141011 139937 138886 137575 135785 133552 131259 129103 126794
63800 126794 124262 122290 121701 122116 122282 121572 120441 119497 118923 118884 119591 120647 121072 120402 119131 117777 116238
63783 116238 114465 113012 112234 111607 110584 109667 109750 110727 111646 111958 111664 110429 107832 104714 103046 103704 105251
63766 105251 105702 104887 104186 104437 105181 105857 106653 107871 109193 110029 110152 109717 109057 108759 109517 111463 113778
63749 113778 115331 115708 115469 115581 116715 118945 121832 124838 127757 130771 134095 137780 141831 146341 151433
63734 151433 157323 164462 173315 183933 196000 209316 223773 238828 253565 267510 280738 292800
63722 292800 302199 307592 309068 307603 303658 297098 288235 278019 267202 256061 245012 234777 225757
63709 225757 217812 210806 204830 199705 194815 189729 184611 179824 175387 170996 166346 161463 156893 153382
63695 153382 151032 149081 146959 145187 144518 144566 144292 143721 144062 146053 149268 153289 158366 164472 170842 177140
63679 177140 184163 192655 202290 212620 224212 237804 252880 267933 281743 293574 302645 308281
63667 308281 310377 308954 303698 294704 283245 270880 258093 244650 230913 217781 205601 194252
63655 194252 184205 176316 170459 165404 160280 155328 151023 147430 144662 143032 142311 141694 141023 141263 143197
63640 143197 146281 149429 152408 155750 159666 163739 167652 171636 176208 181773 188443 195973 203921 212080
63626 212080 220754 230516 241776 254618 268888 284360 300980 319002 338706 359954 382132 404452
63614 404452 426019 445665 462093 474314 481769 484193 481849 475919 468102 459632 451074 443160 437183
63601 437183 434062 433357 433592 433279 431326 426890 419540 409625 398070 385730 373103 360568 348534 337292
63587 337292 326940 317530 309135 301756 295241 289271 283363 277098 270561 264462 259466 255469 251850 248535
63573 248535 246440 246573 248892 252385 256192 260315 265235 271261 278466 286994 297067 308777 322136 337253
63559 337253 354248 373018 393417 415536 439404 464313 488786 511318 530857 546547 557599
63548 557599 563866 566336 566676 566381 566504 567878 571255 577268 586363 598558 613035 628190 642235 653556
63534 653556 660556 661870 657177 647291 632875 613607 589253 561137 531554 501894 472210 442580
63522 442580 413915 387173 362656 340446 320811 303723 288617 275127 263557 254099 246064 238535
63510 238535 231488 225622 221239 217886 215081 212828 211266 210273 209648 209403 209694 210617 212204 214427 217114
63495 217114 220066 223443 227849 233758 241004 249194 258561 269886 283394 298236 313495 329281 346158
63482 346158 363687 380320 394799 406801 415973 421188 421446 416955 408650 397071 382512 365995 349194
63469 349194 333258 318353 304402 291690 280575 271120 263210 256685 251190 246282 241855 238150 235235
63456 235235 232753 230341 228035 226160 225003 224674 225148 226310 228072 230411 233296 236739 240996 246431 252939
63441 252939 259883 266959 274862 284657 296711 310684 326254 343296 361504 380561 400691 422525
63429 422525 446390 472185 499833 529295 560167 591727 623148 652910 678153 695706 704211 704817
63417 704817 699754 690898 679770 667886 656465 646148 637275 629973 623827 618022 611916 604810 595144
63404 595144 581034 562203 540566 518231 495656 472409 448950 426611 406173 387469 370283
63393 370283 354784 341139 329368 319631 312099 306520 302439 299853 299109 300082 301958 303998 306245 309317
63379 309317 313714 319412 325980 333096 341042 350626 362539 376899 393485 412078 432374 453976 476887
63366 476887 501784 529240 558635 588174 615893 640255 659828 673105 679214 678795 673850 666541
63354 666541 658074 648737 638835 629264 621024 614373 608777 603574 598201 591742 582839 570457 554632 536244
63340 536244 516236 495261 473938 453105 433672 416112 400000 384295 368440 353177 339935
63329 339935 329345 320698 312825 305131 297699 290930 285364 281395 278846 277028 275425 274117 273425 273444 273962
63314 273962 274543 274691 274386 274467 275879 278504 281350 283958 286693 289360 290617 289597 287354 285717 285183 284860
63298 284860 284137 283325 282720 281988 280741 279081 277407 276189 276007 277285 279734 282416 284488 285684 286137 286116
63282 286116 285962 285930 286004 286098 286395 287199 288436 289636 290439 290929 291404 291993 292479 292437 291634 290430 289590 289557 290088
63263 290088 290793 291727 293161 295053 297123 299315 301779 304538 307462 310500 313644 316775 319830 323053 326809
63248 326809 331219 336167 341497 347036 352625 358410 364905 372529 381211 390648 400677 411266 422501
63235 422501 434906 449413 466575 486025 506957 528817 551242 573829 596483 619614 643369
63224 643369 666930 689169 709765 729094 747267 764031 779598 794900 810869 827851 845692
63213 845692 863949 882018 899396 915725 930291 941741 948779 950891 947901 939183 924060 902927
63201 902927 877286 848660 818065 786445 754926 724557 696352 671485 650718 633601 618947
63190 618947 606261 596050 588743 584158 582288 583742 588893 597166 607721 620360 635280 652288 670752
63177 670752 690133 710139 730485 750868 771119 791194 811040 830547 849556 867960 885956
63166 885956 904095 922695 941085 957702 970979 979972 984273 983771 978580 968830 954424 935298 911916
63153 911916 885233 856167 825449 793899 762420 731658 702085 674408 649401 627262 607542
63142 607542 589800 573919 559808 547342 536684 528153 521594 516322 511813 508048 505062 502744 501200
63129 501200 500738 501187 501756 501926 502070 502817 504142 505455 506394 507243 508707 511383 515217 519406 523094 526217
63113 526217 529387 533001 536888 540791 544591 548051 550973 553763 557118 560887 564007 565982 567716 570285
63099 570285 573434 575988 577343 577814 577729 576933 575284 573170 571400 570661 570959 571535 571588 571206 571220 572063 573373
63082 573373 575032 577839 582532 588600 594821 600735 606855 613650 621053 629000 637696 647176 657049 666928
63068 666928 676807 686967 697699 709118 721054 733246 745936 760045 776373 794723 814281 834797
63056 834797 856870 881119 907597 936155 966817 999566 1034179 1070655 1109479 1151033 1194836
63045 1194836 1239692 1284589 1329260 1373892 1418509 1462754 1506117 1548249 1589107 1628966 1668371
63034 1668371 1707993 1748329 1789477 1831207 1873188 1914947 1955613 1993761 2027505 2054691 2073130
63023 2073130 2081072 2077664 2062924 2037276 2001238 1955598 1901640 1841132 1776260 1709596 1643759 1580779
63011 1580779 1521755 1467201 1417583 1373543 1335816 1305080 1281651 1265186 1254841 1249946 1250456 1256629
62999 1256629 1268427 1285316 1306513 1331262 1358960 1389160 1421422 1455128 1489525 1523929 1557796
62988 1557796 1590711 1622557 1653660 1684418 1714651 1743504 1769990 1793364 1812967 1828107 1838067
62977 1838067 1841832 1837707 1823882 1799719 1766077 1724092 1674222 1616982 1554055 1487860 1420173 1351953
62965 1351953 1284433 1219537 1158860 1102765 1050860 1002998 959465 920442 885689 854720 827017
62954 827017 802119 779729 759779 742252 726914 713336 701174 690277 680453 671276 662296 653334
62942 653334 644350 635092 625185 614675 604223 594502 585522 576732 567686 558435 549411 541119 533829 527382
62928 527382 521403 515769 510606 505696 500386 494490 488901 484663 481699 479102 476487 474234 472459 470667
62914 470667 468649 466873 465613 464358 462545 460320 458133 456095 454211 452778 452009 451598 451137 450694 450590
62899 450590 450857 451352 452133 453242 454313 454775 454315 452854 450292 446636 442249 437699 433475 429953 427240
62884 427240 424854 422013 418633 415627 413797 412879 412118 411345 410850 410619 410472 410727 411838 413391 414240 413827
62868 413827 412794 412082 411927 411972 411897 411682 411532 411713 412281 412881 413094 412953 412837 412759 412190 410730 408682 406720
62850 406720 405129 403570 401527 398849 395842 392915 390232 387842 386037 385293 385647 386343 386352 385206 383221 381035
62834 381035 379153 377825 377118 377068 377769 379192 380874 381978 381817 380269 377746 375036 373096 372496 372850 373165
62818 373165 372953 372646 372766 373245 373855 374705 375776 376415 376033 375087 374748 375700 377737 380427 383617 387357 391777
62801 391777 397069 403239 409966 417010 424567 432944 442106 451946 462723 474758 487932 501950 516846
62788 516846 532735 549436 567052 586653 609569 636013 665224 697008 732366 772457 817623
62777 817623 867623 922149 980877 1043663 1111006 1183767 1262007 1344427 1429051 1513914 1596868
62766 1596868 1675370 1747065 1810332 1863880 1905988 1934470 1947403 1943931 1924660 1891333 1845804
62755 1845804 1789306 1723003 1649093 1570668 1490313 1409391 1328822 1249865 1173781 1101349 1033177
62744 1033177 969942 911776 857861 807373 760610 718596 681668 648972 619289 591875 566537
62733 566537 543394 522644 504294 488030 473587 461121 450848 442378 434861 427862 421740 416952
62721 416952 413344 410379 407829 405892 404756 404414 404999 406986 410798 416308 422955 430337 438557 447999 458962
62706 458962 471602 486076 502588 521380 542700 566689 593281 622453 654687 690936 731936
62695 731936 777738 828144 883301 943469 1008236 1076419 1146693 1217995 1289223 1358894 1425220
62684 1425220 1486240 1539721 1583255 1614810 1633274 1638399 1630293 1609104 1575224 1529751 1474668 1412435
62672 1412435 1345352 1275318 1204070 1133318 1064459 998328 935376 875931 820194 768236 720184
62661 720184 676224 636256 599914 567205 538749 514853 494573 476274 459068 443238 429254
62650 429254 416964 405816 395321 385037 374509 363593 352691 342404 333038 324558 316918 310238
62638 310238 304590 299584 294353 288290 281933 276774 273849 272702 271985 270816 269185 267348 265456 263707
62624 263707 262290 261110 259964 259081 259054 260088 261608 262696 262769 261947 261026 260966 262106 263996 266228 269099
62608 269099 272992 277553 282178 287082 293038 300145 307787 315886 325275 336544 349405 363640 379885
62595 379885 398842 420322 443731 469118 497186 528523 563319 601540 642837 686352 730936
62584 730936 775469 818778 859471 896211 927991 953993 973391 985468 989657 985433 972636 952171
62572 952171 925963 895780 862426 826397 788850 751389 715026 679913 646025 613721 583693
62561 583693 556669 533052 512531 494076 476652 459955 444299 429953 416849 404789 393576
62550 393576 382963 372743 362911 353511 344326 334954 325295 315858 307500 300853 295959 292385 289661 287535
62536 287535 285852 284425 283259 282775 283444 285147 287194 289052 290830 292984 295828 299453 303887 309204 315669
62521 315669 323763 333809 345445 357841 370602 384286 399860 417835 438091 460356 484720 511712
62509 511712 541924 575409 611498 649337 688467 728599 768880 807780 843770 875814 903173
62498 903173 925048 940405 947914 946286 935219 916108 891374 862945 831664 797978 762613 726500
62486 726500 690615 656050 623692 593723 565913 540487 518130 498941 482072 466690 452765
62475 452765 440651 430447 422025 415159 409353 404079 399465 396231 394650 394153 394209 394898 396308 398159 400518
62460 400518 404055 408954 414261 419048 423639 428933 435104 441785 449001 456985 465472 474065 482968 492436
62446 492436 501747 509731 516093 521184 524512 524589 520523 512912 502927 491267 478328 464597 450408 435795
62432 435795 421019 406859 394048 382732 372707 363864 356136 349305 343215 338041 334120 331560 330119
62419 330119 329449 329407 330082 331518 333441 335467 337605 340298 343905 348485 354171 361230 369434 377888 385983
62404 385983 394104 402800 411606 419398 425688 430810 434860 437289 437764 436834 435375 433762 431787 429081 425390
62389 425390 420652 414991 408638 401976 395757 390986 388191 386888 386135 385582 385738 387320 390732 396075 403304
62374 403304 412396 423579 437310 453767 472626 493630 517138 543735 573612 606826 643771 684698
62362 684698 728983 775594 824170 874790 926652 977726 1025856 1069469 1107061 1136915 1157907
62351 1157907 1170067 1173917 1169730 1157943 1139872 1117423 1092071 1064363 1034200 1001317 965697 927933
62339 927933 889293 851313 815281 782031 751951 725058 701159 679983 661122 643954 627814
62328 627814 612224 596830 581304 565644 550465 536633 524612 514439 506219 500170 496185 493786
62316 493786 492618 492599 493495 494775 496071 497417 498737 499324 498167 494802 489777 484254 479095 474260 469149
62301 469149 463542 457933 452773 447804 442578 437411 433279 430809 429794 429672 430010 430503 430957 431404 432048 433080
62285 433080 434811 437776 442251 447795 453693 459782 466369 473522 480969 488650 496772 505401 514599 524910
62271 524910 536927 550358 564324 578839 595147 614360 636505 661271 688907 719798 753872
62260 753872 791076 831924 876854 925320 975993 1027394 1077671 1124175 1164130 1195722 1218039
62249 1218039 1230277 1231853 1223385 1206824 1184291 1157070 1125753 1090852 1053021 1013065 972017 931068
62237 931068 891201 853041 817148 784273 755094 729753 707833 688859 672756 659703 649545
62226 649545 641559 634955 629522 625516 622908 621122 619684 618808 618958 619963 620965 621301 621158 621225 621938 623292
62210 623292 625198 627634 630352 632839 634923 637271 640909 646273 653082 661149 670751 681977 694207 706842
62196 706842 720326 735942 754651 776541 801387 829231 860234 894154 930041 966295 1001067
62185 1001067 1032882 1060872 1084313 1102205 1113725 1119045 1119372 1116244 1111048 1105129 1099914 1096846 1097379
62172 1097379 1102791 1113589 1129250 1149049 1172988 1201305 1233090 1266113 1298158 1327929 1354466
62161 1354466 1376427 1392596 1402826 1408091 1409789 1409178 1407168 1404175 1400119 1394654 1387387 1378056 1366934
62148 1366934 1355098 1343948 1334336 1326478 1320682 1317615 1317596 1320059 1324056 1328999 1334658 1340780 1347034 1353192
62134 1353192 1359151 1364949 1370882 1377415 1384841 1393257 1402915 1414243 1427343 1441796 1457128 1473157 1489756
62121 1489756 1506726 1524224 1542950 1563457 1585441 1608056 1630842 1654015 1677911 1702435 1727174
62110 1727174 1751929 1777023 1803014 1830041 1857558 1884842 1911678 1938350 1965223 1992776 2021990
62099 2021990 2054202 2090317 2130355 2173794 2219926 2267733 2315713 2362108 2405425 2445078 2481987
62088 2481987 2518524 2557382 2600334 2648095 2700857 2758066 2817683 2876633 2932525 2984626 3033072
62077 3033072 3077781 3118501 3155354 3188858 3219726 3248951 3277713 3306830 3336567 3367117 3398718
62066 3398718 3430964 3462450 3491585 3517460 3539644 3557574 3570633 3578631 3581772 3580403 3575105 3566778
62054 3566778 3556135 3543155 3527304 3508181 3485761 3460288 3432271 3402543 3372121 3342018 3313143
62043 3313143 3286060 3260747 3236881 3214482 3193975 3175586 3159176 3144793 3132836 3123340 3115525 3108437
62031 3108437 3101727 3095548 3090058 3085377 3081689 3078951 3076636 3074024 3070601 3066172 3060861 3055099 3049199 3042906
62017 3042906 3035824 3028248 3020944 3014048 3007016 2999894 2993656 2988744 2984131 2978586 2972211 2966013 2960633 2956358
62003 2956358 2953802 2953430 2954570 2955693 2955503 2953054 2947116 2936324 2919918 2897546 2868507 2832067 2788622
61990 2788622 2739904 2687924 2634261 2580311 2527425 2476583 2428459 2383881 2343627 2307584 2274635
61979 2274635 2243632 2214086 2185838 2158639 2132365 2107313 2083924 2062353 2042448 2023915 2006272
61968 2006272 1988778 1970701 1951831 1932789 1914701 1898316 1883373 1868970 1854515 1840031 1825660
61957 1825660 1811414 1797553 1784653 1773015 1762474 1753045 1745148 1738806 1733272 1728086 1723981 1722004 1722153
61944 1722153 1723648 1726223 1730389 1736546 1744631 1754558 1766331 1779706 1794448 1810883 1829553 1850216
61932 1850216 1871734 1893193 1914792 1937543 1962434 1989919 2019975 2052654 2088673 2129256 2175269
61921 2175269 2227045 2285438 2352560 2430877 2521926 2626572 2746195 2882985 3039424 3218201
61911 3218201 3422268 3654102 3915136 4206894 4532803 4898167 5308448 5768060 6280120
61902 6280120 6845437 7460482 8115669 8794022 9469114 10103728 10652779 11071086 11322215
61893 11322215 11384813 11255920 10951296 10501738 9945861 9322713 8667047 8007062 7363527
61884 7363527 6750405 6176763 5648196 5166956 4732231 4341658 3992696 3682499 3407352
61875 3407352 3163167 2946393 2754032 2583171 2431130 2295901 2175926 2069641 1975606 1892758
61865 1892758 1820023 1755908 1698980 1648607 1604787 1567386 1536031 1510572 1491066 1477224 1468255
61854 1468255 1463355 1462077 1464130 1469082 1476326 1485178 1494901 1504757 1514017 1521904 1527650 1530737 1531096 1528975
61840 1528975 1524737 1518935 1512470 1506467 1501895 1499294 1498842 1500627 1504845 1511692 1520923 1531521 1541938 1550778
61826 1550778 1557244 1561003 1561862 1559730 1554778 1547446 1538181 1527266 1515029 1502253 1490168 1479855 1471792
61813 1471792 1466204 1463675 1465055 1470800 1480918 1495525 1514878 1538716 1566332 1597658 1633641 1674999
61801 1674999 1721240 1771674 1826887 1888310 1956572 2031204 2111824 2198766 2292605 2394112 2504938
61790 2504938 2627516 2763896 2915296 3083176 3270152 3479416 3713729 3975530 4267892
61781 4267892 4595073 4962294 5375301 5840090 6363017 6951153 7612377 8354680 9184999
61772 9184999 10108015 11124431 12228030 13401872 14614849 15819374 16951266 17934107
61764 17934107 18689595 19151743 19279820 19065742 18534420 17737406 16741789 15618188 14431711
61755 14431711 13236936 12075606 10976326 9956385 9024651 8183655 7430793 6760114 6164642
61746 6164642 5637436 5171100 4757671 4389845 4062013 3769886 3509645 3277726 3070974
61737 3070974 2886554 2721785 2574115 2441042 2320317 2210719 2112375 2025543 1949109 1880955
61727 1880955 1819672 1764968 1716260 1671834 1629732 1588722 1548208 1507973 1468336 1429746 1391992
61716 1391992 1354609 1318206 1284319 1253563 1224996 1197852 1172772 1150529 1130561 1111821 1094269
61705 1094269 1078422 1063932 1049721 1035261 1020788 1006477 992265 978365 965272 953329 942730
61694 942730 933665 925827 918122 909567 900282 891013 881916 872481 862516 852550 843230 834774 826920 819076
61680 819076 810651 801612 792577 784127 776308 769020 762377 756350 750585 745096 740607 737609 735535 733417
61666 733417 730868 727768 723580 717944 711587 705710 700617 695802 691220 687511 684991 683320 682333 682434 683964
61651 683964 686797 690663 695231 699733 703148 705051 705922 706511 707266 708324 709562 710582 711130 711582 712591
61636 712591 714234 716004 717634 719435 721774 724813 728854 734335 741183 748605 755784 762421 768406 773257
61622 773257 776117 776042 772295 764824 754670 743503 732460 721567 710489 699497 689377 680577 672762
61609 672762 665225 657565 649950 642849 636554 631000 625992 621479 617479 613836 610210 606349 602309 598459
61595 598459 595320 593273 592307 592099 592389 593179 594544 596446 598828 601644 604661 607426 609731 612040 615283
61580 615283 620170 626691 634216 642083 650265 659447 670329 682939 696880 712099 729023 747998 769043
61567 769043 792090 816923 842835 868967 895108 921603 948327 974364 998956 1022131 1044159
61556 1044159 1065008 1084714 1103688 1122263 1140482 1158589 1177015 1195547 1213260 1229736 1245435
61545 1245435 1260303 1272900 1281728 1286588 1287748 1284694 1276939 1265486 1252183 1237893 1222404 1205846
61533 1205846 1188997 1172339 1155987 1140552 1127008 1115634 1106052 1098293 1092910 1089998 1089095 1090212 1094078
61520 1094078 1101275 1111973 1126541 1145487 1168754 1196064 1228074 1266167 1310891 1361637 1418204
61509 1418204 1481731 1553727 1635116 1726695 1829614 1944903 2073275 2215895 2374544 2550447
61499 2550447 2743566 2953276 3178456 3415722 3657894 3894930 4116109 4311072 4469951
61490 4469951 4584358 4649059 4662800 4627964 4549903 4436197 4295467 4136132 3965803 3791124
61480 3791124 3617531 3449131 3288990 3139439 3002019 2877451 2765902 2667217 2581068 2507363
61470 2507363 2446565 2399060 2364102 2339977 2325445 2320356 2324537 2336802 2355678 2380614 2411741 2448694
61458 2448694 2490282 2535133 2582167 2630475 2679172 2727339 2773909 2817868 2858842 2897257 2933717
61447 2933717 2968595 3002565 3037043 3073417 3112008 3152291 3193980 3237315 3282315 3328369 3374689
61436 3374689 3420682 3465569 3507937 3545989 3578272 3604094 3623246 3635284 3639079 3633230 3617111 3591505
61424 3591505 3558183 3518993 3475452 3429008 3381335 3334151 3288714 3245525 3204711 3166887 3133579
61413 3133579 3106455 3086093 3071662 3061906 3056144 3054252 3055961 3060502 3066786 3073645 3079810 3083859 3084414
61400 3084414 3080636 3072584 3060983 3046567 3029859 3011668 2993480 2977055 2963947 2955788 2954663 2962580
61388 2962580 2980701 3009751 3051138 3106976 3178924 3267673 3373709 3497876 3640899 3802996
61378 3802996 3984345 4185304 4405565 4643232 4894750 5154920 5416310 5669084 5902147
61369 5902147 6104715 6267201 6382038 6445210 6457382 6423084 6348557 6240111 6103441 5943100
61359 5943100 5762326 5563967 5351884 5131099 4906441 4681433 4458578 4240188 4028497
61350 4028497 3825269 3631813 3449398 3279346 3122583 2979346 2849548 2733276 2630592
61341 2630592 2540825 2462536 2394559 2336924 2290402 2255192 2230404 2214786 2207545 2208364 2216980 2232962
61329 2232962 2255613 2283893 2316611 2352847 2392046 2433670 2476932 2520939 2564882 2608056 2649860
61318 2649860 2689809 2727401 2762062 2793525 2822211 2848885 2873945 2897343 2919036 2938963 2956592
61307 2956592 2971086 2982126 2989986 2994635 2995331 2991401 2982917 2970222 2953259 2931823 2906027 2876039
61295 2876039 2841702 2802925 2760267 2714664 2666789 2617115 2566423 2515749 2465977 2417964 2372990
61284 2372990 2332471 2297038 2266262 2239574 2217189 2199831 2187621 2179435 2173556 2168896 2165476 2163636
61272 2163636 2162857 2161567 2158060 2151560 2142535 2132153 2121317 2109949 2097257 2082849 2067405 2052001
61260 2052001 2037116 2022887 2010225 2001128 1997806 2001888 2014384 2035859 2066634 2107308 2159054 2222829
61248 2222829 2298422 2384971 2482266 2590409 2707891 2830940 2955023 3075858 3188266 3285131
61238 3285131 3358724 3402884 3413602 3388709 3328514 3236809 3120188 2986024 2841078 2691327
61228 2691327 2542009 2397556 2261669 2137086 2024832 1924093 1833513 1752424 1680495 1616826
61218 1616826 1560262 1510257 1466564 1428299 1394205 1363788 1337369 1315047 1296415 1281291 1269914
61207 1269914 1262254 1257906 1256857 1259702 1266778 1277576 1291181 1306792 1323615 1340746 1357419 1373023
61195 1373023 1386742 1397617 1405244 1410128 1413144 1414878 1415538 1415147 1413579 1410479 1405190 1396808 1384657 1368954
61181 1368954 1350723 1330652 1308364 1283333 1256186 1228352 1200591 1172715 1144816 1117833 1092591
61170 1092591 1069025 1046730 1025648 1005652 985937 965574 944561 923873 904395 886069 868139
61159 868139 850100 832405 816175 802154 789977 778456 766429 753220 738591 722617 705568
61148 705568 687674 669153 650637 633245 617793 604195 591996 581144 571764 563647 556733 551788
61136 551788 549637 549818 550969 552621 555655 560800 567611 575224 583283 591697 600315 609288 619052 629459
61122 629459 639603 648996 658266 668152 678469 688631 698521 708104 716871 724492 731648 739245 747038
61109 747038 753783 758609 761491 762557 761723 759026 754673 748673 740975 732058 722852 713946 705263 696582
61095 696582 688033 679931 672344 664941 657205 648952 640695 633154 626256 618992 610614 601495 592396 583361
61081 583361 573992 564430 555304 546862 538914 531536 525094 519592 514689 510432 507303 505440 504455 504230 505277
61066 505277 507993 511952 516146 519626 521896 523062 523702 524306 524872 525327 526119 527830 530367 533198 536316
61051 536316 540279 545287 550918 556809 562839 568552 573274 577070 580837 585191 589929 594844 600262 606371
61037 606371 612773 619175 625935 633555 642207 652059 663367 675876 688779 701665 714812 728255 741387
61024 741387 753853 765965 777730 788437 797850 806940 816709 827147 838019 849768 862825 876952
61012 876952 892183 909553 930063 953830 981163 1013352 1051188 1093612 1138897 1186123 1234423
61001 1234423 1282388 1330193 1381299 1440230 1509448 1589943 1683342 1791046 1912380 2046239 2193964
60990 2193964 2358606 2543102 2752342 2995515 3282562 3619710 4013063 4475633 5026260
60981 5026260 5684837 6478407 7453498 8674570 10211160 12137143 14528680 17401720 20582873
60972 20582873 23636205 25991358 27240712 27372828 26744117 25845730 25097749 24795765 25110953
60963 25110953 26011204 27159634 27975359 27906108 26720198 24582841 21890195 19040592 16311698
60954 16311698 13856543 11738781 9960012 8485338 7270806 6277431 5469055 4810490
60946 4810490 4272815 3835296 3479558 3186141 2938481 2725894 2540543 2374941 2224161
60937 2224161 2086869 1961916 1846446 1738805 1640332 1552295 1473511 1402637 1340129 1285737
60927 1285737 1236086 1186899 1136274 1084494 1032440 981700 934425 891372 851352 813756 779915
60916 779915 750798 725254 701967 681294 663563 647404 631563 616835 604438 593882 584138 575448
60904 575448 568244 561686 555112 549654 546547 545012 543582 542344 542036 542154 541968 542319 544334 547301 549899
60889 549899 552617 556745 561624 565238 567171 568844 570957 572688 573347 573005 571450 568141 563240 557358 550425
60874 550425 542108 533020 524168 515607 507085 499502 494120 490705 488023 485819 484654 484155 483282 482210 482198
60859 482198 483605 485686 488283 492016 496746 501570 506532 512738 520524 529007 537726 547347 558523 571373
60845 571373 586185 603217 621522 639263 655329 669459 680936 688769 693305 696129 698122 699111 699549
60832 699549 700717 702717 703898 703034 700662 697654 693856 688998 683697 678645 673693 668542 663496 658839
60818 658839 654186 649018 643245 636901 629985 622877 616090 609434 602325 595082 588903 584266 580383 576550
60804 576550 572961 569787 566610 563284 560397 558320 556640 555088 554215 554731 556907 561001 567309 575332 583775
60789 583775 591911 600253 609466 619354 629318 639019 648186 656510 664216 672065 680333 688297 695031 700206
60775 700206 703990 706844 709548 712695 716046 719066 722088 726066 731117 736291 740857 744851 748216 750526
60761 750526 751795 752490 752475 751067 748462 745953 744277 742827 740970 739071 737619 736302 734629 732757 731211
60746 731211 730401 730637 731765 732536 731290 727643 722712 717565 712454 707645 703717 700675 697976 695778 694874
60731 694874 694987 694549 692771 690576 688807 686914 684335 681826 680242 679027 677049 674154 670924 667621 664282
60716 664282 661170 658319 655269 651867 648567 645382 641502 636676 631919 628077 624684 621136 617975 615908
60702 615908 614422 612505 610062 607537 604706 600931 596218 591128 585982 580814 575652 570253 564107 557318
60688 557318 550851 545370 540486 535618 530737 525708 519949 513523 507546 502691 498290 493842 490338 488841
60674 488841 488628 488074 486818 485952 486571 489143 493691 499436 504800 508884 512559 517166 522649 527978 532854
60659 532854 537833 543122 548363 553392 558290 562903 567117 571357 576140 581499 587416 594222 601824 609170
60645 609170 615304 620421 625137 629395 632980 636463 640674 645782 651708 658816 667265 676415 685765 695761
60631 695761 706639 717315 726598 734763 742661 749975 755709 759783 762642 763769 762168 758096 752846 746903
60617 746903 739650 730885 721376 711902 702849 694695 687826 681936 676596 672288 669863 669208 669533 670732 673328
60602 673328 677162 681238 684815 687584 688909 688078 685385 681991 678663 675499 672754 670948 670155 670127 671076
60587 671076 673527 677483 682547 688628 695659 702843 709081 713953 717520 719628 720403 720922 722168 723622 724082
60572 724082 723552 722996 722526 721270 718970 716279 713371 709551 704428 698258 691048 682533 673238 664414 656669
60557 656669 649621 642983 636884 631061 624924 618677 613392 609746 607545 606511 606595 607517 609088 611953 616951
60542 616951 623727 631198 639447 649946 663815 681135 702139 727704 758165 792744 830413 870045
60530 870045 909287 944434 972149 990546 998452 994916 980241 956729 927833 897065 867713 842367
60518 842367 822005 806165 794453 787232 784659 785924 789820 795375 801634 807619 812860 817450 821447
60505 821447 824879 828322 832720 838631 846431 857091 871725 890474 912965 939864 972705 1012168
60493 1012168 1057884 1110054 1169661 1236551 1308728 1384300 1463070 1545811 1633497 1728212 1833930
60482 1833930 1955626 2098497 2268575 2472774 2716744 3002193 3325133 3674119 4028594
60473 4028594 4360347 4639181 4839014 4940803 4933667 4816979 4602220 4311426 3972174 3611987
60463 3611987 3254086 2914949 2604066 2325773 2081341 1869865 1688458 1532963 1399048
60454 1399048 1283097 1182713 1096622 1023598 961411 907361 859828 818542 783300 753302 727913
60443 727913 707018 690110 675832 662877 650650 638770 626795 614860 603652 593265 582869
60432 582869 572075 561776 553027 545809 539550 534146 529729 525986 522406 518871 515565 512692 510621 509763
60418 509763 509937 510402 510808 511515 512710 513992 515261 517204 520340 524175 527854 531101 534065 536759 539117
60403 539117 541158 542776 543862 544874 546680 549592 553122 556866 560947 565496 570494 576282 583279 590969
60389 590969 598110 604179 609605 614350 617543 619002 619822 620699 620776 618998 615632 611667 607630 603793 600523
60374 600523 597546 593844 589258 585339 583532 583260 582883 581875 580970 580741 581147 582094 583477 584972 586630 589214
60358 589214 593161 597651 601534 604706 607769 610978 614494 619161 625806 633964 642302 650142 657693 664976
60344 664976 671519 677138 682135 686659 690577 694093 697838 702076 706293 709721 712092 713812 715553 717736
60330 717736 720446 723992 729309 737244 747552 759153 771303 783672 795244 804263 809639 811560 810316
60317 810316 805518 797054 785857 773119 759528 745849 733271 722364 712531 703273 695117 688444 682322
60304 682322 675673 668940 663478 659737 657133 655338 654594 654936 655985 657427 659024 660352 661142 661637 662111
60289 662111 662406 662442 662684 663537 664816 666387 668709 672023 675604 678606 681119 683654 686133 688223 690172
60274 690172 692506 695303 698445 702056 705975 709437 712177 715288 720070 726495 733690 741402 750026 759637
60260 759637 770022 781350 793887 807429 821923 838303 857719 880211 905098 932352 962611
60249 962611 996091 1032514 1071981 1115008 1161806 1212424 1267522 1328228 1395264 1468883 1549418
60238 1549418 1637082 1731389 1831507 1936879 2046657 2158680 2269905 2377850 2480943 2577561
60228 2577561 2665551 2742798 2807776 2859590 2897917 2922736 2933757 2930443 2913068 2883461 2844262
60217 2844262 2797830 2746279 2691936 2637117 2583866 2534400 2491236 2456223 2430004 2413053 2406654
60206 2406654 2412190 2430132 2460418 2503172 2558318 2625302 2703976 2794864 2897532 3009450 3127412
60195 3127412 3249145 3372221 3492362 3604489 3705141 3792553 3864940 3920247 3957363 3976057
60185 3976057 3975853 3956254 3917944 3862588 3791743 3707363 3613160 3513976 3413757 3315347 3222019
60174 3222019 3137527 3064388 3003495 2955721 2922689 2905626 2904522 2918824 2948084 2991777 3049202
60163 3049202 3119474 3200580 3288405 3377705 3464128 3544473 3615394 3673386 3716376 3744227 3757381
60152 3757381 3756008 3740715 3713037 3674902 3628447 3576610 3523076 3471302 3424116 3384162 3353917
60141 3353917 3335152 3329091 3337087 3360523 3400305 3457297 3532993 3628917 3745657 3883452 4043393
60130 4043393 4226963 4434770 4666950 4924341 5207538 5514702 5841657 6184182 6538680
60121 6538680 6900403 7262610 7618039 7960020 8281850 8576577 8838163 9062001 9243911
60112 9243911 9379609 9465624 9499708 9480050 9405181 9275307 9093105 8863154 8591663 8287043
60102 8287043 7959513 7619344 7275936 6938429 6615777 6315453 6042695 5801199 5593612
60093 5593612 5421038 5283101 5179137 5108834 5071677 5066633 5092420 5147042 5226827 5326912 5442732
60082 5442732 5569852 5702165 5831734 5951191 6055371 6140389 6202578 6239337 6250132 6235889
60072 6235889 6198076 6138813 6060871 5966638 5857539 5734855 5600432 5456163 5303524 5144153
60062 5144153 4980398 4814979 4650806 4491256 4339766 4198702 4069350 3953168 3852114
60053 3852114 3767374 3698762 3645910 3609308 3589773 3587729 3603460 3637313 3689170 3758389 3844417
60042 3844417 3946545 4062620 4188830 4321086 4455646 4588030 4712489 4823472 4917027 4990408
60032 4990408 5041179 5067429 5068247 5043423 4993294 4919330 4824254 4711133 4582929 4443243 4296750
60021 4296750 4148372 4002470 3862940 3733219 3615735 3511845 3422476 3348161 3288544 3242969
60011 3242969 3211895 3196730 3198025 3214925 3246851 3294594 3359232 3441101 3540520 3658429 3795290
60000 3795290 3949919 4119869 4302031 4491981 4683373 4868945 5042011 5196955 5329247
59991 5329247 5435840 5515120 5565990 5587304 5578348 5539154 5470127 5372184 5247797 5101410 4938673
59980 4938673 4765887 4590073 4418229 4255837 4106696 3974250 3861878 3771418 3702556 3654354
59970 3654354 3626530 3618700 3629428 3656827 3699550 3756733 3827676 3911898 4008584 4115507 4229210
59959 4229210 4346423 4464327 4579343 4687158 4784606 4870387 4943470 5002194 5045789 5075476
59949 5075476 5093026 5099304 5095216 5083095 5066124 5047264 5029809 5018176 5017157 5030968 5063693 5119730
59937 5119730 5202872 5315696 5460632 5640631 5857792 6112178 6402976 6729899 7092017 7485487
59927 7485487 7903165 8335568 8770880 9194176 9587675 9932100 10208281 10399463 10494275 10488431
59917 10488431 10384071 10188558 9914218 9577497 9196314 8787625 8367088 7949234 7546221
59908 7546221 7166522 6815461 6496565 6212002 5962749 5749453 5572771 5432388 5326568
59899 5326568 5253477 5212223 5202011 5221343 5269021 5345065 5449478 5580561 5735178 5909779
59889 5909779 6100050 6299938 6501778 6696761 6874701 7024359 7135348 7199672 7211472 7166855
59879 7166855 7065403 6911324 6712232 6477222 6216289 5939852 5657152 5375429 5101117
59870 5101117 4840460 4597787 4374409 4170687 3988237 3828731 3691507 3573960 3473513
59861 3473513 3387560 3312209 3243044 3177107 3112968 3049385 2985370 2921214 2858057 2796745 2738393
59850 2738393 2685496 2640801 2605148 2577703 2557992 2546173 2541300 2540699 2541129 2539456 2532427 2517271 2492944
59837 2492944 2460056 2419764 2373648 2324266 2274506 2226333 2181083 2140578 2106708 2080016 2059964
59826 2059964 2046607 2040830 2042795 2051149 2063800 2078684 2094122 2109794 2127679 2151084 2182483 2222807
59814 2222807 2272282 2330473 2395157 2462277 2527754 2589095 2645293 2695821 2739828 2775870 2802344
59803 2802344 2818594 2825496 2824732 2817859 2806456 2792601 2778574 2766446 2758430 2757050 2764276 2780926 2807504
59790 2807504 2845133 2895156 2958642 3037019 3132515 3247266 3382843 3541563 3727510 3945391
59780 3945391 4199169 4492393 4828119 5205885 5617808 6046983 6467544 6845054 7140166
59771 7140166 7318274 7360715 7269628 7064531 6775293 6435242 6075050 5718494 5381828 5075421
59761 5075421 4804687 4570408 4370543 4202769 4065071 3954675 3868020 3801960 3754166 3722645
59751 3722645 3705914 3703465 3715105 3740137 3778052 3829460 3895160 3974834 4067791 4174489 4296110
59740 4296110 4433163 4585937 4755911 4945316 5155625 5387735 5643274 5924414 6232864
59731 6232864 6570376 6939762 7343966 7784471 8261759 8776208 9326403 9906656 10507630
59722 10507630 11118758 11728217 12321422 12882627 13399330 13864744 14277458 14641659 14968077
59713 14968077 15272182 15570129 15876874 16206870 16573163 16984161 17442233 17945224 18486994
59704 18486994 19055707 19633503 20199156 20730550 21205319 21602211 21904241 22100931 22188407
59695 22188407 22169527 22054532 21859675 21603851 21306808 20989781 20675169 20383809 20132830
59686 20132830 19935851 19803512 19743395 19761117 19862434 20053475 20338951 20721748 21204560 21790106
59676 21790106 22478874 23267573 24149383 25112696 26137385 27192333 28236462 29220679 30089228
59667 30089228 30783307 31248650 31443914 31346548 30956312 30296361 29409663 28351042 27179401
59658 27179401 25952973 24725676 23542872 22438621 21435724 20545988 19768573 19088333
59650 19088333 18476620 17894697 17299884 16655164 15939488 15152480 14310803 13440208 12568432
59641 12568432 11720174 10913906 10161253 9468456 8837484 8266366 7750781 7286663 6870738
59632 6870738 6498788 6165373 5866063 5598462 5360225 5147645 4957242 4787467 4637749
59623 4637749 4506855 4393129 4295268 4211823 4140783 4080503 4030246 3989089 3955102 3926215 3900893
59612 3900893 3877162 3851813 3821392 3783412 3736352 3679480 3613299 3539258 3458564 3372112 3281864
59601 3281864 3191026 3102310 3016962 2935879 2860386 2791374 2728886 2673250 2625520 2586253 2554888
59590 2554888 2530830 2514016 2504030 2499933 2501424 2508825 2521500 2537718 2556599 2578626 2603596 2629712
59578 2629712 2655480 2680864 2705621 2728266 2747921 2765774 2783485 2801499 2820225 2841547 2867748
59567 2867748 2899874 2938285 2983768 3036949 3097732 3166547 3245164 3335100 3436238 3548225 3672329
59556 3672329 3810740 3964847 4135282 4322744 4527520 4748759 4985055 5234958 5496082
59547 5496082 5764551 6036116 6307002 6573159 6829966 7073577 7301578 7511852 7702352
59538 7702352 7872635 8023349 8152438 8253502 8320209 8351961 8354187 8334523 8300332 8258472 8214810
59527 8214810 8173884 8140562 8121834 8125689 8158502 8224361 8325796 8462995 8631936 8824122 9027932
59516 9027932 9229635 9414153 9566709 9674415 9726470 9714195 9632225 9479421 9258109 8973381
59506 8973381 8633932 8252337 7842841 7418858 6992695 6575933 6178233 5805984 5462966
59497 5462966 5151576 4872620 4625056 4407304 4218252 4056191 3917935 3800351 3702016 3622326
59487 3622326 3560016 3513906 3484153 3471320 3474867 3493787 3527974 3577713 3642669 3722723 3819056
59476 3819056 3933041 4064737 4213701 4380398 4565366 4767647 4985361 5216882 5459708
59467 5459708 5708564 5955982 6194221 6415319 6610072 6768804 6883268 6947110 6955664 6907212
59457 6907212 6804292 6652457 6458024 6227955 5970910 5696438 5412965 5127483 4846506
59448 4846506 4575756 4318986 4078111 3854175 3647328 3456643 3281267 3121358 2977024
59439 2977024 2847118 2730156 2625609 2533076 2451072 2377962 2313277 2256851 2207632 2164735 2128624
59428 2128624 2099672 2076552 2057757 2043737 2035655 2032869 2033557 2037058 2043599 2052542 2063078 2076022 2092713
59415 2092713 2112856 2135889 2163697 2198505 2237463 2272207 2295225 2305342 2306936 2306139 2308640 2318774
59403 2318774 2338731 2369160 2411102 2466163 2533939 2610069 2687701 2760981 2827927 2891547 2958560
59392 2958560 3035919 3127880 3236432 3363642 3512119 3683513 3878405 4098158 4345830 4624969
59382 4624969 4938486 5288840 5678253 6108240 6579228 7090052 7636438 8209603 8796854
59373 8796854 9383591 9954694 10495679 10994948 11445774 11845799 12195219 12496431 12754539
59364 12754539 12976140 13166914 13330735 13470189 13586229 13677103 13738562 13765026 13750026 13686596
59354 13686596 13569277 13396241 13169111 12891741 12570428 12214340 11833371 11434983 11023742
59345 11023742 10603115 10176153 9744921 9311155 8877720 8448418 8026810 7616566 7222488
59336 7222488 6849509 6500759 6177747 5881896 5614326 5374556 5161036 4972767 4809057
59327 4809057 4668239 4548340 4448637 4368826 4307086 4260690 4228096 4208607 4200400 4200972 4209168 4224544
59315 4224544 4244787 4266040 4285856 4303718 4318447 4327403 4328712 4322272 4308020 4285135 4253600 4214754
59303 4214754 4169718 4118867 4063408 4005886 3948518 3892519 3839454 3791615 3750453 3716049 3688716
59292 3688716 3669816 3660599 3661603 3673607 3697890 3735127 3785227 3848576 3926205 4018470 4124776
59281 4124776 4244775 4378679 4526318 4687002 4860150 5044610 5237276 5433292 5626840
59272 5626840 5810136 5972691 6104553 6200969 6262414 6290550 6286534 6253005 6194582 6115231 6017196
59261 6017196 5903186 5777397 5643341 5502538 5356239 5206751 5056221 4905827 4756994
59252 4756994 4611762 4471253 4335416 4205020 4082251 3968525 3863467 3766856 3680035 3604498
59242 3604498 3540569 3488292 3448246 3420770 3405873 3404572 3418952 3450293 3498621 3564653 3650611
59231 3650611 3758567 3889666 4045693 4229748 4444562 4691598 4972349 5288568 5640031
59222 5640031 6023161 6432067 6858811 7291483 7713778 8107964 8457652 8747630 8963345
59213 8963345 9092529 9127164 9063968 8904713 8656938 8333078 7948122 7518675 7063302 6600635
59203 6600635 6145528 5708028 5295956 4916014 4571602 4262069 3985632 3741445 3528038
59194 3528038 3342036 3180012 3039972 2919822 2816162 2726053 2648383 2582156 2525016 2474867
59184 2474867 2431549 2395550 2366363 2343341 2326687 2316243 2310605 2308740 2311244 2318770 2330495 2345386
59172 2345386 2363814 2386694 2414140 2446006 2482644 2524084 2569570 2618736 2672022 2729182 2788736
59161 2788736 2849590 2911597 2973799 3033912 3090501 3143710 3192734 3234482 3266207 3287675 3299375
59150 3299375 3300452 3290146 3269717 3241259 3205886 3164539 3119159 3071476 3021986 2971531 2922441
59139 2922441 2876598 2833819 2793709 2757641 2727324 2702909 2684255 2672663 2669446 2674087 2685639 2704826
59127 2704826 2732926 2769673 2814208 2867091 2929583 3001806 3083412 3175230 3278556 3393546 3519763
59116 3519763 3657337 3806030 3964145 4130113 4304384 4488092 4680566 4879552 5082963
59107 5082963 5288834 5494479 5697429 5896561 6090867 6277717 6453456 6614450 6755804
59098 6755804 6869923 6948085 6983020 6969178 6902259 6780892 6608396 6391361 6137110 5853747
59088 5853747 5551201 5239793 4927786 4621491 4326745 4048411 3788884 3548660 3327928
59079 3327928 3126343 2942189 2773508 2619633 2480281 2353964 2238802 2134118 2039605 1953671
59069 1953671 1874346 1801259 1735033 1675208 1620407 1570105 1524620 1483607 1446063 1411586 1380372
59058 1380372 1352188 1326446 1302931 1281397 1261021 1241266 1222685 1205880 1190357 1175390 1161215
59047 1161215 1148289 1136268 1124774 1114275 1105133 1096871 1089536 1084580 1083008 1083666 1084780 1086184 1088689
59034 1088689 1092447 1097577 1105365 1117198 1133028 1152162 1174531 1199696 1225705 1250527 1273605 1294557
59022 1294557 1311617 1323152 1329740 1332949 1333137 1330255 1325749 1321680 1318728 1316839 1316979 1320430 1327185 1336788
59008 1336788 1349768 1366329 1384529 1401802 1417437 1431661 1443128 1449559 1450228 1445816 1436432 1421963
58996 1421963 1403930 1384900 1366250 1348140 1331115 1315963 1302491 1290204 1279713 1271831 1265911 1260827
58984 1260827 1256918 1255200 1255387 1256521 1258887 1263356 1269457 1275965 1282792 1290535 1298865 1307204 1316330 1327415
58970 1327415 1340218 1354069 1369758 1388410 1409244 1430540 1452155 1475004 1498860 1522849 1547395
58959 1547395 1573393 1600039 1625698 1650358 1675081 1699702 1723418 1747056 1772356 1799467 1827527
58948 1827527 1857249 1890473 1927514 1967387 2010404 2058136 2110927 2167817 2228812 2295009 2366604
58937 2366604 2443034 2524987 2614044 2710428 2813235 2922823 3040930 3168714 3306786 3456917
58927 3456917 3621484 3801422 3996864 4209559 4442445 4697176 4974362 5275922 5604767
58918 5604767 5962399 6349392 6768287 7223441 7717748 8251559 8824732 9437166 10086797
58909 10086797 10768801 11476469 12200383 12926233 13635140 14306025 14916173 15440679 15854958
58900 15854958 16139289 16280593 16271742 16112778 15813185 15390325 14864871 14258769 13595804 12899937
58890 12899937 12191558 11486620 10798608 10138639 9513712 8927554 8383232 7882710 7424341
58881 7424341 7004010 6619020 6268345 5949244 5656786 5387163 5138683 4909219 4695614
58872 4695614 4496232 4311398 4140642 3981976 3834340 3698202 3573182 3457509 3350269
58863 3350269 3251757 3161235 3076884 2998443 2927415 2864198 2807421 2756396 2711660 2672802 2638522
58852 2638522 2609304 2587232 2572477 2562622 2556176 2554179 2557710 2566467 2580549 2601078 2628174 2660624
58840 2660624 2698238 2742230 2792763 2848512 2909144 2975732 3048350 3125858 3208549 3298388 3396151
58829 3396151 3501090 3613871 3736946 3871518 4017141 4175026 4348660 4540219 4749433
58820 4749433 4977043 5226509 5501233 5802935 6133900 6497916 6897713 7334030 7808225
58811 7808225 8322945 8878962 9473896 10104747 10768253 11456890 12156921 12851507 13522835
58802 13522835 14149927 14707756 15171314 15519469 15734957 15804892 15724574 15499554 15142736 14671234
58792 14671234 14106320 13472522 12793449 12089098 11377340 10674835 9994517 9344172 8728890
58783 8728890 8152903 7618073 7123242 6666726 6247657 5864028 5512134 5189208 4894176
58774 4894176 4624698 4376181 4145232 3931462 3734429 3551429 3379967 3219981 3071847
58765 3071847 2934401 2806419 2687818 2577993 2475269 2379316 2291734 2212943 2140939 2074337
58755 2074337 2013997 1960381 1912027 1868114 1829698 1796862 1767411 1740082 1716305 1697065 1680772
58744 1680772 1666009 1653569 1643873 1635043 1625482 1615730 1605821 1593517 1577333 1558910 1540356 1521589
58732 1521589 1502153 1483166 1465493 1448370 1431532 1416195 1402090 1386302 1366965 1345582 1323802
58721 1323802 1300764 1275612 1249767 1224401 1198331 1170644 1142793 1115932 1088885 1061003 1034280
58710 1034280 1010253 987521 964681 942970 923548 904983 886047 868322 853345 839787 826118
58699 826118 813421 802846 792899 782065 771546 762578 753649 743389 733656 726652 721328 715765 710787
58686 710787 708074 706890 705857 705858 707950 710322 710483 708697 706434 703405 699079 695127 693389 693141 693044 693721
58670 693721 695658 696908 695911 694427 694656 695650 695743 696208 699002 702814 704817 704696 703742 701764 698091 693917
58654 693917 690488 686725 681627 677097 675200 674611 673178 672111 674240 679824 687481 697527 710875 726188
58640 726188 741452 757041 774126 791770 808808 826857 848201 872303 897615 925023 956256
58629 956256 990679 1027059 1066685 1111410 1160496 1212952 1271077 1338059 1413858 1497153 1589449
58618 1589449 1693368 1808630 1933904 2071128 2223915 2392797 2575829 2772442 2982587
58609 2982587 3202923 3427300 3649621 3862438 4054147 4211824 4326526 4393134 4407267 4366861
58599 4366861 4275975 4143265 3977465 3787290 3583483 3376266 3171303 2971528 2781405 2605488
58589 2605488 2444312 2296003 2160904 2040706 1934366 1839234 1755215 1683737 1623509 1571444
58579 1571444 1526805 1490351 1460243 1432853 1406852 1382719 1359348 1335206 1311804 1291843 1274768
58568 1274768 1258166 1242503 1230230 1221081 1212493 1203816 1195859 1187011 1174067 1156396 1135472 1111239
58556 1111239 1083011 1053066 1025092 999786 975857 954211 936969 923340 910752 899079 889602
58545 889602 881012 870986 860548 852280 845294 836717 826984 818704 811236 801557 789811 778914 769192
58532 769192 758497 747097 737256 728291 717245 704396 693034 683736 673804 662461 651780 642293
58520 642293 632407 622337 614140 607687 600879 593788 588318 584123 579241 574372 572053 572049 571993 571977 573932 577212
58504 577212 579559 581642 585772 591073 595074 599079 606441 616272 624573 631046 639040 649219 659157 668920
58490 668920 681013 694813 706917 717073 728013 739478 748317 754497 760986 767550 770724 770101 768630
58477 768630 766472 760747 751598 742301 733011 720742 705920 692495 680994 667938 652881 639446
58465 639446 628510 616952 604201 593593 586070 578908 571759 567542 566234 564262 561231 560783 563548
58452 563548 565725 565886 566607 568182 567531 564776 564128 566635 568816 569974 573966 581989 590592 598676 609466
58437 609466 623557 636902 647793 658878 670225 677605 679991 681640 684232 684082 679833 675753 674435
58424 674435 673190 670674 670150 672911 675219 675102 675784 679220 682605 684338 687057 691716 695129 696376 699257
58409 699257 705397 711364 715476 720857 728816 735842 740080 743968 747607 746662 740000 732345 726085 717701
58395 717701 705768 695056 688771 683830 677820 673656 673230 673250 671517 670797 672623 673894 673459 675367 681730
58380 681730 688899 694305 700320 707873 713377 715634 718680 724174 728257 729478 732181 738337 743901 747200
58366 747200 752842 763026 772994 779538 786000 794500 801449 805440 811249 821155 830516 836753 844286 855657
58352 855657 866493 874429 884048 897339 908208 912363 913923 916305 915583 909249 902604 899728 896735 890602
58338 890602 886009 886627 888306 887841 889785 897526 906251 911937 918692 930033 941688 950376 960793 976357
58324 976357 991913 1003245 1014844 1030508 1045528 1056278 1068286 1086342 1105670 1121365 1137392
58313 1137392 1157546 1176736 1190062 1201514 1214871 1225243 1228560 1230083 1234615 1237912 1236890 1238141
58301 1238141 1246655 1256267 1261314 1267495 1280829 1296192 1307625 1319797 1338123 1357647 1373065 1389596
58289 1389596 1412466 1435766 1453334 1470469 1493204 1516651 1536005 1558134 1589599 1624044 1654315
58278 1654315 1686103 1726398 1769711 1809437 1851444 1902030 1953608 1996952 2036571 2079313 2119350
58267 2119350 2149705 2177126 2209892 2242506 2268245 2294793 2331005 2370364 2404438 2440184 2486393
58256 2486393 2535832 2579224 2624229 2681702 2745872 2807433 2872986 2951441 3034499 3111523 3190431
58245 3190431 3282438 3379741 3470491 3561993 3666208 3776404 3881961 3991868 4118887 4255005
58235 4255005 4388017 4527393 4687399 4860098 5032523 5214547 5421007 5642750 5865472
58226 5865472 6100418 6365092 6651140 6944208 7257322 7609827 7992112 8387815 8811672
58217 8811672 9287027 9806352 10354860 10952002 11626444 12372466 13177355 14068465 15084144
58208 15084144 16223907 17481336 18900618 20544817 22439688 24613661 27161850 30198741
58200 30198741 33778794 37939896 42790148 48471243 55088548 62792505 71904534 82875913
58192 82875913 96206596 112566237 132947387 158537971 190482397 229766616 276647997
58185 276647997 328954785 380330192 420959580 441634270 438409558 414071009 375657469
58178 375657469 330720149 285067239 242367689 204522210 172122349 144969815 122553308
58171 122553308 104265964 89437707 77412155 67660408 59786302 53457329 48396097
58164 48396097 44419599 41432796 39389042 38281053 38155663 39116429 41275931 44573003
58156 44573003 48469280 51838730 53387866 52399731 49115948 44410629 39178244 34023732
58148 34023732 29304498 25208420 21759641 18877095 16483458 14528256 12934773 11604587
58140 11604587 10478966 9540198 8756082 8076766 7482397 6981392 6561105 6185497 5839768
58131 5839768 5533508 5260443 4995896 4733733 4487813 4257529 4027834 3802186 3600537
58122 3600537 3424995 3259932 3104613 2973609 2866012 2765659 2671311 2596061 2536610 2472455
58112 2472455 2396469 2319076 2242220 2156566 2065160 1983248 1912922 1842400 1771054 1710797 1662057
58101 1662057 1612590 1561323 1519916 1489182 1456815 1420335 1390105 1367492 1341453 1309234 1279864
58090 1279864 1254815 1225160 1190285 1160016 1135765 1108355 1076692 1049982 1029079 1003997 972673
58079 972673 944509 922562 899470 873783 853364 839524 824063 805059 789833 779455 765916
58068 765916 747622 732523 722943 712116 698512 688889 684253 677205 666234 658634 656240 652050 643866
58055 643866 637642 634385 627300 615121 605124 599638 592405 581467 573046 569293 564572 557173 552669 552339
58041 552339 550100 544164 540282 540333 539118 535448 535002 539140 542065 542096 544570 550532 553712 551879 550264
58026 550264 550633 547964 541168 536181 534907 531786 524806 519317 517324 513531 505853 499606 497336 494442
58012 494442 488773 484773 484127 481958 476367 472330 472110 471050 466870 464046 464910 465269 462871 461419 462262
57997 462262 460858 455428 450522 447999 443044 433165 422713 414486 405313 394043 385483 382074 379734 376185
57983 376185 375319 379053 382879 383978 385917 390889 395013 395850 397018 400728 403186 402098 401441 404039 406421
57968 406421 405725 404879 406183 406421 403050 398879 396194 392564 386701 382061 380389 378023 372743 367785 364990
57953 364990 360742 353170 346621 344297 342955 339678 337444 338978 341356 341890 343377 348264 353341 355486
57939 355486 357172 361036 364298 363872 361995 361621 360990 357777 353990 351797 348889 342718 335056 327985 319811
57924 319811 309275 299279 292102 285419 277310 270597 267845 266692 264604 263713 266404 270541 273624 277387
57910 277387 283784 290693 296130 302512 312202 322828 331453 339298 347962 355102 358460 360242 362993 364974
57896 364974 364027 362125 361615 360762 357418 353324 350340 346275 339016 331022 325122 319576 311956 304318 299691
57881 299691 296842 293258 290028 289038 288536 286228 283841 283976 285351 285635 286123 289107 293389 296820 300553
57866 300553 306504 313322 319017 324832 332305 339393 343668 346543 350165 353116 353423 352848 353678 354095 351289
57851 351289 346518 342645 339213 334376 329135 325248 321424 315917 310469 307296 304723 300206 295174 292402
57837 292402 291071 288958 287065 287328 288029 286279 283025 280896 279126 275321 270362 266751 263759 258902 252660
57822 252660 247168 241729 234237 225752 219251 215027 211408 208608 207641 206899 204134 200562 198861 198424 196810
57807 196810 194575 194295 195914 197332 198692 201943 206963 212024 217260 223902 230937 236055 238910 240053
57793 240053 238116 231857 223676 217263 212962 209167 206783 208126 212564 217404 222157 227859 233171 235374
57779 235374 234610 233263 231768 228829 224944 221780 218622 213290 206105 199337 193347 186848 180395 176001
57765 176001 173828 172693 173158 176634 182135 187412 192596 199247 206589 212305 216380 220586 224793 227348
57751 227348 228498 229921 231552 232298 233166 236049 240134 243120 245298 248777 253293 256642 258777 261708 265674
57736 265674 269028 271586 274568 277625 279492 281093 284412 288716 291614 293522 297382 304150 312207 320965
57722 320965 331364 342881 353676 363665 374076 384197 392059 398225 405454 414729 424964 436245
57710 436245 449733 464734 479522 494958 513600 535459 558374 582430 610120 642130 676866
57699 676866 714327 756581 804204 856082 913057 977960 1051656 1132829 1222161 1323020 1437518
57688 1437518 1565506 1707947 1867418 2044579 2237643 2445735 2668768 2902864 3139177
57679 3139177 3367868 3579830 3764302 3909425 4007348 4056556 4059311 4020962 3952658 3870418 3789317
57668 3789317 3720587 3673128 3650784 3643832 3626755 3569564 3453221 3276442 3053002 2805164 2555782
57657 2555782 2321178 2109200 1922731 1762719 1628000 1515563 1422798 1347902 1287757 1238025
57647 1238025 1196270 1162790 1137734 1119759 1108019 1102890 1103949 1109734 1120191 1136898 1160255 1189088
57635 1189088 1223645 1266216 1317959 1377828 1445597 1523287 1612628 1713609 1826485 1952723 2092938
57624 2092938 2246142 2411620 2588969 2775393 2965218 3152361 3330326 3489224 3616210
57615 3616210 3700717 3737524 3724753 3662526 3555103 3411334 3241062 3052726 2854721 2655755
57605 2655755 2462085 2276575 2101473 1939673 1792334 1658051 1535667 1425457 1326680 1236876
57595 1236876 1154898 1081907 1018090 961067 908875 861790 819852 781331 745223 712640 684174
57584 684174 658376 634261 612723 593990 576370 559121 543803 531107 519057 506285 494475
57573 494475 485402 477985 470418 463020 456797 451278 445911 441694 439330 437568 435312 433679 434083 435985
57559 435985 438339 441525 446079 451212 456376 462711 471250 481233 491832 503932 518623 535491 553935
57546 553935 574656 598446 625128 654984 689545 729644 774434 823523 878199 939468 1007035
57535 1007035 1081545 1165477 1260263 1364817 1478495 1603090 1739935 1887219 2042037 2202616
57525 2202616 2365954 2525111 2671113 2796014 2892365 2952212 2969944 2945451 2882770 2787096
57515 2787096 2664815 2524366 2374134 2220153 2067275 1920719 1784171 1657822 1540510
57506 1540510 1432680 1335421 1248195 1169780 1100181 1039437 985791 937231 893752 856139 823619
57495 823619 794751 769481 748370 730899 716479 705971 700206 698063 698006 700505 707009 717584 731514
57482 731514 749211 771622 798680 830167 867179 911054 961830 1019391 1084928 1159645 1243312
57471 1243312 1335931 1439391 1555392 1682850 1819184 1962705 2111430 2260563 2403239 2532674
57461 2532674 2641567 2720935 2762581 2762815 2722416 2644346 2533699 2398589 2248077 2089136 1927112
57450 1927112 1767865 1616786 1476087 1345376 1224625 1114739 1015831 927119 848206 778627
57440 778627 716651 660455 610040 566118 527654 492485 459881 430509 404175 379567 356102
57429 356102 334304 314524 296773 281410 268454 256536 244092 231277 219328 208608 198619 189346
57417 189346 181099 173606 166642 160906 156898 153681 150106 146369 142997 139332 134625 129620 125387 121568
57403 121568 117450 113681 111118 109046 106462 104113 103248 103315 102904 102090 101803 101804 101386 101129 101750 102133 100825
57386 100825 98738 98005 98865 99921 100728 101663 101969 100568 98371 97268 97143 96368 94809 93770 93193 91601
57370 91601 88806 86140 83929 81125 77624 74652 72638 70822 69045 67790 66469 63861 60368 57642
57356 57642 55903 53837 51214 49310 48479 47596 46246 45354 45211 44968 44473 44604 45368 45666 45387 45780 47229
57339 47229 48540 48983 49371 50597 52629 55244 58214 60578 61327 61023 61179 62054 62726 63211 64526 66563
57323 66563 67941 68212 68343 68780 69013 69318 70874 73745 76599 78873 81438 84774 88408 92478 97912 104554
57307 104554 110993 116840 123351 131248 139662 147816 156093 164876 173957 183641 194837 207559 220835
57294 220835 234453 249192 265085 281227 297708 315875 336121 357172 378182 399875 422881
57283 422881 446397 469076 489947 508044 522465 533032 539625 540922 535417 523635 507585 488155
57271 488155 465094 439492 413882 389442 365382 341499 319024 298291 277998 257702 238833
57260 238833 222238 206825 191730 177930 166576 157442 149958 144116 139448 134844 130219 126617 123940
57247 123940 120533 115828 111340 108018 104742 100641 96843 94447 92635 90302 87937 86329 84902 82856
57233 82856 80682 79138 77931 76651 75786 75582 75072 73431 71200 69182 67320 65619 64883 65475 66610 67774
57217 67774 69599 72423 75374 77835 80488 83954 87763 91571 95931 100961 105778 110158 115180 121306
57203 121306 127531 133389 139964 147689 155099 161120 166736 172821 178244 181987 185428 190464 196688 202434
57189 202434 207474 212763 218564 224686 231712 240101 248867 256807 264374 272811 282206 291983 302612 315335
57175 315335 330632 348131 367280 387104 406241 424388 442732 461883 480664 498178 515631
57164 515631 534419 553694 571627 588055 604045 619706 634353 648179 662022 675968 689734
57153 689734 703793 718650 733698 748261 763100 779390 796931 814889 833579 854027 876489
57142 876489 900895 927861 957542 988329 1018482 1048474 1079940 1113044 1146754 1181119 1217147
57131 1217147 1254659 1292247 1329328 1366515 1404056 1441594 1479489 1518752 1559532 1601049 1643098
57120 1643098 1686434 1731729 1779307 1829757 1883758 1941670 2004293 2073357 2149853 2232451 2319154
57109 2319154 2410183 2507998 2615300 2734886 2871043 3029190 3214465 3432757 3693336 4008988
57099 4008988 4393942 4863618 5436168 6131773 6969859 7969200 9151912 10546251 12185073
57090 12185073 14102169 16327799 18881692 21764896 24955751 28410308 32060675 35810566
57082 35810566 39539702 43125762 46471032 49507803 52173758 54380009 56004058 56916235
57074 56916235 57018574 56270526 54694692 52371273 49427636 46022112 42323141 38491081
57066 38491081 34667691 30970701 27489762 24284942 21389591 18814951 16553748 14584383
57058 14584383 12877643 11403178 10132169 9037455 8094228 7280902 6578404 5969283 5438544
57049 5438544 4974629 4568312 4211147 3895821 3616934 3369973 3150039 2952661 2774998
57040 2774998 2614933 2469783 2337117 2215980 2105772 2004687 1910752 1823636 1743871 1670891
57030 1670891 1603443 1541316 1484884 1433308 1384866 1338926 1296183 1257148 1221596 1189166 1159289
57019 1159289 1130945 1103695 1078569 1056884 1038855 1024300 1013786 1007904 1006454 1009687 1019320 1037206
57007 1037206 1064504 1103675 1159818 1238934 1347206 1492453 1679177 1893554 2094183 2226983
56997 2226983 2256369 2183576 2037461 1852895 1657646 1470616 1302920 1158714 1037768 938561
56987 938561 859122 796786 749133 714748 692156 678650 670757 664925 657374 644704 625734 601925
56975 601925 575544 548342 522178 499284 480977 467092 457155 451040 448157 447418 448535 452128 458136
56962 458136 465610 474537 486421 502447 522636 547313 577332 611341 643993 668369 679769 676916
56950 676916 661110 635651 605258 574422 545944 520994 499800 482044 467440 456325 449107 445178
56938 445178 443462 444090 448377 457027 469699 486622 509289 539058 575894 618030 660952 696549
56926 696549 715773 713982 693243 659316 617866 573698 531130 493067 460276 432476 409404 390474
56914 390474 374636 361349 350686 342062 334106 326343 319692 314715 310722 307232 304856 303926 303598 303209
56900 303209 303256 304232 305733 307554 310418 314735 319866 325498 332582 342056 353776 367599 384413 405217
56886 405217 430248 459467 492267 525542 553461 570651 575223 568370 552633 531546 509351 489159
56874 489159 471753 456934 445193 437228 432921 431869 434145 439770 448509 461048 479448 505568 540066
56861 540066 583712 638425 705513 782820 863351 935651 986121 1004297 988549 946504 889448
56850 889448 826938 765923 711438 665782 628512 599036 578221 566564 562695 565415 575707 595200
56838 595200 624288 663709 716590 786872 876612 985902 1112548 1247810 1372902 1463779 1502287
56827 1502287 1483999 1417663 1319527 1207047 1093947 988258 893997 813615 748088 696060 655144
56816 655144 624211 603471 592899 592048 601100 620846 651935 695392 753587 829014 920997 1022736
56804 1022736 1120428 1195707 1232223 1223387 1174769 1098954 1008792 914913 825824 746750 678729
56793 678729 620860 573093 535563 506643 484025 467297 457565 455091 459238 470265 489281 516733
56781 516733 552567 597040 648699 701180 743933 767129 765870 741072 698437 646299 592159 540243
56769 540243 492437 450449 415530 386955 362786 342026 324617 309950 297174 286557 278697 272683
56757 272683 266877 261256 257119 254612 252423 249861 247421 245319 243273 241766 241685 242505 242536 241165 239278
56742 239278 237353 234842 231702 228917 227045 225625 224262 223028 221604 219353 216416 213575 211022 208441
56728 208441 206157 204789 203880 202330 200160 198422 197433 196565 195745 195609 196152 196649 196902 197197 197162 196178 194710
56711 194710 193681 192767 190996 188807 187596 187330 186618 185205 184275 184003 182924 180256 176954 173797 170241
56696 170241 165872 161429 157643 154432 151768 149974 148680 146878 144435 142216 140412 138214 135478 133183
56682 133183 131826 130815 129797 129158 128885 128454 128179 129147 131476 134202 137123 141055 145876 150176 153462
56667 153462 157007 161824 167406 173112 179200 185700 191725 196689 200991 204991 208618 212321 216902 221979
56653 221979 226165 229128 231868 234730 237005 238922 241860 245949 249513 251744 253774 256088 257099 255721
56639 255721 253365 251780 250624 248869 246961 245710 244327 241497 237525 233699 230265 226630 223064 220641
56625 220641 219736 219687 219782 219726 219449 219107 219011 219103 218991 218687 218633 218819 218797 218661 218929 219242 218465 216435 214291 212698
56605 212698 211038 208817 206487 204343 202046 199749 198265 197523 196353 194455 193016 192699 192628 192213 192323 193609
56589 193609 195130 195808 195915 196067 196042 195669 195627 196260 196751 196545 196459 197396 198979 200370 201423 202200 202482 202583
56571 202583 203510 205551 207747 209457 211264 213730 216558 219577 223080 226587 228835 229699 230593 232249 233841
56556 233841 235060 237130 240708 244559 247534 250123 252898 255147 256352 257419 259096 260710 261635 262424 263281
56541 263281 263143 261550 259758 258696 257551 255598 253557 251749 248944 244688 240775 238622 237060 234618
56527 234618 232104 230880 230389 229611 229169 229607 229204 226119 221491 217874 215610 213216 210364 207985 206144
56512 206144 204168 202370 201556 201278 200466 199211 198152 196870 194722 192522 191565 191598 191482 191092 190948 190780 190185
56495 190185 189805 190207 190531 189923 189290 189884 191238 192307 193490 195565 197749 198832 199202 199809 200309 200301 201159
56478 201159 204237 208350 211408 213553 216194 218930 220181 220256 221036 222935 224673 225832 227321 229407 231379
56463 231379 233011 234577 235720 236049 236226 236812 236897 235728 234659 235310 236835 237313 236836 236727 236640 235251 233172
56446 233172 232364 233005 233519 233408 233517 233840 233565 233079 233482 234378 234462 233973 234213 235063 235392 235429 236269 237486 237819
56427 237819 237775 238840 240584 241368 241569 243039 245500 246544 245434 243969 243275 242489 241022 239513 238005 235506
56411 235506 231792 227508 222466 216114 209663 205356 203625 203270 204238 207519 212385 216543 219239 221617 223883
56396 223883 224874 224661 224857 225951 226868 227400 228497 229952 230437 230069 230349 231399 231945 232184 233751 236559 238616
56379 238616 239379 240401 242093 242759 241551 239661 237938 235992 234280 234361 236381 238799 241143 244454 248630
56364 248630 252118 254785 258284 263033 267638 271810 276844 282513 286511 287897 288321 289088 289902 291221 294746
56349 294746 300414 305797 309564 312909 316641 319761 321901 324377 327715 330895 334015 338800 345256 350604
56335 350604 352850 352915 352275 351107 349762 349365 349893 350233 350905 353929 359268 364547 369187 375528 384662 394409
56319 394409 402873 410824 419059 426424 432066 436887 441317 444399 446289 448722 451692 452742 450897 448221
56305 448221 446123 443401 439520 436547 435925 436337 436472 436976 438057 438317 437714 438605 442071 446249 449985 454926
56289 454926 462199 470340 478470 488185 500195 512394 523540 535694 550709 567398 584449 603041
56277 603041 624228 646827 670325 696891 728026 762139 797821 836588 880117 927878 979947
56266 979947 1038960 1106652 1181516 1262581 1352479 1454079 1567114 1690810 1826698 1975829
56256 1975829 2136100 2305222 2483434 2670296 2861606 3052377 3239914 3420958 3588776
56247 3588776 3736470 3860708 3959447 4029055 4067066 4075277 4057037 4014043 3948762 3866991 3774611
56236 3774611 3674123 3567235 3457835 3349133 3240682 3131598 3024009 2919901 2817309
56227 2817309 2713148 2607318 2500825 2392687 2282254 2171955 2064259 1958436 1853548
56218 1853548 1751754 1655207 1562645 1472694 1387548 1309640 1237627 1169555 1106934 1051569 1001356
56207 1001356 953576 909540 871558 838069 806384 777607 754040 734062 714425 695492 679470
56196 679470 665479 651159 637424 626920 619267 612129 605411 600224 595505 589868 585052 583354 583445 582730
56182 582730 581909 583189 586160 589560 594814 603402 612946 620384 626960 635719 646269 656372 666297 676942
56168 676942 686107 691450 694912 699439 703649 704600 703361 702743 702003 699127 696017 695882 697598 698165 698628 701994
56152 701994 707358 711919 716926 725811 738072 750765 764490 782218 803842 827615 855487 891400
56140 891400 935841 987604 1049028 1123677 1210443 1305742 1409543 1522893 1640865 1754077 1856160
56129 1856160 1944620 2016920 2072517 2117368 2159859 2202847 2244394 2283354 2317715 2340264 2343943
56118 2343943 2330813 2309413 2284882 2257873 2230211 2203163 2171165 2125107 2061757 1983917 1893424
56107 1893424 1791669 1685498 1584455 1492407 1408553 1334993 1275628 1228792 1188813 1154058 1126198
56096 1126198 1103083 1080325 1058643 1041616 1027494 1011371 994145 980830 971272 961245 951417 946134
56084 946134 944286 940636 935454 933611 934845 934432 932952 935734 942866 949312 954670 963137 974049 982335
56070 982335 988299 997110 1008650 1017834 1024880 1035093 1048513 1059991 1069386 1081246 1094647 1104330 1111751
56057 1111751 1123705 1139926 1153559 1164116 1178025 1195996 1212114 1226218 1244583 1267229 1287114
56046 1287114 1303289 1322280 1345038 1365328 1382618 1403529 1428788 1451853 1472313 1497320 1527874
56035 1527874 1557228 1584743 1617416 1655716 1692256 1726537 1766248 1811627 1853894 1891846 1934335
56024 1934335 1983260 2030039 2072280 2117696 2167856 2214667 2256964 2303814 2357161 2408328 2456109
56013 2456109 2510748 2575225 2640390 2703471 2773157 2851300 2928431 3002828 3084765 3176383 3267226
56002 3267226 3355366 3452275 3560737 3669425 3775914 3892820 4024156 4158576 4293449 4441780
55992 4441780 4607323 4777629 4950210 5139805 5350655 5568453 5789546 6030107 6295950
55983 6295950 6572686 6857277 7168792 7515398 7882536 8267092 8690167 9162047 9669640
55974 9669640 10213764 10821847 11507507 12256862 13072373 13988808 15027797 16182439 17468021
55965 17468021 18940621 20645708 22604041 24873759 27566414 30771762 34530093 38909794
55957 38909794 44041888 50049894 57042439 65235448 75008397 86818761 101205366 118960234
55949 118960234 141171086 169015780 203608389 245803776 295143838 347870096 395930483
55942 395930483 429198036 440230409 427917031 397166300 355537112 309946978 265287924
55935 265287924 224463887 188794332 158480451 133150441 112253990 95160681 81181251
55928 81181251 69692460 60227882 52415241 45905517 40415906 35770830 31840064 28480645
55920 28480645 25573857 23061437 20899095 19015081 17347806 15880008 14600032 13466699
55912 13466699 12442949 11527092 10720041 9994808 9326519 8720758 8184575 7698412 7242454
55903 7242454 6823199 6449063 6105295 5776735 5471290 5198298 4946323 4703669 4478894
55894 4478894 4280277 4095812 3913503 3741517 3588933 3445749 3300934 3161998 3038225
55885 3038225 2921878 2803931 2691775 2593944 2503079 2410879 2324583 2252189 2186115 2117605 2053094
55874 2053094 2000523 1953090 1902067 1852601 1811640 1772796 1728061 1682559 1643321 1605190 1562045
55863 1562045 1520646 1489414 1464332 1439457 1420487 1413942 1412716 1405596 1391887 1374484 1348717 1311227
55851 1311227 1270711 1237017 1207701 1176789 1147692 1125585 1105985 1083122 1061372 1046614 1034443
55840 1034443 1018534 1002623 992428 983505 968904 951499 937170 922888 903068 880955 862355
55829 862355 844476 822138 798783 780442 764722 746500 728498 715506 703862 687392 668451
55818 668451 652766 638715 622046 605990 596175 590192 582371 574392 571280 571310 569680 568031 570712 575606
55804 575606 577982 579447 583952 588987 589804 588468 589693 591541 589176 584052 580418 576342 567139 554345
55790 554345 542676 531455 517587 503603 494041 487020 477906 468307 463140 461865 460769 460615 463454
55777 463454 464907 458432 444981 430417 415976 399320 382276 369030 358756 348075 338677 334575
55765 334575 333884 331156 325908 321264 316295 307550 296368 287090 279681 271368 263476 259214 256627 251244
55751 251244 243872 238462 234283 227825 220562 216950 216195 213760 209710 207883 207943 205948 202008 199882 199638
55736 199638 198033 195635 196343 200135 203128 204573 207194 210951 212899 212856 212994 212405 208339 202140 197701
55721 197701 194732 189850 183510 179342 177282 173955 169479 167253 167251 166070 163662 163705 167075 170962 174647
55706 174647 180392 188433 196559 204568 213731 222189 226430 227045 227647 228728 228107 226657 227490 229993 230755
55691 230755 230069 231402 234635 235975 234597 233354 232870 230926 227771 226084 225450 222832 218739 217043 218391
55676 218391 219655 220147 222340 226037 227941 227698 228495 230899 231933 231078 231380 233700 235529 236397 238715 242203
55660 242203 243233 241075 239371 240031 240885 240677 241162 242933 244195 244879 246993 249791 249640 245844 241521 237625
55644 237625 231395 222070 212797 205231 197321 188118 179846 173423 166800 159486 153986 150881 147112 141065
55630 141065 134950 130342 125785 120662 117027 115686 114530 112568 111569 112022 111566 109145 106763 105530 103938
55615 103938 101551 100252 100271 99195 96545 95162 96227 97057 95715 93804 92794 91534 89396 88037 88044 87490
55599 87490 85689 84752 85657 86401 85852 85747 87061 88010 87496 87014 87392 87185 86018 85919 87545 88642 88006 87440
55581 87440 88041 88183 87001 86241 86747 86664 85045 83762 83926 83895 82714 82055 82826 83397 83125 84068 87138 90127
55563 90127 91723 93982 98528 103591 107064 109255 110441 109066 104765 99977 96132 91266 83808 75796
55549 75796 69876 65875 62632 60530 59997 60160 61029 64387 70574 77141 82506 88024 94563 100113 102904
55534 102904 103920 104227 102807 99247 95636 93492 91641 89226 87911 88830 90322 91024 92322 95345 98390
55519 98390 99824 100743 102238 102728 100627 97050 93284 88092 80215 71198 63189 56176 49743 45130 43011
55504 43011 41456 38610 35343 32992 30767 27697 24898 23531 22632 21216 20336 20816 21216 20287 19247 19348
55488 19348 19503 18620 18034 19220 21327 23275 26047 30498 35075 38104 40217 42243 42959 41338 38821
55473 38821 37003 35193 32620 30655 30302 29755 27155 23707 21474 20155 18613 17483 17566 17679 16788 16298
55457 16298 17591 19215 19241 18475 18620 19130 18637 17774 17843 18320 18247 18335 19216 19548 18453 17836 19430 21444 21132
55438 21132 18984 17407 16895 16546 16854 18793 21295 22558 22859 23486 24083 23635 22892 23243 24360 25264 26328
55421 26328 27950 28784 27794 26462 26457 26758 25740 24363 24451 25437 25838 26477 29074 32865 35636 37058 38143
55404 38143 38574 37518 36006 35640 35883 35309 34389 34311 34286 32926 31091 30439 30350 29288 27983 28054 28574 27362
55386 27362 24954 23889 24577 25104 24727 24425 24304 23490 22393 22206 22321 21017 18550 16927 16711 16545 15622
55369 15622 14248 12236 9171 6032 4267 3644 3168 3430 5616 8733 10487 10512 10311 10491 10564 10984 12695
55352 12695 14897 15789 15351 15096 15392 15454 15570 16778 18509 19031 18190 17471 17493 17576 17542 17775 17771 16781 15595 15599
55332 15599 16422 16554 15877 15440 15251 14445 13215 12468 12049 11423 11428 13160 15796 17709 19041 20814 22378
55315 22378 22338 21339 21319 22472 23494 24179 25182 25853 25101 23916 24276 25966 27197 27810 28962 30126 29552
55298 29552 27495 25976 25434 24595 23543 23778 25082 25414 24281 23348 23381 23385 23103 23559 24644 24876 24025 23432
55280 23432 23341 22548 21099 20672 21711 22715 22914 23205 23935 24193 23911 24258 25421 26230 26447 27089 28018 27694
55262 27694 25851 24063 23073 21907 20225 19181 19208 19156 18369 17561 17053 16238 15335 15529 16805 17740 17955 18669
55244 18669 20297 21585 21697 21114 20053 18175 16323 16274 18127 20062 21190 22430 24037 24693 23854 22818
55228 22818 22559 22548 22513 23328 25265 27253 28619 29771 30519 29746 27492 25563 25244 26109 27550 29583 31597
55211 31597 32301 31682 31212 31511 31550 30686 29586 28632 27349 25988 25756 26762 27561 27326 26799 26605 26402 26081
55193 26081 26021 25821 24621 22857 21805 21316 20164 18657 18459 19624 20441 20606 21739 24157 25984 26412
55177 26412 27098 29099 31020 31522 31327 31365 31146 30329 29898 30447 31060 30993 30687 30254 28951 27038 26053 26241
55159 26241 25869 24069 22216 21421 20879 19950 19574 20286 20876 20438 19821 19742 19452 18588 18376 19558 21001 21686
55141 21686 22262 23305 23965 23730 23643 24370 24873 24396 23978 24596 25559 26128 26889 28161 28887 28545 28321 28928 29194
55122 29194 28428 28264 30315 33603 36116 37410 38033 37852 36710 35412 34439 32969 30618 28732 28463 28971
55106 28971 29052 29133 30138 31702 33073 34473 36094 37077 36934 36670 37101 37403 36755 36019 36286 37118 37683 38358
55088 38358 39657 40941 41608 42310 43552 44432 44202 43712 43837 43911 43229 42715 43396 44556 45023 45099 45627 46298
55070 46298 46459 46497 46935 47299 47229 47497 48539 49278 48836 48061 47912 47805 47109 46755 47578 48463 48038 46981 46777
55051 46777 47298 47413 46953 46311 45173 43365 41927 41598 41310 39893 38256 38134 39676 41945 44668 47661
55035 47661 49627 49497 48229 47472 47255 46648 45813 45594 45887 46083 46406 47197 47745 47384 46851 47007 47248 46856
55017 46856 46831 48503 51241 53345 54377 54905 54882 54181 53845 54864 56372 56834 56277 55664 54928 53483 51849
55000 51849 50821 49815 47969 46165 45919 46854 47236 46571 45757 45152 44382 43653 43460 43341 42625 41982 42569 44120
54982 44120 45489 46562 47954 49475 50644 52145 54934 58396 61101 62859 64334 65300 65219 64894 65507 66447
54966 66447 66224 65212 65402 67520 70382 73108 76055 79447 82878 86496 91211 97539 105341 114648 125585
54951 125585 137747 150735 164864 180139 195103 207942 217997 224862 227004 223150 214388 203025
54939 203025 189934 174876 158841 143915 131009 119561 109305 100553 92988 86045 80347 77028
54927 77028 75731 74924 74020 73539 73457 73150 72860 73478 74883 76065 76754 77540 78624 80034 82742 87874 95017
54910 95017 102879 111337 121260 132747 145191 158619 173070 186936 197790 204691 207976 207252 201676
54897 201676 192029 180430 167935 154280 139912 126330 114349 103813 95075 88855 84576 80614
54885 80614 76387 72627 69690 67343 66010 66316 67384 67512 66606 66093 66377 66326 65412 64412 63740 62938 62047
54868 62047 61695 61616 60805 59320 58217 57627 56717 55564 55126 55173 54295 52280 50516 49706 49045 48063 47319 46893
54850 46893 46074 45022 44837 45527 45770 45213 45112 46087 47080 47240 47037 46818 46015 44580 43565 43542 43959 44693
54832 44693 46574 49645 52493 54135 55133 56100 56618 56449 56434 57254 58443 59314 59810 59937 59546 59152 59674 60950
54814 60950 61763 61771 62071 63416 65260 67049 69066 71506 74023 76699 80200 84546 89092 94110 100920 109965
54798 109965 120167 130749 142323 155518 169730 183753 196555 207129 214752 219621 222030 221007
54786 221007 215281 205631 194494 183133 171106 158755 147991 139882 133434 127595 122700 119010 115574
54773 115574 111607 107584 104078 100885 98049 96287 95692 95415 95276 96165 98203 100184 101627 103695 107269
54758 107269 111752 116695 122947 131111 140450 150460 162092 176201 192006 208072 223471 237022
54746 237022 246769 251394 251143 246573 237764 225582 212131 198833 185307 171195 157691 146121 136329
54733 136329 127644 120227 114252 108932 103588 98688 94829 91744 89224 87788 87403 86778 85029 82881 81163
54718 81163 79419 77189 75411 75137 75854 76408 76698 77169 77465 76869 75467 73808 72088 70538 69905 70627 72214
54701 72214 74112 76274 78293 79159 78731 78355 79099 80494 81809 83297 85096 86223 85917 84980 84529 84404
54685 84404 84023 83812 84474 85597 86282 86518 86838 87253 87540 87960 88774 89635 90237 90877 91774 92720 94049 96809
54667 96809 101142 105589 108938 111642 114506 117145 118910 120201 121632 122806 123117 122994 123191 123621 123817 123791
54651 123791 123515 122455 120547 118722 117656 117011 116723 117764 120521 123677 125926 127710 130062 132859 135558
54636 135558 138516 142118 145555 147851 149235 150113 149684 147067 142935 138508 133736 128020 122004 116996 113097
54621 113097 109453 105985 103419 101904 100902 100213 99968 99896 99640 99513 100088 101392 103209 105485 107712 108751
54605 108751 108181 106980 105978 104610 102216 99476 97311 95309 92628 89613 87194 85441 84042 83383 83748
54590 83748 84140 83330 81468 79446 77395 75094 73040 71650 70081 67380 64210 61985 60852 59982 59272
54575 59272 59234 59602 59563 59084 58694 58326 57600 56808 56395 55911 54766 53535 53270 53965 54877 55773 56659 56989 56538
54556 56538 56380 57474 58919 59155 58321 57758 57689 57221 56342 56106 56760 57305 57050 56248 55225 54156 53690 54494
54538 54494 56111 57395 58087 58917 60286 61892 63528 65265 67001 68760 71140 74545 78315 81498 84002
54523 84002 86035 87079 86621 85318 84187 83156 81628 79891 78588 77337 75370 73172 71945 71646 70974
54508 70974 69237 66979 64900 63275 62266 61834 61546 61284 61637 62765 63661 63558 63173 63350 63452 62615 61666
54491 61666 62035 63463 64480 64614 64462 64145 63457 63008 63473 64148 63960 63382 63642 64597 65297 66079 68036 70766
54473 70766 72776 73903 75231 76824 77652 77711 78076 78807 78872 78287 78240 78882 79000 78128 77026 75870 73978 71648
54455 71648 70258 70111 70084 69832 70351 71808 72795 72412 71378 70424 69269 67865 66995 66927 66906 66610 66589 66754 65995
54436 65995 63967 61836 60605 60056 59868 60356 61564 62893 64090 65306 65997 65305 63839 63364 64342 65527
54420 65527 66413 68125 71096 73769 74675 74234 73516 72740 72015 72153 73583 75582 77523 79740 82408 84810
54404 84810 86590 88530 91211 94100 96786 99899 103851 107848 111149 114263 117934 121857 125252 127827
54390 127827 129401 129528 128305 126673 125256 123788 122187 121032 120269 118699 115646 112082 109164 106668 103800
54375 103800 100624 97687 95026 92501 90460 89254 88670 88415 88425 88221 86932 84583 82437 81362 80809 80135
54359 80135 79916 80959 82871 84583 85733 86629 87412 88085 88982 90472 92487 94833 97580 100750 104036 107152
54343 107152 110041 112610 114824 117101 119916 122966 125501 127477 129392 131006 131417 130594 129472 128255 125966
54328 125966 122275 118440 115688 113714 111557 108988 106277 103388 100107 96424 92373 88122 84342 81686
54314 81686 79750 77519 74890 72642 70857 68705 66045 63811 62506 61633 60934 60703 60537 59426 57652
54299 57652 56900 57757 58701 58348 57121 55828 54296 52511 51562 52116 53207 53730 53941 54362 54462 53682 52654
54282 52654 52213 52200 52314 52965 54168 54753 54008 53043 53214 54179 54779 54895 55061 55130 54727 54303 54425 54674 54420
54263 54420 54026 54172 54706 55283 56322 58136 59857 60494 60393 60496 60787 60709 60457 60671 61339 62083 62967 63995
54245 63995 64429 63672 62265 61067 60096 59118 58568 58809 59304 59665 60653 62829 65044 65687 64855 63845 63100
54228 63100 62102 60855 59969 59470 58850 58132 57752 57628 57394 57285 57695 58239 58321 58330 59174 60877 62664 64141 65361
54209 65361 66079 66028 65640 65467 65231 64423 63435 62999 62901 62453 61956 62433 63979 65499 66091 65765 64905 63902 63218
54190 63218 62912 62240 60581 58599 57648 58166 59420 60606 61389 61550 61022 60235 59720 59440 59017 58330 57414 56261
54172 56261 55320 55610 57555 60106 61830 62399 62327 61815 60836 59843 59449 59706 60392 61516 62754 63051 61795
54155 61795 59884 58663 58254 57961 57722 58019 58714 59163 59300 59567 59981 60144 59997 59702 59050 57816 56420 55494
54137 55494 55169 55410 56429 57969 58865 58376 57307 56823 56818 56568 56253 56463 56792 56389 55495 54959 54575 53425
54119 53425 51688 50591 50532 50715 50732 51100 52002 52777 53036 53252 53884 54700 55236 55232 54575 53485 52717 52847 53479
54100 53479 53825 53856 54088 54552 54897 55306 56285 57622 58462 58449 57962 57333 56600 55917 55457 55050 54619 54671 55612 56893
54080 56893 57596 57518 56921 55762 54095 52736 52408 52595 52346 51892 52334 54000 56234 58549 60833 62592 63190
54063 63190 62805 62253 61962 61994 62678 64171 65723 66480 66771 67484 68514 69016 68894 68842 69117 69519 70357 72119
54045 72119 74373 76268 77989 80412 83452 86153 88390 91111 94819 99105 103709 108715 113613 117561
54031 117561 120803 124577 129347 134299 138801 143155 147593 151654 154928 157563 159758 161611 163516 165813
54017 165813 168032 169386 170017 170773 171864 172736 173202 173562 173648 172882 171268 169268 166789 163509 160019 157335
54001 157335 155249 152528 148848 145224 142406 140111 137980 135979 133751 130890 128059 126554 126476 126560 125963
53986 125963 124946 123712 122040 120340 119643 120109 120831 121392 122258 123349 123746 123313 123158 123934 125049 126144
53970 126144 127822 130152 131860 132074 131718 132085 132884 132772 131150 128610 126119 124422 123722 123356 122292 120378
53954 120378 118634 118040 118570 119574 120391 120481 119726 118822 118685 119349 120182 121111 122653 124816 127077 129526 132909
53937 132909 137343 142070 146625 151107 155229 158391 160849 163530 166362 168071 167975 166746 165134 163286 161654
53922 161654 161079 161439 161601 161304 161724 163567 165963 168016 170095 172778 175764 178785 182486 187416 192983
53907 192983 198255 203031 207461 211403 214761 217672 219897 220912 220953 220943 221007 220222 218292 216233 214831 213698
53891 213698 212389 211101 209535 206513 201680 196344 191686 187353 182740 178336 174679 171118 166948 162742
53877 162742 159335 156304 152713 148661 144911 141633 138526 135659 133161 130644 127799 124992 122526 119999
53863 119999 117204 114896 113801 113462 112968 112144 111226 110083 108622 107310 106450 105586 104400 103411 102926 102066
53847 102066 99898 96895 94308 92552 91141 89727 88350 87090 86165 86008 86585 87103 86959 86452 86126 86055
53831 86055 86213 86720 87239 87027 86131 85570 85784 85976 85678 85668 86473 87274 87432 87796 89113 90246 89679 88021
53813 88021 87363 88578 90743 92852 94686 96212 97520 99241 101872 104731 106621 107493 108548 110765 114100
53798 114100 117989 121791 124938 127378 129803 132844 136276 139557 142722 146173 149938 153757 157477 160853
53784 160853 163484 165462 167514 169966 172269 174119 176163 178804 181107 181844 180963 179179 176794 173885 171004
53769 171004 168668 166605 164382 162236 160527 159000 157430 156312 156022 155981 155532 154938 154606 154158 153257 152524
53753 152524 152464 152357 151435 150374 150254 150708 150576 149784 149137 148719 147973 146957 146022 144594 141807 138132 134938
53736 134938 132600 130424 128294 126834 125922 124548 122407 120398 119335 119233 119937 121277 122457 122423 121141
53721 121141 119627 118682 118520 119545 122194 125777 128592 129667 129555 129143 128572 127733 127051 127223 128563 130892
53705 130892 133752 136672 139530 142609 146033 149355 152106 154407 156610 158699 160602 162714 165475 168717
53691 168717 171964 175021 177686 179409 179897 179630 179197 178691 178352 179028 181089 183544 185244 186352 187665 189133
53675 189133 190220 191133 192429 193780 194441 194599 195105 196143 197260 198348 199404 199729 198682 196930 195641
53660 195641 194724 193220 191111 189279 187821 186062 184250 183625 184492 185660 186128 186073 185842 185275 184484 184158 184544
53643 184544 185061 185298 185506 185789 185719 185180 184738 184777 184945 184788 184342 183896 183724 184109 185061 186051 186641 187262 188639
53624 188639 190693 192775 194705 196589 197891 197900 197105 196879 197657 198538 198954 199619 201433 204358 207813 211478
53608 211478 215253 218969 222454 225583 228287 230810 233761 237430 241362 245122 248990 253271 257568 261623
53594 261623 266216 272074 278429 283858 288160 292139 296009 299455 302894 307046 311399 314703 316972 319377
53580 319377 322146 324225 325270 326293 327883 329379 330368 331515 333238 334863 335852 336714 337990 339300 340075
53565 340075 340326 340171 339462 338382 337521 336887 335687 333562 331284 329803 329322 329566 330210 330755 330726 330223 329676
53548 329676 329087 328286 327718 327892 328211 327660 326625 326579 327826 329073 329570 330101 331295 332436 332763 332706 333035 333854
53530 333854 335197 337579 341093 344809 347866 350498 353437 357006 361267 366293 371834 377418 383087 389297
53516 389297 395973 402668 409827 418631 429214 440284 451046 462272 474775 488022 501136 514354
53504 514354 528615 544356 561409 579499 598352 617896 638652 661203 685125 709322 733524
53493 733524 758415 784231 810524 837484 865898 895303 923810 950513 976620 1003362 1030243
53482 1030243 1056388 1082238 1108625 1135338 1161792 1188245 1215222 1242621 1270326 1298760 1327818
53471 1327818 1356286 1383378 1409837 1436319 1461775 1484811 1505841 1526324 1546494 1565276 1582003
53460 1582003 1596857 1609982 1621538 1632512 1644154 1656429 1667834 1676692 1682020 1683475 1681393 1676730
53448 1676730 1670193 1661525 1650142 1636217 1620556 1603773 1586124 1567680 1548092 1526645 1503251 1478918
53436 1478918 1454577 1429922 1404118 1377130 1349651 1322130 1294698 1267673 1241386 1215717 1190515
53425 1190515 1166219 1143553 1122854 1104073 1087064 1071415 1056566 1042534 1029978 1019100 1009196
53414 1009196 999886 992030 986683 983838 982985 984224 987867 993502 1000488 1009017 1019718 1032520 1046824
53401 1046824 1062676 1080804 1101469 1123934 1147216 1170963 1195627 1222073 1250902 1281929 1314555
53390 1314555 1348669 1384682 1422656 1462145 1503135 1546316 1592059 1639987 1689941 1742460 1797736
53379 1797736 1855037 1913818 1974490 2037270 2101164 2165016 2228822 2293055 2357409 2421223 2484538
53368 2484538 2547644 2610069 2670932 2729824 2786340 2839195 2886925 2929275 2967009 3000559 3029743
53357 3029743 3054564 3075417 3092544 3105877 3115235 3120183 3119982 3114280 3103607 3088769 3070145 3047842
53345 3047842 3021791 2990991 2953367 2907259 2852924 2792223 2727491 2661090 2595086 2530318 2466333
53334 2466333 2402897 2340956 2281391 2223643 2166537 2109808 2053815 1998364 1942961 1887840 1833760
53323 1833760 1781118 1730097 1681261 1635045 1591077 1548858 1508778 1471666 1437818 1407187 1379963
53312 1379963 1356014 1334269 1313522 1293423 1273934 1254557 1235115 1216660 1200435 1186380 1173717
53301 1173717 1162459 1153216 1145954 1140112 1135579 1132489 1130464 1129129 1128904 1130180 1132202 1134003 1135965 1139180
53287 1139180 1143758 1149221 1156224 1166282 1179835 1195924 1213777 1233412 1254780 1277720 1302812 1330908
53275 1330908 1361644 1393570 1425773 1458092 1489805 1519640 1547482 1574680 1602124 1629104 1654460
53264 1654460 1677780 1698969 1717671 1733827 1748053 1760956 1772617 1783005 1792144 1799483 1803782 1804122
53252 1804122 1800689 1794376 1785915 1775453 1762490 1746232 1726410 1703695 1678877 1651944 1622512 1590836
53240 1590836 1557677 1523469 1488414 1453111 1418184 1383477 1348513 1313520 1279121 1245261 1211569
53229 1211569 1178667 1147949 1119914 1093651 1068064 1042657 1017072 990966 964630 938894 914153
53218 914153 890142 866744 844210 822602 801856 782534 765624 751387 739045 727697 716853
53207 716853 706149 695366 684801 674819 664983 654351 642663 630424 617839 604606 590849 577452
53195 577452 565204 554257 544448 535526 527090 518957 511391 504286 496443 486680 475461 464389 454186
53182 454186 444230 433963 423493 412779 401478 389930 379167 369623 360758 352229 344401 337459 330991
53169 330991 324815 319287 314496 310011 305682 301756 297912 293162 287192 280971 275591 271148 267097 263008
53155 263008 258701 254321 250494 247770 245762 243559 241063 239084 238031 237394 236671 235814 234540 232275 229184
53140 229184 226329 224346 222768 221052 219456 218373 217539 216396 214759 212811 210979 209984 210339 211557 212477
53125 212477 212521 212078 211645 211371 211490 212216 213015 212903 211806 210838 210956 212099 213781 215693 217450 218739 220017
53108 220017 222255 225619 229218 232370 235154 237435 238350 237420 235399 233504 232323 231765 231316 230064 227206
53093 227206 222972 218442 214285 210283 206108 201688 196822 191470 186577 183441 181941 180503 178163 175552
53079 175552 173413 171438 169228 167183 165587 163768 161079 157946 155184 152981 151263 150205 149592 148442
53065 148442 146118 143266 140902 139152 137635 136463 135975 135884 135500 134633 133679 133043 132884 133144 133456 133351 132821
53048 132821 132289 131880 131284 130528 130168 130364 130464 129907 128934 127996 127063 125966 124890 124117 123629 123248 122732 121685
53030 121685 119960 118136 116893 115943 114464 112606 111498 111583 112090 112417 112813 113267 112997 111712 110345 109838
53014 109838 110067 110538 111082 111282 110403 108671 107555 107918 108848 109193 109175 109519 110009 110130 110340 111356 112730 113322
52996 113322 112858 111957 110936 109589 107993 106674 106056 106209 106852 107222 106545 105168 104603 105818 108112 110291
52980 110291 112168 114064 115615 116193 116083 116184 116765 117402 118021 119210 121513 124902 128783 132236 134645 136451
52964 136451 138829 142306 146229 149921 153599 157717 162221 167009 172261 177604 181783 184030 185040 185777
52950 185777 186069 185296 183765 182322 181151 179925 178710 177713 176507 174526 172038 169771 167878 166091 164587
52935 164587 163809 163658 163578 163216 162348 160615 158070 155700 154510 154325 154181 153575 152675 151574 150183 148719 147670
52918 147670 147262 147313 147429 147126 146219 145346 145487 146650 147754 148176 148522 149363 150208 150525 150796 151627 152697 153619
52900 153619 155001 157426 160061 161589 162038 162426 162985 162999 162244 161452 161359 162143 163624 165198 165887 165341 164553
52883 164553 164729 165721 166375 166138 165427 164759 164398 164571 165194 165593 165342 165067 165670 167058 168404 169268 169690 169626
52865 169626 169182 169026 169672 170706 171442 171869 172170 171948 170958 170072 170415 171946 173822 175654 177399 178585 178890
52848 178890 179070 180131 181924 183704 185590 188201 191280 194032 196498 199299 202259 204704 206866 209571
52834 209571 212627 214874 215799 215795 214971 213085 210633 208525 206663 204219 201363 199186 197727 195621 192163
52819 192163 188377 185481 183431 181528 179443 177148 174589 171875 169126 166080 162577 159340 157293 156177
52805 156177 154959 153570 153000 153559 154303 154401 153831 152530 150114 146894 143979 141917 140235 138633 137524 136955
52789 136955 136130 134534 132566 130637 128609 126536 124977 124122 123560 123225 123523 124033 123344 120906 118103 116624
52773 116624 116569 116918 117116 117326 117604 117669 117344 116686 115868 115103 114453 113663 112587 111680 111464 111595 111167 109906 108237
52754 108237 106275 103722 100781 98097 95683 93043 90517 89247 89450 89922 89752 89346 89221 89017 88457 88155
52738 88155 88562 88974 88527 87469 86616 86147 85730 85274 84829 84260 83620 83369 83645 83881 83681 83414 83347 82827 81208
52719 81208 79062 77688 77597 78133 78335 77748 76629 75787 75924 76804 77385 76999 75985 74997 74318 74131 74744 76057
52701 76057 77410 78463 79656 81339 83080 84441 85825 87842 90288 92472 94260 96119 98328 100729
52687 100729 103157 105583 107905 109917 111472 112456 112791 112590 112160 111693 111190 110657 110035 108951 107056 104631
52671 104631 102332 100236 97735 94550 91226 88373 86028 84070 82615 81636 80710 79552 78395 77502 76731
52656 76731 75881 75054 74395 73812 73221 72775 72658 72931 73546 74195 74296 73646 72935 72896 73154 72794 71972 71864 72899
52637 72899 74184 75038 75952 77494 79261 80606 81500 82018 81768 80634 79455 79156 79690 80452 81170 81759 81869
52620 81869 81355 80776 80718 80904 80644 79872 79130 78727 78492 78281 78272 78775 79922 81462 82828 83635 84116 84696 85222
52601 85222 85190 84708 84518 84968 85668 86372 87422 89001 90628 91756 92295 92289 91756 91097 90976 91545 92410 93485
52583 93485 95028 96691 97562 97553 97745 98851 100284 101278 102016 103038 104378 105901 107641 109257 110061 110231 111009
52566 111009 112955 114956 115908 116401 117709 119889 122041 123835 125588 127298 128692 129961 131465 132909 133615
52551 133615 133415 132585 131341 130141 129968 131404 133677 135444 136220 136372 136149 135649 135414 136062 137423 138743
52535 138743 139587 139895 139557 138705 138146 138597 139684 140505 141002 141931 143547 145211 146331 146963 147356 147564 147657 147782
52517 147782 147834 147456 146498 145245 144190 143684 143658 143513 142624 141159 140069 140020 140722 141534 142250 142928 143465 143781
52499 143781 144031 144274 144334 144233 144246 144312 144061 143692 143961 144922 145625 145646 145876 147015 148317 148814 148866 149330 150010 150256
52479 150256 150486 151653 153520 154857 155177 155018 154633 153738 152620 152239 152985 154274 155559 156749 157524 157247
52463 157247 155974 154731 154403 154922 155771 156690 157582 158327 159031 160096 161758 163727 165369 166074 165634 164521
52447 164521 163667 163652 164265 165082 166149 167729 169764 172087 174785 177861 180854 183246 184909 185740 185433 184214
52431 184214 183154 182905 182690 181508 179858 179123 179468 179566 178419 176377 174251 172423 171078 170393 170093 169454
52415 169454 168087 166288 164462 162694 161028 159685 158860 158618 159034 160051 161218 161945 161981 161434 160512 159593
52399 159593 159227 159635 160452 161365 162624 164376 165958 166536 166167 165484 164637 163373 161939 161006 160723 160669 160783
52382 160783 161599 163392 165744 168121 170452 172906 175419 177541 178692 178739 178464 179053 180854 183136 185378
52367 185378 188074 191609 195086 197200 197888 198262 199164 200647 202587 204900 207285 209459 211532 213562 215139
52352 215139 216070 216990 218499 220131 221164 221957 223434 225565 227546 229221 231151 233371 235285 236768 238263
52337 238263 239780 240931 241966 243593 245620 246947 247180 247184 247766 248769 249802 250927 252283 253836 255802
52322 255802 258571 261946 265217 268132 271034 273966 276563 279004 282058 285867 289617 292885 296442 301226
52308 301226 307229 313927 321155 329040 337511 346346 355359 364375 373406 383015 393960 406341 419551
52295 419551 433167 447358 462345 478032 494236 510732 527017 542663 557973 573715 590172
52284 590172 607011 624009 641081 657661 672981 687178 701331 716081 730864 744719 757169
52273 757169 768076 777337 785107 791802 797558 802067 805124 806896 807628 807492 806759 805647 804063 801855 799210
52258 799210 796352 793143 789514 785911 782619 779141 775036 770927 767698 765150 762616 760503 759829 760455 761285
52243 761285 762219 764413 768474 773849 780182 787811 796596 805778 815461 826720 839701 853088 866119
52230 866119 879609 894091 908403 921245 932899 944214 954857 963831 970957 976785 981633 985716
52218 985716 989551 993206 995674 995953 994249 991306 987174 981665 975450 969504 963627 956595 947808 938069
52204 938069 928640 920124 912255 904337 895889 887144 878820 871270 864204 857414 851273 846191 842034 838443
52190 838443 835292 832537 830064 827983 826644 826017 825527 824766 823918 823216 822537 821792 821090 820200 818476 815741
52174 815741 812672 810017 807958 806557 806059 806291 806466 806116 805623 805318 804707 803152 800793 798205 795626 793038
52158 793038 790546 788090 785217 781638 777686 773817 770009 766042 761960 757961 754176 750741 747606 744187
52144 744187 739872 734988 730485 726458 721895 716244 710264 704829 699815 694783 689907 685489 681296 677126
52130 677126 673366 670281 667313 663805 659835 655822 651862 648033 644645 641607 638294 634642 631568 629609
52116 629609 628010 626024 624292 623869 624556 625334 625926 626941 628769 631395 634969 639653 645140 651152 658137
52101 658137 666666 676441 686759 697710 710112 724396 740297 757435 775504 794123 813160 833013
52089 833013 853910 875190 895898 915853 935544 955302 975114 994863 1014076 1031836 1047662
52078 1047662 1062119 1075904 1088778 1100119 1109993 1118762 1126027 1131038 1133893 1135282 1135154 1132725 1127896
52065 1127896 1121720 1115237 1108599 1101478 1093681 1085152 1075984 1066687 1057995 1050237 1043144 1036276 1029369 1022368
52051 1022368 1015527 1009390 1004404 1000598 997859 996213 995542 995389 995473 996138 997941 1001060 1005344 1010518 1015946
52036 1015946 1020781 1024894 1029237 1034672 1040929 1047238 1053454 1059729 1065529 1069965 1073032 1075674 1078526 1081161
52022 1081161 1082622 1082346 1080623 1078421 1076554 1074759 1071934 1067524 1062188 1056711 1050789 1043415 1033945 1022360
52008 1022360 1009060 994929 980961 967103 952081 935100 917095 899471 882193 864081 844482
51997 844482 823695 802169 780342 758990 738659 718836 698537 677582 656471 635331 613985
51986 613985 592857 572782 553900 535569 517333 499142 480787 462093 443660 426532 411002
51975 411002 396487 382582 369508 357512 346551 336518 327100 317538 307412 297617 289642 283743
51963 283743 278625 273094 267270 262002 257816 254704 252297 249962 247161 244006 241128 238939 237290 235780
51949 235780 234033 231762 229004 226232 223929 222212 221107 220783 220993 220703 218958 215955 212717 209968 207765
51934 207765 205858 203750 200816 197102 193721 191691 190631 189252 186874 183775 180454 177399 175239 174166
51920 174166 173329 171704 169445 167622 166772 166469 166085 165201 163526 161316 159667 159445 159996 159772 158170 155958
51904 155958 154076 152874 152360 152177 151467 149680 147502 146126 145673 145196 144083 142571 141056 139839 139383 139770
51888 139770 140020 139038 137148 135659 135055 134809 134793 135391 136116 135632 133681 131708 130976 131115 131110 130733 130397 130379 130785
51869 130785 131659 132736 133642 134481 135611 136758 137235 137155 137460 138543 139817 140959 142506 144753 146993 148481
51853 148481 149383 150255 151259 152337 153570 154922 156155 157241 158327 159166 159251 158685 158135 157771 157088 155930
51837 155930 154800 153942 153055 152190 151927 152335 152759 153054 153920 155457 156527 156385 155967 156600 158137 159322 159530
51820 159530 159260 159247 159792 160738 161524 161520 160769 160065 159932 159908 159282 158060 156746 155557 154412 153376 152666 152327
51802 152327 152227 152197 152018 151543 150951 150524 150121 149358 148408 148083 148841 150221 151470 152313 152922 153585 154592 155930
51784 155930 156955 156917 156014 155427 156088 157888 160157 162339 164031 164980 165283 165187 164600 163409 162235 162118 163270
51767 163270 164866 166267 167728 169628 171794 173931 176090 178282 180181 181642 183072 184942 187215 189411
51753 189411 190975 191630 191790 192461 194215 196391 197912 198608 198985 199108 198764 198510 199330 201210 203199 204899
51737 204899 206723 208684 210286 211768 213974 216660 218422 218815 219152 220487 222207 223419 224377 225605 226719
51722 226719 227146 227053 226658 225586 223833 222415 222075 222148 221646 220694 219960 219433 218753 218040 217421 216421 214793 213338
51704 213338 212945 213336 213638 213631 213547 213225 212452 211642 211300 211250 211197 211516 212599 213949 214836 215484 216686 218595 220697
51685 220697 222674 224563 226461 228781 232377 237574 243398 248457 252197 254713 255964 256030 255697 255806 256289
51670 256289 256576 256634 256890 257391 257754 257630 256687 254572 251526 248484 245961 243346 240006 236427 233381 230588
51654 230588 227130 222769 217906 212729 207403 202757 199692 198073 197006 195910 194535 192435 189513 186774
51640 186774 185421 185223 184798 183353 181243 178889 176247 173511 171329 170024 169242 168587 168096 167901 167874 167706
51624 167706 167092 165988 164927 164733 165525 166363 166390 165897 165689 165883 166074 166301 166985 168068 169015 169621 170146 170762
51606 170762 171449 172301 173333 174120 174235 173975 174121 175029 176359 177593 178499 179292 180633 183162 186784 190770
51590 190770 194731 198897 203269 207370 211289 215984 221831 227738 232542 236430 240033 242953 244377 244560
51576 244560 244506 244617 244786 245296 246416 247390 247067 245369 243168 241034 239171 238173 238520 239546 240142 240348 241010
51559 241010 242068 242639 242803 243847 246414 249700 252882 256188 260075 264382 268831 273451 277924 281292 282955
51544 282955 283467 283842 284420 284814 284608 283845 282992 282526 282418 282150 281487 280979 281319 282453 283739 284594 284500 282890
51526 282890 279815 276385 273812 272225 271056 270087 269221 267699 264726 260738 256963 253786 250537 246892 243379
51511 243379 240355 237452 234346 231298 228722 226778 225482 224598 223493 221680 219480 217550 215964 214446
51497 214446 213192 212599 212400 212007 211492 211339 211444 211425 211716 213140 215425 217374 218611 219974 221936 223879
51481 223879 225296 226660 228575 230985 233687 236833 240458 244219 247996 252178 256973 262034 267048 272211
51467 272211 277861 284121 290987 298271 305396 311822 317662 323343 328754 333364 337054 340064 342251 343245
51453 343245 343352 343368 343479 343150 342210 341207 340557 340174 339993 340077 340029 339005 336468 332426 327059 320843 314783
51436 314783 309641 305049 300170 295013 290190 285729 281249 277012 273461 269967 265588 261047 258280 257756
51422 257756 257855 257325 256729 256774 256814 256022 254928 254696 255747 257860 260845 264287 267372 269685 271671 273764 275703
51405 275703 277117 278079 278668 278727 278338 277734 276360 273053 267614 261317 255399 249947 244750 240124 236131 231913
51389 231913 226666 220643 214615 208981 203995 200021 196928 193875 190307 186601 183303 180413 177853 175749
51375 175749 173807 171221 167801 164323 161257 158148 154806 152128 150825 150253 149407 148323 147618 147304 146975
51360 146975 146542 145908 144525 142194 139825 138530 138361 138655 139133 139952 141072 142345 143775 145125 145728 145378
51344 145378 144848 144847 144995 144613 144028 144311 146010 148778 151860 154390 155821 156751 158782 162766 167639 171720
51328 171720 174716 177545 180678 183697 186360 189100 192319 195791 198924 201208 202386 202441 201392 199101 195655
51313 195655 191963 189269 187649 185670 181977 176720 170950 165326 160013 155292 151465 148466 146064 144132
51299 144132 142331 140087 137342 134794 132949 131509 130139 129171 128858 128605 127704 126368 125409 125285 125960 127157
51283 127157 128239 128484 128029 127848 128293 128520 128081 128037 129338 130982 131157 129742 128312 127949 128322 128821 129313
51266 129313 129601 129202 128033 126636 125582 125122 125331 125986 126392 126000 125098 124377 123971 123533 122963 122374 121518 120005
51248 120005 118069 116451 115566 115343 115738 116749 117984 118858 119234 119335 119126 118353 117198 116343 116303 117086 118444
51231 118444 120017 121243 121586 121026 120110 119496 119471 119752 119672 118865 117808 117347 117603 117856 117623 117254 117287 117850 118988
51212 118988 120817 122902 124214 124276 123812 123805 124528 125830 127582 129276 130051 129842 129770 130620 131702 132001 131747 131877
51194 131877 132573 133367 134183 135262 136430 137416 138508 140032 141483 142094 141914 141546 141159 140596 140109 140118 140508 140924
51176 140924 141355 141706 141283 139595 137274 135310 133799 132246 130496 128510 125901 122838 120749 120752 121787 121644
51160 121644 119644 116995 114783 113075 111984 112052 113208 114471 115105 115263 115303 115313 115436 115885 116564 117360 118685
51143 118685 120928 123539 125525 126702 127597 128302 128461 128220 128119 128093 127551 126378 124930 123206 121094 119226
51127 119226 118449 118491 118284 117528 116765 116074 115004 113774 113096 112721 111608 109751 108399 108172 108396 108677 109648
51110 109648 111544 113407 114457 115060 115687 116110 116325 117025 118285 118943 118346 117714 118621 120873 123013 124310
51094 124310 125200 126197 127383 128755 130228 131452 132242 132957 133870 134457 133912 132199 130125 128523 127720 127544
51078 127544 127506 127254 127099 127775 129398 131117 132120 132595 133314 134632 136310 137975 139363 140325 140881 141122 140968
51061 140968 140385 139850 140075 140981 141560 141144 140398 140598 142226 144654 146918 148433 149071 148967 148316 147363 146598
51044 146598 146673 147718 148919 149343 149159 149446 150744 152425 153638 154173 154130 153428 152148 150920 150470 150980 152148
51027 152148 153570 154817 155456 155371 154914 154591 154676 155170 155880 156478 156719 156686 156718 157204 158595 161231 164757 168036
51009 168036 170204 171657 173369 175440 177099 178056 179062 180953 183818 187268 190883 194246 197181 200174
50995 200174 204080 209200 215146 221578 228549 235982 243447 250636 257680 264918 272857 282299 293902 307430
50981 307430 321889 336497 351196 366435 383092 402462 425591 452509 482622 515734 552065
50970 552065 591532 633808 679014 727547 779336 834044 891761 952470 1014977 1077511 1139314
50959 1139314 1200377 1259526 1314178 1362425 1404138 1439587 1468261 1489724 1504521 1513412 1516633 1514713
50947 1514713 1509173 1501568 1492516 1482412 1472458 1464084 1457709 1452801 1448761 1445152 1441323 1436418 1429656 1420335
50933 1420335 1407726 1391127 1369798 1342994 1310525 1273195 1232038 1187217 1138377 1085965 1031350
50922 1031350 975747 920109 865979 815103 767911 723562 681776 643347 608615 576969 548468
50911 548468 524341 504874 488202 472400 457668 445255 435255 426793 419606 414018 409878 406762
50899 406762 404828 404382 404882 405387 405616 405724 405445 404390 402872 401567 400707 400416 401334 403919 407456 410730
50883 410730 413499 416476 420142 424467 429581 435799 443049 450933 459291 468182 477549 487513 498618 511192
50869 511192 524839 539260 555112 573288 593786 616179 640806 668522 699597 733974 772494
50858 772494 816729 867548 924824 988781 1060638 1141544 1231546 1329964 1436240 1550071 1671139
50847 1671139 1799071 1933430 2073423 2217608 2363672 2508271 2647137 2775702 2889875
50838 2889875 2986492 3063571 3120458 3157512 3175493 3175567 3160011 3132311 3096153 3054729 3011272 2969527
50826 2969527 2932986 2903946 2883757 2873384 2872877 2880360 2892123 2903570 2909910 2906633 2890426 2859843
50814 2859843 2814757 2755287 2681513 2593889 2493387 2381471 2260378 2133180 2003163 1873270
50804 1873270 1746321 1625211 1512293 1408763 1314975 1231031 1156773 1091745 1035654 988515
50794 988515 949982 919079 895031 877749 866951 861429 859948 862334 868833 878792 890768 903626
50782 903626 916693 929014 939274 946506 950395 951068 948994 944789 938657 930262 919500 906952 893169
50769 893169 878054 861537 844198 826620 808705 790429 772668 756382 741424 727138 713742
50758 713742 702209 693104 686514 682815 682440 685021 689700 696291 705252 716706 730424 746732 766370
50745 766370 789345 814820 842428 872975 907593 946808 990690 1039514 1094122 1155799 1225646
50734 1225646 1303725 1389048 1480702 1578457 1681637 1787837 1893555 1995800 2092372 2181019
50724 2181019 2259356 2325516 2377978 2414858 2434369 2436100 2421104 2390822 2346877 2292120 2230951
50713 2230951 2168020 2106932 2050243 1999987 1957775 1924546 1900381 1884513 1875625 1872380 1873362 1876339
50701 1876339 1878023 1874998 1864528 1844312 1812401 1768271 1713442 1650130 1579725 1503489 1424122 1345273
50689 1345273 1269512 1197799 1130828 1069774 1015583 968499 928542 895674 869388 848879 833841
50678 833841 824516 820957 822831 829970 842524 860587 884132 913116 947071 984845 1025294 1067830
50666 1067830 1111585 1154636 1195068 1232415 1266908 1297677 1323071 1342729 1358002 1370100 1379009
50655 1379009 1384470 1386936 1387154 1385681 1383104 1379959 1376145 1371231 1365586 1360513 1357195 1356208 1358060 1363351
50641 1363351 1372334 1385230 1402953 1426490 1455378 1487847 1522608 1559431 1597647 1635267 1670232
50630 1670232 1701708 1729667 1753999 1774575 1791533 1804941 1814757 1821521 1826687 1832043 1839282 1850120
50618 1850120 1866062 1887707 1914876 1947388 1984919 2025866 2067172 2105596 2138575 2163978 2180203
50607 2180203 2187018 2185551 2177024 2162074 2141322 2115517 2084612 2047552 2003512 1952727 1895796 1833015
50595 1833015 1764917 1692769 1618037 1541900 1465743 1391451 1320625 1253875 1191179 1132500 1077805
50584 1077805 1026990 980139 937432 898725 863723 832581 805685 782830 763310 746856 733650
50573 733650 723355 715134 708815 705146 704531 706491 710646 717310 726597 737869 750592 765089 782013
50560 782013 801770 824700 851056 880418 911967 945660 982383 1022639 1065993 1112008 1160661
50549 1160661 1211408 1262865 1313909 1364068 1412368 1457016 1496999 1533049 1566332 1597251 1626239
50538 1626239 1654655 1683840 1714153 1745766 1779412 1815340 1852474 1889841 1928210 1969284 2013989
50527 2013989 2062602 2115793 2174147 2237066 2303349 2372544 2444564 2518247 2591387 2662018 2728659
50516 2728659 2789558 2842755 2886823 2920574 2942266 2950186 2944098 2925139 2894194 2851246 2796525 2731577
50504 2731577 2659015 2581886 2503322 2426193 2352885 2285757 2227670 2181353 2148108 2127534 2118466
50493 2118466 2119613 2129334 2145534 2166278 2190336 2217031 2245657 2274851 2302084 2323643 2335322 2333312
50481 2333312 2314812 2278425 2224451 2154605 2071287 1977295 1876138 1771848 1667882 1566455
50471 1566455 1469145 1377571 1293011 1215784 1145634 1082433 1026122 976361 932756 895100 862916
50460 862916 835135 810788 789826 772784 759872 750773 744982 741879 740779 741455 744386 750052 758215
50447 758215 768255 779940 793478 809136 827173 847763 870521 894516 919252 945301 973461
50436 973461 1003653 1035156 1067552 1100855 1134949 1169490 1204134 1238401 1271665 1303799 1335521
50425 1335521 1367545 1399688 1431341 1462507 1493687 1524910 1555508 1584867 1613095 1641126 1670484
50414 1670484 1702562 1737637 1774781 1812976 1851864 1891040 1929303 1965339 1998678 2029226 2056236
50403 2056236 2078498 2095317 2106534 2111829 2110752 2103276 2089566 2069343 2042094 2007720 1966199 1916846
50391 1916846 1858859 1792732 1720422 1644080 1565344 1485968 1408274 1334472 1265962 1203581 1148189
50380 1148189 1100607 1061189 1029766 1006020 989852 981375 980546 986932 999912 1018826 1042455 1068406
50368 1068406 1093697 1116143 1134528 1147342 1152263 1147597 1133602 1111786 1083512 1049946 1012708 973561
50356 973561 933659 893879 855540 819919 787184 756651 728050 701849 678376 657410 638707
50345 638707 622328 608286 596271 585827 576570 568355 561427 556165 552387 549322 546703 545405 546518
50332 546518 550240 556232 564393 574463 585345 595959 606704 619101 633933 650498 667736 685305
50320 685305 703442 722411 742296 762842 783460 803850 824577 846518 869747 893384 916520
50309 916520 938829 960384 981332 1001712 1021226 1039307 1055685 1070590 1084044 1095462 1104467 1111511
50297 1111511 1116992 1120266 1120544 1118409 1115384 1112131 1108119 1102948 1096793 1089207 1078529 1063079 1042516
50284 1042516 1017824 990425 961525 931829 901691 871716 843007 816382 791551 767689 744621
50273 744621 722805 702387 683051 664741 647732 632023 617439 604302 593226 584219 576733 570596
50261 570596 566071 563012 560893 559776 560291 562445 565349 568360 571621 575159 578463 581466 585039 589809
50247 589809 595185 600198 604698 609007 612898 615758 617484 618466 618739 617858 615702 612901 610197 607650 604732
50232 604732 601117 597119 593197 589210 584529 578964 573144 567679 562390 556866 551483 547202 544450 542809
50218 542809 541864 541805 543086 545885 549946 554614 559172 563545 568527 574763 581624 587750 592696 597253 601958
50203 601958 606072 608507 609236 609202 609073 608577 607061 604320 600721 596625 591956 586480 580340 573970 567495
50188 567495 560699 553677 546943 540579 533837 526071 517611 509216 501123 493148 485288 477640 470146 463118
50174 463118 457595 454321 452689 451462 450353 450076 451008 452636 454235 455336 455533 454554 452537 449746 446161
50159 446161 441890 437553 433491 428954 423071 416405 410573 406398 403368 400805 398566 396565 394629 393016
50145 393016 392172 391854 391265 390223 389367 389072 388952 388556 387852 386944 385998 385486 385842 386953 388648 391383 395517
50128 395517 400229 404271 407625 411229 415221 418838 422082 425939 430623 434985 438166 440517 442451 443708
50114 443708 444415 445600 447789 450116 451609 452465 453284 453977 454267 454533 455351 456745 458511 460606 462719 464242
50098 464242 465315 467108 470380 474472 478422 482378 487164 493080 499912 507599 516137 525199 534451 543911
50084 543911 553600 563328 573176 583573 594510 605387 616090 627421 639915 652996 665939 678872
50072 678872 692169 705532 718430 730846 742863 754170 764779 775652 787854 801541 816441
50061 816441 832787 851009 871090 893021 917452 945122 976108 1010399 1048760 1092253 1141232
50050 1141232 1195546 1255263 1320394 1390106 1462789 1536444 1608358 1674963 1733010 1780845 1818117
50039 1818117 1844979 1862495 1873402 1881291 1888981 1898102 1909628 1923584 1938279 1950791 1958259 1957998
50027 1957998 1946679 1920756 1878408 1820693 1750663 1671860 1587720 1501655 1416951 1336399 1261883
50016 1261883 1194263 1133786 1080741 1035493 997747 966178 939167 915687 895312 877809 863016
50005 863016 850750 840427 831114 822260 813966 806269 798644 790546 781930 772814 762952 752432 741962
49992 741962 731909 721618 710360 698476 686868 675813 665012 654431 644305 634631 625368 616851
49980 616851 609301 602281 595358 589003 584025 580418 577539 575190 573657 572900 572575 572805 574060 576297 578992
49965 578992 582050 585891 590573 595536 600356 605150 610142 615451 621358 628136 635437 642504 649174 656221
49951 656221 664462 673954 684253 695101 706639 719283 733611 750200 769395 791294 815999 843822
49939 843822 875375 911599 953564 1002150 1058057 1122168 1195508 1278573 1370832 1470878 1576522
49928 1576522 1684447 1790310 1889856 1980052 2059351 2127679 2186717 2239691 2290112 2340548 2392449
49917 2392449 2446412 2501947 2557249 2609509 2655064 2689095 2706196 2702333 2676323 2629183 2562782
49906 2562782 2479795 2384291 2281060 2174076 2065883 1958043 1851499 1746772 1644525 1545885
49896 1545885 1451820 1362503 1277950 1198888 1126380 1060777 1001699 948811 901888 860251 822828
49885 822828 788830 757932 729932 704647 681996 661840 643949 628329 615041 603317 591538
49874 591538 578754 565654 553307 541540 529440 516945 504954 494203 484927 477279 471037 465149
49862 465149 458656 452058 446798 443488 441488 440138 439359 439007 438614 437985 437280 436382 434938 433084 431424 430188
49846 430188 429114 428206 427865 428145 428585 428915 429312 429864 430418 431099 432397 434641 437749 441456 445345 448856
49830 448856 451856 455078 459457 465195 471978 479767 488693 498614 509638 522738 538827 557469 577624
49817 577624 599569 624984 655254 690864 732463 781103 836966 898993 966271 1038786 1116112
49806 1116112 1196003 1274746 1348366 1413408 1467510 1510041 1541954 1564956 1581287 1594116 1607038
49795 1607038 1622685 1642200 1665782 1692460 1718914 1739674 1749257 1743719 1720254 1676927 1614059 1535293
49783 1535293 1446177 1351752 1255790 1161481 1071684 988465 912986 845777 786676 734669 688477
49772 688477 647476 611853 581794 556765 535691 517740 502678 490203 479117 467821 456035
49761 456035 445430 437865 433236 429712 425808 421481 417444 414344 412682 412612 413524 414420 414774 414530 413427
49746 413427 411263 408763 407123 406365 405130 402592 399708 398017 397874 398473 399060 399500 399965 400602 401409 402150
49730 402150 402590 402865 403336 403993 404391 404181 403331 401890 400030 398297 397242 396771 396395 396063 396148 396654 397100 397208
49712 397208 397060 396661 396103 396074 397285 399371 401233 402554 403961 405585 406612 406633 406449 407010 408416 410390
49696 410390 412898 415760 418386 420407 422043 423519 424789 426062 427768 429718 431113 431665 431865 431909 431466
49681 431466 430880 431314 433008 434543 434733 434233 434246 434569 434119 432788 431534 431001 431096 431686 432766 434032 435031
49664 435031 435706 436260 436714 437055 437526 438252 438951 439459 440212 441703 443867 446378 449079 451638 453340 453830 453664
49647 453664 453631 454017 454915 456552 458653 460162 460409 460080 460318 461373 462851 464683 466956 469261 471156 472921
49631 472921 474994 477053 478570 479869 481542 483120 483541 482937 482785 484050 486179 488268 490388 493323 497558
49616 497558 502853 508429 513375 517308 520812 524820 529504 534196 538478 542898 548377 555297 563380 572183
49602 572183 581468 591245 601608 612498 623617 634609 645305 655846 666705 678585 691913 706257
49590 706257 720570 734267 747830 762152 777590 793944 811062 829048 847970 867653 887828
49579 887828 908446 929956 953126 978263 1004708 1031535 1058671 1086733 1115826 1145358 1175166
49568 1175166 1205937 1238078 1271007 1304034 1337172 1370486 1403429 1435562 1467314 1499272 1531215
49557 1531215 1562510 1592874 1622059 1649361 1674335 1697494 1719447 1739715 1757312 1772148 1784893
49546 1784893 1795747 1804263 1810300 1814209 1816199 1816300 1814869 1812322 1808456 1802875 1796050 1789142 1782755 1776628
49532 1776628 1770532 1764642 1758974 1753349 1748112 1744200 1742250 1742272 1744336 1748883 1756045 1765282 1776021 1788172
49518 1788172 1801744 1816431 1831901 1848139 1865201 1882866 1900689 1918084 1934279 1948455 1960159
49507 1960159 1969422 1976473 1981518 1984707 1985974 1984910 1981027 1974108 1964066 1950658 1933772 1913882 1891751
49494 1891751 1867707 1841616 1813549 1783965 1753140 1720854 1686867 1651458 1615400 1579540 1544393
49483 1544393 1509933 1475830 1442052 1409113 1377505 1347075 1317283 1287919 1259228 1231499 1204902
49472 1204902 1179612 1155735 1133154 1111766 1091778 1073439 1056540 1040498 1024866 1009525 994538
49461 994538 980198 967078 955639 945772 936939 928708 920977 913869 907626 902398 897915 893614 889354
49448 889354 885623 882746 880297 877776 875436 873866 873055 872518 872123 872083 872300 872457 872792 874138 877048 881354
49432 881354 886624 892564 898927 905567 912799 921416 932169 945276 960195 975508 989252 999901 1007197
49419 1007197 1011956 1015351 1018650 1023194 1029828 1038328 1047871 1058052 1069029 1080816 1092999 1105183 1117277
49406 1117277 1129428 1142064 1155901 1171331 1187759 1204024 1219527 1234604 1249838 1265495 1281562
49395 1281562 1297855 1314006 1329701 1344918 1359609 1373307 1385588 1396822 1407889 1419042 1429610
49384 1429610 1438984 1447448 1455856 1464832 1474538 1484884 1495728 1506931 1518357 1529864 1541410 1553222
49372 1553222 1565581 1578272 1590645 1602551 1614895 1628720 1644036 1660038 1676268 1692939 1710224
49361 1710224 1727958 1746178 1765414 1786149 1808263 1831189 1854424 1877888 1901957 1927140 1953599
49350 1953599 1981009 2009010 2037596 2066969 2097359 2129216 2163200 2199640 2238255 2278659 2320687
49339 2320687 2363885 2407259 2450239 2493600 2538782 2586473 2636355 2687876 2740513 2793472 2845889
49328 2845889 2897381 2947890 2997101 3044564 3090235 3134271 3176335 3215654 3251764 3284697 3314533
49317 3314533 3341310 3365310 3386796 3405413 3420327 3431058 3437932 3441784 3443426 3443178 3440568 3434790 3425824
49304 3425824 3414795 3402930 3390563 3377616 3364453 3351605 3339157 3327121 3315961 3305963 3296573 3287276
49292 3287276 3278750 3272227 3268019 3265619 3264916 3266190 3269153 3273195 3278524 3285968 3295594 3306550 3318351 3331198
49278 3331198 3344933 3358709 3371936 3384592 3396432 3406776 3415255 3421805 3425707 3425670 3421208 3413006 3401487
49265 3401487 3385863 3365104 3339241 3309350 3276728 3242270 3206096 3167637 3126617 3083901 3040763
49254 3040763 2997580 2954074 2910583 2867916 2826005 2784012 2741964 2701056 2662058 2624694 2588941
49243 2588941 2555519 2524406 2494091 2463134 2431531 2399894 2368415 2337516 2308398 2281722 2256369
49232 2256369 2230621 2204189 2178227 2153786 2131130 2110292 2091434 2074663 2059981 2047235 2035861
49221 2035861 2025105 2014976 2006597 2001183 1998953 1999204 2000885 2002838 2004166 2004932 2006074 2008241 2011236 2014869
49207 2014869 2019556 2025577 2032417 2039443 2046655 2054231 2062037 2070159 2079220 2089419 2099885 2109769 2119483
49194 2119483 2130083 2141953 2154947 2169276 2185158 2201831 2217974 2233173 2248195 2263823 2280192
49183 2280192 2297305 2315324 2334003 2352369 2369459 2385265 2400739 2416879 2433817 2450804 2467134
49172 2467134 2482936 2498727 2514323 2528766 2541502 2553071 2564398 2575942 2587865 2600432 2613722
49161 2613722 2627385 2641244 2655783 2671543 2688366 2705786 2723895 2743222 2763879 2785452 2807700
49150 2807700 2830873 2855201 2880374 2905791 2931227 2957112 2983957 3011453 3038343 3063387 3086243
49139 3086243 3107168 3126254 3143527 3159478 3174721 3189231 3202741 3215799 3229438 3243664 3257213
49128 3257213 3269072 3279367 3288472 3296280 3302842 3308725 3314099 3318273 3320863 3322677 3324684 3326725 3327971
49115 3327971 3328153 3327638 3326747 3325628 3324390 3322778 3320172 3316404 3312138 3307981 3303867 3299873 3296872 3295606 3295641
49100 3295641 3296062 3296728 3298088 3300271 3303219 3307282 3312746 3319071 3325493 3332138 3339707 3348268 3357170 3366082
49086 3366082 3375268 3384869 3394613 3404184 3413216 3420953 3426672 3430583 3433777 3437103 3440428 3443109 3444887 3446183
49072 3446183 3447568 3448851 3448853 3446516 3442261 3437586 3433136 3427930 3420886 3412223 3402649 3391908 3379135 3364152
49058 3364152 3347468 3329336 3309759 3289186 3268194 3246492 3223097 3197550 3170272 3141771 3112243
49047 3112243 3082062 3051938 3022345 2993251 2964593 2936622 2909681 2883935 2859421 2836141 2814116
49036 2814116 2793397 2773963 2755598 2738243 2722431 2708866 2697369 2686939 2677233 2669295 2664253 2661880
49024 2661880 2660998 2660726 2660662 2660506 2660518 2661921 2665857 2672001 2679023 2686250 2694074 2702794 2711910 2720643 2728505 2735297
49008 2735297 2741107 2746390 2751576 2756544 2760785 2763967 2765982 2766719 2766213 2764868 2763060 2760764 2757890 2754660
48994 2754660 2751212 2747297 2742903 2738689 2735096 2731454 2726823 2721479 2716699 2713162 2710413 2707837 2705339 2702866
48980 2702866 2699902 2695729 2689852 2682154 2672951 2662815 2652104 2640767 2628928 2617298 2606533 2596428
48968 2596428 2586218 2575449 2564150 2552457 2540528 2528594 2516691 2504587 2492260 2480053 2468107
48957 2468107 2456330 2445328 2436420 2429988 2424640 2419053 2413960 2411098 2410708 2411377 2412171 2413645 2416719 2421732
48943 2421732 2428767 2437933 2449000 2461376 2474552 2488151 2501814 2515708 2530820 2547888 2566264 2584788
48931 2584788 2603538 2623735 2646006 2669866 2694867 2721153 2748689 2776989 2805892 2835832 2867105
48920 2867105 2899629 2933486 2968927 3005723 3043364 3082093 3122872 3166129 3211280 3257710 3305457
48909 3305457 3354700 3405353 3457455 3511289 3566867 3623915 3682647 3743891 3808081 3874636 3942575
48898 3942575 4011361 4080972 4151566 4223202 4295534 4367695 4438809 4508557 4576905 4643548 4708149
48887 4708149 4770815 4831613 4889787 4944235 4994725 5041876 5085985 5126586 5163171 5195623 5223884
48876 5223884 5247907 5267982 5284518 5297447 5306363 5311132 5311759 5307829 5298762 5284479 5265222 5241022
48864 5241022 5212045 5179044 5142650 5102568 5058498 5011453 4963012 4913511 4862157 4808705 4753630
48853 4753630 4696808 4637561 4576236 4514323 4452710 4391035 4329042 4267274 4206120 4145493 4085812
48842 4085812 4028012 3972131 3917219 3863176 3811324 3762561 3716295 3672013 3630528 3592675 3557974
48831 3557974 3525712 3496391 3470882 3448946 3429781 3413391 3400264 3390167 3382419 3377121 3375087 3376691
48819 3376691 3381579 3389462 3400442 3414583 3431735 3451766 3474563 3499817 3526956 3555241 3583922 3612777
48807 3612777 3642518 3674143 3707624 3741776 3775592 3809161 3843042 3877430 3912242 3947380 3982492
48796 3982492 4017057 4051074 4085086 4119223 4152888 4185817 4218698 4252235 4286235 4320277 4354693
48785 4354693 4390167 4426627 4463230 4499365 4535271 4571740 4609396 4648180 4687485 4726906 4766601
48774 4766601 4806510 4845592 4882598 4917417 4950772 4982699 5012264 5038741 5061932 5081205 5095434
48763 5095434 5104258 5108295 5107781 5102104 5091058 5075380 5055537 5031234 5002724 4971314 4937663 4900782
48751 4900782 4859766 4815532 4769776 4723047 4674888 4625004 4573116 4518419 4460545 4400719 4340873
48740 4340873 4281871 4223551 4166074 4110243 4056752 4006031 3958573 3914573 3873536 3835060 3799751
48729 3799751 3768535 3741354 3717373 3696297 3678678 3664975 3655017 3648222 3643729 3640532 3638204 3637436 3639268
48716 3639268 3643900 3650707 3659160 3669165 3680689 3693770 3708880 3726725 3747572 3771010 3796290 3822760
48704 3822760 3850214 3878980 3909338 3940771 3972218 4003291 4034642 4066986 4100393 4134783 4170336
48693 4170336 4207038 4244610 4283346 4324234 4367657 4412739 4458490 4504773 4551435 4597387 4641488
48682 4641488 4683645 4724149 4762560 4798235 4831357 4862343 4890637 4915080 4935199 4951281 4963548
48671 4963548 4972181 4977827 4981117 4981823 4979200 4972930 4963049 4949433 4932181 4912168 4890277 4866359 4839767
48658 4839767 4810595 4779470 4746370 4710624 4671952 4630652 4586895 4540651 4492245 4442214 4390728
48647 4390728 4337811 4283950 4229698 4174840 4118724 4061224 4002623 3942751 3881176 3818235 3755091
48636 3755091 3692669 3631165 3570513 3510743 3451929 3394359 3338638 3285038 3232973 3181695 3131231
48625 3131231 3081971 3033732 2986087 2939389 2894509 2851592 2809921 2769018 2729097 2690353 2652620
48614 2652620 2615852 2580363 2546391 2513882 2482693 2452658 2423565 2395530 2369200 2345088 2322938
48603 2322938 2302279 2283337 2266749 2252521 2239898 2228217 2217306 2207195 2197896 2189436 2181746 2174757
48591 2174757 2168837 2164646 2162183 2160559 2159271 2159018 2160614 2163749 2167706 2172632 2179066 2186735 2194946 2203819
48577 2203819 2214034 2225620 2238062 2251332 2265751 2280998 2296387 2311987 2328412 2345503 2362244
48566 2362244 2377913 2392330 2405067 2415476 2423584 2430043 2435221 2439308 2443200 2448212 2454785 2462361 2470455
48553 2470455 2478909 2487207 2494708 2501650 2508806 2516079 2522546 2528115 2533985 2541138 2549312 2557740 2565960 2573653
48539 2573653 2580635 2587305 2594242 2601159 2607155 2612236 2617573 2624003 2631222 2638785 2646897 2655781 2665244 2675389
48525 2675389 2686853 2699822 2713628 2727895 2743298 2760574 2779414 2798938 2818748 2838945 2859637
48514 2859637 2881023 2903646 2928118 2954772 2983661 3014433 3046064 3077360 3108066 3139010 3170871
48503 3170871 3203228 3235073 3265792 3295356 3323941 3351636 3378258 3403300 3426287 3447144 3465936
48492 3465936 3482361 3495925 3506437 3513866 3517989 3518861 3517374 3514564 3510410 3504089 3495306 3484647 3472723
48479 3472723 3459734 3445799 3430852 3414326 3395806 3375876 3355433 3334290 3311557 3287261 3262370
48468 3262370 3237187 3210994 3183509 3155369 3126804 3097050 3065622 3033143 3000432 2967794 2935610
48457 2935610 2904525 2874434 2844349 2813878 2784040 2756042 2730148 2706260 2684617 2665205 2647311
48446 2647311 2630319 2614267 2599154 2584581 2570738 2558802 2549536 2542177 2535429 2528920 2523027 2517988
48434 2517988 2513889 2510924 2508985 2507496 2506280 2505992 2507105 2509116 2511362 2514011 2517563 2521934 2526699 2531716
48420 2531716 2536899 2541875 2546454 2550970 2555655 2560227 2564638 2569607 2575833 2583188 2591154 2599381 2607302 2613940
48406 2613940 2618921 2623103 2627492 2632037 2636079 2639359 2641880 2643442 2644146 2644878 2646453 2648693 2650970 2653171
48392 2653171 2655369 2657092 2657831 2657886 2657829 2657475 2656212 2654074 2651589 2648779 2645162 2640691 2635981 2631585 2627680
48377 2627680 2624327 2621541 2619111 2616849 2614989 2614013 2614252 2615840 2618691 2622192 2625441 2628287 2631686 2636419
48363 2636419 2641886 2646811 2650749 2654174 2657395 2660121 2662116 2663658 2665322 2667628 2670822 2674666 2678644 2682548
48349 2682548 2686611 2690787 2694370 2696592 2697182 2696086 2693282 2689272 2685095 2681243 2677057 2671767 2665558 2659063
48335 2659063 2652420 2645497 2638502 2631496 2623820 2614871 2605173 2595881 2587508 2579844 2572774 2566378 2560492 2554950
48321 2554950 2549961 2545521 2540797 2535072 2529073 2524408 2521691 2520121 2518874 2517970 2517674 2517888 2518485 2519613 2521383
48306 2521383 2523741 2526803 2530896 2536118 2542222 2548970 2556153 2563216 2569267 2573686 2576569 2578550 2580267 2581779
48292 2581779 2582326 2580866 2577053 2571334 2563847 2553761 2540199 2523368 2504153 2482930 2459438 2433616
48280 2433616 2405924 2376930 2347100 2316776 2285814 2253537 2219740 2185591 2152807 2121970 2092314
48269 2092314 2063193 2035000 2008438 1983446 1959216 1935016 1910836 1887330 1865234 1844756 1825567
48258 1825567 1807375 1790176 1773915 1758366 1743649 1730350 1718711 1708146 1697995 1688371 1679688 1671747
48246 1671747 1663914 1655955 1648083 1640386 1632802 1625520 1618887 1613039 1608040 1604159 1601544 1599839 1598590 1597756
48232 1597756 1597393 1597160 1596612 1595668 1594271 1592059 1589014 1585976 1583720 1581835 1579452 1576808 1575029 1574345 1573512
48217 1573512 1571345 1568075 1564890 1562589 1560901 1558733 1555005 1549595 1543489 1537681 1532003 1525425 1517261 1507598
48203 1507598 1496799 1485279 1473722 1462798 1452476 1442142 1431457 1420643 1409915 1399167 1388346
48192 1388346 1377739 1367780 1358873 1351403 1345529 1340901 1336861 1332925 1328883 1324675 1320481 1316790 1313984 1312016
48178 1312016 1310705 1310072 1310037 1310220 1310506 1311467 1313651 1316792 1320279 1324046 1328284 1332585 1336211 1339123 1341962
48163 1341962 1345030 1347981 1350589 1353176 1356212 1359964 1364475 1369308 1373415 1375906 1377038 1377945 1379374 1381152
48149 1381152 1382836 1384276 1385576 1386964 1388769 1391083 1393508 1395571 1397251 1398709 1399832 1400613 1401693 1403773
48135 1403773 1406650 1409501 1411981 1414298 1416301 1417365 1417308 1416722 1416261 1416173 1416594 1417696 1419444 1421707 1424603 1428132
48119 1428132 1431538 1433741 1434574 1434970 1435816 1437178 1438793 1440691 1442958 1445245 1446835 1447102 1445997 1444236 1442903
48104 1442903 1442526 1442665 1442611 1442239 1441943 1442232 1443866 1447817 1454457 1463134 1473269 1485485 1501037 1520614 1544320
48089 1544320 1571835 1601087 1627187 1644556 1650765 1647593 1638561 1626730 1614824 1605537 1600415 1599039
48077 1599039 1600012 1602385 1605917 1610665 1616793 1624333 1632932 1642232 1652433 1663756 1675439 1686217 1695861
48064 1695861 1705264 1714726 1723241 1729898 1734997 1739221 1742534 1744596 1745548 1745673 1744770 1742472 1738853 1734235 1728707
48049 1728707 1722174 1714607 1706009 1696496 1686516 1676517 1666298 1655239 1643337 1631394 1620027 1609068
48037 1609068 1598097 1586883 1575144 1562632 1549843 1537860 1527115 1516863 1506240 1495235 1484237
48026 1484237 1473242 1461883 1449712 1436062 1420280 1402456 1383423 1363737 1343232 1321854 1300165
48015 1300165 1278549 1256596 1233868 1210727 1187826 1165255 1142772 1120539 1099058 1078678 1059473
48004 1059473 1041301 1023691 1006079 988490 971579 955728 940636 926062 912381 899944 888417
47993 888417 877278 866584 856742 847875 839837 832576 826069 820121 814576 809494 805008 801274 798613 797207
47979 797207 796542 795776 794839 794493 795087 795930 796282 796231 796128 795789 794844 793388 791805 790362 789362 789062 789015 788049
47961 788049 785459 781735 777737 773752 769797 766045 762230 757312 750621 742906 735482 728745 722287 715934
47947 715934 709732 703277 696127 688782 682281 676892 672081 667737 664413 662141 660044 657591 655471 654568
47933 654568 654628 654630 654198 653929 654351 655281 656427 658138 660987 664859 669026 673217 678044 684031 690724 697325
47917 697325 703851 710994 718909 726810 733904 740112 745736 750915 755700 760216 764470 768225 771144 772847
47903 772847 772858 770911 767337 762759 757430 751271 744423 737120 729166 720232 710729 701580 693022 684423 675513
47888 675513 666949 659317 652333 645493 638869 632831 627542 623136 619815 617412 615435 613860 613249 613804 615047
47873 615047 616840 619943 624988 631537 638677 645841 652670 658874 664937 672090 680745 689651 697562 705108
47859 705108 713904 724190 734485 743438 750963 757529 763384 768768 774139 779708 785043 789330 791873 792383
47845 792383 791070 788476 785049 780939 776200 770884 764840 757744 749509 740410 730743 720804 711284 702984
47831 702984 695894 689140 682168 675329 668935 662542 655792 649260 643709 638973 634361 629781 625723 622408
47817 622408 619693 617659 616658 616812 617953 619911 622483 625253 627809 630019 631871 633349 634649 636123
47803 636123 637751 639110 640175 641591 643849 646671 649602 652593 655620 658327 660557 662754 665351 668306
47789 668306 671602 675523 679940 684055 687498 690974 695234 700107 705275 711224 718445 726257 733360 739236
47775 739236 744324 749314 754952 761836 769522 776438 781619 785925 790581 795298 799048 802069 805541 809540
47761 809540 812837 814720 815648 815945 815185 813215 810711 808252 805642 802511 798860 794728 789932 784396 778301
47746 778301 771794 764954 757976 750994 743888 736698 729869 723508 716880 709451 702036 695900 691045 686445
47732 686445 681776 677772 674860 672651 670939 670128 670352 671130 672326 674642 678735 684404 690967 698011 705586
47717 705586 714120 724146 735675 747908 760087 772467 785846 800306 815098 829553 843322 856041
47705 856041 867663 878848 889930 899680 906413 910337 913436 916738 919063 918970 916579 912649 907025 899145
47691 899145 889410 879030 868814 858816 848858 838746 828233 817363 806699 796836 787856 779581 772129
47678 772129 765878 761070 757680 755493 754154 753433 753590 755299 759001 764488 771189 778665 786839 796011 806631
47663 806631 818833 832245 846448 861386 877014 892855 908433 923897 939636 955413 970454
47652 970454 984286 996872 1008026 1017348 1024783 1030642 1035072 1037922 1039059 1038300 1035318 1030201 1023847 1017002
47638 1017002 1009198 999460 987853 975371 962473 948893 934844 921122 907771 893938 879563 866035
47626 866035 854458 844103 833323 821363 808637 795910 783967 773519 764650 756495 748018 738948
47614 738948 729710 720751 712186 703781 695063 685810 676573 668274 661041 653942 646075 637489 628776 620246
47600 620246 611823 603316 594488 585194 575669 566324 557134 547656 537845 528415 520110 512960 506416 499977
47586 499977 493637 487974 483683 480655 477750 474042 470075 467158 465653 464828 464261 464239 464689 464895 464661 464693
47570 464693 465318 465866 465928 466291 467792 469937 471538 472223 472551 473035 473769 474716 475652 476011 475321 473718 471703
47553 471703 469622 467673 466073 464776 463266 461042 458166 455090 452128 449320 446559 443609 440169 436141
47539 436141 431692 427009 422213 417438 412690 407678 402183 396489 391010 385659 380191 375060 371114 368357
47525 368357 365778 362603 359022 355524 352247 349252 346785 344975 343817 343439 343705 343577 341921 339131 336913
47510 336913 336102 335773 334921 333859 333242 332834 332182 331658 331788 332161 332064 331735 332030 333158 334604 336042 337449
47493 337449 338533 338807 338273 337369 336336 335146 333955 333131 332816 332866 333172 333751 334549 335373 335954 336093 335994 336344
47475 336344 337622 339294 340294 340442 340722 341996 344099 346454 348775 350803 352110 352791 353712 355560 358197
47460 358197 361376 365369 370233 375082 378873 381517 383624 385630 387824 390699 394536 398887 403123 407129
47446 407129 410948 414225 416740 419135 422309 426254 430184 433620 436787 440061 443649 447638 451814 455543
47432 455543 458325 460490 462927 466254 470526 475536 481056 486889 493037 499617 506470 513083 519193 525151
47418 525151 531472 538324 545605 553173 560820 568418 576155 584101 591556 597623 602689 608391 615644 623477
47404 623477 630333 635713 639999 643527 646635 649897 653371 656087 657008 656120 653904 650416 645672 640290 634728
47389 634728 628344 620243 610816 601430 592825 584732 576922 569641 562977 556645 550602 545193 540541 536344
47375 536344 532471 529366 527668 527636 528910 530724 532498 534272 536379 538828 541565 545279 551012 558689 566917
47360 566917 574725 582626 591420 600873 610343 619790 629188 637693 644423 649543 653594 656362 657395 657099
47346 657099 656183 654438 651174 646429 640568 633044 622961 610809 598449 587191 576856 566697 556275
47333 556275 545353 533936 522641 512270 502852 493790 484931 476804 469749 463532 457830 452464 447122
47320 447122 441484 435670 430114 425104 420828 417547 415147 412944 410575 408630 407686 407235 406597 406414 408016
47305 408016 411474 415385 418594 421045 423008 424559 425929 427421 428802 429631 430141 430914 431763 431956 431556 431434
47289 431434 431859 432127 431774 431109 430347 429188 427636 426312 425596 425229 424940 424677 424125 422993 421996 422515 424857
47272 424857 427812 430295 432507 435058 437969 441180 445160 450188 455703 461076 466531 472597 479105 485431
47258 485431 491434 497562 504178 511310 518919 526993 535406 543945 552415 560653 568535 575970 582694 588159
47244 588159 592013 594637 596817 598804 600102 600212 599224 597669 596126 594997 594298 593617 592489 590706 588133
47229 588133 584563 580150 575550 571132 566445 561192 556288 553045 551514 550520 549297 548181 547697 547835 548334
47214 548334 548949 549335 549391 549788 551506 554852 559499 565339 572459 580464 588767 597534 607392 618145 628780
47199 628780 638811 648610 658259 667150 675043 682518 689896 696473 701252 703807 704200 702727 699954 696292
47185 696292 691393 684696 676670 668559 660771 652567 643693 635253 628359 622818 617781 613021 609013 606297
47171 606297 605206 605713 607199 608924 610976 614175 618902 624802 631751 640200 650233 661202 672690 685025
47157 685025 698451 712689 727733 744137 761873 779732 796600 812659 828663 844610 859717
47146 859717 873238 884753 894131 901634 907644 911989 914031 913639 911412 907752 902609 896398 890174 884270
47132 884270 877700 869693 861110 853555 847608 842549 837364 831443 824727 817760 811288 805577 800550 796599
47118 796599 794376 793539 792743 791352 790175 789982 790339 790656 791377 793185 795838 798743 802001 805968 810468 815328
47102 815328 821120 828334 836298 843783 850224 855544 859369 861397 862125 862224 861446 858953 854387 847867 839367
47087 839367 829023 817697 806313 794798 782509 769499 756521 743955 731531 719057 706732
47076 706732 694784 683346 672573 662408 652564 643183 635121 628943 624056 619510 615288 612067 610027
47063 610027 608732 607978 607979 608862 610618 613362 616993 620831 624252 627457 630980 634707 638161 641540 645690
47048 645690 651107 657568 664563 671453 677389 681860 685305 688587 691919 694868 697242 699406 701800 704658
47034 704658 708030 711632 714907 717732 720777 724649 729089 733631 738560 744362 750596 756331 761555 767220
47020 767220 773838 780895 787757 794413 801167 808233 815752 823703 831809 839908 848305 857202 866045 874141
47006 874141 881760 889833 898575 907262 915523 924072 933794 944618 955586 965742 974776 982991 990735
46993 990735 997772 1003512 1007946 1011873 1015729 1018727 1019818 1019082 1017469 1015533 1013271 1010876 1008648 1006240
46979 1006240 1002982 999022 995286 992260 989614 987122 985060 983593 982595 982293 983251 985486 988363 991666 995967
46964 995967 1001568 1007886 1014345 1021110 1028352 1035442 1041679 1047405 1053593 1060531 1067533 1073901 1079576 1084807
46950 1084807 1089689 1094222 1098491 1102521 1106085 1108914 1110993 1112485 1113362 1113366 1112521 1111435 1110717 1110213 1109216 1107410
46934 1107410 1105073 1102292 1098663 1094121 1089468 1085604 1082662 1080419 1079090 1079006 1079814 1080789 1081870 1083756 1086882
46919 1086882 1090845 1094969 1099053 1103403 1108375 1114019 1120032 1126117 1132362 1139022 1145892 1152326 1158130 1163994
46905 1163994 1170713 1178359 1186490 1194720 1202822 1210809 1219319 1229265 1240482 1251291 1260125 1267034 1272907
46892 1272907 1277797 1280993 1282284 1282034 1280186 1276272 1270371 1263166 1255103 1246379 1237739 1230335 1224656 1220343
46878 1220343 1217132 1215268 1215046 1216743 1221018 1228384 1238115 1248553 1258825 1269505 1281310 1293880 1306266
46865 1306266 1318022 1329355 1340530 1351446 1361581 1370277 1377379 1383494 1389241 1394422 1398541 1401911 1405426
46852 1405426 1409315 1413001 1416425 1420598 1426496 1433964 1442103 1450231 1458256 1466585 1475885 1486451 1497702
46839 1497702 1508729 1519420 1530445 1542055 1553519 1563969 1573160 1581150 1587831 1593101 1597085 1599909
46827 1599909 1601629 1602470 1602705 1602157 1600365 1597313 1593564 1589557 1585299 1580772 1576096 1571243 1566246 1561805 1558979
46812 1558979 1558083 1558541 1560027 1562997 1567793 1573992 1581132 1589545 1599920 1612422 1626632 1642029 1658317
46799 1658317 1675622 1694547 1715542 1738016 1760549 1782157 1802789 1822469 1840691 1857054 1871708
46788 1871708 1884606 1894930 1901897 1905751 1907296 1906755 1903704 1897956 1890012 1880700 1870720 1860464 1849940
46775 1849940 1838987 1827715 1816535 1805615 1794586 1783034 1771001 1758803 1746698 1735003 1724128
46764 1724128 1714079 1704197 1693788 1682913 1672239 1662295 1653114 1644470 1636140 1628039 1620357 1613564 1608036
46751 1608036 1603700 1600134 1596992 1594329 1592588 1592323 1593825 1597018 1601749 1608033 1615822 1624755 1634420 1644759
46737 1644759 1655851 1667454 1679184 1691111 1703689 1717077 1730918 1744810 1758596 1772108 1785072
46726 1785072 1797355 1808914 1819413 1828281 1835320 1840962 1845821 1850259 1854341 1857901 1860645 1862614 1864512
46713 1864512 1867200 1870834 1874948 1879357 1884461 1890601 1897603 1905173 1913329 1922284 1932185 1943038 1954569
46700 1954569 1966127 1977019 1986890 1995535 2002494 2007270 2009765 2009976 2007436 2001551 1992371 1980432 1965868
46687 1965868 1948339 1927790 1904559 1878821 1850708 1821037 1791092 1761463 1731801 1701871 1672104
46676 1672104 1642889 1614159 1585983 1558877 1533170 1508660 1485218 1463105 1442308 1422184 1402144
46665 1402144 1382266 1362981 1344644 1327549 1311764 1296808 1282118 1268033 1255530 1244742 1234587
46654 1234587 1224288 1214511 1206483 1200691 1197015 1195489 1196237 1199131 1204043 1211133 1220449 1231597 1244174
46641 1244174 1258119 1273337 1289438 1306130 1323328 1340545 1356724 1371038 1383321 1393449 1401047
46630 1401047 1406286 1410200 1413542 1415795 1415940 1413812 1410221 1406227 1402785 1400613 1399770 1399722 1400277 1402107 1406011
46615 1406011 1412245 1421001 1432899 1448334 1466810 1487528 1510166 1534451 1559444 1584002 1607612 1630151
46603 1630151 1651199 1670243 1687167 1701788 1713143 1720062 1722384 1720962 1716549 1709149 1698422 1684255
46591 1684255 1666993 1647492 1626812 1605578 1583844 1561761 1539987 1519101 1499085 1479808 1461487
46580 1461487 1444153 1427212 1410247 1393840 1378813 1364940 1351238 1337312 1323606 1310327 1296919
46569 1296919 1282805 1268076 1253307 1239137 1226098 1214433 1203908 1194092 1184906 1176671 1169538 1163085
46557 1163085 1156583 1149645 1142666 1136533 1131741 1127877 1124276 1121010 1118709 1117422 1116423 1115313 1114537 1114492 1114888
46542 1114888 1115539 1116987 1119693 1123150 1126613 1130233 1134709 1140095 1145785 1151523 1157775 1165158 1173995 1184349
46528 1184349 1195953 1208163 1220333 1232229 1243919 1255575 1267601 1280538 1294494 1309064 1324128
46517 1324128 1340227 1357723 1376107 1394642 1413269 1432362 1452138 1472820 1494837 1518214 1542243
46506 1542243 1566433 1591289 1617370 1644065 1670186 1695371 1719979 1743917 1766561 1787607 1806968
46495 1806968 1823884 1837228 1846853 1853836 1859226 1863223 1865674 1866538 1865711 1863105 1859208 1854915 1850572 1845634
46481 1845634 1839567 1832627 1825549 1818801 1812334 1805687 1798128 1788972 1778057 1765839 1753011 1740016 1726742
46468 1726742 1712483 1696390 1678200 1658349 1637233 1614694 1590517 1565004 1538557 1511029 1482049
46457 1482049 1451885 1421498 1391886 1363747 1337510 1313139 1290056 1267785 1246696 1227717 1211444
46446 1211444 1197883 1186892 1178407 1172345 1168722 1167801 1169705 1173940 1179700 1186596 1194827 1204600 1215667
46433 1215667 1227383 1239139 1250863 1263102 1276285 1289842 1302439 1313189 1322132 1329517 1335340 1339811
46421 1339811 1343440 1346177 1347253 1346421 1344623 1342857 1341081 1338931 1336751 1335080 1333799 1332747 1332627 1334388
46407 1334388 1338135 1343548 1350819 1360249 1371468 1384179 1399206 1417637 1439244 1462935 1488561 1517035
46395 1517035 1548751 1583099 1619513 1657881 1697817 1738564 1779781 1821464 1863034 1903440 1942225
46384 1942225 1979547 2015049 2047637 2076487 2101402 2122079 2137991 2149179 2156164 2158848 2156323 2148145
46372 2148145 2135037 2118108 2098085 2075581 2051370 2026023 1999748 1972791 1945618 1918705 1892656
46361 1892656 1868371 1846457 1826581 1808114 1791226 1776651 1764615 1755064 1748743 1746948 1750146 1757855
46349 1757855 1769906 1786641 1807763 1832299 1860091 1892151 1929039 1969948 2014036 2061643 2113392
46338 2113392 2168825 2226666 2285915 2345950 2405970 2464956 2522054 2576634 2628117 2675714 2718014
46327 2718014 2752963 2778862 2795384 2803057 2801970 2791834 2773184 2747362 2715127 2676394 2631660 2582598
46315 2582598 2530710 2476376 2419789 2362005 2304404 2247886 2193195 2141376 2093230 2048821 2008041
46304 2008041 1971226 1938863 1911219 1888588 1871268 1858876 1850386 1845314 1844277 1847881 1855734 1867063
46292 1867063 1881695 1899810 1921283 1945861 1973500 2003901 2036099 2069099 2102719 2137380 2173346
46281 2173346 2210503 2248481 2286608 2324069 2360440 2395775 2429943 2462296 2492153 2519138 2542845
46270 2542845 2562724 2578576 2590574 2598535 2601805 2600252 2594738 2586075 2574090 2558232 2538673 2516355
46258 2516355 2492314 2467451 2442537 2417957 2393652 2369657 2346518 2324956 2305463 2288292 2273519
46247 2273519 2260941 2250362 2241964 2235977 2232009 2229398 2228197 2229036 2231863 2235700 2239829 2244262 2248737 2252304
46233 2252304 2254502 2255996 2257359 2257972 2256854 2253862 2249330 2243140 2234985 2225059 2213732 2200925 2186473
46220 2186473 2170729 2154219 2137036 2119109 2100754 2082435 2064378 2046730 2029607 2012624 1995062
46209 1995062 1977082 1960055 1944948 1931051 1917129 1903313 1890847 1880290 1871038 1862589 1855312 1849828
46197 1849828 1846287 1844518 1844395 1845848 1848784 1853256 1859615 1868386 1879803 1893183 1906937 1919718 1931686
46184 1931686 1944231 1958446 1974403 1991780 2010280 2029114 2046983 2063187 2078264 2093145 2108212
46173 2108212 2123408 2138523 2152966 2165976 2177646 2189090 2201136 2213519 2225744 2237894 2249942
46162 2249942 2261166 2271083 2280337 2289839 2299623 2309362 2319413 2330419 2342271 2354297 2366146 2377812
46150 2377812 2389143 2400027 2410726 2421500 2432324 2443413 2455242 2467383 2478129 2486167 2492019 2496945
46138 2496945 2501182 2504311 2506664 2509048 2511526 2513672 2515680 2517901 2519607 2519594 2517991 2516139 2514639 2512764
46124 2512764 2509887 2506239 2501992 2496849 2491021 2485555 2481051 2476840 2471977 2466378 2460487 2454429 2448139 2441975
46110 2441975 2436567 2432058 2427786 2422800 2416820 2410744 2406005 2403131 2401153 2398710 2395425 2391769 2388085 2384433
46096 2384433 2381126 2378504 2376174 2373239 2369378 2365097 2360832 2356457 2351862 2347429 2343682 2340771 2338501 2336694
46082 2336694 2335448 2335157 2336161 2338283 2341040 2344532 2349525 2356217 2363472 2370037 2376091 2382768 2390486 2398723
$$ [...]
##END NTUPLES=NMR SPECTRUM
##END=
