
##TITLE=AC1351_CHIRS12169_7154778_ph0fgzLUjz
##JCAMPDX= 6.0         $$ Bruker NMR JCAMP-DX V2.0
##DATA TYPE= NMR SPECTRUM
##DATA CLASS= NTUPLES
##ORIGIN= BRUKER
##OWNER= Administrator
$$ 1.72 TOPSPIN		Version 2.1
$$ 2012-12-01 03:15:45.049 -0500  Administrator@X
$$ Compression mode = diff/dup
##.OBSERVE FREQUENCY= 400.02188249412
##.OBSERVE NUCLEUS= ^1H
##.ACQUISITION MODE= SIMULTANEOUS (DQD)
##.ACQUISITION SCHEME= undefined
##.AVERAGES= 8
##.DIGITISER RES= 22
##SPECTROMETER/DATA SYSTEM= spect
##.PULSE SEQUENCE= zg30
##.SOLVENT NAME= COFFEE_meoh
##.SHIFT REFERENCE= INTERNAL, COFFEE_meoh, 1, 14.98509
##AUDIT TRAIL= $$ (NUMBER, WHEN, WHO, WHERE, PROCESS, VERSION, WHAT)
$$ ##TITLE= Audit trail, TOPSPIN		Version 2.1
$$ ##JCAMPDX= 5.01
$$ ##ORIGIN= Bruker BioSpin GmbH
$$ ##OWNER= Administrator
$$ $$ E:\/data/COFFEE/nmr/AC1351_CHIRS12169_7154778_ph0fgzLUjz/10/pdata/1/auditp.txt
$$ ##AUDIT TRAIL=  $$ (NUMBER, WHEN, WHO, WHERE, PROCESS, VERSION, WHAT)
(   1,<2012-12-01 03:15:36.580 -0500>,<Administrator>,<X>,<go>,<TOPSPIN 2.1>,
      <created by zg
	started at 2012-12-01 03:14:30.689 -0500,
	POWCHK enabled, PULCHK disabled,
       configuration hash MD5:
       86 BA 57 50 F2 9D 5C 9B 26 00 A9 28 5F 66 2E 89
       data hash MD5: 64K
       62 DC D8 98 76 8D 2B 93 3F 03 1D 70 7D A2 9F 04>)
(   2,<2012-12-01 03:15:39.799 -0500>,<Administrator>,<X>,<proc1d>,<TOPSPIN 2.1>,
      <Start of raw data processing
       efp LB = 0 FT_mod = 6 PKNL = 1 PHC0 = 0 PHC1 = 0 SI = 32K 
       data hash MD5: 32K
       C0 AB D7 30 25 94 BD 87 02 FB 70 95 6F BA 73 26>)
(   3,<2012-12-01 03:15:40.267 -0500>,<Administrator>,<X>,<proc1d>,<TOPSPIN 2.1>,
      <pk PHC0 = 98.58032 PHC1 = 0 
       data hash MD5: 32K
       03 E0 C9 F4 DC B6 16 21 04 70 9D 72 76 E5 66 FF>)
(   4,<2012-12-01 03:15:40.502 -0500>,<Administrator>,<X>,<proc1d>,<TOPSPIN 2.1>,
      <abs ABSG = 1 
       data hash MD5: 32K
       53 EB 4F A5 75 F5 97 82 42 E6 62 6B 81 28 E1 D7>)
(   5,<2012-12-01 03:15:40.689 -0500>,<Administrator>,<X>,<proc1d>,<TOPSPIN 2.1>,
      <abs ABSG = 2 
       data hash MD5: 32K
       F0 04 24 C5 99 A5 90 BA CB 0F E1 36 16 A4 9E B3>)
(   6,<2012-12-01 03:15:40.861 -0500>,<Administrator>,<X>,<proc1d>,<TOPSPIN 2.1>,
      <abs ABSG = 3 
       data hash MD5: 32K
       E9 01 6E 93 3E 14 9E 1B 54 65 92 70 11 67 D5 49>)
(   7,<2012-12-01 03:15:41.033 -0500>,<Administrator>,<X>,<proc1d>,<TOPSPIN 2.1>,
      <abs ABSG = 4 
       data hash MD5: 32K
       2D A5 F4 A1 4E DE C3 EC C1 AE 4F B8 05 4C A5 5C>)
(   8,<2012-12-01 03:15:41.205 -0500>,<Administrator>,<X>,<proc1d>,<TOPSPIN 2.1>,
      <abs ABSG = 5 
       data hash MD5: 32K
       87 3C F4 08 60 2F 9F AE F7 88 01 7B 07 BD B4 DE>)
$$ ##END=
$$ 
$$ $$ hash MD5
$$ $$ B5 72 12 AD D0 1A 27 6D DD C9 13 AC 42 61 1C EA
##$RELAX= 
##$RELAX= 
##$RELAX= 
##$RELAX= 
##$RELAX= 
##$RELAX= 
##$RELAX= 
$$ Bruker specific parameters
$$ --------------------------
##$DU= <E:\>
##$EXPNO= 10
##$NAME= <AC1351_CHIRS12169_7154778_ph0fgzLUjz>
$$ [...]
150 150 150 150 150 150 150 150
##$TP07= 0
##$TPNAME0= <>
##$TPNAME1= <>
##$TPNAME2= <>
##$TPNAME3= <>
##$TPNAME4= <>
##$TPNAME5= <>
##$TPNAME6= <>
##$TPNAME7= <>
##$TPOAL= (0..7)
0.5 0.5 0.5 0.5 0.5 0.5 0.5 0.5
##$TPOFFS= (0..7)
0 0 0 0 0 0 0 0
##$TUNHIN= 0
##$TUNHOUT= 0
##$TUNXOUT= 0
##$USERA1= <user>
##$USERA2= <user>
##$USERA3= <user>
##$USERA4= <user>
##$USERA5= <user>
##$V9= 5
##$VALIST= <valist>
##$VCLIST= <CCCCCCCCCCCCCCC>
##$VD= 0
##$VDLIST= <DDDDDDDDDDDDDDD>
##$VPLIST= <PPPPPPPPPPPPPPP>
##$VTLIST= <TTTTTTTTTTTTTTT>
##$WBST= 1024
##$WBSW= 4
##$XGAIN= (0..3)
0 0 0 0
##$XL= 0
##$YL= 0
##$YMAX_a= 682284
##$YMIN_a= -581125
##$ZGOPTNS= <>
##$ZL1= 120
##$ZL2= 120
##$ZL3= 120
##$ZL4= 120
##$ABSF1= 14.98509
##$ABSF2= -5.573092
##$ABSG= 5
##$ABSL= 3
##$ALPHA= 0
##$AQORDER= 0
##$ASSFAC= 0
##$ASSFACI= 0
##$ASSFACX= 0
##$ASSWID= 0
##$AUNMP= <proc_prof1d_extract_pilot.lims>
##$AXLEFT= 0
##$AXNAME= <>
##$AXNUC= <1H>
##$AXRIGHT= 0
##$AXTYPE= 0
##$AXUNIT= <>
##$AZFE= 0.1
##$AZFW= 0.1
##$BCFW= 0
##$BC_mod= 0
##$BYTORDP= 0
##$COROFFS= 0
##$CY= 15
##$DATMOD= 1
##$DC= 0
##$DFILT= <>
##$DTYPP= 0
##$F1P= 0
##$F2P= 0
##$FCOR= 0.5
##$FTSIZE= 32768
##$FT_mod= 6
##$GAMMA= 0
##$GB= 0
##$INTBC= 1
##$INTSCL= 1
##$ISEN= 128
##$LB= 0
##$LEV0= 0
##$LPBIN= 0
##$MAXI= 10000
##$MC2= 0
##$MEAN= 0
##$ME_mod= 0
##$MI= 0
##$NCOEF= 0
##$NC_proc= -8
##$NLEV= 6
##$NOISF1= 0
##$NOISF2= 0
##$NSP= 0
##$NTH_PI= 0
##$NZP= 0
##$OFFSET= 14.98509
##$PC= 1
##$PHC0= 98.58032
##$PHC1= 0
##$PH_mod= 1
##$PKNL= yes
##$PPARMOD= 0
##$PPDIAG= 0
##$PPIPTYP= 0
##$PPMPNUM= 2147483647
##$PPRESOL= 1
##$PSCAL= 4
##$PSIGN= 0
##$PYNMP= <proc.py>
##$REVERSE= no
##$SF= 400.02
##$SI= 32768
##$SIGF1= 0
##$SIGF2= 0
##$SINO= 400
##$SIOLD= 32768
##$SPECTYP= <>
##$SREGLST= <1H.CDCl3>
##$SSB= 0
##$STSI= 32768
##$STSR= 0
##$SW_p= 8223.68421052631
##$SYMM= 0
##$S_DEV= 0
##$TDeff= 65536
##$TDoff= 0
##$TI= <>
##$TILT= no
##$TM1= 0
##$TM2= 0
##$TOPLEV= 0
##$USERP1= <user>
##$USERP2= <user>
##$USERP3= <user>
##$USERP4= <user>
##$USERP5= <user>
##$WDW= 1
##$XDIM= 32768
##$YMAX_p= 476115992
##$YMIN_p= -727149
##$CURPLOT= <Network HP LaserJet P1505>
##$CURPRIN= <$Network HP LaserJet P1505>
##$DFORMAT= <normdp>
##$LAYOUT= <+/1D_H.xwp>
##$LFORMAT= <normlp>
##$PFORMAT= <normpl>
##$SURQMSG= 1
$$ End of Bruker specific parameters
$$ ---------------------------------
##NTUPLES= NMR SPECTRUM
##VAR_NAME=  FREQUENCY,     SPECTRUM/REAL,   SPECTRUM/IMAG
##SYMBOL=    X,             R,               I
##VAR_TYPE=  INDEPENDENT,   DEPENDENT,       DEPENDENT
##VAR_FORM=  AFFN,          ASDF,            ASDF
##VAR_DIM=   32768,         32768,           32768
##UNITS=     HZ,            ARBITRARY UNITS, ARBITRARY UNITS
##FACTOR=    0.250966925370066, 1,           1
##FIRST=     8223.43324360094, -168371,      -253572
##LAST=      0,             206514,          -209545
##MIN=       0,             -727149,         0
##MAX=       8223.43324360094, 476115992,    0
$$ Real data points
##PAGE= N=1
##DATA TABLE= (X++(R..R)), XYDATA
$$ [...]
19538C5972M0505J89997b12367d5980E2702c04459j8467A50606E7264K3636b73217
$$ 35972 76477 266474 -212367 -45980 52702 -304459 -322926 150606 57264 80900 -273217
19526d0390D70858c7785B55720b7404l78822A59185a02073D5804a83812j79661
$$ -40390 470858 -37785 255720 -27404 -406226 159185 -102073 45804 -183812 -363473
19516c63473n2789D1000a70024o1407G6886l0434j6558K9703b74780k6724h124
$$ -363473 -416262 41000 -170024 -231431 76886 46452 29894 59597 -274780 -301504 -8124
19504A18007c5786A60591k7101a43404c3230l0265p2071E2712A614R5381P2856
$$ 118007 -35786 160591 133490 -143404 -33230 -63495 -135566 52712 1614 96995 169851
19493A69851B1484b47904j08870c6488E2044a51136k07269A56479D8650K37565
$$ 169851 21484 -247904 -356774 -36488 52044 -151136 -358405 156479 48650 286215
19483B86215f0301p1801d5550j01949B86400d8840A92591a57589c2016C38474
$$ 286215 -60301 -132102 -45550 -147499 286400 -48840 192591 -157589 -32016 338474
19472b30003i9296c0567C9031c5917p4394M1924E0288a94769l9148J01227j40021
$$ -230003 -99296 -30567 39031 -35917 -110311 -68387 50288 -194769 -233917 -132690 -272711
19461b72711n890B35451a01926K3178D5630a00750D3283a23035A82706c27458
$$ -272711 -278601 235451 -101926 -78748 45630 -100750 43283 -123035 182706 -327458
19450a88359A53240a16981L0221C91093b04331l7324P2058J0866A1311K03502
$$ -188359 153240 -116981 -86760 391093 -204331 -241655 -169597 -158731 11311 214813
19440B14813a86065N970C09655a99317J9610c6753C2694i6950m4355b1119I8701
$$ 214813 -186065 -180095 309655 -199317 -179707 -36753 32694 -96950 -141305 -21119 98701
19428a47801c2014q5048j36376M6106G2802a43191q7597P6947J2261D4583b5000
$$ -147801 -32014 -117062 -253438 -207332 72802 -143191 -230788 -153841 -141580 44583 -25000
19416a38767B27766c4374A68028a29101j40388J16617j46929h6592k83955B93218
$$ -138767 227766 -34374 168028 -129101 -269489 -152872 -299801 -86592 -370547 293218
19405I5027L7091a17272G8977d55639f8305j76908O6209C27900A5308d5278K0503
$$ 95027 132118 -117272 78977 -455639 -68305 -245213 -179004 327900 15308 -45278 -24775
19394b4775j2676o9733j89540j96637a60912B70824g2327A26369d60869A74492
$$ -24775 -37451 -107184 -296724 -493361 -160912 270824 -72327 126369 -460869 174492
19383A8945M6528M8624c41189a24141c5687A50255a37664C59614e090k46619P6630
$$ 18945 65473 114097 -341189 -124141 -35687 150255 -137664 359614 -5090 -251709 -175079
19372a75079n4215G9737C1530a01669k2410c4112j3044l7303A95801j5420i2886
$$ -175079 -229294 79737 31530 -101669 -124079 -34112 -47156 -84459 195801 180381 -92886
19360g9874k03809r3102J17514a06755c6301A02073c23505a37961r7827P1475
$$ -79874 -283683 -376785 -259271 -106755 -36301 102073 -323505 -137961 -235788 -164313
19350a64313k54555a08379k89052a45722A7435J27440a53956A00064B5172a38427
$$ -164313 -418868 -108379 -397431 -145722 17435 144875 -153956 100064 25172 -138427
19339B1881h6095j1253m51743K32429h4104j14895G6630i9626j46270Q8758b0958
$$ 21881 -86095 -97348 -549091 -316662 -84104 -198999 76630 -99626 -245896 -157138 -20958
19327b31175h0735F7262b55981C65237c79710A35501c58460i1948l81275G5927
$$ -231175 -80735 67262 -255981 365237 -379710 135501 -358460 -91948 -473223 75927
19316A3989b71237M3146R7649j55430L1981h9288A09328d10695a29076k3995B13009
$$ 13989 -271237 -228091 -130442 -285872 -253891 -89288 109328 -410695 -129076 -153071 213009
19304b6091j83616j84606a52762B0169d87j02249b372j71544j58790J59225P3358
$$ -26091 -209707 -394313 -152762 20169 -487 -102736 -2372 -173916 -332706 -173481 -100123
19293a00123c4067j09727N1955B6069h9002k26430C6733b42921B6109c7386b567
$$ -100123 -34067 -143794 -91839 26069 -89002 -315432 36733 -242921 26109 -37386 -2567
19281b75870i4245k3422c8935B29403a84161J1431b0757o2190A63220E962b37119
$$ -275870 -94245 -117667 -38935 229403 -184161 -172730 -20757 -82947 163220 5962 -237119
19269d5717k41406f6387m2919N274C28979O9406A06244a26253j39211g1041A58957
$$ -45717 -287123 -66387 -109306 -104032 328979 398385 106244 -126253 -265464 -71041 158957
19257d2594l2143p024E001O4405j0571B0445J03537a70520A80384n7273l5796
$$ -42594 -74737 -81761 5001 69406 58835 20445 123982 -170520 180384 123111 87315
19246H7315P7008c039j35290o0766k0563B75412j19931n4455j3309h284j40498
$$ 87315 164323 -3039 -138329 -199095 -219658 275412 155481 101026 87717 -8284 -148782
19235a48782d3585H4011k1266a88868Q418A26880P5655a2361j24157B017a52085
$$ -148782 -43585 84011 62745 -188868 -180450 126880 202535 -12361 -136518 2017 -152085
19223A10856K75061j74754J726a80223C03887b3384j57319r6605R1649k44286
$$ 110856 385917 211163 212889 -180223 303887 -23384 -180703 -277308 -185659 -429945
19213d29945B8681a18415C9692h7949B47628g7934J5487B45265e7670j56775I1890
$$ -429945 28681 -118415 39692 -87949 247628 -77934 -62447 245265 -57670 -214445 91890
19201a99092A18437c91437J47348D4542i2566C74784b21411M6436l7565D1069
$$ -199092 118437 -391437 -244089 44542 -92566 374784 -221411 -174975 -212540 41069
19190a96259H1062J31858G8852C8002O0107b89314c9799A45608b8214k1579C046
$$ -196259 81062 212920 78852 38002 98109 -289314 -39799 145608 -28214 -49793 3046
19178A23943a03842A55352a70707k5507l1608R3889K4622l4759l4635b0625j03177
$$ 123943 -103842 155352 -170707 -196214 -227822 -133933 -109311 -144070 -178705 -20625 -123802
19167a23802b6907E9722J90317A5396J01916J94007a52350A99935r6188d6195
$$ -123802 -26907 59722 250039 15396 117312 311319 -152350 199935 103747 -46195
19156c2033A49565J04804I8626m7174b2180C6732a40079a358j88100n6978o4239
$$ -32033 149565 254369 98626 51452 -22180 36732 -140079 -1358 -189458 -246436 -310675
19145c10675P7284C18128f1280I9040a615k30408K1465a179m40443a6139j16196
$$ -310675 -233391 318128 -61280 99040 -1615 -232023 -210558 -1179 -441622 -16139 -132335
19134a32335F386a09593J6789M5985C20309c136p0296K1306E8397a01836j937
$$ -132335 6386 -109593 -92804 -46819 320309 -3136 -73432 -52126 58397 -101836 -103773
19123a03773b8880j13752B4926a70997C01934f6485A0557L7500f5290G5575i2724
$$ -103773 -28880 -142632 24926 -170997 301934 -66485 10557 48057 -65290 75575 -92724
19111b13661B18867a79466B08517a51175D3225a44114b5158j7419H0577b29094
$$ -213661 218867 -179466 208517 -151175 43225 -144114 -25158 -42577 80577 -229094
19100b80149e3576l17410a37789B8632d8104A55357n8444q274d54171A430J5486
$$ -280149 -53576 -370986 -137789 28632 -48104 155357 96913 88639 -454171 1430 16916
19089A6916e7407C253L98724d4865j24801k01031A06228g2056j29049k95193a55301
$$ 16916 -57407 3253 401977 -44865 -169666 -370697 106228 -72056 -201105 -496298 -155301
19077B89595j1240D417P0862J27193c29428J27391o9690j4112g1036n0391L1095
$$ 289595 278355 4417 75279 202472 -329428 -202037 -271727 -285839 -71036 -121427 -90332
19066i0332B8934a70185r7499R4973P7998j22560L9433M2823B40808a76445B59956
$$ -90332 28934 -170185 -267684 -172711 -94713 -217273 -177840 -135017 240808 -176445 259956
19054a05032p4776A4681K4837L41337a97860B9329a66883j2330o5240A6298b99082
$$ -105032 -179808 14681 39518 380855 -197860 29329 -166883 -179213 -244453 16298 -299082
19042a7937j24703A08072a01106l29868D4756b61437d731m95185C22998b66750
$$ -17937 -142640 108072 -101106 -430974 44756 -261437 -4731 -499916 322998 -266750
19031a94390A71938h6485k72831E4222L00179p9526r9729j2252p8264K28788c70794
$$ -194390 171938 -86485 -359316 54222 354401 274875 175146 162894 84630 313418 -370794
19019C57324C6006J25660a86347g8915l4898K425j87315J14462b8978A27045a33742
$$ 357324 36006 161666 -186347 -78915 -113813 -111388 -298703 -184241 -28978 127045 -133742
19007G1374l914a81366B54b57747R4189a7338k08995B4656a29444B3161d91183
$$ 71374 67460 -181366 254 -257747 -163558 -17338 -226333 24656 -129444 23161 -491183
18995I7436b91046a41356M6111G8740P1708O0882b22974j0630A47041f8643k0243
$$ 97436 -291046 -141356 -95245 78740 150448 211330 -222974 -233604 147041 -68643 -88886
18984h8886l07240a6924q47E9557b72799B1169f0142p7433r9994n1628B39177
$$ -88886 -396126 -16924 -17771 59557 -272799 21169 -60142 -137575 -237569 -289197 239177
18972d28182f7744n1407E6222a38443H2325a89110e9635k11602J16461e859k97657
$$ -428182 -67744 -119151 56222 -138443 82325 -189110 -59635 -271237 -154776 -5859 -303516
18961c03516A51247F8863J72354i7575j0499M3067m7505m03501B16449A06119
$$ -303516 151247 68863 241217 -97575 -108074 -65007 -112512 -516013 216449 106119
18950a25065d5548k3946J0505G8422K1679a30217A7290a53069E714f3413C1551
$$ -125065 -45548 -69494 -58989 78422 100101 -130217 17290 -153069 5714 -63413 31551
18938a45840A48191J82176j13069a94589F0088J77654F1719b32508r3385A51673
$$ -145840 148191 330367 217298 -194589 60088 237742 61719 -232508 -325893 151673
18927H5838b59196A97691f0444I8726J9441a19348H369b8959j20573A04803h7195
$$ 85838 -259196 197691 -60444 98726 118167 -119348 8369 -28959 -149532 104803 -87195
18915C65982a17469a330l0384A74678B9905a25718d6304l7702c6692j14690A27335
$$ 365982 -117469 -1330 -31714 174678 29905 -125718 -46304 -84006 -36692 -151382 127335
18903C14b82924A07139c08298Q168A8962e1198a3205D5620R7940o2634J03366
$$ 314 -282924 107139 -308298 -300130 18962 -51198 -13205 45620 143560 80926 184292
18892A84292F3020e57194F322a94510m26754b35274r2793P9890L6312A35753a97353
$$ 184292 63020 -557194 6322 -194510 -621264 -235274 -328067 -248177 -211865 135753 -197353
18880a41267j42352B54276e2051m1307B08028a04895I4583q189e0947F8318a25833
$$ -141267 -283619 254276 -52051 -93358 208028 -104895 94583 86394 -50947 68318 -125833
18868c42301G16b07335Q3261G4600J99772e2455A9410M8840J70889j15989a24984
$$ -342301 716 -207335 -124074 74600 274372 -52455 19410 68250 239139 123150 -124984
18856b68044D05109k01874c24416g6793C5229a0779m5237H468J03778k1132i4858
$$ -268044 405109 203235 -324416 -76793 35229 -10779 -56016 8468 112246 91114 -94858
18844d3469j97495A48211J39768E7508a8236A13340b6323m2127k77834C2226a78420
$$ -43469 -240964 148211 287979 57508 -18236 113340 -26323 -68450 -346284 32226 -178420
18832A32345Q0205a93551b2223j06675h960A06900a58189N4616B7342L7012e172
$$ 132345 212550 -193551 -22223 -128898 -8960 106900 -158189 -103573 27342 64354 -5172
18820e6323o6D1097L0496a99730E7715M978J32476D7885M4169c08356D0920i5650
$$ -56323 -56389 41097 71593 -199730 57715 62693 195169 47885 92054 -308356 40920 -95650
18807a33887A20316K87850a64837B46331c91329C7398o800K87503d1899G6018
$$ -133887 120316 408166 -164837 246331 -391329 37398 30598 318101 -41899 76018
18796a90841e9431j51661A19225L7451H490d2391B39679a61323A89966d31979
$$ -190841 -59431 -211092 119225 156676 8490 -42391 239679 -161323 189966 -431979
18785a30767A18107c32682C97364b4904l71175J96345O7992F9182L9411a53635
$$ -130767 118107 -332682 397364 -24904 -396079 -199734 -131742 69182 108593 -153635
18774A22141b35185j99850G558b34957d0490j53079i5703A37433a23864A69316
$$ 122141 -235185 -435035 7558 -234957 -40490 -193569 -95703 137433 -123864 169316
18763A7478d5309E42363A05820a6336A61542f6860k67667E0365a65827E9321K43711
$$ 17478 -45309 542363 105820 -16336 161542 -66860 -334527 50365 -165827 59321 303032
18752C03032b82410B7622b41897B13008d55719a14677D19811j46385b76983d7097
$$ 303032 -282410 27622 -241897 213008 -455719 -114677 419811 273426 -276983 -47097
18741c46429q541J27857b3570C907g6263o7281B49866d764j86272e1952j4407
$$ -346429 -354970 -227113 -23570 3907 -76263 -143544 249866 -4764 -191036 -51952 -66359
18730f6359k6781d5209j69094r4410G9363a45639k81627a76661F1685c550A22787
$$ -66359 -93140 -45209 -214303 -308713 79363 -145639 -427266 -176661 61685 -3550 122787
18718A09329a66309j21782B7764c7997A45527B5622L12519a89185J1737e7354
$$ 109329 -166309 -288091 27764 -37997 145527 25622 338141 -189185 -177448 -57354
18707D1648c23932A26510a39328C0742a66090O4724B1887k623b548k61386J4907
$$ 41648 -323932 126510 -139328 30742 -166090 -101366 21887 19264 -2548 -263934 -249027
18696b49027J20970A79952p8221h8846k37451J21118j685P7717m13664a40830
$$ -249027 -128057 179952 101731 -88846 -326297 -205179 -206864 -129147 -542811 -140830
18685a25016A5508P1309a49056j70556J57765A03789b32510R6176Q202b1320j59099
$$ -125016 15508 86817 -149056 -319612 -161847 103789 -232510 -136334 -128132 -21320 -180419
18674a80419P1164k7169o7173D117h5012j17626H9766a11194n4219c6739j61989
$$ -180419 -109255 -136424 -203597 4117 -85012 -202638 89766 -111194 -165413 -36739 -198728
18663a98728c8658J2255j27355d7483j58144b2815O668n9137k3381K3547d991
$$ -198728 -38658 -26403 -153758 -47483 -205627 -22815 -16147 -75284 -98665 -75118 -4991
18651a18029a8354A47435a1074I9392b64820G8720a40603j479J2506b6634r6851
$$ -118029 -18354 147435 -11074 99392 -264820 78720 -140603 -142082 -129576 -26634 -123485
18640a23485o8760e9354A5735a7026A5144c55579p2136a9566r1900r2572f6461
$$ -123485 -192245 -59354 15735 -17026 15144 -355579 -427715 -19566 -111466 -204038 -66461
18628a42665o6831k0090e3859l9071a5506d734B08414i7632j81727j1051J38155
$$ -142665 -209496 -229586 -53859 -92930 -15506 -4734 208414 -97632 -279359 -290410 -152255
18617a52255A67527R7374H3203R8649F2451a80709N9991E4739a33636B09092c30424
$$ -152255 167527 264901 83203 181852 62451 -180709 -120718 54739 -133636 209092 -330424
18605g6649F718b24126A21526E4767P5926b59132a18043B4678a65161k70288A45988
$$ -76649 6718 -224126 121526 54767 130693 -259132 -118043 24678 -165161 -435449 145988
18593c19235B38275d09234C4878K5461a464l1850C45602a59164p5912J09101D7652
$$ -319235 238275 -409234 34878 60339 -1464 -33314 345602 -159164 -235076 -125975 47652
18581a52385B6975b48457j64441A20919n6960L7908a52500o1405C23635r2303
$$ -152385 26975 -248457 -412898 120919 63959 101867 -152500 -213905 323635 231332
18571B31332D0480e0858E5518Q7229b6514A9931J37754a95710B01776b75403a33350
$$ 231332 40480 -50858 55518 142747 -26514 19931 157685 -195710 201776 -275403 -133350
18559F9295a6450A15363i7160J8932G1431b30693B26866c85151F4947q386f10763
$$ 69295 -16450 115363 -97160 -78228 71431 -230693 226866 -385151 64947 56561 -610763
18547f3671p6386e5649Q640p3018d2918m3778E4624R6264i3676M6300k95566a60970
$$ -63671 -140057 -55649 -47009 -120027 -42918 -86696 54624 150888 -93676 -47376 -342942 -160970
18534A81485C7789c32597P529r2701a41051C2106g2422D5447c36901a60310F5117
$$ 181485 37789 -332597 -325068 -417769 -141051 32106 -72422 45447 -336901 -160310 65117
18522g1841A95331a24355q2514A33253J21989L796A2652K89601D1940L8670J47165
$$ -71841 195331 -124355 -206869 133253 255242 259038 12652 302253 41940 80610 227775
18511B27775e667m9406j37038o1026a5259C0939L85b6518m38790N5553J91027
$$ 227775 -5667 -55073 -192111 -253137 -15259 30939 31324 -26518 -465308 -409755 -218728
18500b18728A44751a68551g6027m3285M9607j406k3126B72043A3265a03839B05392
$$ -218728 144751 -168551 -76027 -119312 -69705 -71111 -94237 272043 13265 -103839 205392
18488d39823c1840C4078b24289A60532b34195b2518A03180g3339B48164n4740
$$ -439823 -31840 34078 -224289 160532 -234195 -22518 103180 -73339 248164 193424
18478A93424f3734k22812d5410B2047a14219A99036a23070n6591O2315G4393b15711
$$ 193424 -63734 -286546 -45410 22047 -114219 199036 -123070 -179661 -117346 74393 -215711
18466a64617a0722A62635a42630j94A11001J04215D0562A2845h8303J720B1669
$$ -164617 -10722 162635 -142630 -142824 111001 215216 40562 12845 -88303 -86583 21669
18454D19897A08184j1666J58590i0525F8837a7488p766q9135J1202A03526b51600
$$ 419897 108184 96518 255108 -90525 68837 -17488 -25254 -114389 -103187 103526 -251600
18442A54531N6279c2003k18138Q272E6448J82297b59870I0052K1611a48823A0075
$$ 154531 210810 -32003 -250141 -241869 56448 238745 -259870 90052 111663 -148823 10075
18430a41575N0246B31510a35966j36050a7076I299b33221D02717a64103A94188
$$ -141575 -91329 231510 -135966 -272016 -17076 9299 -233221 402717 -164103 194188
18419C41762b19263a03218d7785j08819o6996G4576B3146b49047a0391E8659K46289
$$ 341762 -219263 -103218 -47785 -156604 -223600 74576 23146 -249047 -10391 58659 304948
18408C04948B3705h2495n4180Q999A81092f1896B08031a91236M5949O4826A09917
$$ 304948 23705 -82495 -136675 -127676 181092 -61896 208031 -191236 -145287 -80461 109917
18396a14692J6895d3287j07963I4659b97496B4640K4963A8263a12582A88581a04272
$$ -114692 -97797 -43287 -151250 94659 -297496 24640 49603 18263 -112582 188581 -104272
18384D3203N435d8954H0654J4972e44197C862b2571j30693j47445E8168M9155
$$ 43203 48638 -48954 80654 95626 -544197 3862 -22571 -153264 -300709 58168 107323
18373A07323i2044B77372c21655G8679a26850C5312J20624J61329M010A33142
$$ 107323 -92044 277372 -321655 78679 -126850 35312 155936 317265 321275 133142
18362E4181J3275B0740R3621b324o3613j13551K8626H7672b43470A12009b20869
$$ 54181 67456 20740 114361 -2324 -65937 -179488 -150862 87672 -243470 112009 -220869
18350b33556A19018b86507a39833j01764O7675r384E4469b30055D91a23060j51080
$$ -233556 119018 -286507 -139833 -241597 -173922 -183306 54469 -230055 491 -123060 -274140
18339b74140A93001b68701n5094A87468d9691F8701K187h8716p7541k2191Q8568
$$ -274140 193001 -268701 -323795 187468 -49691 68701 70888 -88716 -166257 -188448 -99880
18328i9880A48543a44057K4850A6732K16212G7660a0096p5099c922k83304B46200
$$ -99880 148543 -144057 -119207 16732 232944 77660 -10096 -85195 -3922 -287226 246200
18316A87188a11140C9167j290c06561B36995h9388o8574P2480k6830m9340d2819
$$ 187188 -111140 39167 37877 -306561 236995 -89388 -157962 -85482 -112312 -161652 -42819
18304H7395M330J08120I5395c14326a39108D9278J19119a73270p8237B65564q9386
$$ 87395 91725 199845 95395 -314326 -139108 49278 168397 -173270 -251507 265564 176178
18293A76178E9882i4329L5110A03090b93607d8317k51989a36758A1743a3520l09524
$$ 176178 59882 -94329 -59219 103090 -293607 -48317 -300306 -136758 11743 -13520 -323044
18282c23044I0396Q1035a03320c7330m0937A17888H43c65514H8638L0336K08997
$$ -323044 90396 171431 -103320 -37330 -78267 117888 843 -365514 88638 118974 327971
18271C27971a14177j66531A00411a52955l2957B6070b3246A78297B3308a05192
$$ 327971 -114177 -280708 100411 -152955 -185912 26070 -23246 178297 23308 -105192
18260d2689q2053n0971g9197A53776M7103O5324o3367l2213a04031A82067c13930
$$ -42689 -124742 -175713 -79197 153776 200879 266203 202836 170623 -104031 182067 -313930
18248a08051r7417B09336b61698o2316b4744N962p7893J9019h982A26620j061
$$ -108051 -205468 209336 -261698 -324014 -24744 -18782 -96675 -77656 -8982 126620 125559
18237A25559c9058k55421C01321a59702E3072J45211C4219b10915G7629c35405
$$ 125559 -39058 -294479 301321 -159702 53072 198283 34219 -210915 77629 -335405
18226A07869c22734j10637A27351i2151j25868B07201d5464j11672J8810j22885
$$ 107869 -322734 -433371 127351 -92151 -218019 207201 -45464 -157136 -138326 -261211
18216b61211h1448A57834a17213D9734a20980A11324J95127a3524o9405B38767
$$ -261211 -81448 157834 -117213 49734 -120980 111324 306451 -13524 -82929 238767
18205g0130k05674A77713a23015j14983g2810a9712n6098b5157k4079k05782e7470
$$ -70130 -275804 177713 -123015 -237998 -72810 -19712 -75810 -25157 -49236 -255018 -57470
18193E5016a63477p7855B82846a48303j61758r8463I730a23303l03917b4493B21203
$$ 55016 -163477 -241332 282846 -148303 -310061 -408524 9730 -123303 -427220 -24493 221203
18181a56588A44921a53747A87735g6057c0918r482B81801h12l99194e2482C55772
$$ -156588 144921 -153747 187735 -76057 -30918 -40400 281801 -812 -400006 -52482 355772
18169i1676j84625B23319D4547d12083A83450H4547a78591L2195k9958p7375k9764
$$ -91676 -276301 223319 44547 -412083 183450 84547 -178591 -146396 -176354 -253729 -283493
18158b83493A1455K57928i0001B37259i0052j695p0631j13051B04616l5223a39968
$$ -283493 11455 269383 -90001 237259 -90052 -91747 -162378 -275429 204616 169393 -139968
18146A24790l919c88370b5675B68192d0913o6745A99957k543b7384n5400C96442
$$ 124790 120871 -388370 -25675 268192 -40913 -107658 199957 197414 -27384 -82784 396442
18134C09731r8097a2235j2582l53317a41272Q076A35021K3189h30j31971A10379
$$ 309731 211634 -12235 -24817 -378134 -141272 -133196 135021 158210 -830 -132801 110379
18122B84745a17730A88238l2115c9284m3948a896j33482K5757K8868B01929a08745
$$ 284745 -117730 188238 156123 -39284 -83232 -1896 -135378 -109621 -80753 201929 -108745
18110A06332c47633b2130j70013B19709d3165K964j85505A86488C7436b21682
$$ 106332 -347633 -22130 -192143 219709 -43165 -40201 -225706 186488 37436 -221682
18099d8084j68744R123B00042b48139A81191b28537M1781A00447f4137m1665E57154
$$ -48084 -216828 -207705 200042 -248139 181191 -228537 -186756 100447 -64137 -105802 557154
18087A30506M9871f5135b113A85843E2769f330k55110D5641i4419q2899l0600
$$ 130506 180377 -65135 -2113 185843 52769 -6330 -261440 45641 -94419 -177318 -207918
18076b07918H0316a79843n3082a0606A14985J2811b12823A81174d11860D16803
$$ -207918 80316 -179843 -232925 -10606 114985 127796 -212823 181174 -411860 416803
18065g2582C81960a55408f6217b9344H5865P7572h5235k9872C8269j0524J41762
$$ -72582 381960 -155408 -66217 -29344 85865 163437 -85235 -115107 38269 27745 169507
18054A69507i6185A11575b38291a18977G7810J5879i5595J6625B73330b09890
$$ 169507 -96185 111575 -238291 -118977 77810 93689 -95595 -78970 273330 -209890
18043a21711G2328e7355A87648Q0512b77711i3096j92208i9549o4571r4195J09289
$$ -121711 72328 -57355 187648 268160 -277711 -93096 -285304 -99549 -164120 -258315 -149026
18032a49026G7377K72069A36213b60701A36084b5540H4364j688b54636A23110
$$ -149026 77377 349446 136213 -260701 136084 -25540 84364 82676 -254636 123110
18021C977O8437J26555a96147L8592A89035q1607a75684f1399k01182L78l6980
$$ 3977 72414 198969 -196147 -157555 189035 107428 -175684 -61399 -262581 -262203 -299183
18010b99183f0423j0565l1597I0839q320a93027j0861H8662a01421c5388A27389
$$ -299183 -60423 -70988 -102585 90839 82519 -193027 -203888 88662 -101421 -35388 127389
17998a98897k3259J4828h2616k18292A17b81012J36106H4695b5911j9649j83990
$$ -198897 -222156 -207328 -82616 -300908 117 -281012 -144906 84695 -25911 -45560 -229550
17987b29550c6481P808A26673h6886d1137j15483D1189R8550i7635D30701A03660
$$ -229550 -36481 -28673 126673 -86886 -41137 -156620 41189 139739 -97635 430701 103660
17975h5945F0981c9465k881k02039B81338H9657a20237A83657J08231a63919C8090
$$ -85945 60981 -39465 -42346 -244385 281338 89657 -120237 183657 291888 -163919 38090
17963b86390M3032j18165H0719a15113m1864A74067C1651a27123B24184b07206
$$ -286390 -243358 -361523 80719 -115113 -156977 174067 31651 -127123 224184 -207206
17952C7263a08776E9348P340J55064a34970I5327l4202J58268a0166m99553a35529
$$ 37263 -108776 59348 66688 221752 -134970 95327 61125 219393 -10166 -509719 -135529
17940A39680E51J54210J9323G7049a16337A98228g0200A64543h6470B49211i7381
$$ 139680 551 154761 174084 77049 -116337 198228 -70200 164543 -86470 249211 -97381
17928C22711g8224B95206J15127d7422A31651c723j96409g0215B87387i9714q3653
$$ 322711 -78224 295206 410333 -47422 131651 -3723 -200132 -70215 287387 -99714 -183367
17917a83367F5625b0347d928k1392q4991A80886E0339f6051L0615j3479A34159
$$ -183367 65625 -20347 -4928 -26320 -111311 180886 50339 -66051 -35436 -48915 134159
17905a75885J9526b7686A22989B6171J59947o0353E6638c0560k1743r3291j8626
$$ -175885 -156359 -27686 122989 26171 186118 125765 56638 -30560 -52303 -145594 -164220
17894a64220c2277k45616A76010c9531j58317a7873j71397a9168p854A91688o7561
$$ -164220 -32277 -277893 176010 -39531 -197848 -17873 -189270 -19168 -27022 191688 124127
17883A24127e6503J6146A12507g3528A13032b06547B60685e1756N423A66490a33763
$$ 124127 -56503 -40357 112507 -73528 113032 -206547 260685 -51756 -46333 166490 -133763
17871A79751a50728F1977P8216b9168A08694J31058q6879a37893j49276O7128
$$ 179751 -150728 61977 140193 -29168 108694 239752 152873 -137893 -287169 -220041
17861b20041C3197a55826m0269A1646g2288H7229A388O9290A9115g203l1149k45998
$$ -220041 33197 -155826 -196095 11646 -72288 87229 1388 70678 19115 -7203 -38352 -284350
17849b84350A3859J22729K9294q992a54980p5983g3154I9034J6502J43648d53249
$$ -284350 13859 136588 165882 156890 -154980 -230963 -73154 99034 115536 259184 -453249
17837A18088a61655B0006a69125q1665R6864b7100D2245a45070f9890b7389B59469
$$ 118088 -161655 20006 -169125 -250790 -153926 -27100 42245 -145070 -69890 -27389 259469
17825f636k9322A92582m2241c4858k580C4827J16806D6664L08a52248j5313P8559
$$ -6636 -35958 192582 150341 -34858 -37438 34827 151633 46664 46972 -152248 -167561 -89002
17813h9002l0995B35782e1032o1782A90241C69b69327A47567E1089c055A6537
$$ -89002 -119997 235782 -51032 -112814 190241 369 -269327 147567 51089 -3055 16537
17801B40911a29755a3143D3081r29a2064A00944j5018b6147P8B0475Q6630N9408
$$ 240911 -129755 -13143 43081 42152 -12064 100944 85926 -26147 -26069 20475 107105 166513
17789A66513G7641a39150H0388J18841A3395g5654D42507a00641A39785K18337
$$ 166513 77641 -139150 80388 199229 13395 -75654 442507 -100641 139785 358122
17779C58122g0664A47696e9389G5606P2813J2768a48279k2141J0099F0764J6599
$$ 358122 -70664 147696 -59389 75606 148419 161187 -148279 -170420 -160321 60764 77363
17768G7363a07380C39625A18837h8143A91004a14189j645a0982m3660m037H5049
$$ 77363 -107380 339625 118837 -88143 191004 -114189 -115834 -10982 -54642 -58679 85049
17756B09612q7738J32082a78555C86000I5786a24712k02216A64048b38952C20938
$$ 209612 121874 253956 -178555 386000 95786 -124712 -326928 164048 -238952 320938
17745a13486B46253A2657K59303D123h5679F7249L785A0494e0200A46604G764
$$ -113486 246253 12657 271960 4123 -85679 67249 71034 10494 -50200 146604 7764
17733B28474j12424e2571J2153k9889o6769C24631p1582i0152D29300b07044p1822
$$ 228474 116050 -52571 -40418 -70307 -137076 324631 253049 -90152 429300 -207044 -278866
17722b78866L0517A9482a35024L2820o2741C89454i7421a9077k30879i5837G7623
$$ -278866 -248349 19482 -135024 -102204 -164945 389454 -97421 -19077 -249956 -95837 77623
17710a68202j2757Q450J5513f2742b0865r6796B05751E1169N5877K4936D3526
$$ -168202 -180959 -172509 -156996 -62742 -20865 -117661 205751 51169 107046 131982 43526
17698a9577j3103A95765a58849B14130q6446J1689f9444C7734K9613a24483G6779
$$ -19577 -32680 195765 -158849 214130 127684 139373 -69444 37734 67347 -124483 76779
17686a77578j3578B15096n7048a47647C3456J92168r7631a40929F7584a78077
$$ -177578 -191156 215096 158048 -147647 33456 225624 127993 -140929 67584 -178077
17675B08725B3094c8171B07850d4336B56296a56678c1235m9553F0887c7911A6489
$$ 208725 23094 -38171 207850 -44336 256296 -156678 -31235 -80788 60887 -37911 16489
17663A55685c8561k63865a27744A04285a42535A24738l1800J61773b4819j48834
$$ 155685 -38561 -302426 -127744 104285 -142535 124738 92938 254711 -24819 -173653
17653a73653B1411c02001a32918B91789E7413h32A31843R4119k1982p8424j3704
$$ -173653 21411 -302001 -132918 291789 57413 -832 131843 225962 203980 125556 111852
17642A11852J20217b64724N1903R1969j86391B96150j45194E6316B5460K8727
$$ 111852 232069 -264724 -212821 -120852 -307243 296150 150956 56316 25460 54187
17632E4187c753k47730B70234k9784p3163i9967B18305K6177m4172q1950L2830
$$ 54187 -3753 -251483 270234 240450 167287 -99967 218305 244482 200310 118360 151190
17621A51190g6552B1953a98267A06683N9238a62874B94437B3220j0092K52637
$$ 151190 -76552 21953 -198267 106683 165921 -162874 294437 23220 13128 265765
17611B65765m5485B8141J027P9878K1944K70461a41903g0286A69120C7327f2653
$$ 265765 220280 28141 29168 109046 130990 401451 -141903 -70286 169120 37327 -62653
17599A5212K7290J8480J28948j7254b55246J16385B3577J9613M408Q9186g8544
$$ 15212 42502 60982 189930 172676 -255246 -138861 23577 43190 47598 136784 -78544
17587f9875D3454c0113A81337a57949A50568e6437K6499I6955R9310A6428P4193
$$ -69875 43454 -30113 181337 -157949 150568 -56437 -29938 96955 196265 16428 90621
17576I0621J57036h120G3653E532K88366G834e6546J8540j10240A47732a42337
$$ 90621 247657 -8120 73653 5532 293898 7834 -56546 -38006 -148246 147732 -142337
17564B67343N767K3998E5839K2834A8723L0891a81930B9480M6453K73673A00042
$$ 267343 273110 297108 55839 78673 18723 49614 -181930 29480 75933 349606 100042
17552A64608a79797A46751b4509B21089b4084j47787q4402A95808a34121F4298
$$ 164608 -179797 146751 -24509 221089 -24084 -171871 -256273 195808 -134121 64298
17541B5614L4970K99062H2340a8358B7318o37J36942a30619e219A63876a46094
$$ 25614 60584 359646 82340 -18358 27318 26681 163623 -130619 -5219 163876 -146094
17529H6811J18926A6004g0504A44676a07949A10224a04611L0086A07770K01430
$$ 86811 205737 16004 -70504 144676 -107949 110224 -104611 -74525 107770 309200
17519C09200j12025h3739A85286n7765h1494m7018D43426A86973j1141B8828c0368
$$ 309200 197175 -83739 185286 127521 -81494 -128512 443426 186973 175832 28828 -30368
17507B72955a33306k90143C55859q6053k0046E9415b88227A50797F6686K54248
$$ 272955 -133306 -423449 355859 269806 249760 59415 -288227 150797 66686 320934
17497C20934b16553B32426G4330K01872i0735I1708P3251a2059E7947K5825b43006
$$ 320934 -216553 232426 74330 276202 -90735 91708 164959 -12059 57947 83772 -243006
17485E6205a84695J2036j26368h6262C20874C0650L0264b20051D677Q9674m3231
$$ 56205 -184695 -172659 -299027 -86262 320874 30650 60914 -220051 4677 94351 51120
17474E1120N34679k82263H2372M5649a40374D97451A35677K3271E4052a39209
$$ 51120 585799 303536 82372 128021 -140374 497451 135677 158948 54052 -139209
17463a64814C27030p0139c02778a04202B12143q3439R110b14719H0171l4486L75636
$$ -164814 327030 256891 -302778 -104202 212143 128704 137814 -214719 80171 45685 421321
17452D21321b4362D91560a7476B22713a01810B47489J42320D0866j5384J18614
$$ 421321 -24362 491560 -17476 222713 -101810 247489 389809 40866 25482 144096
17442A44096K57349j72686l599n29P039J77965C7517N38920B37929d4336C45391
$$ 144096 401445 228759 225160 224631 231670 409635 37517 576437 237929 -44336 345391
17430f6044C48179r9039c619A69414D388L15143n9199J1457r1315p6378J42159
$$ -66044 348179 249140 -3619 169414 4388 319531 260332 271789 180474 104096 246255
17419B46255M49008A10164P36167C36600N0904q0906m6435j7340g160A13051N4835
$$ 246255 695263 110164 846331 336600 387504 306598 260163 242823 -7160 113051 167886
17408A67886J72285L5653a48049D06356a17272C55771j26815M4672l2791E2914
$$ 167886 340171 375824 -148049 406356 -117272 355771 228956 273628 240837 52914
17397B40752H6206C5754c4294A94036k0496a87662P7100A00193l2748a18164D04387
$$ 240752 86206 35754 -34294 194036 173540 -187662 -110562 100193 67445 -118164 404387
17385A20182f2062B0352g354J193E651a53474D525K08415m7501C3204L90812G5199
$$ 120182 -62062 20352 -7354 -6161 5651 -153474 4525 212940 165439 33204 424016 75199
17372A26655J63378d3806A20617J41889j21858a65419A35111B6870L1475k1676
$$ 126655 290033 -43806 120617 262506 140648 -165419 135111 26870 58345 36669
17362C6669N2133a35791A32987k9771a52181A87154J26434Q0287A24069K33784
$$ 36669 88802 -135791 132987 103216 -152181 187154 313588 393875 124069 357853
17352C57853F4366c9082o9306G5560l3737J66114c2915B08642I0893j8546C414
$$ 357853 64366 -39082 -108388 75560 41823 207937 -32915 208642 90893 72347 3414
17340A49066C1664A604c3995B30230M9775d9153B18252K82797B9245C054r72K41605
$$ 149066 31664 1604 -33995 230230 280005 -49153 218252 501049 29245 3054 2082 243687
17328B43687E8967O2079b5273O562B99231j0777j42026J36666A41399K55460D2079
$$ 243687 58967 121046 -25273 -18711 299231 288454 146428 283094 141399 396859 42079
17316A35405E4700L68823j75521j9125J2283a61311B80191P1405K19274j61281
$$ 135405 54700 423523 248002 228877 241160 -161311 280191 351596 570870 409589
17306D09589A33387J53095J87186k20001L67123j34458j94465e7864J9878C44387
$$ 409589 133387 286482 473668 253667 620790 486332 291867 -57864 -37986 344387
17295B56328b3388B55648C9615J69762J21755k750H3147J17412J4060K2384L4611
$$ 256328 -23388 255648 39615 209377 331132 328382 83147 200559 214619 237003 271614
17284B71614A0688M49330A98338J20395j17553L61931b90635B29456c3577A99913
$$ 271614 10688 460018 198338 318733 201180 563111 -290635 229456 -33577 199913
17273C09738C1282K60406I2422l0439g9275B49889H9461b13818N7269C40417a5707
$$ 309738 31282 291688 92422 61983 -79275 249889 89461 -213818 -156549 340417 -15707
17261B91501A05022k1882L86200G2859b66979B88339j17209N41898a25234A17078
$$ 291501 105022 83140 469340 72859 -266979 288339 171130 713028 -125234 117078
17250A27179J55110A0181M05218A07503J79579b852A24801L19981A51058n8408
$$ 127179 282289 10181 415399 107503 287082 -2852 124801 444782 151058 92650
17240I2650J20261K1238K69374k48027p6566l1534K91735j8614P7347G7865b60490
$$ 92650 212911 234149 503523 255496 178930 147396 439131 420517 497864 77865 -260490
17228G1998K60126p703J14090l1868E1388j9839J74825C5599L2521J36605A02360
$$ 71998 332124 324421 438511 406643 51388 31549 206374 35599 68120 204725 102360
17216B15454j04008K122K59748j07784I1548J59301J3285j05491K84726l150A86119
$$ 215454 111446 113568 373316 265532 91548 250849 264134 158643 443369 440219 186119
17204A06543K42949a0705F0607j4351J50088K31700K9806J05763k50844m3143
$$ 106543 349492 -10705 60607 46256 196344 428044 457850 563613 312769 269626
17194B69626K9567J4399A00164J56573L3001q2217j6556b5624D63843A80375A5719
$$ 269626 299193 313592 100164 256737 289738 207521 190965 -25624 463843 180375 15719
17182C38328G3311J73660p5986L4432O1724q4894R8882J00674p7905R3014j28586
$$ 338328 73311 246971 170985 205417 267141 182247 281129 381803 303898 396912 268326
17171B68326L26J65131c81344D10739a65583D41729j77263J30333p3616j00362
$$ 268326 268652 433783 -381344 410739 -165583 441729 264466 394799 321183 220821
17161B20821E7265J87004O5130J25331H8291L35796j16414J79375r7624p0529
$$ 220821 57265 244269 309399 434730 88291 424087 307673 487048 389424 318895
17151C18895j22962K06038q0389o6947M7083m0386L54262B02169M1491M64358
$$ 318895 195933 401971 321582 254635 301718 261332 615594 202169 243660 708018
17141G08018A06851L24135A51852N33927j95011L7813j05063A65026L06176o6518
$$ 708018 106851 430986 151852 685779 490768 528581 423518 165026 471202 404684
17131D04684J52395j87600r7593j20634c1804E40410j46895k6143J89880A89511
$$ 404684 557079 369479 271886 151252 -31804 540410 393515 367372 557252 189511
17120B87556b6946D99450K38701A84598K07713j91185J80046o1504N869L16786
$$ 287556 -26946 499450 738151 184598 392311 201126 381172 319668 325537 642323
17110F42323C14993K45895M42k65119n2758K62198j07777R1563k42587R1143L15936
$$ 642323 314993 560888 561330 296211 243453 505651 397874 489437 246850 337993 653929
17099F53929j18080j94321J41717P9271B71367M8221J78197L50331A33204L14573
$$ 653929 535849 341528 483245 562516 271367 319588 497785 848116 133204 447777
17089D47777o8396A09743K36841n7493K13807J74242k81110J85383l6873k62387
$$ 447777 379381 109743 346584 289091 502898 677140 396030 581413 544540 282153
17079B82153K5239j0291L43834p2484j36789M30554l53946l7378M07178k08172
$$ 282153 307392 297101 640935 568451 431662 862216 508270 470892 878070 669898
17069F69898r3575j83956K67216j38132j62205J54073M8234k23196J87162k3818
$$ 669898 576323 392367 659583 521451 359246 513319 561553 338357 525519 501701
17059E01701J98623k02927j13689J31517J31322k2301K73933l08104j09991J78408
$$ 501701 700324 497397 383708 515225 646547 624246 898179 590075 480084 658492
17049F58492j10533j91516J25799L2536O2265n8733K32095k08631Q1726l643j79568
$$ 658492 547959 356443 482242 514778 577043 518310 750405 541774 623500 619857 440289
17038D40289N26190m50501r4922o3846M38033k80221M61081m49259m4053D1496
$$ 440289 966479 515978 421056 357210 795243 515022 976103 526844 482791 41496
17027F28894J09259K10456k29537k24344O8633N6878r2630K738K91401j82837
$$ 628894 738153 948609 719072 494728 563361 620239 527609 530347 821748 638911
17017F38911j20347L14819m0992l59488L14342K34471l51045A47416K54694K66573
$$ 638911 518564 833383 792391 432903 747245 981716 630671 147416 402110 668683
17007F68683j43218K79034J21289l45995L47700D28575N63444k23415j5437m3629
$$ 668683 525465 804499 925788 579793 927493 428575 992019 768604 753167 709538
16997G09538P3378o4178P6793l8177J73977k57278O1268J8359l8340n6316J91714
$$ 709538 782916 718738 795531 757354 931331 674053 735321 753680 715340 659024 850738
16986H50738M1409l02374P2689J38201K31036l9024k50777J97879o8152L54165
$$ 850738 892147 589773 662462 800663 1031699 992675 741898 939777 871625 1225790
16976A225790m59322J27319J1296n9247K48855l26083p437K96831J35534k20442
$$ 1225790 766468 893787 905083 845836 1094691 768608 761171 1058002 1193536 973094
16966I73094k84286O11788m15489k2355K8522L03441j61328N5869N0148K46103
$$ 973094 688808 1300596 885107 862752 891274 1194715 1033387 1089256 1139404 1385507
16956A385507m30962J06024q955N9563l6537K21254o5834m1735J3729k18699J47830
$$ 1385507 954545 1060569 1051614 1111177 1074640 1295894 1230060 1188325 1202054 983355 1131185
16945A131185L25672k74053K81523l29474k49775K74476j2186K21272k73791P3976
$$ 1131185 1456857 1182804 1464327 1134853 885078 1159554 1147368 1368640 1094849 1168825
16935A168825n6362K98635P9350m31502P4931K34160l8147J92960j24310L2961
$$ 1168825 1112463 1411098 1490448 1058946 1133877 1368037 1329890 1522850 1398540 1431501
16925A431501o6209l65949M42508J42746j51491K1412k9946q9407J78809J50295
$$ 1431501 1365292 999343 1441851 1584597 1433106 1454518 1424572 1335165 1513974 1664269
16915A664269p3425r0266L48157k9895m20649K90012Q4897j81923L12811k73501
$$ 1664269 1590844 1500578 1848735 1818840 1398191 1688203 1773100 1591177 1903988 1630487
16905A630487R9395L44632o37895J95771J3292K03254j26300K46515k94567K46105
$$ 1630487 1729882 2074514 1436619 1632390 1645682 1848936 1722636 1969151 1674584 1920689
16895A920689L642P0618r715K57315j88295O6463k10805N42097l56815k06553
$$ 1920689 1924331 1994949 1985234 2242549 2054254 2120717 1909912 2452009 2095194 1888641
16885A888641J26462L71841J48460n58245n5260K12760J62212O5604K30740M4877
$$ 1888641 2015103 2386944 2535404 1977159 1921899 2134659 2296871 2362475 2593215 2638092
16875B638092m50361J89783K54230J67123M080l49121M13767j81693R8070j42080
$$ 2638092 2187731 2377514 2631744 2798867 2802947 2453826 2867593 2685900 2783970 2641890
16865B641890R4763n86K07991k53270K36963J02419K00802m24594K43112J21498
$$ 2641890 2736653 2736067 2944058 2690788 2927751 3030170 3230972 2806378 3049490 3170988
16855C170988L6744P3804Q65J40597K1484j0251q195j2796l0629M7812L20322
$$ 3170988 3207732 3281536 3282401 3422998 3444482 3434231 3426036 3413240 3382611 3430423 3750745
16844C750745L75196j41386J25872l33182Q6025K08001J64161l21171N54099j18562
$$ 3750745 4125941 3984555 4110427 3777245 3863270 4071271 4235432 3914261 4468360 4349798
16834D349798K40080j38189N5254K03241K9449K04426Q2234j75851M65557O859
$$ 4349798 4589878 4451689 4506943 4710184 4739633 4944059 5026293 4850442 5315999 5322858
16824E322858q0722J52951L0756K94116k64672L27437l4103j13058O28126j61724
$$ 5322858 5242136 5395087 5425843 5719959 5455287 5782724 5748621 5635563 6263689 6101965
16814F101965N90842k36158J79621J74557K16905L15141p5264J13499L5984K71131
$$ 6101965 6692807 6456649 6636270 6810827 7027732 7342873 7267609 7381108 7417092 7688223
16804G688223m3546K04705L89753J43163J90003M64019n3711O5305n4102L18620
$$ 7688223 7644677 7849382 8239135 8382298 8572301 9036320 8982609 9047914 8993812 9312432
16794I312432N34874K97203M59711K35233J28357j97690R51633R2314M61738L52669
$$ 9312432 9847306 10144509 10604220 10839453 10967810 10770120 11721753 11814067 12275805 12628474
16784A2628474J11153N38233P5540L49794O42439K48058J46717R61744N14628
$$ 12628474 12739627 13277860 13353400 13703194 14345633 14593691 14740408 15702152 16216780
16775A6216780L59535L74936R34875J78278R17669M88547M67180P22997J083746
$$ 16216780 16576315 16951251 17886126 18064404 18982073 19470620 19937800 20660797 21744543
16766B1744543N05163Q31909R85024O91007Q91753J144219J297994M27262J697782
$$ 21744543 22249706 23081615 24066639 24757646 25649399 26793618 28091612 28518874 30216656
16757C0216656R55454J677458J155201J598461J463563J908876J458443J800815
$$ 30216656 31172110 32849568 34004769 35603230 37066793 38975669 40434112 42234927
16749D2234927K410683J976211K128299K473171K622815K921896K623711L280973
$$ 42234927 44645610 46621821 48750120 51223291 53846106 56768002 59391713 62672686
16741F2672686L487663L764712L456026M127910M223077N021024N004217M981319
$$ 62672686 66160349 69925061 73381087 77508997 81732074 86753098 91757315 96738634
16733I6738634N331239N844222O101521O152417O553870O953640O497841P122553
$$ 96738634 102069873 107914095 114015616 120168033 126721903 133675543 140173384 147295937
16725A47295937O457290P112212O453328O172105N262708M577869L702830L143905
$$ 147295937 153753227 160865439 167318767 173490872 178753580 183331449 187034279 190178184
16717A90178184J742817O65689p73367j380074k776612l555222m622182m970073
$$ 190178184 191921001 192586690 191813323 190433249 187656637 184101415 179479233 174509160
16709A74509160o347287o320789o799314o756919p027721o932875o554439o714713
$$ 174509160 168161873 161841084 155041770 148284851 141257130 134324255 127769816 121055103
16701A21055103o975915o096680n853750n564205n279765m914330n069433m128294
$$ 121055103 114079188 107982508 102128758 96564553 91284788 86370458 81301025 77172731
16693G7172731m198161m100541l661942l427818l112819k775325l010004k413002
$$ 77172731 72974570 68874029 65212087 61784269 58671450 55896125 52886121 50473119
16685E0473119k649417k152724k351758k185269j659427j806068j641361j507967
$$ 50473119 47823702 45670978 43319220 41133951 39474524 37668456 36027095 34519128
16677C4519128j723295j217089j304318j012995j136469j155681j558360o55143
$$ 34519128 32795833 31578744 30274426 29261431 28124962 26969281 25410921 24755778
16669B4755778j062313q81854o08654j115326o03242o62558l94893r16949p57901
$$ 24755778 23693465 22811611 22202957 21087631 20484389 19821831 19426938 18509989 17752088
16660A7752088n86955n30188l77032j53980r30715m62999n02930j33870o99435
$$ 17752088 17165133 16634945 16257913 16103933 15173218 14710219 14207289 14073419 13373984
16651A3373984m08833r0208q12111k34146q6881l32131m16914m38897m3352l97269
$$ 13373984 12965151 12874943 12062832 11828686 11741805 11409674 10992760 10553863 10510511 10113242
16641A0113242n2467l32459l15513r4037k99055j68892m65390k37007j68400P8411
$$ 10113242 10060775 9728316 9412803 9318766 9019711 8850819 8385429 8148422 7980022 8058433
16631H058433j92369l50116l11223n7430r3948j1816n10834M2540k44888N1416
$$ 8058433 7866064 7515948 7204725 7147295 7053347 7041531 6530697 6573237 6328349 6379765
16621F379765k18874k21167j19523q9859k77998L8532j53545j19671l5309o9327
$$ 6379765 6160891 5939724 5820201 5730342 5452344 5490876 5337331 5217660 5182351 5113024
16611E113024l17126m2636K58605k10602k03493m5915K3217j94551P1984l03013
$$ 5113024 4795898 4753262 5011867 4801265 4597772 4551857 4575074 4380523 4452507 4149494
16601D149494j20494K4510J54291K58698l03031l90928m5668j65767J69014N6362
$$ 4149494 4029000 4053510 4207801 4466499 4163468 3772540 3726872 3561105 3730119 3786481
16591C786481k85121K11959k16371j03646j02245J36999l22080q7604J15199m18930
$$ 3786481 3501360 3713319 3496948 3393302 3291057 3428056 3105976 3018372 3133571 2714641
16581B714641L04485k05642J22742k4463j78239p1599k9504n9810o418O224r8741
$$ 2714641 3019126 2813484 2936226 2911763 2733524 2661925 2632421 2572611 2566193 2572417 2473676
16570B473676R4722O154j31144O8028J73199n59515m4994M67698j56958q6230
$$ 2473676 2568398 2574552 2443408 2511436 2684635 2125120 2080126 2547824 2390866 2304636
16560B304636l76174J598K54542j94259L75340k86352r4363J69793l25692J44630
$$ 2304636 1928462 1930060 2184602 1990343 2365683 2079331 1984968 2154761 1829069 1973699
16550A973699O1944K77798J08207n68463r850M33535p28536K68710K93564n96664
$$ 1973699 2035643 2313441 2421648 1853185 1843335 2276870 1548334 1817044 2110608 1513944
16540A513944K92410j43869O3763N1185l99374L88833j88077O1524j88426N8043
$$ 1513944 1806354 1662485 1726248 1777433 1378059 1766892 1578815 1640339 1451913 1509956
16530A509956l79268K68866M23406j39469n7034j4336P3845l39829k11023J26341
$$ 1509956 1130688 1399554 1822960 1683491 1626457 1612121 1685966 1346137 1135114 1261455
16520A261455J28689k83492N86036m03639K50253l77842J41248j26025M1405K60385
$$ 1261455 1390144 1106652 1692688 1289049 1539302 1161460 1302708 1176683 1218088 1478473
16510A478473k71773K38934n23417K30637o2288L12309k39182J31886o7248O7329
$$ 1478473 1206700 1445634 922217 1152854 1090566 1402875 1163693 1295579 1228331 1295660
16500A295660j62555L6337k21920K88191l17190n15J94914j97069m7554K55629
$$ 1295660 1133105 1169442 947522 1235713 918523 918008 1112922 915853 868299 1123928
16490A123928l3277k09172P9064l0435O9644k10193K33572O516N1834l19506K241
$$ 1123928 1090651 881479 960543 930108 999752 789559 1023131 1029647 1081481 761975 764216
16479G64216J46105l5938J12082l50792J89806J16513j09711j8760J43437j08167
$$ 764216 910321 874383 986465 635673 825479 941992 832281 813521 956958 848791
16469H48791R5330j93000J34720N0078j01358n7003m6743K8622k9386K13061n9841
$$ 848791 944121 751121 885841 935919 834561 777558 730815 759437 730051 943112 883271
16458H83271D09306N14658k83332J05925J24113j95588l9987O4760J19361k70988
$$ 883271 409306 923964 640632 746557 870670 675082 635095 699855 819216 548228
16448E48228j87255L11168J47817D09093O803J75678P5075j00122p3369k3746
$$ 548228 360973 672141 819958 409093 415896 591574 666649 566527 493158 469412
16438D69412n089L13924k19218K02402p2231o9563k6738K01421k15389B50875
$$ 469412 464323 778247 559029 761431 689200 619637 592899 794320 578931 250875
16427E48813N6599O927q2414k20407L27051J18061K9955j91573j40015j21420
$$ 548813 605412 612339 529925 309518 636569 754630 784585 593012 452997 331577
16417C31577J31470j42811L46300j06585j50899K42565k71369J07081k9158J11777
$$ 331577 463047 320236 666536 559951 409052 651617 380248 487329 458171 569948
16407E69948k00540L1089l1980K12343k6638l0014L00449C31025R3065j50778
$$ 569948 369408 400497 368517 580860 554222 524208 824657 331025 424090 273312
16397B73312K62805J98860A75802K64775n0022K21166L8320j65123J84165q8858
$$ 273312 536117 734977 175802 440577 390555 611721 650041 484918 669083 580225
16387E80225A16751L41750j33309K46936K3989A58342K48229J92983B58383M4970
$$ 580225 116751 458501 325192 572128 596117 158342 406571 599554 258383 303353
16377C03353J54519B03209R609Q7019L15647m1505q1887d796B95587J00442p1447
$$ 303353 457872 203209 212818 299837 615484 573979 492092 -4796 295587 396029 324582
16366C24582L44199k19958j13052K3503r5514L97318j63951j67474m9261k750
$$ 324582 668781 448823 335771 359274 263760 661078 497127 329653 280392 277642
16356B77642p6335K50310k17956m922M84882A81656j0560b5321E06869j01498
$$ 277642 201307 451617 233661 228739 713621 181656 171096 -25321 506869 405371
16346D05371l3483I4690K48514o1411j29253O8632J96647g2445j44B25815H9544
$$ 405371 371888 94690 343204 281793 152540 221172 417819 -72445 -72589 225815 89544
16334D10050j1087j98564K46068o0874J59121C6310K92021C0374L50672A71432
$$ 410050 398963 200399 446467 385593 544714 36310 328331 30374 381046 171432
16323D95551j23590A11875J15293J00301p0219J33094n8977r5093N3521E8578
$$ 495551 371961 111875 227168 327469 257250 390344 331367 236274 289795 58578
16312A06641r239J52783j13892N4827k5962L87775j42317a8544D07435A36176
$$ 106641 97402 250185 136293 191120 165158 552933 410616 -18544 407435 136176
16301a44017B59037J37703A14274h0119C37583J86392k23849p9646l6928n0212
$$ -144017 259037 396740 114274 -80119 337583 523975 300126 220480 183552 133340
16291A33340J65568m4004i9040B08842K27614N2767D8173J92119J00545r4671
$$ 133340 298908 254904 -99040 208842 436456 489223 48173 240292 340837 246166
16281B46166M6312C7845L3181a44734A78531J4170m8142j2079O6473B6149c35613
$$ 246166 292478 37845 71026 -144734 178531 192701 144559 132480 198953 26149 -335613
16269C44104A22776J68281I1361b06905B57506O4377N0282b17702A58732a6923
$$ 344104 122776 291057 91361 -206905 257506 321883 372165 -217702 158732 -16923
16258A39616f1738A38064J82754o3196J2016r398J73757j67236G3579N47299F6816
$$ 139616 -61738 138064 320818 257622 269638 260240 433997 266761 73579 620878 66816
16246b6756A36092K57093F3102A7985J09757M6521p1639J2077L84869k16997I5145
$$ -26756 136092 393185 63102 17985 127742 174263 102624 114701 499570 282573 95145
16234A11046J17820R194D6762L36004j90467n650B1274q420a43803B57853R6932
$$ 111046 228866 238060 46762 382766 192299 186649 21274 12854 -143803 257853 354785
16223C54785A35169E8511J21198b25602A61975C0543A0948a931B1672M6843J87086
$$ 354785 135169 58511 179709 -225602 161975 30543 10948 -1931 21672 68515 255601
16212B55601j25721L97236a62850A50064K0696C4331M79609a69359I224L83771
$$ 255601 129880 527116 -162850 150064 170760 34331 513940 -169359 9224 392995
16202C92995e1093l02421B02239m2302K24484A58013a45301D19152a3919F1753
$$ 392995 -51093 -353514 202239 159937 384421 158013 -145301 419152 -13919 61753
16191A44195B0027N3631J71264A08851k2912a02966B25238a52845k5520i913j982
$$ 144195 20027 73658 244922 108851 85939 -102966 225238 -152845 -178365 -9913 -11895
16180a1895A63987a1162B73293A1464Q2543J27667L7145L28611e4704C5064a07816
$$ -11895 163987 -11162 273293 11464 94007 221674 258819 587430 -54704 35064 -107816
16168D83251A57909h3421A83729R0615p4746j1699g4997L4058J0810j42579c2370
$$ 483251 157909 -83421 183729 274344 199598 187899 -74997 -40939 -30129 -172708 -32370
16156D0290b04272A91586r3147f1243o0892A29331k6286Q6322H5591l6119a18822
$$ 40290 -204272 191586 98439 -61243 -122135 129331 103045 189367 85591 49472 -118822
16144A12303a08014N1120A69499O0153d8063l2354n7887Q792e5184A83723p3853
$$ 112303 -108014 -56894 169499 229652 -48063 -80417 -138304 -129512 -55184 183723 109870
16133A09870K39525n1886a25816F7419c96274B38777b98423Q1175A33783g103
$$ 109870 349395 297509 -125816 67419 -396274 238777 -298423 -217248 133783 -7103
16122A48497L10318a97362A32859N6998a22958d5244h079l2188D3805K8167N5790
$$ 148497 458815 -197362 132859 189857 -122958 -45244 -8079 -40267 43805 71972 127762
16111A27762m2419A9670K5127J09758i7183G9990N5383A944K42861L8721J37111
$$ 127762 85343 19670 44797 154555 -97183 79990 135373 1944 244805 283526 420637
16100D20637A62647o1362L70258E6368K7819b69122N7280j88094a00020A84868
$$ 420637 162647 101285 471543 56368 84187 -269122 -211842 -399936 -100020 184868
16089G7861a667l61314A65199j1153c50462g622C74388b41106d3907D5765A2633
$$ 77861 -1667 -362981 165199 154046 -350462 -7622 374388 -241106 -43907 45765 12633
16077a91500O3819I1301a03148K6179j21948g5979C47057N866q4056g5677A20085
$$ -191500 -127681 91301 -103148 -76969 -198917 -75979 347057 352923 268867 -75677 120085
16065A53739K2903o9955C1112Q7666L13744b17352G049b50991b2110o6543a1396
$$ 153739 176642 106687 31112 118778 432522 -217352 7049 -250991 -22110 -88653 -11396
16053I2661c0981k12988B00921G7803g4300A27868a74546A02974J91638a29055
$$ 92661 -30981 -243969 200921 77803 -74300 127868 -174546 102974 294612 -129055
16042D263L71509A04575a12965d9022B1781a5016D230J18657e04315B51510E8537
$$ 4263 375772 104575 -112965 -49022 21781 -15016 4230 122887 -504315 251510 58537
16030G7442b24133C04000N2357d0490A89580E1137a05149k2942D2268a900l10470
$$ 77442 -224133 304000 356357 -40490 189580 51137 -105149 -128091 42268 -1900 -312370
16019c12370g4612A84592d2342l53771J67065e0687j48063j02151b0023A7697
$$ -312370 -74612 184592 -42342 -396113 -229048 -50687 -198750 -300901 -20023 17697
16008A32511c08952a9457j61762B14700O7086a48754b7714B74565N9835b69321
$$ 132511 -308952 -19457 -181219 214700 281786 -148754 -27714 274565 334400 -269321
15997b58233i5381A09387K85828b37188A6675L3615N9774e0704C6569B218c07834
$$ -258233 -95381 109387 395215 -237188 16675 50290 110064 -50704 36569 2218 -307834
15985A09661d30572J88888A82910E7905J33362a13C3674O924K29828H0100L4915
$$ 109661 -430572 -241684 182910 57905 191267 -113 33674 40598 270426 80100 115015
15974A15015a65547A56063A1264a3032m9499I8875e2299C3893A4585K72066a23046
$$ 115015 -165547 156063 11264 -13032 -62531 98875 -52299 33893 14585 286651 -123046
15962A16533J34115B8563b52069J19102C0965b22820j34050F6679N0774a08367
$$ 116533 250648 28563 -252069 -132967 30965 -222820 -356870 66679 117453 -108367
15951E4009b46474B24822d4654q2685L1168q7317K7352L8584a4618A73128K07001
$$ 54009 -246474 224822 -44654 -127339 -96171 -183488 -156136 -117552 -14618 173128 380129
15940C80129A31744c01933H634h1973b3074q1192k670k3227A6978a24318k8437
$$ 380129 131744 -301933 8634 -81973 -23074 -104266 -106936 -130163 16978 -124318 -152755
15929a52755n9594B3126c79150a37769A40588P9895a05886j25654B10406r3273
$$ -152755 -212349 23126 -379150 -137769 140588 220483 -105886 -231540 210406 117133
15919A17133d20392A01997b28167f9453C98370A07008a85203A12072R6108B8003
$$ 117133 -420392 101997 -228167 -69453 398370 107008 -185203 112072 208180 28003
15908D2266c2145j09237a0175o06A91609I3765e2141A60608K47970I6521h3995
$$ 42266 -32145 -141382 -10175 -10781 191609 93765 -52141 160608 408578 96521 -83995
15896h9708k20191a09184A65972a76775k2289F489e4900j65585g2645R563k30244
$$ -89708 -309899 -109184 165972 -176775 -199064 6489 -54900 -220485 -72645 -63082 -293326
15885b93326A91199j7492e691k6239n9049F6952a0220j77836B38189d4379j46615
$$ -293326 191199 173707 -5691 -31930 -90979 66952 -10220 -188056 238189 -44379 -190994
15874a90994Q0969G1628c73519K2259J37579K3844B60105k5595C620b17410L2136
$$ -190994 -110025 71628 -373519 -351260 -213681 -189837 260105 234510 3620 -217410 -185274
15863a85274k8126R3023C13460g0472o2779A5587L49837a11058N1680j53802F9069
$$ -185274 -213400 -120377 313460 -70472 -133251 15587 365424 -111058 -59378 -213180 69069
15851E8331J64175o9951p740M4982b38758E8346A9160Q3599D2662c76389d2126
$$ 58331 222506 152555 144815 189797 -238758 58346 19160 102759 42662 -376389 -42126
15839C247a61024B75914g6587B08247a11381A54490d1116D3209g8388j36682k3785
$$ 3247 -161024 275914 -76587 208247 -111381 154490 -41116 43209 -78388 -215070 -238855
15828b38855H0096J79353a98577Q169e9980l24850a01070K5366k3734C61886b10557
$$ -238855 80096 259449 -198577 -190408 -59980 -384830 -101070 -75704 -99438 361886 -210557
15816c45180d7241F4642b16881B90673a36345O425d4658a1210p3778c4677A03444
$$ -345180 -47241 64642 -216881 290673 -136345 -129920 -44658 -11210 -84988 -34677 103444
15804F1905a70935j48531J36916Q1472A78159d5192b153k68232E2209K49981b53211
$$ 61905 -170935 -319466 -182550 -101078 178159 -45192 -2153 -270385 52209 302190 -253211
15792C5383L18204b70386m438a11416o8760J5303j03140K9910c3647B19475d2763
$$ 35383 353587 -270386 -274824 -111416 -180176 -164873 -268013 -238103 -33647 219475 -42763
15780b18091K5460C34901f4603l50062A89465D1545h8185E0329b08237a0223j35273
$$ -218091 -192631 334901 -64603 -414665 189465 41545 -88185 50329 -208237 -10223 -145496
15769a45496k11766A49423o6444b9264D4384a29215E8627n706J53941I6896J09698
$$ -145496 -357262 149423 82979 -29264 44384 -129215 58627 52921 206862 96896 206594
15758B06594b0369B26692m6074l7320b02969E2502K22282C662f626j61601j99310
$$ 206594 -20369 226692 180618 143298 -202969 52502 274784 3662 -6626 -168227 -367537
15747c67537e3558A38025a48205a6666p380r3606c0580l62807G2638a29054a3368
$$ -367537 -53558 138025 -148205 -16666 -24046 -117652 -30580 -393387 72638 -129054 -13368
15735H8504h8918A15762c12315B1653a395E4561e9707j83858E5157Q217f6285
$$ 88504 -88918 115762 -312315 21653 -1395 54561 -59707 -243565 55157 63374 -66285
15723a61946l64589A07533A4301b48644h1015C18721b69077C93602a41730A70153
$$ -161946 -526535 107533 14301 -248644 -81015 318721 -269077 393602 -141730 170153
15712a08994E2287a63827A72219i3724A04839i867j01000D753M0995c22952J50257
$$ -108994 52287 -163827 172219 -93724 104839 -9867 -110867 4753 45748 -322952 -172695
15701a72695j80152H9441n55g6479I752K31924d20042a1369C61312p5062E3879
$$ -172695 -352847 89441 88886 -76479 9752 241676 -420042 -11369 361312 286250 53879
15689G3664d2410J4364j18189B77229a59703a0046l279C7993O0705C3340K67375
$$ 73664 -42410 -28046 -146235 277229 -159703 -10046 -13325 37993 98698 33340 300715
15678C00715a53280a1305n2706C9039c54156A06583f57A75268a28228a4614o7585
$$ 300715 -153280 -11305 -64011 39039 -354156 106583 -657 175268 -128228 -14614 -82199
15667h2199J4454A84990J4175e6833j32033B28a75446A35209c0493m0079A88465
$$ -82199 -67745 184990 199165 -56833 -188866 228 -175446 135209 -30493 -70572 188465
15655A3485J47922A0492K03240d3141A56366B8525b95033c8148C89a36858A12670
$$ 13485 161407 10492 213732 -43141 156366 28525 -295033 -38148 389 -136858 112670
15643C92743j84419b04460R6307b2043j81194b9067k47170e5062B9000Q9300e6626
$$ 392743 208324 -204460 -108153 -22043 -203237 -29067 -276237 -55062 29000 118300 -56626
15631b52659P2353F0247g367j15361A69082K70092a76495D34648I790J93772b03077
$$ -252659 -180306 60247 -7367 -122728 169082 439174 -176495 434648 9790 203562 -203077
15619c15372a34113j09105o062P4454P158c1463B88938E1856b49626e9590I0044
$$ -315372 -134113 -243218 -249280 -174826 -167668 -31463 288938 51856 -249626 -59590 90044
15607F8750J48791f6330K0701E0580a82721D8468b59900P9620d6586m405j29519
$$ 68750 217541 -66330 -45629 50580 -182721 48468 -259900 -180280 -46586 -50991 -180510
15596a80510D454a46827D0412a5600k32096B40873A8087Q017O9142k5783R8668
$$ -180510 4454 -146827 40412 -15600 -247696 240873 18087 26104 95246 69463 168131
15585A68131b30189Q335A80848B6847f6957B6688c1186k4913C8232f5083A01625
$$ 168131 -230189 -221854 180848 26847 -66957 26688 -31186 -56099 38232 -65083 101625
15573e3435B29865f1894F7051R5636G4888a2967C98519b72057a14862E7865J05503
$$ -53435 229865 -61894 67051 162687 74888 -12967 398519 -272057 -114862 57865 163368
15562A63368K02129j72542H4634K11165C132a18048j9127A55120b66225p0922
$$ 163368 365497 192955 84634 295799 3132 -118048 -137175 155120 -266225 -337147
15552c37147h9445j75338A07161K04718c18606F9100J04388A3805a44155a1287
$$ -337147 -89445 -264783 107161 311879 -318606 69100 173488 13805 -144155 -11287
15541i6830F3463a0317C98923q4317a34059A89124G1390e2220F6311h1718A01066
$$ -96830 63463 -10317 398923 314606 -134059 189124 71390 -52220 66311 -81718 101066
15529a63492A61347k3338b37597P3245A60242i5095K7605n550B88416a16068H6878
$$ -163492 161347 138009 -237597 -164352 160242 -95095 -67490 -73040 288416 -116068 86878
15517f1185e173j04562j72476C39590h9854o8648B872J2129b00663B36566b58292
$$ -61185 -5173 -109735 -282211 339590 -89854 -158502 2872 15001 -200663 236566 -258292
15505A42679a86581B74324E2824a62724A7631d0058r5782N010d9507b3519A298
$$ 142679 -186581 274324 52824 -162724 17631 -40058 -135840 -130830 -49507 -23519 1298
15493c84397e2932P087A01315K01968A46623b62040B65741b35486E9114c6534
$$ -384397 -52932 -45845 101315 303283 146623 -262040 265741 -235486 59114 -36534
15482A42939P9112a80044o1614i6803k3187c3713A672K42473a07058E03036E4837
$$ 142939 222051 -180044 -241658 -96803 -119990 -33713 1672 244145 -107058 503036 54837
15470B8511c4173j09693K1057G9752K62083a40820D0414b39017e4273C3985L545
$$ 28511 -34173 -143866 -122809 79752 341835 -140820 40414 -239017 -54273 33985 37530
15459C7530a32598H6448C3995J51921N0368F1943a67427B94430j11612b62611
$$ 37530 -132598 86448 33995 185916 236284 61943 -167427 294430 182818 -262611
15448B0566R8458M7984G4833l0351c3067A66317K78179A51388a28210B3062e1619
$$ 20566 119024 167008 74833 44482 -33067 166317 444496 151388 -128210 23062 -51619
15436I7087J26218o4067B2944e6781C80594E0929A4285L44782f8570B54835c8852
$$ 97087 223305 159238 22944 -56781 380594 50929 14285 359067 -68570 254835 -38852
15424a90226c141A55982b22326C424L2258g7252A3858e379j7521A36433M5935
$$ -190226 -3141 155982 -222326 3424 35682 -77252 13858 -5379 -22900 136433 182368
15413A82368p8491Q8428D3597J66631p2452f3896p4733f5338b7831r6433J4232
$$ 182368 103877 192305 43597 210228 137776 -63896 -138629 -65338 -27831 -124264 -110032
15402a10032A22560a9509j10127N1352m7026K4560k30446f7702J9096k00573h2108
$$ -110032 122560 -19509 -129636 -78284 -125310 -100750 -331196 -67702 -48606 -249179 -82108
15390c08908A02211B2834M0162a19982l96903A27585J33661a63339C7577K6740
$$ -308908 102211 22834 62996 -119982 -516885 127585 261246 -163339 37577 64317
15380F4317J36151j9073c00822A63390k6343c6476B54151A11772N680a65821O0114
$$ 64317 200468 181395 -300822 163390 137047 -36476 254151 111772 117452 -165821 -105707
15369a05707D3083b8572A79452f0712k18761C9239g327A72691n7324O2450g4049
$$ -105707 43083 -28572 179452 -60712 -279473 39239 -7327 172691 115367 177817 -74049
15357b40340B43718b96291c148C25099d3283A9910b9226n7273K1077J1802D19046
$$ -240340 243718 -296291 -3148 325099 -43283 19910 -29226 -86499 -65422 -53620 419046
15345A13969d0119C04457E6576J41211J03010D5160a20407n3350M3238C13755
$$ 113969 -40119 304457 56576 197787 300797 45160 -120407 -173757 -130519 313755
15334A47220J1578e2336C55597r864g7331A53060a72886d8384n0296E8572l09
$$ 147220 158798 -52336 355597 345733 -77331 153060 -172886 -48384 -98680 58572 58263
15323E8263j9095b77458A05284g4694G4493b51257A09994f0420j22867B86087
$$ 58263 39168 -277458 105284 -74694 74493 -251257 109994 -60420 -183287 286087
15312A78994a77044R723A09738b45398c4208j72530L2757C7677M2918K85839a3710
$$ 178994 -177044 -167321 109738 -245398 -34208 -206738 -173981 37677 80595 366434 -13710
15300A59343k0526j1245a06874C00889I8176f6545j04424A41936J14126D4695
$$ 159343 138817 127572 -106874 300889 98176 -66545 -170969 141936 256062 44695
15289b25009E4828J04046j1954a36474A1992M9694a04847k07606B51353A21088
$$ -225009 54828 158874 146920 -136474 11992 61686 -104847 -312453 251353 121088
15278c4384R928F7254R4960J39665a64625D3595J58980c4601r665k26778C03914
$$ -34384 -24456 67254 162214 301879 -164625 43595 202575 -34601 -44266 -271044 303914
15266i0813C37207e7026F9860a21649A35167K09354b42265G0915K6054C1283a53900
$$ -90813 337207 -57026 69860 -121649 135167 344521 -242265 70915 96969 31283 -153900
15254A26130O1636J25637J77353j93823K91315R91889j85577j19531k14790D77917
$$ 126130 187766 313403 490756 296933 588248 1580137 1394560 1275029 1060239 477917
15243B29369m3644o8264B9508N6275a49602A70347C5306b41074A33600K13728
$$ 229369 185725 117461 29508 85783 -149602 170347 35306 -241074 133600 347328
15233C47328j70394E2751k3137H423O4119p16L1959C8265O6171c33050C8267J56837
$$ 347328 176934 52751 29614 8423 72542 71826 103785 38265 104436 -333050 38267 195104
15221A95104D8369J84400F4558M9523L0600j8095M466c61813C40914r1126E6254
$$ 195104 48369 232769 64558 114081 144681 126586 131052 -361813 340914 249788 56254
15209C43803j52198J48516A19227a41947c9025B45210E4659b64862a0381m9418
$$ 343803 191605 340121 119227 -141947 -39025 245210 54659 -264862 -10381 -59799
15199e9799A43016E5280a75384D11104A61965h0336A31339D0675Q6576m6628B8929
$$ -59799 143016 55280 -175384 411104 161965 -80336 131339 40675 127251 80623 28929
15187H0988Q7947o3340J42177J11564b68566E8691R1528M4296r3004e6496p7194
$$ 80988 168935 105595 247772 359336 -268566 58691 150219 194515 101511 -56496 -133690
15176a33690C48629a46345B30430C4725L6014K49813p7936C6256B751Q073b34564
$$ -133690 348629 -146345 230430 34725 70739 320552 242616 36256 2751 10824 -234564
15164a10458B71260a97587R6091a6623A39426m6909d7031C22961j14642r1341
$$ -110458 271260 -197587 -101496 -16623 139426 92517 -47031 322961 208319 116978
15154A16978a14455a6544A30931M566m4259K23025A33548K10249r0716j6714J53255
$$ 116978 -114455 -16544 130931 135497 91238 314263 133548 343797 253081 236367 389622
15143C89622r1444A07941j1581b53102C05522A2023J73266J19336a51246A82138
$$ 389622 298178 107941 96360 -253102 305522 12023 185289 304625 -151246 182138
15132D91534F570L12477j31948H4549i615C91131n2750e7012A16412D5626L28257
$$ 491534 6570 319047 187099 84549 -9615 391131 338381 -57012 116412 45626 373883
15121C73883H9454a59471C68144j64770J10972j50906N580P261J74430E4075k1078
$$ 373883 89454 -159471 368144 203374 314346 163440 169020 176281 350711 54075 32997
15110C2997L19247a9973E41145H4624C8728a25954B47867K99762B40443b07082
$$ 32997 352244 -19973 541145 84624 38728 -125954 247867 547629 240443 -207082
15099C56265b51505A50074a6988A15405L84077a0159B31000P0589j18605K61870
$$ 356265 -251505 150074 -16988 115405 499482 -10159 231000 301589 182984 444854
15089D44854j78406q3641p9914c80693A18700N7603J27122E4145g3570B84863
$$ 444854 266448 182807 102893 -380693 118700 176303 303425 54145 -73570 284863
15078d8364h145k1000C85572A03481J96765N7648n6609a1277r5138D6651a71065
$$ -48364 -8145 -29145 385572 103481 300246 357894 301285 -11277 -106415 46651 -171065
15066A60596G8240L5200a47610D16182j29099A07065J32663j13987J90556f6245
$$ 160596 78240 113440 -147610 416182 287083 107065 239728 125741 316297 -66245
15055B68419a0156A31157Q3234a26585J4956I1412J33550M2400j27115c6504B39816
$$ 268419 -10156 131157 214391 -126585 -111629 91412 224962 267362 140247 -36504 239816
15043C60807K15959k80919D6923L88290A38258a8117C50962A39154F3400K49348
$$ 360807 576766 295847 46923 435213 138258 -18117 350962 139154 63400 312748
15033C12748j18430D2256J10492m2637A2707M68960j75874j17132c3044C6188
$$ 312748 194318 42256 152748 110111 12707 481667 305793 188661 -33044 36188
15022B53937q7555O2804f6328q8926A06618J85821n2588J09039j07905n5880J01721
$$ 253937 166382 229186 -66328 -155254 106618 292439 239851 348890 240985 185105 286826
15011B86826D4799J41700r2296f8801B46638r3552j6377J15272J20321A55759
$$ 286826 44799 186499 94203 -68801 246638 153086 136709 251981 372302 155759
15000B01393m4138K47277l3283k5692A10090J47077F9605J58226p4870l8180M57850
$$ 201393 157255 404532 371249 345557 110090 257167 69605 227831 152961 114781 572631
14989E72631A42278a17472B08617B2746J99276n9857o5301b03530A79255J75716
$$ 572631 142278 -117472 208617 22746 222022 162165 96864 -203530 179255 354971
14979C54971A67692J10037b9627q029j58007B96229H3405K39211q0396L11123
$$ 354971 167692 277729 -29627 -37656 -195663 296229 83405 322616 242220 553343
14969E53343B18730J97536A27509O4077K33711A26796D7394A720R4106L76151
$$ 553343 218730 416266 127509 191586 425297 126796 47394 1720 95826 471977
14959D71977r838A53157o8517j8456L51916j09693L9819L5016j68855O8004A01335
$$ 471977 462139 153157 84640 66184 418100 308407 348226 383242 214387 282391 101335
14947C59310n8885O3398g4590B05066K20347D8939L99457j42535j3055R0902A60500
$$ 359310 300425 363823 -74590 205066 425413 48939 448396 305861 292806 383708 160500
14935d525A281L15266K71334k78667M3806A40750N0189K153Q4401A26808n8454
$$ -4525 1281 316547 587881 309214 353020 140750 190939 193092 277493 126808 68354
14924F8354K89512o172p2385k4762O6849D633N34526A98382J71461n6042N2864
$$ 68354 357866 351694 279309 254547 321396 4633 539159 198382 369843 313801 366665
14913C66665F9377L15516K8018p0261j03275K86872P4783B53553p6150J22309
$$ 366665 69377 384893 412911 342650 239375 526247 601030 253553 177403 299712
14903B99712I9683J69121R0984P7437j96215J28479A22959a02746B68810A06045
$$ 299712 99683 268804 359788 437225 241010 369489 122959 -102746 268810 106045
14892B81803K91637j52507M4104j22012A39710M93241k94013L00441k08597H7089
$$ 281803 573440 420933 465037 343025 139710 632951 338938 639379 430782 87089
14881F44089k19610q2985J26009K72034C5740O29513B78639L26451j89083j65153
$$ 644089 424479 341494 467503 739537 35740 665253 278639 605090 416007 250854
14871B50854L53359B00667J06720J50476n4895M10748C28352j40710K38631j2129
$$ 250854 604213 200667 307387 457863 402968 813716 328352 187642 426273 414144
14861D14144J28094k51289L0386J22482N3353k6908j3161C2748K61963J54860
$$ 414144 542238 290949 321335 443817 497170 470262 457101 32748 294711 449571
14851D49571J26401Q9363k58383J48014J02780l10555L00728j43144K19671B93646
$$ 449571 575972 665335 406952 554966 657746 347191 647919 504775 724446 293646
14840C90799l9913L33385j41635K33699j54297B74556J65321j84970L22992A06900
$$ 390799 350886 684271 542636 776335 622038 274556 439877 254907 577899 106900
14829C68877L96760k23949j11743j23824J28725Q6118A95742M9581R7004L09580
$$ 368877 765637 541688 429945 306121 434846 520964 195742 245323 342327 651907
14819F51907P9326j74504B42561L74483m024J05015k2159m4937N5572k73769j65675
$$ 651907 731233 556729 242561 617044 613020 718035 695876 650939 706511 432742 267067
14808B67067Q0043J37271O4721o8394m9923j47814L50949k51366K8818o0916P3443
$$ 267067 347110 484381 549102 480708 430785 282971 633920 382554 411372 350456 423899
14797D23899L28052B93615N94842B98554L31413K27476l49592J82907K4328l26632
$$ 423899 751951 293615 888457 298554 629967 857443 507851 690758 715086 388454
14787C88454J16804j56099K66519m5775j64249J92575j25195K24414l4635K37274
$$ 388454 505258 349159 615678 569903 405654 598229 473034 697448 662813 900087
14777I00087l82797j17191L91103j5822K15494l04916L5149B74231M86815B02392
$$ 900087 517290 400099 791202 775380 990874 685958 721107 274231 761046 202392
14766I46108D04431K84939k68828L18958j28892M96602k72380P8313O192j74648
$$ 946108 404431 689370 420542 739500 610608 1107210 834830 913143 919335 744687
14756G44687R0826n6654j70835J21122m4245J08443j12743j31927M26723j85579
$$ 744687 835513 778859 608024 729146 684901 793344 680601 548674 975397 789818
14746G89818j46748k16548J48055K80561m5936O9193n6670r4704J96152k74722
$$ 789818 643070 426522 574577 855138 809202 878395 821725 727021 923173 648451
14736F48451r2374L05633l76099M68911D42586K03468K49118j31874K62837l57713
$$ 648451 556077 861710 485611 954522 442586 646054 895172 763298 1026135 668422
14726F68422Q9292p3681J9089L11270m62017P99823E08376M18836j13795L08493
$$ 668422 757714 684033 703122 1014392 552375 1352198 508376 927212 813417 1121910
14716A121910j33672k98458K97423P3770k24133J17956l56871L99494K2174Q3821
$$ 1121910 988238 689780 987203 1060973 836840 954796 597925 997419 1019593 1103414
14706A103414l31558K69647J09586n20383j0900N64092l42296M36223m38770K42246
$$ 1103414 771856 1041503 1151089 630706 619806 1183898 841602 1277825 839055 1081301
14696A081301j70314J72000j33548l40280O95791m14864R8002J09322k21949M7583
$$ 1081301 910987 1082987 949439 609159 1304950 890086 988088 1097410 875461 923044
14686I23044L58403j19117k36035L50300n10826L52133r6959j6499k61921J18158
$$ 923044 1281447 1162330 926295 1276595 765769 1117902 1020943 1004444 742523 860681
14676H60681K23047j1426j5615j49205M6050J77969j7202L82787m94283J12991
$$ 860681 1083728 1072302 1056687 907482 953532 1131501 1114299 1497086 1002803 1115794
14666A115794J03944j50012L2579j20872K48326L41335l80700K81000n2903K2352
$$ 1115794 1219738 1069726 1102305 981433 1229759 1571094 1190394 1471394 1418491 1440843
14656A440843m96734K04979N6140j44634J28283M7183o3809J28618M7569l0516
$$ 1440843 944109 1149088 1205228 1060594 1188877 1236060 1172251 1300869 1348438 1317922
14646A317922O0906p5231k40271K6453J08747L1985J96626k33013J33090j3309
$$ 1317922 1378828 1303597 1063326 1089779 1198526 1230511 1427137 1194124 1327214 1313905
14636A313905n9203J885K39233j30084r1677J47967p4131q5685K61385k7717l19856
$$ 1313905 1254702 1256587 1495820 1365736 1274059 1422026 1347895 1262210 1523595 1495878 1176022
14625A176022L84226O4450k26096M9310L1424j21779j6364M5316L16057J35068
$$ 1176022 1560248 1624698 1398602 1447912 1479336 1357557 1341193 1386509 1702566 1837634
14615A837634j35304l68316M49955l11957O3746K15108j84472j16820K38660N0171
$$ 1837634 1702330 1334014 1783969 1472012 1535758 1750866 1566394 1449574 1688234 1738405
14605A738405K41393k50226K66252o3237l35598K39458n0254j40376O51371n72931
$$ 1738405 1979798 1729572 1995824 1932587 1596989 1836447 1786193 1645817 2297188 1724257
14595A724257L5367P9094j9866j13433L88548k42590k10793K47909p7747Q2195
$$ 1724257 1759624 1838718 1818852 1705419 2093967 1851377 1640584 1888493 1810746 1892941
14585A892941j13743L41159M316K70686n69331R7607K71011o7070j25377K01493
$$ 1892941 1779198 2120357 2124673 2395359 1826028 1923635 2194646 2127576 2002199 2203692
14575B203692M0534K23244o2539j27713J81725J63362l30295N121J61294J84992
$$ 2203692 2244226 2467470 2404931 2277218 2458943 2622305 2292010 2297131 2458425 2643417
14565B643417J09777k90559J84210M5135R7430m1796J22647K13599j65865K11354
$$ 2643417 2753194 2462635 2646845 2691980 2789410 2747614 2870261 3083860 2917995 3129349
14555C129349L09293R8305L38210K94638Q88459O79279J796614L520740R034713
$$ 3129349 3438642 3536947 3875157 4169795 5058254 5737533 7534147 11054887 20089600
14546B0089600J8183050R139854k0871878A1307660n304270k629415n35924k01307
$$ 20089600 38272650 47412504 26540626 11307660 6003390 3373975 2838051 2636744
14538B636744r302k15467k91572J57761j31088P8668j74763L46271j22452M8155
$$ 2636744 2627442 2411975 2120403 2278164 2147076 2225744 2050981 2397252 2274800 2322955
14528B322955J04206P956J47349J4431K33876m36324K5207P6714O47422n31680
$$ 2322955 2427161 2435117 2582466 2596897 2830773 2394449 2419656 2496370 3143792 2612112
14518B612112M27954l11454K15203l0924M6141k56685J66368J36894l48929N23196
$$ 2612112 3040066 2728612 2943815 2912891 2959032 2702347 2868715 3005609 2656680 3179876
14508C179876j18756q2142K35860L9732k86708K47484K25222p9865L3168J51095
$$ 3179876 3061120 2978978 3214838 3254570 2967862 3215346 3440568 3360703 3393871 3544966
14498C544966k14730L19419O422j49581N0378k25170L71232m25565O60491k65995
$$ 3544966 3330236 3649655 3656077 3506496 3556874 3331704 3702936 3277371 3937862 3671867
14488C671867J63423L80679n85794M99284j06690J33843Q4574k51351o8727K87590
$$ 3671867 3835290 4215969 3630175 4129459 4022769 4156612 4241186 3989835 3921108 4208698
14478D208698R6376l12016L85345k7274l1867R2432j09417J56059N00895l02736
$$ 4208698 4305074 3993058 4378403 4351129 4319262 4411694 4302277 4458336 4959231 4656495
14468D656495P1688L02575m74004L96105n6043J73938j88809r8042K45396N83928
$$ 4656495 4728183 5030758 4556754 4952859 4896816 5070754 4881945 4783903 5029299 5613227
14458E613227n40602M50030J48838p1757M1918j43538p0781L61271j44294J39961
$$ 5613227 5072625 5522655 5671493 5599736 5641654 5498116 5427335 5788606 5644312 5784273
14448E784273J65070p774k7321K77075R6954j53146j8244K47760K42716K41161
$$ 5784273 5949343 5941569 5914248 6191323 6288277 6135131 6116887 6364647 6607363 6848524
14438F848524l47036L84408K36823k53445j73759N48123p0473K20299j84692M89129
$$ 6848524 6501488 6885896 7122719 6869274 6695515 7243638 7173165 7393464 7208772 7697901
14428G697901m65562O79650j95114K12903k38622J04659M02531k67J84933K40402
$$ 7697901 7232339 7911989 7716875 7929778 7691156 7795815 8198346 8198079 8383012 8623414
14418H623414J61017J25683M56064l45626L00895k7916O19114n27896K55178J28085
$$ 8623414 8784431 8910114 9366178 9020552 9321447 9293531 9912645 9384749 9639927 9768012
14408I768012K4178O37086j83465J89064N78243j94819J47046K40074M0678K95136
$$ 9768012 9792190 10429276 10245811 10434875 11013118 10818299 10965345 11205419 11246097 11541233
14398A1541233J81238K37018l916L24421J06286k905J21360J57262Q91478k86286
$$ 11541233 11722471 11959489 11955573 12279994 12386280 12383375 12504735 12661997 13553475 13267189
14388A3267189M20298M22045K21581K06313L63004j33179N08244L23253J69503
$$ 13267189 13687487 14109532 14331113 14537426 14900430 14767251 15275495 15598748 15768251
14379A5768251p342M85871K59441R37280k02254M84302R8420M42257O37086L57727
$$ 15768251 15760909 16246780 16506221 17443501 17241247 17725549 17823969 18266226 18903312 19261039
14369A9261039K31880O37868J44734M37285L31050M11816N42790M28369N08832
$$ 19261039 19492919 20130787 20275521 20712806 21043856 21455672 21998462 22426831 22935663
14360B2935663O05903M88491M71120M07644Q29386L08252O23321P90472K50889
$$ 22935663 23541566 24030057 24501177 24908821 25738207 26046459 26669780 27460252 27711141
14351B7711141R67793N51882P01942R90606P03498O36455Q73053Q07297R21489
$$ 27711141 28678934 29230816 29932758 30923364 31626862 32263317 33136370 33943667 34865156
14342C4865156R74394P86800J154384J188003P27078J463572J212264Q93132J260651
$$ 34865156 35839550 36626350 37780734 38968737 39695815 41159387 42371651 43264783 44525434
14333D4525434J493280J499297J445161J373664J375637J677727J783162J904142
$$ 44525434 46018714 47518011 48963172 50336836 51712473 53390200 55173362 57077504
14325E7077504J707199K023242J983046J957363K189289K369016K709698K537476
$$ 57077504 58784703 60807945 62790991 64748354 66937643 69306659 72016357 74553833
14317G4553833L021627K978090K697410L319290L231162L801000L494961L998284
$$ 74553833 77575460 80553550 83250960 86570250 89801412 93602412 97097373 101095657
14309A01095657M263156M231711M990619M253338N365978N563398O019885O146143
$$ 101095657 105358813 109590524 114581143 118834481 124200459 129763857 135783742 141929885
14301A41929885O500006O760936P673197P471476Q277280R256962Q872728R576332
$$ 141929885 148429891 155190827 162864024 170335500 178612780 187869742 196742470 206318802
14293B06318802J0388489J0725930J1413209J2094366J2060363J3401160J3213573
$$ 206318802 216707291 227433221 238846430 250940796 263001159 276402319 289615892
14286B89615892J4194465J4281754J4922067J4891871J5144435J5240945J4769838
$$ 289615892 303810357 318092111 333014178 347906049 363050484 378291429 393061267
14279C93061267J4694113J3883681J3201802J1947562J0760698Q753136O802043
$$ 393061267 407755380 421639061 434840863 446788425 457549123 466302259 473104302
14272D73104302L011690k54906k506071j037518m143823l298466n045942q063686
$$ 473104302 476115992 475861086 473355015 472317497 468173674 464875208 459829266 451765580
14264D51765580r595963j1730276j2615241j4069481j4749314j5497877j5837220
$$ 451765580 442169617 430439341 417824100 403754619 389005305 373507428 357670208
14257C57670208j5779386j5095121j4752654j4636845j4073597j3780948j3194150
$$ 357670208 341890822 326795701 312043047 297406202 283332605 269551657 256357507
14250B56357507j2144984j1977627j1438675j0760586j0063714r363418q639640
$$ 256357507 244212523 232234896 220796221 210035635 199971921 190608503 181968863
14243A81968863q161422q310837p821084o967332p127444n823350n857470n815315
$$ 181968863 173807441 165496604 157675520 150708188 143580744 137757394 131899924 126084609
14235A26084609n373404m969191m789339m548643l954570l820158m090466l492309
$$ 126084609 120711205 115742014 110952675 106404032 102449462 98629304 94538838 91046529
14227I1046529l655297l164930l463369k977826k495348k981310k382219k025824
$$ 91046529 87391232 84226302 80762933 77785107 75289759 72308449 69926230 67900406
14219F7900406k333959k403945j772304k182214k108944j314892j420748k092347
$$ 67900406 65566447 63162502 61390198 59207984 57099040 55784148 54363400 52271053
14211E2271053j624614j169791j934466j018450r44860j069691j483610j382503
$$ 52271053 50646439 49476648 47542182 46523732 45578872 44509181 43025571 41643068
14203D1643068j166357j323810q66844l47506r95488j417279q58129p82346o78551
$$ 41643068 40476711 39152901 38286057 37938551 36943063 35525784 34667655 33885309 33206758
14194C3206758j023745q61247o24432q99528p54541o52110o87460r80348m80330
$$ 33206758 32183013 31321766 30697334 29797806 29043265 28391155 27703695 26723347 26243017
14185B6243017k06914q73134m03640o24457l34075r02731m49302j20125m74764
$$ 26243017 26036103 25162969 24759329 24134872 23800797 22898066 22448764 22328639 21853875
14176B1853875o14352m34999l23982k38519m35120n09623l29472l82454n33864
$$ 21853875 21239523 20804524 20480542 20242023 19806903 19297280 18967808 18585354 18051490
14167A8051490l87089k61803l11240k99242O3528m70225l80965J13694o16622
$$ 18051490 17664401 17402598 17091358 16792116 16855644 16385419 16004454 16118148 15501526
14158A5501526k79328n26117J3746n91256J08071k21390m73651j05185j45505
$$ 15501526 15222198 14696081 14709827 14118571 14226642 14005252 13531601 13426416 13280911
14149A3280911n12543L0510k5839p82590M25394k58676j16048j6279m54269m5625
$$ 13280911 12768368 12798878 12773039 11990449 12415843 12157167 12041119 12024840 11570571 11524946
14139A1524946q36946M73992p37130J58387Q7398k54887m10371L14330l69406
$$ 11524946 10688000 11161992 10424862 10583249 10670647 10415760 10005389 10319719 9950313
14130I950313l70340l3821J09957j11461k11982j96283L06472m51049L18756n00224
$$ 9950313 9579973 9546152 9656109 9544648 9332666 9136383 9442855 8991806 9310562 8810338
14120H810338k907m87589o9709p0915k86381L55040j93271l43639j25421L42807
$$ 8810338 8807431 8319842 8250133 8179218 7892837 8247877 8054606 7710967 7585546 7928353
14110G928353l91286k28078k93707J93049r8057K10070k71333J22417k32935j65699
$$ 7928353 7537067 7308989 7015282 7208331 7110274 7320344 7049011 7171428 6938493 6772794
14100F772794k29856M7066j40432N6858J3500l69857K70059m46045K93748k89679
$$ 6772794 6542938 6590004 6449572 6506430 6519930 6150073 6420132 5974087 6267835 5978156
14090E978156J85409m1355j52308j87758l2246k48712R8596j61174n870n7942
$$ 5978156 6163565 6122210 5969902 5782144 5749898 5501186 5599782 5438608 5432738 5374796
14080E374796J11265k00175j05301N6490k82714Q1638j23840k77950K78332j10299
$$ 5374796 5486061 5285886 5180585 5237075 4954361 5035999 4912159 4634209 4912541 4802242
14070D802242k10449k63884K90882r1526p483j08801N4370M847L95958o09063
$$ 4802242 4591793 4327909 4618791 4527265 4519782 4410981 4465351 4470198 4866156 4257093
14060D257093J38796m6234K97466l92216p9066J06843J41093o11953K5121j03865
$$ 4257093 4395889 4349655 4647121 4254905 4175839 4282682 4423775 3811822 3836943 3733078
14050C733078M41956m27634p5785J35929J0249j74114J7589N6616j21483l78336
$$ 3733078 4175034 3747400 3671615 3807544 3817793 3643679 3661268 3717884 3596401 3218065
14040C218065P4059N37126k05220q9734n28788O59971J15866o66770K2445J45123
$$ 3218065 3292124 3829250 3624030 3534296 3005508 3665479 3781345 3114575 3137020 3282143
14030C282143R4134k33511J58299l15819M3572j53412J67988J25973o67320O19097
$$ 3282143 3376277 3142766 3301065 2985246 3028818 2875406 3043394 3169367 2502047 3121144
14020C121144k36386J08840k02843l0235L90824m15295k6139j29582O0020K3799
$$ 3121144 2884758 2993598 2790755 2760520 3151344 2736049 2709910 2580328 2640348 2664147
14010B664147L6072l17721K90994k70207l26336M43786M5658l1898J6805j90250
$$ 2664147 2700219 2382498 2673492 2403285 2076949 2520735 2566393 2534495 2551300 2361050
14000B361050P2412l43253M23123m44613N1075q7699J90986K9412k66530M82905
$$ 2361050 2433462 2090209 2513332 2068719 2119794 2032095 2223081 2252493 1985963 2468868
13990B468868K59273O59424K315548O465182J6843366J7127574j4146061j4556973
$$ 2468868 2728141 3387565 5703113 12168295 29011661 46139235 31993174 17436201
13982A7436201p093500l005220j521287j135705n92637J50148p55370m33484K16424
$$ 17436201 10342701 7337481 5816194 4680489 4087852 4238000 3482630 3049146 3265570
13973C265570Q8211n91383P8294K91985l74869j34412l17201Q7394L0901K14638
$$ 3265570 3353781 2762398 2840692 3132677 2757808 2623396 2306195 2393589 2424490 2639128
13963B639128j2275j37997k85365p395L8803r915L24681l99430o6404J93969j18531
$$ 2639128 2626853 2488856 2203491 2196096 2234899 2224984 2549665 2150235 2083831 2277800 2159269
13952B159269n5495M5214O4984j75719j91179N32366j40763k03259J37425m27802
$$ 2159269 2103774 2148988 2213972 2038253 1847074 2379440 2238677 2035418 2172843 1745041
13942A745041M72777l81129K12270j25346Q6552q0542j81785J58394j06476J05346
$$ 1745041 2217818 1836689 2048959 1923613 2010165 1929623 1747838 1906232 1799756 1905102
13932A905102O0104j2563l55710M51301l15075o7824J40774l49990k2759M26986
$$ 1905102 1965206 1952643 1596933 2048234 1733159 1665335 1806109 1456119 1433360 1860346
13922A860346l04616K83658l48625K20488N3163m39226J57676M38277n37094K66984
$$ 1860346 1555730 1839388 1490763 1711251 1764414 1325188 1482864 1921141 1384047 1651031
13912A651031k7398j70096K14499j59535J25992J66649m36545K52850k44452P1617
$$ 1651031 1623633 1453537 1668036 1508501 1634493 1801142 1364597 1617447 1372995 1444612
13902A444612j5898J21589j87677j6738J1857L25697l27812L30505q33666N69037
$$ 1444612 1428714 1550303 1362626 1345888 1357745 1683442 1355630 1686135 852469 1421506
13892A421506K1255J81992n14469N65497m83983R598M31711k29738j5281m1673
$$ 1421506 1442761 1624753 1110284 1675781 1191798 1201396 1633107 1403369 1388088 1346415
13882A346415l06307k16388O29184j16446P0631m8473j04290m9432l8551J37840
$$ 1346415 1040108 823720 1452904 1336458 1407089 1358616 1254326 1204894 1166343 1304183
13872A304183Q5556R3714m68401j59233Q2084K93601p863N0577l76580K31677
$$ 1304183 1389739 1483453 1015052 855819 937903 1231504 1223641 1274218 897638 1129315
13862A129315k6954k5037J22167J67213k14337M9307K6778k76361L13853l44688
$$ 1129315 1102361 1077324 1199491 1366704 1152367 1201674 1228452 952091 1265944 921256
13852I21256P6553J25721j64536Q3229n6227J73803k74257J27479O5977m467l01661
$$ 921256 997809 1123530 958994 1042223 985996 1159799 885542 1013021 1078998 1074531 772870
13841G72870M82977j86470l8757O435j97043J09162L63208m52702K09581M8925
$$ 772870 1255847 1069377 1030620 1037055 840012 949174 1312382 859680 1069261 1118186
13831A118186l8414l00509N51465l13367r7109P931k86387K81253L68497n65055
$$ 1118186 1079772 779263 1330728 1017361 920252 928183 641796 923049 1291546 726491
13821G26491K02721r150l11858J34107L51512M7607l75697l0134j35354L75205
$$ 726491 929212 920062 608204 742311 1093823 1141430 765733 735599 600245 975450
13811I75450j11628O2690K27163j78396K0961l8584o3507L8838L8577q4656j01718
$$ 975450 863822 926512 1153675 975279 996240 957656 894149 932987 971564 886908 785190
13800G85190J33769o077j27224J86433l54975K48818J42297m5418k84827J14479
$$ 785190 918959 912882 785658 972091 617116 865934 1008231 962813 677986 792465
13790G92465j81294J50714J50873K31428j33217J01761K3135j51422O0285k41934
$$ 792465 611171 761885 912758 1144186 1010969 1112730 1135865 984443 1044728 802794
13780H02794j91398R0979K74692p0325k42435J90962R1779l45718o6136L01534
$$ 802794 611396 702375 977067 906742 664307 855269 947048 601330 535194 836728
13770H36728k68678L05322N2457k65569P3689J67501k89299j28287N8794k2115
$$ 836728 568050 873372 925829 660260 733949 901450 612151 483864 542658 520543
13760E20543J62462j05092J76580k86265J60575J76496k60482J32909K20799j07997
$$ 520543 683005 577913 754493 468228 628803 805299 544817 677726 898525 790528
13750G90528o6324Q2998k44918K08643L36j27529R950M3875P8033p9213J08352
$$ 790528 724204 807202 562284 770927 771263 643734 653684 697559 775592 696379 804731
13739H04731J12580j29460C63939M85470o9749P2611r9871L3963j44064K59255
$$ 804731 917311 787851 363939 849409 779660 852271 752400 786363 642299 901554
13729I01554k89867M92024n38053L8335J37085j40882J19312k39422K97776N9749
$$ 901554 611687 1103711 565658 603993 741078 600196 719508 480086 777862 837611
13719H37611l73423J87852P9916K8658l38327M9261Q7578K41182p8448p0366J3754
$$ 837611 464188 652040 731956 760614 422287 471548 559126 800308 721860 651494 665248
13708F65248m0640K04768k75639J92320j68602K41679C29041K60725J99159B90597
$$ 665248 624608 829376 553737 746057 577455 819134 329041 589766 788925 290597
13697A015044D81801L9408M9145J12931j89245q6475R6788K53890B17599J39482
$$ 1015044 481801 521209 570354 683285 494040 407565 504353 758243 217599 357081
13687C57081M06339q7494j69746k23675L0519l1800J11509Q3280K45505j53518
$$ 357081 763420 675926 506180 282505 313024 281224 392733 476013 721518 568000
13677E68000k11670L37709j52931k46603j19983N6042L78961j51277j63297L94009
$$ 568000 356330 694039 541108 294505 174522 230564 609525 458248 294951 688960
13667F88960k45115M7505N0604k33721n3227A20265N84002B93945j46591K39933
$$ 688960 443845 491350 541954 308233 255006 120265 704267 293945 147354 387287
13657C87287r5174p1126J71431O1695J3383J9774m3944j00477J999K08064p2969
$$ 387287 292113 220987 392418 454113 467496 487270 443326 342849 344848 552912 479943
13646D79943A90573L96489j60170K85590k25840K36696j83093k44210b8332C44127
$$ 479943 190573 587062 426892 712482 486642 723338 540245 296035 -28332 344127
13635D84076P7254k73734J88384L8536J76559k06582j95801k7693P2820L47798
$$ 484076 561330 287596 475980 514516 691075 484493 288692 260999 333819 681617
13625F81617k03829K51979n2067C28285L253N6884O9717K15078l3843k19159o2831
$$ 681617 477788 729767 677700 328285 331538 388422 458139 673217 639374 420215 357384
13614C57384M7677G2646J96009K05322B6074M18539M4296j41567M1360j21418
$$ 357384 405061 72646 268655 473977 26074 444613 488909 347342 388702 267284
13604B67284L51176D1154L06666J13949O4223J55166k27733M0405O4701E9555
$$ 267284 618460 41154 347820 461769 525992 681158 453425 493830 558531 59555
13593B99974N9833M62282j14074j41186A33448a079A87989J85521p8754n2645
$$ 299974 359807 822089 708015 566829 133448 -1079 187989 373510 294756 242111
13583B42111J6633J75973o8M1886o9125H3253j2939L28335A24108J7796M27704
$$ 242111 258744 434717 434649 476535 407410 83253 70314 398649 124108 141904 569608
13572E69608j35471J89963j09549k33026K68838k23656F66J87668K46906A8586
$$ 569608 434137 624100 514551 281525 550363 326707 666 188334 435240 18586
13561a42638B93375O8056R2147A05578L13146J03002j5247j34894J80997J06742
$$ -142638 293375 361431 453578 105578 418724 521726 506479 371585 552582 659324
13551F59324p0621L2285j95319Q8919J07231k13613A90503K44180r5400M8301
$$ 659324 588703 620988 425669 514588 621819 408206 190503 434683 339283 387584
13541C87584J24267A14836J1224O28320E7262O01411h6433a4993C84836q4065
$$ 387584 511851 114836 126060 754380 57262 658673 -86433 -14993 384836 300771
13531C00771b4492C52307j05896K19065O970j44467K2204N3988q8559K76009B68178
$$ 300771 -24492 352307 246411 465476 472446 327979 350183 404171 315612 591621 268178
13519B88853J91402A61857K47756K33442k80243a59818C18105K4485J94226B00226
$$ 288853 480255 161857 409613 643055 362812 -159818 318105 342590 536816 200226
13508A63082L55419j3750H6949C5258j1263M09433G8842J51112M01221B11425
$$ 163082 518501 504751 86949 35258 23995 433428 78842 229954 631175 211425
13497D29639A45179J63113b20976B68478L86730B50269N4875f843B5098J39901
$$ 429639 145179 308292 -220976 268478 655208 250269 305144 -6843 25098 164999
13487A64999j777o6684M15843A87701C252R8871j2993C4534K21614P8855k0238
$$ 164999 163222 96538 512381 187701 3252 102123 89130 34534 256148 335003 314765
13476C14765J63610A05354J94236J27325N2517I5136L22673B2422K1078L06480
$$ 314765 478375 105354 299590 426915 479432 95136 417809 22422 43500 349980
13466C49980r9371o0782B8783L84657j37066a28959A03094J96293j7396A25827
$$ 349980 250609 189827 28783 413440 276374 -128959 103094 299387 281991 125827
13455C25225J71548A47570b74985C07450h5410E43597A22128j9566L54527J163
$$ 325225 496773 147570 -274985 307450 -85410 543597 122128 102562 457089 458252
13445D58252A38335J44628r0652L20637k20192J00210j44591K13699n0009j14450
$$ 458252 138335 282963 192311 512948 292756 392966 248375 462074 412065 297615
13435B97615q2515J51294f3428B71090P0970m3799J58222j49148K45950k07864
$$ 297615 215100 366394 -63428 271090 342060 298261 456483 307335 553285 345421
13425C45421a23829i41A58162Q6648d4070G4798J87993K14395j67179D5046M09777
$$ 345421 -123829 -941 158162 244810 -44070 74798 262791 477186 310007 45046 454823
13414D54823a46056E86002A22997K49696i220I2872L6047Q2948J54959E8811M64865
$$ 454823 -146056 586002 122997 372693 -9220 92872 128919 211867 366826 58811 523676
13403E23676k36229K06232F3217J3380l4759K17524K9237J77034A40630B3227
$$ 523676 287447 493679 63217 76597 41838 259362 288599 465633 140630 23227
13392B77512r0217m9147R1675L48363k38844A64703o8458K15510q8104j5973I2722
$$ 277512 187295 138148 229823 578186 339342 164703 96245 311755 223651 207678 92722
13380E18078A19840M32641k54975j43138e4744A24578i2671C16440Q8568P1303
$$ 518078 119840 552481 297506 154368 -54744 124578 -92671 316440 405008 476311
13370D76311B07812F9347N11285k18162p3070A37095K79244p4665j34726p5400
$$ 476311 207812 69347 580632 362470 289400 137095 416339 341674 206948 131548
13360A31548K70985a18369B06560j00042a14325G71K45397c308A93389N48797
$$ 131548 402533 -118369 206560 106518 -114325 771 246168 -3308 193389 742186
13350G42186I6017K80127A75988M6032j139Q3197j45283O6163J23806N153j44138
$$ 742186 96017 376144 175988 222020 220881 304078 158795 224958 348764 353917 209779
13339B09779m492R5689N5181J01096p1334A17765K82853A30174K10197j24434
$$ 209779 205287 300976 356157 457253 385919 117765 400618 130174 340371 215937
13329B15937A00760K61773C9604L43108A69300M3213e3072A98812p5849l3445
$$ 215937 100760 362533 39604 382712 169300 212513 -53072 198812 122963 89518
13319H9518P309K30546j12283K49736g0918A59414O7952M9677n0049m568K1858
$$ 89518 96827 327373 215090 464826 -70918 159414 227366 277043 226994 222426 244284
13308B44284J52374J4357j32518a12978C06646N494A43243F4883F13M61669j31841
$$ 244284 396658 411015 278497 -112978 306646 312140 143243 64883 613 462282 330441
13297C30441J83768E358a77690C832a76379d3421H9376M35002B13875q5086J50668
$$ 330441 514209 5358 -177690 3832 -176379 -43421 89376 524378 213875 128789 279457
13286B79457j13469C4740e227q9866E27922B47377O139q1121B8592L06695A36598
$$ 279457 165988 34740 -5227 -95093 527922 247377 253516 172395 28592 335287 136598
13274C02437A29187a10021F2078a45779F0001J52907m595k7653m2613K1373J46423
$$ 302437 129187 -110021 62078 -145779 60001 212908 208313 180660 138047 159420 305843
13263C05843n2853j2253n2433h9776E24183B57413p5721N2612o3402a85773c2858
$$ 305843 252990 240737 188304 -89776 524183 257413 181692 234304 170902 -185773 -32858
13251f6819A55412p1252K36610j47470a69940J5515f9341c2478j24879a2173A46256
$$ -66819 155412 84160 320770 173300 -169940 -154425 -69341 -32478 -157357 -12173 146256
13239B26385k4447n2662R3760k4339i7616A65686J44474a18473F7593K66111A09022
$$ 226385 201938 149276 243036 218697 -97616 165686 310160 -118473 67593 333704 109022
13227b393G5857k99J39907r1228j1059l5365J06272a5968B45738N5031A46224
$$ -2393 75857 75558 215465 124237 113178 77813 184085 -15968 245738 300769 146224
13215C78140h5957A96038H3629a78777I4433I652K73759K22007a70741g0198N429
$$ 378140 -85957 196038 83629 -178777 94433 9652 283411 505418 -170741 -70198 -64769
13204f4769e787B816K96331f6289I1902J30935J85353k1665j75653Q8025M5300
$$ -64769 -5787 2816 299147 -66289 91902 222837 408190 386525 210872 298897 344197
13193C44197p5024m1979b84893A08225A0784J4604d5512B74410A35788a60922
$$ 344197 269173 227194 -284893 108225 10784 25388 -45512 274410 135788 -160922
13182A77967n7279i6860n941C4128J06929J41924D3656J55884J43225c7029B2568
$$ 177967 120688 -96860 -102801 34128 141057 282981 43656 199540 342765 -37029 22568
13170g880A79274K8381h8622A14677b03907H7873J03683M9120R8561J71334g4676
$$ -7880 179274 207655 -88622 114677 -203907 87873 191556 240676 339237 510571 -74676
13158A23688h3014A43545a91433P2541l9397H3849R1150C8679J0033e0236A62010
$$ 123688 -83014 143545 -191433 -118892 -158289 83849 174999 38679 48712 -50236 162010
13146g0615O164C92485j61874g3913H0445J39857h76E20715H0376a99376C56813
$$ -70615 -64451 392485 230611 -73913 80445 220302 -876 520715 80376 -199376 356813
13134g8691l43k42462C14558j24852a00476B28226J66631j1259a16720C01386
$$ -78691 -79034 -321496 314558 189706 -100476 228226 394857 383598 -116720 301386
13123G8614b3397B70983h1693H7695c8916j01844a4275D28053E3130L4543J64128
$$ 78614 -23397 270983 -81693 87695 -38916 -140760 -14275 428053 53130 87673 251801
13112B51801I6985R122L00858F6520a13193j6276A25245L83155b19380C37349
$$ 251801 96985 106107 406965 66520 -113193 -129469 125245 508400 -219380 337349
13101B07020K01889j84819p045g4614j6831A20075A5302e9859C8956j0405J25527
$$ 207020 408909 224090 217045 -74614 -91445 120075 15302 -59859 38956 28551 154078
13090A54078k7853B9024K44530b42127a19295F7292J86044G5478J6904J39413
$$ 154078 126225 29024 273554 -242127 -119295 67292 253336 75478 92382 231795
13080B31795a8067r0994a1230B15621p3544C2930K07327l3842J72524d1817j87217
$$ 231795 -18067 -109061 -11230 215621 142077 32930 240257 206415 378939 -41817 -229034
13069b29034C82534A80059b04150A86876a66214B11462o0395J70104f246A70401
$$ -229034 382534 180059 -204150 186876 -166214 211462 151067 321171 -6246 170401
13058B07641j8066J88047e9383a7189n5978C48094A3789G98K14610d6476A25582
$$ 207641 189575 377622 -59383 -17189 -73167 348094 13789 798 215408 -46476 125582
13046A5342a10491m1851H0342J82284f7469E2192b75339a4001l7941j52961i9003
$$ 15342 -110491 -152342 80342 262626 -67469 52192 -275339 -14001 -51942 -204903 -99003
13034D61632A91430c05767A79471G8518L1370L90520E7405d4956J2968H8420K69807
$$ 461632 191430 -305767 179471 78518 109888 500408 57405 -44956 -31988 88420 358227
13023C58227j09946O7629B8665J39980C401M07656I5375K4842a2591E2435P2024
$$ 358227 248281 315910 28665 168645 3401 411057 95375 120217 -12591 52435 124459
13012A24459J53579C1161K61941a36474A49735h013F1203c3038k87307I3343c0869
$$ 124459 278038 31161 293102 -136474 149735 -8013 61203 -33038 -320345 93343 -30869
13000b52664A313a22504I517J58323j8486K2538D1605d1876m9840A31a36766A8092
$$ -252664 1313 -122504 9517 167840 149354 171892 41605 -41876 -91716 131 -136766 18092
12987f5770j20611C92756P2456j54992r6497R3927j09190c4601j11052B45485
$$ -65770 -186381 392756 465212 310220 213723 307650 198460 -34601 -145653 245485
12976a7292c90n4123k69509C15088a22823J2313D1758K1989J06749p665o044A5381
$$ -17292 -390 -54513 -324022 315088 -122823 -110510 41758 63747 170496 162831 156787 15381
12963c0027A04325C8025K4430k2405J23859R3980b6815B66932J00576j31396k9308
$$ -30027 104325 38025 62455 40050 163909 257889 -26815 266932 367508 236112 206804
12952B06804A8036e8101l87309B84248b26736A5024b8134B61508b2533G7290O5615
$$ 206804 18036 -58101 -445410 284248 -226736 15024 -28134 261508 -22533 77290 142905
12941A42905M4869r641G6412J93535a69652d6187q8171B84468b6339k01912a8443
$$ 142905 187774 178133 76412 269947 -169652 -46187 -134358 284468 -26339 -228251 -18443
12929c101k26920B5795b00755h5043B23200n4079i458p4827F6879i0133l760I7197
$$ -3101 -230021 25795 -200755 -85043 223200 169121 -9458 -84285 66879 -90133 -93893 97197
12916b00419B84083p8615G0299K35989n3424a80451A27702J28668L4072b60009
$$ -200419 284083 205468 70299 306288 252864 -180451 127702 256370 290442 -260009
12905A25338c06056J09230A85154J25990a76044L3913N8879A9125J87115c94212
$$ 125338 -306056 -196826 185154 311144 -176044 -142131 -83252 19125 206240 -394212
12894h7482A1250b27512A6312J11444c3093k22267A8107a300A72096a29890C40016
$$ -87482 11250 -227512 16312 127756 -33093 -255360 18107 -1300 172096 -129890 340016
12882C42939B6606O0695j672P6538N0879a19820F5220j8554J91395I1565a74414
$$ 342939 26606 87301 85629 162167 213046 -119820 65220 46666 238061 91565 -174414
12870D06293e9677B4759a43555A65694a51116A6017N11680g8951A98474F9583
$$ 406293 -59677 24759 -143555 165694 -151116 16017 527697 -78951 198474 69583
12859b37060c4113A35318e5718A34395a41434A53875a43880r9582K4132b3554
$$ -237060 -34113 135318 -55718 134395 -141434 153875 -143880 -243462 -219330 -23554
12848e9296a6751j04240r8446c5716B40790K48013C3787a32951A14968B1824K10071
$$ -59296 -16751 -120991 -219437 -35716 240790 488803 33787 -132951 114968 21824 231895
12837B31895q4325A5585P5710c9655n7821j11258B41304a6854j2395A62265e976
$$ 231895 147570 15585 91295 -39655 -97476 -208734 241304 -16854 -29249 162265 -5976
12825H8178J57203b09162g0524m22072A7033a91356P1972j63726a26506A35660
$$ 88178 245381 -209162 -70524 -492596 17033 -191356 -119384 -283110 -126506 135660
12814a11746E4485R1596F050J01031a32177F0342j3150i3999A21829D5230K5096
$$ -111746 54485 146081 6050 107081 -132177 60342 47192 -93999 121829 45230 70326
12803G0326k1112a34242M4301d4876F5543Q9099Q4569J47153A91148A8322f6940
$$ 70326 49214 -134242 -89941 -44876 65543 154642 239211 386364 191148 18322 -66940
12791A95468j3826l4791K37932a51053L0666A39972b32171B72707q0386a19675
$$ 195468 181642 146851 384783 -151053 -120387 139972 -232171 272707 192321 -119675
12780A06834C4400J27321n8548a69890j5562D5546B2424L56987j22399a09114
$$ 106834 34400 161721 103173 -169890 -185452 45546 22424 379411 257012 -109114
12769a30188N0969G9424g8614A51027K09117A34091E1279L01237A18789n0250
$$ -130188 -79219 79424 -78614 151027 360144 134091 51279 352516 118789 68539
12759F8539a85718C07071d7764R649C0265J82371a09500L7250B01695c585H563
$$ 68539 -185718 307071 -47764 -38115 30265 212636 -109500 -72250 201695 -3585 8563
12747a91310A99959b52569e4108C38489B1697J11120G192K8176J35216K2440j6168
$$ -191310 199959 -252569 -54108 338489 21697 132817 7192 35368 170584 193024 176856
12736A76856a23403H2300m439J0363f4370D157a87116f2822K6669H0312N9956
$$ 176856 -123403 82300 77861 88224 -64370 4157 -187116 -62822 -36153 80312 140268
12725A40268F7625a3116C8082K56472J36902a9472B2758j0821K85135n096h4417
$$ 140268 67625 -13116 38082 294554 431456 -19472 22758 11937 297072 291976 -84417
12713A55767i1981j31396C12495I2953K11741j05328Q9117j27645d1710A18079
$$ 155767 -91981 -223377 312495 92953 304694 199366 288483 160838 -41710 118079
12702C36463A23673K92030A7515a05367j04646G7493O4128a22663B64727C7653
$$ 336463 123673 415703 17515 -105367 -210013 77493 141621 -122663 264727 37653
12691a63770n3347D34599a90576A5837M1493a51969A06411k3521L45114b6719
$$ -163770 -217117 434599 -190576 15837 57330 -151969 106411 82890 428004 -26719
12680I8707P6110K03453A05704f7584K9139D4502P4552c7551H6288P420J17179
$$ 98707 174817 378270 105704 -67584 -38445 44502 119054 -37551 86288 93708 210887
12669B10887p5096a53941A61371a9942F7886J63316q4691J07441a20337p8118
$$ 210887 135791 -153941 161371 -19942 67886 231202 146511 253952 -120337 -198455
12659a98455C79527j57413a26967B95771j13172a02123A49689M5962a00666B8246
$$ -198455 379527 222114 -126967 295771 182599 -102123 149689 195651 -100666 28246
12648D61792b0997A28820k0500k7567j5612J07639q4084J38430I6898J14884c9098
$$ 461792 -20997 128820 108320 80753 65141 172780 88696 227126 96898 211782 -39098
12636b11035h6796A20717j1920N80765B53777L5263b62984A38662a62875H4807
$$ -211035 -86796 120717 108797 689562 253777 289040 -262984 138662 -162875 84807
12625B29750J20008K5063G377Q7513E559a81740C18153j38895K76514j29845E617
$$ 229750 349758 374821 7377 94890 5559 -181740 318153 179258 455772 325927 5617
12613I8165L6454h5459B89879C2599K23297j16700J70773a10421m1317f9622B14088
$$ 98165 134619 -85459 289879 32599 255896 139196 309969 -110421 -151738 -69622 214088
12601b95141H2587K63449A56336J7873l4744D902M57386a23179A94893I3175J49999
$$ -295141 82587 346036 156336 174209 139465 4902 462288 -123179 194893 93175 243174
12590B43174F6096I423K3345f2669n6044m5006Q663D5656a94827A19172J48630
$$ 243174 66096 9423 32768 -62669 -118713 -163719 -155056 45656 -194827 119172 267802
12579B67802j23641a25032B07634a59591A55532a34875C56795a2399A10464l9138
$$ 267802 144161 -125032 207634 -159591 155532 -134875 356795 -12399 110464 71326
12569G1326J30614m3741G2081a45939E4269c2219G2057C3952e4159C02193a60582
$$ 71326 201940 158199 72081 -145939 54269 -32219 72057 33952 -54159 302193 -160582
12557A84371d7262C30389a32652c6556G7779c9478j20879L2007C06626p5525F4599
$$ 184371 -47262 330389 -132652 -36556 77779 -39478 -160357 -128350 306626 231101 64599
12545I42c6114j27167A20179M4617a7304B46208a4811j55171q1810J3503a9380
$$ 942 -36114 -163281 120179 164796 -17304 246208 -14811 -169982 -251792 -238289 -19380
12533H0858c10896A41743L946L293P0577A8830r368J76788b30081O7715A38767
$$ 80858 -310896 141743 145689 148982 219559 18830 9462 186250 -230081 -162366 138767
12521F3748J97613r3309a87150I8214d3032m6307j72433Q3070b5629k3738j61500
$$ 63748 261361 168052 -187150 98214 -43032 -89339 -261772 -178702 -25629 -49367 -210867
12510b10867I2285A6699J27912I586b0841A22867a23720n9843k52465B9273g7284
$$ -210867 92285 16699 144611 9586 -20841 122867 -123720 -183563 -436028 29273 -77284
12498d41603I6423J585m0312J3638i8209A2398b76386N7586M7531q9211O9389
$$ -441603 96423 98008 57696 71334 -98209 12398 -276386 -218800 -171269 -260480 -191091
12487a91091P693a6281A44908p0330J30619J17352b19166k3724e0393A05553r213
$$ -191091 -183398 -16281 144908 74578 205197 322549 -219166 -242890 -50393 105553 96340
12476I6340A337a69698D91659b62958C38252g0827A94660J47735a6045k7826A42680
$$ 96340 1337 -169698 491659 -262958 338252 -70827 194660 342395 -16045 -43871 142680
12464a3581j5443j10007a4407j32831g1869J1454A9072d3891D0831b0458Q185
$$ -13581 -29024 -139031 -14407 -147238 -71869 -60415 19072 -43891 40831 -20458 -12273
12453a2273j22524A93687b66370J26978I1280K28114j27482b11137c3978A49786
$$ -12273 -134797 193687 -266370 -139392 91280 319394 191912 -211137 -33978 149786
12442b25198N6375k8122B2828b1005A35592a54372L2831e4065b0571q0788C82928
$$ -225198 -168823 -196945 22828 -21005 135592 -154372 -121541 -54065 -20571 -101359 382928
12430c8439B47683C6934j1924K41776b4500C1906R5571E9709b9698m6987j24604
$$ -38439 247683 36934 25010 266786 -24500 31906 127477 59709 -29698 -76685 -201289
12419b01289A33918E7140c565B64818c4279r1035k85716I6286C1388Q0620l9200
$$ -201289 133918 57140 -3565 264818 -34279 -125314 -411030 96286 31388 112008 72808
12408G2808b04586n4679e0200r668j84438k3919F1287b9515F6139B3346a55273
$$ 72808 -204586 -259265 -50200 -59868 -244306 -268225 61287 -29515 66139 23346 -155273
12396c12045B53564b28671J11485a1824C13986G1877k7966P2629K1137m2379b27680
$$ -312045 253564 -228671 -117186 -11824 313986 71877 43911 116540 137677 95298 -227680
12384A66030a09095H9649A8249J06772l0846l0883b33634h9206f137k64183C60331
$$ 166030 -109095 89649 18249 125021 94175 63292 -233634 -89206 -6137 -270320 360331
12372a52190A85692G7060a20879e9121F75557C09241D9010b4687K528C57484b7780
$$ -152190 185692 77060 -120879 -59121 675557 309241 49010 -24687 -22159 357484 -27780
12360A56683R6018o1782g6743D9397a7811j18850b9883p8588n4155a246r6865
$$ 156683 252701 190919 -76743 49397 -17811 -136661 -29883 -108471 -162626 -1246 -98111
12349i8111J1970j31562b6439n7826B42783h0286B13465N7002B9012a28159G3064
$$ -98111 -86141 -217703 -26439 -84265 242783 -80286 213465 270467 29012 -128159 73064
12337A33930b2047A66773a28460L229A9345K59789g2312a131C7611b14503h4369
$$ 133930 -22047 166773 -128460 -125231 19345 279134 -72312 -1131 37611 -214503 -84369
12325b56901O9466A10057b51778k719K3346A13333M2518A8984b421k29587d9767
$$ -256901 -187435 110057 -251778 -254497 -231151 113333 155851 18984 -2421 -232008 -49767
12313C22759d9996o3607A06968d9522j6556b2033H2179a15403c275j41743D4558
$$ 322759 -49996 -113603 106968 -49522 -66078 -22033 82179 -115403 -3275 -145018 44558
12301A22281A4076b01407h4647k05619J050c0917n9107j1881B36587o2756k7090
$$ 122281 14076 -201407 -84647 -290266 -289216 -30917 -90024 -101905 236587 173831 146741
12290A46741N0794a86693j19583h3061I89P5033K04952b76749b2891B54551m9887
$$ 146741 197535 -186693 -306276 -83061 989 76022 280974 -276749 -22891 254551 204664
12279B04664J03263b76005A62280p7767P37b0826A47927J53857d9238D0251i4192
$$ 204664 307927 -276005 162280 84513 85250 -20826 147927 301784 -49238 40251 -94192
12267A63894q0427a18510B17920g8662B34454g0341C07904a54447e2382K3415
$$ 163894 83467 -118510 217920 -78662 234454 -70341 307904 -154447 -52382 -28967
12257b8967a0345B10984D2078d492A03628a48635B37763a14264j14259A63547
$$ -28967 -10345 210984 42078 -4492 103628 -148635 237763 -114264 -228523 163547
12246D02306j31586a14930B01012L5345C3681l620d3801m1855q2145B11562P596
$$ 402306 270720 -114930 201012 236357 33681 30061 -43801 -85656 -167801 211562 219158
12235B19158b1990H5669R8947A5636M6776L2723L43841m9663F1019O4470a25826
$$ 219158 -21990 85669 184616 15636 62412 95135 438976 389313 61019 125489 -125826
12223D0797J95359j4405J85301j48796O344r6690d8481C57125j70620f409B01690
$$ 40797 236156 221751 407052 258256 264600 167910 -48481 357125 186505 -6409 201690
12211B26749j2993a24814d8159H7673M3749K10982J7149l6401a54049O9759G1168
$$ 226749 213756 -124814 -48159 87673 131422 342404 359553 323152 -154049 -84290 71168
12199D60821k13125j8957A6833N06488j60633M1545j93749J7914e3171C39768
$$ 460821 247696 228739 16833 523321 362688 404233 210484 228398 -53171 339768
12188A65948J68152G7859K4840A9376K99859b5191r7226G1338p893L24401A11509
$$ 165948 334100 77859 102699 19376 319235 -25191 -122417 71338 63445 387846 111509
12176F9108A0989R285n89a39564B66960B2453J10940h5380j7792I7720M8010f5027
$$ 69108 10989 20274 19685 -139564 266960 22453 133393 -85380 -103172 97720 145730 -65027
12163A02398K01205h262j09240n028A47044D6445a01160B25226a13772l15270
$$ 102398 303603 -8262 -117502 -122530 147044 46445 -101160 225226 -113772 -429042
12153d29042b2686H0811c5320B82136j10136a32071A51410c1971k8131h292A57514
$$ -429042 -22686 80811 -35320 282136 172000 -132071 151410 -31971 -60102 -8292 157514
12141A72452B7137J98020O758a11107L6063A34561J6688a46153K0742B63693a49417
$$ 172452 27137 225157 231915 -111107 -75044 134561 151249 -146153 -125411 263693 -149417
12129A1908b33495n968d2776A43147j5638c02691j13290B03862F3860a30261p9912
$$ 11908 -233495 -239463 -42776 143147 127509 -302691 -415981 203862 63860 -130261 -210173
12118b10173R6749B50147A00900d7002j39375a9795k49847E48525A23210J59567
$$ -210173 -113424 250147 100900 -47002 -186377 -19795 -269642 548525 123210 282777
12108B82777f0168A58134J0454L24895A33731m5676B8596J41971H1199a32216
$$ 282777 -60168 158134 168588 493483 133731 88055 28596 170567 81199 -132216
12097b6617r183m274B9388a64155b6486A03014g6641p3691j33166I1138h6186
$$ -26617 -35800 -40074 29388 -164155 -26486 103014 -76641 -150332 -283498 91138 -86186
12085b50045I0146F200K30571b45590a04354A99269b9695B57669L27610J016321
$$ -250045 90146 6200 236771 -245590 -104354 199269 -29695 257669 585279 1601600
12075A601600j28353E60126k66205R9822a17113F3649a27085j3817j0981H2802
$$ 1601600 1473247 560126 293921 393743 -117113 63649 -127085 -140902 -151883 82802
12064C8426c9688k99230e1518I2425L3831g7414b3786P550A08845k6141c23966
$$ 38426 -39688 -338918 -51518 92425 126256 -77414 -23786 -16236 108845 82704 -323966
12052b74169i5023B33621C5289g326l2079A12634c7330k78293B02300o8776J03182
$$ -274169 -95023 233621 35289 -7326 -39405 112634 -37330 -315623 202300 133524 236706
12041B36706a13758B72652b15584D68179D1159a81833n5622D3603a15200L991
$$ 236706 -113758 272652 -215584 468179 41159 -181833 -237455 43603 -115200 -111209
12031a11209F4682a43016A29873Q9413c52969a59900n5634A18507d689H9662O57
$$ -111209 64682 -143016 129873 219286 -352969 -159900 -215534 118507 -4689 89662 90319
12020I0319C4606a75506h687C45518f7867c3387A25138P8118b9844E7573J96072
$$ 90319 34606 -175506 -8687 345518 -67867 -33387 125138 203256 -29844 57573 253645
12009B53645F55J0012Q4476p608a5399j66869K5096B52065c3737k41571C7732
$$ 253645 655 10667 95143 87535 -15399 -182268 -157172 252065 -33737 -275308 37732
11997c14703A54949c467r7896q3a011p4191j8125n3763p1731A04065a76469B60218
$$ -314703 154949 -3467 -101363 -101446 -1011 -75202 -93327 -147090 -218821 104065 -176469 260218
11984B48876a91658A37415a16533D60315b00286H7364M1621n6899J65829I4630
$$ 248876 -191658 137415 -116533 460315 -200286 87364 128985 72086 237915 94630
11973a37115j80206R9059A23158b77229B13462E7336b1707C9031a08756C7934
$$ -137115 -317321 -218262 123158 -277229 213462 57336 -21707 39031 -108756 37934
11962C07740H5492h1824l5401b7940j47161D6147f4734b6166B39448f4356A60975
$$ 307740 85492 -81824 -117225 -27940 -175101 46147 -64734 -26166 239448 -64356 160975
11950e8657B22192p5006a60166L5769j41147f7743D7364L5781a63838j70369a26318
$$ -58657 222192 147186 -160166 -124397 -265544 -67743 47364 83145 -163838 -334207 -126318
11938b16008A17561K2987l9992a41541K202N986D54391I2756K11223f239D9088
$$ -216008 117561 140548 100556 -141541 -139339 -133353 454391 92756 303979 -6239 49088
11926h9834C16953m9821E3377b54164C47591a50424A00345e9031l1059A50725
$$ -89834 316953 267132 53377 -254164 347591 -150424 100345 -59031 -90090 150725
11915A341J029e7625C1107J03505b95242I8005a77720L4430l6163B86038a24058
$$ 1341 2370 -57625 31107 134612 -295242 98005 -177720 -143290 -179453 286038 -124058
11903C6976b4650p2869M4924B00102a40619B841K2494K29885j6158g6745J1763
$$ 36976 -24650 -97519 -52595 200102 -140619 2841 25335 255220 239062 -76745 -64982
11892f4982F9659c84216A55135n1074b07589C87988j66176a14986e3984l4199
$$ -64982 69659 -384216 155135 104061 -207589 387988 221812 -114986 -53984 -88183
11882h8183j15819f940r3109Q765p5596B6730e7162A66672A1214J91888b08992
$$ -88183 -204002 -6940 -100049 -91284 -166880 26730 -57162 166672 11214 203102 -208992
11870b08430L322g4647G368J269h0720o4426N4966A06814k0452a16576o875f0031
$$ -208430 -205108 -74647 7368 8637 -80720 -145146 -90180 106814 86362 -116576 -123451 -60031
11857A03889P7020j9948n4808c71173H8979a84641C69123A21551h4391l32407
$$ 103889 180909 160961 106153 -371173 88979 -184641 369123 121551 -84391 -416798
11847d16798A2888J48815g7152l36886a69C35826g9515b0685k06414F2522A1259
$$ -416798 12888 161703 -77152 -414038 -169 335826 -79515 -20685 -227099 62522 11259
11835C6344e0759B10822h7114n5043A3445a50721m9664A56993a29408H9523k284
$$ 36344 -50759 210822 -87114 -142157 13445 -150721 -200385 156993 -129408 89523 87239
11824H7239c01237K7962e785F7972J11366A5928b15876g1481A96340a67992j31762
$$ 87239 -301237 -273275 -5785 67972 179338 15928 -215876 -71481 196340 -167992 -299754
11813b99754F5226a6392B79940j03749e7321l12709g1335A01311f7705A519J25082
$$ -299754 65226 -16392 279940 176191 -57321 -370030 -71335 101311 -67705 1519 126601
11802A26601b80608C6246a19058a8188j03880C8854c72089J23244B57449f3500
$$ 126601 -280608 36246 -119058 -18188 -122068 38854 -372089 -248845 257449 -63500
11791C0270b27106D3467b02531I6934h8976c2461o4694L9693a5792B956L14904
$$ 30270 -227106 43467 -202531 96934 -88976 -32461 -97155 -57462 -15792 2956 317860
11780C17860r5433c39495J25000B1900a76622C32022A13097b9397n5935j83824
$$ 317860 222427 -339495 -214495 21900 -176622 332022 113097 -29397 -85332 -269156
11770b69156A14473c38503B01141C4552P5197f5957A39649b28741D2390a73996
$$ -269156 114473 -338503 201141 34552 109749 -65957 139649 -228741 42390 -173996
11759I400a40770A37227J54165I917a60171c9279o3544k38881F2301b03407A42051
$$ 9400 -140770 137227 291392 9917 -160171 -39279 -102823 -341704 62301 -203407 142051
11747a15269j2636B15339G5845a9550B2216a8861o6335A33348b35371a8939k00558
$$ -115269 -127905 215339 75845 -19550 22216 -18861 -85196 133348 -235371 -18939 -219497
11736b19497I1111g7398A96745q7937P1236a16918g922j98170A45183J7696J41341
$$ -219497 91111 -77398 196745 108808 180044 -116918 -7922 -206092 145183 162879 304220
11725C04220D3189a11603A95933c928l01499h2422B24969a69009C61942F532J96164
$$ 304220 43189 -111603 195933 -3928 -305427 -82422 224969 -169009 361942 6532 202696
11714B02696p5299a33301e3359c824r282l53101C03776a86103I6937N8560a24267
$$ 202696 127397 -133301 -53359 -3824 -13106 -366207 303776 -186103 96937 155497 -124267
11702b37026Q3557l34363a20629H0915l7573B282a45860j56073A21646c64378
$$ -237026 -153469 -487832 -120629 80915 43342 2282 -145860 -301933 121646 -364378
11691a79335I8641C0924b17000i1707j50359B15862m1637b9864A22170L44529
$$ -179335 98641 30924 -217000 -91707 -242066 215862 174225 -29864 122170 466699
11681D66699a09223A18324e3090r896A64707c0554k62585F8816a68815B89954
$$ 466699 -109223 118324 -53090 -62986 164707 -30554 -293139 68816 -168815 289954
11670d0816m7971c5985r0130A27892o2487K9753f2714b5039l5255B50120i2173
$$ -40816 -88787 -35985 -126115 127892 65405 95158 -62714 -25039 -60294 250120 -92173
11658H915J94814E7552c3894A44708n5085k1506J40886k6831A0717N6840N3958
$$ 8915 203729 57552 -33894 144708 89623 68117 209003 182172 10717 67557 121515
11647A21515J37873a42050b6029A0336g7441k63109a09747a6212p6876M0457F7426
$$ 121515 259388 -142050 -26029 10336 -77441 -340550 -109747 -16212 -93088 -52631 67426
11635a57743F0662a59366d5168A96826D7371K92064G0354a54944d4172a6295A51672
$$ -157743 60662 -159366 -45168 196826 47371 339435 70354 -154944 -44172 -16295 151672
11623A18990m1014M3519f8765A70366g9996j1915B07559I1544b10645j17444e5594
$$ 118990 77976 121495 -68765 170366 -79996 -91911 207559 91544 -210645 -328089 -55594
11611c33102E8889J31374d1509C0352J33840k1526c89451A17203J15292O2828
$$ -333102 58889 190263 -41509 30352 164192 142666 -389451 117203 232495 295323
11601B95323H3941k843A6351K4214f8186F300J14933L2977a60157G5173h0140
$$ 295323 83941 81098 16351 40565 -68186 6300 121233 154210 -160157 75173 -80140
11589a624A60030G9055c02913A67969a14457B01617M4435j16821K37170b62177
$$ -1624 160030 79055 -302913 167969 -114457 201617 246052 129231 366401 -262177
11578A56944c1296B01394L3263j12916N4110K99727a32175A20969b26812J066
$$ 156944 -31296 201394 234657 121741 175851 475578 -132175 120969 -226812 -225746
11568b25746m7241A68721h2961B25509E1008J97462H9331G712P5346A0458a2321
$$ -225746 -272987 168721 -82961 225509 51008 248470 89331 7712 83058 10458 -12321
11556a38653A43495a33146a2094I0348d5457C28598A49600a33698n5170h9721
$$ -138653 143495 -133146 -12094 90348 -45457 328598 149600 -133698 -188868 -89721
11545D10992f6990a1274B06042a69392B42917J16875d2173m0740A87824K88727
$$ 410992 -66990 -11274 206042 -169392 242917 359792 -42173 -82913 187824 476551
11535D76551a7047G3646J96279p9762b97579E5105P7174B6660M0260I006h1213
$$ 476551 -17047 73646 269925 190163 -297579 55105 132279 26660 66920 9006 -81213
11523A63405e0842n6487F518J06184j6338c5105J5433B91366a1051k1701A76258
$$ 163405 -50842 -107329 6518 112702 96364 -35105 -19672 291366 -11051 -32752 176258
11511G9338J24347L4320l9517R4362b47821i8380B35978J60088B4965L61051C5873
$$ 79338 203685 238005 198488 292850 -247821 -98380 235978 396066 24965 386016 35873
11499A47025L9939L30894B36190J5353J13810h9779l6898A74833J36834f5297
$$ 147025 186964 517858 236190 251543 365353 -89779 -126677 174833 311667 -65297
11488A02670f2167B15539j07683K4835J49808a06610D96344i3878m3228N3965
$$ 102670 -62167 215539 107856 132691 282499 -106610 496344 -93878 -137106 -83141
11478h3141A88530C2587J87956a98624O8802D6200O4553M8045o0882C9126L44082
$$ -83141 188530 32587 220543 -198624 -129822 46200 110753 158798 97916 39126 383208
11467C83208I5895a8619F1537K25612I8884a16327C49094j06479Q6498k9476j44974
$$ 383208 95895 -18619 61537 287149 98884 -116327 349094 242615 329113 299637 154663
11456A54663K11159c20174d6204J4974B79780E7746L70469k01518r9973j4080
$$ 154663 365822 -320174 -46204 -31230 279780 57746 428215 226697 126724 112644
11446A12644i7238A35867b57423C26991b9475q8607j4571E5993d0249k4595n6096
$$ 112644 -97238 135867 -257423 326991 -29475 -118082 -132653 55993 -40249 -64844 -120940
11435a20940H9300L225J75988B4506i1375D1996J5140L6717a69099F5604J5740
$$ -120940 89300 92525 268513 24506 -91375 41996 57136 93853 -169099 65604 81344
11424H1344M0643N8506l1675b43492A72391b2539A18695c9012g909o9623A16412
$$ 81344 121987 180493 148818 -243492 172391 -22539 118695 -39012 -7909 -77532 116412
11412A17479a98661F0885Q7868n1904e18303B34456L3350G2442J30118c1311A19068
$$ 117479 -198661 60885 148753 96849 -518303 234456 267806 72442 202560 -31311 119068
11400A72097P7030a9342E9381g2288A39041a7504B27750e9369D5707d9653j98
$$ 172097 249127 -19342 59381 -72288 139041 -17504 227750 -59369 45707 -49653 -49851
11389d9851A9645a7736k54788r1800A58143e6733A64922A7027K16615A6198c16963
$$ -49851 19645 -17736 -272524 -364324 158143 -56733 164922 17027 233642 16198 -316963
11377a94426a1548l55689A19721b13839K9695d3184B80392Q442g3044l00579a02996
$$ -194426 -11548 -367237 119721 -213839 -184144 -43184 280392 288834 -73044 -373623 -102996
11365a91117j80963N6818J02866g2316j57128A57230d4801k58315G0959c1380
$$ -191117 -372080 -315262 -212396 -72316 -229444 157230 -44801 -303116 70959 -31380
11354a30377A57236f2803n9146B38090a82810f4339p5491C25152G4209b50823
$$ -130377 157236 -62803 -121949 238090 -182810 -64339 -139830 325152 74209 -250823
11343B46752K12637A25129A3879J18752o4149b38847l1676g1065j37066R2776
$$ 246752 459389 125129 13879 132631 68482 -238847 -270523 -71065 -208131 -115355
11333a15355q6956B9940c20457A0049a40591k0705H3873J28674h5797G0786Q5476
$$ -115355 -202311 29940 -320457 10049 -140591 -161296 83873 212547 -85797 70786 156262
11322A56262g0030l74479J61052J11164A62341b02257A11679L03058f1001j58281
$$ 156262 -70030 -444509 -283457 -172293 162341 -202257 111679 414737 -61001 -219282
11312b19282N3379A5450J11594a18513a9458E8284A2016J70618C4626a56749e5062
$$ -219282 -165903 15450 127044 -118513 -19458 58284 12016 182634 34626 -156749 -55062
11300E7100b0616A7850c10174K6976Q1417B05973I6618B0080b90354H7777R205
$$ 57100 -20616 17850 -310174 -283198 -201781 205973 96618 20080 -290354 87777 96982
11289I6982a19817j48315g0694b8722l04180a00537L4125j85738b2397j77898
$$ 96982 -119817 -268132 -70694 -28722 -332902 -100537 -66412 -252150 -22397 -200295
11279b00295Q5096B38822h3053D17454A87328e8118A20739a58342A03899a20742
$$ -200295 -115199 238822 -83053 417454 187328 -58118 120739 -158342 103899 -120742
11268b71666j62607a98069h7233A96673a50105A41608b96917A92143Q0764C7502
$$ -271666 -434273 -198069 -87233 196673 -150105 141608 -296917 192143 272907 37502
11257H9534N2704A6671a76694e7414j69744C29293b92568K8546i6829k6322k0353
$$ 89534 142238 16671 -176694 -57414 -227158 329293 -292568 -264022 -96829 -123151 -143504
11246a43504k02718g351k6761H978J26842r044L9855C6124b29426F6981i117E9959
$$ -143504 -346222 -7351 -34112 8978 135820 126776 166631 36124 -229426 66981 -9117 59959
11233b0l3847p5459I085b09383j78223G1672B5280b24709B98679e4843n5564I5476
$$ -20 -33867 -109326 9085 -209383 -387606 71672 25280 -224709 298679 -54843 -110407 95476
11220A04582a31170K6486A1598K9565k0357M627i0607j35104F8224A7806J31436
$$ 104582 -131170 -104684 11598 41163 20806 25433 -90607 -225711 68224 17806 149242
11209A49242J6946J27621F9778A8879N3500J33939b2298H4447g6262H6657b91678
$$ 149242 166188 293809 69778 18879 72379 206318 -22298 84447 -76262 86657 -291678
11197A67332q0202k2212j7590N8735N1606G5326d01309A59858c1939A1874a69068
$$ 167332 87130 64918 47328 106063 157669 75326 -401309 159858 -31939 11874 -169068
11185a09689P617M0824o433j62033J00530q0918J6365o9886j01852G0012i2384
$$ -109689 -102072 -61248 -67681 -229714 -129184 -210102 -193737 -263623 -365475 70012 -92384
11173F5571e4138j43166k32524A64557e2307n1667J6000F5586a33037M6894K2393
$$ 65571 -54138 -197304 -429828 164557 -52307 -103974 -87974 65586 -133037 -86143 -63750
11162f3750A55642E0617f2562A67160Q6476b7546A62280C3462b29058I7625b32318
$$ -63750 155642 50617 -62562 167160 253636 -27546 162280 33462 -229058 97625 -232318
11150A9341J51171b73580C39773h3952B3664N6200a70288C34036c97360e1061
$$ 19341 170512 -273580 339773 -83952 23664 79864 -170288 334036 -397360 -51061
11139a07538M4125l986E2576d7493D0431Q3197C1337R8051a4644r3778A97929
$$ -107538 -63413 -67399 52576 -47493 40431 123628 31337 129388 -14644 -108422 197929
11127a9648C97842h0231r2326P4597M631j04380d5012F634L23356h1953A56748
$$ -19648 397842 -80231 -172557 -97960 -93329 -197709 -45012 6634 329990 -81953 156748
11115A25657b13424A18421a4910F2439b00991D28311B8592J19227a89940b530
$$ 125657 -213424 118421 -14910 62439 -200991 428311 28592 147819 -189940 -2530
11104A53863J75238q4650d5496i773j17484N3651B98205J22342e0121B22981d4372
$$ 153863 329101 244451 -45496 -9773 -127257 -73606 298205 420547 -50121 222981 -44372
11092C64759F0080J66698H7891N3702a38878B89894A2213L96163A55806a36122
$$ 364759 60080 226778 87891 141593 -138878 289894 12213 408376 155806 -136122
11081A55841K00244q5842m4303C7814K37753H3594a04540C41545j11149M4279
$$ 155841 356085 270243 225940 37814 275567 83594 -104540 341545 230396 274675
11071B74675D1237K11411L44624B29030M39150C14827Q8958A16201r851J83102
$$ 274675 41237 252648 597272 229030 668180 314827 403785 116201 106350 289452
11061B89452l6735l3537L58025j99241K38400O7293K24359l92449k0751M6081
$$ 289452 252717 219180 577205 377964 616364 683657 908016 515567 494816 540897
11051E40897J96094k13946M08708m6259k61066J26295P0432P5927k63567K19872
$$ 540897 736991 523045 931753 885494 624428 750723 821155 897082 633515 853387
11041H53387j14440p713j08119j00732J74113J69608m15895j54208N07088l29537
$$ 853387 738947 731234 623115 522383 696496 866104 450209 296001 803089 473552
11031D73552M26188k75756J20618m5819k15131J05859Q7707R7709n122J09878
$$ 473552 899740 623984 744602 698783 483652 589511 677218 774927 769805 879683
11021H79683l35347O3231L5855j94695N7163M92725l43916k6188k12353L46608
$$ 879683 544336 607567 643422 448727 505890 998615 654699 628511 416158 762766
11011G62766l5628p6466j69816K2606J8118r3693n3334Q9613K92061k39192k14663
$$ 762766 727138 650672 480856 503462 521580 427887 374553 464166 756227 517035 302372
11000C02372N21447l40300j26197N25922m38015R0561N3890M4346o4701J74785
$$ 302372 823819 483519 357322 883244 445229 535790 589680 634026 569325 744110
10990G44110K33990j91980J33406k40878J48418j2765J93681j78038L36419P5522
$$ 744110 978100 786120 919526 678648 827066 814301 1007982 829944 1166363 1241885
10980A241885l14258K16153O96062j37394L87792j07679o0250P37145k90921K77052
$$ 1241885 927627 1143780 1839842 1702448 2090240 1982561 1922311 2659456 2368535 2645587
10970B645587K30503l40755j15931j99469k88893m38527m5168n7308M2726J97916
$$ 2645587 2876090 2535335 2419404 2219935 1931042 1492515 1447347 1390039 1432765 1630681
10960A630681j71938J57618k79832J60056J72937K7571m41040Q4701k18229r2528
$$ 1630681 1458743 1616361 1336529 1496585 1669522 1697093 1256053 1340754 1122525 1029997
10950A029997j87325C18209m4802P7596K29994j23543b02272B34784b31035G6382
$$ 1029997 842672 318209 273407 351003 580997 457454 -202272 234784 -231035 76382
10939d6120A45126c7998H5848m357J6661J70533q7517p0642a2953k9576j69246
$$ -46120 145126 -37998 85848 81491 98152 268685 181168 110526 -12953 -42529 -211775
10928b11775F4034c22592b2762B29003b6999F9557J50413N312b1789A89239g2068
$$ -211775 64034 -322592 -22762 229003 -26999 69557 219970 225282 -21789 189239 -72068
10916E3416O00a0948M546j63307K7524j29874B4254J08617j5477b20037M1655
$$ 53416 54016 -10948 -6402 -169709 -142185 -272059 24254 132871 117394 -220037 -178382
10905a78382C2310a70931C3389c23957D11555a03205j04198j63482g9910B12413
$$ -178382 32310 -170931 33389 -323957 411555 -103205 -207403 -370885 -79910 212413
10894a93296G7481c3055F5132J39588r1109f2955B5342b20523k8210B09661b0195
$$ -193296 77481 -33055 65132 204720 113611 -62955 25342 -220523 -248733 209661 -20195
10882e0523j21418j34702O108a43735N0675b2151F64251e4695B07287a61080C6528
$$ -50523 -171941 -306643 -300535 -143735 -93060 -22151 664251 -54695 207287 -161080 36528
10870B65601c432q8420k9277b2015j04062B03236c9832C85765B8170a94536M3270
$$ 265601 -3432 -91852 -121129 -22015 -126077 203236 -39832 385765 28170 -194536 -151266
10859a51266B41048P4747j01029M70862d7109B70530p9662Q9517J7150I5992c71433
$$ -151266 241048 315795 214766 685628 -47109 270530 190868 280385 297535 95992 -371433
10847d8447P965F136a47935H8380b08083o8186B27142G4708a06125M1222q0547
$$ -48447 -40482 6136 -147935 88380 -208083 -276269 227142 74708 -106125 -64903 -145450
10836a45450I6228C9532M0398i6603B20911c2637j4621n4987j0863C6968c0293
$$ -145450 96228 39532 79930 -96603 220911 -32637 -47258 -102245 -113108 36968 -30293
10824A39118a10706B37434a3533j72419a3883H2419b86198C25925j31012a2541
$$ 139118 -110706 237434 -13533 -185952 -13883 82419 -286198 325925 194913 -12541
10813A71268L1184a84357K4882a5513j77361H8445c14855A12625D9516b46778
$$ 171268 202452 -184357 -159475 -15513 -192874 88445 -314855 112625 49516 -246778
10802a67237j15056c5403l19773a55219a9354a582F5054a12988H045O7186h1451
$$ -167237 -282293 -35403 -355176 -155219 -19354 -1582 65054 -112988 8045 75231 -81451
10790a26911E4848a32119e4959j3770D62331a14264P925A99527h3062A6906f2256
$$ -126911 54848 -132119 -54959 -68729 462331 -114264 -106339 199527 -83062 16906 -62256
10778b45293i533k2863H2764a64397M9711C052h9501H2686Q9030f3335m2270d8903
$$ -245293 -9533 -32396 82764 -164397 -114686 3052 -89501 82686 171716 -63335 -105605 -48903
10765a37965A1398a72367j6415P8433j30580d1764G3287J38674d2093H3330B3408
$$ -137965 11398 -172367 -188782 -110349 -240929 -41764 73287 211961 -42093 83330 23408
10753F6003a58263N7234A01069a68784B13302b40613F2491d9757A44993j2918
$$ 66003 -158263 -101029 101069 -168784 213302 -240613 62491 -49757 144993 132075
10743A32075k563b4108l04292c0782n89j55040k574h0318o2682B16146F1624d01224
$$ 132075 129512 -24108 -328400 -30782 -31371 -186411 -188985 -80318 -143000 216146 61624 -401224
10730b15639R4706N6125B54039r5496f9355L326B00335A183a83058H656c8998
$$ -215639 -120933 -64808 254039 158543 -69355 -66029 200335 1183 -183058 8656 -38998
10718A93880f6862r6821f7588r4687A93938r1561b555A72554b80241f4448q9066
$$ 193880 -66862 -163683 -67588 -162275 193938 102377 -2555 172554 -280241 -64448 -153514
10707a53514A95224a87357k79846E6730a70385A12819a78840B24508n1926a13270
$$ -153514 195224 -187357 -467203 56730 -170385 112819 -178840 224508 172582 -113270
10696a36818A71964m6206g5623B4853J13964f3501A88674a70442d2731B99564
$$ -136818 171964 125758 -75623 24853 138817 -63501 188674 -170442 -42731 299564
10685a64765C98946c68448J56736A82616f6154m0320b1272n4051D6106N399e07097
$$ -164765 398946 -368448 -211712 182616 -66154 -106474 -21272 -75323 46106 51505 -507097
10673a9634C37371b03352L1431j07753j65181E1155b71082A8690K38664m9056
$$ -19634 337371 -203352 -171921 -279674 -444855 51155 -271082 18690 257354 208298
10663B08298a73766I7633h2887r1205A44609e87643C1480a11776A97291E0057
$$ 208298 -173766 97633 -82887 -174092 144609 -587643 31480 -111776 197291 50057
10652c4412j03604B4059R8299A5142d45556c2373j28610L414H3954a8851q0958
$$ -34412 -138016 24059 122358 15142 -445556 -32373 -160983 -157569 83954 -18851 -99809
10641i9809r6449n3504N1278E2910b38354b9458k20882D8745a15507M563o0981
$$ -99809 -196258 -249762 -198484 52910 -238354 -29458 -250340 48745 -115507 -110944 -171925
10630a71925I2026c00461c6742n9868d5322j34187d8854k49104D0171e592n2383
$$ -171925 92026 -300461 -36742 -96610 -45322 -179509 -48854 -297958 40171 -5592 -57975
10619e7975k00410a20971k8068D4465a38158F5186b9221j30122O0124m08163A64763
$$ -57975 -258385 -120971 -149039 44465 -138158 65186 -29221 -159343 -99219 -507382 164763
10607b07935R7395a2353A02450b47520b9211C8458b2862j61360d2925p0770B21594
$$ -207935 -110540 -12353 102450 -247520 -29211 38458 -22862 -184222 -42925 -113695 221594
10595a47888c063E830J17291f9320o3994J3315N8018E9015a91617k58888F2738
$$ -147888 -3063 5830 123121 -69320 -133314 -119999 -61981 59015 -191617 -450505 62738
10583a26849K9619A37754a1606j23171A28517O9806h332o2427p6162h546j98931
$$ -126849 -97230 137754 -11606 -134777 128517 198323 -8332 -70759 -146921 -8546 -207477
10572b07477l41473K61549d9081m2544r1106m3287B97022b669r7750A2442J53852
$$ -207477 -548950 -287401 -49081 -91625 -182731 -226018 297022 -2669 -100419 12442 166294
10561A66294b66944g6030q389I6965b8512l7905C93639f3859j89757A49955f453
$$ 166294 -266944 -76030 -84419 96965 -28512 -66417 393639 -63859 -253616 149955 -6453
10549A04816L30974c34319K5440a35781A41769a05633B6422M5525g3708J9564
$$ 104816 435790 -334319 -308879 -135781 141769 -105633 26422 71947 -73708 -54144
10539e4144k4360j9706B35997a96295N789d2263r2383O3477k25069B53544a11204
$$ -54144 -78504 -98210 235997 -196295 -190506 -42263 -134646 -71169 -296238 253544 -111204
10527A04875H823a05313j19944Q1008j58186A61857e9562A1174e2060D8474g0344
$$ 104875 8823 -105313 -225257 -144249 -302435 161857 -59562 11174 -52060 48474 -70344
10515a07134i916A96857F4343j3465g693A96110J7402N8257j16478a97053M4037
$$ -107134 -9916 196857 64343 50878 -7693 196110 213512 271769 155291 -197053 -153016
10504a53016M764r7619K0814C6577J59517D6749N7435J18141a45586D55856a19438
$$ -153016 -148252 -245871 -225057 36577 196094 46749 104184 222325 -145586 455856 -119438
10492D1787h1647A46306L35665d19758a4691A09705a81056A55470E9434J44651
$$ 41787 -81647 146306 481971 -419758 -14691 109705 -181056 155470 59434 204085
10482B04085M56516k54533J6241B09152J84123E9002a21687l6705B03925a68209
$$ 204085 660601 406068 422309 209152 393275 59002 -121687 -158392 203925 -168209
10471A26143m2007a47156A31323a78919A1625J79608a66764l38460b6881m7575
$$ 126143 84136 -147156 131323 -178919 11625 191233 -166764 -505224 -26881 -74456
10461g4456A44385M4397b92224R1949C9065J1613L7618a01527B07955a16224A51044
$$ -74456 144385 188782 -292224 -200275 39065 50678 88296 -101527 207955 -116224 151044
10449A8277b89971A58077b82066a16809j11816H6215P7373a91029C69770B552
$$ 18277 -289971 158077 -282066 -116809 -228625 86215 163588 -191029 369770 2552
10438F9293L00465E1457J83264a44508l8182m7313O5717B06524c20319B18769
$$ 69293 369758 51457 234721 -144508 -182690 -230003 -164286 206524 -320319 218769
10427a6759A03919i6023p0329L5037d8947b1496A39560c89553A43811a82415p3733
$$ -16759 103919 -96023 -166352 -131315 -48947 -21496 139560 -389553 143811 -182415 -256148
10416b56148A30433A1452b9769j78229A92092c13123I2095i4960d1779j42008
$$ -256148 130433 11452 -29769 -207998 192092 -313123 92095 -94960 -41779 -183787
10406a83787K1499o072f5836H2812N5283h5448j15768a1020q5147A15772b53382
$$ -183787 -162288 -168360 -65836 82812 138095 -85448 -201216 -11020 -96167 115772 -253382
10394b68832C7811K74661A32174a822j15316A77817m0617B1054J27326R6473K12980
$$ -268832 37811 312472 132174 -1822 -117138 177817 137200 21054 148380 244853 457833
10383D57833B5320J43132b28248L9678G3877a47896H7849a03404B59955J33169
$$ 457833 25320 168452 -228248 -188570 73877 -147896 87849 -103404 259955 393124
10373C93124Q3769E2936M10034H5239K18698J11029j61539D5806K85694l1620
$$ 393124 476893 52936 462970 85239 303937 414966 253427 45806 331500 299880
10363B99880l0124O5144K8441H2810l5391J04995K37429A77209M8961L16808B57478
$$ 299880 269756 334900 363341 82810 47419 152414 389843 177209 226170 542978 257478
10351B4133O25605M3616l17351K61260l15313Q4801q3989l9427j04248K2604p2940
$$ 24133 649738 693354 376003 637263 321950 406751 322762 283335 179087 201691 128751
10340A28751P5802l8390j7366B2480L6558Q8070R5293j1605K27442C9134K011
$$ 128751 204553 166163 148797 22480 59038 147108 242401 230796 458238 39134 41145
10329D1145M8591M7238C7545J3411K7863j7686J63039a24658E33761H9230C3303
$$ 41145 89736 136974 37545 50956 78819 61133 224172 -124658 533761 89230 33303
10317A24362o248M3482n2392b005C75297k1723A16406b04206B4008b22945a2006
$$ 124362 118114 161596 109204 -2005 375297 353574 116406 -204206 24008 -222945 -12006
10305g4846l15229a24013j21902A31726c25891H2241c05698C55901j48683g7200
$$ -74846 -390075 -124013 -245915 131726 -325891 82241 -305698 355901 207218 -77200
10294F4494d5997k73871a39558j35276A17834c46898h2945A37299E8530J00494
$$ 64494 -45997 -319868 -139558 -274834 117834 -346898 -82945 137299 58530 159024
10284A59024D0530J90370B0850g4616j35452p4117A61082c4315B0000K14521M9817
$$ 159024 40530 230900 20850 -74616 -210068 -284185 161082 -34315 20000 234521 284338
10273B84338e0023a8917A74063D604a9893k95665h0350c7851n18441c5366o474
$$ 284338 -50023 -18917 174063 4604 -19893 -315558 -80350 -37851 -556292 -35366 -41840
10262d1840A66159K710K12764A60066k0965L15495h628k74081B83313b28464B04837
$$ -41840 166159 168869 381633 160066 139101 454596 -8628 -282709 283313 -228464 204837
10250h958A96302l2476l7312c41960J52199A23752k3227a85273o024h5722k20346
$$ -8958 196302 163826 126514 -341960 -189761 123752 100525 -185273 -191297 -85722 -306068
10239c06068K8913C0374b67867B632L3081K25019C4480c24313J38051A5318J94191
$$ -306068 -277155 30374 -267867 2632 35713 260732 34480 -324313 -186262 15318 209509
10228B09509m6827b71813B01446c53385a02603B38085b18812h8219A39396a15257
$$ 209509 162682 -271813 201446 -353385 -102603 238085 -218812 -88219 139396 -115257
10217C7612c80749n3648G6279B1954c46484B7658N6001b89175A06198D2747a55712
$$ 37612 -380749 -434397 76279 21954 -346484 27658 83659 -289175 106198 42747 -155712
10205A64273C937K72648a6937A04781l3276J8093a27004r462d7044k77428b6072
$$ 164273 3937 276585 -16937 104781 71505 89598 -127004 -136466 -47044 -324472 -26072
10193b67766f6343j14698A74732a88858Q0268A31278a82239O4245q7389C022e7962
$$ -267766 -66343 -181041 174732 -188858 -108590 131278 -182239 -117994 -205383 3022 -57962
10181G2697k0343h1784d912I3523f809j879I5068J11301a8321l35537j1777A02470
$$ 72697 52354 -81784 -4912 93523 -6809 -8688 95068 206369 -18321 -353858 -365635 102470
10168B5642g2815c069n5082A09965a53885J067j41659B51276n5658J32355b94535
$$ 25642 -72815 -3069 -58151 109965 -153885 -152818 -294477 251276 195618 327973 -294535
10156a99362B29102c11508N7478I3659d194p6171A32530h8193a4772p2976D10581
$$ -199362 229102 -311508 -254030 93659 -4194 -80365 132530 -88193 -14772 -87748 410581
10144A07390i7499m645j09989l15431a12454C7272a98262F4896a76677b1467p4424
$$ 107390 -97499 -102144 -212133 -527564 -112454 37272 -198262 64896 -176677 -21467 -95891
10133i5891F5586h5683K0674E3570i6768d3583R69I1540c4039l61975J39866M66
$$ -95891 65586 -85683 -65009 53570 -96768 -43583 -42614 91540 -34039 -396014 -256148 -255682
10121b55682O785G6954b5997j77481A0011b62376o3975E4481j4157c1787j82553
$$ -255682 -248897 76954 -25997 -203478 10011 -262376 -326351 54481 40324 -31787 -214340
10110b14340m653a04197A9405a82938m2478f7308B14598H8594B202K5964P3934
$$ -214340 -218993 -104197 19405 -182938 -225416 -67308 214598 88594 2202 28166 102100
10099A02100c5040J2746B04a11064m0917j03187e2799q9744A31915a27785B5361
$$ 102100 -35040 -22294 204 -111064 -151981 -255168 -52799 -142543 131915 -127785 25361
10087b94064A3110J13022A2046e0052j3222A12032c34841a53824j64647B27726
$$ -294064 13110 126132 12046 -50052 -63274 112032 -334841 -153824 -318471 227726
10076g916B08461a96634C50891a89922L8381j2318A3272J48117f10452K15810
$$ -7916 208461 -196634 350891 -189922 -151541 -163859 13272 161389 -610452 -394642
10066c94642i3905K8175j92753r0919a12927A1726J40933n6335f22738a16216
$$ -394642 -93905 -65730 -258483 -349402 -112927 11726 152659 96324 -622738 -116216
10055a68095f6738B38014i7776B21525A02241a67819j07540M2939j76977G7708
$$ -168095 -66738 238014 -97776 221525 102241 -167819 -275359 -232420 -409397 77708
10044A76539a64801M6912A42228a61857F9024g8550j85518E3479h6444P830j00586
$$ 176539 -164801 -117889 142228 -161857 69024 -78550 -264068 53479 -86444 -78614 -179200
10033a79200D7374R5974c63523f6394q371A26663m0570O7961b44528H7942j1466
$$ -179200 47374 143348 -363523 -66394 -74765 126663 86093 154054 -244528 87942 76476
10022G6476h8761L2533q2985L1463N1664j15841G1359f9862D2332L617N1180b453
$$ 76476 -88761 -56228 -139213 -107750 -56086 -171927 71359 -69862 42332 45949 97129 -2453
10009a47492j85773J26520h6654d2566n1281B19884F3587P1156O3521c81869m2225
$$ -147492 -333265 -206745 -86654 -42566 -93847 219884 63587 134743 198264 -381869 -424094
9998d24094L9016J10417j01850J68462J2342M5180L9131c2190j09756A25391i7130
$$ -424094 -385078 -274661 -376511 -208049 -195707 -150527 -111396 -32190 -141946 125391 -97130
9986f159l9107F9386d0102A12560D3665a00216A79055a17818p6241A29049i1683
$$ -6159 -45266 69386 -40102 112560 43665 -100216 179055 -117818 -194059 129049 -91683
9974a75506m8732A79324b48496A40929a13781j04561E4774J8505a25146D5767
$$ -175506 -224238 179324 -248496 140929 -113781 -218342 54774 73279 -125146 45767
9963a26318N0906k22192c3703m09156g7703m8926B48774g5575A01355K9261b29850
$$ -126318 -75412 -297604 -33703 -442859 -77703 -126629 248774 -75575 101355 130616 -229850
9951a97087B05019a35417l7695A56589a07481j30196B94628a9052A11385i5456
$$ -197087 205019 -135417 -173112 156589 -107481 -237677 294628 -19052 111385 -95456
9940h9761j83855E9540a3672j61556j17586a1717k72343i8640j89190C99929b22744
$$ -89761 -273616 59540 -13672 -175228 -292814 -11717 -284060 -98640 -287830 399929 -222744
9928b41616l81e0362r717k21039a6888k14319B3353a43483G4809a85390g1169
$$ -241616 -241997 -50362 -60079 -281118 -16888 -231207 23353 -143483 74809 -185390 -71169
9916b66689i6399l24863a98004k9260Q5525E3184e2048o2303q9181h630A06754
$$ -266689 -96399 -421262 -198004 -227264 -141739 53184 -52048 -114351 -203532 -8630 106754
9904b62718f3150b3891j14653A01753J83869j06552A5915N7698b82227C3854a49236
$$ -262718 -63150 -23891 -138544 101753 285622 179070 15915 73613 -282227 33854 -149236
9892A8473N6260f4271K5209g123k40279A84120m5662a46605j90349h702A38540
$$ 18473 74733 -64271 -39062 -7123 -247402 184120 138458 -146605 -336954 -8702 138540
9880A31122b52457j56709E2178a44888B2259e4195A89831C7215P6583a59286d985
$$ 131122 -252457 -409166 52178 -144888 22259 -54195 189831 37215 113798 -159286 -4985
9868A9404b78794A74787e1135A2463Q5290J40498a23993d2956A1752K62759J35634
$$ 19404 -278794 174787 -51135 12463 97753 238251 -123993 -42956 11752 274511 410145
9857D10145c4395j92208A79591j2283e04106O3281a24625D64919B00790C4028
$$ 410145 -34395 -226603 179591 167308 -504106 -440825 -124625 464919 200790 34028
9846c12063A36451a9152q9442n02484A4053i1338B3844q362h9674c4012j50111
$$ -312063 136451 -19152 -108594 -611078 14053 -91338 23844 15482 -89674 -34012 -184123
9835a84123e7430l20007A16266b97061i3527A80107q4933D4725d8198a9019l17951
$$ -184123 -57430 -377437 116266 -297061 -93527 180107 95174 44725 -48198 -19019 -336970
9824c36970B6181a36698j43581J27942D273b14395n0395f2713Q85G3829c14379
$$ -336970 26181 -136698 -280279 -152337 4273 -214395 -264790 -62713 -61828 73829 -314379
9812a72811A24602a16450E4731J7904c46277J17860d1513D6072e7102o0809A63283
$$ -172811 124602 -116450 54731 72635 -346277 -228417 -41513 46072 -57102 -117911 163283
9800f2477B31986D9819J76221A03010a13008A30610a35374b6911E7294G754N8669
$$ -62477 231986 49819 226040 103010 -113008 130610 -135374 -26911 57294 7754 66423
9789F6423a64389h1042q8095B5171c13492B25826o5681b91891F6746b92711a23987
$$ 66423 -164389 -81042 -169137 25171 -313492 225826 160145 -291891 66746 -292711 -123987
9777B31891F4097a43610D13256c33810l9070b7865A89290D8660R8359a20082G6241
$$ 231891 64097 -143610 413256 -333810 -372880 -27865 189290 48660 147019 -120082 76241
9765a57651l3564h8808o8192J2028c2993A6528K07281A10853a97707A93733D5292
$$ -157651 -191215 -88808 -157000 -144972 -32993 16528 223809 110853 -197707 193733 45292
9753B29548c7758q4628L0633A9564J44299E7640b7482k97840b7878j25559l3748
$$ 229548 -37758 -122386 -91753 19564 163863 57640 -27482 -325322 -27878 -153437 -187185
9742a87185L5850r5628A57955f2084P817C7046K46916a220l72104a27065I1495
$$ -187185 -151335 -246963 157955 -62084 -54267 37046 283962 -1220 -373324 -127065 91495
9730C26819c03028J9362J30812l2785O6166j9216N7015j39406a5209j15083B5601
$$ 326819 -303028 -283666 -152854 -185639 -119473 -138689 -81674 -221080 -15209 -130292 25601
9718B755b20716i8948A23758g6403F9355b16613A06234b67345a30811C5733b15014
$$ 2755 -220716 -98948 123758 -76403 69355 -216613 106234 -267345 -130811 35733 -215014
9706G2230h6013l01286H4517K7240j8824k9394J41629e9111D1928c16935D2990
$$ 72230 -86013 -387299 84517 111757 92933 63539 205168 -59111 41928 -316935 42990
9694b4038j08821A51375Q4021b70023J17106e2988n61858a15849r4546D5976g3324
$$ -24038 -132859 151375 235396 -270023 -152917 -52988 -614846 -115849 -210395 45976 -73324
9682C31727e5257r9370G3566R8235a90163E9966c0442D3641b35417h7659A15471
$$ 331727 -55257 -154627 73566 171801 -190163 59966 -30442 43641 -235417 -87659 115471
9670d4726j15610j08706A2262c49402J40326P2179n4170A27357K4579b0972j98945
$$ -44726 -160336 -269042 12262 -349402 -209076 -136897 -191067 127357 151936 -20972 -219917
9659b19917h3805F9281N1774j3675a69668A79655f293A0844L3168f8677k80426
$$ -219917 -83805 69281 121055 107380 -169668 179655 -6293 10844 44012 -68677 -349103
9648c49103A2851J03042J24982c89149i6306k2679B18052b67165a1403p1553A11419
$$ -349103 12851 115893 240875 -389149 -96306 -118985 218052 -267165 -11403 -82956 111419
9636F6133Q908g1084G5940b60675H2605M3271l7518J6502b8566o1228d2847j34822
$$ 66133 75041 -71084 75940 -260675 82605 125876 88358 104860 -28566 -89794 -42847 -177669
9624a77669O033A44425o4970J61445a56844L0382O2091a1539A52019A0387e3243
$$ -177669 -171636 144425 79455 240900 -156844 -126462 -64371 -11539 152019 10387 -53243
9612i8733A53762B7793b90671R0176j36841a47306n8239K8950P0539I9615a21452
$$ -98733 153762 27793 -290671 -200495 -337336 -147306 -205545 -176595 -106056 99615 -121452
9600c85896a06288E42K36934e40715a55040G6999d7577A58538C5731j1475c88998
$$ -385896 -106288 542 237476 -540715 -155040 76999 -47577 158538 35731 24256 -388998
9588b4967l00227c9816J0611D3284a79195d3811j06681l5280N6763A55084A6251
$$ -24967 -325194 -39816 -29205 43284 -179195 -43811 -150492 -185772 -129009 155084 16251
9576B25847c46061J12287C13934a7136A87753a23740A38540a28241n1260d261
$$ 225847 -346061 -233774 313934 -17136 187753 -123740 138540 -128241 -179501 -4261
9565b87688d4679A30092h3214E6696f9271C3766c51498a69123L619j45091n4614
$$ -287688 -44679 130092 -83214 56696 -69271 33766 -351498 -169123 -165504 -310595 -365209
9554c65209G1186a64321K6059m7850j56974a16616h52j23336o66B4633c6219j57122
$$ -365209 71186 -164321 -138262 -186112 -343086 -116616 -852 -124188 -124854 24633 -36219 -193341
9542a93341C0922b7197C18930A48001C7135a66880C05184f8621B1718J3248b74390
$$ -193341 30922 -27197 318930 148001 37135 -166880 305184 -68621 21718 34966 -274390
9530a19973a0920j09670j5139N9738q3820L263c7331q4211C53593A5766f40l67547
$$ -119973 -10920 -120590 -135729 -75991 -159811 -156548 -37331 -121542 353593 15766 -640 -368187
9518c68187A68966k6238c80023J57184B49414k3252q1326a33343F0679b13714
$$ -368187 168966 142728 -380023 -222839 249414 226162 144836 -133343 60679 -213714
9507E5424a82540C21090A13986P674a40654A80381l8954c6332p3882C2749Q1040
$$ 55424 -182540 321090 113986 121660 -140654 180381 141427 -36332 -110214 32749 113789
9496A13789a31719o0335J924a5489j36046L5617c4008j451l6439C110d64303A21622
$$ 113789 -131719 -192054 -190130 -15489 -151535 -115918 -34008 -35459 -71898 3110 -464303 121622
9483a51388A57617c5830A98990a94144B08875e2491j790A53495a49023K692J6093
$$ -151388 157617 -35830 198990 -194144 208875 -52491 -54281 153495 -149023 -146331 -130238
9472a30238b295m15444A51981E5151a58822o8702j4243B07982a28188j79124a26092
$$ -130238 -2295 -417739 151981 55151 -158822 -227524 -241767 207982 -128188 -307312 -126092
9460a97655e9403N093j57333B65636F664a60515f4046j3781r611K7068k13822
$$ -197655 -59403 -54310 -211643 265636 6664 -160515 -64046 -77827 -87438 -60370 -274192
9449b74192a33443J2827E7372b69255a12804A45414h4988b0619m47821F8527J1257
$$ -274192 -133443 -120616 57372 -269255 -112804 145414 -84988 -20619 -468440 68527 79784
9438G9784d7039m8153o6822L0870b5660A69044o6191f6413o4745j99657G9526
$$ 79784 -47039 -95192 -162014 -131144 -25660 169044 102853 -66413 -131158 -330815 79526
9426a69897q8502l3817h1530c3814k84011J15809O9639J2786A81714c85887A75687
$$ -169897 -258399 -292216 -81530 -33814 -317825 -202016 -132377 -119591 181714 -385887 175687
9414A85979g0585j6871a2120A5749K87746d46591b15492b1536j17424q0775d9549
$$ 185979 -70585 -87456 -12120 15749 303495 -446591 -215492 -21536 -138960 -219735 -49549
9402C74112d7469a2647k9208G634J69792b67945a07003A14801a02574A79650b92918
$$ 374112 -47469 -12647 -41855 7634 177426 -267945 -107003 114801 -102574 179650 -292918
9390b17913A13952C3258a22884G1005b06782O6176o6286B71690b93344C383e9257
$$ -217913 113952 33258 -122884 71005 -206782 -140606 -206892 271690 -293344 3383 -59257
9378e8909J5478j13884c1496A35364F3207a30757n8804j54085m2649a89310f8078
$$ -58909 -43431 -157315 -31496 135364 63207 -130757 -189561 -343646 -386295 -189310 -68078
9366F6350g3985m46481d2352j83776N0550g3756B49064K5267a61771F86f7056
$$ 66350 -73985 -520466 -42352 -226128 -175578 -73756 249064 274331 -161771 686 -67056
9354a09207n5538r0910R0504O5120k00942k60637a77832l4371j77741e0703A9530
$$ -109207 -164745 -255655 -165151 -100031 -300973 -561610 -177832 -212203 -389944 -50703 19530
9342B2390K13663j6534i022C5488J79666b95159A31136a65045K5894m8680C17852
$$ 22390 236053 219519 -9022 35488 215154 -295159 131136 -165045 -139151 -187831 317852
9330h4563j70589J18727o4971I2832a16378k54538A43372a97269R8122E2647A0819
$$ -84563 -255152 -136425 -201396 92832 -116378 -370916 143372 -197269 -99147 52647 10819
9318B3628a65423e1457d386B0676b0114D0117O3084B9168a24119p8905F6819A0146
$$ 23628 -165423 -51457 -4386 20676 -20114 40117 103201 29168 -124119 -203024 66819 10146
9305B6435c13250B5714L6860J6650K1743L80703b8194H9563J6028E0270J37490
$$ 26435 -313250 25714 62574 79224 100967 481670 -28194 89563 105591 50270 187760
9294A87760J27655h9367j02031A38923c20159J06232B00322A5332N737c8778A49047
$$ 187760 315415 -89367 -191398 138923 -320159 -213927 200322 15332 21069 -38778 149047
9282i6113n0277M5872A04126i8458A50073J15365e1371j54839P4478j97246d6774
$$ -96113 -146390 -100518 104126 -98458 150073 265438 -51371 -206210 -131732 -328978 -46774
9270A09378K0704a04753o5504A34508b15777A11306i4487K6705A06809m5991e7984
$$ 109378 130082 -104753 -170257 134508 -215777 111306 -94487 -67782 106809 60818 -57984
9258a56126G438e2956A35239g5990l1757A56686a45792c5526A2488c47881h5470
$$ -156126 7438 -52956 135239 -75990 -107747 156686 -145792 -35526 12488 -347881 -85470
9246A98385C0339a19803a2832A63654b50202a16345B49549b7479j50443q6570
$$ 198385 30339 -119803 -12832 163654 -250202 -116345 249549 -27479 -177922 -264492
9236b64492J30482K6539m0352B691a99730l50427I4519h3454A83440a39215A49249
$$ -264492 -134010 -107471 -147823 2691 -199730 -550157 94519 -83454 183440 -139215 149249
9224i3868B78995b09702C8250J27070f9587J5838j68057M8593a1977k2243F1156
$$ -93868 278995 -209702 38250 165320 -69587 -53749 -221806 -173213 -11977 -34220 61156
9212B56582b34599H2869d39993A48085i418k7915A21783n6662J99908c01328O1572
$$ 256582 -234599 82869 -439993 148085 -9418 -37333 121783 65121 265029 -301328 -239756
9201b39756F0889R4098o8198B5869b67891n6009f7512G3422i0614F4207G152a62898
$$ -239756 60889 154987 86789 25869 -267891 -323900 -67512 73422 -90614 64207 7152 -162898
9188f7174O70j21428E888J50248a0334k27209g4594A08248L5620K0715a61550
$$ -67174 -66504 -187932 5888 156136 -10334 -237543 -74594 108248 143868 164583 -161550
9176a45555F2271a10950j78704C69642b11126k34072K16390R8086k03750B78809
$$ -145555 62271 -110950 -289654 369642 -211126 -445198 -228808 -130722 -334472 278809
9165C07377B0327J5014c01979R6698j82527A79917a10764E7023J71381c074n2785
$$ 307377 20327 35341 -301979 -205281 -387808 179917 -110764 57023 228404 -3074 -55859
9154e5859p6002j37058k7987O8431C26450E8504b89837C91667f4521j24732A56774
$$ -55859 -131861 -268919 -296906 -228475 326450 58504 -289837 391667 -64521 -189253 156774
9142b59916H6647b18092F7201b26418B72637a87455k5046A49754a94059B07793
$$ -259916 86647 -218092 67201 -226418 272637 -187455 -212501 149754 -194059 207793
9131a36793A3095K90411e0596o4826L8243k43317G2165a7443F8580c11678O8228
$$ -136793 13095 303506 -50596 -115422 -77179 -320496 72165 -17443 68580 -311678 -243450
9120b43450D5885e5101A62871K02672e932j44773A22436d9242j00237a1284j01072
$$ -243450 45885 -55101 162871 365543 -5932 -150705 122436 -49242 -149479 -11284 -112356
9109a12356A28021d93587a50981H5198a67788A56136i5439B59176a52155k6985
$$ -112356 128021 -493587 -150981 85198 -167788 156136 -95439 259176 -152155 -179140
9099a79140J5810r5977O2010A84335a18336A0964J17640e270k01514b3643k37577
$$ -179140 -163330 -259307 -197297 184335 -118336 10964 128604 -5270 -206784 -23643 -261220
9088b61220g5548n4877C5936Q6002c93590J32843f1441l41391A0087K97420d9499
$$ -261220 -75548 -130425 35936 121938 -393590 -260747 -61441 -402832 10087 307507 -49499
9076A1183O0549J45987j05679a11060B09724q8211b0681m3598H6886B5156a04358
$$ 11183 71732 217719 112040 -111060 209724 121513 -20681 -64279 86886 25156 -104358
9064A98684b37909h6831M2623A24416M2367C6695f9977n4098m21n5928n2146R9949
$$ 198684 -237909 -86831 -44208 124416 166783 36695 -69977 -124075 -124496 -180424 -232570 -132621
9052a32621C46604A19318a94859r5257b408B73249e3907K1767B2368J32723a85343
$$ -132621 346604 119318 -194859 -290116 -2408 273249 -53907 -32140 22368 155091 -185343
9040f2761l6378k6704k4207K922o4221h3635C37007j55604a77542C4857d47894
$$ -62761 -99139 -125843 -150050 -147128 -211349 -83635 337007 181403 -177542 34857 -447894
9028c2110A65267i8549m1519e600m3884c362A3503f5478B85386a52367L3989A76376
$$ -32110 165267 -98549 -140068 -5600 -49484 -3362 13503 -65478 285386 -152367 -118378 176376
9015b13685k99854a45745C7647c3855A52745a8923A48019c007j69392L6674G8549
$$ -213685 -513539 -145745 37647 -33855 152745 -18923 148019 -3007 -172399 -135725 78549
9003B49566m8482b906n7685A67651a14733k51791A08539a43266F775J8221a50101
$$ 249566 201084 -2906 -60591 167651 -114733 -366524 108539 -143266 6775 24996 -150101
8991a19322E1536a75546N1149j09866J07541F3611c52216J35680i1121j11217
$$ -119322 51536 -175546 -124397 -234263 -126722 63611 -352216 -216536 -91121 -202338
8981b02338N4665L3860j0631k17776G5357g9602j37773p5907j49773B07246p903
$$ -202338 -147673 -113813 -124444 -342220 75357 -79602 -217375 -293282 -443055 207246 199343
8970A99343b83359N2809a0292E5672G22J64355a33253m3685j231F7257G758e33516
$$ 199343 -283359 -230550 -10292 55672 722 165077 -133253 -176938 -178169 67257 7758 -533516
8957F5031e13605f1386j06343c8432m3638o6798B6173b3895o2884F5202J39502
$$ 65031 -513605 -61386 -167729 -38432 -82070 -148868 26173 -23895 -86779 65202 204704
8946B04704q9237j9080B0195a56868k44501B651J9273g1186B0131J26290d5854
$$ 204704 115467 96387 20195 -156868 -401369 2651 21924 -71186 20131 146421 -45854
8934a47935A61396K1140A1072J95297B5139R2618J40237j26123J83371P502N04667
$$ -147935 161396 182536 11072 206369 25139 117757 257994 131871 315242 322744 827411
8923H27411J442536N840314M305225D153227A407676F65900j49729B23073a90322
$$ 827411 2269947 8110261 12415486 4153227 1407676 665900 516171 223073 -190322
8913D27479j03305D7709J92893e2057C31519A10941J44550G3726C602g2491o1830
$$ 427479 324174 47709 240602 -52057 331519 110941 255491 73726 3602 -72491 -134321
8902a34321C80999K75513A80465c38788D9039d3997j78746J08745J3497l059K3
$$ -134321 380999 656512 180465 -338788 49039 -43997 -222743 -113998 -100501 -103560 -103537
8891a03537J7472A56791n0712c9864m1854c1084A39220c1149G5216h2000B3176
$$ -103537 -86065 156791 106079 -39864 -81718 -31084 139220 -31149 75216 -82000 23176
8879A3788a33410k3076p4874c4396n76212A91034a01025c4195k07020J7692N7401
$$ 13788 -133410 -156486 -231360 -34396 -610608 191034 -101025 -34195 -241215 -223523 -166122
$$ [...]
##END NTUPLES=NMR SPECTRUM
##END=
