
##TITLE=AC1351_CHIRS12169_7154778_ph0fgzLUjz
##JCAMPDX= 6.0         $$ Bruker NMR JCAMP-DX V2.0
##DATA TYPE= NMR SPECTRUM
##DATA CLASS= NTUPLES
##ORIGIN= BRUKER
##OWNER= Administrator
$$ 1.72 TOPSPIN		Version 2.1
$$ 2012-12-01 03:28:48.259 -0500  Administrator@X
$$ Compression mode = diff/dup
##.OBSERVE FREQUENCY= 400.02188249412
##.OBSERVE NUCLEUS= ^1H
##.ACQUISITION MODE= SIMULTANEOUS (DQD)
##.ACQUISITION SCHEME= undefined
##.AVERAGES= 64
##.DIGITISER RES= 22
##SPECTROMETER/DATA SYSTEM= spect
##.PULSE SEQUENCE= noesygpps1d.comp
##.SOLVENT NAME= COFFEE_meoh
##.SHIFT REFERENCE= INTERNAL, COFFEE_meoh, 1, 14.96098
##AUDIT TRAIL= $$ (NUMBER, WHEN, WHO, WHERE, PROCESS, VERSION, WHAT)
$$ ##TITLE= Audit trail, TOPSPIN		Version 2.1
$$ ##JCAMPDX= 5.01
$$ ##ORIGIN= Bruker BioSpin GmbH
$$ ##OWNER= Administrator
$$ $$ E:\/data/COFFEE/nmr/AC1351_CHIRS12169_7154778_ph0fgzLUjz/12/pdata/1/auditp.txt
$$ ##AUDIT TRAIL=  $$ (NUMBER, WHEN, WHO, WHERE, PROCESS, VERSION, WHAT)
(   1,<2012-12-01 03:28:42.196 -0500>,<Administrator>,<X>,<go>,<TOPSPIN 2.1>,
      <created by zg
	started at 2012-12-01 03:17:12.083 -0500,
	POWCHK enabled, PULCHK disabled,
       configuration hash MD5:
       86 BA 57 50 F2 9D 5C 9B 26 00 A9 28 5F 66 2E 89
       data hash MD5: 64K
       33 9A 4F FB CE BB 78 32 9D 4B E0 BE 43 C5 68 50>)
(   2,<2012-12-01 03:28:45.415 -0500>,<Administrator>,<X>,<proc1d>,<TOPSPIN 2.1>,
      <Start of raw data processing
       efp LB = 0.3 FT_mod = 6 PKNL = 1 PHC0 = 0 PHC1 = 0 SI = 128K 
       data hash MD5: 128K
       E3 A5 11 8A B9 D6 12 36 36 19 1E 1A E9 79 A3 D1>)
(   3,<2012-12-01 03:28:46.509 -0500>,<Administrator>,<X>,<proc1d>,<TOPSPIN 2.1>,
      <pk PHC0 = -79.28284 PHC1 = 0 
       data hash MD5: 128K
       18 0E 53 A6 4A 3D F4 87 C8 CD D2 C2 08 1D 15 4A>)
(   4,<2012-12-01 03:28:47.228 -0500>,<Administrator>,<X>,<proc1d>,<TOPSPIN 2.1>,
      <abs ABSG = 1 
       data hash MD5: 128K
       9E FD 9D 7E D8 C0 66 A5 50 A5 1B A6 08 23 21 A5>)
(   5,<2012-12-01 03:28:47.415 -0500>,<Administrator>,<X>,<proc1d>,<TOPSPIN 2.1>,
      <abs ABSG = 2 
       data hash MD5: 128K
       0F 43 AE 7F 97 0A 47 B8 3A DD CA 99 F3 DF 86 CD>)
(   6,<2012-12-01 03:28:47.571 -0500>,<Administrator>,<X>,<proc1d>,<TOPSPIN 2.1>,
      <abs ABSG = 3 
       data hash MD5: 128K
       27 9A 66 70 F7 F4 44 ED 26 74 56 64 51 EF 74 15>)
(   7,<2012-12-01 03:28:47.759 -0500>,<Administrator>,<X>,<proc1d>,<TOPSPIN 2.1>,
      <abs ABSG = 4 
       data hash MD5: 128K
       C2 D6 D7 23 16 E1 D8 99 14 EE 88 0B 5E B5 67 B5>)
(   8,<2012-12-01 03:28:47.915 -0500>,<Administrator>,<X>,<proc1d>,<TOPSPIN 2.1>,
      <abs ABSG = 5 
       data hash MD5: 128K
       A8 91 95 4B 16 6F 91 9A 4E AF 3C 05 6E C2 D5 1B>)
$$ ##END=
$$ 
$$ $$ hash MD5
$$ $$ 10 E1 29 42 05 5F E3 20 BB 2C 43 D5 E4 5A 87 AC
##$RELAX= 
##$RELAX= 
##$RELAX= 
##$RELAX= 
##$RELAX= 
##$RELAX= 
##$RELAX= 
##$RELAX= 
$$ Bruker specific parameters
$$ --------------------------
##$DU= <E:\>
##$EXPNO= 12
$$ [...]
##$TP07= 0
##$TPNAME0= <>
##$TPNAME1= <>
##$TPNAME2= <>
##$TPNAME3= <>
##$TPNAME4= <>
##$TPNAME5= <>
##$TPNAME6= <>
##$TPNAME7= <>
##$TPOAL= (0..7)
0.5 0.5 0.5 0.5 0.5 0.5 0.5 0.5
##$TPOFFS= (0..7)
0 0 0 0 0 0 0 0
##$TUNHIN= 0
##$TUNHOUT= 0
##$TUNXOUT= 0
##$USERA1= <user>
##$USERA2= <user>
##$USERA3= <user>
##$USERA4= <user>
##$USERA5= <user>
##$V9= 5
##$VALIST= <valist>
##$VCLIST= <CCCCCCCCCCCCCCC>
##$VD= 0
##$VDLIST= <DDDDDDDDDDDDDDD>
##$VPLIST= <PPPPPPPPPPPPPPP>
##$VTLIST= <TTTTTTTTTTTTTTT>
##$WBST= 1024
##$WBSW= 4
##$XGAIN= (0..3)
0 0 0 0
##$XL= 0
##$YL= 0
##$YMAX_a= 6288745
##$YMIN_a= -11974374
##$ZGOPTNS= <>
##$ZL1= 120
##$ZL2= 120
##$ZL3= 120
##$ZL4= 120
##$ABSF1= 14.96098
##$ABSF2= -5.597201
##$ABSG= 5
##$ABSL= 3
##$ALPHA= 0
##$AQORDER= 0
##$ASSFAC= 0
##$ASSFACI= 0
##$ASSFACX= 0
##$ASSWID= 0
##$AUNMP= <proc_prof1d_extract.lims>
##$AXLEFT= 0
##$AXNAME= <>
##$AXNUC= <1H>
##$AXRIGHT= 0
##$AXTYPE= 0
##$AXUNIT= <>
##$AZFE= 0.1
##$AZFW= 0.1
##$BCFW= 0
##$BC_mod= 0
##$BYTORDP= 0
##$COROFFS= 0
##$CY= 15
##$DATMOD= 1
##$DC= 0
##$DFILT= <>
##$DTYPP= 0
##$F1P= 0
##$F2P= 0
##$FCOR= 0.5
##$FTSIZE= 131072
##$FT_mod= 6
##$GAMMA= 0
##$GB= 0
##$INTBC= 1
##$INTSCL= 1
##$ISEN= 128
##$LB= 0.3
##$LEV0= 0
##$LPBIN= 0
##$MAXI= 10000
##$MC2= 0
##$MEAN= 0
##$ME_mod= 0
##$MI= 0
##$NCOEF= 0
##$NC_proc= -2
##$NLEV= 6
##$NOISF1= 0
##$NOISF2= 0
##$NSP= 0
##$NTH_PI= 0
##$NZP= 0
##$OFFSET= 14.96098
##$PC= 1
##$PHC0= -79.28284
##$PHC1= 0
##$PH_mod= 1
##$PKNL= yes
##$PPARMOD= 0
##$PPDIAG= 0
##$PPIPTYP= 0
##$PPMPNUM= 2147483647
##$PPRESOL= 1
##$PSCAL= 4
##$PSIGN= 0
##$PYNMP= <proc.py>
##$REVERSE= no
##$SF= 400.020009646537
##$SI= 131072
##$SIGF1= 0
##$SIGF2= 0
##$SINO= 400
##$SIOLD= 131072
##$SPECTYP= <>
##$SREGLST= <1H.CDCl3>
##$SSB= 0
##$STSI= 131072
##$STSR= 0
##$SW_p= 8223.68421052631
##$SYMM= 0
##$S_DEV= 0
##$TDeff= 65536
##$TDoff= 0
##$TI= <>
##$TILT= no
##$TM1= 0
##$TM2= 0
##$TOPLEV= 0
##$USERP1= <user>
##$USERP2= <user>
##$USERP3= <user>
##$USERP4= <user>
##$USERP5= <user>
##$WDW= 1
##$XDIM= 131072
##$YMAX_p= 462654178
##$YMIN_p= -12867
##$CURPLOT= <Network HP LaserJet P1505>
##$CURPRIN= <$Network HP LaserJet P1505>
##$DFORMAT= <normdp>
##$LAYOUT= <+/1D_H.xwp>
##$LFORMAT= <normlp>
##$PFORMAT= <normpl>
##$SURQMSG= 1
$$ End of Bruker specific parameters
$$ ---------------------------------
##NTUPLES= NMR SPECTRUM
##VAR_NAME=  FREQUENCY,     SPECTRUM/REAL,   SPECTRUM/IMAG
##SYMBOL=    X,             R,               I
##VAR_TYPE=  INDEPENDENT,   DEPENDENT,       DEPENDENT
##VAR_FORM=  AFFN,          ASDF,            ASDF
##VAR_DIM=   131072,        131072,          131072
##UNITS=     HZ,            ARBITRARY UNITS, ARBITRARY UNITS
##FACTOR=    0.0627417313425164, 1,          1
##FIRST=     8223.62146879497, -1864,        -58538
##LAST=      0,             -1086,           -59247
##MIN=       0,             -12867,          0
##MAX=       8223.62146879497, 462654178,    0
$$ Real data points
##PAGE= N=1
##DATA TABLE= (X++(R..R)), XYDATA
$$ [...]
67945 68879 69459 69895 69952 69710 69373 69187 69369 69967 70865 72033 73615 75582 77476 78806 79579 80169 80673 80776
67927 80776 80396 80054 80304 81058 81850 82607 83744 85457 87292 88559 88937 88619 88039 87592 87429 87359 87020 86202
67909 86202 84918 83253 81350 79523 78060 76901 75786 74736 73973 73276 72060 70456 69777 71205 74266
67894 74266 77223 78863 79266 78928 78012 76755 75863 75856 76349 76481 75887 74846 73680 72503 71591 71454 72282 73515
67876 73515 74281 74231 73765 73408 73162 72668 71943 71583 72026 72910 73522 73806 74390 75586 76834 77421 77292 76786 75981
67857 75981 74813 73644 73026 72849 72290 70833 68914 67308 66231 65435 64929 65110 66113 67366 67970 67492
67841 67492 66346 65423 65322 65907 66647 67289 67960 68615 68798 68266 67578 67575 68353 69231 69788 70493 72061 74574 77485
67822 77485 80188 82278 83551 84171 84766 85975 87841 89766 91044 91302 90621 89380 87857 85841 82912
67807 82912 79293 76004 73711 71842 69492 66859 64915 63777 62456 60453 58585 57719 57571 57459 57531 58285
67791 58285 59342 59682 58987 57916 57042 56243 55254 54183 53318 52902 53162 54046 54871 54808 53947 53398 54079 55729
67773 55729 57301 57937 57421 56135 54899 54586 55510 57274 59314 61380 63384 65115 66404 67390 68397 69607
67757 69607 70957 72222 73142 73609 73773 73791 73498 72602 71192 69730 68511 67531 66993 67383 68746 70293 71165
67740 71165 71305 71228 71104 70548 69237 67403 65626 64337 63523 62799 61826 60707 59838 59352 58990 58627 58547 58915
67722 58915 59289 59060 58184 57069 55911 54597 53197 52086 51495 51298 51353 51708 52290 52689 52533 51901 51165 50499
67704 50499 49818 49206 49138 49990 51441 52639 53085 53072 53082 53092 52925 52989 53975 55732 57172 57616 57594 57869 58200 57775
67684 57775 56494 55066 53952 52976 52063 51631 51924 52454 52498 51919 51236 51069 51672 52807 53943 54734 55410 56514
67666 56514 58134 59600 60164 59843 59400 59564 60446 61704 63109 64729 66526 67918 68106 67041 65854 66007
67650 66007 67956 70782 73067 73938 73381 71895 70043 68171 66403 64795 63397 62113 60708 59200 58092
67635 58092 57965 58871 60384 62131 63984 65760 67131 67895 68070 67722 67029 66478 66536 67022 67263 67052 67007 67632
67617 67632 68471 68659 68085 67509 67612 68399 69530 70765 71945 72894 73637 74474 75588 76597 76731 75524 73280
67600 73280 70801 68733 67235 66219 65703 65797 66418 67207 67799 68080 68122 67937 67369 66244 64616 62804 61113
67583 61113 59534 57932 56550 56034 56619 57513 57570 56558 55296 54476 53950 53429 53250 53855 54827 55235 54916 54692
67565 54692 55126 55667 55523 54900 54797 55696 57034 58002 58370 58377 58277 58371 59105 60688 62640 64084 64502 63977 62878
67546 62878 61642 60787 60580 60610 60141 59070 58092 57656 57268 56277 54950 54140 54103 54214 53854 53076 52386 52279 53013
67527 53013 54398 55728 56269 55958 55363 55014 55053 55439 55982 56184 55603 54553 53954 54297 55182 56048 56812 57496
67509 57496 57748 57258 56343 55679 55573 55811 56004 55813 55093 54129 53497 53392 53357 52960 52426 52188 52131 51873 51583 51864
67489 51864 52741 53367 52962 51693 50434 49924 50325 51367 52671 53962 55107 56012 56529 56528 56010 55181 54481 54401
67471 54401 55033 55819 56147 56219 56774 57828 58345 57654 56529 56180 56608 56896 56836 57243 58587 60222 61307 61788
67453 61788 62102 62515 63048 63596 63775 63174 62031 61160 60901 60671 59957 59154 58840 58737 58169 57312 57187 58342
67435 58342 60170 61687 62554 63135 63901 64976 66035 66540 66190 65200 64023 62869 61698 60617 59984 59996 60387
67418 60387 60628 60345 59501 58324 57161 56296 55839 55788 56202 57198 58701 60194 60854 60141 58381 56668 55954
67401 55954 56276 56976 57590 58224 59100 60099 60879 61122 60547 59089 57279 56107 56134 56981 57952 58821 59651 60199
67383 60199 60144 59768 59803 60554 61631 62631 63548 64376 64749 64262 62915 61100 59353 58211 57964 58410 59053 59643
67365 59643 60310 61147 61995 62729 63340 63620 63166 61956 60560 59461 58560 57700 57285 57825 59065 60140 60543
67348 60543 60419 59964 59147 58243 58091 59311 61475 63419 64337 64364 64142 64120 64338 64651 64948 65125 65060 64748 64467
67329 64467 64589 65187 65933 66507 66957 67516 68235 68991 69808 70844 72023 72901 73079 72593 71825 71102 70454 69696
67311 69696 68690 67620 67016 67337 68484 69835 70880 71715 72798 74359 76192 77883 79076 79594 79578 79523
67295 79523 79908 80637 81046 80577 79345 77861 76373 74746 72959 71327 70091 69098 68137 67366 67071 67122 67096
67278 67096 66937 67045 67610 68306 68944 70014 72057 74670 76698 77521 77730 78353 79670 81052 81798 81877 81803 81926
67260 81926 82011 81559 80478 79208 78137 77181 76158 75288 74975 75234 75745 76365 77122 77744 77765 77273 76995 77376
67242 77376 78024 78406 78634 79090 79701 80081 80171 80119 79714 78582 76970 75735 75450 75979 77035 78595 80459 81936
67224 81936 82448 82257 82141 82411 82567 82017 80963 80434 81402 83748 86173 87262 86738 85548 84768 84631 84650 84376
67206 84376 83839 83424 83488 83956 84235 83744 82687 82047 82564 83873 84963 85304 85266 85505 86334 87657 89127 90255
67188 90255 90651 90396 89982 89764 89666 89531 89511 89839 90342 90540 90224 89723 89553 90049 91352 93407 95812 97892
67170 97892 99246 100098 100904 101743 102368 102723 102987 103127 102910 102532 102752 104052 105991 107711 108818 109357 109246
67153 109246 108354 107118 106482 107053 108625 110581 112365 113507 113725 113273 112891 113125 113890 114832 115800 116743 117423
67136 117423 117542 117020 115970 114593 113259 112428 112243 112384 112557 112920 113826 115335 117259 119453 121763 123861
67120 123861 125451 126650 127868 129361 131034 132581 133647 134044 134004 134058 134424 134802 135037 135655 137253 139563
67104 139563 141645 142921 143507 143620 143290 142809 142834 143702 144997 146076 146797 147498 148489 149794 151226 152524 153541
67087 153541 154436 155581 157187 159145 161225 163267 165115 166555 167421 167661 167329 166693 166268 166500 167441 168877
67071 168877 170620 172452 174048 175441 177312 180104 182941 184285 183901 183341 184065 185826 187468 188629 189875
67056 189875 191613 193761 196258 199083 201814 203926 205577 207441 209679 211752 213398 215133 217471 220205
67042 220205 222857 225428 228236 231311 234449 237691 241258 244936 247980 249889 251159 252922 255713 258771
67028 258771 260812 261529 262019 263584 266398 269633 272645 275539 278640 281964 285357 288778 292135 295169 297723
67013 297723 299976 302223 304617 307275 310395 314032 317927 321830 325844 330209 334897 339738 344843 350488
66999 350488 356456 361863 365927 368820 371495 374681 378263 381734 385121 389130 394337 400416 406404 411657
66985 411657 416328 421014 426221 432243 439125 446427 453269 459051 464196 469866 476803 484618 492263 499000
66971 499000 504853 510384 516296 523144 531135 540023 549287 558456 567312 575907 584480 593302 602477 611885
66957 611885 621406 631154 641336 651914 662613 673319 684271 695732 707648 719815 732245 745133
66945 745133 758533 772267 786132 800027 813948 828068 842773 858338 874586 891152 908062
66934 908062 925688 944042 962552 980843 999396 1019061 1040089 1062002 1084232 1106525 1128800
66923 1128800 1151058 1173513 1196496 1220103 1244223 1268952 1294747 1321955 1350329 1379175 1407912
66912 1407912 1436470 1465132 1494110 1523320 1552681 1582558 1613582 1645851 1678639 1711252 1743947
66901 1743947 1777518 1812059 1846743 1880931 1914963 1949546 1984776 2020182 2055460 2090756 2126251
66890 2126251 2161769 2196803 2230858 2263920 2296661 2329878 2363461 2396163 2426710 2454944 2481519
66879 2481519 2506724 2530196 2551786 2572072 2591641 2610151 2626517 2639963 2650672 2659426 2666803 2672711
66867 2672711 2676553 2677741 2676116 2672024 2666032 2658452 2649002 2636982 2622049 2604873 2586759 2568413 2549265
66854 2549265 2528224 2504902 2479769 2453365 2425845 2397341 2368112 2338095 2306720 2273622 2239242
66843 2239242 2204335 2169037 2132902 2095775 2058184 2020791 1983860 1947385 1911422 1876029 1841076
66832 1841076 1806325 1771616 1736883 1702159 1667678 1633763 1600509 1567738 1535385 1503612 1472377
66821 1472377 1441309 1410384 1380388 1352108 1325213 1298570 1271621 1244815 1218596 1192826 1167528
66810 1167528 1143410 1120924 1099310 1077390 1055080 1033304 1012489 991937 970932 949821 929618
66799 929618 910886 893335 876312 859406 842692 826542 811196 796563 782483 768981 755945
66788 755945 742792 728970 714751 700997 688071 675507 662912 650601 638985 627821 616522
66777 616522 604912 593274 581902 571000 560814 551462 542697 534056 525160 515787 506026 496525 488175
66764 488175 481145 474521 467234 459077 450520 442024 434056 427286 421955 417215 411821 405462 398827 392518
66750 392518 386639 381376 377051 373299 369019 363597 357736 352684 349023 346450 344232 341540 337776 333039
66736 333039 328054 323371 318934 314603 310636 307265 304150 300746 296971 293140 289439 285864 282516 279569
66722 279569 276998 274631 272381 270222 268061 265781 263267 260273 256596 252569 248994 246248 243807 241044
66708 241044 238148 235762 233994 232378 230647 228977 227447 225729 223387 220124 215921 211356 207584 205352
66694 205352 204068 202464 200226 198291 197442 197325 197170 196774 196304 195651 194596 193292 192026 190647 188708 186101
66678 186101 183175 180323 177765 175610 173763 171857 169589 167182 165193 163900 163131 162684 162522 162486 162130 161099
66662 161099 159499 157731 156056 154563 153437 152967 153123 153310 152797 151459 149908 148870 148525 148535 148476 148073 147219
66645 147219 146065 145062 144615 144657 144695 144236 143025 141112 138999 137529 137128 137184 136675 135427 134174 133349 132573
66628 132573 131601 130933 130897 130752 129538 127437 125540 124491 124103 124102 124383 124575 124143 123091 121822 120248 117903
66611 117903 115152 113385 113430 114526 115435 115933 116408 116601 115818 114244 113009 112721 112693 111910 110182 108026 105907
66594 105907 104070 102752 102114 102063 102413 103102 104045 104971 105686 106283 106748 106573 105292 103414 102198 102227 102661 102317
66576 102317 101099 99816 98855 97818 96500 95424 95022 94927 94647 94431 94748 95211 94903 93757 92825 92933 93751
66559 93751 94444 94623 94281 93387 92105 91016 90600 90736 91117 91778 92687 93218 92720 91433 90154 89091 87779
66542 87779 86122 84734 84044 83815 83819 84300 85279 85971 85523 84077 82558 81611 81200 81126 81359 81812 82140 82018 81431
66523 81431 80633 79911 79403 79080 78889 78862 79025 79205 79139 78805 78478 78437 78819 79728 81074 82185 82005 80049 76988
66504 76988 74046 72014 71002 70729 70755 70675 70528 70811 71819 73220 74602 76055 77747 79239 79895 79764 79363
66487 79363 78723 77441 75748 74727 75111 76419 77586 77968 77503 76456 75398 74968 75177 75201 74302 72707 71318
66470 71318 70725 70834 71178 71299 71003 70571 70567 71222 72143 72799 73043 73012 72823 72632 72664 72929 73164 73291 73537 73861
66450 73861 73725 72882 71920 71516 71563 71631 71856 72533 73118 72626 71062 69589 69108 69391 69782 69955 69765 69112 68386
66431 68386 68348 69086 69663 69402 69014 69760 71752 73757 74570 74001 72592 70962 69625 69025 69382 70458 71560
66414 71560 71889 71095 69626 68359 67746 67505 67157 66650 66265 66232 66686 67653 68766 69263 68687 67461 66411 65847
66396 65847 65471 65064 64773 64705 64692 64596 64565 64781 65222 65780 66458 67291 68175 68875 69116 68645 67389 65643 64042
66377 64042 63191 63301 64191 65581 67320 69249 70893 71556 70940 69591 68455 68001 67983 67993 67839 67396 66538 65443
66359 65443 64513 63787 62883 61769 61058 61105 61343 61102 60663 60800 61645 62754 64028 65584 66846 66852 65592 64152
66341 64152 63201 62322 61202 60523 60951 61971 62546 62456 62174 61867 61372 60989 61365 62530 63696 64156 63890 63293
66323 63293 62814 62885 63664 64716 65437 65884 66684 67968 68933 68831 67995 67448 67734 68504 69122 69286 69078 68693 68263
66304 68263 67823 67399 67109 67096 67322 67570 67780 68232 69179 70349 71002 70568 69131 67265 65525 64103 62863
66287 62863 61562 60124 58841 58257 58681 59765 60698 60960 60773 60742 61153 61798 62362 62763 63131 63657 64472 65468
66269 65468 66230 66369 65909 65127 64031 62403 60449 58949 58472 58769 59265 59856 60777 61964 63036 63826 64359
66252 64359 64353 63318 61418 59762 59524 60911 63141 65189 66398 66639 66209 65551 64913 64295 63696 63219 62880
66235 62880 62572 62297 62175 62117 61844 61504 61893 63582 65957 67637 67846 66984 65860 64928 64467 64822 65883 66684
66217 66684 66241 64832 63866 64264 65482 66397 66700 66920 67414 67922 68124 68053 67821 67410 66991 67064 67933 69200 70028
66198 70028 69841 68688 67166 66098 66024 66742 67553 68133 68854 70033 71285 72047 72353 72528 72411 71608 70385
66181 70385 69429 68659 67194 64857 62919 62705 64002 65553 66721 67866 69216 70223 70250 69338 68003 66608
66165 66608 65248 63998 63007 62352 61995 61887 62109 62870 64310 66255 68243 69863 70954 71403 70962 69558
66149 69558 67756 66547 66505 67250 67880 67861 67421 67097 67056 67006 66731 66443 66363 66157 65202 63521 62032 61633 62299
66130 62299 63279 63900 63897 63305 62485 62130 62735 64009 65161 65744 65923 65953 65789 65328 64657 63971 63544 63807 65123
66111 65123 67278 69532 71300 72537 73331 73540 73172 72802 73171 74386 75805 76693 76798 76326 75601 74844 74159
66094 74159 73621 73260 72980 72613 72260 72401 73374 74814 76033 76987 78342 80374 82279 83004 82432 81325 80389
66077 80389 79857 79723 79812 79693 79063 78222 77713 77546 77288 76923 76958 77537 78034 77893 77354 76928 76575 75989 75459 75785
66057 75785 77223 78986 80045 80245 80355 81021 81865 81833 80487 78717 77870 78293 79117 79524 79722 80421 81745
66040 81745 83080 83855 84059 84083 84333 84933 85568 85692 85094 84155 83362 82810 82474 82633 83522 84719 85494 85774 86222
66021 86222 87260 88577 89760 90823 91762 92143 91733 91214 91668 93347 95376 96728 97162 97150 97250 97682 98413
66004 98413 99466 101079 103488 106512 109509 111920 113859 116025 118998 122653 126214 128897 130625 132121
65990 132121 134192 136871 139430 141246 142351 143052 143353 143030 142069 140751 139447 138502 138069 137790 136921 135135
65974 135135 132893 130622 127874 123980 119375 115436 112872 111039 109119 107260 106017 105271 104441 103470 102880
65959 102880 102867 102938 102580 101859 101192 100863 100950 101516 102597 104065 105665 107218 108772 110538 112601 114719 116495
65942 116495 117815 119008 120489 122374 124585 127095 129808 132261 133797 134216 134065 134138 134738 135478 135812 135697
65926 135697 135696 136378 137650 138840 139490 139859 140568 141958 144075 146990 150706 154796 158720 162633 167349 173099
65910 173099 178687 182481 184172 185008 186232 187760 188655 188489 187768 187208 187050 187188 187559 188179 188941 189577 189792
65893 189792 189351 188166 186365 184204 181804 179090 176052 172876 169669 166242 162423 158434 154678 151146
65879 151146 147413 143219 138783 134539 130906 128357 127260 127335 127592 127154 125995 124659 123519 122622 121962 121430
65863 121430 120645 119294 117615 116066 114628 113016 111598 111325 112397 113702 114210 114394 115460 117410 118840
65848 118840 118784 117860 117223 117104 116983 116607 116108 115456 114714 114671 116245 119025 121288 122006 122112 123130 125144 127023
65830 127023 128322 129836 132122 134507 136120 137221 138848 141565 145204 149632 154968 160906 166436 170628
65816 170628 173476 175686 177756 179553 180735 181276 181380 181027 179974 178298 176606 175372 174209 172179 168901
65801 168901 165007 161449 158672 156605 155074 153875 152699 151388 150158 149294 148669 147876 146811 145949 145976 147255
65785 147255 149562 152247 154758 157194 160240 164440 169680 175565 182045 189345 197375 205550 213189 219827
65771 219827 225198 229192 231777 232700 231297 227010 220185 212064 203855 195977 188293 180801 173886 167972
65757 167972 163150 159213 156052 153902 153048 153333 154299 155956 159000 163925 170239 177049 184259 192643 202772
65742 202772 214346 226567 238595 249538 258555 265263 269731 272020 272184 270784 268629 265577 260187
65729 260187 251334 239874 228071 217397 207515 197408 186891 176625 167111 158303 150206 143409 138568
65716 138568 135479 133026 130233 127059 123983 121138 118286 115462 113067 111315 110038 109085 108384 107573 106154
65701 106154 104289 102879 102512 102794 103064 103261 103653 104179 104660 105368 106730 108599 110387 111761 112739 113229 113125
65684 113125 112839 113149 114361 116050 117732 119379 121192 123297 125858 129102 133062 137549 142500 148078 154394
65669 154394 161475 169619 179371 190904 203723 217171 230931 244712 257820 269547 279923 289587
65657 289587 298780 306790 312564 315706 316697 316359 315453 314691 314579 314960 315023 314322 313688 314567 317312 320581 322669
65640 322669 322961 321747 319163 314928 308928 301328 292126 281158 268669 255388 241840 228001 213852
65627 213852 199936 187073 175745 166014 157814 151055 145474 140617 136077 131737 127764 124310 121216
65614 121216 118133 114999 112226 110214 108894 108001 107589 107855 108495 108705 107980 106618 105388 104905 105331 106342
65598 106342 107285 107673 107671 107862 108488 109207 109652 109940 110455 111352 112409 113295 113950 114803 116447 118880 121292 123004
65580 123004 124414 126453 129307 132459 136001 140960 147979 156474 165634 175552 186707 198936 211677
65567 211677 224743 237969 250391 260696 268530 274560 279168 281794 281780 279180 274433 267718 259101 249036
65553 249036 238318 227589 217110 206897 196916 187177 177793 169002 161122 154385 148691 143557 138554
65540 138554 133891 130314 128263 127370 126935 126595 126288 125956 125790 126413 128207 130511 132063 132264 131565 130629 129656
65523 129656 128613 127547 126436 125106 123507 121741 119713 117175 114307 111851 110460 110154 110562 111271 111762
65508 111762 111464 110293 108885 107958 107664 107738 107931 107981 107558 106681 106006 106232 107344 108821 110358 111928 113283
65491 113283 113995 114110 114308 115247 117030 119420 122237 125376 128638 131717 134262 135962 136797 137191 137659 138239
65475 138239 138573 138577 138625 138890 138857 137871 135973 133868 132111 130611 128917 126718 124043 121227 118738 116870 115512
65458 115512 114298 112999 111675 110557 109952 110185 111305 112761 113694 113716 113148 112344 111168 109503 107900 107137
65442 107137 107186 107295 107163 107366 108369 109743 110931 112232 114325 117087 119714 121928 124205 126639 128449
65427 128449 129030 128839 128618 128256 127132 125232 123131 121004 118501 115750 113713 113099 113423 113616 113274 112872
65411 112872 112951 113566 114518 115707 117151 118909 121075 123660 126379 128671 130072 130596 130741 131152 132138 133406
65395 133406 134340 134653 134758 135355 136731 138626 140652 142536 143930 144348 143555 141800 139501 136929 134392 132504
65379 132504 131832 132348 133500 134843 136305 137894 139505 141059 142526 143730 144496 145066 145992 147362 148548
65364 148548 149030 149180 149848 151453 153899 157121 161122 165600 170152 174984 180838 187993 195788 203348 210352
65349 210352 216816 222552 227354 231442 235144 238165 239569 238659 235641 231436 227017 222934 219190 215414
65335 215414 211188 206266 200505 193837 186458 178964 172049 166104 161213 157392 154484 151944 149113 145873
65321 145873 142790 140468 138955 137876 136940 136098 135355 134659 133980 133344 132749 132125 131377 130413 129103 127239 124661
65304 124661 121579 118748 117104 116962 117672 118284 118523 118936 120154 122270 124919 127582 129768 131278 132486
65289 132486 134000 135796 137042 137105 136442 136067 136369 136958 137479 137997 138536 138890 139109 139625 140579 141407 141523 141150
65271 141150 141029 141421 141798 141490 140262 138259 135713 132862 129999 127476 125611 124494 123785 122871 121470 119993
65255 119993 119064 118759 118664 118678 119299 120837 122649 123561 123072 121924 121426 122265 123898 124976 124418 122267 119574
65238 119574 117459 116317 115948 116215 117293 119191 121296 122667 122847 122268 121796 121879 122217 122195 121474 120151 118495
65221 118495 116743 115056 113526 112192 111149 110615 110711 111285 112120 113283 114970 116940 118407 118673 117715 116077
65205 116077 114469 113600 113957 115319 116629 116855 115998 114953 114387 114147 113820 113440 113328 113524 113725 113719 113565 113356
65187 113356 113064 112741 112689 113249 114421 115801 116896 117441 117458 117213 117231 118149 120231 122960 125351 126730 127115
65170 127115 126917 126572 126536 127221 128583 130033 131037 131678 132383 133339 134579 136385 139002 142021 144561 146275
65154 146275 147681 149369 151349 153432 155813 158903 162861 167673 173484 180429 188245 196449 204902 213909
65140 213909 223642 233695 243368 252333 260935 269769 278967 287969 296103 303232 309651 315430 320234 323721
65126 323721 325712 325944 324234 321113 317725 314622 311042 305887 299076 291382 283293 274817 266285 258423
65112 258423 251393 244439 236877 228911 221130 213668 206331 199177 192445 186069 179794 173701 168212 163548
65098 163548 159551 156083 153237 150968 148808 146249 143338 140700 138977 138312 138381 138729 138994 138946 138545 138020
65082 138020 137756 137942 138422 138953 139568 140467 141627 142677 143221 143117 142433 141327 140107 139190 138766 138534 137965
65065 137965 136857 135526 134426 133781 133637 134113 135299 136897 138247 138925 139220 139857 141301 143442 145802 147707
65049 147707 148403 147479 145419 143379 142166 141652 141380 141338 141724 142229 142147 141234 140050 139303 139131 139074 138473 136908
65031 136908 134506 131826 129236 126501 123288 119999 117651 116907 117542 118862 120157 120816 120603 120033 119943 120455
65015 120455 120888 120901 121060 121835 122730 123113 123388 124447 126174 127423 127547 127229 127572 128947 130982 133185 135289
64998 135289 137300 139421 141695 143644 144629 144699 144689 145229 146004 146297 146007 145761 146166 147278 148789 150438 152158
64981 152158 153966 155801 157500 158977 160375 161837 163112 163557 162769 161058 159162 157513 155941 154035 151632
64966 151632 148921 146198 143671 141473 139712 138355 137060 135374 133280 131420 130530 130626 130947 130713 129755 128430
64950 128430 127152 126117 125346 124807 124522 124563 124855 125114 125121 125023 125126 125396 125419 124908 124029 123124 122377 121889 121869 122512
64930 122512 123769 125313 126678 127457 127600 127546 127733 127912 127329 125820 124343 123992 124716 125475 125516 125068 124744 124796
64912 124796 125098 125522 126048 126634 127177 127585 127849 128103 128600 129509 130754 132142 133559 134943 136215 137510 139377
64895 139377 142362 146346 150663 154940 159470 164551 169855 174804 179309 183663 187800 191171 193518 195329
64881 195329 197194 198928 199713 199159 197864 196737 195944 194802 192671 189668 186404 183279 180285 177383 174749
64866 174749 172633 171170 170391 170155 170006 169348 167958 166217 164678 163503 162467 161341 160046 158528 156706
64851 156706 154595 152281 149851 147487 145573 144431 143864 143208 141899 139887 137537 135428 134206 134194 134865
64836 134865 135070 134172 132747 131799 131526 131402 131274 131618 132508 133090 132603 131525 131100 131881 133286 134532 135495
64819 135495 136480 137597 138702 139818 141290 143423 146036 148509 150435 152231 154836 158752 163619 168943
64805 168943 174819 181500 188542 194997 200368 204730 207875 209111 208196 205814 202707 198942 194627 190677
64791 190677 187943 185815 182720 178141 173332 169680 167142 164763 162166 159759 157802 156128 154877 154702
64777 154702 155793 157137 157416 156576 155970 156808 158890 161152 162981 164556 166195 168073 170564 174121 178545
64762 178545 182971 186986 191251 196486 202293 207615 212068 216077 219856 223074 225649 228114 230919 233946
64748 233946 236992 240160 243388 246059 247538 247766 246920 244821 241195 236326 230950 225517 219964 214182 208396
64733 208396 203043 198511 194976 192341 190360 188919 187992 187201 185802 183561 181364 180430 180951 181993 182728
64718 182728 183192 183819 184863 186584 189440 193536 198110 202070 204985 207225 209173 210664 211261 210781 209402
64703 209402 207415 205004 202258 199278 196151 192811 188959 184299 178954 173593 169033 165696 163425 161745
64689 161745 160232 158758 157531 156858 156844 157325 158156 159424 161175 163025 164336 164936 165506 167000 169687 172958
64673 172958 176111 179149 182652 186958 191722 196311 200444 204291 208059 211677 214850 217248 218551 218487 216960
64658 216960 214180 210633 206844 203135 199505 195837 192260 189270 187344 186439 185960 185290 184207 182856 181575
64643 181575 180890 181370 183118 185434 187383 188838 190699 193927 198580 204029 209872 216256 223381 231080 239072
64628 239072 247240 255400 262976 269231 273760 276530 277537 276752 274466 271304 267707 263588 258725 253342
64614 253342 248090 243514 239743 236681 234255 232389 230917 229598 228228 226675 224892 222956 221045 219324
64600 219324 217830 216381 214583 212049 208805 205518 203089 201850 201222 200301 198736 196859 195021 193104 190888
64585 190888 188657 187056 186328 186035 185694 185430 185798 187119 189322 192341 196286 201110 206381 211549 216275
64570 216275 220360 223553 225639 226639 226729 225954 224178 221324 217567 213239 208592 203653 198317 192585 186759
64555 186759 181394 177051 174026 172193 171067 170133 169289 168885 169215 170083 171062 171973 172837 173502 173809 174070 174850
64538 174850 176136 177247 177801 178220 178965 179755 180020 179753 179340 178841 178003 176769 175249 173381 171239 169458
64522 169458 168718 168822 168977 168952 169230 169947 170486 170420 170145 170176 170459 170787 171363 172339 173295 173824 174363 175819 178434
64503 178434 181528 184292 186484 188402 190625 193763 198082 203271 208743 214099 219172 223754 227534 230265
64489 230265 231859 232498 232717 233037 233274 232594 230570 227830 225261 223069 221159 219933 219743 219746 218438 215552
64473 215552 212513 210598 209453 207940 205678 203055 200241 197152 194219 192349 191965 192611 193628 194767 196041
64458 196041 197466 199188 201480 204335 207215 209495 211050 212194 213161 213901 214380 214817 215509 216533 217718
64443 217718 218880 220057 221594 223984 227503 231885 236511 241042 245790 251337 257936 265546 274336 284671
64429 284671 296495 309243 322739 337899 356115 378086 403651 432726 466025 504835 550491
64418 550491 604083 666193 736537 813868 896289 981541 1067044 1150138 1228673 1301448 1368034
64407 1368034 1428113 1480776 1524144 1555728 1573549 1577191 1567717 1546600 1514884 1473122 1421613 1360520
64395 1360520 1290318 1212461 1129447 1044009 958523 875290 796795 725024 660667 603454 553106
64384 553106 509507 472019 439315 410184 384200 361440 341832 325016 310610 298325 287869
64373 287869 278993 271628 265776 261117 256795 251821 245857 239543 233876 229264 225343 221617 217883 213936
64359 213936 209380 204241 199506 196471 195390 195137 194383 192891 191586 191574 193252 196234 199919 203994 208383
64344 208383 212800 216690 219737 222144 224105 225258 225137 223993 222574 221026 218657 215079 211056 207740
64330 207740 205395 203395 201333 199596 198841 199339 200937 203292 205903 208179 209801 210933 211840 212310 211735
64315 211735 209914 207566 205771 204986 204829 204807 204836 204867 204426 203010 200789 198436 196267 193935 191020 187559
64299 187559 183912 180473 177580 175259 172974 170112 166974 164750 164138 164437 164514 164275 164531 165702 167359 168992
64283 168992 170529 171985 173256 174519 176356 179148 182685 186603 190866 195556 200472 205270 209860 214434
64269 214434 219208 224235 229265 233611 236448 237501 237315 236688 236062 235648 235729 236430 237363 238034 238538 239331 240279
64252 240279 240467 239208 236818 234005 230791 226549 221012 214757 208552 202692 197216 192435 188748 186064
64238 186064 183909 182158 181229 181285 181626 181285 180048 178548 177542 177462 178530 180701 183340 185443 186468 186720
64222 186720 186731 186598 186145 185447 184786 184128 182980 180839 177740 174372 171669 170133 169507 169197 168953 168894 168984 168912
64204 168912 168633 168537 168866 169343 169647 169826 169937 169742 169250 169189 170307 172457 174948 177605 180851 184883 189481
64187 189481 194612 200594 207554 215369 224161 234173 244887 254873 262811 268214 271009 271076 268583 264243
64173 264243 258793 252558 245781 238854 231918 224784 217686 211472 206464 201716 196215 190435 185807 182834
64159 182834 180615 178176 175364 172325 169025 165724 163276 162361 162758 163732 164920 166493 168692 171493 174642
64144 174642 177822 180872 183877 186907 189681 191809 193384 194951 196740 198321 199249 199686 200056 200394 200435 200135
64128 200135 199679 199046 198002 196529 194915 193403 192095 191254 191314 192383 194045 195948 198399 201999 206758
64113 206758 211952 217020 222297 228633 236399 245132 254043 262573 270370 277011 281986 284997 286203 286233 285996
64098 285996 286368 287939 291037 295852 302314 309836 317464 324440 330423 335092 337933 338723 337932 336151 333292
64083 333292 328813 322748 315951 309191 302451 295348 287846 280227 272710 265493 258915 253117 247678 242150
64069 242150 237018 233556 232355 232411 232102 230908 229617 228931 228518 227767 226851 226468 226762 227187 227466 228065 229536
64052 229536 231886 234799 238048 241429 244770 248392 253105 259248 266072 272640 279073 286232 294335 302670
64038 302670 310743 318937 327790 337177 346594 355707 364175 371248 376117 378606 379187 378254 375647 371049 364857
64023 364857 358517 353730 351091 349639 347986 345692 343206 340647 337355 332773 327264 321712 316650 312002
64009 312002 307393 302460 297126 291791 287050 283132 279884 277292 275506 274183 272414 269723 266718 264281
63995 264281 262518 261034 259924 259852 261184 263589 266468 269394 272194 275037 278439 282766 287678 292437 296812
63980 296812 301378 306898 313667 321441 329705 337964 346081 354397 363315 372803 382550 392565 403265 414994
63966 414994 427814 441870 457530 474950 493807 513716 534752 557328 581697 607801 635616
63955 635616 665475 698089 734417 775614 823061 878320 942897 1017970 1104378 1202941 1314708
63944 1314708 1440802 1581931 1737884 1907271 2087793 2277085 2473424 2675289 2879987
63935 2879987 3082902 3278452 3461711 3628880 3776468 3900593 3997467 4064459 4100584 4105938
63925 4105938 4080654 4024510 3937802 3822617 3682921 3523235 3347576 3159929 2965126 2768371
63915 2768371 2573793 2383880 2200404 2025484 1861586 1710786 1574133 1451524 1342143
63906 1342143 1245194 1160160 1086191 1021587 964405 913555 868781 829626 795028 764135 736846
63895 736846 713133 692296 673354 655923 640140 625822 612139 598217 583847 569523 555983
63884 555983 543727 532908 523559 515852 510009 506021 503642 502753 503574 506448 511540 518769 527880 538466
63870 538466 550093 562523 575783 589980 605155 621284 638218 655460 672191 687660 701598
63859 701598 714141 725339 734801 741904 746415 748760 749431 748218 744405 737867 729467 720031 709344 696654
63845 696654 681799 665265 647381 628262 608399 588468 568389 547408 525402 503410 482493
63834 482493 462746 443861 426013 409535 394164 379320 364863 350991 337641 324657 312432
63823 312432 301714 292737 285039 278160 271983 266283 260501 254349 248338 243377 239855 237269 234725 231697
63809 231697 228345 225189 222553 220428 218765 217609 216814 215934 214650 213230 212262 211942 211846 211398 210437 209264
63793 209264 208253 207460 206600 205457 204240 203378 202923 202367 201185 199406 197537 196055 195086 194428 193720 192679
63777 192679 191280 189725 188230 186994 186259 186093 186092 185679 184839 184226 184372 185084 185785 186101 185920 185278 184485 184044
63759 184044 184046 183908 183074 181725 180475 179652 179282 179503 180485 182036 183728 185334 186848 188219 189461 190847
63743 190847 192549 194225 195390 196091 196789 197727 198889 200435 202591 205149 207649 210075 212789 215709 218185
63728 218185 219889 221326 223197 225719 228871 232809 237612 242861 247875 252330 256426 260489 264551 268248
63714 268248 271099 272938 273963 274262 273460 271214 267863 264188 260576 256914 253275 250082 247467 244999 242370
63699 242370 239901 238130 237293 237420 238526 240389 242497 244523 246539 248538 250238 251687 253667 256946 261361
63684 261361 266008 270122 273373 275624 277016 278182 279813 281878 283587 284143 283366 281743 280219 279773 280704
63669 280704 282243 283241 283347 283267 283876 285376 287319 289103 290255 290496 289772 288151 285669 282365 278427 274211
63653 274211 270082 266338 263109 260124 256750 252647 248391 245079 243212 242301 241654 241213 241356 242171 243323
63638 243323 244574 246089 248113 250554 253005 255149 257041 259029 261469 264599 268620 273691 279696 286123
63624 286123 292405 298482 304963 312678 322091 333090 345248 358244 372148 387322 404014 422114
63612 422114 441424 462137 484816 509851 537071 565944 595976 626686 657288 686569 713069
63601 713069 735282 751833 761800 765158 762901 756686 748295 739188 730161 721172 711629 701139 689877
63588 689877 677989 664733 648727 629337 607522 584962 562551 540187 517932 496767 477879
63577 477879 461579 447304 434587 423681 415175 409215 405187 402098 399344 397239 396760 398611 402553
63564 402553 407731 413565 420084 427401 435299 443609 452755 463462 475877 489352 503283 517911 534041
63551 534041 552238 572727 595992 622931 654119 689185 727077 766537 805784 841895 871242
63540 871242 891081 900819 901727 895718 884562 870063 854382 839671 827225 817064 808470 800784 793522
63527 793522 785800 776116 763001 745792 724655 700094 672731 643445 613332 583399 554370 526683
63515 526683 500495 475808 452830 432063 413767 397491 382545 368839 356833 346704 338066 330540
63503 330540 323980 318006 311987 305861 300456 296516 293864 291983 290948 291081 291949 292512 292235 291421 290421
63488 290421 289275 288323 288485 290406 293635 297060 299950 302301 304446 306794 309909 314333 320067 326309 331878
63473 331878 335979 338649 340483 341888 342636 342209 340546 338150 335345 331717 326627 320209 313502 307528 302481
63458 302481 297979 293848 290384 287964 286681 286368 286743 287497 288460 289819 292026 295395 299936 305609 312470
63443 312470 320384 328936 337983 348087 359993 373845 389418 407075 427805 452043 478858 506531
63431 506531 533434 558010 578475 593380 602563 607252 609313 610726 613485 619280 629003 642801 660679
63418 660679 682701 708636 737887 769998 804809 841712 878859 913421 942588 964403 978029
63407 978029 983724 982609 976206 966047 953581 940135 926639 913359 900023 886117 870846 853016
63395 853016 831468 805893 777081 746256 714393 682294 650998 621616 594684 569922 546716
63384 546716 524761 504246 485680 469632 456430 445996 437990 432128 428196 425817 424525 424216 425251
63371 425251 427953 432267 438131 445873 455921 468317 482859 499486 518135 538414 559943 582988
63359 582988 608271 636187 666617 699412 734384 770757 807207 842605 876082 906166 930617
63348 930617 947672 957087 959617 956109 947622 935832 922463 908489 894397 880782 867923 854994
63336 854994 840550 823775 804564 782529 756970 728123 697667 667478 638405 610600 584519
63325 584519 561090 541147 525117 513065 504730 499593 496978 495796 494113 489578 480860 468570 454431
63312 454431 439733 424828 409799 395026 381073 368413 357348 347913 339794 332623 326413 321501
63300 321501 317992 315482 313409 311483 309633 307723 305531 302986 300238 297494 294859 292351 289947 287500
63286 287500 284737 281516 278146 275325 273588 272861 272601 272361 272102 271966 271938 271913 272034 272714 274165 275967 277288
63269 277288 277628 277219 276646 276282 276287 276895 278279 280086 281533 282213 282598 283571 285643 288720 292397 296248 300037
63252 300037 303849 307905 312162 316329 320427 325018 330610 337172 344536 352941 362703 373607 385154 397310
63238 397310 410501 424988 440781 458138 477558 499166 522565 547366 573398 600271 627246
63227 627246 653739 679595 704741 729047 752688 776144 799552 822492 844763 866948 889802
63216 889802 913385 937216 960995 984539 1006932 1026228 1040253 1047714 1048598 1043603 1033177 1017089
63204 1017089 994980 967244 935138 900105 863354 826104 789673 754911 721913 690685 661905
63193 661905 636630 615393 597947 583833 572819 564817 559666 557084 556673 557915 560338 563696 567992
63180 567992 573388 580157 588459 597948 607725 616994 625808 634904 644770 655067 665094 674645 684119 693641
63166 693641 702321 708705 711960 712309 710193 705506 698018 688106 676427 663131 648141 632033 615699
63153 615699 599015 580876 561056 541184 523129 507040 491795 476977 463456 452141 442993 435416
63141 435416 428971 423449 418626 414203 409949 405915 402579 400481 399513 398850 397887 396890 396390 396351 396506 397130
63125 397130 398732 401133 403610 405900 408386 411261 414322 417654 421711 426383 430674 433818 436213 438808
63111 438808 441954 445323 448614 451835 454963 457774 460081 461966 463738 465630 467461 468724 469276 469840 471378
63096 471378 473877 476204 477331 477333 477063 477259 478165 479530 480605 480549 479338 478063 477992 479484 482084 485322 488920
63079 488920 492440 495396 497887 500789 505162 511513 519478 528025 536127 543587 551164 559699 569275 579535
63065 579535 590566 602920 616842 632125 648904 667994 690062 714880 741873 771175 803637
63054 803637 839852 879608 922380 967964 1016446 1067812 1121832 1178210 1236621 1296552 1357197
63043 1357197 1417557 1476743 1534371 1590753 1646598 1702399 1758179 1813859 1869601 1925569 1981464
63032 1981464 2036601 2090312 2141813 2189505 2230810 2262945 2283734 2291631 2285471 2264752 2230005 2182477
63020 2182477 2123478 2054419 1977405 1895246 1810635 1725619 1642009 1561824 1486837 1417799 1354580
63009 1354580 1297222 1246605 1203811 1168983 1141076 1118770 1101413 1088967 1081319 1078037 1078735 1083158
62997 1083158 1090703 1100247 1110808 1122235 1134902 1148859 1163587 1178521 1193492 1208587 1223767 1238598
62985 1238598 1252203 1263615 1272423 1278958 1283495 1285301 1282811 1274754 1260913 1241807 1218020 1189947
62973 1189947 1157945 1122621 1085055 1046650 1008556 971316 935274 901061 869267 839826 812304
62962 812304 786714 763479 742578 723414 705628 689302 674109 659140 644131 630175 618376
62951 618376 608159 597740 586137 574014 562551 552183 542642 533607 524965 516686 508768 501196 493802
62938 493802 486323 478752 471564 465412 460492 456245 451793 446748 441533 436862 433109 430340 428667 428077
62924 428077 427980 427474 426268 424900 423942 423411 423122 423052 422979 422291 420656 418567 416816 415664 414882 414143 412973
62907 412973 410821 407809 404998 403220 401954 400189 398100 396880 396942 397351 397214 396725 396458 396414 396304 396180 396197
62890 396197 396138 395716 395071 394605 394514 394801 395511 396624 397907 399117 400163 400901 401113 400926 400957 401714 403005 404168
62872 404168 404655 404293 403324 402476 402615 403864 405257 405625 404708 403151 401656 400547 399957 399986 400618 401745 403249
62855 403249 404905 406358 407449 408420 409582 410991 412657 414749 417185 419332 420649 421500 422717 424358 425470
62840 425470 425215 423785 422039 420677 419960 419834 420032 420267 420555 421155 422030 422643 422469 421567 420452 419545 418932
62823 418932 418525 418321 418563 419664 421831 424706 427603 430187 432714 435560 438812 442433 446525 451141 456102
62808 456102 461238 466639 472364 478144 483721 489357 495610 502650 510222 518301 527374 537904 549894 563160
62794 563160 577763 593802 610964 628757 647342 667936 692104 720634 753242 789503 829907
62783 829907 875752 927992 986485 1050646 1120560 1197043 1280661 1371060 1467329 1568481 1673133
62772 1673133 1778887 1882452 1980532 2070467 2150143 2217567 2270724 2307771 2327315 2328610 2311614
62761 2311614 2276985 2226087 2161042 2084597 1999700 1909034 1814873 1719212 1623787 1529979 1438839
62750 1438839 1351266 1268075 1189815 1116668 1048667 985979 928881 877456 831360 789891 752263
62739 752263 717896 686550 658248 633036 610725 590847 572856 556452 541772 529230 519023
62728 519023 510736 503482 496557 489931 484096 479513 476272 474133 472700 471618 470824 470677 471583 473409 475532
62713 475532 477720 480674 485332 491764 499304 507839 518370 531892 548102 565802 584460 604819 627895
62700 627895 653919 682529 713565 747230 783610 822412 863190 905582 949319 994081 1039228
62689 1039228 1083436 1124732 1161191 1191609 1215268 1231191 1238125 1235539 1224293 1205982 1181702 1151713
62677 1151713 1116204 1076098 1032994 988527 943814 899393 855549 812773 771972 734167 699938
62666 699938 669156 641277 615850 592729 571881 553118 536047 520267 505629 492336 480700
62655 480700 470709 461898 453841 446689 440884 436206 431531 425943 419810 414220 409504 405013 400430 396443
62641 396443 393621 391350 388711 386010 384451 384359 384649 384320 383693 383745 384765 386170 387242 387643 387473 387220 387382
62624 387382 387843 387944 387556 387633 389149 391817 394530 396927 399812 403967 409262 415107 421177 427361 433433
62609 433433 439273 445211 451854 459645 468677 478791 489784 501780 515463 531693 550827 572759
62597 572759 597702 626362 659060 695164 733921 775494 820542 868857 918957 969037 1017761
62586 1017761 1064009 1106396 1143389 1173582 1195647 1208297 1210776 1203365 1187229 1163748 1134041 1098970
62574 1098970 1059369 1016275 971018 925019 879373 834663 791262 749699 710579 674279 640975
62563 640975 610905 584271 560804 539733 520422 502864 487320 473648 461321 450014 439823
62552 439823 430819 422825 415847 410326 406500 403721 400930 397885 395408 394189 393754 392984 391412 389565 388107
62537 388107 387134 386404 385827 385351 384648 383342 381635 380392 380426 381806 384013 386641 389708 393321 397376 401867
62521 401867 407309 414488 423722 434614 446699 460089 475282 492486 511511 532333 555366 580879
62509 580879 608283 636296 663856 690673 716788 741717 764240 783042 797466 807591 813721 815948
62497 815948 814223 808679 799802 788418 775664 762980 751853 743345 737770 734876 734414 736543 741766
62484 741766 750544 763072 779394 799583 823659 851373 882150 915242 949772 984562 1018021 1048339
62472 1048339 1073872 1093510 1106856 1114088 1115460 1110770 1099410 1081022 1056014 1025351 990012 950887
62460 950887 909075 865962 822887 780832 740386 701829 665299 631163 600208 573187 550055
62449 550055 529926 511929 495925 482321 471503 463611 458500 455585 453943 452981 452899 454204 456844 460182
62435 460182 463709 467389 471219 474844 477729 479475 479832 478688 476143 472412 467575 461636 454881 447820
62421 447820 440636 433010 424748 416323 408520 401709 395748 390453 385805 381735 378025 374540 371416 368897
62407 368897 367044 365548 363865 361667 359232 357206 355862 354788 353496 352123 351308 351507 352654 354317 355940
62392 355940 357102 357894 358918 360583 362508 364036 365203 366674 368718 370814 372501 374121 376421 379788
62378 379788 384133 389231 394800 400476 406092 411940 418570 426420 435729 446540 458571 471305 484516
62365 484516 498533 513784 530389 548558 569125 593115 620856 652062 686807 725915 770076
62354 770076 818988 871592 926770 983344 1039514 1092711 1140244 1180054 1210982 1232600 1245041
62343 1245041 1248941 1245317 1235213 1219343 1198091 1171854 1141189 1106554 1068174 1026581 983245 940297
62331 940297 899446 861366 826251 794577 766964 743426 723149 705163 688938 674223 660592
62320 660592 647453 634473 621689 609072 596165 582338 567370 551637 535783 520334 505596
62309 505596 491705 478684 466613 455832 446831 439705 433830 428230 422387 416579 411491 407611 404976
62296 404976 403323 402382 402086 402520 403621 404931 405844 406227 406696 408133 410861 414453 418371 422651 427819 434151
62280 434151 441204 448167 454584 460675 467075 474426 483188 493563 505374 518059 530969 543800 556758
62267 556758 570298 584703 599959 616044 633236 652043 672816 695664 720769 748618 779770
62256 779770 814558 853156 895790 942568 993153 1046649 1101624 1155939 1206723 1251039 1286814
62245 1286814 1313132 1329844 1337358 1336697 1329139 1315421 1295507 1269226 1236824 1198798 1155683 1108348
62233 1108348 1058209 1006750 954948 903456 853187 805516 761936 723532 690472 661899 636609
62222 636609 614013 594208 577123 562159 548905 537590 528322 520412 513020 506096 500065 494857 489921
62209 489921 484940 479951 474924 469931 465563 462452 460442 458891 457738 457557 458621 460700 463795 468174
62195 468174 473503 478839 483827 489145 495389 502316 509651 517850 527386 537903 548809 560244 572689
62182 572689 585987 599426 612527 625061 636529 646385 654711 662010 668378 673564 677898 682529 688613
62169 688613 696786 707606 721907 740417 763377 790886 823292 860729 902292 945938 989287 1030444
62157 1030444 1068048 1100734 1126939 1145478 1156274 1160214 1158227 1150734 1138052 1120843 1099797 1075135
62145 1075135 1046866 1015402 981603 946391 910819 876376 844611 816196 790736 767749 747585
62134 747585 731099 718619 709443 702313 696304 691320 687851 686254 686260 687239 688870 691425 695402 701051 708184
62119 708184 716126 723719 729598 732862 733638 732916 731746 730557 729218 727595 725737 723326 719235 712111 701559
62104 701559 688503 674318 659990 646291 634222 624638 617529 612213 608268 605819 604856 604850 605372 606702
62090 606702 609417 613570 618720 624668 631640 639592 647716 655074 661599 668145 675536 683930 693221 703664
62076 703664 715727 729483 744586 760832 778321 797040 816652 836876 857716 879085 900563
62065 900563 921913 943595 966408 990664 1016034 1042093 1068581 1094968 1119918 1141322 1156930
62054 1156930 1165260 1166262 1161197 1151727 1139006 1123530 1105489 1084879 1061316 1034095 1002746 967595
62042 967595 929805 890851 851859 813370 775781 739885 706662 676500 648998 623715 600778
62031 600778 580560 563097 548255 536089 526497 518712 511780 505576 500786 497685 495423 492800 489402
62018 489402 485641 481839 477615 472273 465669 458634 452406 447579 443705 440076 436695 434174 432811 432208
62004 432208 431909 432060 433224 435783 439681 444579 450021 455541 460786 465560 469683 472907 475029 476057 476167
61989 476167 475445 473678 470456 465579 459351 452332 444762 436397 427026 417005 407193 398442 391171 385189
61975 385189 379819 374509 369450 365340 362356 359732 356632 353050 349475 346081 342818 340022 338236 337442
61961 337442 337096 336903 337001 337369 337691 337955 338653 340220 342747 346365 351266 357098 362889 368045 373065 378899
61945 378899 385993 394380 404416 416814 431950 449485 468714 489091 510384 532558 555588 579384
61933 579384 603806 628589 653179 676859 699248 720483 740589 758878 774403 786869 796546 803372
61921 803372 806796 806574 803046 796422 786561 773895 760027 746880 735622 726757 720743 717961 718438 722183
61907 722183 729557 740774 755231 771853 789896 808864 827740 844876 858741 868423 873470 873639
61895 873639 868931 859617 846251 829767 811320 791625 770685 748583 726387 705673 687075 669811
61883 669811 652855 636170 620584 606716 594284 582320 569915 556862 543650 530852 518594
61872 518594 506790 495761 486252 478795 473305 469456 467160 466449 466991 468084 469296 471061 474444 480243
61858 480243 488405 498434 510267 524476 541612 561667 584363 609738 638106 669508 703478 739435
61846 739435 777190 816856 858076 899289 938053 972438 1002023 1027215 1047748 1062431 1070409 1071981
61834 1071981 1067888 1058546 1044593 1027737 1010308 994090 980101 969284 962738 961198 964779 973242
61822 973242 986034 1002049 1019817 1038028 1055443 1070230 1079880 1082197 1076306 1062751 1042854 1017986
61810 1017986 989062 956466 920549 882225 842914 803933 766154 730221 696723 666024 638140
61799 638140 612950 590361 570207 552174 535966 521478 508726 497686 488192 479922 472517 465783
61787 465783 459749 454426 449626 445123 440915 437184 434139 431984 430814 430303 429686 428308 426036 422956 419015
61772 419015 414449 410273 407639 406598 406045 405071 403911 403299 403282 403076 402056 400645 400095 401331 403992 406754
61756 406754 408707 410164 411942 414193 416361 418045 419330 420326 420925 421068 420834 420222 419227 418095 416983 415396
61740 415396 412616 408836 405281 402931 401618 400660 399860 399431 399350 399288 399008 398525 398087 398250 399689 402530 406016
61723 406016 409119 411365 412891 414005 415044 416534 419000 422553 426832 431336 435683 439602 442853 445222
61709 445222 446614 447143 447017 446167 444113 440486 435601 430193 424619 418779 412841 407489 403154 399377 395240
61694 395240 390237 384619 379191 374883 372057 370070 367867 365152 362517 360301 358034 355350 352739 350768
61680 350768 349094 346974 344341 341700 339260 336963 335137 334271 334175 334086 333634 333054 332487 331758 330931 330410 330280
61663 330280 330175 329999 330167 330895 331758 332295 332615 333116 333998 335266 336841 338346 339225 339381 339402 339848 340657 341590
61645 341590 342889 344998 347799 350665 353305 356231 360258 365629 371639 377075 381143 383964 386015 387127
61631 387127 386426 383398 378645 373299 368016 362885 357994 353599 349825 346602 343872 341603 339735 338376
61617 338376 337892 338416 339439 340374 341425 343283 345890 348124 349031 348827 348214 347108 344680 340557 335385 330086
61601 330086 325004 319957 314825 309779 305063 300806 296979 293365 289643 285763 282244 279811 278631 278065
61587 278065 277333 276229 274953 273444 271339 268655 266088 264333 263342 262530 261550 260551 259818 259508 259641 259925
61571 259925 259628 258129 255772 253751 252870 252805 252897 253188 254114 255438 256255 256135 255650 255481 255540 255343 254928 254937 255903
61552 255903 257796 260207 262656 264736 266267 267375 268282 268998 269396 269577 269929 270742 271940 273286 274681 276147
61536 276147 277690 279304 281035 282880 284690 286342 287950 289635 291030 291376 290419 289040 288540 289186 289864
61521 289864 289388 287833 286198 284976 283603 281368 278379 275441 273313 272293 272151 272187 271615 270295 268986
61506 268986 268548 268983 269511 269503 269000 268365 267832 267467 267268 267088 266608 265587 264113 262615 261701 261880 263232 265250
61488 265250 267115 268197 268327 267746 266971 266640 267172 268465 270000 271342 272497 273821 275624 277803 279826
61473 279826 281199 282030 282952 284378 286004 287209 287733 287696 287219 286392 285467 284679 283996 283418 283360 284156 285270 285645
61455 285645 285031 284361 284577 285593 286711 287546 288078 288218 287865 287265 286845 286765 286929 287319 287994 288821 289520 290024
61437 290024 290618 291762 293882 297181 301462 306124 310489 314120 316882 318973 320963 323445 326342 328769
61423 328769 329881 329773 329356 329525 330666 332712 335279 337834 340131 342472 345250 348222 350552 351612 351507
61408 351507 350689 349326 347250 344414 341189 338123 335515 333339 331529 330097 328893 327483 325616 323691
61394 323691 322385 321872 321787 321935 322483 323266 323433 322176 319560 316417 313782 312585 313302 315339 317136 317565
61378 317565 317163 317516 319513 322600 325604 327768 329044 329881 330875 332328 334060 335773 337453 339158 340690
61363 340690 341893 343102 344835 347137 349710 352590 356127 360263 364400 368136 371744 375785 380659 386605
61349 386605 393711 401676 409811 417467 424324 430339 435696 440769 445771 450454 454507 458103 461616 464922
61335 464922 467633 470020 472913 476394 479315 480515 479967 478296 475762 472359 468510 464919 461811 458804
61321 458804 455527 451973 448374 445115 442714 441495 441246 441427 441708 442169 443103 444859 447747 451895 457248
61306 457248 463843 471862 481216 491349 501695 512052 522155 531207 538307 543236 546383 548049 548350
61293 548350 547631 546320 544303 541043 536527 531549 526792 522099 516973 511391 505707 500069 494384 488703
61279 488703 483234 478144 473671 470299 468442 468096 469072 471308 474440 477335 478912 479553 480886 483816 487525
61264 487525 490990 494737 500074 506890 513451 518639 523457 529729 537936 546890 555128 562003 567664 572686
61250 572686 577760 583245 588781 593571 597120 599487 600805 600824 599091 595507 590611 585276 580044 574731 568809
61235 568809 562240 555699 549860 544720 539875 535235 531115 527770 525217 523463 522554 522370 522658 523295 524311
61220 524311 525698 527443 529714 532737 536539 541023 546205 551993 557823 562957 567224 571127 575176 579388
61206 579388 583434 586877 589281 590563 591437 593047 595974 599938 604597 610208 617230 625752 635719 647369
61192 647369 660847 675449 689723 702436 713216 722239 729580 735099 738855 741429 743615 745786 747698
61179 747698 748976 749513 749233 747800 744963 741005 736396 731211 725510 720100 716080 713384 710516 706112 700202
61164 700202 693567 686546 679063 671282 663427 655156 645799 635209 623976 612884 602576 593561 586043
61151 586043 579791 574597 570774 568776 568412 568852 569335 569410 568537 566010 561461 555069 547266 538627 530084 522742
61135 522742 517137 512954 509686 507289 506009 505845 506562 508111 510752 514665 519670 525410 531729 538797 546878
61120 546878 556090 566462 578140 591432 606634 623882 643136 664034 685803 707604 729128 750634
61108 750634 772261 793587 814095 833839 853351 872999 892590 911357 928025 941174 950050 955107
61096 955107 957459 957770 955971 951932 945963 938487 929620 919349 907941 895875 883431 870613 857536
61083 857536 844639 832367 820829 810057 800490 792766 786808 781587 776204 770877 766387 762848 759835
61070 759835 757623 757304 759368 762946 766944 771241 776277 782101 788505 795614 803574 812038 820665 829864
61056 829864 840343 852082 864442 877132 890318 903893 917429 930904 944810 959457 974744
61045 974744 990731 1007833 1026328 1046168 1067352 1090014 1114110 1139510 1166441 1195280 1225929
61034 1225929 1258051 1291928 1328358 1367398 1407873 1448478 1488891 1529583 1571167 1614396 1660487
61023 1660487 1711011 1767529 1831293 1902905 1982247 2069227 2164745 2270751 2389725 2525134 2682701
61012 2682701 2870792 3099698 3381341 3729798 4161513 4695632 5355579 6170039 7170613
61003 7170613 8388229 9851022 11574842 13531607 15603977 17571413 19170017 20207957
60995 20207957 20657468 20656418 20430266 20202691 20141781 20330078 20732548 21178856 21405117 21162044
60985 21162044 20328727 18955284 17214819 15313731 13423155 11655279 10069268 8685251
60977 8685251 7498218 6490896 5642982 4934361 4344862 3854808 3446905 3106970 2822675
60968 2822675 2582346 2375540 2194529 2034652 1893002 1766870 1653504 1550982 1458674 1376589
60958 1376589 1304432 1241400 1186455 1138410 1095834 1057243 1021387 987232 953885 920953 888990
60947 888990 859271 832910 810171 790475 772871 756547 741154 726762 713519 701335 689906
60936 689906 678892 667946 656763 645190 633256 621044 608726 596691 585339 574651 564336
60925 564336 554568 546019 538813 531918 524231 515999 508538 502682 498116 494161 490504 487003 483401 479597
60911 479597 475861 472509 469603 467069 464866 462936 461271 460050 459447 459275 459197 459334 460195 461822 463479 464425
60895 464425 464683 464734 464778 464625 464169 463627 463323 463311 463086 461691 458416 453564 448219 443118 438075 432665 427002
60878 427002 421450 415964 410319 404815 400181 396712 393962 391405 388991 386929 385255 383899 382969 382703 383221
60863 383221 384459 386313 388626 391055 393125 394587 395693 396923 398425 399824 400748 401395 402332 403711 404988
60848 404988 405575 405542 405454 405643 405910 405910 405582 405103 404566 403850 402821 401556 400187 398523 396052 392539 388506 384789
60830 384789 381685 378866 376100 373525 371059 368128 364457 360736 357945 356214 354858 353326 351551 349453
60816 349453 346826 343771 340584 337106 332877 328228 324464 322366 321089 319241 316647 314254 312538 310978
60802 310978 309150 307432 306288 305584 305122 305189 305881 306313 305355 303091 300809 299436 298680 297997 297727 298610 300490
60785 300490 302221 302918 302796 302566 302473 302331 302229 302647 303792 305168 306065 306376 306744 307907 309965 312257 313944
60768 313944 314812 315528 317036 319548 322278 324253 325261 325774 326170 326389 326394 326489 326898 327352 327429 327113 326677 326144
60750 326144 325310 324265 323439 323050 322907 322967 323689 325476 327997 330446 332319 333530 333846 332731 329906 325729
60734 325729 320763 315261 309385 303730 299232 296463 295220 294827 294654 294238 293209 291426 289223 287291 286157
60719 286157 285780 285689 285465 285072 284775 284815 285210 285784 286341 286802 287174 287446 287521 287314 286954 286885 287632 289336 291521
60700 291521 293433 294668 295391 295981 296631 297358 298122 298723 298800 298249 297578 297456 297929 298446 298680 298896 299359 299886
60682 299886 300320 301062 302631 304910 307279 309365 311184 312627 313356 313366 313240 313663 314842 316424 317718 317998
60666 317998 316996 315225 313542 312301 311175 309800 308193 306437 304463 302420 300910 300437 300822 301473 302083
60651 302083 302815 303943 305613 307869 310647 313770 317084 320493 323775 326482 328171 328606 327714 325580 322548
60636 322548 319069 315341 311467 308011 305811 304877 304028 302221 299904 298450 298506 299513 300632 301441 301782 301654
60620 301654 301447 301666 302213 302413 301896 301038 300408 300238 300536 301178 301733 301770 301585 302049 303353 304506 304589 303978 303741
60601 303741 304243 305094 306258 308298 311402 314822 317611 319526 320934 322206 323467 324698 325748 326314 326170
60586 326170 325459 324617 324014 323703 323533 323437 323562 324116 325086 326190 327142 327981 329132 331143 334337 338645 343830
60569 343830 349852 356904 364990 373657 382424 391363 400823 410508 419252 425930 430269 432469 432399 429722 424742
60554 424742 418615 412555 407094 402231 397986 394578 392203 390953 391001 392620 395857 400304 405500 411649 419607
60539 419607 429898 441996 455015 468872 484075 500281 515843 529232 540331 549696 557029 561186
60527 561186 561640 559182 555093 550127 544446 538078 531216 524350 518126 512795 507837 502577 497167 492556
60513 492556 489505 488077 488022 488986 490293 491369 492700 495640 500824 507490 514983 524241 537006 554075
60499 554075 575177 600197 629403 662571 698874 737731 778854 821186 862674 901466 936720
60488 936720 967799 993348 1011696 1021699 1022685 1014045 995623 968368 934082 894543 851189 805539
60476 805539 759431 714728 672858 634507 599625 567870 539164 513656 491218 471491 454596
60465 454596 441099 430739 421740 412226 402150 393079 386158 380974 376461 372085 367853 363786 359892
60452 359892 356403 353598 351483 349770 348084 346174 344124 342328 341035 340006 338894 337810 337035 336326 335131
60437 335131 333576 332534 332415 332466 331674 329926 327874 326050 324542 323286 322262 321531 321284 321636 322251 322555
60421 322555 322492 322623 323244 323990 324638 325608 327074 328197 328093 327151 326533 326607 326829 327047 327877 329623 331658 333194
60403 333194 334064 334545 335061 336210 338353 340813 342139 341656 340308 339628 340315 342149 344713 347611 350384 352821
60387 352821 355237 358009 361009 363845 366479 369249 372400 375896 379487 382696 384932 386068 386692 387499 388618
60372 388618 389866 391443 393779 396753 399546 401394 402184 402301 402250 402524 403499 405202 407311 409480 411614 413838
60356 413838 416326 419254 422794 427104 432205 437802 443279 448146 452523 456864 461130 464574 466578 467244
60342 467244 466820 465029 461611 457279 453377 450545 448338 446213 444235 442564 440859 438649 436001 433402
60328 433402 431153 429088 426663 423173 418274 412656 407933 405419 405002 405481 405880 406165 406796 408057 410002
60313 410002 412776 416694 421933 428281 435332 443018 451853 462409 474527 487317 500043 512730 525564
60300 525564 537876 548140 555089 558609 559392 557790 553132 544210 530538 513223 494622 477114 462092
60287 462092 449834 439935 431764 424872 419295 415342 412920 411273 409696 408251 407395 407046 406567 405690 404867
60272 404867 404466 404088 403092 401493 399930 398858 398140 397342 396079 394054 391140 387630 384243 381683 380171
60257 380171 379383 378815 378218 377700 377401 377126 376493 375458 374486 374065 374271 374990 376263 378096 380157 382048 383748
60240 383748 385386 386669 387120 386927 386965 387774 388945 389903 390816 392259 394255 396159 397404 397928 397936 397654 397361
60223 397361 397269 397284 397143 396941 397214 398400 400421 402938 405828 409197 413066 417265 421614 426051 430597 435307
60207 435307 440306 445717 451460 457213 462745 468238 474042 479996 485268 489142 491901 494605 498032 502108
60193 502108 506306 510187 513428 515788 517348 518506 519415 519684 518916 517330 515489 513653 511670 509320 506361
60178 506361 502403 497236 491253 485185 479467 474196 469582 465931 463174 460866 458764 457024 455743 454685
60164 454685 453613 452577 451748 451176 450779 450350 449641 448759 448421 449345 451329 453346 454609 455125 455224 455126 455165 455786
60146 455786 456929 457886 458170 458184 458704 460057 462147 464936 468487 472844 478272 485297 494065 503913 514044
60131 514044 524387 535263 546311 556346 564315 570028 573897 576315 577424 577221 575776 573437 570721
60118 570721 567931 564994 561872 558946 556799 555735 555596 555776 555287 553247 549699 545711 542297 539544 537068
60103 537068 534843 532987 531145 528915 526703 525252 524287 522547 519472 516104 513836 512914 512671 512707 513100 513657
60087 513657 513751 513072 512079 511488 511563 512150 513208 515013 517799 521422 525521 529845 534137 537795 540085 540899
60071 540899 540911 540593 539284 535698 529329 521045 512307 504101 496617 489568 482613 475627 468707 461958 455400
60056 455400 449159 443554 438771 434637 430980 428036 426180 425408 425434 426141 427542 429366 431188 432983 435156
60041 435156 437992 441448 445410 449689 453731 456818 458764 460074 461318 462647 463946 465001 465505 465316 464759
60026 464759 464219 463319 461085 457150 452212 447071 441702 435650 428837 421497 413786 405945 398612 392387 387212
60011 387212 382604 378344 374589 371384 368517 365901 363844 362770 362696 362981 362682 361418 359828 358814 358350
59996 358350 357555 356097 354890 354955 356132 357509 358787 360533 363179 366420 369676 372719 375694 378759 381860
59981 381860 384709 387012 388769 390200 391308 391829 391776 391689 391997 392526 392996 393664 394951 396678 398267 399537
59965 399537 400737 401965 403229 405090 408475 413643 419812 426075 432186 438297 444344 449995 454761 457983
59951 457983 459118 458357 456655 454851 453009 450793 448117 445094 441611 437478 432914 428509 424663 421210
59937 421210 417595 413350 408547 403968 400659 399082 398768 398953 399394 400395 402220 404808 407941 411277 414203
59922 414203 416099 417004 417747 419114 420977 422505 423153 423190 423291 423930 425313 427596 430896 435201 440502 446881
59906 446881 454189 461749 468821 475385 482009 488752 494688 498870 501412 503130 504343 504585 503438 501089
59892 501089 498017 494631 491433 489044 487712 487036 486460 485966 486089 487391 490083 493985 498707 503941 509683
59877 509683 516116 523207 530567 537752 544500 550567 555632 559562 562537 564715 565998 566448 566713 567605 569268
59862 569268 571101 572609 573996 575829 578346 581274 584221 587059 589962 593126 596503 599798 602701 604923
59848 604923 605949 605060 601979 597443 592694 588376 584280 580242 576743 574201 571990 568693 563310 555859
59834 555859 546960 537380 528123 520388 514896 511308 508622 506214 504324 503505 503734 504190 503900 502559 500591
59819 500591 498427 495943 492797 489128 485532 482380 479519 476759 474251 472128 470107 467793 465203 462687
59805 462687 460427 458303 456113 453619 450529 446741 442618 438766 435596 433298 431964 431332 430635 429274 427614
59790 427614 426568 426401 426534 426570 426737 427035 426743 425400 423695 422632 422179 421512 420435 419743 420100 421247 422588
59773 422588 424051 425993 428567 431527 434574 437689 441133 445194 449879 454830 459592 463937 467890 471533
59759 471533 474941 478191 481290 484197 487111 490591 495094 500486 506298 512404 519130 526682 534857 543418
59745 543418 552412 561903 571638 581209 590468 599571 608660 617584 625882 633012 638666 642926 646085 648319
59731 648319 649577 649679 648415 645640 641520 636637 631643 626799 621978 617112 612373 607944 603834 599967
59717 599967 596256 592553 588693 584617 580278 575582 570670 566135 562499 559470 556236 552651 549589 547797
59703 547797 546861 545803 544356 543100 542522 542522 542793 543137 543311 543086 542671 542692 543445 544408 544761 544161 542781 540856
59685 540856 538530 536084 533902 532109 530420 528437 525996 523234 520427 517694 514724 510905 506055 500938
59671 500938 496616 493165 489471 484648 479214 474423 470708 467439 464146 461204 459119 457728 456555 455547
59657 455547 455001 454998 455290 455606 455755 455631 455470 455947 457637 460375 463407 466079 468121 469431 469956 469758 468900
59640 468900 467314 465093 462745 460788 459195 457628 456089 454818 453629 452018 450027 448344 447295 446294
59626 446294 444678 442563 440438 438327 435923 433324 431129 429757 429010 428234 426696 423937 420074 415739 411615
59611 411615 408113 405554 404240 404075 404433 404787 405249 406107 407114 407806 408340 409396 411207 413271 415146 416984
59595 416984 419027 421095 422933 424737 426863 429177 431102 432294 432940 433386 433670 433579 432985 432004 430830 429533
59579 429533 428044 426288 424240 421893 419302 416705 414451 412685 411190 409688 408202 407007 406310 406136 406434
59564 406434 407046 407643 407895 407734 407277 406651 406139 406345 407716 409797 411442 411940 411625 411161 410689 410072 409606 409951
59546 409951 411411 413754 416728 420373 424798 430117 436762 445575 457406 472791 491966 514570 538758
59533 538758 560754 576021 581567 577517 566649 552543 538043 525013 514755 508024 504607 503432
59521 503432 503449 504270 505734 507200 507823 507507 507047 507121 507435 506992 504976 501251 496326 490962 485584 479951 473652
59504 473652 466887 460306 454061 447715 441369 436156 432928 430996 428942 426337 423845 421872 420120 418493
59490 418493 417494 417470 418243 419760 422277 425475 428129 429322 429542 430066 431611 434014 436823 439656 442393 445490
59474 445490 449823 455583 461672 466747 470656 474244 477960 481353 483849 485284 485630 484889 483490 482255 481749
59459 481749 482005 482975 484843 487736 491470 495748 500289 504804 509280 514363 520944 529088 537785 545988 553573
59444 553573 560999 568408 575371 581348 586051 589530 592133 594266 595976 596828 596290 594069 589970 583722 575283
59429 575283 565267 554873 545346 537480 531491 527251 524700 524045 525493 528899 533992 540992 550686 563751
59415 563751 580173 599519 621670 647189 676964 711122 747518 781070 805280 815589 811914 798260
59403 798260 780072 761895 746779 736848 733726 738291 749871 765526 780212 788357 786230 773571
59391 773571 753261 729350 705055 682101 661330 643330 628409 616299 606258 597468 589355 581761
59379 581761 575019 569620 565552 562180 559012 556336 554712 554059 553760 553511 553480 553594 553305 552280 550860 549556
59363 549556 548525 547820 547858 549270 552372 556908 562194 567520 572653 578070 584503 592274 601226 611117 621777
59348 621777 632997 644760 657510 671636 686734 701936 716962 732172 747496 762023 774837
59337 774837 785533 793718 798861 801056 801092 799184 794374 785929 774677 762189 749159 735414 721083
59324 721083 706770 692829 679331 666609 655010 644155 633280 622307 611953 602830 595161 589300
59312 589300 585619 583720 582503 581395 580972 582239 585884 592436 602420 615703 630843 645346 656477
59299 656477 661961 660636 652959 640712 625981 610408 595195 581158 568447 556600 545313 535033
59287 535033 526593 520430 516261 513380 511108 509150 507636 506757 506377 506240 506510 507747 510246 513747 518018
59272 518018 523415 530545 539531 549891 561029 572633 584591 596716 608600 619662 629329 637234
59260 637234 643272 647540 650193 651294 650702 648234 644070 638978 633963 629601 625733 621821 617675 613825
59246 613825 611137 609959 609750 609789 610080 611251 613648 617007 620999 625422 629652 632618 633902 634396 635290 636696
59230 636696 637786 637897 636883 634624 630933 625981 620285 614244 608013 601646 594966 587584 579564 571758
59216 571758 564904 558644 552163 545570 539759 535035 530801 526672 522940 519688 516372 512667 509004 505828
59202 505828 502949 500045 497248 494826 492789 491204 490405 490498 491128 492099 493755 496284 499047 501156 502462
59187 502462 503589 505226 507672 510840 514386 518043 521979 526543 531537 536230 540313 544301 548634 552926
59173 552926 556574 559630 562553 565471 568253 570970 573684 576003 577484 578367 579335 580552 581446 581462 580667 579497
59157 579497 578276 577012 575438 573176 569984 565849 560788 554750 547849 540486 533067 525805 518937 512816
59143 512816 507542 502733 497971 493287 488959 485084 481597 478484 475677 472915 470043 467272 464933 463183
59129 463183 462139 461972 462551 463358 464183 465637 468507 472801 477868 483264 489041 495334 502188 509716 517883
59114 517883 526127 533660 540259 546443 552805 559471 566243 572950 579588 586312 593329 600612 607782 614510
59100 614510 620917 627298 633464 638659 642199 643984 644422 644012 643059 641721 640345 639615 640071 641371 642454
59085 642454 642625 642124 641356 640026 637494 633580 628472 622148 614602 606440 598517 591004 583488 576005 569255
59070 569255 563549 558239 552531 546392 540314 534637 529485 525070 521603 518999 516878 514766 512191 508846
59056 508846 504875 500861 497337 494417 491932 489685 487439 484960 482352 480209 479142 479195 479835 480451 480693
59041 480693 480485 480006 479715 480175 481675 484029 486777 489538 492177 494690 497093 499452 501945 504858 508625
59026 508625 513912 521422 531340 543076 555871 569618 584789 601581 619607 638480 658119 678090
59014 678090 697066 713427 726236 735285 740407 741268 737883 731064 722269 713019 704183 695637 686894 678318
59000 678318 671340 667125 665325 664666 664483 665052 666582 668552 670162 670896 670553 669173 667057 664477 661316
58985 661316 657347 652831 648311 643774 638623 632692 626710 621458 617019 613315 610923 610711 612791 616377
58971 616377 620729 625806 631907 639049 646971 655490 664527 673730 682375 689889 696378 702397 708255 713853
58957 713853 719179 724456 729451 733068 734100 732310 728298 722539 715077 706218 696861 687865 679384 671085
58943 671085 662749 654450 646384 638810 632103 626610 622367 618943 615661 612088 608348 604832 601578 598280
58929 598280 595022 592571 591536 591592 592030 592778 594192 595979 597160 597248 596782 596357 595709 594128 591404 587931
58913 587931 584189 580461 576942 573865 571560 570423 570580 571594 572894 574687 578040 583850 592008 601701
58899 601701 612123 622578 632351 641050 648974 656751 664640 672502 680362 688671 697952 708368 719705
58886 719705 731689 744323 757862 772333 787059 800875 812874 822761 830516 836106 839653 841468
58874 841468 841552 839323 834245 826553 817049 806418 795148 783978 773718 764481 755586 746585 738075 731138
58860 731138 726131 722399 719041 715534 711545 706669 700735 694176 687690 681653 676118 671284 667480 664651
58846 664651 662378 660594 659844 660538 662260 664088 665219 664918 662236 656449 647742 637166 626003 615332
58832 615332 605831 597420 589376 581344 574143 569047 566384 565456 565686 567160 570067 574288 579603 585582 591161
58817 591161 595103 597171 598170 598607 598093 596415 594335 592642 591059 588889 586337 584345 583271 582376 580617
58802 580617 577505 573297 568775 564746 561394 558208 554780 551371 548247 544858 540309 534540 528428 522739
58788 522739 517580 512888 508822 505441 502512 500001 498394 498207 499365 501350 503790 506647 509981 513802
58774 513802 518128 522858 527462 531015 532751 532544 530765 527769 523736 518968 514012 509256 504659 500131
58760 500131 495966 492567 489869 487505 485538 484598 485135 486984 489846 493742 498587 503579 507524 509825 510917
58745 510917 511669 512537 513329 513615 513226 512343 511248 510234 509778 510439 512271 514508 516250 517418 518729 520831
58729 520831 523875 527872 532853 538457 543890 548666 553048 557436 561581 564778 566726 567952 569392 571720
58715 571720 575013 578980 583492 588745 594788 601104 606992 612209 616806 620482 622719 623536 623448 622543 620213
58700 620213 615981 609965 602281 592748 581610 569915 558564 547485 536289 525201 514687 504612
58688 504612 494625 485160 477201 471074 466110 461593 457412 453665 450207 446892 443853 441200 438706 436130
58674 436130 433773 432431 432622 433940 435370 436346 437362 439388 442945 448032 454727 463261 473469 484697
58660 484697 496261 507425 516912 523305 526349 527220 527058 525809 522995 518925 514434 509867 505098 500269
58646 500269 495778 491686 487781 484108 480925 478260 476051 474530 473893 473707 473270 472524 472077 472361 473183 474096
58630 474096 474757 474946 474649 474050 473157 471617 469264 466504 463634 460106 455199 449359 444106 440624 439024
58615 439024 439056 440750 444104 448688 453907 459363 464761 469767 474145 477854 480938 483501 485678 487415 488412
58600 488412 488675 488866 489627 490649 491037 490594 490081 490045 489993 489094 487297 485376 484138 483907 484644 486251 488708
58583 488708 492026 496171 501130 507023 514025 522036 530575 539038 546864 553533 558912 563825 569623 576671
58569 576671 583672 589141 593299 597903 604493 613524 625030 639144 655660 673845 693141 713703 735805
58556 735805 758908 781566 802232 820081 835067 847229 856117 861195 862832 862364 860913 858558 854940
58543 854940 850154 844543 838167 831056 823494 815263 805081 791806 776068 759842 744441 729714 715131
58530 715131 700725 686913 674256 663591 655566 649725 644667 639426 634194 629658 626197 623813 622124
58517 622124 620259 617459 613985 610844 608422 606007 602855 599090 595308 591952 589330 587589 586376 585015
58503 585015 583366 581937 580992 580141 579107 578239 577881 577855 577942 578306 578986 579566 579851 580382 581745 583791 586121
58486 586121 588959 592927 598153 604165 610529 617147 624013 631164 638908 647799 658289 670464 684004
58473 684004 698174 711905 724098 733948 741041 745203 746272 744091 738938 731966 724784 718299 712325
58460 712325 706657 702033 699413 698705 699097 700553 704061 710274 718663 728221 738293 748386 757769 765647
58446 765647 771390 774434 774433 771700 767104 761386 754895 747954 740986 734288 728199 723468 720835 720177 720669
58431 720669 721868 724059 727563 732431 738900 747358 757614 768801 780083 790843 800236 807488 812870
58418 812870 817504 821903 825388 827102 826716 823917 818250 810045 800702 791517 782862 774860 767992 762386
58404 762386 757313 752084 747008 742819 739663 737195 735298 734179 734152 735704 739365 745041 751742 758267 763898
58389 763898 768431 772037 775165 777935 779505 778768 775852 772193 769037 766719 765553 766266 769012 772929 777324
58374 777324 782540 789112 796811 805046 813450 821586 828897 835525 842411 850049 857940 865810 874428 884520
58360 884520 895678 907070 918480 929921 941034 951662 962309 973210 983544 992316 999483 1005585
58348 1005585 1010926 1015809 1020844 1026285 1031674 1036814 1042443 1049268 1057083 1065559 1075150 1086379 1098931
58335 1098931 1112271 1126529 1141943 1158016 1174075 1190120 1206374 1222556 1238275 1253520 1268027
58324 1268027 1280869 1291471 1300391 1308343 1315141 1320408 1324671 1328898 1333529 1338735 1345021 1352753 1361584
58311 1361584 1371045 1381133 1391870 1402987 1414639 1427627 1442342 1458313 1475188 1493158 1511941
58300 1511941 1530650 1549284 1569003 1590168 1611502 1632080 1652657 1673954 1695189 1715618 1736128
58289 1736128 1757888 1780733 1804201 1828900 1855365 1882863 1910737 1939655 1970104 2001103 2031959
58278 2031959 2063829 2097841 2133187 2168897 2205893 2245203 2285653 2325688 2366235 2409396 2455471
58267 2455471 2503528 2553718 2606498 2660727 2715236 2771423 2831556 2895297 2960541 3026997 3096187
58256 3096187 3168407 3242427 3317897 3395473 3474862 3555161 3636863 3721358 3808973 3899674 3994952
58245 3994952 4096528 4203971 4316045 4433614 4558664 4691441 4831279 4979157 5136417
58236 5136417 5301979 5474145 5654409 5846259 6051030 6268244 6499180 6746541 7011313
58227 7011313 7293417 7594787 7918267 8264492 8633645 9029408 9457299 9920325 10420455
58218 10420455 10962994 11554742 12199184 12898767 13661120 14497827 15418186 16429945 17545308
58209 17545308 18780273 20149020 21665615 23351393 25235929 27353963 29750413 32489243
58201 32489243 35652534 39336029 43657935 48774834 54885627 62229506 71098095 81854964
58193 81854964 94941840 110878495 130266493 153763742 181999918 215461040 254324266
58186 254324266 298064631 344729426 390283176 428858412 454347835 462654178 453192867
58179 453192867 428750862 394035744 353987717 312674829 272912535 236349707 203749754
58172 203749754 175297304 150836826 130023654 112423154 97584982 85086739 74547497
58165 74547497 65633285 58064648 51614216 46092266 41337317 37217688 33630091 30489797
58157 30489797 27724478 25276686 23103983 21172058 19450267 17913505 16542166 15317609
58149 15317609 14221143 13237990 12357543 11568299 10856540 10210850 9623557 9086472 8589487
58140 8589487 8125226 7691528 7287709 6911442 6560606 6234758 5932768 5651496 5388338
58131 5388338 5142868 4914768 4702229 4503431 4317548 4143495 3979712 3825842 3682498
58122 3682498 3548745 3421964 3300794 3186025 3077967 2975178 2876578 2782593 2693355 2607839
58112 2607839 2525688 2447880 2374586 2304269 2235938 2170554 2109142 2051058 1995107 1940938 1888437
58101 1888437 1837177 1787336 1739929 1695261 1652353 1610481 1570031 1531289 1493795 1457645 1424033
58090 1424033 1393614 1365523 1338838 1313863 1291012 1269469 1247998 1226358 1205119 1184643 1164866
58079 1164866 1145550 1126255 1106511 1086339 1066089 1045781 1025242 1004844 985283 966631 948521
58068 948521 931128 914872 899253 883325 867423 853040 840708 829365 818220 807881 799030 791193
58056 791193 783519 775711 767478 758012 746818 734436 721824 709670 698537 688829 680178 671711 663264
58043 663264 655505 648526 641344 633272 624814 616653 608667 600604 592885 586045 579986 574367 569052 563647
58029 563647 557263 549410 540641 531811 523163 514526 505893 497374 489049 481167 473996 467224 460152 452701
58015 452701 445592 439261 433322 427466 422150 417933 414700 411930 409200 406115 402380 398361 394993 392798
58001 392798 391486 390693 390434 390578 390613 390283 389767 389004 387678 386213 385846 387129 389122 390656 391646 392493 392970
57984 392970 392514 391178 389540 387995 386645 385441 383918 381279 377339 372994 369210 365966 362674 359193
57970 359193 355874 353002 350731 349156 347933 346300 344093 342289 341848 342351 342560 342090 341761 342279 343274 343792
57954 343792 343284 341867 339894 337458 334429 331005 328023 326277 325541 324832 323779 323123 323526 324577 325517 326478
57938 326478 328291 331336 335250 339714 344975 351513 359434 368205 376834 384412 390567 395201 397889 397995
57924 397995 395539 391364 386177 379904 372357 364010 355616 347438 339338 331323 323503 315728 307801 299920
57910 299920 292606 286340 281563 278671 277652 277900 278759 280025 281592 282907 283281 282637 281519 280418 279378
57895 279378 278213 276892 275774 275525 276590 278564 280417 281575 282493 283942 286138 288930 292477 297090 302486
57880 302486 307725 311980 315089 317263 318487 318343 316460 313122 309283 305799 302769 299939 297537 296071
57866 296071 295299 294169 292073 289562 287418 285664 284058 283044 283439 285396 288301 291552 294910 298191 301236
57851 301236 304236 307556 311073 314031 315788 316570 317313 318765 320765 322420 322993 322464 321188 319330 317053
57836 317053 314958 313650 312843 311574 309499 307361 305948 305239 304878 304826 305038 305063 304560 303901 303724 304266 305470
57819 305470 307285 309326 310677 310622 309283 306986 303453 298299 292036 285727 279665 273108 265436 257048 249037
57804 249037 242333 237212 233289 229903 226718 223822 221211 218493 215456 212525 210185 208247 206244 204292
57790 204292 202924 202144 201294 199974 198653 198185 198989 200747 202726 204480 206382 209301 213566 218527 223365
57775 223365 227936 232464 236887 241132 245674 251045 256853 261944 265554 267691 268460 267722 265633 262948 260473
57760 260473 258462 256688 254845 252811 250798 249329 248857 249405 250720 252624 254960 257353 259412 261132 262761
57745 262761 264290 265344 265523 264689 263063 261235 259815 258773 257511 255850 254585 254502 255282 255996 256358 256699
57729 256699 256935 256468 255163 253610 252287 251202 250468 250404 250811 250852 250119 249195 248732 248546 248183 247939 248671 250667
57711 250667 253173 255034 255588 255039 254189 253664 253216 251927 249269 245805 242660 240490 239206 238536 238481 239173
57695 239173 240520 242100 243306 243516 242245 239372 235265 230570 225713 220742 215788 211512 208687 207223
57681 207223 205996 203949 201196 198866 198026 198965 201402 205226 210986 219671 231909 247594 266641 289888
57667 289888 318670 353418 393121 435772 478108 514598 538260 544129 532163 506457 472296 434389
57655 434389 396651 361802 330819 303560 279962 260116 243562 229554 217932 208920 202161 196784
57643 196784 192356 188877 185977 183090 180382 178543 177556 176662 175593 174812 174397 173818 173095 173047 173927 174905 175407
57626 175407 175934 176895 177643 177514 176923 176519 175991 174692 172880 171331 170060 168435 166353 164347 162630 160811
57610 160811 158672 156532 154778 153493 152611 151970 151236 150185 149103 148523 148513 148504 147900 146647 145178 143942 142970
57593 142970 141889 140424 138847 137669 136869 135846 134222 132339 130766 129701 129048 128606 127910 126369 123981
57578 123981 121575 119996 119359 119415 120117 121273 122136 122121 121713 121905 122684 122796 121247 118509 115930 114333 113554
57561 113554 113096 112755 112490 112077 111286 110343 109856 110082 110632 111169 112022 113658 115824 117804 119334 120637 121703
57544 121703 122395 123226 125041 127668 129809 130793 131613 133622 136879 140390 143366 145456 146314 145767 144279 142577
57528 142577 140966 139382 137775 136020 133864 131398 129089 126821 123626 119118 114560 111508 109835 108199
57514 108199 106166 104646 104230 104292 104047 103519 103079 102787 102577 102436 102118 101261 100070 99280 99190 99309 99202 99087
57496 99087 99253 99496 99567 99607 99695 99426 98512 97435 96936 97076 97309 97334 97355 97527 97646 97482 97085 96660 96301 95963
57476 95963 95559 94987 94145 92935 91275 89212 87059 85292 84171 83471 82744 81859 81179 81089 81458 81690 81367
57459 81367 80650 79977 79507 79109 78725 78400 78003 77298 76369 75603 75180 74964 75064 75952 77694 79512 80584 80967
57441 80967 81249 81634 81956 82395 83464 85214 86998 88157 88580 88509 88190 87840 87633 87636 87952 88899 90658 92720
57423 92720 94073 94152 93362 92562 92196 92075 91837 91457 91283 91617 92300 92894 93226 93501 93749 93565 92711 91658 91164
57404 91164 91470 92327 93556 95065 96475 97297 97505 97458 97223 96486 95237 94087 93660 93991 94657 95209 95314 94852
57386 94852 94120 93801 94431 95863 97393 98502 99478 101098 103547 105869 106976 107135 107765 109567 111583 112603
57370 112603 112776 113057 113659 114063 114279 114963 116207 117216 117394 117004 116484 115829 115000 114282 113887 113667 113510 113583
57352 113583 113936 114344 114807 115743 117382 119366 121190 122689 123866 124676 125288 126159 127511 129005 130242 131359
57336 131359 132860 134990 137471 139731 141382 142627 144117 146119 147973 148822 148744 148605 148842 149127 149302 149858
57320 149858 151105 152523 153402 153690 153814 154100 154734 155890 157500 159168 160602 161864 163038 164039 164943 166075
57304 166075 167592 169344 171233 173187 174720 175296 175397 176387 178857 181846 184249 186188 188313 190496 192231
57289 192231 193747 195672 197815 199319 199909 200067 199974 199166 197471 195586 194437 194414 195351 196820 198347 199793
57273 199793 201628 204469 208322 212643 217118 221900 227082 232437 237911 243902 250754 258172 265385 271865
57259 271865 277827 284081 291322 299455 307750 315753 323743 332069 340381 348068 355238 362692 370903 379569
57245 379569 388255 396985 405901 414740 423015 430594 437855 445253 452918 460729 468670 476950 485639 494329
57231 494329 502422 509817 517063 524805 533333 542702 552847 563368 573621 583328 592846 602566 612408
57218 612408 622197 632164 642672 653770 665422 677827 691006 704336 717127 729500 742223 755840
57206 755840 770462 786164 802956 820457 838272 856641 876063 896225 915999 934739 953019
57195 953019 971845 991572 1011883 1032495 1053525 1075304 1098014 1121535 1145723 1170899 1197746
57184 1197746 1226351 1255624 1284142 1311472 1338174 1364696 1390906 1416690 1442292 1467833 1493027
57173 1493027 1517533 1541136 1563539 1584565 1604889 1625934 1648638 1672586 1696678 1720306 1743623
57162 1743623 1767002 1790678 1814696 1838911 1863082 1887115 1911120 1935148 1959103 1982908 2006476
57151 2006476 2029405 2051047 2071037 2089490 2106598 2122388 2136972 2150577 2162985 2173288 2180656
57140 2180656 2185262 2188201 2190586 2192869 2194894 2196346 2197207 2197942 2199282 2201866 2206136 2212474 2221120 2231943
57126 2231943 2244527 2258530 2273735 2289720 2305795 2321331 2335874 2348888 2359710 2368032 2374322 2379760
57114 2379760 2385882 2394157 2405584 2420581 2439430 2462654 2490744 2523862 2562395 2607704 2661832 2726704
57102 2726704 2804420 2898285 3012832 3152888 3323770 3532739 3789290 4103600 4485607 4946062
57092 4946062 5497021 6149711 6911650 7785448 8768343 9850622 11014066 12231900 13468785
57083 13468785 14680478 15818195 16841851 17735073 18507943 19182805 19774675 20280487 20679801
57074 20679801 20940474 21025578 20902677 20554226 19983304 19211327 18271167 17201332 16042857
57065 16042857 14837092 13622991 12434457 11298580 10234972 9256014 8367497 7569376
57057 7569376 6856960 6223011 5659988 5160793 4717916 4322951 3967802 3646262 3354084
57048 3354084 3087960 2845169 2623938 2423196 2241587 2077228 1928531 1794693 1675102
57039 1675102 1568867 1475247 1394013 1324988 1267711 1222035 1188576 1167959 1159851 1162896 1174570
57028 1174570 1189854 1200432 1197152 1174601 1133528 1079053 1017222 953082 890461 831948 778764
57017 778764 731071 688592 651007 618094 589703 565365 543881 523849 504928 488156 474535
57006 474535 463513 453293 442456 430895 419377 408738 399453 391485 384354 377595 371215 365501 360464
56993 360464 355786 351395 347777 345518 344795 345460 347428 350734 355303 360944 367655 375659 384868 394347 402417
56978 402417 407327 407803 403267 394053 381547 367665 353816 340528 328191 317697 309810 304310 300488
56965 300488 298396 298804 301849 306537 312051 318974 328670 341813 357973 376270 395707 414745 431039
56952 431039 441973 445702 441942 431915 417462 400175 381421 362880 346353 332802 322009 313492
56940 313492 307360 303920 302953 304001 307236 313522 323645 337892 356310 378822 404810 432646 459650
56927 459650 482432 497572 502567 496618 480754 457371 429503 400019 370992 343634 318796 297275
56915 297275 279456 264870 252427 241118 230456 220439 211283 203128 195892 189525 184294 180454 177542
56902 177542 174505 170842 167216 164545 162862 161582 160633 160584 161736 163751 166459 170572 177248 187070 199709
56887 199709 214532 231419 250879 273234 297618 321798 342990 358853 368025 370391 367151 360294
56875 360294 351623 342368 333692 326957 323026 321771 322874 326854 334698 346620 361945 380309 402495
56862 402495 429975 464079 505631 554599 609333 665896 718289 759714 784503 790035 777560 751304
56850 751304 716554 678137 639815 604167 572690 546220 525468 511202 504106 504667 513164 529655
56838 529655 554190 587335 630277 684136 749249 825083 909907 999302 1084746 1154697 1198359
56827 1198359 1209626 1188746 1141355 1075894 1000830 923030 847787 779317 720336 671299 630992
56816 630992 598436 574011 558719 552926 556202 568083 588605 618308 657883 707483 765748 829021
56804 829021 891175 944172 979513 990674 975591 937476 883239 820631 755950 693320 635238
56793 635238 583375 538767 501564 471193 447179 429602 418576 413718 414614 421480 434706 453885
56781 453885 477911 505861 536820 568476 596568 616267 624068 618559 600278 571492 535760 496979
56769 496979 458369 421952 388494 357839 329778 304800 283720 266548 252203 239506 228066
56758 228066 218026 209464 202283 196205 190539 184465 178013 172371 168677 166687 165065 162814 159978 157094
56744 157094 154498 152278 150533 149388 148779 148294 147404 145998 144628 143875 143481 142567 140877 139386 139313 140764
56728 140764 142681 143937 144163 143658 142893 142175 141635 141409 141677 142362 142895 142646 141651 140606 140107 140264 141136 142928
56710 142928 145426 147657 148649 148366 147646 147423 148226 150056 152332 154139 155000 155327 155819 156583 157171 157342 157366
56693 157366 157597 158097 158761 159549 160533 161787 163241 164597 165493 165803 165640 165090 164196 163255 162762 162901 163413 164135
56675 164135 165284 166932 168583 169674 170206 170498 170607 170432 170195 170268 170598 170801 170809 171031 171793 172956 174130 175002
56657 175002 175410 175365 175101 174910 174869 174802 174488 173826 172876 171832 170827 169695 168141 166244 164491 163068 161447
56640 161447 159056 156192 153869 152796 152840 153448 154201 154901 155407 155624 155602 155633 156133 157276 158679 159700 160126
56623 160126 160314 160618 161052 161678 162798 164394 165738 166064 165411 164448 163733 163507 163792 164137 163611 161788 159561
56606 159561 158268 158083 158053 157730 157834 158977 160551 161523 161860 162449 163750 165126 165577 164836 163599 162812 162841
56589 162841 163352 163895 164430 165142 165970 166632 167090 167672 168683 170110 171778 173610 175574 177473 178850 179187
56573 179187 178350 176845 175464 174570 174010 173800 174390 175922 177671 178882 179860 181591 184451 188030 192191 197332
56557 197332 203309 208949 213201 216227 218786 220920 221942 221568 220409 219223 218102 216613 214532 212243
56543 212243 210441 209450 208860 207919 206327 204543 203283 202870 203122 203730 204476 205173 205579 205557 205273 205129 205395 205949
56525 205949 206487 206986 207724 208795 209875 210652 211227 211737 211811 210836 208804 206489 204676 203464 202414 201120
56509 201120 199490 197697 195971 194398 192933 191736 191308 191980 193239 193928 193289 191610 189837 188808 188884 189949
56493 189949 191461 192732 193374 193461 193186 192560 191598 190595 189915 189606 189457 189442 189866 190921 192257 193216 193482 193290
56475 193290 192931 192403 191810 191826 193201 195778 198532 200664 202168 203165 203401 202898 202520 203153 204596 205898 206552
56458 206552 206703 206467 205889 205521 206087 207391 208325 208250 207728 207549 207710 207785 207782 208042 208643 209393 210204 211063 211837 212410
56438 212410 212829 213020 212631 211506 210124 209222 209147 209886 211448 213725 216033 217333 217146 216063 215218 215349 216362
56421 216362 217670 218819 219780 220659 221347 221694 221918 222430 223193 223688 223743 223956 224866 226007 226357 225625 224574 223998
56403 223998 223878 223756 223534 223615 224376 225826 227660 229449 230852 231875 232908 234358 236220 238179 240010 241639
56387 241639 242828 243231 242934 242585 242582 242428 241311 239200 236875 234966 233449 232133 230993 229908 228646 227480
56371 227480 227283 228574 230839 233164 235122 236668 237649 238099 238667 239975 241612 242449 242040 241242 241346 242940
56355 242940 245569 248171 249903 250895 252088 253989 255901 256827 256877 257126 258221 259864 261551 263073 264200
56340 264200 264709 264957 265719 267151 268504 269192 269625 270592 272233 274009 275415 276442 277527 279166 281353 283447
56324 283447 284997 286605 289335 293189 296856 299236 300584 301822 303290 304713 305878 306794 307441 307848 308279
56309 308279 308952 309715 310324 310938 312069 314055 316695 319378 321609 323566 326073 329770 334448 339467 344556
56294 344556 349696 354496 358514 362168 366361 370981 374720 376920 378842 382381 387927 394109 399367 403302
56280 403302 406731 410935 416685 423746 431366 439256 447705 456740 465858 474822 484122 494276 505223 516807
56266 516807 529301 542991 557773 573678 591310 611226 633291 657214 683305 712123 743771
56255 743771 778211 816114 858773 907329 962486 1024729 1094287 1171018 1254827 1346051 1445029
56244 1445029 1551364 1663983 1781673 1903134 2026588 2149672 2269650 2383510 2488119
56235 2488119 2580605 2658480 2719320 2760841 2781679 2781842 2762145 2723656 2668080 2598169 2516979 2426774
56223 2426774 2329032 2225354 2117943 2009415 1902472 1799460 1701658 1608971 1520641 1436285
56213 1436285 1356215 1281075 1211446 1147571 1089176 1035702 986777 942224 901628 864388 830287
56202 830287 799503 771899 746915 724310 704308 686718 670634 655413 641352 629022 618584
56191 618584 610037 603299 597585 591564 584811 578335 573103 568884 565254 562670 561551 561071 560065 558573
56177 558573 557422 556817 556423 556344 556886 557758 558683 560351 563509 567391 570395 572236 574176 577150 580937 585291
56161 585291 590613 597157 604580 612603 621215 630031 638400 646519 655620 666647 679443 693556 709143
56148 709143 726678 746380 768423 793434 822554 857244 899129 949641 1009562 1078978 1157401
56137 1157401 1243525 1334767 1427310 1516604 1598130 1668722 1728034 1778520 1823485 1865290 1905422
56126 1905422 1944928 1983457 2018282 2045627 2063234 2071246 2071080 2064349 2052394 2035467 2011946 1979021
56114 1979021 1934399 1877247 1808144 1729116 1643645 1555868 1469639 1388473 1315488 1252347 1198588
56103 1198588 1152843 1114358 1082595 1056127 1033300 1013816 998480 987519 980161 975624 973385 972640
56091 972640 972602 973315 975196 977941 980851 984045 988253 993552 999278 1005069 1011042 1017149 1023349 1030192 1038290
56076 1038290 1047470 1057342 1068119 1079855 1091535 1102318 1113113 1125443 1139204 1153082 1166758 1181049
56064 1181049 1196194 1211725 1227827 1245055 1262867 1280192 1297407 1315936 1335950 1356273 1376547
56053 1376547 1397585 1419457 1441118 1462211 1483447 1504982 1526186 1547259 1569270 1592337 1615576
56042 1615576 1639088 1664103 1690831 1718064 1745340 1773700 1803851 1835286 1867627 1901134 1935660
56031 1935660 1970810 2007335 2046513 2088009 2130291 2173196 2217925 2264464 2311459 2358934 2408526
56020 2408526 2460502 2513086 2565540 2619578 2676961 2737897 2802419 2870874 2942343 3015040 3089160
56009 3089160 3167097 3250214 3337766 3429533 3526821 3630220 3739066 3853774 3975889 4105233
55999 4105233 4239985 4380248 4528292 4684522 4846605 5013582 5187386 5369418 5559415
55990 5559415 5758925 5971977 6200774 6444493 6703781 6982429 7283128 7605780 7951743
55981 7951743 8325405 8729796 9165252 9634443 10144008 10699167 11301688 11955524 12669359
55972 12669359 13451426 14307646 15247723 16287444 17442548 18727113 20161493 21775728
55964 21775728 23602949 25678252 28049303 30781903 33954270 37659020 42019965 47201899
55956 47201899 53404473 60864142 69874863 80802276 94079409 110204229 129732430
55949 129732430 153221551 181126677 213679936 250664994 290908818 331609464 368144640
55942 368144640 395022176 407789138 404762802 387459318 359612025 325629931 289405708
55935 289405708 253789447 220555961 190609043 164256828 141452983 121952780 105404758
55928 105404758 91419366 79619129 69659115 61231200 54071470 47964882 42736021 38236705
55920 38236705 34343934 30960557 28007870 25417912 23134818 21116994 19331167 17746172
55912 17746172 16334964 15077467 13956329 12952909 12050773 11239183 10509067 9848759 9247249
55903 9247249 8698202 8196984 7736746 7311087 6917758 6555991 6222420 5912870 5625773
55894 5625773 5360562 5114766 4885735 4673298 4477816 4297429 4129883 3975052 3832722
55885 3832722 3699496 3570704 3444152 3319804 3197491 3077498 2961976 2853135 2750848
55876 2750848 2653947 2562652 2477726 2398374 2322854 2250112 2179273 2108953 2038921 1971197 1907765
55865 1907765 1848392 1792137 1739487 1691150 1646140 1602950 1561435 1521805 1482961 1443807 1405177
55854 1405177 1368671 1334480 1301937 1271155 1242500 1215374 1189063 1163815 1139581 1114861 1088484
55843 1088484 1061515 1035758 1011355 987547 964761 944066 925320 907606 890858 875371 860421
55832 860421 845010 829497 814984 801651 789062 777361 766767 756667 746726 737995 731197 724724
55820 724724 716178 705343 693832 682342 670260 657625 645377 633633 621547 609125 597577 587666
55808 587666 579142 571952 566555 562703 559273 555720 552618 550493 549188 548712 549745 552802 557518 562922
55794 562922 567809 570865 571256 569362 566463 563644 561384 559933 559374 559437 559758 560122 559833 557255 550883 540900
55778 540900 529101 517433 507171 499263 494678 494387 499410 510627 527837 548871 569783 585800
55766 585800 592475 587362 571603 549348 524808 500129 476309 454890 437455 424082 413627 405216
55754 405216 398467 392653 386915 381229 376145 371616 366902 361509 355433 348684 341468 334685 329372 325738
55740 325738 323379 322191 322208 322800 322874 321778 319291 315058 308942 301809 295094 289579 285173 281547 278238
55725 278238 274517 270128 265952 263006 261012 258838 256143 253595 251628 250065 249011 249184 251252 255550
55711 255550 262277 271068 280418 288407 294007 297017 297115 294125 289072 283760 279023 274264 268760 262483 255576
55696 255576 248094 240518 233630 227596 221980 216796 212707 209985 208087 206473 205114 204011 203003 202232
55682 202232 202076 202523 203292 204532 206529 208813 210625 212333 215103 218812 221497 221462 218964 215286 211244
55667 211244 207326 204294 202526 201342 199863 198217 197186 197039 197468 198322 199669 201206 202265 202482 202167
55652 202167 202097 203062 205368 208487 211386 213372 214445 214908 215078 215512 216878 219139 221220 221864 220598 217619
55636 217619 213108 207067 199709 191683 183896 177107 171549 166922 162945 159798 157715 156312 154870 153295
55622 153295 152196 151934 152112 152182 151971 151409 150300 148731 147255 146300 145681 144928 143732 141920 139440 136690
55606 136690 134455 133153 132331 131134 129062 126215 123174 120763 119505 119106 118852 118616 118943 119950 120825 120845
55590 120845 120325 119988 119833 119338 118546 118206 118766 119786 120555 120910 121183 121601 122098 122777 124226 127038 131008
55573 131008 135216 139163 143559 149593 157556 166479 174962 181936 186783 189345 190003 189333 187584 184751 181098
55558 181098 177130 173030 168598 163807 158909 153879 148304 142063 135715 129956 125037 120952 117797 115693
55544 115693 114564 114196 114332 114676 115056 115564 116257 116752 116599 116026 115847 116535 117862 119489 121328 123203 124765
55527 124765 126011 127327 128715 129522 129314 128529 127866 127452 127058 126766 126880 127389 128024 128792 130059 132071 134589
55510 134589 136980 138599 139115 138525 136839 133866 129512 124109 118194 112131 106318 101527 98396 96656 95474
55495 95474 94510 93932 93395 91957 89377 86739 85245 84951 85121 85256 85199 84711 83646 82391 81604 81564 82012 82526
55477 82526 82838 82957 83128 83503 83840 83798 83446 83047 82440 81309 80101 79883 81035 82781 84289 85475 86381
55460 86381 86607 85962 85010 84294 83583 82465 81169 80136 79290 78414 77827 77973 78671 79392 79919 80178 79900 79149
55442 79149 78744 79342 80395 80883 80801 81050 82005 83079 83768 84262 84821 85259 85325 85124 84959 85045 85452 86014 86295
55423 86295 86003 85407 85121 85574 86953 89307 92326 95296 97835 100438 103721 107286 109945 110951 110435 108721
55407 108721 105947 102458 98972 96098 94000 92584 91713 91216 91019 91163 91478 91477 90963 90405 90235 90073 89384
55390 89384 88606 88724 89792 90765 90990 91051 91832 93411 95223 96709 97429 97097 95952 94750 94012 93532 92826
55373 92826 91703 90117 87911 85163 82549 80934 80580 80964 81291 81068 80316 79370 78460 77500 76418 75553 75419
55356 75419 76014 76712 76912 76588 76170 76136 76776 78019 79348 80117 80105 79622 79045 78489 77950 77502 77205 77039 77021
55337 77021 77192 77433 77503 77350 77192 77164 77070 76635 75944 75479 75671 76450 77280 77724 77886 78135 78514 78773 78929 79330
55317 79330 79988 80424 80451 80540 80914 80920 79981 78754 78467 79293 80190 80249 79421 78044 76573 75849 76622 78474 79996
55298 79996 80392 80245 80319 80378 79779 78636 77718 77504 77920 78751 79785 80664 81063 81010 80807 80729 80920 81408 82007 82398
55278 82398 82459 82315 82007 81469 80981 81170 82204 83330 83690 83366 83182 83582 84152 84271 83831 83193 82686 82395 82290
55259 82290 82346 82439 82269 81642 80846 80473 80735 81190 81380 81391 81469 81396 80872 80345 80715 82126 83657 84382 84173 83290
55239 83290 81876 80254 79140 78988 79383 79522 79074 78235 77283 76472 76177 76717 78042 79775 81436 82609 83210
55222 83210 83731 84795 86239 87101 86833 86095 85893 86409 87126 87704 88069 87972 87245 86424 86318 86871 87141 86585 85726
55203 85726 85244 84973 84352 83492 83183 83786 84671 84989 84765 84851 85818 87236 88273 88724 89058 89539 89846 89720 89475
55184 89475 89476 89470 88964 88132 87773 88327 89325 89989 90041 89712 89233 88677 88264 88477 89600 91151 92039 91527 89964 88408
55164 88408 87580 87409 87555 87952 88688 89632 90487 91068 91342 91344 91226 91218 91391 91571 91596 91433 90953 89945 88616 87747
55144 87747 87962 88987 90005 90530 90601 90271 89446 88242 87051 86150 85572 85392 85759 86523 87170 87343 87160 86858
55126 86858 86423 85896 85847 87066 89641 92537 94324 94347 93186 92023 91626 91941 92424 92548 91973 90594 88693
55109 88693 86928 85928 85806 86185 86633 86966 87219 87515 87953 88454 88715 88537 88239 88522 89764 91579 93227
55092 93227 94375 95253 96152 96940 97213 96761 95785 94725 94008 93877 94286 94866 95191 95143 94940 94763 94549 94262 94161
55073 94161 94529 95205 95665 95609 95254 94991 94926 94852 94614 94341 94290 94422 94249 93297 91788 90618 90480 91204 92118 92782
55053 92782 93084 92936 92341 91671 91419 91678 92235 93038 94126 95187 95772 95949 96179 96480 96351 95690 95145 95253
55035 95253 95812 96413 96984 97428 97330 96632 96131 96610 97783 98718 99115 99439 99875 99851 98818 97053 95470 94838
55017 94838 95276 96292 97243 97819 98107 98225 98167 98083 98343 99030 99653 99739 99519 99692 100631 102066 103368 103920 103440
54998 103440 102318 101416 101254 101557 101838 102043 102249 102164 101570 101040 101489 103072 105039 106640 107605 107814 107176 106001
54980 106001 104920 104231 103731 103324 103288 103779 104490 105053 105423 105607 105407 104714 103884 103527 103972 105017 106116 106776
54962 106776 106905 106730 106342 105581 104600 104208 105021 106446 107207 106953 106638 107068 107738 107575 106365 104879 103861
54945 103861 103398 103177 102880 102305 101464 100693 100449 100873 101592 102028 101936 101642 101691 102211 102765 102973 103088 103695 104916
54926 104916 106268 107301 108065 108866 109853 110963 112134 113492 115510 118811 123513 128822 133640 137614 141204
54911 141204 144677 147484 148804 148363 146530 143923 141108 138384 135606 132384 128540 124235 119765 115653
54897 115653 112813 111937 112464 112781 111826 110062 108558 107697 107282 107323 107901 108510 108406 107612 106932 106853 107049 107137 107426
54878 107426 108565 110823 113958 117607 121503 125489 129526 133693 137998 142200 145861 148548 150013 150298
54864 150298 149693 148491 146754 144398 141493 138341 135149 131697 127573 122832 118314 115072 113400 112571 111678
54849 111678 110540 109520 108657 107419 105442 103083 101075 99880 99598 100160 101259 102305 102835 102940 102964 102876
54833 102876 102244 100896 99262 97983 97377 97382 97801 98426 99000 99276 99175 98902 98903 99625 101171 103101 104623 105130
54815 105130 104650 103814 103336 103476 103962 104404 104686 104889 105024 105019 104963 105118 105644 106436 107262 107840 107769 106680 104707
54796 104707 102627 101278 100847 100971 101423 102393 103968 105646 106751 107273 107954 109316 110908 111842 111954 111913 112108
54779 112108 111993 110948 109436 108754 109740 112157 115191 118016 119981 120923 121535 122889 125347 128292 131118
54764 131118 133954 137128 140461 143627 146884 150847 155614 160506 164625 167299 168084 166791 163654 159230
54750 159230 154063 148573 143150 138107 133557 129571 126426 124462 123670 123616 123783 123872 123816 123694 123610 123497 123029
54733 123029 121861 120019 117973 116367 115728 116266 117760 119638 121334 122599 123508 124305 125317 126841 128912
54718 128912 131268 133680 136219 139050 142081 144993 147446 149029 149148 147397 144165 140649 137966 136275
54704 136275 134780 132606 129625 126484 123966 122464 122026 122512 123355 123485 122124 119764 117770 116816 116270 115434
54688 115434 114752 115099 116275 117062 116772 115991 115614 115735 115789 115351 114433 113242 112003 110931 110107 109426 108778 108257
54670 108257 108066 108225 108451 108424 108175 108124 108577 109299 109822 110110 110565 111301 111876 111962 111832 111827 111805 111580 111475 111700 111577
54649 111577 110264 108257 107209 107994 109711 110966 111414 111539 111554 111340 111110 111322 111885 112093 111555 110787 110627
54632 110627 111264 112102 112542 112698 113209 114345 115536 115955 115465 114666 114073 113629 113072 112383 111606 110616 109379 108219
54614 108219 107448 106878 106101 105170 104621 104792 105454 106229 107107 108342 109996 111769 113254 114213 114597 114418 113714
54597 113714 112704 111807 111374 111397 111610 111853 112145 112417 112445 112150 111704 111159 110248 108879 107624 107234 107697 108186
54579 108186 108095 107750 107910 108778 109831 110479 110595 110427 110245 110180 110232 110313 110358 110478 110950 111963 113316 114408 114610
54560 114610 113802 112556 111723 111680 112084 112469 112940 113957 115483 116829 117596 118314 119666 121315 122172 121852 121269
54543 121269 121524 122701 124147 125566 127255 129322 131124 131695 130609 128401 126165 124683 123827 122908 121628
54528 121628 120441 119865 119775 119648 119256 118742 118206 117667 117356 117611 118385 119217 119767 120115 120460 120850 121267 121720 122092
54509 122092 122125 121690 120936 120150 119590 119430 119626 119869 119926 120043 120683 121788 122666 122747 122250 121872 122034 122561 122963
54490 122963 122872 122337 121824 121818 122350 123018 123462 123664 123797 124016 124442 125169 126199 127477 128913 130206 130846 130686
54472 130686 130425 130980 132391 133839 134790 135483 136158 136574 136721 137273 138651 140177 140910 140945 141069 141375 141115 139957
54454 139957 138570 137749 137626 137952 138555 139181 139385 138989 138343 137868 137646 137698 138244 139304 140300 140489 139651 138074
54436 138074 136075 133910 132048 131016 130856 131061 131161 131171 131351 131752 132207 132685 133429 134663 136185 137339 137502
54419 137502 136659 135469 134704 134626 134954 135315 135578 135741 135697 135255 134362 133211 132164 131587 131715 132523 133684 134740
54401 134740 135414 135828 136338 137148 138089 138867 139472 140232 141356 142551 143272 143314 143007 142766 142664 142598 142674 143116 143827
54382 143827 144419 144765 145240 146161 147214 147790 147797 147788 148187 148690 148629 147819 146859 146653 147748 150035 152895 155576 157589
54363 157589 158953 160144 161764 164101 166894 169506 171401 172458 172838 172645 171750 169975 167413 164550 161994
54348 161994 159981 158124 155822 153006 150317 148446 147422 146711 145886 144995 144260 143708 143188 142633 142182 141997
54332 141997 141939 141530 140442 139063 138324 138747 139878 140819 141126 140952 140571 140169 139917 139783 139372 138405 137362 137127
54314 137127 137919 139050 139839 140227 140310 139864 138752 137376 136229 135260 134152 133014 132333 132260 132363 132147 131585
54297 131585 131101 131173 131916 132915 133511 133397 132869 132476 132536 133010 133588 133836 133581 133293 133745 135044 136365 136963 137055
54278 137055 137276 137605 137489 136860 136333 136318 136555 136727 137012 137708 138681 139526 140084 140493 140891 141315 141872 142750 143996
54259 143996 145361 146449 147001 147106 147147 147571 148650 150331 152206 153693 154486 154870 155314 155721 155356 153731 151263
54242 151263 148834 146954 145632 144765 144217 143650 142812 141958 141624 141932 142438 142734 142865 143109 143594 144167 144403 143767
54224 143767 142089 139903 138017 136749 135819 134991 134427 134357 134797 135705 137076 138702 140101 140818 140643 139512
54208 139512 137587 135531 134256 134153 134784 135555 136385 137474 138707 139649 140023 139879 139386 138707 138052 137661 137634
54191 137634 137819 137892 137653 137393 137764 138967 140183 140353 139543 138933 139221 139696 139407 138698 138794 140119 141837 143073
54173 143073 143841 144501 144998 145069 144799 144414 143708 142211 140009 138029 137273 137908 139267 140631 141818 142948 143958
54156 143958 144558 144669 144584 144617 144789 145005 145386 146190 147416 148624 149169 148599 146949 144756 142785 141600 141322
54139 141322 141695 142219 142333 141826 141244 141550 143054 144902 145939 145921 145512 145209 144852 144270 143793 143748 143830 143438 142485
54120 142485 141464 140823 140686 141174 142501 144525 146595 148182 149493 151113 153114 154838 155618 155485 155065 154981
54104 154981 155482 156523 158023 159974 162321 164785 166972 168791 170647 173061 176229 180147 184843 189860
54090 189860 193678 194534 192301 188873 186113 183971 181297 177944 174909 172570 170009 166486 162642 159704
54076 159704 158214 158102 159342 161792 164783 167608 170259 173110 176042 178488 180206 181432 182292 182588 182241
54061 182241 181453 180396 179159 177994 177169 176462 175283 173480 171659 170575 170496 171253 172494 173763 174739 175667
54045 175667 177228 179723 182667 185413 187858 190251 192650 194979 197431 200408 204124 208579 213788 219667
54031 219667 225749 231392 236339 240815 245029 248844 251945 254142 255506 256371 257173 258017 258474 258099 257108 256148
54015 256148 255413 254468 253067 251572 250179 248258 244987 240414 235347 230395 225662 221206 217136 213220 209098
54000 209098 205069 202049 200375 199175 197321 194645 191800 189329 187354 185890 184821 183683 182061 180237
53986 180237 179002 178746 179132 179618 179922 179914 179511 178820 178119 177650 177636 178350 179676 180718 180577 179611 179254 180309
53968 180309 182111 183781 185593 188423 192402 196897 201582 206732 212561 218926 225608 232148 237313 239508
53954 239508 238096 233972 228662 223301 218614 215269 213635 213322 213402 213153 212546 212106 212423 213657 215454 217420
53938 217420 219653 222595 226319 230222 233559 236115 238224 240321 242635 245208 248075 251373 255191 259265
53924 259265 263037 266280 269504 273326 277586 281654 285645 290578 297009 304111 310644 316351 321756 326965
53910 326965 331472 335049 338044 340639 342428 343038 342711 341967 341021 339820 338412 337015 335841 334999 334326 333168
53894 333168 330575 326035 319953 313228 306426 299561 292558 285659 279299 273634 268243 262377 255723 248887
53880 248887 242882 238023 233669 229272 225319 222755 221639 220927 219638 217731 215652 213488 211018 208373
53866 208373 206125 204607 203475 202101 200288 198424 196923 195637 193935 191396 188294 185295 182795 180778
53852 180778 179264 178517 178619 179089 179246 178900 178470 178480 179084 180079 181152 182128 183016 183786 184010 183011 180708 178248
53834 178248 177329 178637 181161 183252 184186 184507 185063 186034 186904 187095 186506 185609 185117 185497 186640 187939 188777
53817 188777 189048 189256 190026 191456 192973 193912 194214 194526 195629 197888 201114 204807 208482 211971 215491 219342
53801 219342 223533 227798 231969 236088 240091 243658 246597 249234 252126 255391 258547 261023 262686 263850
53787 263850 264950 266240 267688 269013 269840 269891 269084 267511 265354 262757 259740 256289 252560 248889 245479
53772 245479 242143 238525 234513 230282 225962 221522 217124 213378 210922 209721 208969 207804 206028 204078
53758 204078 202444 201301 200603 200230 199919 199223 197760 195517 192866 190364 188500 187432 186815 186075 185058 184258
53742 184258 184203 184732 185176 185150 184837 184549 184436 184676 185506 186838 188202 189356 190691 192682 195121 197248 198550
53725 198550 199132 199329 199298 199099 198975 199347 200492 202275 204255 206127 208004 210179 212657 215072 217027 218349
53709 218349 219089 219555 220286 221640 223397 225111 226821 228934 231382 233581 235508 238079 241926 246418 250548
53694 250548 254323 258431 262841 266674 269413 271325 272626 273085 272748 272270 272102 271878 271045 269688 268340 267341
53678 267341 266708 266336 265991 265393 264577 263908 263562 263304 262989 262862 263025 263059 262610 262001 261732 261618 261015 259840 258768
53659 258768 258377 258539 258765 258780 258654 258642 259061 260078 261502 262841 263662 263834 263512 263012 262633 262467 262419 262573 263342
53640 263342 265016 267235 269234 270588 271514 272497 273922 276031 278821 281831 284406 286424 288509 291268 294445
53625 294445 297133 298727 299455 300017 300999 302678 305091 307976 310729 312725 313915 315024 316984 320138 324086
53610 324086 328224 332186 335756 338720 341144 343561 346483 349739 352650 354872 356715 358558 360350 361904
53596 361904 363279 364487 365140 364853 363910 363050 362634 362472 362450 362760 363271 363195 361801 359176 355947 352596 349473
53579 349473 347187 346240 346268 346191 345286 343693 341819 339784 337678 335791 334168 332359 330065 327824 326591 326753
53563 326753 327931 329575 331329 332928 334181 335140 335987 336764 337487 338382 339644 340997 341854 341983 341715 341510
53547 341510 341681 342477 343990 345884 347611 349094 350898 353581 357129 361113 365114 368950 372781 377101 382308
53532 382308 388207 394235 400284 406879 414445 422810 431665 441052 451113 461681 472505 483599 495152
53519 495152 507310 520333 534610 550222 566743 583776 601468 620182 639931 660491 681805
53508 681805 703925 726761 750187 774169 798459 822434 845666 868344 890707 912441 933242
53497 933242 953652 974575 996050 1017260 1037667 1057350 1076148 1093504 1109596 1125816 1143360
53486 1143360 1161831 1179882 1196950 1213623 1230471 1247307 1263793 1280142 1296752 1313410 1329297
53475 1329297 1343714 1356445 1367366 1376130 1382566 1387111 1390290 1391722 1390212 1385121 1377237 1367862 1357407
53462 1357407 1345425 1331852 1317472 1303058 1288610 1273673 1257977 1241455 1223932 1205164 1185101
53451 1185101 1164013 1142440 1121000 1100014 1079287 1058540 1038072 1018614 1000457 983196 966590
53440 966590 951250 938104 927469 919027 912459 907584 904020 901191 898811 897065 896309 896886 899221 903616
53426 903616 909731 916606 923586 931124 940338 951752 964819 978776 993659 1010063 1028107 1047194
53414 1047194 1066934 1087773 1110302 1134324 1159159 1184745 1211758 1240626 1271075 1302845 1336241
53403 1336241 1371536 1408361 1446273 1485632 1527316 1571603 1617911 1665667 1714973 1766235 1819445
53392 1819445 1873996 1929015 1983848 2038377 2092896 2147435 2201226 2253132 2302620 2350002 2395644
53381 2395644 2439358 2480767 2519850 2556684 2590915 2621974 2649765 2674623 2696507 2714657 2728252
53370 2728252 2736951 2740402 2737499 2726732 2707414 2680252 2646634 2607645 2563945 2516277 2465721 2413393
53358 2413393 2360071 2306124 2251673 2196869 2142146 2088207 2035726 1985082 1936408 1889730 1844839
53347 1844839 1801156 1757970 1714875 1671877 1629213 1587311 1546807 1508219 1471541 1436481 1403253
53336 1403253 1372749 1345724 1322084 1301254 1282933 1267107 1253480 1241419 1230483 1220565 1211341 1201944
53324 1201944 1191475 1179685 1167004 1154038 1141242 1128942 1117369 1106641 1096836 1088096 1080554 1074210
53312 1074210 1068994 1064922 1062061 1060365 1059683 1059940 1061160 1063233 1065913 1069172 1073493 1079622 1088038 1098728
53298 1098728 1111406 1125789 1141720 1159225 1178509 1199727 1222623 1246489 1270668 1295048 1319917
53287 1319917 1345243 1370290 1394146 1416675 1438650 1460739 1482508 1502709 1520444 1535583 1548012
53276 1548012 1557061 1562111 1563359 1561469 1556764 1549348 1539774 1528721 1516000 1500617 1482109 1461107 1438330
53263 1438330 1413765 1387297 1359428 1330703 1300939 1269771 1237652 1205602 1174236 1143651 1114012
53252 1114012 1085475 1057750 1030520 1004183 979301 955369 931127 906202 881552 857903 834690
53241 834690 811042 787041 763422 740734 719491 700575 684538 670704 657745 645155 633576
53230 633576 623769 615796 609206 603427 597821 591724 584642 576288 566529 555549 543986 532531 521337
53217 521337 510133 498865 487821 476984 465690 453348 440476 428662 419243 412023 405523 398568
53205 398568 391430 385167 380086 375330 369891 363422 355943 347419 338136 328984 320783 313483 306485 299545
53191 299545 292933 286925 281668 277385 274113 271266 267988 264079 260184 256996 254646 252859 251270 249513
53177 249513 247416 245246 243405 241865 240316 238893 238178 238231 238217 237433 236243 235457 235060 234219 232502 230500
53161 230500 229020 228105 227194 226020 224953 224406 224226 223901 223233 222517 222044 221703 221270 220804 220451 220001 219034 217538
53143 217538 216022 214927 214258 213887 213895 214328 214850 214978 214646 214322 214551 215537 217171 219290 221756 224239 226086
53126 226086 226690 226167 225483 225575 226366 226907 226541 225602 224919 224968 225734 227013 228513 229795 230521 230721 230556 229874
53108 229874 228348 226069 223670 221740 220320 219095 217875 216703 215695 214952 214577 214530 214531 214269 213732 213184 212812
53091 212812 212567 212397 212484 213023 213817 214257 213833 212639 211327 210500 210173 209810 208943 207712 206738 206489 206849 207350
53073 207350 207707 208075 208818 210013 211122 211282 210124 208319 207005 206600 206519 206115 205426 204711 203839 202761 202153
53056 202153 202774 204266 205403 205549 205112 204518 203709 202996 203392 205351 207793 209171 209155 208637 208460 208794 209403
53039 209403 209780 209278 207851 206480 206215 206880 207403 207220 206650 206053 205520 205347 205910 206911 207560 207703 207936 208415
53021 208415 208499 207962 207651 208255 209210 209607 209631 210217 211625 213180 214259 214808 214918 214555 213817 213003 212312 211789
53003 211789 211559 211819 212559 213511 214375 214938 215108 215004 214874 214814 214739 214762 215220 216018 216355 215586 214127 213041 212868
52984 212868 213347 214146 215289 216791 218363 219667 220631 221409 222223 223183 224144 224823 225255 225819 226595 227042 226855
52967 226855 226853 228285 231240 234363 236243 236586 236024 235483 235867 237610 240041 241648 241373 239377 236397 232955
52951 232955 229548 226887 225226 223899 222253 220769 220421 221062 221403 220696 219601 218994 218686 217942 216784 216058
52935 216058 216354 217461 218811 219998 220814 221233 221489 221809 221967 221447 220206 218956 218426 218634 219110 219586 220080
52918 220080 220423 220217 219377 218485 218347 219218 220476 221087 220492 219142 218024 217609 217495 217209 216948 217092 217345 217019
52900 217019 216125 215504 215733 216487 217210 217774 218184 218215 217899 217934 218943 220564 221796 222127 221874 221609 221732 222448
52882 222448 223522 224141 223618 222280 221155 220711 220487 220051 219716 220061 221266 223232 225821 228562 230566 231320
52866 231320 231373 231742 232726 233772 234413 234883 235666 236808 237836 238189 237623 236382 235002 233782 232314 229759
52850 229759 225811 221282 217480 214956 213117 211160 209114 207654 207033 206681 205984 205022 204243 203744 203328 203110
52834 203110 203535 204693 206012 206830 207063 207183 207681 208607 209451 209529 208659 207489 206861 206857 206794 206184 205297 204693 204602
52815 204602 204995 205880 207160 208513 209758 211165 213024 215092 216789 217824 218290 218253 217637 216506 215132 213741
52799 213741 212428 211281 210328 209385 208272 207138 206290 205689 204971 203988 202955 201952 200701 199080 197549 196736
52783 196736 196764 197259 197844 198304 198428 198063 197398 196887 196791 197000 197390 198100 199262 200578 201403 201275 200258 198816
52765 198816 197446 196392 195587 194838 194109 193657 193778 194419 195206 195949 196939 198561 200696 202755 204267 205194 205671
52748 205671 205753 205623 205778 206635 208098 209750 211440 213295 215186 216606 217339 217920 219065 220766 222305 223147
52732 223147 223490 223884 224627 225686 226915 228066 228755 228700 227976 226797 225161 222994 220611 218642 217358 216368
52716 216368 215165 213724 212324 211060 209883 208943 208477 208363 208154 207643 207088 206802 206841 207160 207778 208556 209130
52699 209130 209318 209396 209713 210192 210466 210392 210153 209909 209660 209440 209456 210006 211351 213488 215845 217395 217515 216699
52681 216699 215990 215634 214799 212870 210547 209247 209630 211170 212982 214576 215802 216539 216719 216434 215865 215292
52665 215292 215188 215973 217448 218796 219436 219718 220447 221929 223879 226162 229043 232474 235654 237735 238798
52650 238798 239658 240717 241395 240823 238853 236173 233591 231420 229521 227692 225885 224112 222378 220826 219902
52635 219902 220099 221418 223176 224520 225146 225407 225793 226485 227434 228663 230283 232187 233821 234419 233606 231806
52619 231806 229935 228542 227391 226047 224684 223973 224160 224716 225113 225551 226491 227638 227922 226659 224395 222397
52603 222397 221459 221472 221992 222881 224219 225837 227234 228011 228195 228028 227594 226882 226157 225960 226542 227444 227901 227669
52585 227669 227322 227616 228687 230004 231014 231643 232036 232057 231350 229939 228466 227722 228063 229333 231080 232667
52569 232667 233442 233227 232529 231951 231469 230656 229507 228522 227893 227162 225977 224728 224083 224224 224923 225974 227042
52552 227042 227357 226275 224209 222494 222133 222946 223996 224453 223992 222813 221582 221072 221563 222694 223978 225232
52536 225232 226317 226831 226448 225477 224673 224433 224442 224210 223730 223448 223736 224584 225757 226976 227882 228043 227239 225718
52518 225718 224013 222548 221601 221496 222408 223893 225068 225576 226041 227243 229150 231226 233342 235717 238080
52503 238080 239662 240194 240284 240530 240782 240586 239863 238720 237042 234724 232077 229603 227594 226269 225926 226507
52487 226507 227311 227706 227871 228313 228879 228974 228707 229040 230582 232835 234875 236305 237246 237832 238013 237628 236505
52470 236505 234761 233053 232080 231753 231380 230890 231254 233241 236271 239081 241152 242859 244512 245999 247269
52455 247269 248466 249425 249620 248801 247300 245559 243749 241947 240279 238696 236946 235000 233250 232117 231691
52440 231691 231867 232450 233003 232951 232201 231357 230982 230833 230200 228875 227418 226508 226379 226883 227754 228697 229490 230149
52422 230149 230868 231725 232552 233160 233551 233876 234374 235363 237094 239416 241733 243578 245257 247768 251989 258080
52406 258080 265692 274527 284340 294400 303233 309164 311095 308855 303161 295470 287561 280695 275037 270133
52392 270133 265897 262805 261139 260518 260336 260260 260098 259651 259107 259159 260216 261669 262468 262304 261741 261313 261127 261377
52374 261377 262533 264688 267253 269690 272222 275433 279429 283783 288061 292092 295905 299771 304036 308456
52360 308456 311834 312942 311860 309985 308576 307751 307037 306375 306168 306714 308047 310135 312761 315308 317199
52345 317199 318593 320285 322764 325798 329089 332876 337488 342662 347839 353065 359073 366381 374706 383454
52331 383454 392456 402044 412630 424462 437512 451361 465411 479549 494488 511127 529635 549450
52319 549450 570078 591413 613221 634758 655210 674316 692303 709420 725751 741358 756340
52308 756340 770754 784615 797914 810491 822017 832284 841450 849772 857178 863395 868519 873081 877373
52295 877373 880959 883147 883718 882863 880464 875939 868986 860153 850414 840380 830237 820210 810693 801927
52281 801927 794000 787317 782752 781043 782215 785712 790965 797669 805698 814967 825315 836450 848077
52268 848077 860115 872600 885351 898013 910532 923203 936044 948490 960015 970704 980834
52257 980834 990270 998773 1006560 1013941 1020583 1025817 1029539 1032129 1033517 1033084 1030576 1026363 1020617 1012920
52243 1012920 1002889 990529 975795 958710 940275 922326 905778 889713 872952 855873 839785
52232 839785 825053 810901 796842 783227 770400 758269 746856 736518 727438 719474 712583 706764
52220 706764 701548 696311 691242 687370 685331 684786 685251 686854 689806 693680 697661 701217 704190 706642 708920
52205 708920 711442 714054 715990 716817 717064 717557 718519 719749 721294 723363 725807 728265 730697 733329 736184
52190 736184 739084 741973 744782 747100 748499 749111 749421 749457 748706 746904 744374 741342 737316 731519 723882
52175 723882 715494 708131 703195 700761 699544 698047 695881 693839 692772 692702 693098 693658 694539 696033 698192
52160 698192 700715 703121 705198 707329 710141 713756 717596 721101 724399 727991 731933 735618 738391 740187
52146 740187 741580 743373 746121 749867 754225 758745 763193 767513 771751 776178 781333 787618 794819 802252
52132 802252 809513 816979 825533 835988 848822 864192 881941 901676 923081 946190 971183 997952
52120 997952 1026097 1055305 1085367 1115691 1145115 1172580 1197888 1221506 1243670 1263993 1281964
52109 1281964 1297451 1310477 1320759 1327765 1331230 1331476 1329259 1325410 1320544 1314848 1308071 1299853 1290207
52096 1290207 1279698 1269039 1258470 1247495 1235295 1221435 1206140 1189893 1172906 1155138 1136753
52085 1136753 1118368 1100807 1084798 1070917 1059595 1051042 1045296 1042382 1042283 1044621 1048577 1053346 1058697
52072 1058697 1065035 1073042 1083294 1095942 1110504 1126051 1141821 1157614 1173456 1189084 1204034 1218094
52060 1218094 1231318 1243560 1254329 1263209 1270249 1275826 1280255 1283581 1285646 1286353 1285822 1284108 1280596 1274011
52046 1274011 1263527 1249760 1234214 1217660 1199552 1179155 1156732 1133341 1109959 1087141 1065161
52035 1065161 1043999 1023411 1003488 984961 968553 954216 941446 930054 919991 910477 900199
52024 900199 888679 876918 866288 857158 848940 841048 833319 825748 818331 811127 804081 796825 789025
52011 789025 780961 773343 766489 759888 752694 744385 734892 724377 713100 701383 689467 677439 665351
51998 665351 653322 641471 629935 619094 609688 602434 597410 593815 590387 586151 580945 575314 569839
51985 569839 564522 558821 552259 544832 536811 528359 519493 510282 500883 491402 481901 472558 463651 455418
51971 455418 448043 441792 436972 433696 431839 431255 431948 433978 437308 441855 447528 454025 460708 466894 472319
51956 472319 477159 481467 484760 486286 485620 482888 478555 473328 468273 464613 462989 463025 463967 465757 469187
51941 469187 474959 482972 492772 504410 518511 535607 555722 578480 603124 628248 651810 671746
51929 671746 686607 695601 698260 694343 684133 668662 649515 628312 606306 584323 562839 541990
51917 541990 521614 501663 482708 465791 451473 439175 427782 416892 407170 399512 394185 390837
51905 390837 388939 388087 388106 389138 391371 394526 397860 400925 404033 407580 411114 413497 413929 412365 408984
51890 408984 403812 397177 390088 383657 378247 373495 369191 365758 363817 363476 364236 365524 367229 369809 373932
51875 373932 379950 387497 395553 403018 409318 414496 418807 422310 424854 426241 426242 424620 421378 416999 412234
51860 412234 407604 403240 399224 395879 393617 392626 392783 393753 395088 396366 397387 398154 398656 398769 398435 397621
51844 397621 395988 392860 387954 382029 376421 371879 368090 364341 360341 356310 352707 350097 349048 349702
51830 349702 351439 353259 354588 355539 356342 356738 356188 354554 352388 350442 349038 347947 346764 345314 343807
51815 343807 342768 342703 343627 344968 346191 347511 349671 352977 356845 360466 363529 365985 367500 367690 366788
51800 366788 365494 364117 362356 360125 358031 356663 355783 354688 353183 351633 350128 348186 345517 342711
51786 342711 340725 339893 339759 339839 340196 341128 342585 344133 345401 346310 346909 347215 347326 347542 348244 349709 352012
51769 352012 354997 358336 361815 365702 370669 377156 384885 393094 401083 408336 414288 418345 420186 419772
51755 419772 417035 411879 404629 396234 387781 379875 372575 365765 359451 353798 349058 345418 342810 340916
51741 340916 339501 338748 339227 341505 345711 351370 357651 363961 370364 377148 383932 389539 393116 395217 397364
51726 397364 400573 404647 408927 413145 417157 420166 420805 418170 412597 405375 397950 391403 386332 382807
51712 382807 380374 378269 375785 372531 368513 364169 360306 357821 357310 358878 362238 366755 371381 374845
51698 374845 376319 376030 375097 374594 374786 375264 375728 376418 377669 379161 379898 379044 376620 373239 369415 365483
51682 365483 361936 359254 357228 355071 352597 350807 350834 352613 355238 358375 362563 368060 374261 380581 387302
51667 387302 395094 404104 413930 424056 433684 441418 445822 446408 443690 438360 430943 422298 413847 406911
51653 406911 402038 399205 398471 400082 403877 408728 412717 414054 412126 407727 402240 396600 391070 385707
51639 385707 380599 375690 370847 366269 362459 359596 357260 355053 353193 352089 351582 351090 350392 349795 349442
51624 349442 348947 347882 346247 344178 341486 337885 333583 329288 325610 322602 319898 317114 314123 311141
51610 311141 308604 306808 305641 304820 304393 304748 306009 307694 309313 311171 314176 318753 324295 329970 335866
51595 335866 343061 352490 363822 375328 384621 389714 389952 386333 380813 374945 369087 362970 356859 351857
51581 351857 349065 348760 350515 353884 358704 364931 372545 381625 392187 403792 415595 427049 438411
51568 438411 450291 462656 474537 484754 492790 498982 504242 509849 517315 528013 542756 561813
51556 561813 585187 612541 642753 673814 703438 729745 751432 767764 778728 784926 786713 783396
51544 783396 773752 757527 736150 711796 686086 659840 633677 608326 584491 562801 543824 527733
51532 527733 513933 501415 489616 478659 468688 459345 450187 441384 433630 427313 421984 416738 411007
51519 411007 404938 399023 393507 388247 383076 378142 373732 369928 366539 363287 359939 356402 352909 349985
51505 349985 347982 346712 345738 344910 344306 343783 343017 341996 341084 340571 340527 341102 342395 343903 344685 344419 343859
51488 343859 343908 344647 345646 346724 347865 348717 348834 348273 347405 346228 344376 341783 338852 335999 333418 331259
51472 331259 329535 327868 325801 323458 321459 320073 318837 317109 314637 311562 308217 305091 302605 300789
51458 300789 299370 298243 297605 297594 298124 299039 300159 301266 302485 304579 308299 313419 319101 325283 332981
51443 332981 342875 354293 366021 377410 388033 396824 402502 404801 404696 403503 402263 401766 402357 403377
51429 403377 403339 401062 396589 390921 385025 379132 372885 366102 359397 353829 349821 346716 343660 340743 338822
51414 338822 338281 338473 338505 338236 338212 338783 339617 340178 340483 341137 342507 344101 345054 345098 344724 344448 344416 344823 346151
51395 346151 348620 351788 355030 358107 360958 363373 365492 368302 372994 379873 388404 398266 409779 423371
51381 423371 439273 457885 479849 505459 534489 566901 603261 643872 687495 731297 772140
51370 772140 807870 837552 860836 877380 886851 889221 884777 873836 856603 833343 804496 770694
51358 770694 733062 693609 654715 617823 582887 549488 518117 489842 465105 443553 424821
51347 424821 408790 395105 383281 373354 365661 359809 354687 349824 345972 343810 342748 341670 340417
51334 340417 339774 340207 341292 342338 342989 343158 342774 341730 339893 337238 334171 331490 329665 328264 326517
51319 326517 324325 322267 320643 319073 317229 315484 314431 314064 313830 313408 312999 312828 312713 312345 311724 311043
51303 311043 310265 309182 307967 307351 307971 309674 311660 313179 313899 313733 312744 311270 309885 309039 308892 309470
51287 309470 310752 312509 314346 316151 318365 321607 326037 331201 336444 341337 345645 348985 350799 350924
51273 350924 350167 349874 350653 351811 352442 352777 353895 356166 358645 360182 360568 360344 359970 359552 358990 357986 356115
51256 356115 353271 349834 346179 342266 338028 333888 330462 327884 325839 324137 322887 322186 322013 322420 323400
51241 323400 324497 324940 324354 323165 322114 321553 321385 321562 322319 323786 325507 326727 327254 327771 328952 330459
51225 330459 331176 330409 328428 325906 323380 321385 320418 320359 320415 320097 319884 320443 321653 322930 324179 325716 327493
51208 327493 329086 330410 331821 333551 335600 338095 341090 344028 346111 347303 348265 349208 349625 349404 349354 350084
51192 350084 351092 351601 351706 351912 351981 351162 349415 347543 346034 344492 342421 340060 338149 337251 337522 338833
51176 338833 340852 343196 345669 348218 350666 352703 354237 355448 356388 356833 356704 356336 356001 355474 354422 353136
51160 353136 352380 352443 352731 352480 351603 350629 350020 349723 349249 347943 345380 341809 338118 335062 332545 330001 327419
51143 327419 325516 324757 324678 324532 324266 324421 325315 326812 328767 331170 333815 336255 338253 339865 340996 341347
51127 341347 341022 340774 341268 342403 343710 345091 346642 347988 348473 348169 348113 349199 351149 352938 353987 354582
51111 354582 355195 355888 356498 357065 357767 358557 359222 359883 361170 363661 367169 370740 373418 374935 375782 376757 378441
51094 378441 380806 383149 384546 384630 383934 383425 383753 384988 386810 388645 389778 389826 389245 389016 389605 390492 390907
51077 390907 390723 390281 389646 388626 387514 387192 388192 389999 391597 392558 393443 395339 399234 405532 413792 423090
51061 423090 433050 444512 458809 476213 495278 513722 529762 542748 553091 562020 571174 581920
51049 581920 594682 608776 622723 634809 643697 648888 650661 649459 645366 638249 628388 616862 605311
51036 605311 595280 587593 582049 577547 572475 565230 554834 541474 526500 511635 498001 485919
51024 485919 475463 466910 460531 456234 453668 452580 452959 454914 458459 463324 468988 475172 482292 491074
51010 491074 501532 512648 523357 533557 543809 554310 564612 574299 583404 592091 600268 607644
50998 607644 613947 619004 622835 625771 628255 630442 632120 633069 633354 633288 633272 633720 634937 637015 640044 644474
50982 644474 651041 660187 671572 684174 696771 708494 719258 729879 741598 755345 771492 790346
50970 790346 812665 839552 871905 909982 953367 1001277 1053072 1108664 1168410 1232495 1300402
50959 1300402 1370905 1442475 1513682 1583395 1650679 1714417 1773047 1824913 1869022 1905284 1933827
50948 1933827 1954224 1965681 1967975 1961983 1949273 1931510 1910378 1887636 1864529 1840831 1814775 1784462
50936 1784462 1749658 1712210 1674751 1639092 1605725 1574377 1544571 1515661 1486812 1457289 1426772
50925 1426772 1395299 1362943 1329683 1295515 1260525 1224824 1188582 1152303 1116916 1083262 1051420
50914 1051420 1020807 991136 963100 937874 915989 896917 879654 863507 848405 834745 822891
50903 822891 812603 803073 793849 785509 778830 773436 767986 761868 755858 750785 746379 742130 738587 736857
50889 736857 737092 738369 739905 741543 743101 744175 744889 746121 748595 752197 756445 761217 766720 773038 780032
50874 780032 787495 795320 803692 813108 823934 835969 848863 862906 878919 897240 917361 938783
50862 938783 961798 987250 1015932 1048420 1084971 1125238 1168607 1215373 1267334 1326787 1395012
50851 1395012 1472058 1557801 1652759 1757846 1873553 1999417 2134158 2276365 2425092 2579734
50841 2579734 2739379 2902270 3065630 3225499 3376856 3514500 3634191 3732831 3807834 3857055
50831 3857055 3879599 3876165 3848389 3798428 3729466 3645928 3552608 3453805 3353576 3256101 3165076
50820 3165076 3082889 3010685 2948696 2895946 2850115 2808438 2768559 2728221 2684852 2636456 2582612
50809 2582612 2523668 2459222 2388439 2311805 2231337 2148730 2064369 1978689 1893620 1811894 1735375
50798 1735375 1664728 1600344 1542807 1492564 1449749 1414471 1386913 1366928 1353731 1346133 1343081 1343964
50786 1343964 1348350 1355422 1363868 1372489 1380792 1388692 1395753 1401117 1404263 1405434 1405155 1403524 1400151 1394632
50772 1394632 1386971 1377579 1366856 1354619 1340116 1322842 1303186 1281869 1258951 1233970 1207093 1179476
50760 1179476 1152238 1125668 1099820 1075335 1053142 1033634 1016755 1002619 991457 983021 976759 972794
50748 972794 972170 975790 983443 994344 1008398 1026415 1048959 1075492 1104971 1137055 1172371 1211701
50736 1211701 1255375 1303503 1356322 1414059 1476711 1544140 1616048 1691520 1769009 1847345 1926575
50725 1926575 2007295 2089150 2170515 2249547 2324923 2395357 2458966 2513474 2556606 2585966 2598989
50714 2598989 2593661 2569439 2527488 2470377 2401931 2327054 2250881 2177449 2109027 2046607 1990923
50703 1990923 1942861 1903001 1870997 1845688 1825733 1809823 1796190 1782406 1766153 1746085 1721640
50692 1721640 1692291 1657619 1618065 1575068 1530279 1485066 1440702 1398472 1359381 1324252 1294201
50681 1294201 1270423 1253333 1242502 1237800 1239979 1249702 1266560 1289615 1318497 1353330 1393892 1439381
50669 1439381 1488689 1540220 1591673 1640762 1686254 1727845 1765165 1797512 1824616 1847123 1866210
50658 1866210 1883066 1898672 1913500 1927182 1938824 1947844 1954333 1958788 1961849 1964209 1966236 1967724 1968583
50645 1968583 1969828 1973283 1980169 1990530 2004251 2021922 2044239 2071105 2101809 2135686 2171980 2209410
50633 2209410 2246614 2283065 2319038 2354681 2389631 2423561 2456457 2487741 2514994 2533678 2538434
50622 2538434 2525411 2494314 2448768 2394681 2338012 2283603 2235133 2195076 2164305 2142214 2127778
50611 2127778 2120411 2119617 2124119 2131818 2140668 2149250 2156367 2160331 2158921 2150041 2132382 2105526 2069593
50598 2069593 2024909 1972106 1912545 1848407 1782066 1715265 1648980 1584009 1521304 1461493 1404415
50587 1404415 1349610 1297314 1248654 1204774 1166007 1131946 1101997 1075626 1052286 1031513 1013218
50576 1013218 997782 985776 977482 972551 970177 969813 971711 976457 983890 992955 1002926 1014410 1028573
50563 1028573 1045625 1064747 1085522 1108662 1134990 1164263 1195527 1228290 1262781 1299227 1337456
50552 1337456 1377170 1418113 1459845 1501685 1542951 1582952 1620764 1655596 1687663 1718258 1748626
50541 1748626 1779153 1810097 1842708 1878813 1919292 1963586 2010898 2061259 2115161 2172727 2233853
50530 2233853 2298866 2368543 2443533 2524127 2610453 2702496 2799922 2902205 3008784 3118657 3229766
50519 3229766 3339195 3444006 3541571 3629143 3703689 3762465 3803530 3825615 3827872 3809982 3772193
50508 3772193 3715109 3639839 3548681 3445393 3334480 3220344 3107168 2999067 2899779 2812357
50498 2812357 2739446 2683508 2646201 2627621 2626634 2641902 2672086 2714937 2766544 2821640 2874422 2919203
50486 2919203 2950743 2964393 2956269 2923844 2866956 2788230 2692176 2583769 2467770 2348638 2230093
50475 2230093 2114560 2003579 1898737 1801608 1712691 1631205 1556249 1487583 1424950 1367339 1313609
50464 1313609 1263508 1217527 1176009 1138886 1106071 1077564 1053335 1033575 1018893 1009631 1004970 1003240
50452 1003240 1003227 1004823 1008402 1014047 1021588 1030918 1042013 1054871 1069644 1086599 1105638 1125838 1145603
50439 1145603 1163318 1178006 1189648 1198958 1206694 1213118 1218151 1221957 1225095 1228124 1231376 1235206 1240109
50426 1240109 1246338 1253634 1261677 1270712 1281404 1294067 1308314 1323758 1340974 1361506 1386765 1417059
50414 1417059 1451849 1490825 1534313 1582516 1634761 1689936 1747479 1807429 1869418 1932015 1993265
50403 1993265 2051727 2106823 2158374 2205836 2247869 2282537 2308013 2323076 2326845 2318272 2296330 2260797
50391 2260797 2212572 2153245 2084859 2010287 1933300 1857687 1786204 1720424 1661307 1609611 1566085
50380 1566085 1531605 1507025 1492606 1487754 1491539 1503147 1521422 1544143 1568279 1590909 1609526 1621683
50368 1621683 1625112 1618501 1601797 1575622 1540821 1498790 1451746 1402143 1351919 1302461 1255061 1210918
50356 1210918 1170743 1134622 1102380 1073944 1049335 1028381 1010477 994524 979030 962301 942856
50345 942856 920158 895177 869973 846295 824558 804372 785846 769920 757461 748556 742782 739671
50333 739671 738653 738933 739821 740993 742304 743644 745206 747529 750919 755066 759509 764248 769501 775069 780342
50318 780342 784885 788663 791725 793949 795197 795554 795433 795533 796543 798748 802014 806083 810629 814984 818405
50303 818405 820883 823241 826096 829199 832292 836007 841158 847555 854436 861811 870291 879604 888425 896059
50289 896059 903272 910929 918604 925265 930664 935181 938574 939702 937523 931960 923858 914532 905280 896888
50275 896888 889545 883347 878729 876142 875512 876415 878771 882984 889367 897672 907370 918260 930772 945652
50261 945652 963368 983930 1007396 1034314 1065199 1099425 1135103 1170260 1203895 1235784 1265749
50250 1265749 1293600 1319519 1344036 1367557 1389968 1410509 1427748 1439874 1445299 1442958 1432188 1412884
50238 1412884 1386101 1354027 1318921 1282304 1245423 1209975 1177706 1149389 1124618 1102366 1081247
50227 1081247 1059528 1035596 1008549 978123 944451 908493 872376 838392 807510 779415 753891
50216 753891 731364 712052 695457 681052 668757 658337 648999 640131 632051 625592 621238 618988 618588
50203 618588 619420 620456 620838 620347 619058 616847 613683 610154 607164 605088 603554 601963 600011 597749 595378
50188 595378 592977 590373 587435 584508 582121 580100 577521 573967 570405 568206 567663 568109 569243 571373 574346
50173 574346 577221 579471 581817 585225 589497 593517 596737 599856 604015 609796 617045 625266 633994 643091
50159 643091 652929 664120 676813 690396 704120 718061 733332 751332 772890 798037 826254 856820
50147 856820 889201 923512 960601 1001473 1046662 1096287 1150530 1209488 1272306 1336792 1400320
50136 1400320 1461201 1519176 1574916 1629377 1683396 1737323 1790541 1841358 1887391 1926104 1955098
50125 1955098 1972238 1975800 1964663 1938535 1898213 1845704 1783896 1715798 1643915 1570150 1496109
50114 1496109 1423318 1353241 1287265 1226642 1172176 1123772 1080435 1040950 1004596 971101 940038
50103 940038 910699 882755 856680 833211 812455 793850 776964 761979 749292 738952 730663 724172
50091 724172 719417 716315 714566 713719 713430 713626 714402 715745 717437 719221 720882 722126 722578 722144 721169 719954
50075 719954 718283 715749 712468 709006 705573 701816 697511 692949 688392 683651 678631 673861 669943 666679
50061 666679 663354 659820 656713 654484 652708 650672 648328 646325 645232 645082 645745 647476 650840 656062 662649
50046 662649 669802 677120 684741 692879 701546 710765 720741 731653 743407 755708 768167 780285 791719
50033 791719 802780 814338 826960 840468 854722 870477 888849 910067 933446 958660 986441
50022 986441 1017764 1052747 1090511 1129664 1168560 1205495 1239182 1269148 1295577 1318918 1339766
50011 1339766 1358860 1376847 1393952 1409671 1422419 1429489 1428018 1416516 1395282 1365150 1326435 1279797
49999 1279797 1227782 1174433 1123068 1074982 1030440 989995 954197 922632 894228 868454 845550
49988 845550 825495 807459 790548 774552 759598 745379 731185 716556 701502 686150 670534
49977 670534 654819 639517 625287 612556 601328 591353 582525 575063 569159 564440 560058 555423 550647
49964 550647 546081 541745 537508 533568 530343 527981 526424 525813 526379 527953 530158 533182 537820 544500 552747
49949 552747 561850 571628 582153 593114 603831 613649 622036 628622 633609 637808 641769 645045 646752
49936 646752 646611 644825 641146 634842 625697 614362 601549 587513 572762 558761 547267 538997 533225
49923 533225 528664 524555 521011 518582 517569 517746 518682 520149 521993 523741 524818 525280 525938 527462 529657
49908 529657 531960 534397 537620 542031 547261 552684 558158 564126 571068 579034 587738 596981 606798 617044
49894 617044 626959 635413 641646 645593 647493 647505 645899 643168 639557 634588 627571 618634 608838 599177 589736
49879 589736 579992 569633 558869 548172 538017 528725 520339 512744 506096 500953 497636 495574 493759
49866 493759 491952 491039 491961 494586 497925 501256 504753 509164 515151 522825 531633 540713 549692 559026 569369
49851 569369 580650 592094 603001 613031 621752 628512 632983 635409 636099 635102 632625 629269 625444 620869
49837 620869 615077 608083 600171 591468 582374 574053 567644 562945 558579 553557 548103 542921 538472 535228
49823 535228 533840 534454 536324 538652 541484 545349 550402 556490 563787 572618 582610 592564 601354 608688
49809 608688 614981 620814 626532 631938 636278 638797 639449 638803 637226 634484 630256 624592 617595 609067 598985
49794 598985 588086 577481 567627 558203 549067 540903 534558 530071 526730 523907 521448 519305 517237 515041
49780 515041 512766 510529 508313 506101 504057 502456 501568 501723 503306 506502 511138 516837 523157 529540 535434
49765 535434 540754 546032 551843 558147 564359 569898 574498 578223 581450 584596 587489 589173 588646 585595
49751 585595 580139 572354 562705 552595 543500 535573 527915 520374 514073 509828 506933 504199 501480 499467
49737 499467 498471 498157 498103 497919 497142 495769 494707 494978 496543 498501 500311 502141 504179 506430 509238 513264
49721 513264 518722 525270 532746 541350 550862 560353 568998 576579 582900 587402 589839 590798 591005 590518 589128
49706 589128 587077 584704 581719 577544 572265 566602 561054 555726 550970 547468 545472 544441 543646 542721 541568
49691 541568 540241 539219 539315 540915 543571 546643 550126 554536 560125 566543 573217 579846 586586 593949 602434
49676 602434 612149 622901 634741 648099 662969 677997 690789 699398 703499 704170 702779 700207 696974
49663 696974 693765 691579 691290 693170 696931 702019 707551 711964 713110 709153 699556 685342 668579 651493
49649 651493 635620 621442 608868 598018 589282 582628 577405 573182 570360 569481 570260 571849 573727 575760
49635 575760 577587 578711 579146 579246 578868 577439 574946 572015 568751 564397 558615 552300 546492 541205 536031
49620 536031 531242 527280 523646 519502 515290 512576 512028 512474 512421 511791 511579 512280 513279 513690 513435 513400 514587
49603 514587 517036 519643 521222 521611 521550 521694 522156 522831 523523 523830 523527 523103 523314 524079 524534 524365 524332 525065
49585 525065 526021 526250 525646 524825 524145 523547 523122 523129 523508 523881 524062 524163 524343 524823 526029 528278 531412 535150
49567 535150 539668 545397 552321 559944 567856 575864 583654 590874 597584 603995 609640 613404 614650 613820
49553 613820 611682 608506 604406 599994 596029 592586 589197 585897 583584 583066 584060 585469 586512 587273 588092
49538 588092 588824 589020 588675 588360 588566 589356 590906 593936 599053 605906 613615 622097 632409 645669 662088
49523 662088 681135 701920 723019 742498 758815 771526 780660 785835 786735 784375 781016 778547 777496
49510 777496 777801 779848 784179 790555 797896 804926 810482 813440 813004 809127 802255 792680 780654 767124
49496 767124 753666 741367 730161 719560 709616 700787 693216 686640 680842 675758 671300 667523 664867
49483 664867 663759 663944 664577 665026 665248 665476 665908 666763 668157 669876 671600 673420 675654 678076 679850 680494
49467 680494 680523 680897 682118 684074 686372 688569 690448 692375 695056 698653 702399 705373 707254 708039 707573
49452 707573 705901 703708 701670 699521 696466 692497 688744 686386 685679 686071 686797 687236 687179 687045 687590 689208
49436 689208 691617 694244 696717 699042 701548 704736 708873 713727 718866 724266 730417 737917 747131 758099
49422 758099 770428 783322 795971 807765 817724 823965 824495 818846 808632 796432 784497 774417
49410 774417 767148 762739 760382 759306 759651 762277 767801 775976 785811 796255 806993 818708 832216
49397 832216 847176 862027 875481 887701 899600 911332 922117 931480 939936 948200 956071 962476
49385 962476 966425 967659 966470 963218 958151 951451 943236 933592 922775 911427 900414 890398 881766
49372 881766 874949 870432 868161 867218 866541 865919 865910 866853 868362 869791 870792 871267 871196 870672 869841 868567 866414
49355 866414 863070 858601 853194 847013 840550 834750 830458 827819 826479 826187 826937 828615 830800 832933 834522
49340 834522 835147 834397 831916 827634 822042 816087 810548 805516 800723 796368 793236 791935 792398 794397 798250
49325 798250 804741 814456 827452 843393 861762 881868 902640 922309 938458 948854 952566 950197
49313 950197 943033 932277 919072 904620 889703 874331 858315 842119 826803 813190 801445 791461
49301 791461 783345 777387 773648 771676 770688 770207 770473 772021 774818 778111 781144 783627 785383 786080 785742
49286 785742 785093 784866 784904 784422 782937 780529 777374 773647 769922 767084 765650 765513 766474 768671 772273 776969
49270 776969 782061 787017 791897 797181 803146 809340 814793 818870 821742 823948 825803 827594 830032 834019
49256 834019 840013 848166 859100 873874 892854 914983 938495 962017 984453 1003992 1017961 1024198
49244 1024198 1022478 1014310 1001411 984745 965131 944147 923805 905355 888901 874227 861453 850782
49232 850782 842186 835772 832009 831133 832612 835554 839324 843434 847366 851150 855810 862423 870748 879378
49218 879378 887214 894204 900770 907241 913938 921058 928179 934497 939888 945282 951635 958941 966587 974326
49204 974326 982542 991819 1002546 1014743 1028070 1042176 1057074 1072785 1088515 1102805 1114894 1125559
49192 1125559 1136080 1146704 1156611 1165162 1172584 1179432 1185907 1191876 1197280 1202366 1207641 1213612 1220490
49179 1220490 1228289 1237384 1248783 1263484 1281647 1302795 1326892 1354902 1388169 1427427 1472234 1520583
49167 1520583 1568454 1610120 1639989 1655111 1656309 1647131 1631944 1614788 1599035 1586973 1579304 1575365
49155 1575365 1574124 1574863 1577031 1579992 1583316 1587021 1591215 1595745 1600531 1605975 1612574 1620328 1628997 1638729
49141 1638729 1649801 1661760 1673523 1684624 1695842 1708183 1721633 1735280 1748520 1761695 1775454
49130 1775454 1789666 1803227 1815114 1825613 1836166 1847755 1859772 1870956 1881109 1891287 1902443
49119 1902443 1914660 1927782 1941964 1957302 1973667 1991418 2011824 2036371 2066129 2102323 2147076
49108 2147076 2203108 2272961 2358634 2460656 2575791 2695681 2809868 2912473 3006695 3101489
49098 3101489 3201546 3298682 3373210 3405867 3390976 3339493 3269755 3194918 3117503 3033028 2936912
49087 2936912 2829019 2714374 2601104 2496980 2406576 2330881 2268964 2219461 2180728 2150606
49077 2150606 2126855 2107807 2092466 2080127 2070077 2061563 2054024 2047287 2041364 2035941 2030339 2024242 2018103
49064 2018103 2012503 2007442 2002742 1998755 1995871 1993539 1990681 1987126 1983777 1981172 1978795 1976271 1974396 1974206
49050 1974206 1975490 1976975 1977814 1978316 1979356 1981646 1985584 1991296 1998472 2006183 2012933 2017083 2017631 2014842 2009957
49035 2009957 2004225 1998390 1993177 1989683 1988902 1991021 1995515 2001711 2008992 2016716 2024401 2031931 2039243 2045936
49021 2045936 2051548 2056223 2060792 2066120 2072485 2079518 2086597 2093466 2100711 2109449 2120210 2132231 2144147
49008 2144147 2155320 2166207 2177526 2189505 2201949 2214585 2227095 2239021 2249918 2259584 2268105 2275717
48996 2275717 2282535 2288288 2292440 2294723 2295415 2294886 2293048 2289585 2284641 2278833 2272608 2265978 2258933 2251610
48982 2251610 2243903 2235429 2226256 2217349 2209835 2203986 2199224 2194994 2191215 2187928 2184935 2181900 2178586 2174829
48968 2174829 2170462 2165416 2159893 2154324 2149144 2144618 2140821 2137796 2135696 2134773 2135178 2136754 2139070 2141684
48954 2141684 2144461 2147787 2152471 2159376 2169008 2181362 2196055 2212631 2230872 2250967 2273268 2297669
48942 2297669 2323344 2349379 2375632 2402700 2431067 2460680 2491508 2524021 2558755 2595703 2634503
48931 2634503 2675013 2717321 2761342 2806868 2853931 2902611 2952450 3002542 3052399 3102417 3153324
48920 3153324 3205476 3258825 3313191 3368176 3423042 3477065 3529972 3581828 3632537 3681708 3729023
48909 3729023 3774582 3818836 3862225 3904819 3946236 3985921 4023562 4059237 4093253 4126003 4157954
48898 4157954 4189417 4220165 4249442 4276462 4300689 4321529 4338141 4349990 4357470 4361566 4362866 4361186
48886 4361186 4356143 4347791 4336613 4323074 4307301 4289050 4268015 4244235 4218138 4189952 4159226 4125243
48874 4125243 4087831 4047419 4004260 3958012 3908213 3854900 3798619 3740245 3680930 3621881 3563853
48863 3563853 3507080 3451918 3399216 3349659 3303020 3258565 3216175 3176607 3140607 3108151 3078664
48852 3078664 3051659 3027010 3004904 2985729 2969751 2956670 2945646 2936004 2927856 2921888 2918659 2918354
48840 2918354 2921047 2926771 2935191 2945564 2957374 2970862 2986640 3004753 3024363 3044356 3064084 3083494
48828 3083494 3102857 3122526 3142640 3162838 3182464 3201402 3220513 3240868 3262574 3284731 3306516
48817 3306516 3327924 3349399 3371228 3393533 3416436 3439848 3463289 3486227 3508530 3530492 3552596
48806 3552596 3575394 3599295 3624210 3649623 3675295 3701621 3729059 3757451 3786325 3815585 3845376
48795 3845376 3875396 3904875 3933256 3960406 3986080 4009643 4030550 4048866 4065221 4080393 4094821
48784 4094821 4108220 4119735 4128784 4135535 4140043 4141150 4137077 4127120 4111929 4091976 4066794 4036256
48772 4036256 4001615 3964349 3924606 3881794 3836246 3789160 3741059 3691374 3639701 3586543 3532558
48761 3532558 3477904 3422711 3367565 3313105 3259667 3207655 3157737 3110280 3064982 3021521 2980263
48750 2980263 2941982 2907076 2875280 2845807 2817652 2790204 2763924 2739998 2719025 2700494 2683863
48739 2683863 2669500 2657916 2648602 2640463 2633141 2627072 2622437 2618888 2616292 2614886 2614553 2614703 2615025 2615670
48725 2615670 2616498 2616945 2616968 2617423 2619025 2621463 2623936 2625992 2627357 2627495 2626115 2623835 2621778 2620585 2620200 2620350
48709 2620350 2620838 2621615 2623002 2625547 2629202 2632975 2635946 2638365 2641101 2644234 2646985 2648966 2650738 2653008
48695 2653008 2655959 2659591 2664120 2669753 2676508 2684513 2694014 2704797 2715937 2726366 2735505 2743330 2750238
48682 2750238 2757061 2764735 2773636 2783401 2793541 2803943 2814622 2825282 2835285 2843776 2849755 2852500 2852226
48669 2852226 2850037 2846976 2843295 2838686 2832765 2825097 2815195 2802845 2788142 2770971 2750836 2727501 2701377
48656 2701377 2672892 2641893 2608135 2572052 2534532 2496282 2457941 2420611 2385568 2353491 2324454
$$ [...]
##END NTUPLES=NMR SPECTRUM
##END=
