
##TITLE=AC1351_CHIRS12169_7154778_ph0fgzLUjz
##JCAMPDX= 6.0         $$ Bruker NMR JCAMP-DX V2.0
##DATA TYPE= NMR SPECTRUM
##DATA CLASS= NTUPLES
##ORIGIN= BRUKER
##OWNER= Administrator
$$ 1.72 TOPSPIN		Version 2.1
$$ 2013-01-29 23:54:54.468 -0500  Administrator@X
$$ Compression mode = diff/dup
##.OBSERVE FREQUENCY= 400.02188249412
##.OBSERVE NUCLEUS= ^1H
##.ACQUISITION MODE= SIMULTANEOUS (DQD)
##.ACQUISITION SCHEME= undefined
##.AVERAGES= 8
##.DIGITISER RES= 22
##SPECTROMETER/DATA SYSTEM= spect
##.PULSE SEQUENCE= zg30
##.SOLVENT NAME= COFFEE_meoh
##.SHIFT REFERENCE= INTERNAL, COFFEE_meoh, 1, 14.98509
##AUDIT TRAIL= $$ (NUMBER, WHEN, WHO, WHERE, PROCESS, VERSION, WHAT)
$$ ##TITLE= Audit trail, TOPSPIN		Version 2.1
$$ ##JCAMPDX= 5.01
$$ ##ORIGIN= Bruker BioSpin GmbH
$$ ##OWNER= Administrator
$$ $$ E:\/data/COFFEE/nmr/AC1351_CHIRS12169_7154778_ph0fgzLUjz/20/pdata/1/auditp.txt
$$ ##AUDIT TRAIL=  $$ (NUMBER, WHEN, WHO, WHERE, PROCESS, VERSION, WHAT)
(   1,<2013-01-29 23:54:46.187 -0500>,<Administrator>,<X>,<go>,<TOPSPIN 2.1>,
      <created by zg
	started at 2013-01-29 23:53:39.327 -0500,
	POWCHK enabled, PULCHK disabled,
       configuration hash MD5:
       86 BA 57 50 F2 9D 5C 9B 26 00 A9 28 5F 66 2E 89
       data hash MD5: 64K
       BF AD 39 1D A6 4C 6A B4 F2 C7 BE 98 72 16 2D 9A>)
(   2,<2013-01-29 23:54:49.280 -0500>,<Administrator>,<X>,<proc1d>,<TOPSPIN 2.1>,
      <Start of raw data processing
       efp LB = 0 FT_mod = 6 PKNL = 1 PHC0 = 0 PHC1 = 0 SI = 32K 
       data hash MD5: 32K
       E7 21 91 E4 F9 9A 8F CF 50 5E A8 39 21 04 4A 78>)
(   3,<2013-01-29 23:54:49.749 -0500>,<Administrator>,<X>,<proc1d>,<TOPSPIN 2.1>,
      <pk PHC0 = 98.89893 PHC1 = 0 
       data hash MD5: 32K
       25 58 43 26 CD E5 C9 31 CE 3D 8A F6 E7 56 4C 62>)
(   4,<2013-01-29 23:54:49.984 -0500>,<Administrator>,<X>,<proc1d>,<TOPSPIN 2.1>,
      <abs ABSG = 1 
       data hash MD5: 32K
       7F 1D E7 E1 BF 80 B0 FB 0B 8D ED 45 44 C5 FE 18>)
(   5,<2013-01-29 23:54:50.140 -0500>,<Administrator>,<X>,<proc1d>,<TOPSPIN 2.1>,
      <abs ABSG = 2 
       data hash MD5: 32K
       D6 FA CB F6 87 2A 2E ED 36 EF C2 C8 CE D2 47 B9>)
(   6,<2013-01-29 23:54:50.280 -0500>,<Administrator>,<X>,<proc1d>,<TOPSPIN 2.1>,
      <abs ABSG = 3 
       data hash MD5: 32K
       B2 38 1D 21 33 76 5B 3F DE 05 21 CF 9D DD 64 A0>)
(   7,<2013-01-29 23:54:50.437 -0500>,<Administrator>,<X>,<proc1d>,<TOPSPIN 2.1>,
      <abs ABSG = 4 
       data hash MD5: 32K
       68 08 2B E9 1B B5 AF 34 64 11 78 97 67 36 DF 57>)
(   8,<2013-01-29 23:54:50.577 -0500>,<Administrator>,<X>,<proc1d>,<TOPSPIN 2.1>,
      <abs ABSG = 5 
       data hash MD5: 32K
       CD 3D 4F 9A F4 0B 54 78 6D C4 17 14 29 C4 C0 9C>)
$$ ##END=
$$ 
$$ $$ hash MD5
$$ $$ A9 3F BB BC E1 36 3A 23 4F 24 49 B6 4D CB 89 D3
##$RELAX= 
##$RELAX= 
##$RELAX= 
##$RELAX= 
##$RELAX= 
##$RELAX= 
##$RELAX= 
$$ Bruker specific parameters
$$ --------------------------
##$DU= <E:\>
##$EXPNO= 20
##$NAME= <AC1351_CHIRS12169_7154778_ph0fgzLUjz>
$$ [...]
150 150 150 150 150 150 150 150
##$TP07= 0
##$TPNAME0= <>
##$TPNAME1= <>
##$TPNAME2= <>
##$TPNAME3= <>
##$TPNAME4= <>
##$TPNAME5= <>
##$TPNAME6= <>
##$TPNAME7= <>
##$TPOAL= (0..7)
0.5 0.5 0.5 0.5 0.5 0.5 0.5 0.5
##$TPOFFS= (0..7)
0 0 0 0 0 0 0 0
##$TUNHIN= 0
##$TUNHOUT= 0
##$TUNXOUT= 0
##$USERA1= <user>
##$USERA2= <user>
##$USERA3= <user>
##$USERA4= <user>
##$USERA5= <user>
##$V9= 5
##$VALIST= <valist>
##$VCLIST= <CCCCCCCCCCCCCCC>
##$VD= 0
##$VDLIST= <DDDDDDDDDDDDDDD>
##$VPLIST= <PPPPPPPPPPPPPPP>
##$VTLIST= <TTTTTTTTTTTTTTT>
##$WBST= 1024
##$WBSW= 4
##$XGAIN= (0..3)
0 0 0 0
##$XL= 0
##$YL= 0
##$YMAX_a= 618094
##$YMIN_a= -527992
##$ZGOPTNS= <>
##$ZL1= 120
##$ZL2= 120
##$ZL3= 120
##$ZL4= 120
##$ABSF1= 14.98509
##$ABSF2= -5.573092
##$ABSG= 5
##$ABSL= 3
##$ALPHA= 0
##$AQORDER= 0
##$ASSFAC= 0
##$ASSFACI= 0
##$ASSFACX= 0
##$ASSWID= 0
##$AUNMP= <proc_prof1d_extract_pilot.lims>
##$AXLEFT= 0
##$AXNAME= <>
##$AXNUC= <1H>
##$AXRIGHT= 0
##$AXTYPE= 0
##$AXUNIT= <>
##$AZFE= 0.1
##$AZFW= 0.1
##$BCFW= 0
##$BC_mod= 0
##$BYTORDP= 0
##$COROFFS= 0
##$CY= 15
##$DATMOD= 1
##$DC= 0
##$DFILT= <>
##$DTYPP= 0
##$F1P= 0
##$F2P= 0
##$FCOR= 0.5
##$FTSIZE= 32768
##$FT_mod= 6
##$GAMMA= 0
##$GB= 0
##$INTBC= 1
##$INTSCL= 1
##$ISEN= 128
##$LB= 0
##$LEV0= 0
##$LPBIN= 0
##$MAXI= 10000
##$MC2= 0
##$MEAN= 0
##$ME_mod= 0
##$MI= 0
##$NCOEF= 0
##$NC_proc= -8
##$NLEV= 6
##$NOISF1= 0
##$NOISF2= 0
##$NSP= 0
##$NTH_PI= 0
##$NZP= 0
##$OFFSET= 14.98509
##$PC= 1
##$PHC0= 98.89893
##$PHC1= 0
##$PH_mod= 1
##$PKNL= yes
##$PPARMOD= 0
##$PPDIAG= 0
##$PPIPTYP= 0
##$PPMPNUM= 2147483647
##$PPRESOL= 1
##$PSCAL= 4
##$PSIGN= 0
##$PYNMP= <proc.py>
##$REVERSE= no
##$SF= 400.02
##$SI= 32768
##$SIGF1= 0
##$SIGF2= 0
##$SINO= 400
##$SIOLD= 32768
##$SPECTYP= <>
##$SREGLST= <1H.CDCl3>
##$SSB= 0
##$STSI= 32768
##$STSR= 0
##$SW_p= 8223.68421052631
##$SYMM= 0
##$S_DEV= 0
##$TDeff= 65536
##$TDoff= 0
##$TI= <>
##$TILT= no
##$TM1= 0
##$TM2= 0
##$TOPLEV= 0
##$USERP1= <user>
##$USERP2= <user>
##$USERP3= <user>
##$USERP4= <user>
##$USERP5= <user>
##$WDW= 1
##$XDIM= 32768
##$YMAX_p= 457013619
##$YMIN_p= -686176
##$CURPLOT= <Network HP LaserJet P1505>
##$CURPRIN= <$Network HP LaserJet P1505>
##$DFORMAT= <normdp>
##$LAYOUT= <+/1D_H.xwp>
##$LFORMAT= <normlp>
##$PFORMAT= <normpl>
##$SURQMSG= 1
$$ End of Bruker specific parameters
$$ ---------------------------------
##NTUPLES= NMR SPECTRUM
##VAR_NAME=  FREQUENCY,     SPECTRUM/REAL,   SPECTRUM/IMAG
##SYMBOL=    X,             R,               I
##VAR_TYPE=  INDEPENDENT,   DEPENDENT,       DEPENDENT
##VAR_FORM=  AFFN,          ASDF,            ASDF
##VAR_DIM=   32768,         32768,           32768
##UNITS=     HZ,            ARBITRARY UNITS, ARBITRARY UNITS
##FACTOR=    0.250966925370066, 1,           1
##FIRST=     8223.43324360094, -70018,       -306409
##LAST=      0,             -18178,          -87635
##MIN=       0,             -686176,         0
##MAX=       8223.43324360094, 457013619,    0
$$ Real data points
##PAGE= N=1
##DATA TABLE= (X++(R..R)), XYDATA
$$ [...]
23837 182566 -152530 235148 -145929 170693 72810 76081 -8190 5752 -352395 137110 43889
23825 -317863 48353 -110849 28858 -151130 72143 -241847 182648 -314616 -148239 -107197
23815 -107197 -93579 -127204 -13676 -192112 -67458 -98974 223419 199437 -86893 -625 11095
23803 51585 182808 -213034 -159543 82680 150424 181622 -96000 239267 -54279 -236072 107754
23791 -94197 78196 181071 -73907 34962 -422555 288969 124115 -52252 235774 -229721
23780 115121 -46933 -268839 -298093 -48413 -97833 -333355 19851 182760 -303362 147711
23769 -199620 -83641 -5675 118445 194138 -95398 -122133 269739 -226594 24306 169084 -3857
23757 110326 340951 248353 -128932 -105686 27312 98601 -68768 207491 -14207 152449 118279
23746 118279 48124 25966 -125180 -427379 -146131 -131038 -142983 -112262 -116979 205029 -42809
23734 -14610 -351117 -38126 179352 -143137 372756 -242810 127099 -132639 -96446 125123
23723 -31700 -343259 -77763 9125 59169 -38382 -102454 -185025 -71136 136749 44441 84010
23712 84010 13886 -18017 -119316 81480 122021 -108351 -138166 -188978 -80084 -102495 -443469
23701 -443469 4779 266975 122969 -189789 -210784 -179310 -155442 120591 -50483 98248 379363
23690 379363 -152099 -45356 85601 -3643 62993 176224 160410 -252216 -32502 -35037 -107318
23679 -107318 165661 -80296 280435 119526 -80804 -381304 -451638 130581 -186529 -54366
23668 -129903 24495 131592 -232589 -287356 -50831 -17986 -468617 332721 -313012 -31932
23657 -192800 -29890 -78149 158616 11376 -31576 19013 414467 129482 -48546 -32194 -127653
23646 -127653 -181915 133316 76903 -346668 -318554 77625 -359592 25950 -74224 69776 135684
23635 135684 136413 -422494 -74648 251212 96918 -72722 116017 -272795 -176539 295058 131415
23623 101461 143906 -56767 35533 -203023 -204212 -284867 29599 -331500 14725 154962 32347
23611 3674 70967 -249114 79552 106882 -32935 -155896 216821 -256678 134514 -330746 26377
23599 -243342 -73422 -14115 662682 -197677 91113 12196 -22862 63213 -4556 -181356 -122099
23588 -122099 123774 215942 -176091 123201 68613 9965 -148541 132210 216946 -212840
23577 180209 -186599 39036 -314898 116524 -122637 -223609 -79126 45000 17786 201184
23567 201184 -81624 -212038 78521 198273 23936 176561 -122404 -133341 92104 -5245 38018
23555 -60682 -146495 39673 -304209 175141 136012 -122378 22375 36757 -336628 -124586 137630
23543 135518 275970 100199 -78519 -84164 -68946 -124122 -42414 -152274 250739 224779 -34036
23531 -149353 -97297 -274261 -25393 -374563 163838 -39699 168683 228425 107604 26430
23520 -95920 13399 -300452 -423842 337937 123819 258050 27173 344449 114634 238739
23510 238739 -83054 -182959 253822 159394 81547 51671 -312384 -24450 392038 58754 244213
23499 244213 17735 140810 149702 192284 -40786 -277037 221186 -80314 243830 216033 198560
23488 198560 114505 86939 -70406 -340949 289180 92105 10893 73911 -6142 -155284 -107670
23477 -107670 -23094 161079 -128937 -345968 79670 -247076 40803 -307222 -85047 117522
23466 -37363 -160491 -259915 -127651 256331 -94394 -43237 -53029 132079 57582 436881 55446
23454 -103031 -181770 -99819 86507 223439 9870 -414826 -109871 102915 -29633 -32741 -51721
23443 -51721 276282 201766 -4039 -197546 92633 163335 253125 -82867 -377146 -239353 -58312
23431 106506 42275 -72606 73692 316834 252099 59721 -421888 35598 -38708 -89652 -24368
23419 140500 -234619 -146247 -191727 -181703 72656 -132920 51188 -234256 62667 34968 -441759
23407 9357 239018 -169623 -358872 -103788 -19700 -86999 -76208 -198449 -154924 101128 -262728
23395 81890 -83517 -3428 56994 192272 -267150 56605 192055 71074 286566 -208641 61963
23383 77170 298096 -410388 83535 -129267 16943 -79526 321286 -152590 -133805 151961
23372 -120485 114230 155985 -390319 14492 -54027 20662 -194677 -50463 300740 -286211
23361 -64072 -125901 -156005 -26881 27741 -134335 -82926 60655 -113763 11249 20816 88561
23350 88561 -190266 21848 -47998 -277069 -283545 232770 26691 -136345 -174012 -330881 172927
23338 -230559 112302 132088 -35980 -83394 -113497 49949 38137 -34700 -6698 -304564 -289623
23327 -289623 -18862 241572 -49090 246497 -116228 154176 -198667 -93585 49346 345680
23317 345680 -228818 354681 -119818 -385633 211319 -223326 -74015 151530 -44173 10989
23306 -88607 -46040 161192 63303 -268115 -63391 -36180 13066 -100578 -184546 -168168 164571
23294 -216172 -132667 -64551 254196 -3824 -44635 109956 45651 -457175 42323 -49807 -800
23282 -154434 -29964 -248945 90872 -16684 308376 -147501 -181877 -143600 220576 -219402
23271 -47713 -67185 144278 215430 12951 -94826 -358433 -143604 161454 -48165 -310815 -148296
23259 53426 -143172 67401 -29936 200390 -185113 -90660 387348 -169143 -297642 236179
23248 -355993 116108 -142693 -88974 112408 -73314 141509 195093 265409 180327 -109349
23237 -156006 -2882 -237418 163040 -48773 -34716 372075 -224505 -207303 12085 -9834 242386
23225 -146312 -87365 -169584 -131418 -83443 -30779 -195339 -26666 -50969 -213887 329605 -121289
23213 -209609 36042 21941 5374 -151106 60461 31840 -23280 60344 -225855 257101 -301067
23201 -187515 150393 -77187 1088 41338 201585 287916 168186 -63090 56398 -591881 -108172
23189 174146 97548 82757 -288279 -187687 -155813 -129248 155265 110295 -30284 -367852 -33980
23177 22477 -31822 17508 183735 326690 -173184 96426 -184476 128309 -84790 -1886 -37410
23166 -37410 11234 -49189 -148340 137243 52730 133629 -143056 180585 -184431 21444 -93004
23154 81861 -45665 -67111 -78195 -220242 28033 60763 -278360 151801 131795 495507 4219
23142 62985 -156124 174968 18119 -258901 -123263 -110840 198971 -269655 49419 148582
23132 148582 35766 127559 303823 -17473 238158 36330 -160948 332340 -159261 6933 83054
23121 83054 185266 4549 15770 -295018 310292 -144902 238344 -110677 142952 465114
23111 465114 -179567 -87151 -102292 49 -90765 -121140 3080 -185065 79896 207462 330435
23100 330435 -98499 67216 -69930 265421 210899 15392 -237221 -107329 -197039 234409 -231578
23088 -328081 39586 -47876 -185387 20057 -118001 66324 29564 -167167 68637 -287903 -145305
23077 -145305 -31397 -165059 -89467 -55382 -137293 -79496 -39018 245994 268775 -391991 55457
23065 -209615 -96410 221275 36283 111079 -98506 176178 102729 244641 -35143 -432144 66044
23053 -27086 -177815 15916 59242 -424034 -72699 -50446 -328764 41583 60482 233687 -4194
23041 -199759 -90171 -151435 183189 -222906 -74760 -280955 -102836 -200216 165458 97108
23031 97108 88724 62779 189035 -8468 -40351 63115 -115038 -262214 -354545 -81367 -127988
23020 -127988 168076 122291 157129 166955 190104 -21865 -44442 95666 -252171 -32764 -52625
23009 -52625 63681 60169 -303211 -49573 71514 -203147 127054 -99693 212472 -340378 83993
22997 -249117 227128 -283965 -242566 119876 -135768 165496 -122438 250593 26629 -153721
22986 112569 -102909 460820 -96026 67203 154243 -332474 252849 -119788 -309747 -27328
22975 460054 -318667 168108 -34438 -540108 97772 -36223 -84314 -171780 108653 -106906
22964 -13887 -192743 -15495 -135654 -230406 -53389 -434280 170905 -118471 -294457 -76737
22953 257728 35523 -32357 109351 10579 -30356 30202 186159 -262226 -145803 -177020 65055
22941 -50981 -399462 -262809 -129322 -247298 -171062 259150 -61627 -47871 153660 -185665
22930 88531 -104453 -322414 -67193 -38566 70413 79011 -75082 72005 -227730 184382 -60396
22918 -21922 187287 169697 -190909 -90795 -234441 16760 -201245 -224695 311774 -63253 174212
22906 -26111 -141792 -179819 -294964 154239 -40673 -55911 -253410 -11844 -257295 56382 -61905
22894 144907 174898 82057 -400 -166610 287635 -91021 60834 26158 -381493 -249551 116818
22882 -15770 190606 61887 5626 150883 -236786 114414 41278 -57139 -212801 61267 59929
22871 59929 197283 83996 19420 -111237 -107059 205706 -120695 -274076 114301 94353 40594
22859 161096 61549 -186134 253828 -294152 -197548 -87573 -15028 77189 -121230 -62106 9829
22847 -120542 -147922 151136 -35683 118738 -124899 -145357 223002 -473090 141631 87251
22837 87251 -208696 89437 -233934 -88738 33324 -6524 85907 388590 -47995 28680 -287756
22825 -146439 202538 128042 15182 -41533 162724 -221457 2210 111220 142744 -49616 105589
22813 -86965 322421 122077 65535 -177112 -87517 -245795 -66843 294812 86439 43652 -8264
22801 -201158 176323 -144835 269282 -239797 107285 216482 -116307 35489 251572 43989
22790 -83695 -362536 -41403 173993 -100247 123676 -75646 -10502 -185587 332666 -73309
22779 97886 -166783 43717 -41180 -143069 33248 -137413 93168 -182796 182535 -193439
22768 -203957 -140533 -3354 -25907 -1692 -88293 -254812 -58133 -165942 -221119 -205616 105111
22756 -75326 -351275 -234955 -217932 -369197 130558 207334 -185830 91677 71922 51739 51769
22745 51769 -126572 165451 -127865 -78934 -33562 79256 76686 103355 -244189 -5984 -95707
22734 -95707 -74363 -82050 57512 175136 -42306 224596 -59608 366127 -241025 -167595 -83105
22722 -1628 -155557 -273290 41657 119547 -17054 -151962 103967 -56418 16544 -104811 -91465
22711 -91465 24789 -274888 -70533 152677 180329 224349 -216842 25549 6523 -269863 26487
22699 -74750 -36925 26765 39590 -151641 -180696 115619 -290273 -440951 -21394 65116 -375073
22687 -207797 179430 107275 -148994 -11577 -99324 -5767 13812 32962 53409 307269 -84650
22675 52110 81342 -4799 -150449 108005 -151348 360068 -8850 -13142 442511 -17056 -323898
22664 -323898 51447 -16811 185567 162125 -181623 645 -89247 149805 200920 -105568 85497
22652 145008 -81199 43831 -126736 -93937 229403 354397 -7027 75972 -226180 -38952 61515
22640 -118328 -50670 253505 324576 -102623 -224290 -299793 -232058 -96610 75876 69712 -328213
22628 -88089 70477 112006 25395 -631120 108679 -107008 -40818 -82062 -164737 5968 54090
22617 54090 -201189 -122798 -94295 -161664 75141 97810 -105616 98709 -219580 -283783 145556
22605 96548 204132 87822 148708 66104 -161659 -235991 35137 65217 -112520 67340 20009
22593 66659 189749 168835 -152858 169402 14112 -395924 120741 -146179 -89841 163964
22582 118919 -144703 -54295 107758 169709 -12513 -99861 61814 285315 139919 -48579 -17908
22570 222986 -574399 214223 205636 -67458 -321901 371888 -157424 -58081 -71773 -112929 104677
22558 73991 -207387 -153833 -133287 -151710 -110294 102998 -345675 -170555 -1153 18570 362498
22547 362498 -74805 106061 -97705 15455 -222376 78677 -154128 -338047 -106875 317715
22536 -56327 -23758 -39994 -397432 -304192 126409 -82487 125704 -222402 120011 -196108
22525 185097 93985 44152 -210351 -120479 -109029 -3590 -144566 -304786 59420 423554 5328
22513 296807 100893 -37427 -128618 194210 -99240 -289139 232244 160619 -306243 -334385
22503 -334385 -8067 -252369 -686176 -43978 14745 23122 -138802 232654 -69917 113693 -6945
22491 205835 -101578 58295 14840 -221357 -171520 154370 -73528 -103269 1842 215535 63799
22479 -86543 -118974 71347 -308365 -6904 -184604 -126239 -173 -194838 -67441 -8998 31328 -299989
22466 -273622 -290548 -321389 251453 -184037 -120399 112604 -161983 -136760 -70009 170532
22455 162359 -176823 81231 21555 190213 -147072 90685 146700 36082 401420 -29446 -40572
22444 -40572 177625 -178703 42582 -277747 38877 32686 -94773 -120590 -154438 -166425 -92713
22433 -92713 72283 212035 -269130 -166142 -253929 -279082 69862 -1426 24123 96499 87658
22422 87658 -65391 14270 111769 -94403 -209637 45580 52469 -173883 -291519 58373 -318308
22410 -47748 232415 -163340 140239 -17710 -81817 -97840 145289 18787 -68454 -52132 158280
22398 -245129 -190608 -249212 -74473 -107088 116019 -372858 -57126 40791 -94522 -60874 -118649
22387 -118649 54553 76593 140712 157335 -100595 106329 -191403 -157231 96537 -124134 -88396
22376 -88396 -40175 92458 98920 115664 -267620 -103649 210448 -107864 -93656 -320585 -270391
22365 -270391 -48741 -367183 -64517 -192136 -77514 -12275 267148 -18423 2044 -217592 15615
22353 60151 45685 1061 395176 -103308 -274953 226751 254177 -45923 122906 78400 112569
22342 112569 -96566 -38346 16053 -19258 294966 266696 -137349 623 58895 -114948 29124
22330 32027 363427 -159232 -54858 -100042 -7772 -192174 -116879 -424920 255509 -127185 -73077
22319 -73077 -5106 180074 -12564 313500 -51880 -232170 -335538 -260961 52395 59338 -66328
22307 -114888 183752 -160598 -133355 -18312 43405 -99687 -107878 107356 -131565 41375 170853
22296 170853 -296423 94809 -144721 184226 316513 -60160 -1589 -53652 82001 263385 231922
22285 231922 -75174 -89292 -129340 6118 -48892 -116653 -164037 -97892 111470 243474 137567
22274 137567 38130 -59431 -5180 191956 67765 173147 174695 -81935 470871 -31465 13373
22262 -323728 -215985 -166910 -83736 16488 237615 -185063 -287186 -392318 -173400 93315
22251 91916 11267 4827 16678 -14346 40174 429338 276887 -122101 12825 -167279 -189414
22240 -189414 -140284 70023 -133595 -110943 -156261 -278889 181771 -244798 -22224 -16566 109008
22228 130185 66682 334298 136000 -515059 71844 -53738 125563 51840 50710 -430044 -124783
22216 -63637 73230 -343058 -321957 -345039 -271108 -33429 139152 -256834 11914 -143373 27108
22204 169799 -303995 27823 -180565 -139463 -27230 -106344 -126754 -3977 -55253 1022 -230992
22192 -9805 -160228 -47018 -5184 -108331 42121 -135911 -179938 122204 32538 -68241 10256
22180 80801 -147938 106245 -22565 -130913 -100665 -76282 -131937 -337183 315619 -359995
22169 -8169 -146631 -13190 123703 -89661 -99158 156977 -138682 -134619 -197335 -82767 68827
22157 -23488 -127220 -56999 157290 51542 139627 -327029 -24667 -191403 203052 -319971
22146 -188827 27571 -123060 -24339 104494 325632 -185965 -57047 -203393 361142 -17996
22135 -228551 39347 336773 58752 -270710 226626 -21326 -120851 719 145213 -383824 115535
22123 -20480 -257515 -191670 -132877 -290815 38488 340142 -136799 208075 -142032 -87961
22113 -87961 -180945 -125477 -34455 -124638 -58780 -127391 -102632 -3552 200508 112592 151325 -248612
22100 170329 -142926 56578 32998 -33351 -72397 357789 85772 -202519 31337 -28469 -101892
22089 -101892 368926 227696 -18665 -195916 -37085 -281277 -63073 -258526 -109065 64004
22078 268673 350543 -269979 10676 -91905 101830 50326 160912 -223620 -259962 -54572 148733
22066 41688 20678 6625 254277 233185 142128 -117788 -273192 11618 93773 334147 220990
22055 220990 70488 -145594 -37944 254487 -126574 -23380 -217438 203679 -60423 -304099
22045 -304099 32152 49346 -285635 -102512 -182977 -50971 -75823 -222122 -118999 90375 -85628
22033 -51624 23795 226032 164028 71037 -63463 -287237 13055 368778 361969 298160 51212
22021 -82864 -72432 -101187 -186758 370676 133955 20468 -21353 -49773 -300030 -255906 -69049
22009 -49444 -26133 -343083 97913 124647 -176684 206714 -250444 -315339 -254056 15720 56597
21998 56597 -280670 -157708 -114779 -32988 62944 -278114 -109739 -96221 137760 189069 -84784
21986 134130 -19961 -244826 270616 -123371 -226486 79882 95326 -83802 -318669 -89337
21975 314131 65064 -37260 -152545 -115641 -248215 86894 -273510 40879 -118209 204301
21964 -66674 -100764 165202 308170 79947 23041 18003 105360 -116739 -233630 -332185 21171
21952 106567 -17306 69601 182156 -63239 -235631 -40487 197566 -135430 148013 -221965
21941 37419 -263385 347518 -173142 -415037 -110894 -84241 122464 -245711 144969 -179615
21930 61589 135400 -90856 -92148 -168756 -209502 -82912 -76911 163510 -22617 144522 -39574 -68526
21918 -68526 53822 -148788 14513 -35965 -221682 60410 -145942 73547 -59657 -240800 50024
21906 78836 -305345 124448 -274603 -252017 -130762 -137013 -132582 33678 156555 -32140 -193564
21895 -193564 54004 -45297 -136298 -108984 -256018 66713 -186925 18093 -109560 -319477 -92064
21883 -122458 -25793 -239610 -206748 501477 -170924 -115181 -66276 -272562 -96702 -140524 117941
21871 -210411 -187961 -28473 51354 100931 48856 -278318 271672 13865 187318 -138890 25272
21859 -75256 -112376 101038 -24891 282007 -141941 264630 -218784 44377 73222 27203 -17664
21847 -385661 233277 325818 2408 227081 -369124 -44501 307318 -224991 -44799 -150681
21837 -150681 210364 -74592 68022 -260873 58176 289246 52439 262341 195984 50447 -188746
21825 59049 -13093 -142336 -16021 -99821 -28203 66453 25458 83667 -101407 138224 -21970
21813 -328832 -78639 -216271 147780 108904 82418 -2542 -13610 -66297 -47248 90019 -93179
21801 188580 -21692 218398 433969 -166047 -17858 61536 82183 92947 11417 -296301 285459
21789 -29028 -1408 156437 -206345 112202 284335 55193 -405736 -113491 68065 -177342
21778 418321 -94080 48371 -309778 21730 -8860 58490 -282036 -225180 343674 -333042 -116044
21766 -88735 -343275 123760 -59191 -23998 -549613 59312 472137 249370 -36373 -57187 180519
21754 82533 -12010 -44288 -136018 -232141 41851 -44176 106943 32820 -79767 206695 -23703
21742 224148 130330 110584 -99672 107229 -304850 -38348 216030 40593 -224136 -72056 -116330
21731 -116330 -17823 -4796 208463 -187703 -81844 43735 -130379 -224700 -93375 156565 -76702
21719 63831 286951 -56469 -22193 -21754 159320 47502 15178 -270464 -60516 -306814 29520
21707 341995 -454015 -25872 -212415 -103147 -2814 21669 -402861 42819 302644 -206286
21696 13757 71905 -82454 -167549 267109 -73586 -189447 36209 30386 -450220 17332 -286043
21684 105005 -153959 -287009 -193135 -48173 73813 -76133 3241 -184813 101897 184645 -55830
21672 180000 -377530 -90899 -59835 78577 72458 49175 -203099 -319386 -192522 278345 58829
21660 115229 -239664 -58679 -101533 400173 -140454 251967 -91516 79370 -318571 -190597
21650 -190597 -67718 170586 -21913 97800 11812 120795 -406332 118333 -129111 16470
21639 -361185 53377 -99275 -157123 -36788 54885 -193576 2850 197741 226455 -544652 111775
21627 -139015 -125142 256938 -620744 79016 -121588 104770 -36394 -114951 -138642 -83889 -49027
21616 -49027 227413 18423 52532 195199 138557 -46706 -451353 -168676 80662 422398 68887
21604 -38311 -107285 83502 -75820 -2429 107635 -222507 -302993 117622 164423 -575653 -79255
21592 -46128 124830 207755 -261660 -30997 -59422 -167432 -32072 121614 -283824 -110000
21581 81713 63756 151654 -116306 -67997 -89909 -220018 -643928 -152128 16227 160387 -11214
21569 -249661 -230640 116498 -169995 320659 112563 -60262 75023 45377 -113478 -364234
21559 -364234 274120 47808 52285 -187338 43204 270756 89266 -97604 -129767 39885 -75829
21547 24957 64755 -208403 262183 2829 73449 188151 410705 418458 -325553 -241977 133643
21535 21297 370580 9082 76347 99644 66855 42266 16720 184669 -49931 -144987 -357463
21524 -357463 285218 46468 114263 21591 -50498 -33688 -197581 -6711 -164764 -213449 -40978
21512 144460 -100995 45086 -215828 115536 46180 -253315 310365 -24606 -101615 266590
21501 376025 278834 -8824 118964 43381 -137795 -227575 420034 34957 -176122 -239236 91444
21489 -46557 -96923 -221854 -43323 -33670 -198103 -209262 -123061 -3776 -63367 -33513 162321
21477 -46658 43037 143018 62615 -194819 -77734 156128 39637 -183621 91196 -83241 -140605
21466 -140605 -71160 3749 -168584 -30075 79143 -96165 -292037 -150692 99499 -201574 -1943
21454 -209832 -79556 -26931 31256 -315533 93441 39590 298076 -184017 -144124 68000 -193915
21442 292047 -10001 73688 357606 -91885 225564 289284 69333 407891 273057 -243708
21431 231097 138561 -178701 176062 -64775 -32995 -165901 -273569 -184093 54380 -85738 -380413
21420 -380413 -6594 -73888 -91180 9047 5252 2265 -341073 6665 213123 -418382 19264 -1107
21407 113495 -4638 176443 -119570 -134995 28125 106104 -112176 -102528 -61065 -66229 158003
21395 -190054 203815 -224950 -210765 27155 -110403 55745 -89045 75979 -180878 -220180 -130149
21384 -130149 -201116 71059 -117777 171133 81918 -73059 30186 30994 -175010 -189919 -94492
21372 6408 100837 -14868 227502 -210815 39450 -153417 96334 41877 157006 66817 -18087
21360 -107317 11196 -72521 299016 32623 -144738 -206334 -272927 -81674 118230 -287466 -49740
21348 28666 -125172 87308 122514 -142951 144151 17369 -21669 86183 -83311 -161543 242966
21336 81914 -29719 10453 -494120 -3362 -135129 -96428 -56191 90791 -190946 337827 183213
21325 183213 30709 -113280 -338942 -289574 49891 -117192 212795 53888 -134721 67004
21314 -164281 -31802 -387661 38483 309913 -132646 -42749 137209 47497 -308485 -28208
21303 213273 -362862 28195 83757 310219 -201175 50038 -126398 -138338 -482085 -428505
21293 -428505 -16951 -177994 123447 -72426 -55193 -302212 -244991 -264329 39740 -126465 311435
21281 79208 -243769 129155 377404 78599 -205231 -139552 -4902 76412 146391 324857 2028
21269 358595 -214199 19180 -19271 93928 113877 -60159 59904 -130192 71017 -85704 -247547
21258 -247547 34291 -51511 -368021 -50392 32125 -744 -58223 -68627 -42148 309145 94970
21246 -109415 -3221 15533 211918 22171 52790 -34052 -94645 -191632 -42588 -124618 105936
21234 -190629 -125409 -18307 -39919 35153 266638 -339658 -103174 -74460 -45080 -165756 -176427
21223 -176427 -5725 -34384 70504 58647 -113612 294458 8898 -147834 152372 -12873 -175050
21212 -175050 -10072 232938 -116319 -56648 -25349 -143938 65830 199105 -171984 -61267
21201 -1113 -258639 -12126 300706 239246 -24106 -352740 -67514 -296564 92138 -220604 -100338
21189 136579 -38884 163142 -214842 -157625 57364 -49188 -186617 97049 52108 -108265 -119750
21178 -119750 169260 -98933 168936 -20817 -79735 -155673 -165435 -141996 -225114 -280423 -341162
21167 -341162 207080 -350213 -48409 154535 -200028 46512 -2879 105059 -86737 -14538 36832
21155 13868 -202708 -59084 42466 -482317 339858 -141683 -235280 351573 114463 333103
21145 333103 62793 -171166 54331 -94119 -66574 -146554 118249 -169133 -354493 -55767 133854
21133 -26750 48467 -66171 154238 -319992 -274248 -188804 -115161 -85371 51831 -41412 -257853
21122 -257853 -78155 -306642 -222125 135714 233287 101746 -119452 45056 -119740 -21661
21111 -51683 -206838 -167488 -27221 195229 -216564 -96237 -314263 442190 24516 -503569
21100 292879 3146 220782 -53193 48255 26470 -253608 -145851 -33266 174581 -172341 31393
21088 84463 -281776 -103386 76049 49434 -29913 -138353 -245598 -190358 18952 5820 -432640
21076 -47574 35412 -41000 13601 -42286 132381 -162460 -56068 -60130 117233 17951 32003
21065 32003 -14555 -104944 -68660 92476 -308583 -138937 -46767 15629 -68425 -26065 -275939
21054 -275939 -55097 -102103 -122562 -74175 234287 117314 -65065 -3158 62 -15861 60892 -143549
21041 -21435 -96082 28229 173538 43715 182875 -31907 -253995 -164980 -190103 185195 -126027
21029 -374575 -38655 -424203 105496 130637 -73874 -113530 -69405 -254910 -152543 272362
21018 -206918 -298486 98090 101812 -118665 338215 196087 377051 -93778 228000 -180592
21007 7358 138561 124308 -351135 147666 -322301 102418 -124341 81171 148855 61172 83042
20996 83042 1532 -167486 -232300 -107231 250332 -218224 -140741 -204150 -53844 -57721 -123435
20985 -123435 -332009 200216 138666 -248556 106052 7687 -70582 6939 37614 -141644 -102092
20974 -102092 95879 -229499 -258098 -414726 35394 322342 -341162 229224 -99959 207592
20963 -49498 332456 -199871 58916 27172 -137085 120169 -39128 -304261 -213635 -132667 -42370
20951 102215 -3202 210804 -173317 -12110 247957 -122370 -229006 -197868 -62697 -175226
20941 -175226 34010 -125193 70941 -496764 -293631 -37406 -51034 1527 -129620 -82930 -49329
20930 -49329 92640 -128574 108102 127987 -134811 -1980 13215 774 7206 -63029 -129720 30709
20917 -96111 144912 -278209 -357270 -444458 -5369 42364 27399 253172 -468426 161260 81524
20906 81524 109860 -316465 -248031 84504 -168802 188153 103818 -148708 382225 -60603 -245462
20895 -245462 -164335 -250451 38157 -54908 -135854 -240884 -75437 -54346 -114934 50951 77644
20884 77644 3601 -42040 211352 25749 1059 82374 -66267 225084 -316581 151189 -49266
20872 18372 -265190 -196832 -137418 -182560 122519 -223787 389447 38512 -42839 206819 17474
20860 177458 -67063 160249 19456 -103440 -261889 123526 64408 23545 -140997 -134171 2577
20848 -426755 342477 -194698 -304327 38567 31845 -82710 -102675 151276 -190747 -305508
20838 -305508 90575 93119 113908 -199525 833 178461 73830 41777 -10174 8468 -247674 -1272
20825 -216442 287260 -485201 -357877 25886 158423 -148116 152113 -217829 -82170 -115934
20815 -115934 236133 -73132 205051 323449 174198 -8415 -301033 -345470 102165 199077
20805 199077 -113681 42933 -148406 -147218 -121326 -101832 -9855 131991 -324198 44212 -105357
20793 118850 252953 -241910 288536 369727 -210801 -198488 -10804 -286720 102106 -17835
20782 191027 -73351 -146301 -101597 -44448 -383723 -309381 -164439 398060 -139300 -342777
20772 -342777 -37510 -190708 -64835 1441 168652 144664 -269075 28609 -163489 -60053 14217
20760 -18201 -25241 -352080 17007 25808 -317288 191486 -195243 28948 11547 -186739 105990
20748 -55739 365105 36355 -84692 -16351 121530 -324679 -174367 -173077 -51463 -119407 36214
20736 -189130 199168 -90268 119035 -187601 -258396 -168428 -162724 -101077 -171983 -61558 -98802
20725 -98802 -52517 -59912 122335 -118458 88935 -268139 -66346 -248701 55928 -67985 -36074
20714 -36074 -198471 -53420 -268520 13969 335424 -91480 -102468 -330791 -467212 184807
20703 -227777 -273824 -15512 -356200 -83106 55254 128565 169346 -55441 -293361 -118473 160370
20691 430126 -241660 -113866 -183354 -30257 60520 98562 -133819 52555 -41205 40759 -459827
20679 204597 -204094 -255769 -103576 -338575 -8838 160320 74237 -172088 -227092 -14275 -354525
20668 -354525 13939 84565 -196845 -273177 -18234 -122309 99379 72483 104645 -221827 -386055
20657 -386055 -307663 -409823 -150783 -157927 -7435 -43382 -76968 -446689 24300 26787 -126581
20645 148472 -59087 -24652 113360 35182 148907 71862 -45016 -257607 -69074 -123336 -161657
20634 -161657 -52663 344567 -250349 240181 65500 -108993 205623 -96851 -114683 67454
20623 -1390 51436 -426441 -173035 -217526 44341 -6781 -45535 -162608 -189574 37927 -374679
20611 26463 -177622 66062 -227773 139616 89785 -352727 -14742 251475 101047 -166756
20600 -216946 -19509 -34510 124090 130152 -118031 167586 -77046 -172205 -247564 81968 147470
20589 147470 69826 62058 178154 154213 -89925 85516 37985 104548 50259 91120 56848
20578 56848 338808 275732 22954 164585 -249565 -17497 188331 60667 108556 -21495 -185663
20567 -185663 119433 -36698 -191117 62603 -160291 -160175 -145011 -167962 128352 65416 -123837
20555 -109656 31027 -23702 -157661 -133519 -88011 61123 11700 -396156 150136 26182 338734
20544 338734 -472324 -268201 -139620 -153409 -248031 -87398 -201568 233317 -171990 -56382
20533 -39626 5805 -67312 -109188 -139785 -310600 -237559 -7170 -99647 157901 40593 -271284
20521 -231685 -114614 -42555 13013 -41366 -47080 -232559 -113905 -127296 -172308 154139 32660
20509 191594 -124959 -48930 19013 7041 90483 -83503 194675 28506 295095 -20752 -86369
20498 -86369 -12118 -33256 28547 -40376 53655 -279113 128181 -106818 79157 118259 -277143
20486 166270 -22931 -340468 -39585 -518611 -308878 8857 -3329 -374663 -52467 -357236 -144338
20474 253466 10474 100214 -201882 -33559 -222758 -430413 -130311 -126111 -189349 -69625 -238732
20463 -238732 -129495 -148737 146894 -62140 153381 -53245 270058 -382440 -77381 17384
20452 -3652 135894 -15681 91286 48841 67751 66251 -56597 -168419 -32517 -59296 -3015 -158420
20440 -158420 -87863 28028 -105488 -57974 105716 -14121 40164 -182493 -86045 -444967 -31872
20428 195810 98703 317523 67565 -16478 163670 -3969 169129 -177237 -144424 -191621 -42699
20416 -365594 47936 -195985 60312 164861 153225 -61651 -24545 39989 266034 -44699 -65012
20405 -65012 -77613 -4511 78408 -378522 -257813 -247920 -61278 -368164 212104 67251 -370531
20393 291999 -107412 231135 26396 -160678 -521039 -31135 -217970 108570 -190609 97626
20382 -58473 -60113 -250816 -135958 244110 115611 -37304 -106755 -247426 -49452 -365623 -198826
20371 -198826 -109302 -13978 -90648 29395 -72117 -334113 -175792 -246220 44844 234057 74042
20359 -485056 42831 -330801 -213348 -263577 117282 -98695 -325437 231736 -5970 21391 -83117
20347 -159494 -73697 188650 -184779 -56330 -213871 -205522 -2389 200789 -148571 96798 -102752
20335 101058 -274394 -297131 55408 -36118 134123 -71454 104209 -380970 -4202 -52680 2729
20323 -171229 -61709 234768 -442361 -44184 -253769 180628 -39558 -31399 244798 2068 -149260
20311 -254292 -166539 -174125 160069 271289 -29623 -101765 -192468 -350533 130047 -82195 -126573
20300 -126573 -291081 -223458 243868 -105079 -108668 -155335 83160 -624493 -390083 -87915 -18168
20288 -254633 197249 73353 -218748 104169 5240 -18349 274578 -25660 -77269 -69176 160794
20276 -40682 -283995 -119093 56124 -124793 -3023 -4097 19307 -11127 -252380 11314 -183249
20264 -280869 -177956 19303 -33655 -276967 151998 161771 -98391 117712 -146729 254113
20253 -148965 15870 205185 -1328 412848 -346921 -160596 60608 7507 302072 -371191 -489396
20242 -489396 -412727 -48217 -176013 121841 -16274 120073 -162285 -222700 -282328 -275968 -175015
20231 -175015 -184123 -252626 -39355 -205479 -16808 -44706 -58608 135996 -140177 -79408 -181266
20220 -181266 38350 -133623 -36900 138485 -29191 -187410 -73259 -255530 194840 118058
20210 118058 129541 -94946 106721 20742 -44889 -504828 152676 -29361 -153366 -304029
20200 -304029 17296 -144662 -7323 282292 -182458 -237064 -205938 -391194 -174356 -82766 -243682
20189 -243682 43938 -233059 -212453 -456954 -131590 -247765 -339886 -69158 18024 -97363 -263390
20178 -263390 27364 -125771 -129959 73504 -3417 67524 88303 77360 233255 -240767 110383
20166 -384839 -113112 118007 -281615 -66426 -133834 -185079 -414244 -21784 -46183 88961 -104643
20154 -20489 -10329 44834 149532 -69138 77517 -33747 -75665 119520 -23062 -144920 -261731
20143 -261731 67809 27081 103735 181994 -242275 -316532 -75754 65805 246588 219195 101772
20131 32193 -200328 -114475 -470045 69405 -100293 23998 -151082 120369 -40038 -22073 -1773
20119 55512 -249584 -60002 77543 -227755 -164738 179168 -332606 171738 -82449 56760 -385388
20107 -370949 -358049 -252051 6027 -233305 -80429 166475 67268 -317224 -134199 -369583
20097 -369583 -182419 65927 -279521 8132 -418358 146829 504116 -22517 -206308 -12118
20086 186062 -321015 -341683 -229198 147998 7324 -59587 4626 241787 -150112 -62345 -19856
20074 -162104 -164938 -158596 -160974 12963 -132434 -38497 37733 13791 -83896 28946 39442 51850
20062 51850 -82244 -2903 -393571 -237419 -76302 22877 118629 171582 95243 190796 73719
20050 6721 -180319 -153395 -57102 -55908 -6358 -94061 298531 141053 -62863 -87270 -92652 -71324
20038 -71324 -136352 131430 -30103 137089 -237144 63673 -123067 375685 278690 75017 -119058
20026 -177305 -105754 -265772 -242420 -131512 -198940 255824 107237 -219055 34308 -101259
20015 36770 74974 387071 -532540 -3503 -140350 188974 -146943 -137276 227023 70840 -38820
20003 -206879 -131857 -150788 104313 -114909 -188898 -161871 -122290 -94264 -306467 -315520 81115
19991 207816 59684 74949 -548125 70953 -49028 137653 140834 -115437 171102 -134761 51865
19979 -236858 -360754 -257209 188092 -43137 140364 2165 -207083 11136 -194711 61617
19968 -116437 -14433 -133962 -207324 -115472 -92338 203228 -93442 -175478 5637 128305 76597
19957 76597 78916 100050 -318167 -171521 173941 -26702 13845 227892 29691 3755 -64735
19945 -227393 117872 -145919 -330965 35578 -265836 -51542 -215038 -37438 -69872 -150526
19935 -150526 -197371 -326359 -176170 61471 -255124 215123 -431480 -290536 144809 32812
19924 53093 -25232 364207 -28554 -13251 67906 -18865 -58075 -203217 -125038 192481 -82704
19912 -257504 -234865 -150616 -18978 134281 126294 55255 -46967 -91513 -124708 -121220 -178200 13596
19899 -84674 -23610 -17281 113311 108686 -327944 183699 -1150 -36518 -116923 -287245 215718
19887 -63681 88159 -26807 -51073 -3087 -15292 -239227 334326 -147320 -287699 -203196 -125720
19876 -125720 -160533 -175109 112653 -93848 80796 -55118 -105849 -137068 61447 -58134 -117870
19865 -117870 -269621 -27807 -92398 -3622 193178 -140236 206084 -13894 -8155 -205014 -195971
19854 -195971 -217217 -156330 -136494 -276903 -279431 39505 105712 -81498 350483 -188749 -49154
19842 -463303 -47611 41147 -237398 -21269 -83307 -107631 -22874 155886 -222534 239479 127128
19831 127128 -113813 294402 -94148 115027 176382 -476085 -21993 -251091 -157205 -352051
19821 -352051 -97539 -263554 -35685 -110012 -7930 164449 -133795 -150290 469 74526 261820
19810 261820 -11548 1630 -17633 -45347 42323 285532 -49569 202148 6276 -374745 -335615
19799 -335615 -110358 60615 -289307 -97762 -175761 -89579 -232707 79689 -143822 -217922 -72666
19787 22677 -74993 71839 180805 213690 -81748 205205 -302223 22469 -94465 -348567 -64127
19775 70448 -7245 213652 -438401 -65969 -127271 132373 14316 -232668 -200045 66393 227105
19764 227105 55687 113503 -281374 16717 -54583 -49391 69294 -40967 -115444 -48704 -113280
19753 -113280 -85519 -63062 -30441 -48496 -21825 -190174 -208283 30360 -45985 -103914 -3142
19741 57131 -88300 -153689 -34929 -94010 -224372 -168125 162371 -166674 8299 -183929 -103092
19730 -103092 -69640 -277439 -73254 292350 -71293 -30815 387318 -59409 -87295 86084 -64819
19718 116926 -63543 -166107 -317123 317353 -117794 -11227 -115383 7038 -225275 -3078 -105608
19707 -105608 -273500 -177340 -276842 -410784 -116821 -47436 167550 102452 87625 -346374
19696 58263 -137754 -50445 -116478 87458 -61325 -142528 -118321 -262135 -150764 31396 114544
19685 114544 140276 82508 121645 164150 97759 -16492 60488 -59328 -277263 -132591 -210609
19674 -210609 199430 116246 -61457 -182764 -54053 -72403 -468243 -341366 -45860 -229212
19664 -229212 -105847 -117785 -18214 -207117 51512 -6605 -311079 -203260 179666 237522 -86993
19652 27428 -313108 -130888 -228255 21978 61872 -245950 -105152 -126651 27805 107185 188992
19641 188992 -74689 -416465 -113926 153504 -452898 8528 54084 181646 -240952 -10793
19630 100641 40049 -2196 -14084 235392 -334245 252982 272191 151889 -368569 -378208 242315
19618 62778 -90776 156863 112780 41513 -59732 -2395 92390 -113890 -108795 182678 -401480
19606 -121770 -72035 79493 38929 -321093 -121917 -191099 46554 -7865 58633 80927 60208
19595 60208 -155051 -416253 -130012 222650 -99062 225357 -218665 -378644 203520 102478
19585 102478 -165118 -208273 -114542 -148882 -69915 -70166 72703 -206060 315106 59938 -117672
19573 -278207 -54633 -141330 14165 -27036 -27561 87903 -287781 59000 11979 135668 -175871
19561 -318020 70019 31505 313949 -22728 -86170 -287335 -125587 -4822 -131744 144956 15491
19549 -126381 -200877 214702 4941 21235 123275 -108273 -320593 288308 28790 -179785
19538 19011 -18939 -65369 -363357 -123987 -102330 50200 49737 4588 8086 95250 -42226 10337
19525 -266803 -531228 -330919 -72333 42536 -24885 -109120 146730 214270 60370 -103643 -252328
19514 -252328 -93805 193049 -174408 14400 -53230 312477 44725 279069 176680 -190210
19503 4543 -118161 -406145 -187936 -38669 -238768 -236561 -12035 -113882 141381 80749 -91315
19491 225538 -126884 -145528 246982 -225404 -178563 2732 28887 -38989 -169501 -69479 -94509
19480 -94509 -50353 -243972 -165362 -41882 -92298 -231712 -77970 -11442 248482 -143081 -75118
19469 -75118 -317787 -4274 -188559 -126472 -174088 -172015 -23689 2611 -53196 285983 65081 -91713
19456 -183124 200704 149882 -174211 3781 208336 72010 36799 -135160 36917 -64459 -16521
19444 80836 -381984 -273200 46509 -72526 -91084 -167920 -208165 -204851 -338799 -474295 8655
19432 91564 -92415 -128913 -188209 -360945 -28440 -35409 11588 130482 154768 -177790 -147889
19421 -147889 466499 -200280 -32108 59338 18295 -111147 8392 -52721 45558 -136641 -101052
19410 -101052 -237125 -22186 -314526 46121 -151845 9914 -88160 59453 -37355 16843 123394
19399 123394 -227465 6582 -180235 193207 229849 -267181 -134161 -123477 -17082 31573 -173340
19387 118604 -192098 -239675 150393 -21338 -31497 -32270 -106194 -158319 -25248 38735 -176244
19375 -131735 -141308 10723 29113 -355663 20737 -41171 -198624 162094 -21020 -162642 -323375
19364 -323375 100177 -241285 -184759 36430 4800 155664 165461 -444555 22120 128384 6934
19352 311258 -113585 -228236 180570 -10395 35477 189349 84292 -130146 57516 -237826
19341 4730 213649 9207 124955 144467 139158 116187 -283209 -160381 61668 32969 105613
19330 105613 -64561 -207612 -306392 -69597 -53452 -278804 -270667 49480 -92517 -92200 45187 144422
19318 144422 -250848 -30492 215509 -25740 -17356 -236703 -127367 -195388 156318 -28794 -74832
19307 -74832 1015 -138134 -78791 -1198 -44669 -6533 -215054 143007 -146928 116176 -112161
19295 -254834 214371 -195378 15628 220289 296631 211979 -223977 -177202 302506 -258402
19284 78627 -93900 -68569 -33092 93153 -12068 -383730 -165096 -134801 -235451 -8212 43514
19272 -136923 -23873 -340903 -321424 -220860 -151669 -271404 -346353 121791 -51698 -232089
19262 -232089 -137510 -59880 -34618 32949 -182072 -47961 201367 211849 20945 -133173 -105410
19251 -105410 47037 269092 -9050 -214293 -8811 -213775 85359 68952 47338 -24795 -145087
19240 -145087 -31835 118792 25650 107662 -467167 76255 -103991 172408 -12199 -194810
19230 -194810 229525 -129318 -151595 -206957 -247419 -32626 -229475 122654 -154955 -14854
19219 -337440 -160314 -277094 -97175 145611 -508902 50717 47236 -218943 364448 -100059
19208 -90904 -17741 43855 60632 18094 -61288 202879 -24165 117969 -108655 -357247 -218886
19197 -218886 -244459 19942 -331182 -88611 -25306 -155944 -26970 99266 -4868 -46892 1450
19185 -59480 -115336 -50554 -375902 -465 -74480 -314729 134786 57945 -300847 -46138 28193
19173 214200 156109 259539 123520 -324451 10713 -140872 -420657 260679 -41780 -288996
19163 -288996 339500 -211506 -194224 257296 -46022 18337 -350043 101737 21579 -228537
19152 48102 -229056 3984 -358092 -337674 -220927 -74332 -127192 -77195 -29952 154532 -298958
19140 -261325 -70992 -250414 -55736 -58343 -1534 -87463 -196097 38511 176598 -23275 -16919
19129 -16919 -27656 -48038 -44897 97719 71952 -55505 -140509 -89940 223462 -85152 -173574 -58844
19116 -377701 307505 -19969 -95083 11737 -184922 -50601 197079 49807 -144876 104119
19105 1891 -196049 408398 18703 -134465 128598 -13732 142888 -269407 48890 72154 -309634
19093 -211308 12586 262083 -210075 19987 -400299 -157869 -25670 -29802 -377533 3869 -170376
19081 145974 120484 -16452 6521 96433 -233142 79689 -308035 -130719 -371846 -146460 216504
19069 -88288 97747 -212395 -385823 -179710 150107 -179015 -135531 -352775 383313 -66904
19058 60292 -227742 269302 -533461 -121663 98169 -145323 148354 24668 41312 -172011
19047 -19788 82480 -134957 62532 229786 -104249 49383 -125406 7909 190335 211949 104133
19035 -155343 -317163 -198566 -38069 -131607 143120 -27197 54246 -47787 58340 175835 385819
19024 385819 123799 -87968 91089 -86034 -468274 5765 151895 -138155 51626 -191510 -156021
19013 -156021 -25600 -60444 -149172 -234932 77337 -112095 -232103 -133086 163247 -128363 -172413
19002 -172413 -118941 -91740 149448 -65265 35849 -229251 -17745 19527 -220224 142887 256495
18991 256495 -277570 -48981 39630 24008 -52025 -116522 -190633 -302512 -82335 125956 25229
18979 18356 17812 -433289 2305 -300635 -75669 78550 -32882 108205 -77208 -114874 233822
18967 -236328 -99337 70688 -38865 -262787 188203 -125107 -23662 -178350 97715 -85582 -73022
18956 -73022 -66998 78337 -253607 281055 92958 30104 -290231 214796 147427 395863 -154416
18944 237779 325491 88796 19174 178663 58964 -120521 -234097 -155712 -137310 -42162 -198392
18933 -198392 -56818 -125671 256747 -61242 -129740 61753 -7882 256877 -267736 -32162 -94703
18922 -94703 20297 -42120 -15923 -55370 -178873 269210 218829 -86985 287201 2538 39444
18911 39444 61206 -138701 -92657 -88502 -114518 16840 -221671 36404 -225970 42642 135597
18900 135597 47806 189630 379553 88662 121478 -78067 -212399 123943 -139026 -36257
18889 9533 79384 100619 7630 -66003 -175816 -196822 88032 -224313 99254 -293156 138464
18877 -132983 31250 -74017 263409 -16658 -334611 -52910 -25715 -87993 -98682 -572221 -53290
18865 -143827 -209436 -73544 -87322 35772 -126260 -158555 -209150 219400 -343283 -52017 167153
18853 -9732 113287 -66502 -190900 227601 -73936 374187 -27175 -142679 -248033 -139616
18843 -139616 143630 6845 179320 -199471 235052 -32989 -314157 -740 225151 -149815 -15550
18831 455500 -83284 -286433 -175446 5354 416876 -39107 142910 195064 170976 295103 80755
18819 -491126 322256 62562 192729 -73190 -58339 358614 -97029 82345 170468 63511 103673
18808 103673 174281 -6914 128930 116167 -134630 18127 -51198 -80773 -23512 -325229 -148995
18796 -330596 -237821 -78292 -252818 -257133 -74249 -112599 -203427 31666 -108410 43201 -113815
18784 -209824 -932 115965 -311320 -375890 1093 55465 39557 11259 -85180 306303 120489
18772 43206 93192 -268606 -133818 -325358 33524 23385 -157147 -468237 -78932 -151286 65774
18760 164913 -157128 244787 -698 156727 -109661 -23178 -386998 10792 -121182 -53206 -114713
18749 -114713 344803 97918 72270 52762 7454 -178310 -315169 332747 107057 -38595 -68151
18738 -68151 -450852 -230892 -314537 -276471 -249206 -198780 132387 -235833 -122181 68014 196158
18727 196158 -133438 253152 -13771 -160267 -310598 191381 176605 -210901 172406 -12578
18716 -206080 40761 105393 6444 -8728 24993 -300192 -98596 -146487 48370 23502 -101492
18704 -149977 4214 13093 -85261 -217100 -124213 -101179 -39835 -199901 -89124 -211103 405279
18692 185247 -55195 45261 -155457 76775 -300673 -161185 -28148 106529 -126793 -26651
18681 215372 -86361 49944 -159390 -37693 13676 165710 -157543 1522 -61109 196417 12910
18669 88248 329566 173661 -122433 -384753 -146400 -496460 -108728 112811 146401 -143521
18658 -106778 -52662 -9907 44553 200662 -79941 -301656 1548 62348 -261428 -40841 -270305
18647 -270305 -193270 26055 -231509 292022 167049 3246 63476 187207 64552 4548 -257512
18635 -33174 -207681 -220049 276639 -40111 -100002 -226732 -213873 -205131 -248091 63534 -424254
18623 -63835 -121764 -69206 30953 -49568 73991 -41485 121615 -186160 -33470 -64292 -42436
18612 -42436 4522 -78166 -189414 220272 -209457 -100336 -256945 -64918 51604 -24712 -135280
18601 -135280 247917 -66090 314059 35442 -15751 -421063 15583 -261531 -70559 -287333
18591 -287333 -176472 -136364 -178954 -115126 63278 190348 224836 74950 -72908 30954 -256499
18579 -357642 -36523 -22870 -117383 237917 -101079 -452430 -67536 -17249 17010 -208001 -128143
18568 -128143 72835 -108903 80936 -279620 95637 -26255 -100698 -265191 -298587 -126326 -255244
18557 -255244 124205 5494 -152551 -314962 -178309 52965 211089 -8698 -108197 60955 -307498
18545 -328036 -79752 55957 322255 -99331 102413 194063 -46695 178775 174692 57774 -155569
18533 -102160 -148878 -12875 -93594 -234831 -41197 359418 -60675 26460 -73816 -40928 -104234
18522 -104234 261594 102225 114722 66799 46248 28787 37908 -54759 -33624 -117942 -192511
18511 -192511 167397 -203302 -78344 215805 -234704 -212723 41275 -7057 98820 113218 -15002
18499 3145 32433 282487 109832 -98536 -266767 204384 -318131 109167 -197035 -225047
18489 -225047 -3924 259702 84994 33849 -105587 -253494 -98699 76196 16360 -26661 -17033
18478 -17033 -17226 31379 -245168 -68989 -14059 -121603 84800 -53479 18259 -71153 138717
18466 -342023 -20963 -126399 79005 176355 230769 -346560 24121 2356 -217343 -18323 -253709
18455 -253709 -24559 -70384 151273 -133752 -63655 -42771 307747 -94068 -41789 125223 56625
18443 -247233 -65255 100347 64066 -70652 163086 30770 370331 -339703 162696 282382
18433 282382 -183886 254666 146549 154087 81077 -58654 -62105 -72067 -72820 31634 -543769 197169
18420 -16663 19006 -318601 -95410 -124235 -16236 178067 -51896 -121304 -165906 37189 -92648
18408 53305 -191621 184618 150040 -175491 -140543 29960 -338999 131011 128166 121840 -132413
18396 -54441 -103812 -16344 -21421 -53381 -205579 76254 124991 -344367 -312560 148337 -113155
18384 -294031 -325927 209538 -34829 -103611 343672 -362648 -98644 197843 -275893 65298
18373 59816 174034 303432 148638 -89558 -48399 -121914 -97059 33404 -135721 -29109 20047
18361 252512 -4489 -26158 -217183 273677 -26467 400576 -121934 -135832 -38306 -173951 203093
18349 57533 -211648 -350162 103407 -32199 288682 -146927 -34498 39402 51350 197703
18339 197703 -30230 277857 -99101 19421 -370787 -207774 -167793 135206 148920 -26267 -66280
18328 -66280 -151170 -81398 14443 -12907 98991 231947 103028 69389 -116110 -28570 -161207
18317 -161207 -170021 9324 -249345 -364469 -48417 -124581 -211097 116306 -46614 60110 40547
18306 40547 22192 60984 -10277 -61663 -139229 -261670 -31115 -106997 -79625 92444 229636
18295 229636 76563 -75393 -66456 109726 -151735 129860 144361 -147994 28060 1429 121678
18284 121678 -218185 -9019 -48090 122582 -379274 274859 -133267 -214175 -281015 -181408 79373
18272 177151 -191295 -59101 -318670 -114616 -11632 244265 -186954 -286548 52912 129421
18262 129421 -192086 -260534 -192617 65849 -239021 104764 35204 -158881 -78490 -222310
18252 -222310 356462 -37507 427239 -139837 30778 -104931 -2674 -730 -63125 -33723 -62088
18241 -62088 260670 95085 116935 -45920 -313498 28693 -156310 -291378 -113147 -209439 173793
18229 128833 43595 -41830 426671 -12816 -266058 -158089 93737 -28776 86753 -100547 -160052
18218 -160052 -337156 -211015 -111134 -4262 58533 169688 -187572 251437 19646 10033 445674
18207 445674 118711 48366 -249739 -46129 -430886 19857 -56109 -83330 123234 84250 162915
18196 162915 133566 -272466 167436 -25563 28628 -16181 -57301 -35609 -248550 -382547 -329781
18185 -329781 33567 -14130 9799 -116740 11755 -480606 -9116 51329 -291594 285429 64419
18173 -119263 -275135 112793 -355195 82873 -165895 -181091 183924 -170820 -161375 80590
18162 -352544 -68317 49313 -167495 92264 208547 -302094 -177682 -233756 36565 39426 24930
18151 24930 199823 -363796 41239 -18266 139792 -47385 -22926 132077 -199793 20787 -34053
18139 -174791 -188936 -92060 145954 -254679 47314 24997 -13980 10409 -249416 -128577 75706
18127 -44052 -43665 53735 54077 -181656 264963 -143091 161832 213196 -9699 -145484 216505
18115 -144090 37027 18016 138483 113727 -211127 -120974 69697 54879 -163480 19143 -178484
18103 -12960 -155125 60936 -69368 2977 -147690 -152895 -254992 -62693 72432 91303 -111756
18091 -317654 128421 27754 -369127 -223660 -161981 -118386 -150246 -348529 -19426 -40776 204396
18079 -19834 -9560 180817 186905 -26935 6651 -55031 -343385 313456 -88992 -161019 -79477 -38355
18066 -149940 60397 -69408 155739 -100103 221785 -90049 -257645 -110463 -342663 97157
18055 19152 22991 -953 46725 -120288 233127 21764 -205759 135568 -72575 -160095 -3433 -129737
18043 -129737 68192 64135 80121 24789 -32890 -4582 16397 63514 -164257 -213359 -243150 -138099
18031 -138099 -175182 -8157 -203953 -141520 234688 103188 165081 -204525 -38000 55617 -73678
18019 -86454 -48625 -326305 87793 96926 117959 73732 -45309 -176639 -280558 330532 -203448
18007 172069 -210003 70597 -237905 -80803 -84438 72104 82757 -19922 213783 -73092 -355370
17996 -355370 -302973 82694 -108287 -229007 -361942 331202 47746 45213 -184114 -56669 212193
17984 -54538 17479 -148047 108921 -103061 -56475 68093 -41105 -546744 486436 110261
17973 -71085 -242643 101742 -54287 322746 109238 -81714 -113220 -206112 518228 95428 -54827
17961 77638 -239387 165745 79172 -133041 338768 -59329 -171895 -126488 -96252 25887 -55772
17949 -161072 -215383 -109490 29053 -59465 -20070 84224 20289 -5747 131399 14195 -123306
17937 -21339 82770 141635 -130965 103949 -390115 -197937 35361 -75521 -41570 267389 -62020
17925 -216531 41841 -130903 219535 177252 -153738 -89699 -28233 -140199 110236 16296
17914 -56043 -146988 -256820 -457495 18021 -306387 -99961 78035 185202 210166 59504 140907
17903 140907 242292 187773 -9179 69096 -18190 180093 -139751 515445 -399947 -247712
17893 -247712 -22945 12055 103321 -263491 -312440 94475 -45156 67858 59917 245210 -369252
17881 187037 -323788 234219 53646 -79572 -4651 -36847 -146028 -82303 -129420 -121313 -94889
17870 -94889 291790 101009 77332 -138427 -41146 187543 -113090 131346 -8719 -118196
17860 -118196 -12846 295859 460721 135374 98166 111028 122131 17384 -180197 123979
17849 226815 -20213 -102341 209293 57047 431864 35560 -210781 128240 165687 -226659
17838 273124 182420 -32909 -141406 164324 -243145 -1863 158522 344713 -30664 -169942
17828 -169942 -61122 118231 -363498 17215 181994 -237281 215860 -225862 243226 92891
17817 -251863 70500 -203866 22129 113498 -76485 191776 -296129 -154424 -53441 114576
17806 72825 -84792 59203 203715 -75097 162859 10265 -200804 -95645 82175 -130621 82915
17794 133119 -312451 -188618 114553 -8984 -183988 35853 -131855 126201 25763 -143182
17783 77083 -252075 78321 -175731 31500 241937 -126693 -217385 -13775 303846 -153386
17772 -40960 234071 -126361 -151342 8256 221860 92464 -198471 202854 -18531 8181 -35406
17760 -286259 238727 -63377 191817 62923 181113 130861 -260978 185888 -75507 2557 34543
17749 34543 -327857 -77557 -216139 173210 -137939 471823 -23716 -211303 -102649 5955
17738 -155238 -117750 -49034 -50601 188736 202925 -122571 198035 -165989 35157 6991 279320
17727 279320 236627 -268873 -61691 -20696 117748 56023 -57011 21082 99641 123797 205108
17716 205108 825 138999 89545 -65600 265273 -65921 -192893 83512 -94474 130333 -277949
17704 -90257 -17704 18480 242081 -246111 -130464 32874 -195266 -6620 -179678 397344 177476
17692 -126456 -73748 170750 35991 154965 31107 -359908 -184789 164542 -187170 10787
17681 -84174 55724 -147052 40590 -86479 -90597 6439 335770 -387610 24047 -87212 -34696
17669 209770 222790 -94189 102386 -172691 43496 365341 64724 -45784 175149 -163304
17658 -113027 181452 305603 224709 -7189 -86510 85174 -95209 13187 -354356 -97825 140673
17646 353009 -50407 -74118 -73686 -151960 -220241 28691 202832 -237957 -69557 -26270 169476
17634 -259737 264958 -1065 224753 -47692 8819 -281457 77840 178256 -49587 195437 117899
17623 117899 -174323 -337060 242603 176454 -220397 56920 -77954 -102385 -177074 509745
17612 229439 279618 239363 337225 116495 -137748 67728 -262829 66342 78031 77176 -145798
17600 123873 -204447 -208384 -265745 -145680 267360 83798 72171 -224092 44584 52064 95643
17589 95643 -12799 288196 406236 -129636 161383 -141086 -231304 -323855 13977 -315079
17578 30334 200191 214706 196026 69532 280948 217333 45307 259419 -402392 -1903 -186442
17567 -186442 119368 -135291 -74171 61518 -316309 60708 -163151 123908 10048 221558
17557 221558 4821 47951 77706 223037 128549 232772 -143780 147274 -258347 252419
17546 -50788 282076 -19016 -105624 28934 -8816 -174917 116133 -367219 125356 38035 22131
17535 22131 33658 79566 -18369 -34957 122137 57491 4138 274181 31341 105196 173669
17524 173669 246485 14599 187453 236814 -217790 61282 66775 115280 74792 -148068 122120
17512 78988 -24818 67085 21149 124378 -130427 103405 217999 124734 -216621 -30213 -2690
17500 322854 99195 326449 31179 -79628 74866 55209 114468 237367 283791 167330 90852
17489 90852 270721 241799 62334 -98522 87387 384713 159878 310191 -105608 178103
17478 245715 340810 89555 221518 258416 11114 -3112 163605 -329437 15653 84833 -5232
17466 74884 -313769 95646 150337 -184437 -77538 18918 159821 317878 130916 387184
17456 387184 -210433 301465 322962 135431 656097 122745 330290 114889 -29504 291880
17445 225669 183886 121887 497439 417004 276166 127330 -16061 212636 214837 211896 415832
17434 415832 380773 272289 153392 265789 -12520 -336966 -96199 395949 247244 467662
17424 467662 509337 312651 246864 90859 51404 95909 105038 306568 519918 234280 66662
17412 285797 121327 237630 -36780 195603 10733 -287146 218852 142137 117384 115560 -68027
17400 449948 151518 267851 243428 -81835 195487 130910 306880 397138 533913 102394
17389 -28686 145074 -193526 285836 243066 146974 -32240 328655 154106 289538 244297
17379 244297 316456 94514 -88038 -133061 443294 386291 60344 -42917 45960 269097 89738
17367 360318 389791 78066 -69074 -102675 78024 -247441 258082 140542 2192 -68511 -183208
17356 -183208 83780 123449 -190573 247484 -62457 -84963 -6338 275604 339734 292863 7643
17344 115174 85808 56459 297774 -125694 -111140 193730 -86785 53857 351789 241988
17334 241988 529215 23823 187747 -17683 339659 211801 -105462 114510 108094 229461
17324 229461 -222122 408170 350302 129112 163091 247323 126864 209647 34432 365528
17314 365528 91622 249434 222265 174391 83397 285040 85430 366485 212154 248268 -38069
17302 213180 7584 66999 342861 344203 250730 -49225 78856 -230036 25151 271599 231653
17291 231653 263556 200008 51533 228219 50623 229250 219509 279314 255938 16636 -51559
17279 17681 67813 83142 85857 94422 -79670 98048 3174 139071 8213 459715 141972 247334
17267 247334 32645 214847 536147 -37840 55786 313016 83672 -17526 52389 88876 154278
17256 154278 -51758 234113 87716 183329 -100361 103938 503307 134471 440936 -148007
17245 67312 178598 -20634 401677 300370 234689 278184 -6935 577067 357999 133758 -23341
17233 485989 362234 160918 -70344 -22620 243448 -66949 124303 310105 224689 18872
17222 140294 322174 -85809 100232 85839 335441 377443 532677 184983 457638 81328
17211 -135055 152198 -66460 58711 90749 -125778 92520 91129 223105 178140 -102435 179694
17199 384562 189110 170892 261650 138495 115226 149732 457426 62864 502827 513565 518964
17188 518964 325046 20842 87264 175198 394623 205224 407551 158304 5624 155787
17178 155787 98996 125075 783028 283569 190870 407471 84076 213981 124009 364751
17168 364751 195674 335656 305511 183823 272131 397227 41674 127379 149931 568331
17158 568331 332180 66077 198287 97516 317328 169708 126420 422312 204789 370072
17148 370072 508582 -105333 211826 273564 401634 102006 507562 410046 311880 223409
17138 223409 457718 151748 168125 563738 138842 357200 320873 255347 222903 254832
17128 254832 117723 388580 175535 419623 371713 751782 87150 376837 490937 248961
17118 248961 282793 329129 283516 125354 152287 670326 189350 566758 277215 151427
17108 151427 347728 383371 400438 347389 538942 218801 345183 426773 244277 444970
17098 444970 10981 435624 196802 323014 715186 512443 646041 442643 314945 617775
17088 617775 732191 340650 320407 584667 427379 217296 630930 614371 165303 545132
17078 545132 471587 121673 461025 369578 393958 504911 358976 521952 515583 307599
17068 307599 607228 150524 207397 381319 482229 471946 622992 545614 453641 661140
17058 661140 421572 561665 271819 316552 526479 477814 368852 435040 455017 516843
17048 516843 497292 587243 445774 359469 423847 627680 494951 518200 529231 887443 690415
17037 690415 418541 705674 748452 541164 508293 488883 259401 997705 228518 727520
17027 727520 686286 550630 862391 909561 687505 721589 441416 738348 390875 714151
17017 714151 593366 915901 803548 367739 627103 574039 460135 951860 688042 583435
17007 583435 707199 581958 939606 599978 735263 672914 687898 790793 361390 391892
16997 391892 836373 824875 690872 568058 947781 946975 1060413 462102 720148 580795
16987 580795 669505 1101944 557851 863554 669336 749387 705433 645140 809291 785418
16977 785418 797566 888935 625406 527929 974419 1018005 994380 687350 754808 690695 845855
16966 845855 516848 811860 785087 935830 1213899 894660 869730 987918 668826 1244603
16956 1244603 789173 1380898 1434318 1150665 897555 986949 797999 1225039 1223351 1253186
16946 1253186 1203506 1079908 848424 1420711 978769 1099000 1235160 1291700 1133125 1430776
16936 1430776 1014075 1373042 1245839 925165 870426 947542 1281366 1128696 957182 772091
16926 772091 1352424 1229088 1041169 1401372 1318206 1510717 1534769 1100081 1490940 1052991
16916 1052991 958595 1554338 1399179 1510356 1466760 1639694 1306561 1668085 1278694 1501497
16906 1501497 1669056 1625304 2012804 1693119 1554664 1714188 1596641 2153600 1786038 1836619
16896 1836619 1845137 1721824 1754211 2056069 1712034 1719949 2004283 1917364 2117390 2010963
16886 2010963 1942587 2102189 2030180 2201445 1895724 1753158 2174241 2175397 2148717 2084565
16876 2084565 2482140 2467607 2494913 2171497 2225985 2384920 2581436 2349751 2778129 2344034
16866 2344034 2808271 2366259 2392445 2792592 2606658 2877158 2673795 2475991 3001719 2856952
16856 2856952 2551412 2821909 2903605 2699380 3065752 3208248 3200630 2999815 3321239 3209519
16846 3209519 3028296 3321599 3706457 3298522 3513312 3559745 3783261 3852062 3828381 3862811
16836 3862811 3852633 4185179 3825252 4205362 4180964 4134846 4129844 4377972 4358872 4841107
16826 4841107 5029436 4633615 4577076 4805093 5146927 5215420 5466885 5340606 5195618 5914201
16816 5914201 5589517 5801000 5910080 6148487 6166723 6310040 6256940 6669077 6774237 6917211
16806 6917211 7126511 7207324 7359551 7677549 7619719 7738340 8228435 8152327 8664412 8818937
16796 8818937 9027348 9348495 9641381 9825481 9340312 10080722 10539017 10772717 11029683
16787 11029683 11421947 11801054 11999142 12392142 12777994 13029235 13568570 13815418 14347891
16778 14347891 14904525 15158409 15705343 16580287 16495850 17440218 18277025 18567710 19017682
16769 19017682 19982639 20363978 21559434 22190700 23221129 24227775 25019500 26074895 27162739
16760 27162739 28294781 29626652 30803367 32363781 34105985 35546544 37055646 38794861
16752 38794861 40928481 42751062 44688559 46952643 49574983 52247490 54968685 58038552
16744 58038552 61053020 64632695 68268844 72344870 76545156 81050080 85747796 90857643
16736 90857643 96307930 102122921 107823630 114486949 120715974 127753946 134509793 141423106
16728 141423106 148126200 154919397 161040896 166448088 171796744 176100046 179309272 181345917
16720 181345917 182599726 182628706 180965669 178689855 175073002 170514824 165223180 159308055
16712 159308055 152553007 146165197 139127499 132178229 125199547 118405942 112053699 105365359
16704 105365359 99308367 93547609 88364629 83620597 78254765 73991390 69573244 65756525
16696 65756525 62131640 58885939 55439117 52443923 49874690 47394348 44782840 42454139
16688 42454139 40352473 38305336 36833597 34777298 34008346 31861351 30300364 29053752
16680 29053752 27604266 26642339 25685058 24167015 23629527 22490178 21542442 20587083 20077283
16671 20077283 19214318 18578321 17864361 17520903 16783630 16137331 15725628 15150543 14358289
16662 14358289 14240079 13697491 13238882 12995155 12492439 12345969 11307237 11073117 11023333
16653 11023333 10753974 10749949 10100541 9845468 9506187 9201240 8786294 8711234 8792864 8393734
16643 8393734 7989736 7964275 8094172 7721804 7429650 7266456 6758972 6789784 6841415 6442039
16633 6442039 6307453 6321076 6271172 6085086 5924189 5658041 5716467 5565706 5302467 5270685
16623 5270685 5224757 5250348 5271478 4839106 4666417 4954747 4528224 4661332 4468561 4374216
16613 4374216 4179182 3818066 4068666 3960665 3935375 3598723 3804625 3515626 3566655 3785461
16603 3785461 3270685 3340479 3137132 3245369 3344595 3175310 3137947 3282875 2633428 3180490
16593 3180490 2990602 2961482 3127249 2767685 2745985 2529527 2451576 2665574 2884341 2379500
16583 2379500 2526284 2843754 2549606 2374707 2454259 2548871 2217080 2140945 1925966 2151932
16573 2151932 2064420 2642951 2064099 1939211 2220908 1961502 1899409 1672906 1622903 1879537
16563 1879537 1831540 1817475 1874214 1851035 1905011 1888687 1483581 1718272 1752465 1864503 1283486
16552 1283486 1518757 1583040 1440220 1363166 1739278 1727618 1504591 1620423 1357136 1346894
16542 1346894 1370517 1202846 1391029 1354884 1315310 1191042 1462260 1481898 1136100 1272672
16532 1272672 1176512 1286533 944494 1266554 822015 1361630 870826 1141540 1197000 1022405
16522 1022405 1100049 1247037 1297353 1190386 1045512 1107439 760954 917534 1155450 967235
16512 967235 1045729 827827 1057126 1251527 1183722 894733 840266 1009050 950999 813132
16502 813132 924044 964821 913984 623824 1034171 927124 1089595 907877 907111 834037 1130961
16491 1130961 671409 778056 959998 683346 724825 963305 773909 602934 805663 813019
16481 813019 947079 881661 669856 214178 822015 553717 744841 636366 734505 403454
16471 403454 751735 902399 288365 712826 681920 412195 269166 467405 797697 936718
16461 936718 836388 532183 1196640 589753 521529 651941 814311 552685 872882 559743
16451 559743 451102 577288 491683 732341 499707 631605 532079 377052 89198 663820
16441 663820 686484 417961 552963 464081 311192 327729 491497 759832 354955 298729
16431 298729 549419 244986 438041 370928 577148 448524 206670 264392 355876 387305
16421 387305 611591 300220 305793 704568 571601 391641 598253 582195 535459 116077
16410 139185 732315 409529 486643 355277 281712 450298 399859 247528 717144 513064
16400 513064 241705 475112 515445 14863 331348 535982 131416 205364 503898 224457
16389 217489 423612 383260 397762 118468 185275 -56224 429045 678935 79815 157420 220984
16378 220984 307966 86618 345114 617624 485668 385803 339218 139200 223355 443026
16368 443026 329836 332454 204476 343740 643219 174729 231241 51862 187169 535507
16358 535507 411666 406734 363698 282710 397154 443386 91837 561284 305795 340273 173170
16347 173170 126057 214162 -61535 97921 90815 43970 -116053 575030 284720 333039 387698
16336 387698 -625 309959 313548 199146 272681 173494 220882 345663 -7743 47037 154225
16325 154225 148104 -29762 799054 61782 280653 -126512 204443 391982 88912 180447 124035
16314 124035 81704 376765 65649 -10544 -64090 31622 224349 207551 184665 6487 187149
16303 187149 -152610 48712 168566 -98698 288965 10081 52577 411992 386871 310703 296629
16292 296629 3082 -248170 67720 46878 69834 180774 243934 -176241 100069 71707 -183154
16280 275497 383948 62075 229963 49206 191307 83884 -199085 216880 101075 79741
16270 79741 360324 -15076 369958 180295 101206 61542 155205 169565 32227 607624 337437
16259 337437 226369 250481 260285 -57570 335821 -76932 90103 92129 1024 -16106 60935 481558
16247 481558 143393 1711 228333 -125388 -16527 118566 163105 104011 225965 -37063 324962
16235 41930 -107476 212989 109008 82228 302223 251369 32130 20570 349937 237186
16225 237186 108738 38611 -145468 -1903 90620 206372 -186428 203178 197611 -128072 9023
16213 32507 -100725 175318 -135709 97502 179494 -310823 -158765 -80942 -128017 70285 58586
16202 58586 -142542 269846 -46736 379508 85200 61669 257274 105563 -271164 62510
16191 165557 -137079 68589 -201030 -216230 -112836 23479 -37207 168171 267905 -162976
16180 -48342 155845 51547 -188709 -6509 504971 283680 158382 -34237 306648 -100569
16169 64530 350478 395488 -112270 58256 -383980 -70759 246556 125152 52471 65548 -108691
16157 85223 165400 56403 -184036 54098 207259 -85105 6065 206724 -178782 -11542 64792
16145 180990 8326 -107447 113217 118118 143144 334132 -322016 109169 258059 78530 -71791
16133 242106 232319 108159 153463 -233349 -96460 106812 -57247 181217 -226617 -297970 -15799
16121 42457 -294699 -36914 117258 -93251 -104208 -19580 472924 145586 139961 -110872 210729
16109 -304246 230521 18794 264048 136456 182458 67326 276643 20801 41508 -231189
16098 97797 39434 -28301 -36871 -162582 270763 -130028 128375 132483 -144498 169448 -39223
16086 -349896 8593 -419859 -282979 -19111 -23972 -52234 -315297 -145960 -226174 -48295 -259677
16075 -259677 -95751 -109522 -94940 214826 -63994 -431697 -127226 225448 -200881 165483
16064 -29331 109918 -70617 95602 -56913 -154821 143818 -150288 104175 121295 101190 339686
16053 339686 -248269 -31231 -122517 -165173 -245449 -349039 -171155 -7410 -132930 -154257 121538
16041 65738 137491 -92647 40375 -63348 159941 -223731 -206988 97312 105627 -103847 65383
16029 -41841 73202 190197 -425992 -337200 -5064 21505 54948 57883 274101 227083 242150
16018 242150 -55840 63751 62647 -42847 138269 171072 20610 29941 -183188 340772 -78669
16006 143868 -175140 -28345 23290 209802 -16772 17212 227379 -135315 -162461 389733
15995 -249719 -292138 -300392 279754 -11047 -31425 117415 -113130 -30746 -18537 5553 -61144
15983 171167 164570 34497 -57598 209018 -38546 139772 216075 77443 277422 -153688 223220
15971 114147 69471 3106 -162888 -29802 -43618 -22268 74955 298445 -78445 122810 -245905
15959 112514 -37039 278079 -185479 -158226 -118925 -238692 -131715 -157735 -109199 76429 30910
15947 59740 -237584 -46079 11924 101089 210371 147190 -346916 -116600 155196 935 90771
15936 90771 -77264 52143 -462229 8670 -346968 109658 -293274 -150348 -63515 195363 40969
15924 -225589 -95808 -231391 -162536 -144572 1763 34481 57657 156775 -16 139946 226403 -172043
15911 1020 -23643 116137 68314 29321 -208049 157803 156351 -257029 93274 484744 94670
15899 -61882 97834 -13141 345230 -300003 5266 115478 -253384 -111654 -329018 -34505 209266
15887 -277670 38360 35592 -175057 -5603 160164 -269367 -165009 -114900 -80454 41733 -226146
15875 -449584 -466849 -232292 -239799 -119255 -135513 -76558 -161837 -210137 -120900 -8929 183861
15863 354091 205073 321918 -389187 -10633 117623 162455 80075 139720 213905 -355938
15852 -335071 -24316 -160188 143042 101057 80518 -4692 73880 -9862 -44486 -53080 -158452
15841 -158452 -31019 252826 151891 84155 -136333 77249 -72478 51769 147779 -74217 -119604
15830 -119604 -278951 25875 -264582 -37644 40089 104177 -23656 -139530 90268 6300 73927
15819 73927 -181344 -57359 213876 20325 -120591 -13830 -195125 168331 -41293 -179789
15809 -179789 -62725 170923 83681 -332805 -343854 -2698 -32092 88942 102693 -156813 -91832
15798 -91832 -37313 320755 253307 57763 61631 -64639 -126441 -108204 37955 189504 -246877
15786 -97810 -77318 -87266 -21060 -131970 26246 23445 -304138 161769 -210639 -45789 -106907
15775 -106907 -206675 71076 -251870 -252430 461599 -238597 225443 267199 244639 -260853 316545
15763 -77156 88154 -68211 147889 16388 -260508 259206 351543 -94531 -11305 111443 24238
15751 -36922 281368 -50140 111774 164468 -108859 79737 -8904 284296 105430 39989 266772
15740 266772 -110429 -74998 -16436 -68491 168309 -387888 221740 28440 -53995 135197
15729 77594 120004 58662 84047 69975 -31477 -242734 -25187 -109621 211067 -21050 -289688
15718 -289688 -295268 -932 -27205 -41893 -236988 -55653 -121991 255094 187989 27059 99691 -174681
15705 -29723 -21569 273289 -88943 87913 -241952 66501 223308 -148508 -50772 -125762 44123
15693 6081 -138555 246694 136028 -104900 67629 29737 94307 111044 294924 -34389 82133
15681 -144393 53528 -126938 -141747 -252460 302564 -145359 68122 -5241 376442 135332
15670 12173 18447 18957 141123 -217706 -175052 -180324 -32897 71849 6650 -84983 178062 -86038
15657 -109294 281176 73310 -89594 -136469 24067 -111682 76774 208390 -165149 185259
15646 -174616 -68469 56987 98910 -197199 -282895 51821 91694 -67064 -1600 -393888 -64021
15634 -205830 146889 225427 -19537 101954 -574532 348271 -154571 -83060 -7093 -316590
15624 -316590 4195 226188 -137826 110996 -230766 43546 115015 292948 121347 156995
15614 156995 -86216 13970 -187668 67086 127215 -16280 96051 233877 -244021 -97062 -179259
15603 -179259 -315437 -211927 -94770 21162 21467 -72689 -218314 84188 -181378 60204 -16308
15591 -64490 22436 270475 -105835 3481 -131839 -228762 -49090 -216443 -108057 -242841 327631
15579 -77772 -6794 -44839 78471 343763 -70673 -187988 -111868 -74336 -208397 -432389 -15086
15567 -215808 -229626 -8413 -77242 251781 -48623 -302735 -21881 176745 21855 -38270 -480107
15556 -480107 -252073 -86835 16002 151819 69605 159210 -55159 -98201 24785 -103411 -17501
15544 -169033 239189 -110961 102807 154386 136475 -91629 98825 -57416 152009 170138 -76085
15532 -219202 300844 150146 25810 61295 56987 17053 73535 -1386 -334257 -220404 -136351
15521 -136351 -300686 74575 109326 -88263 -24398 11086 -302146 45822 115214 160527 508792
15510 508792 -462880 -163109 6938 27317 58500 152582 79108 159423 -99113 76744 487928
15499 487928 -53728 -13684 137600 -173508 -2102 -82032 -202580 34038 -27158 -147248 265103
15487 367545 -16378 -4528 348176 -65137 132003 -163203 -186604 -40477 54861 289262 -15210
15475 29151 27810 286976 -21922 198299 -99560 -13370 122861 -282526 52669 31549 137153
15464 137153 21563 -326432 406966 156319 -223822 -101623 -123233 48845 -309735 54926
15453 245208 -75302 -142326 -103615 -59716 -79899 -170450 -94448 -14599 -161713 -135605 15030
15441 156741 313532 80035 63095 53279 -48258 13289 363304 41327 -191831 -10360 48465
15429 118328 41237 -329207 -179898 180074 -239893 -9211 -78735 -259070 42317 248876
15419 248876 11076 90621 -136847 -201414 5856 -214774 -326982 -68532 -54322 -447576 326535
15407 39425 -111486 -4833 -70711 58389 54388 -22603 351046 -163786 256124 -111061 131442
15395 96446 -36158 57589 -37544 -37470 58344 -91459 23031 -302300 100711 197536 -25999 -118421
15383 -118421 49776 57791 123701 -35630 13194 -9722 40269 -168863 -42418 -245017 -131297
15372 -131297 159190 -171553 -8258 -94751 67362 -73872 -201409 32026 80665 124155 82946
15361 82946 375583 149308 178613 94314 113737 164459 -201607 -217082 -66097 -28136 -13756
15349 197444 139110 -223536 115767 -27457 -12320 126455 -261166 -30769 -19871 -361284
15339 -361284 268025 -81889 225102 -157475 46059 -66658 108431 359933 26822 -280032
15328 -232153 6257 -28278 -130525 277704 148954 107752 1222 -89852 -213902 -113675 27682
15316 14458 146445 72577 188363 32217 63899 68934 -85886 173411 64070 -88785 241668
15304 215745 261898 137513 21659 -25884 -9472 -195128 -62181 -12250 -316058 -104484 225197
15292 -97404 58538 114498 65754 -89341 164449 -146415 9912 106057 -435627 222613 8322
15280 -84530 -88089 -32981 19261 -30995 56372 41584 222854 255965 -95886 83693 311252
15269 311252 91382 75464 6768 -118268 149279 119431 -47402 -33017 -533715 74164 214904
15258 214904 169323 -73948 29515 87355 1420 172280 153746 261606 425204 850387 1754917
15247 1754917 1001440 1398625 1178295 299691 226441 -46759 428162 -37112 -41518 517336
15236 -296064 127819 340236 -69493 162487 34462 -244545 -60904 -143005 136836 -256754
15225 -82701 -152181 -131999 395798 93569 70504 31836 48929 -350499 -139766 310110 -73386
15213 160943 -133947 -150466 -313635 88156 -8064 28416 184066 373043 260393 62766 -66427
15201 -128127 -31227 259605 6554 355715 198232 -20903 -18528 395459 201454 -79554 208286
15189 -86265 -26567 139557 40536 51884 273402 49171 191372 173942 116199 141290 25516
15177 142086 44999 28584 69126 122561 150478 -149799 -156704 -147582 -134800 -98478 146050
15165 109198 -213535 143026 -487 225487 150134 252318 154880 82524 99083 227227 239275
15154 239275 -32454 217096 44970 26816 -181045 181272 341989 215940 304289 -336882
15143 331638 -106612 126944 2148 -74624 117424 -142763 112419 330667 -31613 102337
15132 319639 396742 180217 97633 33858 -57748 36673 322279 -100016 69680 492167 134354
15120 -53321 -277974 167432 165978 -207716 267629 103104 84067 206488 533157 -158715
15109 -67564 89364 -286208 52285 -173503 52436 84883 218739 -95147 115025 -275797 271772
15097 223309 -10119 544267 268005 -109471 60707 62036 125885 -78741 111683 -15199 7038
15085 62055 25873 139346 198498 -219709 -31305 363152 94804 94923 -6495 43885 199422
15074 199422 -29093 37294 35396 219650 150019 262862 93093 -64842 66056 -148807 -98758
15063 -98758 210167 100886 30142 113080 80591 141027 123973 304297 -19156 433097 70785
15051 87217 77572 471337 194745 242702 69823 148461 237778 -56447 271715 285832 283634
15040 283634 214118 -44420 -3862 -9536 26826 452240 -51089 219720 40688 52694 -8715 74520
15027 -132125 405593 249333 90930 111194 61183 122039 324264 131166 427836 352999
15017 352999 243285 5372 161977 251091 275604 364098 302268 354958 113204 364815 120292
15005 313601 191236 -97379 229553 44936 292518 215303 508097 319852 265672 -30973
14994 10625 263086 229772 25446 345775 201569 318630 143488 150917 306037 185638
14984 185638 115624 80706 -242230 350720 419204 27910 -5975 55789 407238 -101366 -88628
14973 -88628 -73478 278161 296474 555795 98101 243975 256121 -41091 473679 164159 423748
14962 423748 -153855 320976 383221 178547 100249 208270 195890 185047 242759 461485
14952 461485 249353 80473 324332 487167 200170 585749 317737 243405 242787 175891 195774
14941 195774 223271 473203 352458 516840 301303 210009 188634 584614 38764 288419
14931 288419 504814 584681 366667 -145701 110376 334297 -15130 22016 328568 328764 78549
14919 373927 391360 8133 438635 483893 70547 255686 485250 347163 450075 141339
14908 84894 4465 342071 212316 322839 331432 397091 450133 491168 316798 81041 308270
14897 308270 325209 256105 287666 63007 607817 329943 382191 77474 238218 346084 515777
14886 515777 224654 350205 199471 284161 216500 680088 199285 258836 292704 319490
14876 319490 382163 327648 449997 325814 262363 308309 298036 318682 299972 392235 319880
14865 319880 187538 126061 371213 309134 289637 455050 308510 518458 432369 206680
14854 184050 311788 358334 -16600 535155 243518 360928 384642 35305 539120 198733
14843 383731 271146 442898 490254 450509 409621 509313 228994 350887 198078 669260
14833 669260 341743 150989 409408 488862 878863 485259 570044 736828 434484 254457
14823 254457 408930 373091 427764 426569 331389 650708 134261 449974 494547 242451 574150
14812 574150 568061 426667 519017 17164 302956 535688 220631 600589 147566 617183
14802 617183 643760 755613 303498 452920 355875 204015 441999 136134 550779 551532
14792 551532 404883 603143 682575 608870 845810 93701 196368 510664 364661 140488
14781 582202 368786 416212 581239 481387 587721 743047 490569 340416 533147 553119
14771 553119 378641 656063 428365 457754 223147 595146 561949 765800 321907 328622
14761 328622 855542 679227 705368 391779 446986 543867 562261 503438 728614 743482 637606
14750 637606 642866 554475 988716 493278 602235 555880 632660 1029472 552482 696346
14740 696346 685318 941564 372451 739379 689966 487446 425188 717400 669024 558785
14730 558785 916225 604717 400773 467274 953635 867356 700051 654354 795955 441741
14720 441741 831546 518352 528862 650568 799099 377499 837805 748901 820462 785984
14710 785984 960348 512128 216066 732226 998573 989903 818098 605671 957450 1044548
14700 1044548 928652 629470 623661 724117 915713 899459 1150626 720522 1210593 907600
14690 907600 409208 939808 978144 1164286 466776 880157 718591 904225 975937 938837
14680 938837 913174 993469 689025 835106 826236 563310 795512 877389 1229286 1186830 1229961
14669 1229961 1090614 1030522 731719 1094621 934083 1275540 1060331 857565 1034485 1111164
14659 1111164 879407 991629 1070254 1117934 1084363 1063412 902743 1315525 1000230 1198661
14649 1198661 1027894 1267450 1236678 1093409 1143424 1055577 1331624 1028088 1077803 871300
14639 871300 997329 1265742 1242336 809470 1166330 1154345 1202163 1212555 1039499 1482124
14629 1482124 1357141 1299536 1367708 1304038 1115290 1140415 1220487 1272380 1492553 1174094
14619 1174094 1022901 999008 1630932 1327162 1434531 1355319 1395691 1243162 1575677 1304128
14609 1304128 1340143 1457341 1648586 1429013 1520527 1349554 1490194 1405867 1620648 1228899
14599 1228899 1680132 1475987 1271382 1400073 1677244 1796996 1470819 1763070 1870303
14590 1870303 1741492 1699051 1480614 1560532 1737692 1822095 1799795 1679154 1727013 1647389
14580 1647389 1643891 1548040 1879253 1626933 1588468 1666409 1749938 1910750 1670133 1961274
14570 1961274 2027098 1915762 1945003 2236176 2265537 2510544 2327218 2094161 2117390 2320526
14560 2320526 2608117 2880991 2347673 2529826 2939932 2455724 2937965 3299259 3707163
14551 3707163 4292357 5385771 7089401 11657516 20082708 35998551 45986340 22085567
14542 7643096 3747184 2368712 2406191 1717982 1962657 1657379 1797997 1544862 1770872
14533 1770872 2117608 1693112 1894607 1998181 1968807 1848712 2027709 2237140 2105747 2044425
14523 2044425 2221659 1818535 2514784 2395598 1939611 2575096 2126009 2301156 2157847
14514 2157847 2474551 2450129 2471017 2351376 2538692 2550334 2671481 2585671 2244077 2867783
14504 2867783 2805991 2934823 2713709 2723190 2878897 2694675 3158871 2888736 2713955 3038456
14494 3038456 2859697 2883177 2742560 2852857 3110831 2877189 3250929 3075454 3203030 3440384
14484 3440384 3638276 3210333 3205801 3545443 3771666 3381745 3461980 3825425 3477447 3607524
14474 3607524 3610088 3774217 3518988 3698103 3888595 3545323 3986477 4103637 3869783 4073861
14464 4073861 4186334 4306753 4398565 4283825 3974480 4640383 4698965 4548514 4386426 4534718
14454 4534718 4464508 4538394 4841830 4835462 4633870 5168630 5245314 4705925 4997086 5114078
14444 5114078 5454738 5261925 5781904 5587462 5715789 5578214 5581297 5785703 5434060 5787559
14434 5787559 6046946 6383533 6194986 6285559 6317347 6160693 6372764 6492513 6701727 6573951
14424 6573951 6837408 6665737 6639116 7087201 6909554 7193369 7298299 7299452 7738012 7728552
14414 7728552 7635027 7684948 7824878 7796719 8031214 8199418 8312739 8335538 8524037 8700575
14404 8700575 8741380 8921622 9196271 9121419 9656706 9764177 10098153 10170251 9545516 10075624
14394 10075624 10396171 10350926 10491811 11030927 10939332 11354118 11580426 11848886 11928712 12129786
14384 12129786 12359153 12697529 12554642 13031306 13076980 13392085 13691496 13826489 14144452
14375 14144452 14027495 15088945 14761375 15599753 15653356 16009564 16492491 16680686 16826704
14366 16826704 17244062 17712512 18081159 18455268 18698515 19260501 20035273 20046613 20882791
14357 20882791 21130778 21722857 22259210 22404145 23341964 23524745 24665975 24901278 25469307
14348 25469307 26166193 26743479 27334604 28374744 29262286 29509208 30161574 31261712 32066646
14339 32066646 33081650 34185777 34746273 36027896 36992093 38136766 39233315 40643444
14331 40643444 41973628 42892422 44325424 45661842 46926330 49081945 50509495 51799382
14323 51799382 53917668 55901745 57573732 59944296 62150912 64271337 66831837 69148473
14315 69148473 71761685 75076772 77723426 80752219 84343646 87669932 91576693 95367521
14307 95367521 99574113 104269269 108670104 113696186 118997248 124779135 130610064 136942596
14299 136942596 143785412 150880306 158830865 166762551 175412080 184672937 194512533 204579109
14291 204579109 215742758 227467998 239768694 252810367 266319672 280631347 295243796
14284 295243796 310523534 326271589 342222886 358072860 374218125 389998625 405090464
14277 405090464 419294783 432157787 443105760 450448812 454100255 456166632 456626715 456159667
14269 456159667 457013619 456310661 453017548 445388367 435059542 423819257 410615150 395946616
14261 395946616 380353566 364167704 348016096 331474731 315383835 299748260 285505586
14254 285505586 271089967 256789713 243656916 231139251 219092914 207597297 196625073
14247 196625073 186802193 177304960 168491155 160297759 152478886 144975777 138224476 131368362
14239 131368362 125533879 119652213 114734078 109402570 104634437 100004382 95661350 91984025
14231 91984025 88568576 84915915 81562371 77912703 75209743 72343871 69438730 67068214
14223 67068214 64448874 61955513 60173611 57970911 56125607 53644269 52070629 50610331
14215 50610331 48978793 47706364 46280995 44956495 42990872 41752966 40605054 39554622
14207 39554622 39020509 37953980 36611783 35513846 34425262 33587572 32775663 32189440 31138423
14198 31138423 30270146 29545462 28445513 28016786 27470960 26911638 26244472 25579298 24510911
14189 24510911 24206375 23666189 22719297 22747306 22296341 21521452 21247206 20483677 20120403
14180 20120403 19429847 18845782 18696937 18690144 18523037 17980504 17422747 17058442 16995176 16556847
14170 16556847 16272522 15984139 15495219 15411524 15029739 14672189 14625488 13936026 13850268 13805557
14160 13805557 13355176 13073398 13236653 12683228 12612897 12365807 12198592 11992056 11525153
14151 11525153 11534601 11123384 11348432 11264005 11135217 10781069 10686265 10190055 10251209 9777848
14141 9777848 9871509 9689326 9650907 9355599 9324809 9109524 9204496 8653659 8390784 8415407
14131 8415407 8457176 8412464 8205165 7932705 7895863 7964711 7896639 7715810 7615430 7456607
14121 7456607 6975786 7304555 7021573 6954139 7047359 6639286 7051028 6746981 6686929 6448368
14111 6448368 6364480 6236920 6148134 6135080 6260580 5922030 5820068 5651138 5551465 5788569
14101 5788569 5528709 5591257 5431917 5356193 5286440 5368873 5231775 5057042 5292266 4693804
14091 4693804 5266140 4874476 4807000 4720387 4730492 4317503 4677396 4366247 4456083 4538911
14081 4538911 4450651 4172442 4490052 4132046 4152681 4146237 4103989 4114238 4134041 3891575 4042776
14070 4042776 3966305 4154918 3946445 3934045 3917371 3710882 3871963 3611018 3598378 3989687
14060 3989687 3916521 3604912 3889117 3556065 3542331 3747759 3445780 3554837 3246687 3178016
14050 3178016 3359447 3308241 3394363 3085024 3088483 3233808 3253874 2779432 3093173 3265650
14040 3265650 3055693 2897692 2939931 3049995 2538571 2689706 3028139 2906419 2953459 2845510
14030 2845510 3056851 2681927 2444700 2999374 2901104 2809125 2481768 2343266 2731518 2455474
14020 2455474 2603542 2288379 2514144 2519115 2281874 2419104 2219036 2572064 2213599 2595340
14010 2595340 2473719 2301136 1997861 2097108 2309938 2472119 2252069 1955763 2068537 1976135
14000 1976135 1943359 1832087 1964484 1810568 2228652 1547960 1579883 1571540 2117862 2191341
13990 2191341 2597835 3927623 6559419 13723392 28923656 45080016 27188296 12574489
13981 7686656 5256586 4138152 3917509 3169695 3149914 3071380 2919332 2905446 2479236 2551076
13971 2551076 2129951 2175404 2141385 2107272 2078891 2075567 2051737 2101689 2317191 2056695 2119753
13960 2119753 1887834 2021288 1759357 1900207 1969498 1670641 1681635 1962587 1989168 1616671
13950 1616671 1900785 1601214 1675197 2011792 1603210 1726096 1729499 1893186 1823270 1754809
13940 1754809 1456951 1587251 1543252 1772241 1811799 1421999 1438829 1553480 1749363 1409039
13930 1409039 1390293 1160345 1556871 1406446 1412414 1604981 1370244 1181599 1564154 1480183
13920 1480183 1118066 1338455 1429105 1669250 1283287 1377268 1424694 1215731 1451601 1276020
13910 1276020 1275033 1187678 1591688 1394481 1311261 1007398 932314 1234902 1312654 906840 1009330
13899 1009330 1670148 1196203 1333000 1241462 1325475 1249756 1412932 1290175 1126932 1438463
13889 1438463 1011550 1146136 989864 1280653 1005312 1197479 1385134 664606 1268360
13880 1268360 926658 901017 1132152 1191276 1132681 818669 939681 1033643 1209997 1415979
13870 1415979 1024314 1125541 1231407 1019789 1162622 1042487 1022400 811387 764131 761759
13860 761759 778713 921226 890380 1011268 779244 876240 920111 857049 894240 871487 1082059
13849 1082059 513358 859622 909069 699658 691126 507836 1075872 867923 731560 944434
13839 944434 1077996 839479 823263 784865 1261990 874882 819720 903691 994797 526809
13829 526809 947923 800921 831239 940152 894639 821868 763469 505547 1017651 710052
13819 710052 1094060 718484 700178 760793 638339 1175010 711944 1218241 670825 504695
13809 504695 698371 573831 828975 789875 692365 452001 613238 917057 876676 724639
13799 724639 186313 988629 1153126 619573 620371 540341 1071052 801231 838534 826154 616041
13788 616041 534053 567785 377675 534692 868383 785482 751968 553803 658663 614107
13778 614107 617599 560778 652503 342530 879910 486531 671305 654497 685509 583971 561240
13767 561240 876255 421799 345261 463561 580533 516628 586740 908400 300085 402109
13757 402109 602108 512820 471913 802789 617006 499847 871543 669209 678068 677783 482641
13746 482641 308693 685290 571484 582744 260561 523048 801451 327090 478118 525183
13736 525183 376100 666664 450763 482463 174184 160985 530477 548434 401305 606290
13726 606290 419904 656900 496525 988402 413767 268105 321537 461076 664484 341798
13716 341798 500228 351030 458571 171473 566328 -51413 611844 356867 264983 252021
13706 252021 563961 468591 686728 505350 233726 446798 262952 255527 634650 505560
13696 505560 725256 593864 334941 580689 423659 681645 401373 525488 585120 515018
13686 515018 529059 441623 428427 798785 183947 917385 250604 628967 430163 676442
13676 676442 658870 414743 457120 456573 288275 460359 700303 665689 640569 600687 461907
13665 461907 886194 126629 595728 533953 201840 733987 511596 467347 559040 495217
13655 495217 543375 191750 308372 170544 127644 412338 640150 84039 274159 -52486
13644 691841 517931 629450 369139 392426 304285 435939 449684 159331 -68930 554891
13633 295229 308631 481221 232892 148562 438417 552669 184414 299999 418990 617065
13623 617065 276933 432833 188891 198376 261101 344746 327883 478876 153439 464147
13613 464147 505140 318013 581982 135688 22211 319417 366731 2016 521497 280991
13603 280991 324935 434300 251260 324427 479639 80151 445836 445101 224821 -63210 343115
13591 343419 488784 496820 394944 513433 376880 656097 554189 413679 414587 142789
13580 173271 81093 89402 244377 415139 201350 131333 426723 302698 161031 248223
13570 248223 140107 327281 286566 268135 -68548 177589 432833 205622 167962 173494 -7407
13558 331647 248453 248515 238736 379913 289543 298971 51895 384061 339628 363669 10040 93088
13546 93088 203439 577591 148648 240408 185762 422388 285593 235324 217450 391973
13536 391973 272639 282513 490803 402491 237860 579047 170429 280747 265726 241977
13526 241977 279259 589155 537321 253809 11964 190967 456194 111625 199929 53217
13515 410093 233624 620266 256096 168639 171576 192999 283872 404220 460041 141192 190356
13504 190356 -199916 278011 253130 283847 175799 353365 267873 228430 185406 109302 -121827
13492 211072 70471 186292 124958 359014 330754 669032 106884 183437 239029 275502 206821
13481 206821 551060 381564 182515 354889 267584 236701 178852 312402 -10735 264997
13470 366410 -79395 174277 273330 385119 -67647 389103 346403 452206 483341 390960 48597
13458 269662 220488 219805 312474 342141 444049 68115 199496 125638 266306 275466 115383
13446 165711 344238 269880 166288 232058 169099 148621 198285 -153422 170973 403967
13436 403967 460114 235503 171885 233651 371362 53299 485081 179863 128348 122181 -132248
13424 547922 191176 202083 145760 114740 -34632 504533 462430 251762 350806 331967 48861
13412 381349 210467 560333 -54291 53038 4167 -63212 222851 392048 228603 -67593 444170
13400 53959 44425 173919 39228 215841 293019 226838 155520 -62432 339097 92578 239318
13389 239318 171573 518655 315160 108650 193224 473592 -84146 156468 261058 260833 36411
13377 375811 156915 483306 232456 37970 502601 17909 58044 17508 276519 136780
13366 138488 167159 101839 455746 213483 -58823 187242 72684 188672 307581 101359
13355 42951 92330 28092 302272 64161 36899 85254 363067 394817 526224 145021 195357
13344 195357 391812 -3292 377932 230056 -104402 48529 602115 111138 398400 290737
13334 290737 322237 161641 210650 136057 172968 312350 2762 78853 352367 351102 508864
13323 508864 -18345 357185 -65978 372582 92132 413243 191664 67778 71873 302548 112807
13311 405724 250632 247329 -91060 318089 182944 135320 145402 382854 -76766 -308079 163509
13299 487387 18704 391599 234193 192991 182259 69223 20147 179351 14532 -10779 303830
13287 -2452 207010 -104096 172532 109645 248969 17249 122606 -25893 -99230 277490 237784
13276 237784 6190 3545 -47309 -269681 -98109 -85750 208208 311501 191981 120346 144605
13265 144605 202080 122586 -85163 278077 92449 -179043 217113 224719 151154 197485 24762
13253 -302077 -75335 145293 43800 -181175 43581 279875 263727 112731 -25668 345541
13242 224234 -40417 259265 -61974 73816 -164139 212239 17345 72561 -23702 -106365 155466
13230 183022 329184 157921 202792 248270 -260912 -102578 111083 369819 156354 424497
13220 424497 -125719 -48319 -38633 -144111 67130 117748 -93663 -141679 9870 187074 91562
13208 64028 -233211 -28953 194618 63542 85582 3346 74608 193487 173649 166362 -251224
13196 -43891 320532 97270 504224 -58353 -310461 190363 189837 80364 -28974 36519 -154632
13184 95608 210372 199673 158930 22738 -79109 232193 180758 404002 144523 -124057 176834
13172 306755 299981 -282535 249246 278017 58067 93686 -77097 76482 -115733 134864 23594
13160 159628 374540 205939 2443 -29351 324472 82596 -236104 104721 24867 -206876
13149 -93891 81423 -15518 5048 308539 83175 83675 225984 50930 342304 67765 -247632
13137 -155039 207859 171076 111376 -18875 -12899 62824 -149515 -12370 148890 176401 -144410
13125 7172 208931 -51476 45281 48693 208976 -100005 107623 89179 -178721 263909 -73052
13113 245039 231025 454452 188825 -153091 39006 115444 -24068 -171382 97855 -144422
13102 38284 -121502 -62293 239089 140247 24300 -24995 271787 -146642 -168609 117756 191084
13091 191084 128276 1046 -165601 -139284 247857 128415 -173897 102081 168447 -152245
13080 164768 24645 384375 85035 353957 131611 98937 126429 417357 -260118 -45674
13069 337744 447308 -81558 -15116 203216 306471 23012 185428 -32379 -163132 106451
13058 -85703 195437 78004 -133068 253003 214521 -1832 29330 45013 119041 20755 98955
13047 98955 25315 194577 -126501 349247 132834 3920 -272514 24646 -222770 121474
13036 68923 -28777 -283340 210837 -175392 -114252 -89998 -11612 -51461 333099 60501 194660
13025 194660 -29205 336182 53697 175290 326075 104129 231255 169736 100446 175928
13015 175928 57943 -1104 -68283 198293 25119 184570 -15414 7147 -81779 -81218 120754 -55033
13002 -145047 60991 -15808 20322 193481 114237 123816 223293 1600 -67463 -70855 -95330 76351
12989 64273 -72787 66081 157447 30820 -68213 96023 -63358 -214218 307468 6074 282793
12978 282793 -356372 -45420 139796 -188388 200277 -79784 110513 -88561 197201 -72800
12967 175331 -36622 217923 41870 116596 367206 175352 87312 177049 34233 92208 -24487
12955 174822 -88771 328632 244482 -26602 -190451 354315 -12167 159826 210657 -117147
12944 117048 60285 147468 -267961 -23005 8583 309115 23647 -161359 154329 -5152 -16883
12933 -16883 -203868 420319 -135878 -402237 -203256 13177 -109479 210709 -355335 195253
12922 -65318 84937 -129951 198815 209112 -176483 -29519 -94159 194562 -149907 -298130
12912 -298130 59406 -3386 -114541 82164 -238859 -36232 -86844 -74575 -40815 -106194 4717
12900 108692 53212 -37971 59975 -134274 -82761 -28984 -183888 -78466 97455 194336 -18275
12888 -63857 94791 71211 481967 123434 51048 -106838 139 11281 -107301 -41453 -41180 -95048
12876 -95048 162536 72901 218687 -155524 127276 -103518 134936 -88073 77468 27778
12865 -136809 174894 -187682 242355 -273294 332398 281277 287259 87329 -248667 -117075
12854 -72749 -64856 78075 -115749 -342497 136693 -259637 -33292 291974 102102 79959 316848
12843 316848 56758 351954 63197 287555 -221698 152666 -4150 420745 -28407 337646
12832 -6752 -88458 -199568 -176910 244502 18564 312572 -241211 -138032 -138242 311335 -129617
12820 -4722 33161 -6936 27618 63851 122299 -211338 59821 233347 185393 154533 278046
12809 278046 -105750 -396959 70112 -359629 -236897 -51740 -54199 -78696 -176666 213311 -24659
12797 101876 -176846 -40342 285778 -266252 -31903 -72860 -50686 -78344 28273 -231228 -1434
12785 -84951 32916 -52827 -250444 -86972 -89324 -257776 135870 227127 264147 -101892 -34524
12773 13294 -39370 53698 -71943 62580 444464 -141375 -122396 -395047 -227139 64602 360602
12762 360602 80312 186624 263310 -53977 266691 88094 -166546 249927 -12898 -6252 -32223
12751 -32223 -36437 315407 88615 71390 -82650 156786 -221211 102482 56776 -213369 -170866
12740 -170866 221030 -45538 30573 39985 83767 338374 -134853 -54771 43776 177975 212463
12729 212463 -42130 -223913 -66905 -68632 -236916 -210896 61954 -69935 -357520 194108 -15908
12717 -76299 -264535 26739 1547 229679 81518 64174 136953 24508 -22521 154282 216367
12706 216367 75792 276920 -14786 331677 57188 169683 16903 299758 98333 -6446 130028
12694 -32646 153068 224107 -105925 71685 285409 64234 -134 -21577 346302 -244592 79792
12682 138461 136602 381386 160757 -167839 105949 -17908 105316 83620 -102378 48293
12671 64041 105924 57324 -151457 -104511 -258994 136386 -130214 417474 -7398 216017 400132
12660 400132 205008 102783 28731 343369 180689 -148786 101627 -37729 274055 -68288
12649 -2515 -80952 -253311 72491 -51766 91323 -249986 91299 203867 -123459 184627 185561
12638 185561 181689 10416 231199 132857 -61692 -150349 38057 -76122 62395 251869 153570
12627 153570 325965 54323 28356 -244905 253489 162933 359861 351681 265741 -25358 -130510
12616 -130510 166317 9297 247218 19534 14779 35182 -361254 83897 50558 235596 277770
12605 277770 53742 -92723 171749 -150548 169820 -265867 45108 -129886 -65185 -187531
12595 -187531 85457 51979 103 330277 -191708 169231 -46189 -169155 15679 -184809 164120
12583 288230 -101600 -111951 24792 109829 251271 111486 74169 78199 64776 -15495 526047
12571 -53614 -88748 112332 74679 137570 -46319 72427 102273 90551 24897 -166329 -33290
12559 215674 -87482 152129 -40076 -199495 -16824 -139692 10178 24200 -291309 189502
12548 44796 52459 18325 -197918 181915 -152152 115111 25163 -102363 46860 -57131 -173206
12537 -173206 59110 75581 157095 373828 277221 84382 -144119 -213114 301735 60428 -2212
12525 9181 -40728 -49107 169473 -376020 -151399 -49286 -22371 191093 2071 -192706 29188
12513 -369877 -54214 45610 -5626 -71554 -18902 187068 -184791 -122046 44494 336799 249812
12502 249812 220511 -112922 100651 147146 22406 152403 -216273 151321 -93687 -203950
12492 -203950 -218154 59506 -28169 -42706 -140915 126173 85922 -90093 30598 194020 -78950
12480 -68598 131422 51956 -22018 -72707 -234236 -29404 -59876 105503 -76829 -44362 131522
12468 51978 -199737 -361555 -115918 151445 176653 24854 311072 -327910 -28160 55672
12457 222595 99593 110019 -81944 255453 -143250 262771 -187185 -12860 -125309 69739
12446 -310917 46692 -73583 -214589 338165 -112087 143249 -292189 -25226 -69729 -84851
12436 -84851 -79250 -348277 216602 299398 -158907 69440 160742 -147137 -162626 28258 196048
12425 196048 -57576 -190327 40959 42213 -122252 216501 -182838 -106992 184048 -106225
12414 -124681 -68031 252791 -148291 148686 270217 -201460 -286296 358106 -32755 119428
12403 -273849 -177360 193079 -108192 -6056 -89813 19207 -60406 -212785 -198195 276479 -188867
12391 64566 -70349 -11267 63258 64248 58999 274062 -144865 -71228 -68622 -93224 55344 -139127
12378 -32559 -87748 -220888 -41987 -120042 -212084 -33001 19659 -144349 -192225 21289 -151319
12366 -140042 -54352 170740 -175656 -89892 -300393 -134252 -259664 60701 359438 38174
12355 -105666 32885 -51711 225292 255281 -242781 -314133 182484 -79913 -29439 -201290 -237804
12344 -237804 175995 -87551 168033 82719 -235512 -62231 52698 -134961 40723 239675
12334 239675 145943 -30711 92 62833 -425356 -30107 93500 276155 -201932 14249 265343
12323 265343 -107883 -30055 -110450 207044 124278 378177 -27724 243547 43777 91297 -23239
12311 -343915 -73284 -287176 270 101515 -4073 120778 101035 140793 215490 -237537 -15201
12299 100656 -90475 -164421 -60047 190443 -196004 162396 47864 -248002 -3578 -235757 160441
12287 -233831 178961 111668 -261804 -40766 260015 16381 -88831 75864 288969 141619
12276 187704 511920 276601 120905 235622 99899 -229344 -86661 -66397 -83734 257888
12265 189516 -38057 19549 51932 256153 -75315 -298774 242090 19805 -2249 225760 -154520
12253 140550 119264 299 -204012 62735 -192796 280462 79572 7173 53978 24265 -212619
12241 -25610 -258817 -5995 52104 33917 174021 -89432 169432 -17304 138760 63131 442497
12230 442497 -24490 125601 -18707 33073 147787 195419 369057 26441 426669 92588 -194082
12218 231756 476058 21196 -24013 402397 156749 117724 38796 158988 269268 -41114
12207 257603 223667 109758 350105 12976 173159 239680 203359 378014 58896 -204533
12196 196549 641928 233969 350425 47 -36506 31970 145635 79243 238975 27794 185923
12185 185923 165269 194862 -50280 -42479 13775 365365 138660 35261 -136259 -27708 98279
12173 -11454 156972 242669 95295 -92714 94817 -3568 -26165 62107 -49194 -116647 280404
12161 140317 365120 250733 29875 -3202 49582 84869 86762 125050 -164613 -29501 -82581
12150 -82581 44500 2824 26646 89578 -142702 -91062 -5716 3683 -118342 290356 -92238 -229953
12138 -229953 -18071 -311272 229290 355543 -260700 117553 268570 247683 -211694 -37410
12127 -114802 -151246 -44535 86877 134330 61377 59601 -32401 269432 -44109 65757 -112860
12115 -27529 70935 -202986 37023 -34894 205305 -51738 -65551 -224912 118646 -298996 -122793
12103 -150732 46470 -147209 -113756 123964 -206032 -157698 -450909 220596 -143891 224864
12092 -104867 -97721 -540967 203995 -298660 -181373 -125539 27837 159443 -24105 -120893 -296713
12081 -296713 -148878 -17399 180253 270629 611773 1720552 804743 505707 51770 -62754
12070 29432 23572 87510 22441 -65973 -34142 69882 264655 63810 428949 -128487 147497
12058 367776 312040 235256 105853 110821 -189519 -89038 774 113016 35827 -17971 -44915
12047 -44915 -180404 116193 -101916 -240260 21866 -600654 -102455 269373 189453 -19423
12036 -145590 174259 -36292 24518 105430 84788 -339209 163063 15583 -120460 -39168 173377
12024 -13576 -29247 -65596 -223114 31942 193580 -6003 174158 -392094 -123941 -97598 -92233
12013 -92233 146655 138488 107290 24162 255675 -269287 184650 -222391 36927 222329 37753
12001 15410 -108990 237995 147671 94318 195854 -48700 -157633 189548 -46924 -190341
11991 -190341 59608 -9684 231127 -17537 -59731 -89972 -28627 -339807 -310202 71739 114821
11980 114821 179170 -100881 306143 132443 -53875 -87858 -21987 4761 -214710 515443 219249
11968 -250188 -211789 198330 -181862 29552 263877 427149 -178321 35594 -116022 86773
11957 -32395 -27578 -6993 -303742 -319576 56874 -252046 -39569 290144 24697 294541 85374
11945 150710 -29591 27862 55929 240935 78762 -52066 -172307 -266367 -12604 -60415 69007
11933 87997 89136 -117092 -332930 18364 -192260 319272 45652 -100396 176609 -39978 -312155
11922 -312155 -32663 50045 296879 -158594 96641 -23920 23007 216202 -61482 217393 136511
11911 136511 -280353 57755 -70456 -28663 7704 37187 -304738 65789 -284129 -250481 75575
11899 -92626 -180323 -148967 -160471 -7755 240236 -190620 118231 -212560 -290553 -146844 -137728
11888 -137728 -154450 -98924 102033 195720 -190689 107871 -217752 -126057 -134055 -117101 16381
11876 162669 -84630 -105626 -321568 -114106 -186326 -231025 496 25084 129987 291916 -390138
11864 -232385 -66931 76168 99836 26019 81178 -103867 -115736 8922 453202 -119909 -30008
11852 -116457 115038 -323257 205435 26584 -55257 -171504 -87134 25297 13024 -76068 43781
11840 -20926 82885 -227309 260467 90331 -360763 -293810 167468 -127593 -437355 -130440
11829 -451297 18039 -53883 -183735 198797 34102 -109122 240670 -72564 -224909 -228584 -108412
11817 40928 170793 94371 -59495 -251999 82850 210780 -257197 164012 51592 -365923
11806 279191 47349 -238620 117697 -330805 -347958 -151598 -31846 -220415 -38473 240482
11795 -30739 -236573 -58763 263112 139622 -278963 321450 -43434 88831 34242 50264 -47596
11783 88 49664 -233565 -89556 23491 36509 -52764 -268408 215666 -311 -51295 -315283 -89704
11770 91412 12667 -441953 -50170 132449 9796 32994 20813 -97252 -88094 201275 -92498
11758 -88654 -133835 132995 -20853 118116 -127491 -36944 37306 23535 203824 251655 -136291
11746 -30044 -246805 454335 -1395 -341381 -37542 -85710 -60082 -90878 -251995 147569 128196
11735 128196 18842 67184 128865 141237 12154 -212555 17941 -107123 9894 78305 -42428
11723 -299163 -249545 41483 -113239 -169617 9025 215770 260227 118990 -181696 -39778 -224110
11712 -224110 375852 231284 313975 -234 184124 27570 35974 6616 -12768 -89776 -73599 61730
11699 187772 -184724 383885 -65947 225306 -266179 90153 24884 123681 211930 226195 -213310
11687 -85255 34747 -133499 46342 -19584 -41005 439812 -36108 -54702 228324 183284 -57242
11675 -5384 4815 -158267 -168694 -312546 122153 -38411 287323 -172865 -27086 107172 26001
11663 239476 -78990 148969 -184447 160172 -146796 21042 -184862 199003 132499 86548
11653 86548 42961 61635 177166 75381 139172 230916 209681 298577 -338569 190699 -401617
11641 14046 -258392 -214152 141638 -16926 -161134 211738 39866 -100499 -7463 -210027 -99680
11629 101678 -251696 -85992 -32832 -139477 179893 362630 66590 295541 -147786 -128520
11619 -128520 -274287 -70469 -140536 262222 350756 -242602 103042 134563 -12988 -177572
11609 -177572 15305 -29694 -47169 -205836 86277 -21445 105537 -56482 -62257 -213978 -86415
11597 -55432 -235902 138203 -334921 -90637 123202 -115088 33151 155831 195932 -283375
11586 -82052 106859 386281 49951 -77751 150288 -224119 -7415 -195153 249369 71959 142209
11575 142209 286129 51126 158487 315955 -346438 15429 113706 -354304 250218 -91958
11564 139564 136298 46654 208338 -89742 2495 -24973 -50314 -287494 316540 -205323 60134
11552 123471 -47398 183893 -20488 188343 59402 201683 114498 -31097 28257 25661 23591
11541 23591 -96269 143895 27892 29106 -139295 133453 -157116 -218841 118663 244352 -371706
11529 180467 15666 -54572 473770 50647 -47871 -25734 -155207 120372 -172181 200698
11518 120289 -292142 109462 -59420 6863 185881 -65913 105476 111072 348687 230149 223424
11507 223424 243939 -31556 144424 204151 58091 -125267 321803 111929 333630 3081 35610
11496 35610 225489 -133253 152194 599481 -11072 136147 -37249 -165170 85191 234862
11486 234862 148093 108788 277492 43940 162126 191798 328842 277312 -25135 362081 250522
11475 250522 -115497 -6387 218333 -34772 12408 271124 114009 10986 440279 202147
11464 78829 159991 -95274 -55038 90495 204133 141161 170899 51884 333404 -159516 -143236
11453 -143236 -81442 340009 38184 280287 -16895 -27616 58355 -97228 -109596 169540 25632
11441 -130168 18039 263928 307412 80275 195586 69389 -46436 315100 30005 366541 -18278
11429 33805 154933 323630 16211 -48467 97477 -128607 35206 -58473 44860 206772 -95385
11417 -236906 307898 226593 87586 -216187 -110524 266517 116609 -123137 224132 -232211
11406 88136 -29833 63626 43170 -178804 -101336 350545 19086 105769 136695 248740 39544
11394 -46947 316840 -196715 -177115 44184 -249821 -370568 -274039 -154970 -79790 -12216 163658
11382 47561 -369726 -76744 -99362 85125 92340 82622 -190662 127818 558726 -140106 -409275
11371 -409275 95448 152345 304174 237116 -245742 312446 -495018 -33120 -85566 -243236
11361 -243236 -133687 -22322 -421639 84817 -128593 -167507 -15907 18746 94715 202428 -388276
11349 274782 -234001 46648 -253303 179016 165133 -64720 -183511 173440 140028 7227 321659
11338 321659 49258 105107 24890 -360501 146208 -123444 247482 68493 106974 126146 122059
11327 122059 -176828 79168 -245145 244922 40729 -108885 -18237 95082 -185369 -95604
11317 -95604 -19166 -41862 186926 -2945 -97964 262773 245958 -343050 -19244 -116932 163015
11305 -610876 37563 -223103 -8569 -21808 -503675 -126144 14759 379873 -229166 302651
11294 -151909 289850 -142851 -153928 -242292 204462 -115408 9641 -218385 -158544 119071
11283 -246808 28842 -87340 -132322 6820 136875 121220 -457933 -129007 -93816 8203 607306
11272 607306 147796 -353005 -198980 -323674 67557 150610 -61335 -72651 -366229 106463
11261 51133 105983 12304 140351 188814 196588 -192650 72961 118297 52476 -250916 -314236
11250 -314236 -54104 131576 6131 117019 234853 97565 118274 -255902 8407 295655 -127835
11238 -153125 -159786 -202352 -41321 49232 351171 88256 62014 24556 -289054 -430073 -353370
11227 -353370 147202 -318294 -392003 -198583 -285787 -99541 347530 79162 130209 139036 -83681
11215 37702 -41694 -304100 -120186 -49064 -19641 376443 -154590 -28244 -84384 142460 -10771
11203 -69167 -19257 -34007 84572 -70683 163798 -38796 339132 -284626 -9803 -299377 -73381
11191 47378 -219180 10942 -223095 -334980 117335 -155233 -277046 112096 92542 -275991
11180 153143 37257 309655 -115652 291077 -262882 -201827 -242172 -260039 -103267 185751
11169 -241881 73230 -91024 91823 -160701 137238 -226137 -109146 -72686 61902 27998 -129094
11157 -356046 -16054 -130847 169502 2172 -120948 179773 114057 -166556 238107 -4340 -38401
11146 -38401 -205880 254941 33158 -148097 129509 31424 -62006 -80029 316205 36481 -75597
11134 233613 190836 360849 245794 -193770 220247 -337749 -40199 36868 404525 92571
11123 -426644 63590 -73715 185119 136766 -99055 170523 -38959 -142034 259954 24353 -71112
11111 -59700 -113331 -31553 221686 -42610 -71234 -3972 173933 159220 50796 292228 203120
11100 203120 -12445 344406 382153 325722 321847 -38834 352336 258599 96139 -58777 107771
11088 313402 306125 287303 160654 517736 302925 323689 78162 330954 240216 421561 97172
11076 200786 172089 660913 192490 35232 162707 243743 85768 121197 75777 83803 323839
11065 323839 350049 66800 170936 279662 594193 283240 543638 599006 203141 662802
11055 662802 1096423 588982 933278 552066 536135 473364 508661 562562 587276 795980
11045 795980 713654 843973 290509 627257 412792 421981 501770 724921 729450 650354 862314
11034 862314 733101 478944 598478 678858 493339 725018 388705 553050 350688 819105
11024 819105 422533 901245 387808 494282 962181 710386 467558 300417 656205 481328
11014 481328 619537 562941 725523 469287 550710 382805 522067 525488 483413 435874 482712
11003 482712 550184 738443 836631 466789 809611 564377 544668 472827 865177 630992
10993 630992 614059 871494 579341 758432 455818 777210 435311 675351 774411 499871
10983 499871 1368261 879421 1071617 919470 929519 1284068 1488896 1750916 1716657 2244270
10973 2244270 2433171 2547911 2527921 2862067 2668692 2253444 2158277 1512828 1818952 1585931
10963 1585931 1559786 1408006 1006309 1485913 1353738 1593150 1007449 1387796 1324682 1188212
10953 1188212 1261042 1039148 1193972 650542 580014 748692 758901 395058 237268 244480
10943 244480 234216 392819 177034 561827 -10934 -179195 304788 351664 200917 25211
10932 181013 -135605 138306 237240 338027 406914 162313 13674 -64925 118849 63369
10922 63369 43925 176904 91067 -59325 158654 64645 -53 -96 95649 -142593 92729 70234
10910 70234 58881 116435 -130731 16899 128203 42004 111633 -55517 -206765 213861 -70481
10898 -23471 -191411 -105086 -156404 -143053 -21069 -298037 -159237 66386 -143982 263953 -147750
10886 710 -14465 -410966 184639 446799 281004 -107817 275056 -151825 -48105 4992 26955
10875 26955 -285037 16655 -160279 204982 -19010 -20447 55060 123313 -309864 -49131 -128959
10864 -128959 -172475 109179 -91952 -121847 -150125 -140844 137296 -58182 -205180 -232302 14148
10852 256336 204749 19362 129548 17781 9560 -168770 -30237 -230712 152030 -210897 29305
10840 -200273 -430253 -169891 198703 194509 -106619 201843 -237447 53304 -250397 21193
10829 298808 203202 -251639 140128 -39605 -47847 76260 -23396 -7005 119190 253820 -154059
10817 -276746 -97044 -140206 -165696 -53634 23660 4334 -147549 250102 -86102 21745 127346
10806 127346 99989 350281 296089 76319 -171437 -188700 70665 -255824 56574 -78587 -110907
10795 -110907 -240811 342218 -68360 -68044 208657 -150492 -93937 51756 -32887 -198242 215454
10783 -224369 -395438 -250481 -254781 17968 -271785 -31078 193969 -7654 225352 -262293 3608
10771 -133272 91958 24655 -292671 -82772 121616 -80750 274263 223230 -23198 -151618 -90078
10760 -90078 -165111 -163009 24011 -39443 76424 -399295 290333 10683 235873 -217270 -210332
10749 -210332 85988 303734 -108985 -118690 205171 155658 -6189 -393050 -185344 74013 -235864
10737 -51270 -112540 122791 30574 -3271 62494 -137469 -226697 -189164 -307703 77924 38682
10725 31661 -62663 -194792 -230676 -12697 -171510 -69247 -134789 11782 -76083 -297821 59154
10713 -163245 -144272 -20460 -121154 -62968 17501 -4972 158434 -83507 -50009 87175 11597
10701 -149978 -242710 -109553 34379 -189836 156075 81949 24496 119305 -18268 -62354 163386
10689 -66619 200428 -43509 -9174 52981 -72104 -223375 256924 -157434 -76706 147657 233408
10678 233408 -261122 -216209 -151619 115565 -297163 132382 -215746 -130631 -182227 -97684
10668 -97684 -212941 -2738 101362 -29411 -101784 106693 -118850 -115539 -52626 149333 -301691
10656 -154901 83211 79306 27956 -23485 22281 -121770 -295682 -102101 -244838 -130554 219896
10644 -153393 88944 -122341 -261695 100773 144534 -66755 -166900 -260919 -24634 76000 26597
10632 -64752 -46677 -205793 -102828 -241955 -145351 -198206 -51714 63463 -208080 59648 28691
10620 -520661 201503 287857 -115121 -255404 -23654 250695 -423707 -378874 -352278 -81887
10609 80575 -56933 36267 -7369 -27576 -148853 122732 -19438 91775 -355844 -136372 185974
10597 219198 144307 -93607 68020 -244092 -125146 165195 -431516 240730 29889 -129514
10586 230286 40164 6290 -56357 -256917 -140885 -31914 -17927 -262426 -122409 -118288 110530
10574 -375071 40162 80070 -208222 -45688 6214 -408902 4528 -16430 -409747 -163201 277557
10562 66260 18985 -173682 -129355 53738 276687 -138251 204701 -54822 208212 150772 -182518
10550 37296 188932 -21973 70298 -106202 107812 -115219 -326777 230617 369755 -189343
10539 -24583 -23945 -116171 -108941 -59993 -140570 -85813 -88461 -141719 -164725 259036 89635 209297
10527 209297 300954 -53423 -23139 156448 148296 133586 -283910 -147219 -2056 7271 6102 17787
10515 17787 -280316 -77392 -179343 -242172 -59974 329176 -102306 -10305 106040 -46382 -277833
10504 -277833 108876 163406 174266 13512 62450 191129 -65157 -93973 -220090 97491 -124826
10492 41080 232616 -25882 -29931 33177 -74251 28496 202394 -89904 353603 112928 446173
10481 446173 228358 779733 91092 357390 -196273 241999 -503900 -128 -279859 85306
10470 18726 251561 -139348 -157865 -284115 -95311 -77116 -19450 100672 -420918 2134 -187485
10458 -122287 80139 -171148 -227576 273938 -69293 -313232 58813 -181283 51632 -19004 -69003
10447 -69003 -118600 1893 -40522 295316 80160 -57839 124515 115755 -27698 -71464 -175384
10436 -175384 108271 -38187 -130324 225681 184175 -271916 173523 -301926 189848 362149
10426 362149 -248711 214727 -35095 -164196 61141 -161376 -157229 -121294 23711 299548 -475315
10414 -111760 -243721 -29018 -124830 1220 230454 -400317 17514 78164 166783 288444 239271
10403 239271 178004 -137217 80598 324981 -132468 -240588 -154950 182235 236684 241282 205077
10392 205077 274798 21715 128426 458166 8171 152603 4651 20280 238517 -28583 121484
10380 38825 -30683 71026 -165428 322644 100601 290889 361133 1483 384982 354421 228378
10369 228378 366912 430428 205200 774069 301069 318599 213775 362086 263572 424783
10359 424783 272413 255243 18659 87548 376734 108349 12260 481260 88147 508700
10349 508700 619037 -36355 -6986 284097 217690 213301 405801 25201 173709 36780 257374
10338 257374 532442 183052 102996 -2999 18576 344730 104679 -57268 114553 -22354 -17891
10327 -17891 57979 309084 44286 -67943 211450 -306193 319964 197739 -50567 -164064
10317 -164064 26890 160886 237216 -56765 -138255 135084 -87246 7553 564367 -89268 46748
10305 -286890 -1301 -5776 -6475 181682 263096 -72794 -106706 140788 -181429 -195722 123697
10293 -23980 51169 44425 56521 -83127 -46634 87899 -46469 -31964 -676 -122030 -38313 270635
10280 -205887 -99764 -74210 -455108 -20379 -71551 169000 -338058 -175541 12726 -148812
10269 -247449 272242 -68161 57016 -109017 182776 -95588 -20010 169060 401362 245454
10259 245454 108527 -2371 324438 -267956 153427 273625 -516856 75735 172726 -50830
10248 23817 82026 -38132 174379 -23565 81543 -172254 6364 -99843 -191080 318520 27752
10236 -118524 403 -321072 -168355 305847 200085 72356 57127 -113546 421938 287799
10226 287799 9890 -14619 -56522 -56769 178185 -41335 113219 -78914 -166564 307600 -23948
10214 -102061 71627 -42834 -303317 -166667 -122791 50107 11212 98334 56370 -360258 -78568
10202 236320 -84246 -72342 -52777 -44624 -142874 -117653 106220 -164342 -291589 95834 -372326
10190 -438997 -193965 -176398 309808 263533 157561 -140143 242372 26439 -287305 224571
10179 -215630 -107692 -97301 -454500 145907 -439127 -109788 -183869 31241 26804 23381 -150791
10167 -85453 -43584 110786 -200925 -255953 64448 -358148 -40966 59468 -28975 -148272 -39784
10155 -65991 169079 24843 240363 296614 50858 -10812 -50133 -162045 -230297 94141 122909
10144 122909 185134 -122880 184882 -104524 311119 55683 -132811 124586 369042 -242990
10133 -32919 78894 -99213 -29538 -90557 135159 -86489 92288 -170896 57589 -178051 -172065
10122 -172065 42131 -108778 -133479 -34308 138405 90484 63240 47334 112177 -101257 -102339
10111 -102339 -106339 -226917 -337053 369533 146407 -82262 30167 -182686 70618 -128508
10100 -154004 -55396 -162716 -103603 -63445 -309287 126943 -64587 -455002 -81678 351172
10089 43002 122902 69575 170967 -128353 -75273 -90467 -286600 192964 91039 -124035 -97683
10078 -97683 -25842 34333 -24893 -44099 -37368 341803 -271727 126692 135159 -35710 27009
10066 -31603 56808 -112642 6469 -140503 -331101 11885 -28181 -116019 135271 24523 75910
10055 75910 -261196 -180875 -149451 -302109 -267081 -349986 -14573 -401534 -464482 -277645 98997
10043 152307 -331273 -21486 -63684 72476 6071 -158502 -154924 -35939 -288035 -321136 -367067
10032 -367067 119015 -231543 -17304 -163953 -198784 -215443 -21329 -167023 181924 -54648
10021 14953 -169750 -366627 -215844 -320126 77397 -388615 47942 133671 -87275 -377318
10011 -377318 70346 56004 -31638 97877 -254572 53970 -83979 -39793 -66992 -190340 -114022
10000 -114022 -168931 -105002 27637 -159451 100795 39526 157761 70513 -267908 -129797
9989 -200836 97318 -158142 -109390 44262 -16935 81752 168801 -217688 -332628 -182305 -43224
9977 120344 -141584 373592 -74029 -127592 -6855 -227840 -59852 -93233 -134004 -141123 -229364
9966 -229364 -141054 13352 158302 -115900 403370 49179 220831 -399576 -134217 31660
9955 -208416 564789 157887 4904 -149323 -161625 -242226 -108215 -63506 11631 -287944 -256631
9944 -256631 121033 165492 -7575 155385 18432 -77844 -75587 68688 5976 301573 -17479 -148249
9932 -148249 -105634 9161 91790 79181 -126097 43916 -83609 -259932 304831 119205 -174861
9920 31366 50856 -199506 -283122 75185 52561 -317154 -3548 -54779 -162632 58944 -158874
9908 -234045 2500 23646 -163990 -47128 157279 -293108 200024 -22529 -157913 -10691 -359018
9897 -359018 -272592 -174922 -80934 -31161 -203043 -91302 9326 209836 -302946 -30931 -307956
9886 -307956 94241 24819 -324700 239000 -279636 120779 -441937 -31166 311541 212464
9876 212464 243983 -224768 83697 239415 37909 -48090 -185868 -130160 170142 99230 4417
9864 100131 258371 88499 133816 -47852 342275 -26531 -231867 -124565 -19290 -94019 24495
9852 22942 24922 -266402 37977 -9954 -149378 -103710 1172 -77061 128085 -31983 -169821 -89913
9840 -89913 -370609 -250575 -46623 -107001 -55455 -47528 -157778 -172238 -115618 -201959 24056
9828 -111681 -336200 -48677 303634 211964 1927 31905 262161 -229492 123259 173462 15716
9816 -363857 59433 -92414 -250316 80113 -72896 -49389 -179186 -33533 -21896 -38469 100799
9804 168890 -151978 -427107 369513 -164629 -359878 -193378 -64506 57942 158040 -196624
9793 -83963 127201 131769 -118501 112927 -150036 -17620 139301 5780 27008 222552 150901
9782 150901 179310 -118986 49727 -143773 -87230 -224378 -359320 -221957 -238204 -75303 -129235
9771 -129235 143671 -95266 -111182 -365702 -209466 -245347 210439 -67817 62267 142859 149423
9760 149423 -239559 -186653 -44276 265202 -50080 -93991 191270 -86347 111859 -320152 -303676
9749 -303676 74090 -115653 50469 -215144 16024 -83324 -185204 36101 -53834 -194320 -110118
9738 -110118 -150028 -251902 -81209 -38241 -360871 -440 -55037 22477 -88833 -308757 224118
9726 -72339 307751 -166902 181658 -47019 -122242 44716 -319602 -105083 73236 -16839 137664
9714 88216 128840 133284 -177967 -159136 -24091 -259621 -120588 190251 87774 -8224 30429
9702 -67055 -266714 -246122 72974 -206459 -136534 197566 -208455 -121215 -46983 48240 -97309
9690 132041 13986 11959 30601 110137 181737 -41657 -318618 -399322 -181696 -210544 -30099
9678 107977 -225683 155287 -199075 -206508 -115089 -243598 -33144 -40879 100862 35731 -104992
9666 -285405 76785 162069 -46345 -228589 20379 -199152 -255849 77974 -206212 -157275 30776
9654 467679 197031 -403001 -80266 65813 45586 114851 -129851 19135 -343627 -234091 -28275
9642 -124552 -15867 282877 189753 4971 -166136 -243569 -96645 -3703 -29624 126122 -115511
9630 55108 -124097 -150325 -200065 116772 245123 145100 -221170 -237700 -270735 -150585 -10836
9618 13960 173766 204698 22699 -235988 -37044 27574 11814 150379 -108569 326063 188492
9607 188492 87375 -42032 -226253 252613 -5385 -100250 171758 -39558 -540031 -1016 -14461
9596 -14461 -371408 92392 30971 -93531 -84883 169982 -85828 -5281 -116553 -140177 66920 -98404
9583 47168 -74724 49840 257 -97648 -229599 -213327 -198867 63273 -59246 -87222 210852 -142949
9570 -141058 48769 -192737 874 273600 -480288 -153957 -63398 -214001 4249 -227593 -212312
9559 -212312 25531 -179593 -7389 129080 -54617 -108702 -216232 91148 88015 -42892 52761
9547 -263245 43770 -326012 -25610 -107951 -193944 -63032 -111641 101618 47865 -384458 5608
9535 -163504 -229812 -185195 -162628 41814 -236632 105187 91298 27916 13534 256297 -178554
9523 -194579 -91474 -77341 -125354 -133106 -123310 -322909 -406255 -135090 -232558 182642 162504
9512 162504 -63869 -331465 -506444 28367 -928 -77383 -86451 -164534 -65342 51337 -77683 -317895
9500 -317895 113382 56288 -192400 -355428 -8500 86839 149843 -172800 -113961 -24467 -6449
9488 -32877 -130265 -307386 -318131 -41788 62259 -138319 -97642 -134645 -13148 -153113 212053
9476 -157814 54667 110368 64552 -303035 150292 125022 -30906 233149 -40873 -99750 -146137
9465 -146137 196386 321935 -195479 160420 -98360 60606 126760 22144 283379 -169714
9454 -127647 -219820 69824 -110829 90713 -201446 34506 80818 108223 -65021 88094 -137595
9442 -276576 -54702 56743 -103456 -235819 323758 68298 12416 -142951 38951 -157927 -204944
9431 -204944 -15845 -364488 -175488 116254 32673 427377 -105109 -173397 -360069 122757
9420 -19637 -328393 -67363 -302751 -59586 -2219 82716 -259467 150510 280506 94633 -285079
9408 98736 65891 -223474 10113 -165574 -176117 -130307 -141508 -191683 -325443 -100609 -86649
9397 -86649 -173637 -135659 173726 189299 205739 101847 -299034 261007 83889 65332 46537
9386 46537 -452410 -252108 -486652 -466896 -70444 -64199 -41336 211027 -257696 -209147 -181427
9375 -181427 59358 175518 22252 -191177 -27178 -299122 -141339 107043 13835 -4965 153605
9363 -182695 40410 -65121 76027 -148064 109 12065 -233604 -166702 241625 -139255 76229
9351 -3480 -267873 -149935 -466787 -356806 -108019 -162781 -259032 -39696 -99717 -116705 -238555
9340 -238555 36341 -210961 -76048 72875 -264860 -100982 9575 -142043 -202013 190638 301664
9329 301664 420269 -87288 243891 -46899 -80602 -199580 -242835 -131202 -39762 53106 172544
9318 172544 12426 -4530 170231 -15441 85445 90230 -77139 -111253 -17923 194302 80989 -83060
9305 -233876 -39896 143116 -266091 -3135 315168 289604 -135477 -150269 -140626 -25636 4013
9293 126254 81781 233383 -14709 24681 -117980 337004 -271011 47 6898 -21464 109814
9281 61124 230093 -30987 -394929 10555 -163261 -94654 -197963 -117286 -332223 -404870 -29704
9269 -161538 -130351 306029 -63068 10892 -74071 5695 -288067 -190209 76861 -30469 129674
9257 -269775 455 241116 104959 -25620 -102566 -45824 -95102 -8273 38610 190892 -253293
9245 -1191 -416180 99777 -162049 -134410 -321495 174939 -182972 294021 50404 39058 150376
9234 150376 -14501 -413871 -43670 33323 -105091 48387 306482 -207730 -266100 -157090 35389
9222 7285 -274829 -31982 127860 211250 -3292 -260292 155832 57384 32016 165012 -62500
9210 -202651 129559 -344750 -56609 -51579 345345 119248 7396 -179640 -115398 -295390 -282271
9199 -282271 -20726 -141800 -252422 74582 377003 340409 372241 238798 -197133 -249010 -153411
9188 -153411 80791 -196401 -70330 -133503 64034 -96633 55233 -218169 -126877 -296340 -10991
9176 -207901 221679 95992 -124066 -250869 -214558 57779 -209978 70311 -214661 74289 -36325
9164 -168642 60438 -169606 -173445 43066 -39894 -7079 26397 -11452 -44298 -181441 -15104 180205
9151 -453616 51276 -64370 74530 25440 232706 -185679 -131790 109694 -259209 -130652 -307184
9140 -307184 -349595 123351 141585 -133925 -151066 -102171 -234137 254717 -1447 87886 143764
9129 143764 2334 64086 -231557 -27513 -180349 209216 239020 22181 197356 -177133 -362348
9118 -362348 -167610 -92753 -164461 183595 -40304 -182480 -102834 141951 -38098 -232347 -100430
9106 -168755 -176881 -152769 -255403 -168172 -73157 139677 -42410 175113 -215021 -18016 -124418
9095 -124418 192949 63219 -89753 245816 159344 104450 -246476 -74597 -27371 -131403 -104970
9084 -104970 18264 -365598 212498 -122474 -49255 83305 -114406 -114190 48133 -100832 -265451
9073 -265451 -156552 13907 -115427 201540 -112801 22070 32111 119358 43265 105293 120670
9062 120670 12784 -299478 -176456 -105559 132292 99283 20323 251357 -129216 -368629
9052 -368629 236198 -57764 -99630 78529 108322 193562 -53663 -415119 35773 74208 -90823
9040 1389 -229478 249587 -214730 246292 -224712 -111896 63099 -282310 -255469 -313051 57499
9028 332748 202540 81212 -124863 -263334 52791 10000 16541 -93504 -120094 -287336 -340720
9017 -340720 -101742 92443 21100 -430628 -328794 -304380 31788 -212622 -353864 242086
9006 -343694 27341 58982 -74158 357042 -197594 204558 36631 -115983 -25541 -9330 127959
8994 -446077 -32494 -80136 -79726 -122603 207570 49231 -233249 -253852 78260 12145 -40514 -252486
8982 -252486 -37169 -165316 111943 336139 -124958 -34513 213278 -146768 324939 52566
8971 211074 -243177 209806 102139 -258447 220402 -38118 139798 -206267 222846 -180123
8960 -157131 -167219 -28877 280253 -72894 -5155 -190769 4320 356278 25444 -290151 146135
8948 -210144 -146525 -100704 -125525 -73073 90757 167956 -229743 -78989 117849 -204635 -114064
8937 -114064 -26681 157754 -27923 -44205 -218096 62234 44208 -4710 354470 12081 530700
8926 530700 271957 208441 1319056 2800987 8500678 14936460 3982159 1239648 89936
8916 320667 350557 218524 10773 124076 85593 35017 337184 29077 639844 -40347 -83814
8905 -83814 87328 85032 -388370 179767 -46461 118220 -90932 -130475 -364430 95334 -171242
8893 81876 15553 -148612 -165359 -150821 226116 23251 -153192 -155585 -156994 -199291 -220040 104142
8880 -144525 -218978 -40295 251936 444103 -87203 272098 52775 -35021 161135 42998 -19367
8868 -6888 73848 159796 -120761 208875 -124936 258565 -201422 146492 -122024 -146050 -68633
8856 -105675 149433 144300 2710 -329578 175400 57839 -167633 -125944 54688 132779 296728
8845 296728 -143879 -62216 -59365 -16988 -122563 -144619 -74157 -32246 -85373 -214846 195183
8833 -23746 40327 -300262 171382 -5701 106406 -171168 258335 -256341 2493 -197645 -431801
8822 -431801 141146 33610 104473 -128285 255737 -31130 -16215 -65535 -71592 126936 46639
8810 -86890 52589 -85965 66331 -346419 -35742 285621 14873 -76137 193020 91801 -44565
8798 -246079 -200452 -145595 -166771 22187 -64307 99528 -184609 -43673 43778 -303716 -258722
8787 -258722 41995 7564 -17108 -36836 109312 174713 -138816 152643 -14976 -105786 19946
8775 24738 -14966 57254 -116982 -259260 83124 -35270 -262082 11352 -438457 -30794 18366
8763 -184882 109290 1104 -57621 56776 -212753 -17622 -195874 -99200 -9733 -76635 -43615
8752 -43615 -242561 -123862 36356 -103365 77159 189237 -160352 -228654 268318 -120945
8741 -322264 -286425 5727 -185119 -280685 301638 82064 209321 25384 78042 146693 -109493
8729 -133352 20359 129719 284586 187418 204888 -303401 -61697 -329203 77160 34661 -328813
8717 -5478 16434 113691 -154307 -281079 -42243 -217942 140382 106575 74835 199836 26604
8705 -185147 97083 -181739 127954 -184792 -283298 -122234 -196844 -373650 21888 24420 -143551
8693 246305 -94686 -325281 6275 -15535 79003 -166663 261421 -382708 162632 153647 -81755
8681 -93044 -36606 187620 -316232 -54739 9447 -230606 -224210 56311 14447 -100955 -146556
8670 -146556 -281385 -137132 -228643 -25514 -193591 4712 -166612 110955 -94891 -377794 -99690
8658 253105 -36626 -91253 21626 -413045 -142592 -38018 -184637 -25982 -149646 -169600 -119192
8647 -119192 -154852 -247278 112508 76796 16967 -265316 -88412 145811 -239327 208642 -173163
8635 -226060 132953 -52971 -34354 -282583 -298052 105907 103106 -23314 -203922 148182 -99019
8623 -182070 -303404 134723 -196183 108166 87019 8138 114736 94886 -252940 98253 191198
8612 191198 -70366 -49269 70586 -182377 120311 -131223 12959 82033 94907 -401550 -222348
8601 -222348 -120764 81837 78 -53473 -350105 -85290 46713 -374883 -235003 -128836 -93681
8590 -93681 -93471 -8461 16819 64332 -136483 -105134 -208711 -231939 -252506 -439850 -25611 -23216
8578 -23216 -79804 -316297 -130889 211459 48247 -30076 -153862 -7833 2493 -91568 47685
8566 361047 -59968 -77634 72718 68036 57364 -55333 -5029 -100331 -74881 28609 -18557 -123861
8554 -123861 170855 -69803 -309319 -66946 -215354 -281859 91301 -64334 164163 -145249 149582
8542 99475 -274656 238280 33182 -175368 -54227 58721 217101 22925 -1578 -154492 52064
8530 -367841 -423155 435179 181224 47430 322866 -59151 144848 -169627 -86917 -43869 405071
8518 44048 -292144 19492 100734 -301171 183716 -46894 -105706 -134583 114427 -92264 -260826
8507 -260826 -165072 10326 38762 -93489 385986 -80374 11734 147973 36139 -303972 206729
8495 3361 -73212 28688 -105838 193361 -31026 -26173 2441 -33528 101493 96349 -53831 -92381
8483 -92381 14632 -3775 -246743 -223788 -548715 5469 -53174 102930 -64667 -176354 -175679 -78744
8470 91042 -14493 -22156 236599 -419287 -307598 -154058 -125413 148535 -97397 -11210 -145427
8459 -145427 -193064 125335 -84133 -86528 205337 -235127 163386 -63036 45657 -154593 -22521
8447 -194539 -13088 -189404 6734 114741 -111728 -223304 -100985 -325846 -240752 -193583 7250
8435 185436 -179027 -65095 337601 84803 21161 -144058 46190 -246411 146587 -34382 20051
8423 -106571 286724 -232490 -335790 -229146 -39782 195094 -88408 -234109 170382 -21771
8412 -221501 -108339 -272956 -143213 -408543 195493 -34391 -42551 133109 -37075 -42251 99472
8400 -248114 -121956 130822 110984 45476 303372 41825 -246938 -6271 -147743 26028 82733
8389 82733 21171 167605 -28465 107119 35866 46274 81261 -127701 -177910 168780 119423
8378 119423 -363349 43981 52043 -6750 -270209 -2221 76436 -44698 229194 -65048 -422887
8367 -422887 -433027 -118354 -244472 152846 -74696 -44320 14220 -82749 -285421 -40250 -8479
8355 72008 -227732 -35214 143239 -183303 -286613 -9849 -258116 59325 -352180 -193318 25731
8343 -206851 -123970 -180309 -12491 167107 11661 61029 -39096 100579 -156835 -209042 178445
8331 308603 -116513 166584 -432457 -295879 355440 -196722 -284006 184670 -52611 -65522
8321 -65522 -34550 -3773 -125162 84313 -85955 51846 -85014 -84189 -149102 -327050 -550278 -139734
8308 -328839 -40679 -242595 6204 -74770 -65090 -256829 -92676 123412 112083 201580 -304081
8296 -217418 -181237 96212 63475 55142 -75007 -624128 121576 -200074 -334621 -89987 -192762
8285 -192762 11749 -77666 -118349 -444548 -6917 -12937 126885 45014 -97328 6089 -275201 -90292
8272 49924 137927 -38058 140445 460522 -401838 -116819 238741 64295 -233153 -267907 163699
8260 -192499 -164697 161681 -228587 -42484 77539 -131338 -262817 -283637 11564 -127006 -193222
8249 -193222 -244994 -91115 182676 -239691 112317 146265 -95525 -6312 41805 -33169 -186723
8238 -186723 -319113 45795 90813 210351 -91959 -67849 -119547 10423 -230925 -90566 -113345
8227 -113345 125951 65436 64008 -2432 17837 185076 105335 -308517 -42671 -20424 107358
8215 30904 165289 14920 -249144 156409 -27577 147110 -45252 177080 -87746 -176731 128016
8203 30245 304441 81491 -100635 -378206 -29144 -159354 -172665 87068 103803 -141511 -67526
8191 -137724 -50504 -169980 7973 99418 -309844 96471 -92318 56171 171655 -119653 246381
8179 45206 -139033 162768 -68115 -244532 93353 361244 209943 -72648 -184510 -221005 -345662
8168 -345662 -30579 -47593 -200606 -178429 -152474 -196736 -36601 189497 156733 -32594 101363
8156 291899 -104106 -25461 -77920 -147537 20245 -62981 -79002 -13834 217033 -319606 -172940
8145 -172940 170 -143917 20366 -47727 -202875 -89807 -69 -141901 -124466 44641 -96246 212476
8132 93597 -98193 105949 173851 -419524 -5704 -17941 -10837 195729 -117421 70221 32373
8120 -193959 -227162 -96271 -78869 -237837 311485 -79685 -312044 70399 9525 -157740 -247620
8109 -247620 348904 -33410 62838 228886 -167195 -30278 -285819 -69829 -313155 92178 -414798
8097 181741 147063 -127472 -86127 63783 306774 -123117 71188 -48493 441843 -125875 27136
8085 -341507 -131144 -410142 -115915 -209411 -232681 -138174 -172774 -234655 -253632 90945 -148556
8073 101790 -133146 55380 -73486 -196894 -61722 -99854 -312523 158341 -36399 43269 -53206
8061 23591 -15709 -3160 -12779 -229260 81594 -165858 -181633 -52371 -60976 -145697 14645 -256463
8048 -17414 -48014 -107649 30923 68581 -307138 -229399 210150 14527 272933 5719 -141357
8036 -50899 -85475 80166 230690 -9792 -393960 330973 120028 21522 114399 -118421 -326268
8025 -326268 -78256 -45031 121005 76242 154651 -10316 -295126 115913 -9718 -156149 -81192
8014 -81192 -172906 -126347 -231186 -235074 151773 -218608 -231879 -155084 -135526 -113067 118787
8002 -134116 52697 88066 110181 -16794 -218288 94745 -298863 -181026 -285872 -281835 -98928
7990 -209774 192235 -328579 13025 222916 146455 -140606 -115251 14308 -279935 -304560 44918
7978 -309414 140707 -121915 197571 201379 62807 2963 35966 68085 -121286 270728 111167
7966 183038 -257738 -110827 114016 -169547 98459 -31751 -77562 26828 31715 -30556 -81831
7955 -81831 37408 231953 -112934 -19800 -232273 -190521 -256804 -105463 -137631 131033 170500
7944 170500 -31707 162976 -184495 177919 128624 204540 -426704 -117385 154124 -220206
7933 -230285 7671 105524 -111033 -126745 -218676 -234593 -87476 -2567 249606 -20261 63101 200731
7921 200731 -152261 181199 231154 -268323 -89179 -273064 -205322 -74467 -27306 307689 -184110
7909 -274569 224465 99227 51912 -146633 168220 -40698 -8962 -173403 -121304 -58955 -113420
7898 -113420 97773 -345910 43926 -4793 16012 104791 -26108 185140 -294322 -138869 -229110
7887 -229110 201426 -314273 134046 -276321 56334 -176480 -85043 39933 -5242 -131461 43193
7875 186739 225956 161540 226896 38187 -2218 -25415 48566 130080 -34753 -388061 -137117
7863 -73150 -142599 -289342 -131125 116686 -99446 -14513 211454 -264564 240512 51905 63141
7852 63141 107589 -61236 10074 -144324 -79537 -115518 -240529 -83885 15283 -218267 237048
7840 -632765 -138357 208675 -50534 -84448 127324 170795 -37977 95371 -127144 8896 62115
7829 62115 275342 -106871 -127019 95689 136121 -30094 121184 -327573 -10957 -195887 105410
7817 -233611 -13953 211063 -264171 -228796 563296 146200 -333194 -99724 62257 -131087
7806 58534 -94283 109910 62321 -165511 329282 -14750 153682 162732 -51429 -207673 -80559
7794 -64150 -187908 -40202 -35726 -31830 -122563 -300656 -369676 3853 125558 -33699 476798 -36569
7781 -49300 -217788 -155404 -102016 -203605 364678 -140063 147499 -17082 11616 -41282 -75703
7770 -75703 -4458 13238 -103992 -122374 -398936 -126891 -10769 -274931 -95872 -172262 76563
7758 -59843 -73584 70738 -161712 -67704 -99739 -68509 -100034 151429 65434 -4623 -281192
7747 -281192 -20666 -256879 -196971 17594 306358 -145155 -423974 59630 62733 10990 -248646
7735 -355382 -15178 -309067 -280222 54693 171618 82518 -314699 -64655 248259 -36256 -484741
7724 -484741 -63055 -106740 65034 -111046 265224 -215312 -139333 -206319 51119 -240976 82817
7712 183428 -129730 56089 -3110 97603 -220955 -158734 -297184 -73590 33697 28824 180357
7701 180357 -197757 -106530 304339 -4159 -241667 299361 158471 -83779 30967 -58082 -178234
7690 -178234 78165 208908 220229 -77448 127125 429488 -173259 300910 -245067 -287888
7680 -287888 -264544 184155 -134486 -83197 -155742 -148159 -358 -57839 18086 -146619 -23236 -266441
7668 -266441 -433781 284033 -79323 180575 -186215 203730 29483 30717 -60181 54153 45909
7657 45909 -144938 -264181 -113321 -114505 -66021 -226020 -51957 177872 139843 -15606 129046
7645 154312 40260 12159 -295774 -369593 -7709 -495846 -209677 -21841 70709 -75703 35529
7633 -14472 -246783 37712 89702 -145611 -224683 -17706 50175 126618 -424816 151993 -206033
7621 -70138 91185 8929 33192 -120813 -8243 -239729 78423 23385 81999 63425 -95378 -292010
7609 -292010 137331 -165002 104068 211158 -176197 -263141 -107688 45227 185547 -168736
7598 -172635 34779 -126355 69236 -96765 15923 -51817 138079 -2391 5789 -131736 98066
7586 85045 117173 -273343 88305 98261 -362842 -54231 326099 201989 -170914 137982 -44955
7574 52112 142812 -268637 13455 -75319 -31957 -52344 306277 60660 -198156 150658 366701
7563 366701 -210560 243260 -235261 -126270 131268 -210644 -205400 -139351 122028 213759
7553 213759 -198946 -222008 -1449 3920 141898 243084 229608 -92602 -77499 81271 -305368
7541 -38387 68106 38902 -23716 -65619 -272209 -312154 65853 103217 74610 431894 -80282
7529 123656 14462 -158775 -11105 239595 290838 60243 -102560 84280 126291 -2562 -151191
7518 -151191 -105237 174061 153099 -192525 -468610 55159 262655 -439005 124249 -240278
7507 -22760 122292 -162926 -66938 -229977 -56882 188571 223848 -9021 79736 -71309 203262
7495 -491857 349289 -109017 120168 150653 -109921 -159193 -166951 42042 299391 248081 355113
7484 355113 -161027 176446 -149879 -126754 -12621 -432772 55382 -210049 -143188 -161407 -268519
7473 -268519 -268559 -18081 -134650 -55741 -124318 -114694 -99160 44754 -249789 122253 62349 66356
7461 66356 168439 49071 -337927 16279 4857 -207757 36192 24576 142464 -353000 167978
7449 250525 -235102 -210483 20376 -411893 -199918 -75072 77244 -3502 103191 -147682 81013
7437 -33822 -467426 32054 -349117 -428483 109381 183449 165116 -242070 -204117 52413 -3055
7425 -303682 -157198 10483 121125 -30025 -202875 -221090 -50855 175894 -870 100299 -164239
7413 -174649 -119967 155353 -165155 68737 -394601 -209605 68944 -37455 -271748 -170292
7403 -170292 -236862 84799 81805 -77116 -4313 -73228 48891 -22626 -111997 -42460 133006 -48676
7390 -84612 101566 -63586 80944 26322 -19491 292224 -52341 105229 336958 -147038 170721
7378 -251269 184233 -94426 49652 -105133 15029 -94164 -102622 209041 -19123 -25597 -357214
7367 -357214 34732 -67759 -14908 -93055 -87275 2140 69782 -50962 -328278 -155590 -48686 242814
7354 -22607 133884 248590 321695 -244890 -129188 -427587 218321 73537 -373847 67775
7343 -132903 -72836 155064 -76062 60088 -339671 30948 -36787 -264398 -167871 115227 -138348
7331 -270659 -4455 -212848 166113 126593 -191859 -266472 105900 -393055 -40771 -71291 -155830
7320 -155830 21981 90308 121676 125382 24492 18682 132396 -66274 189049 -103042 -164410
7309 -164410 -31702 -74356 184232 -67336 63598 189100 -38888 -269958 95920 169948 -59408
7297 76225 147128 -7452 -32533 -223003 -108983 140745 -21840 -154749 270369 -430440 -73879
7285 196342 92769 101547 -64752 146483 53934 -146744 -302103 -83567 -25661 76420 334878
7274 334878 -75796 -26304 61101 13076 -4476 -283129 18670 364267 -141656 -50872 134903
7262 153806 -143467 22199 214961 346807 -142221 282408 398460 14237 -324560 18700
7251 210689 18079 243468 -16466 189059 -164621 178780 -290038 -126446 -115465 142259
7240 -86570 114810 -120605 -164120 63249 129721 149574 -241589 -268386 -219451 -32411 216608
7228 -41803 -170419 -42290 -209345 -170717 -410863 -97049 19209 -9235 6056 286754 -134643
7216 56423 -277937 -14364 -164117 82632 91368 -1572 -14514 148225 -160526 -103650 -156991
7205 -156991 -123506 238417 286600 107439 -76813 4098 -20966 181292 79441 59790 120880
7194 120880 -65651 352718 -88899 -85503 -99444 -72552 138598 90927 -3435 -185302 11804
7182 -223185 -11194 -11428 -1986 -453739 -190378 -274346 -71156 -157924 -156752 -326649 21493 63240
7170 63240 -220007 -15051 216702 -336016 31562 -23480 -83461 -222159 -176017 -106543 -256786
7159 -256786 151994 254535 -123277 33220 -184426 1565 -20168 -428213 -24845 366454 -312239
7147 -160683 -45637 69200 25716 67193 -27048 -77673 183666 7548 -86996 -207613 -18241
7135 305582 -43252 -32113 -52287 280967 18711 114605 134960 34319 -43229 -196383 -88919
7123 123981 -246576 -195012 340636 -319100 -147620 -214295 73649 182297 235354 -9228 178612
7111 -13019 -73036 191956 -30041 -137307 -139327 134212 -212811 -173811 117751 -276923 -110659
7099 -123348 -248074 -243959 5375 -177864 132995 187168 -280217 -164322 -26316 -40656 145401
7087 102393 -133694 -313803 193219 86455 78356 -50997 -257024 56112 -25419 55026 -133242
7075 -47293 -76146 -8297 -38688 -82823 -18687 -207320 18672 -375023 116131 186615 -219154
7063 -143492 -178971 -76504 -170827 93524 -58061 238647 26459 16377 -225412 -42813 -96308
7052 -96308 -347442 -56942 -175595 -259811 25048 -45708 -57635 -236230 -177684 48939 -128593
7040 48523 187116 176810 312142 -104844 -115601 -57105 54174 -86015 -84315 -32925 -150699
7029 -150699 196502 -165551 402459 -311163 -275035 -42892 -315197 -40595 9534 -19562 256082
7017 270059 -149149 96249 -222130 -139245 -148579 -316342 257358 220832 -129989 -178675 -206483
7006 -206483 47822 -14850 202733 112868 214697 17453 -42332 -120698 -46766 86808 -215170
6994 -185495 42715 -197513 -103798 106437 97459 -266202 85600 -449461 -408171 -401552 -35639
6982 -265062 -131673 -247870 -369805 -123316 230180 237297 -45617 45594 -96465 17030 120087
6971 120087 100062 113095 210894 -36389 26270 390755 -304992 -37620 -183132 54114 -367656
6959 69081 88913 -371659 39729 -171153 -12586 157436 -20616 169954 73196 -213552 223231
6947 107449 457746 145667 66488 10476 144353 -63672 -109233 62188 -160778 158110 -85735
6935 -237825 205516 -306462 219143 185516 -186015 113085 -75796 -385516 -67672 -164025
6925 -164025 41807 -129233 -211968 -165164 191584 -40085 -247392 387365 409405 -3022 236725
6913 106589 -11996 -21800 195386 -56904 270106 97135 155059 -47160 269502 -76257 -65105
6902 -65105 44376 94224 -111817 -175828 -173814 203040 150493 162399 54569 -108932 -152322
6891 -152322 146040 -134691 -74125 -229345 123814 -395716 -61644 134856 -68814 7493 300664
6880 300664 -151646 -111983 -98870 131165 221892 -96887 136848 -66058 90407 28185 47919
6869 47919 -277713 -23143 -320569 -57303 106019 -224698 48107 -166328 106716 -76756 -203612
6858 -203612 214942 -288459 -47046 26038 -322788 -117160 11854 -159491 140708 -173255
6847 -167432 246155 260559 387085 -118374 -191154 -203106 38201 210966 131924 325812 55429
6835 -117180 -158672 -61609 119937 -53673 -220724 45881 269566 12746 -144386 51449 -126600
6823 235295 130989 -150240 -239187 196676 -229015 -2394 -3706 441176 -23306 42021 -553685
6811 -165835 273587 -13240 54757 341318 147430 120008 -229294 125434 -76726 7349 104904
6800 104904 244065 -184172 -16846 -50392 -49860 144082 107838 36979 -75814 -114452 -40625
6788 -153324 -214880 -51554 -138781 -26741 -292233 199642 -285823 -69035 -303903 301937 87028
6776 148729 121291 -6071 -125750 -62812 51865 -118026 -17669 -82435 -209850 38170 -211172
6764 140329 150198 166862 331999 -231073 101508 -111747 -191094 102068 -127646 149952
6753 25240 296991 -374094 202441 -7075 203129 -145334 -232931 -133119 151289 -35911 -239704
6742 -239704 -121751 -274730 -153163 72123 -203435 111699 -119195 34429 315926 -293133
6731 171873 22626 76010 187903 -205049 481416 257008 -12300 -130288 -73545 2460 -391862
6719 -107588 540738 137814 -36328 -97273 549 150662 -54772 27977 -122576 93604 108022
6708 108022 -66263 -264331 -179749 96588 -59220 -261833 -132270 139226 26792 113354 -99016
6696 -131451 -92471 -285812 25470 -178819 -88956 50706 -106318 137023 -184632 -24919 -212546
6685 -212546 238106 -268200 -333670 -110787 239561 64446 -23891 -487881 -45362 -416796
6675 -416796 89533 262697 225369 -79855 -112085 46481 97052 -68652 -47712 308272 -134847
6663 -70495 118982 160767 -402676 49345 -43375 -70208 -51479 171139 -388336 -237616 7293
6651 -37377 27720 -6673 15668 -141642 116467 -57515 -36280 -195661 25987 -14285 311330
6639 -118997 -120473 6623 -209361 -124832 31016 6266 -150032 513572 181101 -50963 -73232
6628 -73232 -146599 -110025 -40610 -58967 -55981 213662 -285930 59987 205689 152339 -276530
6616 -238368 -5185 -130029 -131908 -111482 25587 -238137 201007 5009 108107 -165585 283220
6604 -177153 -605680 -14836 41241 -30840 109766 -150002 -156094 -40367 -62434 -178850 106328
6592 256375 261119 -432628 -158768 -26865 -195907 63006 13061 -43223 186415 49525 -273248
6580 -141189 -109686 56394 275985 -253133 128131 180196 -149091 -145882 -65582 466718 277391
6569 277391 96886 64613 266470 -31049 147398 10973 -87972 64800 -351171 -2353 283448
6557 109481 -162298 -5916 -98501 -32842 110570 -52523 59495 -70399 -202056 -138759 -40118
6545 104062 58048 115139 -21578 45824 154235 61229 -251085 143737 42821 -45054 -107739
6534 -107739 108973 51258 -44755 -147783 -15205 -167121 -114014 353370 40129 -86716 77535
6522 -138076 -69745 -135508 363294 -100045 -9571 -204794 42874 92908 182180 110027 -113157
6510 -77740 40597 119094 7472 -162930 159827 86847 -172329 -71110 -244757 55847 -1826
6498 58179 -90917 192795 -116733 -395674 42565 -50675 177859 -28649 -120491 218604 -162436
6486 60776 66579 -150672 205580 291078 256216 4998 123738 95496 54536 -89761 105984
6474 -113137 142306 142585 -178978 -23822 -186688 229872 54542 -183236 38389 -136263 49071
6462 110721 118122 13397 55284 231509 465336 -242465 -415194 203657 149195 -31358 -304115
6451 -304115 190892 -18199 -24119 -134850 114248 -87997 -84918 -91213 -114749 -156524 289835
6439 -316056 -106211 198494 24814 -156483 -236209 225404 -91303 -127907 -862 -99084 -49384
6427 84258 300008 211128 -82672 -130178 -243673 -90804 88116 80933 138432 621 157232 -63760
6414 -226954 85165 255567 29616 -2508 -85937 -314983 -43207 143163 -39717 -202245 -37797
6402 -136798 -218107 -160745 130605 -124479 -81802 -321587 80596 -208698 -307438 89903 47469
6391 47469 -378620 97682 231615 -234388 260733 -247515 2880 -30302 -106039 19151 -14804
6379 192828 -217256 -363069 264990 118839 -146023 -268131 191734 133697 225455 -154724
6368 27904 333383 3345 -157342 -111163 322212 433489 -299293 -145448 221712 -78551 -102534
6357 -102534 -280474 158959 -72618 -34988 93531 25919 -98417 60908 -13422 -157087 -185870
6346 -185870 29232 -132542 75278 46950 244401 82423 11962 338272 -307375 45007 -75822
6334 67334 -129482 20999 -106206 82314 -210344 4065 89040 -22424 72030 -58929 192447
6322 298700 -268770 -8332 -285236 150852 -196642 57318 -71355 193650 -110073 95662 571
6310 -120936 -256311 -225513 -250069 57788 12763 -34671 26580 -194336 89589 141741 -102378
6298 -271771 9090 -77260 -181761 273834 204052 238400 -169639 -178247 67383 438491 360062
6287 360062 -74546 143742 -182510 -22843 -20582 60798 -9338 -61521 -338698 5596 67683 274631
6275 274631 -134174 -77038 11723 -167254 -282019 -241334 26080 -83313 173430 -53663 -410018
6264 -410018 149702 -204181 236279 52173 -249638 -213855 28885 125434 159841 -25657 38062
6252 -291879 122166 130538 9326 91792 -65820 79744 219877 -134404 -183597 397963 -79096
6240 -234388 -213427 -295429 -201208 204115 -94960 207051 224152 99908 107281 -341811 -117930
6228 22343 93248 -248896 123502 139829 315070 333394 40474 -327607 64451 -26560 -124950
6217 -124950 -37650 58114 -99175 -163459 302143 112179 -76882 37471 26464 67755 297642
6206 297642 122088 132711 359104 270437 -6309 14623 206792 -45047 196405 -103801 -13603
6194 -68636 -67279 309528 -58622 -217115 117215 -4564 82335 -107241 -174864 -117750 69324
6182 -501897 -57433 237674 -21509 -56726 -218939 139366 152084 19833 8766 -33097 -155859
6171 -155859 -195445 327886 -74692 -8114 -195577 160184 246265 108075 -455711 94542 41822
6159 -267399 -177149 -61476 -98360 -28386 -47883 15730 12130 48694 -49070 -22627 105553 -39157
6146 -127420 104217 157616 -97035 -948 252407 99355 59396 -210141 -41238 -114465 -149706
6135 -149706 -331874 -107380 60371 217443 115045 -21828 318122 -227497 -90694 177760
6124 -167443 256896 -274199 -174947 -116440 262347 231000 -125710 301143 171253 -142276
6113 -137660 111041 351240 -120907 201942 -58404 -20167 -87643 -16422 107993 -259889
6102 -263361 160453 96504 281315 -92040 -44460 -241113 -371961 137996 -30074 -1129 -103921
6091 -103921 56930 -63695 -128485 -232309 -68089 -10958 21125 194100 115775 -128918 121893
6079 -70665 391276 -266262 -8437 29595 -41617 128087 -121025 -179035 249319 -170148 -211152
6068 -211152 -240453 83853 64313 -204075 57852 -70800 -218479 59851 66361 -252666 -7436
6056 77953 -191140 196134 24126 -26551 -14183 17495 76156 -88817 -38481 33057 81388
6045 81388 -376711 148494 -236149 -2650 -43031 -166212 9651 4948 -115344 256778 -69631
6033 223126 -214776 9257 -174389 206962 -185735 117417 149537 195421 88135 -178916 -70547
6021 271727 -201410 -76829 -158940 74422 -150335 -305079 -171355 33925 19672 -3635 117590
6009 42526 -152765 371721 151798 -127397 -14623 -146731 55396 167058 3375 294707 -161419
5997 -210030 128090 87561 -239359 -65313 -20987 -19975 -34473 203801 278339 -191872 -14349
5985 17333 -146656 73393 207340 1682 -84325 -196922 70887 -72290 -76339 121831 -61042
5973 -82211 84987 -136032 -48729 -197759 112175 -9297 -368327 -58171 -150848 278131 59728
5961 -41155 292207 90985 136411 -197937 78894 296838 -94817 -73104 -97422 -150055 362713
5949 90980 12396 19214 -90218 281679 29290 32033 220823 -92669 -54470 -43501 -47165 48201
5936 187165 -2754 -185270 -63351 85922 26996 -190866 181341 -28157 30301 -215032 -339697
5925 -339697 -76879 116244 96105 -215583 16217 -190375 -117666 -58822 -116222 106629 -188223
5913 -56979 142137 163599 104818 -274479 23123 -428296 362914 -271618 117677 -330541
5902 -14727 -42123 155294 -141178 37314 -23086 135397 29553 -172565 221172 101027 -118419
5890 95543 -70287 191152 134221 -193216 122027 242940 211188 189990 269769 237230 4456
5878 -24261 165862 18403 180942 125006 164402 37293 -235787 361002 158359 -87576 134335
5866 -116583 -28202 55118 313774 -154674 20405 -214733 65935 -243435 -100506 299640
5855 -92968 93553 10663 -38041 -78486 53901 -387075 -142649 -323886 11296 310931 47202
5843 -32751 73697 99305 -43795 116089 228533 -12437 -29014 49431 76721 -110462 -38421
5831 -220056 64749 -162663 -351424 265700 -12771 -92122 134243 9887 -80552 39115 9439
5819 204542 -146451 251899 79780 -175402 125533 65700 204662 85535 -91236 -133339 567585
5807 -186998 -219343 -376083 291335 132685 -27158 -129542 -97007 125026 -195726 -190232 -53263
5795 120280 -35266 204590 160449 -161288 -202588 299648 -309579 276945 9601 -469908 109570
5783 -124871 -86687 156043 -23287 -57542 66317 -364211 -89407 71238 -394911 88100 62854
5772 62854 97342 224932 115883 -162968 -306314 13341 -203306 -3509 -93162 59219 -220119
5760 -51736 -41640 -132848 61692 127969 13629 -179887 145435 -56709 199566 -29073 16818
5748 26146 -40645 -75155 -78915 -272196 -384399 -436442 172819 82626 152077 318607 131284
5736 -50378 178938 -154347 -38724 228364 54545 -244577 52993 145713 -74778 -65666 37168
5724 20858 104376 -233353 142093 -36174 190979 36024 271284 126455 219771 -241711 -102908
5712 415028 -52102 -212708 196696 367531 120701 54551 -97850 -604917 67190 111667 228630
5701 228630 -23884 -148878 192135 218706 377494 -81645 35066 210442 -350066 -104805
5690 -177309 170230 -148874 -170057 -86181 171667 135830 256655 201194 -10216 62127 8986
5678 -168921 -205792 -192556 -34132 -211930 156598 5992 82324 -73791 -208897 -134364 -210373
5667 -210373 -160973 70678 -79643 -177410 -68080 88263 -166951 -287379 -348136 404500 27216
5655 20062 -289219 131632 -39311 48886 -317615 18964 -153925 274009 -172131 113890
5644 -78779 -127371 226260 114403 51263 -262134 -175838 77188 -320831 -84678 -165467 -187005
5633 -187005 186198 -76952 -374247 -41265 -31188 396823 -3676 -27783 15749 15426 45460 -162517
5620 59555 85009 -95631 77074 324982 -108877 315867 15920 -101318 -48027 162481 182849
5609 182849 52143 26904 -367449 -17808 195210 -57583 248731 239389 7734 87112 -457109
5597 142953 -100813 97524 -163114 29709 73019 -321866 62751 75545 167171 -52339 -55827
5586 -55827 -51278 37878 -16729 -60061 -69369 122235 -95691 -79994 98562 -141814 47020 202818
5574 202818 152381 -3866 296706 -222917 -315874 266886 122615 93670 -107309 -39958 -70476
5563 -70476 -13403 229772 -94861 238783 -8047 81546 -221865 -113067 -128175 461373 -184017
5551 -1292 -194819 -53179 -390330 52761 4974 238096 -189122 3075 32651 115627 -55282 -7258
5538 377730 -76665 252670 -48240 121719 13753 -72995 168832 71126 -387333 98630 135214
5527 135214 -67252 232770 75518 -294232 68189 112173 -30262 67553 9542 -186545 -101637
5516 -101637 -194891 59741 -42863 -2895 -172665 -41729 -397868 354608 283752 6210 -104416
5504 257878 -25061 85946 -12350 -6069 -117611 75848 -186517 -294145 -112649 -225669 56302
5492 67797 -74523 -63848 29021 -259682 170761 -82646 33298 210373 28961 -8876 -178083
5481 -178083 193085 -132763 -114486 47705 149130 -144618 123312 -368687 -136438 169461
5470 -235966 -69117 104353 -65708 -57925 226178 16745 -71802 217684 261877 30204 -96534
5458 -112574 172893 -35826 504797 -182812 -208564 9844 -17765 -66995 157400 218858 -44785
5446 -193197 114436 141556 234579 -29924 110727 64809 -271142 16652 -140934 -232152 -90499
5434 -76560 -278119 62511 -194186 8320 -140678 211504 35752 -113425 26294 225585 -65749
5422 67348 -97258 61847 145090 211774 -150230 232789 -30048 2383 -23011 -266957 -6836 -9405
5410 -9405 -200991 119929 -96147 -119115 -47444 -201285 208117 234391 -35378 -250049 -297268
5399 -297268 50635 89730 -254194 -132415 161680 115133 -45030 -117827 -37095 -4762 78275
5387 -207568 204917 24615 117413 -101810 173832 312740 -172927 81395 17668 170592
5377 170592 -2811 138612 36764 -557863 -8524 -95197 -195414 30411 -138586 90956 120701
5366 120701 -117140 -46020 -233468 -60359 -201976 -88522 -131719 -155590 148157 215224 3933
5354 -255984 -110380 -50242 -112761 -90827 -163818 239969 140977 -160994 286084 -42464 -170060
5343 -170060 -281383 54581 -254733 -224379 -100241 -133328 498982 -34368 129228 112170 156323
5332 156323 169534 -127028 -197878 -212366 -2379 30954 -56043 14377 -4572 54622 227319 -20217
5319 86982 -99030 -178589 -181672 107626 -13903 179626 96950 179613 -79584 -418931 -58789
5307 -85517 -18150 115527 118468 -177122 -201185 390353 119719 156407 52502 -142940 303740
5295 199039 -155463 -30782 408293 103763 -111924 -119441 -88935 186090 -237338 108037
5284 93797 -204574 -67353 110776 119894 250867 245718 141093 72168 20645 -59133 235592
5272 169462 -40369 -68374 -280077 -233297 -83183 299681 199330 -179230 -40043 -59547 32373
5260 -82866 174315 -19873 -206393 161215 -85597 196369 189871 27442 -145811 -34628 167588
5248 267364 -21881 281779 -271841 136038 -184438 -375661 -45814 -257294 50640 48457 -195941
5236 29038 386944 226202 -183718 -166098 9834 -173796 111826 145129 221886 -41197 80556
5224 -259466 -49719 212046 -100134 214752 158045 -73568 -244666 -107206 -69655 216041
5213 -692 66439 204708 64251 -180711 -362327 33460 -69230 110551 155607 -49425 57854
5201 -8584 -108862 -253497 -21616 254071 420751 480674 68910 61915 370912 -161707 171586
5189 232199 -6662 261235 -80184 -213988 94191 182199 302665 -114407 -184208 -3899 139488
5177 261996 127268 -42921 -216025 -31980 267750 82095 89974 -150842 -67692 -352694 169928
5165 94496 32503 79867 -223093 214932 62705 -186295 -45709 -153109 40026 38598 -104477
5153 146333 285826 -101054 62411 293139 -320645 190156 90280 -303972 257575 305041
5143 305041 134518 -78049 173514 47637 169811 556185 -1524 154330 -294138 -206893 -51304
5131 -207249 -181818 -166521 -142871 -3518 202488 105510 179480 -354296 -4246 -126726 217895
5119 -21790 230367 -3277 88024 -255313 198090 -136545 -84958 4701 -132695 -225015 -52059
5107 -180097 -57970 141714 280170 4436 86637 -44272 -290682 241031 354948 -32562 -200823
5096 -200823 -68806 -66885 -36772 57003 62778 442 -10196 41390 -23432 -403342 256689 131228
5084 131228 -216510 102718 31032 -136646 -209446 -20116 -71447 67960 -78057 -97303 -46899
5072 37636 174211 385482 208159 -78311 -136244 -108860 153454 -79178 38767 50129 68014
5061 68014 33634 -225840 -23649 -91302 304880 -92272 -143023 -85791 -238364 35784 -76270
5049 -206843 140070 -245281 -131063 -312610 229932 -141875 189384 173945 -120849 -131663
5039 -131663 -259262 132058 121077 182631 -184223 52429 -10351 30933 153229 240637 47432
5027 -14541 -56026 -191748 -8580 -1370 287464 -16909 11415 448218 41453 -68060 -139016 -72076
5015 -72076 -219616 69985 -229034 -211430 -16979 -116196 190632 -241934 -259269 107357 -188349
5003 -124237 115900 23435 68519 -19738 -54446 137111 125043 -217443 133005 -60262 -48192
4992 -48192 145179 -53626 -55841 -140046 -65348 25955 -203019 119687 -39270 190775 28952
4980 48039 -173425 -39453 -309173 76716 81299 39199 -138847 -244680 -17001 302554 -150379
4968 -31789 -56010 -145626 91756 261289 -5541 80900 64510 277456 -100779 -12424 11856
4956 -4097 38037 231836 -59978 67868 -45490 98584 -20600 298000 -101997 209758 -36542
4944 77588 -336521 212825 -72269 -6566 195215 -141698 -16563 58286 -61297 86355 -64885
4932 -543784 248960 -277769 170758 15028 237649 -477183 -4787 -6973 56310 -293495 -118395
4920 157846 -153703 147886 -182606 -80644 -24479 144995 31773 81273 -124904 -323097
4910 -323097 -49161 -427817 -165022 366079 225271 97115 -96690 18606 -97863 -177904 144265
4898 4774 13959 16593 154317 58832 -101282 157518 77120 -55290 -55285 -101072 -29666 45717 141363
4885 141363 3479 108644 -168845 -90581 233210 381344 104535 -351000 21138 63618 224116
4874 224116 -38636 447115 113173 218391 -18760 152077 182486 -80488 -4163 -191168 -61581
4862 84503 -257009 170029 -95486 -49123 -179529 71868 227893 81803 252946 -67026 204583
4850 91179 -43375 -77066 -121393 36931 -69270 -20288 -136099 138986 -69314 23305 90271
4839 90271 47112 -100972 147426 356258 -4177 118693 2513 92448 298922 -36271 77780
4827 -26233 102833 -1296 -36099 106830 140071 29149 1882 -349016 180795 -166853 -590869
4816 -590869 24157 -32555 83278 133302 334586 -147741 -114140 113715 -189607 -153001 -264082
4805 -264082 -42037 -40414 40128 -88994 -129018 168354 214850 -104286 -152864 5566 222408
4794 222408 185577 -129388 144217 -262636 242254 101979 114744 -29197 9731 -226680 170573
4782 221569 59711 187003 133087 139187 89236 -75805 -24787 -197806 434574 184332 154612
4771 154612 378143 83637 -90698 -137302 -116620 133396 137673 125329 252092 -393941 -20885
4759 -163163 150229 43151 68358 -58638 -42778 -179519 29008 -176489 -190595 216492 -27393
4747 -23603 -40637 128370 112564 -103263 109244 -9872 -20016 -148678 -329204 58927 -70788
4735 31836 -70034 -299325 128247 15054 94210 291452 290050 149665 -51120 -108899 -315038
4724 -315038 515 -46224 60588 242801 111005 176502 64936 -126979 104133 -187328 123491
4712 -4560 -159872 -65211 -41203 -11688 -49337 -173014 -227938 150485 -451819 227999 -126217
4700 113651 85508 -168166 -9662 52675 58862 -177240 19952 -93218 -24374 -81533 8138 -46580
4687 -135997 70798 51566 -65558 61105 125754 -2312 -170874 100462 -87610 279089 -112960
4675 -33850 -328092 37257 -60510 -136662 138240 320798 2366 -3447 -122350 -21117 61409
4663 109078 -108389 349760 188741 258351 480970 -504762 109884 98906 -255357 -78458
4652 161545 -157553 18689 -9827 77074 349639 -112215 -260658 91699 11247 181496 6703
4640 99962 -84428 -176960 -96 -3140 -9516 -84275 -200348 -152005 -292272 171682 -31442 -201882
4628 -201882 -34948 135336 -5718 70888 40114 18253 362287 -65406 -240652 356472 183426
4617 183426 206814 -150568 312184 78732 165181 -108302 509582 -39482 48147 270195 111480
4605 36843 -177925 -113590 -211653 -92635 -167525 -109315 441712 -289272 -201513 109754 139642
4594 139642 89148 37619 152311 -48392 -419998 32167 346686 81598 -99025 -69689 -259299
4583 -259299 109635 69919 -284763 42254 -91794 89532 105398 -64953 -59656 213107 263931
4572 263931 -31068 -55569 173416 -95151 85463 55648 440136 298563 198598 520596 116337
4560 -42124 -6082 208066 166528 73998 120709 -122119 79949 -55063 165463 -210 -73944 -133020
4548 -133020 -113016 214995 -4794 -212831 38550 137962 -84196 -178364 40108 301711 -63898
4536 170887 252066 -97607 -132124 176096 -196747 -205261 -183023 -163840 -255519 215197 -22516
4524 -187174 211239 -89668 72216 43449 87145 63017 185036 -163752 166046 51769 257016
4513 257016 59435 37309 161316 36660 210746 -232779 32726 -72443 -3530 -42782 -112348
4502 -112348 158699 -186083 63970 -196813 204311 57402 -57920 -87268 175734 -35062 132002
4490 32815 -73272 -32719 -23891 23710 187640 -12099 -12971 248378 156044 3160 -59255 -14588
4477 -38525 -6409 237193 -101325 79163 -87638 -135162 -114556 374744 195292 -189792 222157
4465 111239 -186842 -219913 269125 -212597 186958 76486 -190561 -139170 415778 197049
$$ [...]
##END NTUPLES=NMR SPECTRUM
##END=
