
##TITLE=AC1352_CHIAH12170_6672572_iBDQRKUdyq
##JCAMPDX= 6.0         $$ Bruker NMR JCAMP-DX V2.0
##DATA TYPE= NMR SPECTRUM
##DATA CLASS= NTUPLES
##ORIGIN= BRUKER
##OWNER= Administrator
$$ 1.72 TOPSPIN		Version 2.1
$$ 2012-08-14 18:41:37.484 -0500  Administrator@TOPSPIN
$$ Compression mode = diff/dup
##.OBSERVE FREQUENCY= 400.02188249412
##.OBSERVE NUCLEUS= ^1H
##.ACQUISITION MODE= SIMULTANEOUS (DQD)
##.ACQUISITION SCHEME= undefined
##.AVERAGES= 8
##.DIGITISER RES= 22
##SPECTROMETER/DATA SYSTEM= spect
##.PULSE SEQUENCE= zg30
##.SOLVENT NAME= COFFEE_meoh
##.SHIFT REFERENCE= INTERNAL, COFFEE_meoh, 1, 14.98509
##AUDIT TRAIL= $$ (NUMBER, WHEN, WHO, WHERE, PROCESS, VERSION, WHAT)
$$ ##TITLE= Audit trail, TOPSPIN		Version 2.1
$$ ##JCAMPDX= 5.01
$$ ##ORIGIN= Bruker BioSpin GmbH
$$ ##OWNER= Administrator
$$ $$ C:\Bruker\TOPSPIN/data/COFFEE/nmr/AC1352_CHIAH12170_6672572_iBDQRKUdyq/10/pdata/1/auditp.txt
$$ ##AUDIT TRAIL=  $$ (NUMBER, WHEN, WHO, WHERE, PROCESS, VERSION, WHAT)
(   1,<2012-08-14 18:41:29.859 -0500>,<Administrator>,<TOPSPIN>,<go>,<TOPSPIN 2.1>,
      <created by zg
	started at 2012-08-14 18:40:23.281 -0500,
	POWCHK enabled, PULCHK disabled,
       configuration hash MD5:
       6B 1B 68 BB D9 2E 58 E2 7F 35 AD 54 07 DF 0E 41
       data hash MD5: 64K
       4A A8 4F 25 24 42 2A 86 7B AA 71 21 F2 1D EA 3F>)
(   2,<2012-08-14 18:41:32.906 -0500>,<Administrator>,<TOPSPIN>,<proc1d>,<TOPSPIN 2.1>,
      <Start of raw data processing
       efp LB = 0 FT_mod = 6 PKNL = 1 PHC0 = 0 PHC1 = 0 SI = 32K 
       data hash MD5: 32K
       6E 14 92 D4 BC 8B C6 28 CC 70 AE 2B D9 24 83 19>)
(   3,<2012-08-14 18:41:33.375 -0500>,<Administrator>,<TOPSPIN>,<proc1d>,<TOPSPIN 2.1>,
      <pk PHC0 = 176.9183 PHC1 = 0 
       data hash MD5: 32K
       B6 92 3E AF 8E 6B 1A 07 35 FD 70 D9 9D 93 6F 5A>)
(   4,<2012-08-14 18:41:33.453 -0500>,<Administrator>,<TOPSPIN>,<proc1d>,<TOPSPIN 2.1>,
      <abs ABSG = 1 
       data hash MD5: 32K
       D3 6E DB E2 F6 71 CA D4 E3 FC 69 52 1A BF 4B 3B>)
(   5,<2012-08-14 18:41:33.484 -0500>,<Administrator>,<TOPSPIN>,<proc1d>,<TOPSPIN 2.1>,
      <abs ABSG = 2 
       data hash MD5: 32K
       CA 4E 70 63 0F DC CA ED 1A 3F BE 22 1D D8 DB 40>)
(   6,<2012-08-14 18:41:33.515 -0500>,<Administrator>,<TOPSPIN>,<proc1d>,<TOPSPIN 2.1>,
      <abs ABSG = 3 
       data hash MD5: 32K
       31 79 93 DA E0 7C 44 F9 2F 47 F0 47 07 12 6E 88>)
(   7,<2012-08-14 18:41:33.546 -0500>,<Administrator>,<TOPSPIN>,<proc1d>,<TOPSPIN 2.1>,
      <abs ABSG = 4 
       data hash MD5: 32K
       7E C4 6D 6F 20 A5 BC 2D 8F 14 97 11 9A CB F9 96>)
(   8,<2012-08-14 18:41:33.578 -0500>,<Administrator>,<TOPSPIN>,<proc1d>,<TOPSPIN 2.1>,
      <abs ABSG = 5 
       data hash MD5: 32K
       04 9A CE B6 6C 6B 17 D2 16 95 62 33 A9 33 34 B0>)
$$ ##END=
$$ 
$$ $$ hash MD5
$$ $$ 80 FC 47 A9 CB 2B BC AE 1F 2B B6 15 67 FD C5 F1
##$RELAX= 
##$RELAX= 
##$RELAX= 
##$RELAX= 
##$RELAX= 
##$RELAX= 
##$RELAX= 
$$ Bruker specific parameters
$$ --------------------------
$$ [...]
150 150 150 150 150 150 150 150
##$TP07= 0
##$TPNAME0= <>
##$TPNAME1= <>
##$TPNAME2= <>
##$TPNAME3= <>
##$TPNAME4= <>
##$TPNAME5= <>
##$TPNAME6= <>
##$TPNAME7= <>
##$TPOAL= (0..7)
0.5 0.5 0.5 0.5 0.5 0.5 0.5 0.5
##$TPOFFS= (0..7)
0 0 0 0 0 0 0 0
##$TUNHIN= 0
##$TUNHOUT= 0
##$TUNXOUT= 0
##$USERA1= <user>
##$USERA2= <user>
##$USERA3= <user>
##$USERA4= <user>
##$USERA5= <user>
##$V9= 5
##$VALIST= <valist>
##$VCLIST= <CCCCCCCCCCCCCCC>
##$VD= 0
##$VDLIST= <DDDDDDDDDDDDDDD>
##$VPLIST= <PPPPPPPPPPPPPPP>
##$VTLIST= <TTTTTTTTTTTTTTT>
##$WBST= 1024
##$WBSW= 4
##$XGAIN= (0..3)
0 0 0 0
##$XL= 0
##$YL= 0
##$YMAX_a= 487113
##$YMIN_a= -618888
##$ZGOPTNS= <>
##$ZL1= 120
##$ZL2= 120
##$ZL3= 120
##$ZL4= 120
##$ABSF1= 14.98509
##$ABSF2= -5.573092
##$ABSG= 5
##$ABSL= 3
##$ALPHA= 0
##$AQORDER= 0
##$ASSFAC= 0
##$ASSFACI= 0
##$ASSFACX= 0
##$ASSWID= 0
##$AUNMP= <proc_prof1d_extract_pilot.lims>
##$AXLEFT= 0
##$AXNAME= <>
##$AXNUC= <1H>
##$AXRIGHT= 0
##$AXTYPE= 0
##$AXUNIT= <>
##$AZFE= 0.1
##$AZFW= 0.1
##$BCFW= 0
##$BC_mod= 0
##$BYTORDP= 0
##$COROFFS= 0
##$CY= 15
##$DATMOD= 1
##$DC= 0
##$DFILT= <>
##$DTYPP= 0
##$F1P= 0
##$F2P= 0
##$FCOR= 0.5
##$FTSIZE= 32768
##$FT_mod= 6
##$GAMMA= 0
##$GB= 0
##$INTBC= 1
##$INTSCL= 1
##$ISEN= 128
##$LB= 0
##$LEV0= 0
##$LPBIN= 0
##$MAXI= 10000
##$MC2= 0
##$MEAN= 0
##$ME_mod= 0
##$MI= 0
##$NCOEF= 0
##$NC_proc= -8
##$NLEV= 6
##$NOISF1= 0
##$NOISF2= 0
##$NSP= 0
##$NTH_PI= 0
##$NZP= 0
##$OFFSET= 14.98509
##$PC= 1
##$PHC0= 176.9183
##$PHC1= 0
##$PH_mod= 1
##$PKNL= yes
##$PPARMOD= 0
##$PPDIAG= 0
##$PPIPTYP= 0
##$PPMPNUM= 2147483647
##$PPRESOL= 1
##$PSCAL= 4
##$PSIGN= 0
##$PYNMP= <proc.py>
##$REVERSE= no
##$SF= 400.02
##$SI= 32768
##$SIGF1= 0
##$SIGF2= 0
##$SINO= 400
##$SIOLD= 32768
##$SPECTYP= <>
##$SREGLST= <1H.CDCl3>
##$SSB= 0
##$STSI= 32768
##$STSR= 0
##$SW_p= 8223.68421052631
##$SYMM= 0
##$S_DEV= 0
##$TDeff= 65536
##$TDoff= 0
##$TI= <>
##$TILT= no
##$TM1= 0
##$TM2= 0
##$TOPLEV= 0
##$USERP1= <user>
##$USERP2= <user>
##$USERP3= <user>
##$USERP4= <user>
##$USERP5= <user>
##$WDW= 1
##$XDIM= 32768
##$YMAX_p= 476896021
##$YMIN_p= -719126
##$CURPLOT= <Network HP LaserJet P1505>
##$CURPRIN= <$Network HP LaserJet P1505>
##$DFORMAT= <normdp>
##$LAYOUT= <+/1D_H.xwp>
##$LFORMAT= <normlp>
##$PFORMAT= <normpl>
##$SURQMSG= 1
$$ End of Bruker specific parameters
$$ ---------------------------------
##NTUPLES= NMR SPECTRUM
##VAR_NAME=  FREQUENCY,     SPECTRUM/REAL,   SPECTRUM/IMAG
##SYMBOL=    X,             R,               I
##VAR_TYPE=  INDEPENDENT,   DEPENDENT,       DEPENDENT
##VAR_FORM=  AFFN,          ASDF,            ASDF
##VAR_DIM=   32768,         32768,           32768
##UNITS=     HZ,            ARBITRARY UNITS, ARBITRARY UNITS
##FACTOR=    0.250966925370066, 1,           1
##FIRST=     8223.43324360094, -75778,       -334605
##LAST=      0,             -26350,          -131089
##MIN=       0,             -719126,         0
##MAX=       8223.43324360094, 476896021,    0
$$ Real data points
##PAGE= N=1
##DATA TABLE= (X++(R..R)), XYDATA
$$ [...]
19532G8128j5139h2125k57429c074k94310a13179B7133b25338b5959q4435A30035
19520d49395O5996a67854A88907a97522C18253j56747m9262a6288j37593C58632
19509I1136d3423A36672k8478a01668L7773F4389b51731a01435A04630K54635
19499C59265c43199c4687j40966j669P4286E8312B6086f293A02162A7326a20172
19487c00992q77A09332J15522j00751f1941j37139j44216P7121J14683E4849b38733
19475A24550b68300a11946L551L4076K2400j6132j34912g0897A55616a49237K9806
19464a19431o6369B26885a21334J7662M8080B3957b26059L7621j13273Q1966G1070
19452d6042k82367D045a06562B0304i8834A36305a06442F7285a57732o8858k79389
$$ plain form
19532 78128 62989 -82125 -339554 -3074 -297384 -113179 27133 -225338 -25959 -110394 130035
19520 -449395 -383399 -167854 188907 -197522 318253 161506 112244 -16288 -153881 358632
19509 91136 -43423 136672 108194 -101668 -63895 64389 -251731 -101435 104630 359265
19499 359265 -343199 -34687 -175653 -177322 -103036 58312 26086 -6293 102162 17326 -120172
19487 -300992 -301869 109332 224854 124103 -61941 -199080 -343296 -266175 -151492 54849 -238733
19475 124550 -268300 -111946 -108395 -74319 -51919 -68051 -202963 -70897 155616 -149237 -119431
19464 -119431 -185800 226885 -121334 -103672 -55592 23957 -226059 -188438 -301711 -219745 71070
19452 -46042 -328409 4045 -106562 20304 -98834 136305 -106442 67285 -157732 -226590 -505979
19441e05979a83189B18885I2332L8776l9247a64791A57104b14668B1730a24193
19430b51870Q2766A63787E888L5195K5798a4448k5013l14278a34745M6827l14159
19419d02077F5925b11376A38191b73209e8839A72759b70456A71039b10126M3595
19409a66531B79594A19827a25635e013j65478b1361k2678E3349a85665H4505d1812
19397A19417l4993c73249a15663L6379j09900Q1419H2823c9981j21470j09436
19387b70887h7265l7481B8980A0160L82477a35640A26946J39263b49451H1220
19376c03933a43939n7093A26048K835e8960B05433A059d12517A73904b81380d3644
19364b0693q3027M3414p4464g272j33193b8505o9269B18109a70326d3471k38529
$$ plain form
19441 -505979 -183189 218885 92332 131108 91861 -164791 157104 -214668 21730 -124193
19430 -251870 -169104 163787 5888 41083 66881 -14448 -39461 -353739 -134745 -87918 -402077
19419 -402077 65925 -211376 138191 -273209 -58839 172759 -270456 171039 -210126 -166531
19409 -166531 279594 119827 -125635 -5013 -170491 -21361 -44039 53349 -185665 84505 -41812
19397 119417 84424 -373249 -115663 -79284 -189184 -107765 82823 -39981 -161451 -270887
19387 -270887 -87265 -124746 28980 10160 392637 -135640 126946 266209 -249451 81220
19376 -303933 -143939 -201032 126048 128883 -58960 205433 1059 -412517 173904 -281380 -43644
19364 -20693 -103720 -60306 -134770 -7272 -140465 -28505 -97774 218109 -170326 -43471 -282000
19353b82000p5945a40024o214f7872A29548h4159A67176c0780j36250n7149B68676
19341f7472E2876C337a10083q5745f0994B1442L76341a78871f4551D8079a0294
19329A45772f4882b1407j28473M6179A47193l4879a38952b2242p4703B09679a82060
19317g383A03102a44893G5212b3597j20683p8890A02351a08168j75081L2900Q7637
19306a62712g983j75876g8059A13510C1858F406a22933j22193k2943g9314C06626
19294a68882j5451A70510a4550j54196n1027N9040A44105b42614B22465G7171
19283F6442c9232q0809D0139c31587A40621g280A16553O3456i7725j70719h4335
19271C703e2243F8105K23751a39629j06665a22602d7571A68003h6790B9161b0785
$$ plain form
19353 -282000 -357945 -140024 -146238 -67872 129548 -84159 167176 -30780 -167030 -224179 268676
19341 -67472 52876 3337 -110083 -195828 -60994 21442 397783 -178871 -64551 48079 -10294
19329 145772 -64882 -21407 -149880 -103701 147193 112314 -138952 -22242 -96945 209679 -182060
19317 -7383 103102 -144893 75212 -23597 -144280 -223170 102351 -108168 -283249 -250349 -162712
19306 -162712 -7983 -183859 -78059 113510 31858 6406 -122933 -245126 -268069 -79314 306626
19294 -168882 -184333 170510 -14550 -168746 -219773 -160733 144105 -242614 222465 77171
19283 66442 -39232 -120041 40139 -331587 140621 -7280 116553 180009 -97725 -268444 -84335
19271 3703 -52243 68105 291856 -139629 -246294 -122602 -47571 168003 -86790 29161 -20785
19259b43795e1614j97243r5164B85356g400o4840I2715N6726e9479k28443c1523
19247G3314b78511c6409A28548B896P1171C2504K25828b3891j92539h0739B06829
19235b3556j10870J3808k8196g2197B17371a37348B06180a52386O3518m3743C39847
19223a16539j61771E46425B12621C7523a72866p8818a10471A06265c07183a11390
19212i3979j21296Q1825F8592K17017A30814L48536a58010k75186c764j58350
19202a62114C24277f6512A07197K60164b24900R5429B08759p3239d47189D8779
19191c10890k71897a27778f0007b9166j7742B38763a58075m8303j77905A20734
19180a0460j36726A26618h3154A220i2285j26863A02561b09975j57649J64068
$$ plain form
19259 -243795 -51614 -248857 -344021 285356 -7400 -72240 92715 149441 -59479 -287922 -31523
19247 73314 -278511 -36409 128548 2896 74067 32504 258332 -23891 -216430 -80739 206829
19235 -23556 -134426 -120618 -148814 -72197 217371 -137348 206180 -152386 -88868 -132611 339847
19223 -116539 -278310 546425 212621 37523 -172866 -251684 -110471 106265 -307183 -111390
19212 -93979 -215275 -133450 68592 285609 130814 479350 -158010 -433196 -3764 -162114
19202 -162114 324277 -66512 107197 367361 -224900 -129471 208759 135520 -447189 48779
19191 -310890 -582787 -127778 -60007 -29166 -46908 238763 -158075 -206378 -384283 120734
19180 -10460 -147186 126618 -83154 1220 -92285 -219148 102561 -209975 -367624 -203556
19170b03556B73976D8516b59091B74328A17984d508G1063J867c87183h7271A89060
19158b11994K2164L1599j79431P2304A0711b47312N4098D4929g9708k88146a07432
19146A61831L8408E7935e49590b5105m98506c9148H9430j1770n465a43826N6401
19135h7425j41508K9395K5944o9295c4143j86441h0209R595a4455j0991k75330
19124c00776R4701b2329n1012A21511a63802L120F9630b20701J4649A50771f5018
19112A38287o5374l251f8483j24932D62456a22129A36873D6631K2383I659N9549
19101F9208g6896B16649J45051h6009A99525b0318B3322R0549D1956c41635g9570
19089i0710B38721b4885j24903A7660c4395k42090g2071k22892o0292A48594D451
$$ plain form
19170 -203556 273976 48516 -259091 274328 117984 -4508 71063 72930 -387183 -87271 189060
19158 -211994 -189830 -158231 -337662 -265358 10711 -247312 -193214 44929 -79708 -367854 -107432
19146 161831 200239 57935 -549590 -25105 -523611 -39148 89430 77660 72195 -143826 -87425
19135 -87425 -228933 -199538 -173594 -242889 -34143 -220584 -80209 -70614 -14455 -25446 -300776
19124 -300776 -206075 -22329 -73341 121511 -163802 -160682 69630 -220701 -206052 150771 -65018
19112 138287 72913 69662 -68483 -193415 462456 -122129 136873 46631 69014 9659 69208
19101 69208 -76896 216649 361700 -86009 199525 -20318 23322 113871 41956 -341635 -79570
19089 -90710 238721 -24885 -149788 17660 -34395 -276485 -72071 -294963 -355255 148594 4451
19077A98056a39741l1845k3886G0365M4298D0288a05969F5209L30671a74986f6269
19065G2783a30218B09705g7416j19872b4220m04221K01469P2253B90909a90585
19054I1742g7028A9472M3983b17396C36776f0442K7178k22586B10656b91023B38791
19042E4829a81886E0237h0995A87706C4000L581a44853O7949B157b49062i7186
19030D52806a81335B10494I2324a48039B08341C5192N9328q341D2109L2918h4111
19018D40354b58637A5767R0944a12840d0431E7400f0225q5327A75192a46804j86290
19007c33094A85856d3637j62973a0445j20727C97754H5853J71318b05620A24428
18996A84657J20202c23747A35684a18385j73478G9413d503A10023e47326a72615
$$ plain form
19077 198056 -139741 -171586 -195472 70365 114663 40288 -105969 65209 395880 -174986 -66269
19065 72783 -130218 209705 -77416 -197288 -24220 -428441 -226972 -154719 290909 -190585
19054 91742 -77028 19472 63455 -217396 336776 -60442 -33264 -255850 210656 -291023 238791
19042 54829 -181886 50237 -80995 187706 34000 37581 -144853 -76904 2157 -249062 -97186
19030 452806 -181335 210494 92324 -148039 208341 35192 94520 86179 42109 75027 -84111
19018 440354 -258637 15767 106711 -112840 -40431 57400 -60225 -145552 175192 -146804 -333094
19007 -333094 185856 -43637 -206610 -10445 -131172 397754 85853 257171 -205620 124428
18996 184657 304859 -323747 135684 -118385 -291863 79413 -4503 110023 -547326 -172615
18985B9285a27875j45423J35470j60357B26473b34742j76411B5714K8045a07516
18974b87102i1288l06699B25923a7614B42694b81543A82954e5076A2597b61693
18963H1443e3151I8633f3206m3678j14280P2785g3905i665B5023J28812e0096
18951a98053R5484L1216B12363c15155c766C61942a17509A20684l4529K28377
18941C14532E0707O1378A6462a53612N9694j74315j6365a9981l71778g1238B24229
18929G1142b8265A06055a11232l7734F1348J95815a70357A94679k1377B1915p882
18918A4033c60792i3975l265D2252b6249j33862A41591b2315e791A00977b427
18906a5063k54475j80473B7352a88826A29041K03999A41078b75494r0326J67839
$$ plain form
18985 29285 -127875 -273298 -137828 -298185 226473 -234742 -411153 25714 53759 -107516
18974 -287102 -91288 -397987 225923 -17614 242694 -281543 182954 -55076 12597 -261693
18963 81443 -53151 98633 -63206 -106884 -221164 -148379 -73905 -9665 25023 153835 -50096
18951 -198053 -102569 -71353 212363 -315155 -3766 361942 -117509 120684 86155 314532
18941 314532 50707 112085 16462 -153612 -93918 -268233 -284598 -19981 -391759 -71238 224229
18929 71142 -28265 106055 -111232 -148966 61348 257163 -170357 194679 173302 21915 14033
18918 14033 -360792 -93975 -97240 42252 -26249 -160111 141591 -22315 -5791 100977 -2427
18906 -15063 -269538 -450011 27352 -188826 129041 333040 141078 -275494 -365820 -197981
18896a97981A13761K91492A39321d75681b17671F8930a84139e538C02931b6292
18885C62211j11813a67707l023B01830I7871P6280h5946g446o1759j13473B80132
18873b60951J00101A57773G0364b35827C07868a02533k95630a08883j66072g0711
18862a90267k9000a20k53245a8907k7575j93877Q5624C12922d9013j43867l889
18851a96769H4759Q0403e0932E055Q4970j1433d12949A29803b3904A096a37250
18839A47767g8671E8662c61336J68138B1425b73998d0589l81734f4246F0385b41102
18827G9821a70201j61820n3711a72809C34781h4094C44503i5347A2043c0978K779
18816b8199A73203g805k26662F2292c04792a38464A54959m6535J70532M9558c8894
$$ plain form
18896 -197981 113761 405253 139321 -475681 -217671 68930 -184139 -5538 302931 -26292
18885 362211 250398 -167707 -170730 201830 97871 174151 -85946 -7446 -69205 -182678 280132
18873 -260951 -160850 157773 70364 -235827 307868 -102533 -398163 -108883 -274955 -70711
18862 -190267 -219267 -120 -253365 -18907 -46482 -240359 -154735 312922 -49013 -192880 -196769
18851 -196769 84759 165162 -50932 5055 90025 78592 -412949 129803 -23904 1096 -137250
18839 147767 -78671 58662 -361336 -193198 21425 -273998 -40589 -422323 -64246 60385 -241102
18827 79821 -170201 -332021 -385732 -172809 334781 -84094 344503 -95347 12043 -30978 -28199
18816 -28199 173203 -7805 -234467 62292 -304792 -138464 154959 108424 278956 328514 -38894
18804h8058E3181a13080A12128J25678c26338N5238B4033J61564P9232D6175A7878
18792G7616B7808J19688n4129R0339b04780k11881E09487b06877b6171k41273
18782b67444O7667Q4472k9506O6470N61p6828C45212c97382b1949A83901C4396
18770b64617J8650A58266k8393a34990A8561a46019B40624O5433i2927I035i6439
18758c19565C1944d35396b2811D485O9152c0903f309k08803k03350a43468C3584
18746a94134I3913c2111A21283J9243h9468l14392a68132M2083N5726p9380B10606
18734b98185A1838b14603p1669r8375H80L9023J61613c2906k44400D6380b02951
18722A21201H946J91032B8039c22965B69025e3099J0833G5496o201O5639a93069
$$ plain form
18804 -88058 53181 -113080 112128 237806 -326338 -271100 24033 185597 264829 46175 17878
18792 77616 27808 147496 93367 183706 -204780 -416661 509487 -206877 -26171 -267444
18782 -267444 -199777 -115305 -144811 -78341 -77780 -154608 345212 -397382 -21949 183901 34396
18770 -264617 -245967 158266 129873 -134990 18561 -146019 240624 306057 -92927 9035 -96439
18758 -319565 31944 -435396 -22811 4485 73637 -30903 -6309 -215112 -418462 -143468 33584
18746 -194134 93913 -32111 121283 140526 -89468 -403860 -168132 -126049 -70323 -149703 210606
18734 -298185 11838 -214603 -286272 -384647 880 39903 201516 -32906 -277306 46380 -202951
18722 121201 8946 199978 28039 -322965 269025 -53099 -42266 75496 69295 134934 -193069
18710A0077e7586n50773D6287a74724A48234J44359a44544j63107G0802a75953
18699a14865A00421a35153A11602c76003a3098j3876k1616k51762C5392b38999
18688B14656g2159C26962f0142e638m8056p7157F4842a60760k60263J25612A54668
18676a35104O5588r8232L2090a1747A09542A9168b00380j07732a7813j22008a1574
18664c08350a2063k92307I1685b92988J13653l8882B77868B3846K53218A01068
18653A61894m3742J6012c26434a16109l6953P0337B25766g415k01365j37870a43372
18641A69969b65562A52424f0096r9571l1818L4129a209k44731h3902A16492b11685
18629a99293o9029d1299j82782J04425j66279A84876p6206a5367j85996K7660
$$ plain form
18710 10077 -57586 -608359 46287 -174724 148234 292593 -144544 -307651 70802 -175953
18699 -114865 100421 -135153 111602 -376003 -13098 -26974 -48590 -300352 35392 -238999
18688 214656 -72159 326962 -60142 -5638 -53694 -130851 64842 -160760 -421023 -295411 154668
18676 -135104 -69516 -167748 -135658 -11747 109542 19168 -200380 -308112 -17813 -139821 -11574
18664 -308350 -12063 -304370 91685 -292988 -179335 -218217 277868 23846 277064 101068
18653 161894 118152 134164 -326434 -116109 -153062 -82725 225766 -7415 -208780 -346650 -143372
18641 169969 -265562 152424 -60096 -159667 -191485 -157356 -1209 -245940 -83902 116492 -211685
18629 -199293 -268322 -41299 -224081 -119656 -285935 184876 108670 -15367 -201363 -173703
18619a73703h4135B5559d92133a12729j39202e0774p7180A37487c99381E4302
18608I6315a43313J8558A41779O5302E1798a77299B88606F0127b29033J10416
18598a18617L2118N83B3530b34347M9114a8123j28867J5113B2519O1695b9027
18586A77031b77653J31210E4473A8849d43594a71260A66440A9557e9809r9070
18576a58879j09586F134f9382F6071j4627a27244F5401P2505D2914H606a93742
18564A35652b13519D3688b72347A1913a37386k2628e7019A70937e7305K0396j09472
18553a46381c7146c584B62071a01124d684E7443K4949b49567f9435p4578c2512
18541A07826k4147P3267K49895H6403a64097l31127A78843b2233l20798a485B63235
$$ plain form
18619 -173703 -84135 25559 -492133 -112729 -251931 -50774 -127954 137487 -399381 54302
18608 96315 -143313 -124755 141779 207081 51798 -177299 288606 60127 -229033 -118617
18598 -118617 -86499 -85916 23530 -234347 -185233 -18123 -146990 -131877 22519 84214 -29027
18586 177031 -277653 -146443 54473 18849 -443594 -171260 166440 19557 -59809 -158879
18576 -158879 -268465 6134 -69382 66071 51444 -127244 65401 137906 42914 8606 -193742
18564 135652 -213519 43688 -272347 11913 -137386 -160014 -57019 170937 -57305 -36909 -146381
18553 -146381 -37146 -3584 262071 -101124 -4684 57443 82392 -249567 -69435 -144013 -32512
18541 107826 83679 156946 406841 86403 -164097 -495224 178843 -22233 -343031 -1485 263235
18529C08319a14967F4355c8509a2144o4291A64390F459g9043l5687p0055B68914
18517a09365l47256A19637R0671E5361a95173e394D2563K9204i2687M5360C4772
18505e8661m44067J95488a51268C36627a72074A73382H6020a23318B30732a42587
18494A08310m5954a39965a9674m06646H0099a5428k2528B5195a3535C4323a76767
18482c80038A15424K52690f8250A00653a1188j38721C51404b22541A52203O901
18472A59104f8608j46250d8867C4026c44472h4572A96915o3506J15782a78701
18461b4842A05033K9943j2974D5587a50636J0388a0660l17673D00187b21400e2190
18449a25805B13260e5150l59436f5813j2173j8810j7321A68134a47835k5610P9859
$$ plain form
18529 308319 -114967 64355 -38509 -12144 -76435 164390 6459 -79043 -114730 -184785 268914
18517 -109365 -456621 119637 210308 55361 -195173 -5394 42563 71767 -92687 -47327 34772
18505 -58661 -502728 -307240 -151268 336627 -172074 173382 86020 -123318 230732 -142587
18494 108310 62356 -139965 -19674 -426320 80099 -15428 -37956 25195 -13535 34323 -176767
18482 -380038 115424 368114 -68250 100653 -11188 -149909 351404 -222541 152203 159104
18472 159104 -68608 -214858 -48867 34026 -344472 -84572 196915 133409 249191 -178701
18461 -24842 105033 134976 122002 45587 -150636 -140248 -10660 -328333 400187 -221400 -52190
18449 -125805 213260 -55150 -414586 -65813 -77986 -96796 -114117 168134 -147835 -173445 -93586
18438i3586r9206G8823g8019B1921a27453A72830G7206a79202g9848k33333A09380
18426I8658a50833j16326e8696k78070B7808a51075c8953A36795b97689J42361
18416a55328M5019q9444I2573i6928L2889j10683j33623j6841h1883A22016m6283
18405G5733A5526J04599D4521a6070B54596b55538J07861B16724d2460m6622D7390
18393e9516A37932E6444h3200o8570E0605b4568j04066j68276H5141c79311c2578
18381B94672A12805b07327a7231q5250A23267K8470a91052C22833j29561G9001
18370E1459g6194r2675A32119h6992B00251G339O4509a51076n6646B81e7951F2509
18357f1710k53164A64744a07823A72831b72942E7823k7463a11490p3017j30833
$$ plain form
18438 -93586 -192792 78823 -78019 21921 -127453 172830 77206 -179202 -79848 -313181 109380
18426 98658 -150833 -267159 -58696 -336766 27808 -151075 -38953 136795 -297689 -155328
18416 -155328 -110309 -199753 92573 -96928 -64039 -174722 -308345 -325186 -81883 122016 75733
18405 75733 15526 120125 44521 -16070 254596 -255538 -147677 216724 -42460 -89082 47390
18393 -59516 137932 56444 -83200 -151770 50605 -24568 -128634 -296910 85141 -379311 -32578
18381 294672 112805 -207327 -17231 -102481 123267 151737 -191052 322833 193272 79001
18370 51459 -76194 -168869 132119 -86992 200251 7339 71848 -151076 -207722 281 -57951 62509
18357 -61710 -314874 164744 -107823 172831 -272942 57823 30360 -111490 -184507 -315340
18347c15340a23410b4383j50270n915F567L5596K6656a52815D154a14134K7857
18336h6277A6498c11135a4809m5668j55928f8220k99089P4774K800j8380c7599
18324c93984a96954d692p5750j81658h1990q059l4325b718C0656L00856A43764
18312A83712f4079k18764B84478b20027F2741N7174h6564F8360j9815d913k31929
18301b36842O1421l19515g770I7244N7330L5556a07715k89848A04465m6136P8715
18290A37044B4209b92637h3440P542o4203I8259b12393O8758F9285M5137b711
18278a39858B41629c50008a40804o068M0p6358B71903H6746O9965n2625i0559
18266c0791l08546A5273b49889k5168R3186D21925A88290E8001A5264F806J5941
$$ plain form
18347 -315340 -123410 -24383 -174653 -180568 6567 42163 68819 -152815 4154 -114134 -86277
18336 -86277 16498 -311135 -14809 -60477 -216405 -68220 -367309 -292535 -289735 -308115 -37599
18324 -393984 -196954 -4692 -80442 -262100 -81990 -90049 -124374 -2718 30656 331512 143764
18312 183712 -64079 -282843 284478 -220027 62741 119915 -86564 68360 48545 -4913 -236842
18301 -236842 -175421 -494936 -7770 97244 154574 190130 -107715 -397563 104465 58329 137044
18290 137044 24209 -292637 -83440 -75898 -140101 98259 -212393 -143635 69285 114422 -2711
18278 -139858 241629 -350008 -140804 -146872 -146832 -223190 271903 86746 156711 104086 -90559
18266 -30791 -339337 15273 -249889 -275057 -181871 421925 188290 58001 15264 6806 22747
18255B2747b53504e1688A81428b77357A04537a2533q2220m4796F3406A3987M66030
18244D80017g1051D0466K35159b6795B4161a45027C4217g6951q1142M0963F6373
18232e53042a65558d8789A9632A482b30803d824l2326A4183L19244a46107k7644
18221a73751M1399h175B3262a6152k40044c0801j26681B53216j16690a19005L7556
18210h1449b9542j70531h7838C87681I5875C3312b34414p2718B9018c24887J22989
18199b01898d3335A40753d9161A74543a57964d4517k26654g4202N605c0756B3488
18187C076d105j4819k6214k7620k43947J06575M3809H9384A8712N8724p054d4513
18174a78477b8306D4222R4980n4070B364L83992j12269m9453d29650H8004b2961
$$ plain form
18255 22747 -253504 -51688 181428 -277357 104537 -12533 -94753 -139549 63406 13987 480017
18244 480017 -71051 40466 275625 -26795 24161 -145027 34217 -76951 -158093 -117130 66373
18232 -553042 -165558 -48789 19632 1482 -230803 -4824 -37150 14183 333427 -146107 -173751
18221 -173751 -132352 -8175 23262 -16152 -256196 -30801 -157482 253216 136526 -119005 -81449
18210 -81449 -29542 -200073 -87838 387681 95875 33312 -234414 -307132 29018 -324887 -201898
18199 -201898 -43335 140753 -49161 174543 -157964 -44517 -271171 -74202 -68597 -30756 23488
18187 3076 -4105 -18924 -45138 -72758 -316705 -210130 -166321 89384 18712 77436 70382 -44513
18174 -178477 -28306 44222 139202 85132 2364 386356 274087 224634 -429650 88004 -22961
18162a47236j73149I4122J07381d9815o9373j56334q03h7540C80153A02036r376
18151I2660K7299b09748L4646K3175B84811E9227A5450Q8817e8516j62482A3297
18139A80232b22916B6417K28220g0028K3984l04195h6027B77116a78359n8917
18129b37276M8160A01994L6957o5469C1494c29274H948b5498j97747D3835N0221
18118I4056c0808j64301E3312j1465g9037j66944c0013l89376b863j36807M6015
18107i3655A00835b30270F3941n568b89641g487A00535l3513a29390c2137B7536
18095e5755k02276E2782K2411b9740p4594a8982A20673a40682c7043C1817b40081
18083E1711d5531A84014d48755J97531A0516f0999q3205C41116A11860b21845
$$ plain form
18162 -147236 -320385 94122 201503 -49815 -119188 -275522 -276325 -87540 380153 102036 92660
18151 92660 119959 -209748 -175102 -151927 284811 59227 15450 104267 -58516 -220998 13297
18139 180232 -222916 26417 254637 -70028 -46044 -350239 -86027 277116 -178359 -237276
18129 -237276 -189116 101994 138951 73482 31494 -329274 8948 -25498 -223245 43835 94056
18118 94056 -30808 -195109 53312 41847 -79037 -245981 -30013 -419389 -2863 -139670 -93655
18107 -93655 100835 -230270 63941 58373 -289641 -7487 100535 67022 -129390 -32137 27536
18095 -55755 -258031 52782 75193 -29740 -104334 -18982 120673 -140682 -37043 31817 -240081
18083 51711 -45531 184014 -448755 -251224 10516 -60999 -144204 341116 111860 -221845
18072C1352b28526B1437J01460M9207l6783O290O12g610k35806B1971A903b5889
18059a33113M9609p5599C0961R763K33202l9963H9916e43835a48659O134p6617
18048b19142D1965d1515j07025j12312c2508q7413B05870b0604l80643g4487E7003
18036a81763D3706J12727r281a79835F0223K35732C4691f8377k7060d5532A71863
18024e8017j47751h4004J1130C80297q2869D331b8375n9076j64313a8037D2437
18012C7075d50788b06366A54781E3127b6971A7970M93348a33973j18036f8487
18001f7323n6190j69205d8949e091k7999H962b11496B43791b66887j18579a17086
17989d36076A24150m6475a68563I5844M3797J877a02605B0600f6864B51843J21174
$$ plain form
18072 31352 -228526 21437 122897 172104 135321 141611 142223 -7610 -243416 21971 1903 -25889
18059 -133113 -83504 -159103 30961 40724 273926 233963 89916 -543835 -148659 -142525 -219142
18048 -219142 41965 -41515 -148540 -260852 -32508 -119921 205870 -20604 -401247 -74487 57003
18036 -181763 43706 156433 147152 -179835 60223 295955 34691 -68377 -95437 -45532 171863
18024 -58017 -205768 -84004 -72874 380297 297428 4331 -28375 -87451 -251764 -18037 42437
18012 37075 -450788 -206366 154781 53127 -26971 17970 511318 -133973 -252009 -68487
18001 -67323 -123513 -292718 -48949 -5091 -33090 8962 -211496 243791 -266887 -385466 -117086
17989 -436076 124150 77675 -168563 95844 139641 141518 -102605 20600 -66864 251843 373017
17978C73017A62930D3702K08692p4127a17176M5574n228c5917A25118P2129b12160
17966A37197d8116G3963K10492c67842J57489C5898J31446m1664c61888I9233
17955B08327b1090p818F9468J71029a62351A47346d2934C92619i9977K5966k094
17944g6105L2144E4953b3830k61447e8243j49458E0719P7320b02348g6926b6191
17932c6957j96317A78002g8601B74356A01518O8155a54096d9312A51575J26266
17922B77841g1361a9277j37811A34428i2258C4315R621K09677a37485A2973J12234
17911A25207J37418D7670A0075b4834j29397D7669O4061Q0931a32316E8809a99510
17899B25810A06351b33060e4107H2706h9308j62792e3920E7061b00149A48650
$$ plain form
17978 373017 162930 43702 252394 178267 -117176 -71602 -76830 -35917 125118 197247 -212160
17966 137197 -48116 73963 284455 -367842 -210353 35898 167344 125680 -361888 99233
17955 208327 -21090 -28908 69468 240497 -162351 147346 -42934 392619 -99977 -74011 -76105
17944 -76105 -43961 54953 -23830 -285277 -58243 -207701 50719 128039 -202348 -76926 -26191
17932 -36957 -233274 178002 -78601 274356 101518 169673 -154096 -49312 151575 277841
17922 277841 -71361 -19277 -157088 134428 -92258 34315 43936 253613 -137485 12973 125207
17911 125207 262625 47670 10075 -24834 -154231 47669 111730 192661 -132316 58809 -199510
17899 225810 106351 -233060 -54107 82706 -89308 -252100 -53920 57061 -200149 148650
17888A6710g7558k51818G5488N8579a31600D55J35886a17513A95045E3750K01762
17877B55512b71250A32115a26693D8499J8783a56666H2167P6420J18546o8699
17867B08434a04406I6830c6400B3968J50314i6384r3125g2347A09500b54792G9168
17855A36377E3912N3232b03084B62423I220R3238R4541o6184a55318M8282B38483
17843A37821h8169r8396E9045P9163D139R8778b73066B75324a80938f1835B80811
17831a01444p9035l07661D13060A02110a36913C53155b74033H3235j1196J17069
17821A89108N6713e7400C01503b39656B20724g7536I4660e42783b67064E7353
17810B52929a24944A6159N4842a26949D36017a8629B50460E7256j94a63450B99015
$$ plain form
17888 16710 -77558 -329376 75488 134067 -131600 455 136341 -117513 195045 53750 255512
17877 255512 -271250 132115 -126693 48499 67282 -156666 82167 158587 277133 208434
17867 208434 -104406 96830 -36400 23968 174282 -96384 -189509 -72347 109500 -254792 79168
17855 136377 53912 107144 -203084 262423 9220 102458 196999 130815 -155318 -107036 238483
17843 137821 -88169 -186565 59045 138208 4139 102917 -273066 275324 -180938 -61835 280811
17831 -101444 -180479 -488140 413060 102110 -136913 353155 -274033 83235 72039 189108
17821 189108 245821 -57400 301503 -239656 220724 -77536 94660 -542783 -267064 57353
17810 252929 -124944 16159 71001 -126949 436017 -18629 250460 57256 57062 -163450 299015
17798A32917D5699Q5902n8768Q1376c78819J46597M4848P9716F3707a63269f6958
17786B56548a41863M4468m3896k41672a72288e5487A27757a22278p6893Q4297
17776a14874A58946a17006C21779a0829A46694L6477a25749C4641a10996r539
17766a20535o4081a2971G9462C1954i4420A53794f7881e707k60448B35785a26028
17754b1517k33076A20978J40310h9966A37352J18257a49480A23024b55636H2464
17743a00530G358b49874F7561k752k1134c35778f1214n4664k99950b07903C6926
17731A63208E8272c20658g6396j81778b5345D0837J53275c01815A63687a06986
17720B01938a04230k6b116B4235a36346J471B22969d5590J02B99482f2962m9770
$$ plain form
17798 132917 45699 131601 72833 154209 -378819 -232222 -187374 -107658 63707 -163269 -66958
17786 256548 -141863 -97395 -141291 -382963 -172288 -55487 127757 -122278 -199171 -114874
17776 -114874 158946 -117006 321779 -10829 146694 183171 -125749 34641 -110996 -120535
17766 -120535 -184616 -12971 79462 31954 -94420 153794 -67881 -5707 -266155 235785 -126028
17754 -21517 -254593 120978 261288 -89966 137352 255609 -149480 123024 -255636 82464
17743 -100530 7358 -249874 67561 64809 43675 -335778 -61214 -115878 -415828 -207903 36926
17731 163208 58272 -320658 -76396 -258174 -25345 40837 194112 -301815 163687 -106986
17720 201938 -104230 -104256 -2116 24235 -136346 -134875 222969 -45590 -45488 299482 -62962 -112732
17708a12732B34830C1189d1508j706n4154A79747B0745E085J25714a87703b8921
17696C32194b47629A00379R6531B7376O7887g6118j73052A54448a08357I2702
17685a93678F0714K08663j18925k6973h4034b0088B12985K25995G8589a8514A5467
17673e1592m742A51241l6023b80316B1750J39332h9426H3224O9723a64407A28844
17661A33050R832b14440G0885b07394A6823J84629F40b9635n1244A18669i2076
17649f7901A26617c3216A04387N7733a01651B59852j12167a03475A69752R2389
17639B62141a3757D3198m739j367J19073n9022c65952F430M6946a74332M2814
17628a31518B5250g6833B05485a06224A20571b7581D19137b23724i2959E7219
$$ plain form
17708 -112732 234830 31189 -41508 -43214 -97368 179747 20745 5085 130799 -187703 -28921
17696 332194 -247629 100379 196910 27376 95263 -76118 -249170 154448 -108357 92702
17685 -193678 60714 269377 150452 123479 -84034 -20088 212985 438980 78589 -18514 15467
17673 -51592 -56334 151241 115218 -280316 21750 161082 -89426 83224 152947 -164407 128844
17661 133050 142882 -214440 70885 -207394 16823 201452 640 -29635 -80879 118669 -92076
17649 -67901 126617 -33216 104387 162120 -101651 259852 147685 -103475 169752 262141
17639 262141 -13757 43198 38459 37092 156165 97143 -365952 6430 53376 -174332 -131518
17628 -131518 25250 -76833 205485 -106224 120571 -27581 419137 -223724 -92959 57219
17617B264c7950F7188M3659a94328C46583c5341A22372D4169P2930c21117J13168
17606b07949B29718J26528G4257k0885J65626c7394k56582I3122K9493K31932
17596C54547b87640B418K21040h0825I1185J95995F5832G818b96166H4345J10867
17585A95212L3794a31562L2943A84923f7985C18155b89460b1464E8257K5700a5581
17573a81618C2432N0599c6557A17501a30194A6266J50648F3707J5544J04857K5378
17562B09486C5968f9329H6771L0290m6611b32313B82207B9340d9395j10499B4102
17550d1934A00310b80000a4499D31900A53777f4400F1346a31918A47836h8949
17539C23071b24363O6103j87172I7337f0694N729A29636J1733K55884D3976h4996
$$ plain form
17617 2264 -37950 67188 110847 -194328 346583 -35341 122372 44169 117099 -321117 -207949
17606 -207949 229718 356246 74257 53372 218998 -37394 -293976 93122 122615 354547
17596 354547 -287640 2418 223458 -80825 91185 287180 65832 7818 -296166 84345 195212
17585 195212 229006 -131562 -98619 184923 -67985 318155 -289460 -21464 58257 83957 -15581
17573 -181618 32432 83031 -36557 117501 -130194 16266 166914 63707 79251 184108 209486
17562 209486 35968 -69329 86771 117061 70450 -232313 282207 29340 -49395 -159894 24102
17550 -41934 100310 -280000 -14499 431900 153777 -64400 61346 -131918 147836 -88949
17539 323071 -224363 -158260 -345432 97337 -60694 -54965 129636 141369 397253 43976 -84996
17527A09129b00365B59592a54272j63643A19647O2001a73598F0688J00838m2851
17517A18675e2149G7186f9761P811A73321i6276K4577A40023j7166J02782a42756
17505c42215B97338b00059B76062g6934H2295L90513c7662B33353b3973A35437
17494C06532A20112Q3336a17129A81105M1855J0138h7345j05517C05440B1051
17483F7797N1812P6331C0440i1655C6026Q7014n1125J13489g289C93318I4474
17471B80634j12572J15796q6300b19848G6623a85622b8160A09935J30517b4312
17460g0813a0519A43792J35929A8274E630N73617B58291a36081F70577B76138
17449E95287a38667B93842N1377J45462j38257A3229j823L05282r7575j07559
$$ plain form
17527 109129 -200365 259592 -154272 -317915 119647 181648 -173598 60688 161526 118675
17517 118675 -52149 77186 -69761 -61950 173321 -96276 -71699 140023 122857 225639 -142756
17505 -342215 297338 -200059 276062 -76934 82295 472808 -37662 233353 -23973 135437
17494 306532 120112 203448 -117129 181105 222960 233098 -87345 -192862 305440 21051
17483 67797 119609 195940 30440 -91655 36026 123040 71915 185404 -7289 393318 94474
17471 280634 168062 283858 197558 -219848 76623 -185622 -28160 109935 240452 -24312
17460 -70813 -10519 143792 279721 18274 5630 579247 258291 -136081 670577 276138
17449 595287 -138667 293842 345219 490681 352424 13229 11406 316688 219113 111554
17439A11554R1029J90131A19594M6901a58656m5935D22824q9355j56612n942J4323
17428A85238L73513j71271j83398o0068M4985K05873A08269m2843L73989j69108
17418B70307A05281l9231K14141K01080C7594L35293o3979I0415P9271D6061M10604
17407D56665j74634J01790A29209l3990R1634q2439L7102a52B6039g8351B00013
17395F2929J12229d3069B16545M2075E2195j5566J32257N4770a2917A54288K25011
17384C79299A78918e1275H0937L51651j55027a00095F2522J99290A04311d2485
17373B46018J8190F4138K14952E9831k1700M3692J20651b11608B97698j37936
17363A59762b00410B51696f0849D7871g5606A71354a48315l7317A05027J68099
$$ plain form
17439 111554 202583 392714 119594 166495 -158656 -204591 422824 333469 176857 170915 185238
17428 185238 558751 387480 204082 144014 188999 394872 108269 65426 439415 270307
17418 270307 105281 66050 280191 481271 37594 372887 308908 90415 169686 46061 456665
17407 456665 282031 383821 129209 95219 186853 104414 141516 -152 26039 -78351 200013
17395 62929 175158 -43069 216545 258620 52195 36629 168886 223656 -12917 154288 379299
17384 379299 178918 -51275 80937 432588 277561 -100095 62522 261812 104311 -42485
17373 246018 264208 64138 279090 59831 38131 81823 202474 -211608 297698 159762
17363 159762 -200410 251696 -60849 47871 -75606 171354 -148315 -185632 105027 273126
17353B73126a2066F0103L02476a561l3747A02003J52069I7652f3323B11084r3593
17342A17491g0257C35148E3129H394J30443J20565b53626a01516L7650E462J23251
17331A28713J37564b84261I9005f7550A99196H3860K25956j34215m8981e7183
17320G1734K7711P1432d5021B16582J09948E3269J22195L49006i8494E17432A06144
17308C42084a4728A55212G52K32505M7764m0033g342D12279b26384C97879r1619
17297C06260b21352A02732J14615o6966a0252B74518j18563J2898l7445i2481
17286A44294o8745L2320K01260R7517j29611j19121O5298r3222m6734M68065k60505
17275B90816j8554c0310k6484C2939J15261N7447J66374m8024e1774A43938q220
$$ plain form
17353 273126 -12066 60103 362579 -1561 -35308 102003 254072 97652 -63323 211084 117491
17342 117491 -70257 335148 53129 8394 138837 259402 -253626 -101516 -63866 5462 128713
17331 128713 266277 -284261 99005 -67550 199196 83860 309816 175601 126620 -57183
17320 71734 99445 170877 -45021 216582 326530 53269 175464 524470 -98494 517432 106144
17308 342084 -14728 155212 752 233257 281021 240988 -7342 412279 -226384 397879 306260
17297 306260 -221352 102732 217347 150381 -10252 274518 155955 168853 131408 -92481
17286 144294 75549 107869 309129 406646 277035 157914 223212 129990 83256 551321 290816
17275 290816 272262 -30310 -56794 32939 148200 205647 372021 323997 -51774 143938 135718
17264A35718O5535G8614c4976B3584P3237f1182A15263b6240B16179G5602K61335
17253C36937J76976k49198d0718B84924n4378E9847K44534g4510E241L2375J70396
17242B08012K38479A02849J47720K7764J31647B2377J10127J08487d7783B25580
17231I3310L64786j65519L19062F2969J24679O6997m844J28933q1773m2569M3841
17220B98233Q1604J37431b2592o5722A75449R4459H7687Q2010k477a58197C06835
17208A82657L33095A72443J07085q8798e5878B35103L68752k11011j11698J01809
17198C82955a78385C32789K5909A36902D8272K40398p7321k2482J33425A063L58898
17187C59961j17229K13479A77497e5761B05056M8434J4659D8788L66611L1412
$$ plain form
17264 135718 201253 78614 -34976 23584 96821 -61182 115263 -26240 216179 75602 336937
17253 336937 513913 264715 -40718 284924 230546 59847 304381 -74510 5241 37616 208012
17242 208012 446491 102849 250569 278333 409980 22377 132504 240991 -47783 225580
17231 93310 458096 292577 611639 62969 187648 254645 249801 378734 296961 254392 298233
17220 298233 379837 517268 -22592 -88314 175449 269908 87687 169697 167220 -158197 306835
17208 182657 515752 172443 279528 190730 -55878 235103 603855 392844 281146 382955
17198 382955 -178385 332789 358698 136902 48272 288670 211349 188867 322292 1063 359961
17187 359961 242732 456211 177497 -55761 205056 253490 268149 48788 415399 446811
17177D46811n7096D6731J70917I7806J30814J27658m6206A10378J494D1458K21961
17166B63419M4568p1792k9163J48721A53736L63455j57106J0791j58613l5328
17156A76935L15246r7047l6647n9102J45616c4088C41143A30067L31406B15595
17145C03681R2073n3954A31306J18266p9745J50666J33914r2607Q8350j44348
17135C05802j24424J31930O2923p4144A0493K08139M28404B22921L26518j31200
17125D18239d3014D07641J17029O1952h8502B91647L66905A92022K04365R1291
17115D87678A72936F1547L62937B4708L67346k6392m775L26109b4261C91576o8550
17104C23026P529A54668M61588j77068j38947j02742N28697k70190L22221l75853
$$ plain form
17177 446811 389715 46731 217648 97806 228620 356278 310072 110378 111872 41458 263419
17166 263419 307987 236195 207032 355753 153736 517191 360085 370876 212263 176935
17156 176935 492181 395134 358487 299385 445001 -34088 341143 130067 461473 215595
17145 303681 395754 341800 131306 249572 169827 320493 454407 361800 450150 305802
17135 305802 181378 313308 376231 302087 10493 218632 647036 222921 549439 418239
17125 418239 -43014 407641 524670 586622 -88502 291647 658552 192022 396387 487678
17115 487678 172936 61547 424484 24708 392054 365662 360887 686996 -24261 391576 323026
17104 323026 330555 154668 616256 439188 300241 197499 726196 456006 778227 402374
17094D02374m971l9986J76737j43656L8142K95225C42126J10562l7832R625J6039
17083D40520J43029A03132L03154J00767j62211Q9124m0613K24173k94627j00668
17073B22231N01535j49489B50150o4859M31629p1090j59575J62740k11756J36789
17063D74028J16645j68481j76156K68461M2143j9903k48101J10458J3659K79060
17053F91813l00988K27289l3658K34642l98543M3873k27113M23655p7943k8833
17043E54194j24063L74526j54717k33587J96407j55347k4718j64431Q34653B88267
17032B38873K90912K60060k45383L9047K20434j55990B58713N55719k96793J21728
17022F39367j62050N0762F9208N01917o187M9260J8526K27734K19616C48692M71040
$$ plain form
17094 402374 397403 357417 534154 390498 428640 723865 342126 452688 414856 424481 440520
17083 440520 583549 103132 406286 507053 344842 433966 393353 617526 322899 222231
17073 222231 723766 574277 250150 185291 616920 545830 386255 548995 337239 474028
17063 474028 590673 422192 246036 514497 556640 536737 288636 399094 412753 691813
17053 691813 390825 618114 584456 819098 420555 464428 237315 660970 583027 554194
17043 554194 430131 804657 649940 416353 612760 457413 432695 268264 1102917 288267
17032 238873 529785 789845 544462 583509 803943 647953 258713 814432 517639 639367
17022 639367 477317 528079 69208 571125 564938 614198 632724 860458 1080074 348692 819732
17011H19732k04726N44230E71661j84130K86889j69513N45539E23640K72939j48511
17001F48068l152k41679K84351j18333j96642L37230m6222j96372M10459k05078
16991F72630K27233l0870Q6984j02504k88937K24399l71541K27670J74944J0824
16981H30832K25688j2267j30695J08989k4480j59176D03194N36981K67950k89211
16971I18914n3430J30696K1037j60487m8265P8826K60591j77450J26895r4970
16961A002357K54568n81898L71345J20982l2141m72686K74367n0694J47539j93273
16951H40466K82868l81983N36711j60986K80857l02745L24048k00318k17072R8327
16941A100173m1087j73954L48557k20829n2718K01354K79657q6350l47223L77010
$$ plain form
17011 819732 615006 1159236 571661 387531 674420 504907 1050446 523640 796579 648068
17001 648068 644916 403237 687588 569255 372613 709843 663621 467249 877708 672630
16991 672630 899863 868993 955977 853473 564536 788935 417394 645064 820008 830832
16981 830832 1056520 1044253 913558 1022547 998067 838891 403194 940175 1208125 918914
16971 918914 865484 996180 1017217 856730 808465 887291 1147882 970432 1097327 1002357
16961 1002357 1256925 675027 1046372 1167354 1135213 662527 936894 886200 1033739 840466
16951 840466 1123334 741351 1278062 1117076 1397933 1095188 1419236 1218918 1001846 1100173
16941 1100173 1059086 885132 1233689 1012860 960142 1161496 1441153 1354803 1007580 1384590
16931A384590j6205P6131K1247j01874l39770O17787m30349J76274l02665N2730
16921A137896J05333N5733k11726J27403L81100k11369q4063J26891p0957R2978
16911A449219L9663R6757l8692j17738K18109K17167j51719k20561J05020K1914
16901A619139o0233L8834J38154j22116k2752K80039q4575J14150L7584j79323
16891A758901K91548m16629R5484M77428k96082N4024j76104O0014K01930J10582
16881B161096k45338J90037R719N4538P87m9132L0471L13303k77270L88577m15234
16870B161554M73656m49882M87447q0914L8789Q5035m4782J84865k32739J88441
16860B811470R844J3774J95273J06888j46483N7632r7100J8348M2612M37631k80397
$$ plain form
16931 1384590 1368385 1444516 1465763 1363889 1024119 1641906 1211557 1387831 1085166 1137896
16921 1137896 1243229 1298962 1087236 1214639 1595739 1384370 1300307 1427198 1356241 1449219
16911 1449219 1488882 1585639 1546947 1429209 1647318 1864485 1712766 1492205 1597225 1619139
16901 1619139 1558906 1597740 1735894 1613778 1591026 1871065 1786490 1900640 1938224 1758901
16891 1758901 2050449 1633820 1729304 2206732 1910650 1964674 1788570 1848584 2050514 2161096
16881 2161096 1915758 2105795 2115514 2170052 2170839 2121707 2152178 2465481 2188211 2576788 2161554
16870 2161554 2635210 2185328 2672775 2591861 2630650 2715685 2670903 2855768 2623029 2811470
16860 2811470 2821314 2835088 3030361 3137249 2990766 3048398 2951298 2969646 3012258 3449889 3169492
16849C169492K54448l76299N63693m74647J12801J67867L83055k16445J04942
16840C688907m5797K35241J8961o1279K01682r6067O47822n55122K13094J76627
16830D424069L6342O8167m194P6677M2289K47217J95867l49763J20999N30567
16820E388237l22491K29414R0966K83901N67164o24230P4665P4794J87765M61969
16810F412154K43727m72126K76068N25453j27918K22646N64448r6696J23740p0969
16800G600527J34342j01132P93167K18780l42295O95037J36065K517N56657J68498
16790I862163J9562L58628Q6308L91842K46935L35893L89559P23713J51194K01241
16780A2767038L87575O61427O1107L30356P04140K92145N67415M54520R58615
$$ plain form
16849 3169492 3423940 3047641 3611334 3136687 3249488 3417355 3800410 3583965 3688907
16840 3688907 3643110 3878351 3897312 3836033 4037715 3941648 4589470 4034348 4247442 4424069
16830 4424069 4460411 4528578 4524384 4601061 4643350 4890567 5086434 4736671 4857670 5388237
16820 5388237 5065746 5295160 5386126 5670027 6237191 5612961 5687626 5762420 5950185 6412154
16810 6412154 6655881 6183755 6459823 6985276 6857358 7080004 7644452 7547756 7671496 7600527
16800 7600527 7734869 7633737 8426904 8645684 8303389 8998426 9134491 9137008 9693665 9862163
16790 9862163 9881725 10240353 10326661 10718503 10965438 11301331 11690890 12414603 12565797 12767038
16780 12767038 13154613 13816040 13877147 14207503 14911643 15203788 15771203 16225723 17184338
16771A7184338J30642J044561O97242J90007Q94025R26714P14423L50723Q37842
16762B2970517J205585J161006P59422J668527P44229J432595J133450R23659
16754C1998990J775630J475050J720579J678616J937879J784408K236814K348905
16746D6956871K376346K748401K473582L639505L005156L542080L571677L759703
16738G2073321M900360M041815N051377N174095N382847N844330O122634O464876
16730A15055655P229443O759979O938424P411538P464425P460176O638614O389085
16722A71347339O189649N262781M125757L339075J863910O42682o10611j335585
16714A90824997l508897l319828n376823o097841o390165o862949p379779p355552
$$ plain form
16771 17184338 17314980 18359541 19056783 19246790 20140815 21067529 21781952 22132675 22970517
16762 22970517 24176102 25337108 26096530 27765057 28509286 29941881 31075331 31998990
16754 31998990 33774620 35249670 36970249 38648865 40586744 42371152 44607966 46956871
16746 46956871 49333217 52081618 54555200 58194705 61199861 64741941 68313618 72073321
16738 72073321 76973681 81015496 86066873 91240968 96623815 102468145 108590779 115055655
16730 115055655 122285098 129045077 135983501 143395039 150859464 158319640 164958254 171347339
16722 171347339 177536988 182799769 186925526 190264601 192128511 192771193 192160582 190824997
16714 190824997 187316100 183996272 178619449 172521608 166131443 159268494 151888715 144533163
16706A44533163p415971p628521p187974o710518o539977o620410o007852n676151
16698I0745789n422691m739104m767364m283257m008796m141475k972737l635172
16690E6775193k793096l148613k571793k213756k454827k285881j948707k177000
16682C7181520j438616j608090j530372j668460q10302j776910j190779j303125
16674B5854866j045724o92749r02137r52212p00557r42634j045032o44553j47918
16665A8781350j140771r05512L9277q54998m18967p37352j50225p81782k00176
16656A3630844k77252l50478n97604m24751l28603l08866n76301j97455l42048
16647A0227486N1889l54713m50429N3271n09804m15860j71972k01299J51105m73078
$$ plain form
16706 144533163 137117192 129488671 122300697 115590179 109050202 102429792 96421940 90745789
16698 90745789 85323098 80583994 75816630 71533373 67524577 63383102 60410365 56775193
16690 56775193 53982097 50833484 48261691 46047935 43593108 41307227 39358520 37181520
16682 37181520 35742904 34134814 32604442 30935982 30125680 28348770 27157991 25854866
16674 25854866 24809142 24116393 23214256 22262044 21561487 20618853 19573821 18929268 18781350
16665 18781350 17640579 16735067 16774344 15919346 15500379 14763027 14612802 13831020 13630844
16656 13630844 13353592 13003114 12405510 11980759 11652156 11343290 10766989 10569534 10227486
16647 10227486 10279375 9924662 9474233 9527504 9017700 8601840 8429868 8228569 8379674 7906596
16637G906596j08889m10375j27334k24728k44268J13039o65106L29268p8465k32650
16627F257088J86567l37145m61167K00182m11992k06981K88910k49863r45576
16618D320023O34852J55090l70247R5772m63205L9637k44355Q2704q0181J96797
16608D366887p9109j94198m52379L40381m997k06376k29509J02730k86431J53031
16598C510030k39622j05905m0938K90923n79458M6670K08045j81278K90169m81435
16588B717201K79840k33695M3831k29261j78691L11255L73120q88336N03022j90217
16578B508069j26334l80931L10779K74291p4972k15334p7876K1923J15846j31177
16568B224284O6192j08400K0416p81013Q67407J75284o50934o8078J27592o5901
$$ plain form
16637 7906596 7797707 7387332 7259998 7035270 6791002 6904041 6238935 6568203 6489738 6257088
16627 6257088 6443655 6106510 5645343 5845525 5433533 5226552 5515462 5265599 4320023
16618 4320023 4954875 5109965 4739718 4835490 4372285 4411922 4167567 4250271 4170090 4366887
16608 4366887 4287778 4093580 3641201 3981582 3976585 3770209 3540700 3643430 3356999 3510030
16598 3510030 3270408 3164503 3123565 3414488 2835030 2881700 3089745 2908467 3198636 2717201
16588 2717201 2997041 2763346 2807177 2577916 2399225 2710480 3083600 2195264 2698286 2508069
16578 2508069 2381735 2000804 2311583 2585874 2510902 2295568 2217692 2239615 2355461 2224284
16568 2224284 2290476 2182076 2202492 1421479 2288886 2464170 1813236 1745158 1872750 1806849
16558A806849J79973R8813l49103k52955O6957L11345K8399m05446K99230n6139
16548A727923J08149m51012J44801J47983l46653J44018M9419k17124M42181k72553
16538A477132l86543K34162K03640L1284J49214j73782k97750N08893n16541j57490
16528A072219O9241n2009K65694k66487r1149R5719J66904l73672L4539M29057
16518A350056j71727j18590M5535k56979O28125o55695L75241k61962K49066j91038
16508I92032j18501P6223q6276L8263K26127k44233K5847j99722K53018O9576
16498A032354k43042Q0255R1455p2405J01696j97522p3932M34619D07041O99245
16488A106286E51691M11225k8160l21077p5885J69506K4356O8583K72843j74701
$$ plain form
16558 1806849 1986822 2085635 1736532 1483577 1550534 1861879 1890278 1484832 1784062 1727923
16548 1727923 1836072 1385060 1529861 1677844 1331191 1475209 1524628 1307504 1749685 1477132
16538 1477132 1090589 1324751 1528391 1559675 1708889 1535107 1237357 1746250 1229709 1072219
16528 1072219 1141460 1089451 1355145 1088658 997509 1093228 1260132 886460 920999 1350056
16518 1350056 1178329 1059739 1105274 848295 1476420 820725 1195966 934004 1183070 992032
16508 992032 873531 949754 863478 901741 1127868 883635 909482 709760 962778 1032354
16498 1032354 789312 869567 961022 888617 990313 792791 718859 1153478 407041 1106286
16488 1106286 551691 962916 934756 613679 537794 707300 731656 800239 1073082 898381
16478H98381l72634N2933J74714j648j34023j60981K63612J04636o9927J79932
16468I34995k17184j22058k55016L20140l1452J1388L3611k53700L69566l18354
16458D71936K28069J55285C36526J11403J21826R5893o8413L43532C42323M42451
16448G84774K33082l30551j86661Q0918j7430J44839n2407k44143j25192N81103
16438H68332m00685L17732k98329j08279K65920k32078L36370n3576j32356J13445
16428F76496k52656O8193K48748L3594k84060J54559j31950k17478O1133J19010
16418D75589J38583j68072J40212j57773m8941N9269A31411M62198j16126O9333
16408E46816J19894B37635K20917L10183l35354J05994A37333K28745E9906L48387
$$ plain form
16478 898381 525747 578680 753394 751746 617723 456742 720354 824990 755063 934995
16468 934995 717811 595753 340737 660877 629425 640813 674424 420724 790290 471936
16458 471936 700005 855290 336526 447929 569755 665648 597235 940767 342323 784774
16448 784774 1017856 687305 500644 581562 564132 708971 656564 412421 287229 868332
16438 868332 467647 785379 487050 378771 644691 412613 748983 695407 563051 676496
16428 676496 423840 492033 740781 774375 490315 644874 512924 295446 356579 475589
16418 475589 614172 446100 586312 428539 379598 438867 131411 593609 477483 546816
16408 546816 666710 237635 458552 768735 433381 539375 137333 366078 59906 408293
16398D08293k6207J55985j57844A04239d2105A28064J39371J05524J02794m5019
16388D30734N085j19189m0692e1306D29582B00040J49111n7470p978J45527B07510
16376A38813K61380j11425k6848Q1816j41304K5625K202J87522J66325j34452
16366D49654J37640j40773L2808q5995l936o9945j9965J25826A33016n3376R2070
16355A71710K28546A29067L59825B16702K27831g0755G72591k07050j12264k17611
16345B35666b19316C25867Q8850A91426K4831q1454M1570J87309A60786i9369
16334E39526I9913k815J1861J44923E561J36438N8786k5272l8508M3557J17026
16323B97588J14436k3828K23304k93952Q8826p9977j38400J70523C8349M19385
$$ plain form
16398 408293 382086 538071 380227 104239 -42105 128064 267435 372959 475753 430734
16388 430734 435819 316630 275938 -51306 429582 200040 349151 291681 283703 429230 207510
16376 138813 400193 288768 261920 343736 202432 228057 230259 417781 584106 449654
16366 449654 587294 446521 479329 393334 389398 319453 299488 425314 133016 79640 171710
16355 171710 400256 129067 488892 216702 444533 -70755 772591 565541 453277 235666
16345 235666 -219316 325867 414717 191426 216257 134803 176373 363682 160786 -99369
16334 539526 99913 97098 108959 253882 5561 141999 200785 175513 137005 180562 297588
16323 297588 412024 388196 611500 317548 406374 326397 187997 358520 38349 457734
16313D57734G4259O3280J4222K23257p0832D2410J17609n8910L1171K55044n7640
16302C29684h5544G9292A1843g9773C5167K23467r0930K78135j4309A59143A6354
16290a33728F5013J49603e2290A10758a28657e0383A19154K35756n6324A23690
16279A74380J22923D8745e3758C8114K14599a14935N2568A8511J51556E7996Q4105
16268A42101m4500d2295k40262C15732C3318J70095k9153b8568k9993E99938d7678
16256C03689G4193O7046a11586C28475n0465K8800A1448K6643M50306e5346A72125
16244A24637L2758a17763B00240M9498N1900K2732D9039L00540j48685a51293
16233B0969J26399a26170B27530A1109K21044J19280p118A54702A6731R729K10696
$$ plain form
16313 457734 74259 137539 151761 375018 304186 42410 160019 101109 132280 387324 329684
16302 329684 -85544 79292 11843 -79773 35167 258634 167704 445839 431530 159143 16354
16290 -133728 65013 214616 -52290 110758 -128657 -50383 119154 354910 298586 123690
16279 174380 297303 48745 -53758 38114 252713 -114935 -62367 18511 170067 57996 142101
16268 142101 97601 -42295 -282557 315732 33318 203413 174260 -28568 -58561 599938 -47678
16256 303689 74193 141239 -111586 328475 278010 306810 11448 38091 488397 -55346 172125
16244 124637 157395 -117763 200240 249738 301638 324370 49039 349579 200894 -151293
16233 20969 147368 -126170 227530 11109 232153 351433 344315 154702 16731 26460 237156
16222B37156O9164m0691I9655J06502H7011N9878N7819M13485a41169A11877M9057
16211A60934l8274a36705A5043J99553a3303C42126F6578Q9711J11709j9876C6644
16199a5058C6088c0155B4091e4940b5089H0123b790C6307J5879K14994d0137E00360
16186a5044B16357b59291B64361r0395a58057g617n4344k14606J28680B92172
16175D79384j42892A59310K09716b23342O5186B1048K10870A03004f4550K5713
16165c8837n2795B04185J1234K89538B44109b14101I4324a04730A34515d9525
16154C29989j20001l5344b60544g574C11675c3419j48739c8349A75P8251J36653
16143B15079a09743A99290r1351N8594f9462B14954a11415n4909C49253a90697
$$ plain form
16222 237156 306320 265629 99655 206157 87011 146889 204708 618193 -141169 111877 160934
16211 160934 122660 -136705 15043 214596 -13303 342126 66578 156289 267998 248122 36644
16199 -15058 36088 -30155 24091 -54940 -25089 80123 -2790 36307 52186 267180 -40137 500360
16186 -15044 216357 -259291 264361 173966 -158057 -7617 -61961 -276567 -147887 292172
16175 479384 336492 159310 369026 -223342 -158156 21048 231918 103004 -64550 -38837
16165 -38837 -91632 204185 215419 504957 244109 -214101 94324 -104730 134515 -49525
16154 329989 209988 174644 -260544 -7574 311675 -33419 -182158 -38349 175 78426 215079
16143 215079 -109743 199290 107939 166533 -69462 214954 -111415 -166324 349253 -190697
16132B34501b01371A69698i7739c3777B63669e1738D8966A6186b25725k11590
16122d37315a27877k2198A04123a82236o432A72198L8918E9516B8026L72969a95468
16110b22918A67196k469p4096e3967m7130B8043M0092i8280d3337B87383j5522
16099B71861J8171A02086J97377h0754B81151b79844d7676r1015A39225K171j1882
16088A29514i0939d3222D4655O5266a41423f0086B57022a18668k23888c4212A27499
16076b16813F7556a8571j06361r92F2284b18730g7424j3081B73723g0997l87139
16065d58136B06221b3892q8416A34339a19057E5982L3979h6735F7136M6858n5077
16054E8917J04878G80N5983K00553O4679E826J27037a4777F6480J35456a37983
$$ plain form
16132 234501 -201371 169698 -97739 -33777 263669 -51738 48966 16186 -225725 -437315
16122 -437315 -127877 -150075 104123 -182236 -188668 172198 211116 59516 28026 400995 -195468
16110 -222918 167196 164727 90631 -53967 -101097 28043 68135 -98280 -43337 287383 271861
16099 271861 290032 102086 299463 -80754 281151 -279844 -47676 -138691 139225 141396 129514
16088 129514 -90939 -43222 44655 109921 -141423 -60086 257022 -118668 -342556 -34212 127499
16076 -216813 67556 -18571 -124932 -125924 62284 -218730 -77424 -90505 273723 -70997 -458136
16065 -458136 206221 -23892 -112308 134339 -119057 55982 89961 -86735 67136 113994 58917
16054 58917 163795 780 56763 257316 321995 5826 132863 -14777 66480 201936 -137983
16042D7316a57408d0765k6206E4562J05433Q2227G6243R997O870J6552a36823
16030a09123k51608D575c25405I2655K2381b4464j26905A56233k7972c24320a10832
16018B73153L7278b02510C8422a19208a66A084a8211G9120K3189b917j45724d4810
16005A33391l773J55238D529e2863H950J11198J1036O5785a49153a2624m1747
15994e4371A48425D4612b27975A03167j0957Q1042q2813d3267B27539e2788i462
15982C93122K39987H6223C2401r267J91203Q5308D6834N473a61036D33100a35929
15970B27170D5281f9941G1780r885k4454n960h7021C5786Q6736J57870B1506o153
15958A5353a12243B26982p5874a71057g6930a9621A61730o2169a41518j09828
$$ plain form
16042 47316 -157408 -40765 -66971 54562 159995 242222 76243 86240 93110 109662 -136823
16030 -109123 -360731 4575 -325405 92655 115036 -24464 -151369 156233 128261 -324320 -110832
16018 273153 310431 -202510 38422 -119208 -166 1084 -18211 79120 102309 -2917 -148641 -44810
16005 133391 129618 284856 4529 -52863 8950 120148 131184 196969 -149153 -12624 -54371
15994 -54371 148425 44612 -227975 103167 92210 173252 90439 -43267 227539 -52788 -9462
15982 393122 633109 86223 32401 23134 214337 299645 46834 52307 -161036 433100 -135929
15970 227170 45281 -69941 71780 61895 37441 31481 -87021 35786 122522 280392 21506 15353
15958 15353 -112243 226982 151108 -171057 -76930 -19621 161730 99561 -141518 -251346
15948b51346h2187j18046e3045j55599N9467D5958a39596j83527F7263a60983
15937d9226B0845b166j30315A73857a18948p5081i5626K7252H0835N1119m7465
15926H4489N7299g641j24424K5651A71507e8938J3977j8601E0175a50571p1799
15915b22370A799c20499D1487r196M0567j9650a55286b2062G3871B2065c24054
15903g663p7562k29642c1817j15051f1190o7893a7154E2477J33452L9928b51169
15891a980r6047q2293C6783Q5110b90629H6733a6185n7287b6477n04575J46511
15880c84541a49876B5099b00890f4469r2247q533k0874C5648J04027o2157a3319
15868F296g5473l31088a5317q2108A9732J49623h44j5046j22695A01977b88158
$$ plain form
15948 -251346 -82187 -200233 -53045 -208644 -149177 45958 -139596 -323123 67263 -160983
15937 -49226 20845 -2166 -132481 173857 -118948 -194029 -95626 -68374 80835 131954 84489
15926 84489 141788 -7641 -132065 -106414 171507 -58938 -44961 -63562 50175 -150571 -222370
15915 -222370 1799 -320499 41487 32291 72858 53208 -155286 -22062 73871 22065 -324054
15903 -7663 -85225 -314867 -31817 -146868 -61190 -129083 -17154 52477 185929 225857 -251169
15891 -1980 -98027 -180320 36783 121893 -290629 86733 -16185 -73472 -26477 -531052 -384541
15880 -384541 -149876 25099 -200890 -64469 -156716 -165249 -186123 35648 139675 77518 -13319
15868 6296 -75473 -406561 -15317 -97425 19732 169355 -844 -15890 -138585 101977 -288158
15856i2427E2243f7357A12912M4041P0209c156F0757e9060j02451A48027a19994
15844A05318i0770f348F8022c8643n1602a2304j11276B21468j1784g6093j6368
15833i2461C15776B5527g1990A559a04988K2449a5058H866a5220B7523b97048
15821d5072A96089D4635a20048k76625A0279J17230c86242A80707E1762N0769
15811A02531a32540A31034a01559A79860k7204h4954B80030N9627a81621j32105
15801c13726F4125b61869e0820j50943B6063d9908j5382B52203f2524j62282a3309
15789b62667O4434N2776B08151J32037A02590J8368m4832d1402A60401J11333
15779B71734a7881A41021a79597B51398r7549b24557J10901k44594j08005A30899
$$ plain form
15856 -92427 52243 -67357 112912 156953 227162 -3156 60757 -59060 -161511 148027 -119994
15844 105318 -90770 -6348 68022 -38643 -90245 -12304 -123580 221468 209684 -76093 -92461
15833 -92461 315776 25527 -71990 1559 -104988 -82539 -15058 8866 -15220 27523 -297048
15821 -45072 196089 44635 -120048 -396673 10279 127509 -386242 180707 51762 102531
15811 102531 -132540 131034 -101559 179860 152656 -84954 280030 339657 -181621 -313726
15801 -313726 64125 -261869 -50820 -201763 26063 -49908 -65290 252203 -62524 -224806 -13309
15789 -262667 -198233 -145457 208151 340188 102590 120958 76126 -41402 160401 271734
15779 271734 -17881 141021 -179597 251398 153849 -224557 -113656 -358250 -466255 130899
15768A06048b2360E5978K34574o0316A9098N3847g1100I943a39178b1962A08138
15756C4988K61194l3689E7729a91366H3392J68577F0316b75217A14790Q5396D1041
15744H7262R6319h8086D8068b34402b2039A31575J38623c4038k84843B14381l0188
15733A84193a62729K3134j75269c117H4224Q8371e6834A14762m2916a09981B08662
15721A61566c00706a24296j74929f9244B97883c15938A79795F3266a08923L2893
15711g6030A863c5612A79088k0999N0969O2007b03504I2057K36622g3805B40944
15699B4871K31336A16755b4453k32024A50781J53157a73804C33343B4149L3308
15689E7457J65970b31009a08216j43278a0728q3400n3459N2553j42327C9042J15119
$$ plain form
15768 106048 -22360 55978 290552 230236 19098 72945 -71100 9943 -139178 -21962 108138
15756 34988 296182 262493 57729 -191366 83392 251969 60316 -275217 114790 200186 41041
15744 87262 183581 -88086 48068 -234402 -22039 131575 270198 -34038 -318881 214381 184193
15733 184193 -162729 -139595 -314864 -3117 84224 172595 -56834 114762 71846 -109981 208662
15721 161566 -300706 -124296 -299225 -69244 297883 -315938 179795 63266 -108923 -76030
15711 -76030 1863 -35612 179088 158089 209058 271065 -203504 92057 328679 -73805 240944
15699 24871 256207 116755 -24453 -256477 150781 303938 -173804 333343 24149 57457
15689 57457 223427 -231009 -108216 -251494 -10728 -94128 -147587 -95034 -237361 39042 154161
15678A54161h2476A66280f9916n1659j13225I6367c15113A32072a57432C56379
15667C64459a59585A92116a74228C8927d5490F3166R0795a47194A96077a31564
15656f3402B12757a41420N1253A2153J12640b75582g2920q6368f9430j34962h0971
15644A31463J452E0727g9091l414B8722L868f5139k60856G366a09564q6925A19744
15631f1561B1748K46962a84031C01562b6691q484H109K11044B8185L80711j83996
15620B24900B9361K106b8209j84617m4504J25490p4568h2005E043d4183A27936
15608A87683h452j9426j19592B12955H9298b53710C4600J1760A6182f5160C52894
15596c8414j08968J1420j86333A16374c0199m8613A1256R8288a84741D6063f4361
$$ plain form
15678 154161 -82476 166280 -69916 -121575 -234800 96367 -315113 132072 -157432 356379
15667 364459 -159585 192116 -174228 38927 -45490 63166 153961 -147194 196077 -131564
15656 -63402 212757 -141420 -90167 12153 124793 -275582 -72920 -159288 -69430 -204392 -80971
15644 131463 132915 50727 -79091 -82505 28722 32590 -65139 -325995 7366 -109564 -196489 119744
15631 -61561 21748 268710 -184031 301562 -26691 -35175 8109 219153 28185 408896 224900
15620 224900 29361 31467 -28209 -212826 -257330 -131840 -206408 -82005 5043 -44183 127936
15608 187683 -8452 -27878 -147470 212955 89298 -253710 34600 46360 16182 -65160 352894
15596 -38414 -147382 -135962 -322295 116374 -30199 -78812 11256 109544 -184741 46063 -64361
15584a88243j2927a4556A24295a6926E3460e3788a997m06523J75637j95182A37307
15572D3279a84018A24632f6347k10955a13592j9908L7896E0386M3505a31408F9706
15560C75982H7956O2415L74711G2683C43a75431A83709a97075A90199C7177a10905
15548C28194A33417a57106e2921G5428k6516p681K4379k7314O396g651E0459B1531
15535D5042J82268f0010D14447j29163J5262A13951D4214L3338e6247A31325R1906
15524B23231a07341j898L9365r9146A21735j7978c82920B7096h008C0728a9659
15512A90006b26982K7288m95A99875G5820b82700J25727D4281A2608a08737m4295
15501a53032B70835E8829J68781l0980j5027a80143p270o7444j6927R6357c2507
$$ plain form
15584 -188243 -201170 -14556 124295 -16926 53460 -53788 -1997 -408520 -232883 -428065 137307
15572 43279 -184018 124632 -66347 -277302 -113592 -133500 -95604 50386 93891 -131408 69706
15560 375982 87956 150371 525082 72683 343 -175431 183709 -197075 190199 37177 -110905
15548 328194 133417 -157106 -52921 75428 48912 41231 65610 38296 44692 -7651 50459 21531
15535 45042 227310 -60010 414447 285284 300546 113951 44214 77552 -56247 131325 223231
15524 223231 -107341 -109239 -69874 -169020 121735 103757 -382920 27096 -8008 30728 -19659
15512 190006 -226982 -199694 -200189 199875 75820 -282700 -156973 44281 12608 -108737 -153032
15501 -153032 270835 58829 227610 196630 181603 -180143 -187413 -254857 -271784 -175427 -32507
15489B3011M02747c10180I7051o886f8943B13884H009J11327c3325B10266I4529
15477a52936A19516j596K86328e0230F9377N4997L45906A60857O5119h1332n4863
15466a36195C1658O2782D3074K75966c16886I1916b23748A02642J4551n3245b54348
15454B40690i1468A79708K26323E133P066g2860a1192A30989j3471a77015H6790
15442i8382j55924A18875a05614F0749f8025m6800C19133a73238Q5027m28372
15432e16583b19488k029d4056G824a40802F274K08346b0361j59347q5015Q9990
15421a74733j26285A05041e2148A09672a6612j49091A5704b7259C894K38719j01611
15410A41002a09829C23904a84358P2208b4j35846N4476j50226C2997h8646E7692
$$ plain form
15489 23011 425758 -310180 97051 90165 -68943 213884 8009 119336 -33325 210266 94529
15477 -152936 119516 117920 404248 -50230 69377 124374 470280 160857 225976 -81332 -136195
15466 -136195 31658 94440 43074 319040 -316886 91916 -223748 102642 117193 63948 -254348
15454 240690 -91468 179708 406031 5133 12199 -72860 -11192 130989 117518 -177015 86790
15442 -98382 -254306 118875 -105614 60749 -68025 -114825 319133 -173238 -88211 -516583
15432 -516583 -219488 -221517 -44056 7824 -140802 6274 214620 -20361 -179708 -264723 -174733
15421 -174733 -301018 105041 -52148 109672 -16612 -165703 15704 -27259 3894 242613 141002
15410 141002 -109829 323904 -184358 -112150 -24 -135870 -81394 -231620 32997 -88646 57692
15398b1261A88467I491a01378A09367n0785a76969O9336B78419A16790e0360j01825
15387a52185O6185k10325J4557f0550A59235g2323o6020B90198a75925j0565A51649
15375C2699a75525g5482G9208K34045j29266c31055K3842a15214a9893D1560a03492
15363E3125b25444j28279A96136a96531M303N2471A43753P0791A03905e4820I8832
15351c43843a2082A59722D7114J75333m7908G0010l2254d0945k2579o4402j51532
15340b79458e2827o4839B53678F9713J44167l7822b03195C6701K52419l0928j12778
15329A45414c58323E7206b4173A54031J69457j53990J23211b94675d4700j43672
15319a88372N6857c4533q9915j57136I7044a29854C10297a41769B69088m643b20518
$$ plain form
15398 -21261 188467 9491 -101378 109367 58582 -176969 -107633 278419 116790 -50360 -152185
15387 -152185 -86000 -296325 -281768 -60550 159235 -72323 -138343 290198 -175925 -186490 151649
15375 32699 -175525 -75482 79208 313253 183987 -331055 -307213 -115214 -19893 41560 -103492
15363 53125 -225444 -353723 196136 -196531 -192228 -139757 143753 214544 103905 -54820 98832
15351 -343843 -12082 159722 47114 222447 174539 70010 37756 -40945 -63524 -127926 -279458
15340 -279458 -52827 -117666 253678 69713 213880 176058 -203195 36701 289120 258192 145414
15329 145414 -358323 57206 -24173 154031 323488 169498 292709 -294675 -44700 -188372
15319 -188372 -131515 -34533 -124448 -281584 97044 -129854 310297 -141769 269088 264445 -220518
15307b61316R2893G5529a14097B47202H6705a4714j48235C0878J09249M6119j6378
15296A69868b5171D9206b34642I0284O325a61881C25539A45275Q6904K69725B8906
15284b03912F4212a7431A78702a87988k8829A51636K42891A11745C1428J07656
15274A39084K59362j89284H5733b41366L3509f6983B24339m5507b5435A75551
15263B85036K48437G2125K40749C5801J22899J78855C4650M11947i8768C79651
15252C60209A53239J70358M03647K22418M70923l86441K72963n28125C67870P5111
15242D42981C8698A3193L2863A7013L0299b8953A06934k6899a2665B57143F0065
15230B68862a16765H2410c36253C69063r8924O5171a41639l7837P0713E5237L57385
$$ plain form
15307 -261316 -168423 75529 -114097 247202 86705 -14714 -162949 30878 140127 186246 169868
15296 169868 -25171 49206 -234642 90284 96609 -161881 325539 145275 232179 501904 28906
15284 -203912 64212 -17431 178702 -187988 -216817 151636 394527 111745 31428 139084
15274 139084 398446 209162 85733 -241366 -207857 -66983 224339 178832 -25435 175551
15263 285036 533473 72125 312874 35801 158700 337555 34650 446597 -98768 379651
15252 360209 153239 323597 727244 949662 1420585 1034144 1307107 778982 367870 442981
15242 442981 38698 13193 46056 17013 47312 -28953 106934 80035 -12665 257143 60065
15230 268862 -116765 82410 -336253 369063 270139 335310 -141639 -179476 -108763 55237 412622
15219D12622c62112g2768D09O9970e589q4247B91850d7921C0377J57559D2189
15207B17783a19638A91095K12323I7793N7091l7561J02461J30837o7544I2548
15196A18219a04659j2135j41160D2443A7632c30387A38999i2609A44339F4973
15185b5312A82538K75886I780L43022d3995j4317I2718b5781j75198C49865D7432
15173B00521k0318J60498d5767k7385K3950K0922B17036F191L17059a90329c5425
15161a52549K7986A21222E6821K3271i6429P994k56A31754G158a71554C03474
15149B10042k1341A0274J73180J99819k5152R5365f36098i7940l3218A708R6043
15138I7751J37821a54081I1109p775J84694p4505I0958a06345E7512J97613d6188
$$ plain form
15219 412622 -362112 -72768 409 70379 -5589 -89836 291850 -47921 30377 187936 42189
15207 217783 -119638 191095 403418 97793 154884 117323 219784 350621 283077 92548
15196 118219 -104659 -116794 -257954 42443 17632 -330387 138999 -92609 144339 64973
15185 -25312 182538 458424 9780 352802 -43995 -58312 92718 -25781 -200979 349865 47432
15173 200521 180203 340701 -45767 -73152 -49202 -28280 217036 6191 323250 -190329 -35425
15161 -152549 -124563 121222 56821 80092 -96429 -88435 -88691 131754 7158 -171554 303474
15149 210042 188701 10274 183454 383273 358121 453486 -636098 -97940 -131158 1708 97751
15138 97751 235572 -154081 91109 83334 268028 193523 90958 -106345 57512 255125 -46188
15126B00009m8123A1174P8907J65875G8325d1093C18653A55269b70119C60421
15115A46425a6904j22568a2341B75176A01930l8347L35926D6154j9893L87329
15105D13590A0144J7214P2663C1042a5136C65982e0469B54920K6563a1941B19503
15093a78202g9287A43598b06137B16139L99662A27049L55568d3654C29977m0825
15083B89152r6251D1886b62982C48691h4428C43563j71420P1989E6579K88031
15073C44610A22741L8439J80171b02495A46544d0935A13669J4782l4222M39683
15063E33912c8794C49686J18650b42577B45598J33012A88234J56394j21528J43386
15053C66486I6255J66875f11D42794A72272K18117G564Q5981K76112D8603K37712
$$ plain form
15126 200009 151886 11174 90081 255956 78325 -41093 318653 155269 -270119 360421
15115 146425 -16904 -139472 -12341 275176 101930 63583 399509 46154 26261 413590
15105 413590 10144 27358 100021 31042 -15136 365982 -50469 254920 281483 -11941 219503
15093 -178202 -79287 143598 -206137 216139 615801 127049 482617 -43654 329977 289152
15083 289152 192901 41886 -262982 348691 -84428 343563 172143 244132 56579 344610
15073 344610 122741 161180 341351 -202495 146544 -40935 113669 128451 94229 533912
15063 533912 -38794 349686 468336 -242577 245598 378610 188234 344628 223100 366486
15053 366486 96255 263130 -611 442794 172272 390389 7564 93545 369657 48603 286315
15042B86315j09935f8378C67413C2491K74660p3526a78584B55460J26795d8031
15031B92219D5853J2953a69471B62025A30664C9281K69893o3526K08641A16397
15020A91356m6486K27661g6635D7757K11213K14107j90947m339p7396q3422J27579
15009B44552c880B68726l3709H3940M56575k34469m0440P5751k6420m3073p4046
14998A97818L31399a63514N0476B05941J9807J34834A47528J69007E4688J80051
14988B34739R1006N7021j54861K0503l1764P6928J6085A9250J65661J77545F8126
14976D47053j26697J49271A14050L14254A56010A2720N5514N07652a82693A74073
14965B52921n4947C2138a28647A45766F5389K37608E7471K56894k1567A36642
$$ plain form
15042 286315 176380 -68378 367413 32491 307151 233625 -178584 255460 382255 -48031
15031 292219 45853 58806 -169471 262025 130664 39281 309174 245648 454289 116397
15020 191356 144870 372531 -76635 47757 258970 473077 282130 277791 200395 116973 244552
15009 244552 -3880 268726 235017 83940 540515 306046 265606 341357 314937 271864 197818
14998 197818 529217 -163514 -113038 205941 225748 360582 147528 316535 54688 234739
14988 234739 325745 382766 227905 248408 216644 293572 309657 19250 184911 362456 68126
14976 447053 320356 469627 114050 428304 156010 12720 68234 575886 -182693 174073
14965 252921 197974 32138 -128647 145766 65389 302997 57471 314365 292798 136642
14954A47736b81883c3767A02298P3281J41451K5741C9739O55098A87686o3211
14944A24475R9121H5094C7714A120K73455c8508A75320M0616K09954A59120B1052
14932E08771A12728m0752P4970J74482L1535K82949j41350O1813j60475J75035
14922E70935k80372R2705f0650B09132n042J66384J43190K5793k41344l2815e7021
14910C74222m5647M3823A30561K56966j41325E0667N95590k68356j38017f300
14899C76842j82844M3933J57120L7633j67427J64981l2695P796L00929k57695
14889D48573q0471K86742B16261k4817j903J95548A81958J57252J06890O7751
14879E13851J1622j87425o3173O3744J27492l5389N6388A63111J91703J50492
$$ plain form
14954 147736 -281883 -33767 102298 175579 317030 342771 39739 694837 187686 124475
14944 124475 223596 85094 37714 1120 274575 -38508 175320 215936 425890 159120 21052
14932 508771 112728 71976 146946 321428 352963 635912 494562 556375 395900 570935
14922 570935 290563 383268 -60650 209132 204090 370474 513664 539457 298113 265298 -57021
14910 374222 328575 372398 130561 387527 246202 50667 646257 377901 239884 -6300
14899 376842 193998 237931 395051 432684 265257 430238 397543 405339 706268 448573
14889 448573 368102 654844 216261 191444 189541 385089 181958 339210 446100 513851
14879 513851 525473 338048 274875 338619 466111 430722 487110 163111 354814 505306
14869E05306B05732K22863M3909j11808j9925L89728j84490j61393J29449L18985
14859H33050C72113L2285I4726P72126B94967M26088A56068L77222j38635j37630
14849B57025J75563K52012k53274N4484j70177G6074L61722M58602C58359L75564
14839G33923j74103J54027C36980n504L0719N88014m33934j07828Q3108n660j14127
14828C71768J85884p2098N020j389j8479J29108l2218A25387J93817M86095l28729
14817D76570j32954l1850O1496K9705K53445O1506c5257E15137n9131K9836L2590
14806E18432K38343l32154p6816J78263r7827P247K46154A29759K01989L1394
14796C63142K11668R4996m3936J61122B65499L14827A42685J01027j8708M92700
$$ plain form
14869 505306 205732 428595 472504 360696 340771 730499 546009 384616 514065 833050
14859 833050 372113 404398 94726 866852 294967 721055 156068 533290 394655 257025
14849 257025 432588 684600 431326 485810 315633 76074 437796 896398 358359 733923
14839 733923 559820 713847 336980 331476 362195 950209 516275 408447 491555 485895 371768
14828 371768 557652 485554 490574 489185 470706 599814 567596 125387 319204 805299 476570
14817 476570 343616 311766 373262 402967 656412 717918 -35257 515137 456006 485842 518432
14806 518432 756775 424621 347805 526068 428241 435488 681642 129759 331748 363142
14796 363142 574810 669806 625870 786992 265499 580326 142685 243712 225004 717704
14786G17704k16638M33118m00123p9138k08881N25699J1149k87671K78269j62256
14776F11232J85449j96826Q6764p6735M1132A42652J90090M64313k85407m5701
14766D65947L83510k44292J42201m8344o1202K14469J47999D96273J93107L24859
14756A014239l59115J00460C27416N29689k76251J60611q6553o4957K20J82639
14746G72814C77433M56730q2799j16740L33467k33763L3762L23585r2854l09085
14736F89736k14592L59567j49235O5844j09806N7321P7992J88366l85121K99662
14726H79734k25984r3934J86696K53669j67944J5972J7113o50l13034L19387j25004
14715G46021r0270N30716m08989M663J69727q9686K875K624l2546J48436K0184
$$ plain form
14786 717704 501066 934184 534061 454923 246042 771741 782890 495219 773488 611232
14776 611232 796681 599855 686619 609884 651016 142652 332742 797055 511648 465947
14766 465947 849457 605165 747366 699022 637820 852289 1000288 496273 689380 1014239
14756 1014239 655124 755584 327416 857105 580854 741465 654912 589955 590175 772814
14746 772814 377433 834163 751364 634624 968091 734328 768090 1091675 998821 689736
14736 689736 475144 834711 685476 751320 641514 698835 776827 965193 580072 879734
14726 879734 653750 559816 746512 1000181 832237 848209 865322 864672 551638 871025 746021
14715 746021 655751 1186467 777478 782141 951868 862182 865057 867681 835135 983571 1003755
14704A003755j80021R7328m4147k86811l9405K43218m8618J63416j05616L65829
14694A168928k91265r4287L25553j51374k88380M42603j84896j84931K6535J54777
14684I23263m4600o1271J58826j53804K21812n9530j02760j34381O09784m0493
14674A316846k55377m88073N97771j09053j72556L2555j93833M64468j35012J8310
14664A076046K60788j18015j98979l92975K92855L47107o5296k59327j32441M91978
14654A301741k57348M62278k09077j19768l94674L65984j11346k0613j32823N10856
14644A395210k21129J43169q9434k1492j4416l2857J8603p3345N4131N03709o2043
14633A600106k16442O3868l2181J15087Q6013l44347M02271k67429J3131J73408
$$ plain form
14704 1003755 823734 921062 876915 590104 550699 793917 745299 908715 803099 1168928
14694 1168928 877663 783376 1108929 957555 669175 1111778 926882 741951 768486 923263
14684 923263 878663 817392 976218 822414 1044226 984696 881936 747555 1357339 1316846
14674 1316846 1061469 573396 1171167 1062114 889558 922113 728280 1192748 1057736 1076046
14664 1076046 1336834 1218819 1019840 626865 919720 1266827 1201531 942204 809763 1301741
14654 1301741 1044393 1506671 1297594 1177826 783152 1149136 1037790 1017177 884354 1395210
14644 1395210 1174081 1317250 1227816 1206324 1191908 1159051 1177654 1104309 1158440 1662149 1600106
14633 1600106 1383664 1447532 1415351 1530438 1616451 1272104 1674375 1406946 1420077 1593485
14623A593485k21540K8446j37145J19024K03849j41035J36003J53402m26057J45415
14613A453847L4399j06617N6208j54304M46090m6406L7251j43630j60509L3140
14603A449469J47912P8720k96892M25325j73318k3557j21468K50980m92990M62533
14593A706714j1679J36982k70529J52995p7914K13059j13075K6705Q1618J1483
14583A856359K97229m14521L65817m09233M9003K02512M55141j80717k10976k33088
14573A777526M89855m8308j5677O078L3560M4312j43998L98324j95793L36793
14563B682672k94868L12621k36706L5669O74647j90732l51786O20585k31825L38065
14553C358342M14776O06917M24508J651746K301277M440477Q773376J7374762
$$ plain form
14623 1593485 1371945 1400391 1263246 1382270 1586119 1445084 1581087 1734489 1308432 1453847
14613 1453847 1488246 1381629 1437837 1283533 1729623 1683217 1720468 1576838 1416329 1449469
14603 1449469 1597381 1676101 1379209 1804534 1631216 1607659 1486191 1737171 1244181 1706714
14593 1706714 1695035 1832017 1561488 1714483 1636569 1849628 1736553 1763258 1844876 1856359
14583 1856359 2153588 1739067 2104884 1695651 1744654 1947166 2402307 2221590 2010614 1777526
14573 1777526 2267381 2219073 2203396 2209474 2243034 2287346 2143348 2541672 2345879 2682672
14563 2682672 2387804 2700425 2463719 2499388 3174035 2983303 2631517 3252102 3020277 3358342
14553 3358342 3773118 4380035 4804543 6456289 8757566 13198043 21971419 39346181
14545C9346181L661711B0777001G986430l740681j214754k15716n93395o4381
14537B157503J59280j96599j32972L19092N6749j33116l08640K23727j51020O9204
14527B063208L77610O294Q9157l90442L30813l47630J47713L22007j11617Q9938
14517B577051k2583j3530R8341L01572m28946J88434L2305J59889k1309L5994
14507B907218k3923N9932L23977k20455j22887J4222n4371j10654K85422K42863
14497C301344q4119J66270l39252N7881K71578j99329M60765l30682K65455j34159
14487C435752J23536l03147j94860O30087M16343l29126O0122j9807Q6721q7513
14477C818108k2413J34744j02081J90220K27747L1423j68124L16197k76143Q4593
$$ plain form
14545 39346181 43007892 20777001 7986430 4245749 3030995 2815279 2221884 2157503
14537 2157503 2316783 2120184 1987212 2306304 2363053 2229937 1921297 2145024 1994004 2063208
14527 2063208 2440818 2447112 2536269 2145827 2476640 2129010 2276723 2598730 2487113 2577051
14517 2577051 2554468 2540938 2639279 2940851 2511905 2700339 2732644 2892533 2871224 2907218
14507 2907218 2883295 2943227 3267204 3046749 2923862 2938084 2883713 2773059 3058481 3301344
14497 3301344 3217225 3383495 3044243 3102124 3373702 3174373 3635138 3304456 3569911 3435752
14487 3435752 3559288 3256141 3061281 3691368 4107711 3778585 3838707 3818900 3905621 3818108
14477 3818108 3795695 3930439 3828358 4018578 4246325 4277748 4109624 4425821 4149678 4234271
14467D234271k9504L60534k33132K04634K2756M1386l0929O8697L52314j32940
14457D858087o1811J7840o6802M71064j05548J49976j63266r4341K48153Q6279
14447E339631M37303J02829l44126n8279Q5338M88916k13663J08309R2628j64181
14437E874705M47414o7662J19984J13092m12009Q03757k23161q8239J62072K66390
14427F996343J45858j97663L00777J41610N4396L75645p3655K19381j24704p5661
14417G762327K69805J25152K46188J15866j48956L04459L53558q6195K52372K39120
14407I433696k41320L21736N00401l08454L62908n2662J30083M83023Q1727L0164
14397A0741302P7942L77853L45191j30199K56570K55787M36731Q1676k68482K73596
$$ plain form
14467 4234271 4204767 4565301 4332169 4536803 4559559 4600945 4570016 4638713 4991027 4858087
14457 4858087 4796276 4814116 4747314 5218378 5112830 5262806 5099540 5005199 5253352 5339631
14447 5339631 5776934 5879763 5535637 5477358 5562696 6051612 5837949 5946258 6038886 5874705
14437 5874705 6322119 6254457 6374441 6487533 6075524 6879281 6656120 6567881 6729953 6996343
14427 6996343 7142201 6944538 7245315 7386925 7441321 7816966 7743311 7962692 7837988 7762327
14417 7762327 8032132 8157284 8403472 8519338 8370382 8674841 9028399 8942204 9194576 9433696
14407 9433696 9192376 9514112 10014513 9706059 10068967 10016305 10146388 10629411 10711138 10741302
14397 10741302 10819244 11197097 11542288 11412089 11668659 11924446 12361177 12442853 12174371 12447967
14387A2447967N42722j33183P51720n99119P03592K65026o8N45949L91622j06534
14377A4809694L37073K15625O24058J02172q3428P15712L67347J50612K40985
14368A7479850M15859M69089L25027Q68933n1019K40226M00951K60677Q32868
14359B1242461K43337P31348N25083P50036L4841Q50345M70170L43893J273753
14350B6465267J41192O14870Q28033P12310R19409N56599J118464L76562J458530
14341C3191236N64020O41059J399584P14726J103079J319498P13752J523983J243112
14332D2414049J303324J040191J409986J829628J631721J436262J396482J879884
14324E4341527K220766J624022J919432K155936K387414K565963K219752K641998
$$ plain form
14387 12447967 12990689 12857506 13609226 13010107 13713699 13978725 13978657 14524606 14916228 14809694
14377 14809694 15146767 15362392 15986450 16088622 16005194 16720906 17088253 17238865 17479850
14368 17479850 17895709 18364798 18689825 19558758 19507739 19747965 20148916 20409593 21242461
14359 21242461 21485798 22217146 22742229 23492265 23527106 24377451 24847621 25191514 26465267
14350 26465267 26606459 27221329 28049362 28761672 29681081 30237680 31356144 31732706 33191236
14341 33191236 33755256 34396315 35795899 36510625 37613704 38933202 39646954 41170937 42414049
14332 42414049 43717373 44757564 46167550 47997178 49628899 51065161 52461643 54341527
14324 54341527 56562293 58186315 60105747 62261683 64649097 67215060 69434812 72076810
14316G2076810K966190L045357L049002L481181L036071L786105L831670M246728
14308I9519114M505225M110524M884096N477710N365982N813665O163489O529922
14300A42369727P012766P484555Q283111Q112257R188845R680940J0283017J0563109
14292B12978327J1141762J2498955J2155441J3732077J3680286J4772898J5198764
14285C06158510J5649754J6438824J6014342J6818156J6619418J5880386J5797317
14278D19376707J4855277J3823505J1816749J0150393N108000J658825k273o13530
14270D76173653P22368j934139m457108n514031r970518j1375894j3069749j4155317
14262D16419265j5431622j6152677j7023250j7112336j6905481j6770150j5755107
$$ plain form
14316 72076810 75043000 78088357 81137359 84618540 87654611 91440716 95272386 99519114
14308 99519114 104024339 108134863 113018959 118496669 123862651 129676316 135839805 142369727
14300 142369727 149382493 156867048 165150159 173262416 182451261 192132201 202415218 212978327
14292 212978327 224120089 236619044 248774485 262506562 276186848 290959746 306158510
14285 306158510 321808264 338247088 354261430 371079586 387699004 403579390 419376707
14278 419376707 434231984 448055489 459872238 470022631 475130631 476789456 476787183 476173653
14270 476173653 476896021 474961882 470504774 464990743 455020225 443644331 430574582 416419265
14262 416419265 400987643 384834966 367811716 350699380 333793899 317023749 301268642
14255C01268642j4657428j4633060j4029278j3504153j2547045j2222976j1034023
14248B08640679j0749675j0299563r304878q912520q036199p555194p382156p041854
14240A39358640o861020n625584n586354n549252m776603n411441m277035m297916
14232I6973435l703988l557922l425647l549939l518723l199029k622216k821773
14224G0574198k444354k517207k527549k133597j939030j676941k345866j523948
14216E3465706j721207j809019j050139j555458j954014r61612j598488j287595
14208D1528174j127152j62236j453022j427167j047271r40287j188791o83647
14200C3498601o88675q35806r29697j130521k89418j161589m01350n57302o36949
$$ plain form
14255 301268642 286611214 271978154 257948876 244444723 231897678 219674702 208640679
14248 208640679 197891004 187591441 178286563 169374043 161337844 153782650 146400494 139358640
14240 139358640 132497620 126872036 121285682 115736430 110959827 105548386 101271351 96973435
14232 96973435 93269447 89711525 86285878 82735939 79217216 76018187 73395971 70574198
14224 70574198 68129844 65612637 63085088 60951491 59012461 57335520 54989654 53465706
14216 53465706 51744499 49935480 48885341 47329883 45375869 44414257 42815769 41528174
14208 41528174 40401022 40238786 38785764 37358597 36311326 35371039 34182248 33498601
14200 33498601 32809926 31974120 31044423 29913902 29624484 28462895 28061545 27504243 26867294
14191B6867294r68700o08308n88150o09365m39842p06856p29044k60911m97090
14182B1459028m12086k90178p71383J92528r56711j51419l71724r66382J23121
14173A7854794m44718q6683n54070j61358n86695j7780m55819p82593J75329m54850
14163A4485557m61529k73014J1783l22861n56158M5032J44198o31451l64304J5761
14153A2093014p0814o43738r6992P0337k10599m5773n45230l1080O229j51171
14143A0374183P6836n72549j54949o9130l67678J83300m7118l41776J4631k19767
14133H875983l77290J36532n54741j77p3445J34600k50472l3570l40803L33467
14123G850084l15608K49514k70748j07924j92497o6742r0271M0255n64184J89592
$$ plain form
14191 26867294 25898594 25290286 24702136 24092771 23652929 22946073 22217029 21956118 21459028
14182 21459028 21046942 20756764 19985381 20177909 19221198 19069779 18698055 17731673 17854794
14173 17854794 17410076 17323393 16769323 16607965 16021270 16003490 15547671 14765078 14940407 14485557
14163 14485557 14024028 13751014 13762797 13439936 12883778 12928810 13073008 12441557 12077253 12093014
14153 12093014 12022200 11378462 11281470 11351807 11141208 11095435 10550205 10519125 10525354 10374183
14143 10374183 10451019 9878470 9723521 9654391 9286713 9470013 9422895 9081119 9095750 8875983
14133 8875983 8498693 8635225 8080484 8080307 8006862 8141462 7890990 7857420 7516617 7850084
14123 7850084 7534476 7783990 7513242 7405318 7212821 7146079 7055808 7096063 6531879 6721471
14113F721471k66993j5124J58271k33970K54229o09861K09127m50844J33582N0526
14103E950414j88861M4325K83332k97199l81843n662j51332N24734l58145K91041
14093E710804n72203J33049j35314j74909J43752K2895m12800l20427L31236Q4723
14083D810806J4022k83653k62154L67116r5321K0730n6296k49526J76884n60189
14073C882419J66547J68847K26628p6488k60346l36426K37127j46631J14174m37374
14063C538477J00351m9257K32143n2586j90074M49522j09004j85345M1465l62634
14053C413058p2217K2715j73083L74923o63583L43813n0846j30595n5817J69600
14043C177968M0723l76408K45952j213l4860j57950k42800J24930J86645m7175
$$ plain form
14113 6721471 6454478 6439354 6597625 6363655 6617884 6008023 6217150 5766306 5899888 5950414
14103 5950414 5761553 5805878 6089210 5792011 5410168 5404506 5253174 5777908 5419763 5710804
14093 5710804 5138601 5271650 5136336 4961427 5105179 5128074 4715274 4394847 4726083 4810806
14083 4810806 4824828 4541175 4279021 4646137 4550816 4571546 4515250 4265724 4442608 3882419
14073 3882419 4048966 4217813 4444441 4367953 4107607 3771181 4008308 3861677 3975851 3538477
14063 3538477 3638828 3589571 3821714 3769128 3579054 4028576 3919572 3734227 3775692 3413058
14053 3413058 3340841 3363556 3190473 3565396 2901813 3245626 3194780 3064185 3008368 3177968
14043 3177968 3218691 2842283 3088235 3087022 3052162 2894212 2651412 2776342 2962987 2915812
14033B915812K17957l81237R6844J08950j95870j8193j89153J20343k884K0050
14023B692619n7117K07460l20918n9817Q7955k63537P7324K41321j14143n8903
14013B432244j67462L02202k18414l83439N608K30863l77275L29294k12449N6033
14003A997205o2812K1600j58739J61398K18490k85985j93503M44300k88270L1040
13993A884724L04997l11072L43432N95152K006163L060329P480283J6810588J1080299
13984D3254895j8252052A2320498m676843k071605j056955l94094p00366l13810
13976C106825p9424k58081k48396M4020j08037M7862j97527K47928k27441j76432
13966B151297n4588j14949J10002J82814m36321J70720J29100l34876M6025N54110
$$ plain form
14033 2915812 3133769 2752532 2849376 2958326 2762456 2744263 2555110 2675453 2672569 2692619
14023 2692619 2635502 2842962 2522044 2462227 2550182 2286645 2363969 2605290 2491147 2432244
14013 2432244 2264782 2566984 2348570 1965131 1970739 2201602 1824327 2153621 1941172 1997205
14003 1997205 1934393 1955993 1797254 1958652 2177142 1891157 1697654 2141954 1853684 1884724
13993 1884724 2189721 1878649 2222081 2817233 4823396 7883725 15364008 32174596 43254895
13984 43254895 25002843 12320498 7643655 5572050 4515095 4121001 3420635 3106825
13976 3106825 3027401 2769320 2520924 2564944 2456907 2504769 2307242 2555170 2327729 2151297
13966 2151297 2096709 1981760 2091762 2274576 1838255 2008975 2138075 1803199 1849224 2403334
13956B403334k43583k87619j34431j35467O47874k97156n66261P37829j75146
13947A949374m16421K80824J03664n97798N92084l68173J9118P5480K1650r0135
13937A569667j16801J21979J30555j68313l09344M60562j51395j36376K23311
13928A623845r2193j03603m2692j0748j52783K96630j71711L513J72312n7735
13918A464835L13847n8456k16664m43269N05025k57220O2259m5457N1117k00563
13908A175454M02082m79548M64517j39833m0810m59751L48980K87782k29530k30073
13898A099270O96213p85233M46577m95288J45913L44286k95087j83517K50885
13889A224019K76888m45155j16536J90622K22625j82156M2914n9545l6934k2976
$$ plain form
13956 2403334 2159751 1872132 1737701 1602234 2250108 1952952 1386691 2124520 1949374
13947 1949374 1532953 1813777 1917441 1319643 1911727 1543554 1562672 1638152 1659802 1569667
13937 1569667 1452866 1574845 1705400 1537087 1227743 1688305 1536910 1400534 1623845
13928 1623845 1531652 1428049 1385357 1374609 1221826 1518456 1346745 1350258 1522570 1464835
13918 1464835 1778682 1720226 1503562 1060293 1565318 1308098 1370357 1324900 1376017 1175454
13908 1175454 1577536 1097988 1562505 1422672 1381862 922111 1271091 1558873 1329343 1099270
13898 1099270 1795483 1010250 1456827 961539 1107452 1451738 1156651 973134 1224019
13889 1224019 1500907 1055752 939216 1129838 1352463 1170307 1213221 1153676 1116742 1093766
13879A093766L1227p1607p2526K56754n3750j27933p9501q4161K68534r169j10437
13868A041197Q1625K02632k64415j56552J18404k49470K28888l19949j12527N49558
13858A119391l7373K10619k56562j87063J23380j84955L4835K2467p8520M04871
13848A171090l81757K21539O6302k51733N06469n31777K60616j15735m12739L09870
13838H42145r5503l7505L21074C23288N25124n9175m0336q0746P4449K21357k58783
13827G05178J95780M8143j75133k80121L16856j97269j61847L88639j24080L0160
13817G46306p5786J30199k37711M80499m67518M63926k09423J79913k23425p0744
13807G16236j56115K98544j64047K9442J1777R1770o5793k01830R7272k20408
$$ plain form
13879 1093766 1124993 1053386 980860 1237614 1183864 1055931 976430 892269 1160803 1151634 1041197
13868 1041197 1122822 1325454 1061039 904487 1022891 773421 1002309 682360 569833 1119391
13858 1119391 1082018 1292637 1036075 849012 972392 787437 822272 844739 766219 1171090
13848 1171090 789333 1010872 1077174 825441 1331910 800133 1060749 945014 532275 842145
13838 842145 746642 709137 1030211 323288 848412 789237 748901 668155 742604 963961 705178
13827 705178 900958 949101 773968 493847 810703 613434 451587 840226 716146 746306
13817 746306 670520 800719 563008 1043507 575989 1039915 830492 1010405 786980 716236
13807 716236 560121 858665 694618 724060 735837 827607 761814 559984 657256 436848
13797D36848N11011k05775j30896J19718j32117J88776j78167J60427o2745k63608
13787D43472L41783m3318p5722n985k22538N8370K5861M3775J07728j00349J56386
13776G29463B24551K89374R718N13047k34896k12739K92515L2599D47803o1447
13766C86356K14805K30355A58267P09664C07184M56931p6169l6058k63395L17782
13756G06275k524C38334A54688M20318k64889J38188j10595N58028k25524q5764
13746E84450O6241K18041l90193J42016j54251n163J63415K06888B76935L58206
13736F35141K37114D24093p4494j62278L30779j02956J56155J97529k79509K1282
13726E10601O0977k06669a32559E95976n589J02519k90524K83020k21829M9835
$$ plain form
13797 436848 947859 742084 611188 730906 598789 787565 609398 769825 707080 443472
13787 443472 785255 741937 666215 660230 437692 496062 521923 565698 673426 573077 729463
13776 729463 224551 513925 523643 1036690 801794 589055 881570 914169 447803 386356
13766 386356 601161 831516 158267 867931 307184 764115 687946 651888 388493 706275
13756 706275 703751 338334 154688 575006 310117 448305 337710 895738 670214 584450
13746 584450 650691 868732 478539 620555 466304 461141 624556 831444 276935 635141
13736 635141 872255 424093 349599 187321 518100 415144 571299 768828 489319 510601
13726 510601 571578 364909 -132559 595976 590387 692906 402382 685402 463573 513408
13716E13408m3585j75903K10033J67071m2782k32227L66536l01847L74154l55793
13706D79065k23864N83754L6531A41733M02887j24152K54583F7192M13092k38088
13696B42196L27117J6248j92312J03892p806j20825j35437J61234J09225k32156
13686B71376J92699J80744k53703A26872J73121L10244k91839D9878O82176B29343
13675E91422k54839K06034Q1003k67899J07030A86636L17419A25652L94137q4913
13665D34876J2374j71422K36017k52115n2122K08838M1801j53842L40853l19865
13655C25393P3323n4696o6447K25672k32673M94448B91808o5703K42101O7787
13645E35993Q9866A79104J9918L0747k3387j0585K31926j26401K46266k52750
$$ plain form
13716 513408 469823 293920 503953 671024 628242 396015 762551 460704 834858 479065
13706 479065 255201 838955 875486 141733 544620 420468 675051 67192 480284 242196
13696 242196 569313 585561 393249 497141 489335 368510 233073 394307 503532 271376
13686 271376 464075 644819 391116 126872 299993 610237 318398 49878 732054 229343
13675 591422 336583 542617 623620 355721 462751 186636 504055 125652 519789 434876
13665 434876 447250 275828 511845 259730 207608 416446 458247 304405 645258 325393
13655 325393 398716 344020 277573 503245 270572 765020 291808 226105 468206 535993
13645 535993 625859 179104 199022 229769 206382 195797 427723 301322 547588 294838
13635B94838J79457j00376A18820J01982R6218J76298p275o9490k1665J68532
13625E63420j91092K30017A63469J26272N9996J17511j56225L85649B50344L18853
13615E69197k59513n1257j05995J44031p5679J75530J47307A18947M35278A98288
13604C47201A12893L01152A12191K03767n2045p3182R0494J21001n861A77764
13593B37440r5331J07235L31027o6492N7285a7525D15444g7786D29619R5620J82699
13582G07938l43655J11916B31523K27754r5020O161j39546P1193K65957d9549
13571F676O2482L61973A08047A3772K75448J14122j17622k4979K5522m3257n8722
13560A84284o9478J0517D2056N86831A63691K3582G0724a34742C41222j13769
$$ plain form
13635 294838 474295 373919 118820 220802 317020 493318 486043 416553 394888 563420
13625 563420 372328 602345 163469 289741 349737 467248 311023 696672 250344 569197
13615 569197 309684 258427 152432 296463 220784 396314 543621 118947 554225 198288
13604 347201 112893 414045 112191 315958 263913 190731 281225 402226 396365 177764
13593 237440 142109 249344 580371 513879 571164 -17525 415444 -77786 429619 525239 707938
13582 707938 364283 476199 231523 459277 364257 370418 230872 302065 568022 -49549
13571 6676 69158 431131 108047 13772 289220 403342 285720 260741 286263 243006 184284
13560 184284 114806 125323 42056 628887 163691 187273 70724 -134742 341222 227453
13550B27453J01106M7670j16651C6012K46362m7415L80750j80307L3705q5569
13540C83538f6704B25405K62489B07738J165J12283J56207A29697L2144a22165
13529A54443L77613A49068k8982L60859j82304j27060J14702j14317J49832m0964
13519B80834b587A28935L11589B12453h1622C22850q6984K83044p751A87633K16141
13508D03774C5143a036C05380p1051L20317k30278J02015A49382F3666a58157
13497H2442L30690A03972J6050a642q5491E2828J62835h6555E4270A69N23975
13486E24144A99466b3035D60934A91817J546o3442M42867I9191O0720F2549f2589
13474B20982j253G9183O7395M9602q2469K05937k4853J16180A61853o5282Q6612
$$ plain form
13550 227453 328559 376229 259578 36012 282374 234959 615709 435402 469107 383538
13540 383538 -66704 225405 487894 207738 208903 321186 477393 129697 161841 -122165
13529 154443 532056 149068 120086 480945 298641 171581 286283 171966 321798 280834
13519 280834 -2587 128935 440524 212453 -81622 322850 235866 518910 511159 187633 403774
13508 403774 35143 -1036 305380 234329 554646 324368 426383 149382 63666 -158157
13497 82442 413132 103972 120022 -1642 -87133 52828 215663 -86555 54270 169 524144
13486 524144 199466 -23035 460934 191817 193363 129921 572788 99191 159911 62549 -62589
13474 220982 219729 79183 146578 196180 113711 319648 294795 410975 161853 96571 183183
13463A83183J84770i562A75919K16727A95322J75458j49212a6649A68264J09934
13453B78198b64268A05910O1852J86569E8471J46649K19337I8343i4883A85397
13442b2679A52006E7461N1175J76869j6422A06809L46670e1501k2285B17030H2649
13430D48339F9583a91713C02923A43900E0043K6751L1433a79076K0875c3058B1693
13418E6931Q3755e1544K1933B9116J9269J75548k9041d9967B56314J2133r7099
13407A71348m280j3945a14988A755K46009j01617J81677i3398B72065j00592R8872
13396B70345j4413P944H6019J54394A14803K26059e6350B12521K00167A54432
13385B58283C2417L8224a80563D77982f0594j30724d0731F8980L84930I4710Q7531
$$ plain form
13463 183183 367953 -9562 175919 392646 195322 370780 221568 -16649 168264 278198
13453 278198 -264268 105910 167762 354331 58471 205120 424457 98343 -94883 185397
13442 -22679 152006 57461 108636 285505 269083 106809 453479 -51501 -73786 217030 82649
13430 448339 69583 -191713 302923 143900 50043 76794 108227 -179076 -158201 -33058 21693
13418 56931 140686 -51544 -29611 29116 48385 223933 194892 -49967 256314 268447 171348
13407 171348 167068 153123 -114988 1755 247764 146147 327824 -93398 272065 171473 270345
13396 270345 255932 263876 86019 240413 114803 340862 -56350 212521 412688 154432
13385 258283 32417 70641 -180563 477982 -60594 -191318 -40731 68980 453910 94710 182241
13374A82241o7494J3228a4562E6466L56835A49824J31236e4980l07070B63556
13363C23813j20746J30849J26925e4340p468B71736A21884J44474k1222b9345
13352B66669A14620l3234J88270l2115A10339I899L50287l426O1791A37338L8335
13341A75673j1398J20602j13377f9390D3162L03509N5091j1934A71898P2292J56633
13330D00823J77924H8644K12358F5645R0382m9751h9473A57890o5649m3079P2413
13319A21575L29531A34366K05494d1615A17913K59223j34344N435m8909M1010
13309B40328a0681B13901l3932p5739J92701L5762C8691N18816B35140F8073a00475
13297B24676m7278J24761d0026j50176C08855k2659j38124a55539B29200i010
$$ plain form
13374 182241 114747 127975 -14562 56466 413301 149824 281060 -54980 -362050 263556
13363 323813 203067 333916 460841 -54340 -61808 271736 121884 266358 245136 -29345
13352 266669 114620 81386 269656 237541 110339 9899 360186 356760 418551 137338 175673
13341 175673 164275 284877 171500 -69390 43162 346671 401762 389828 171898 244190 400823
13330 400823 578747 88644 301002 65645 156027 106276 -89473 157890 92241 49162 121575
13319 121575 451106 134366 339860 -41615 117913 377136 242792 248227 199318 240328
13309 240328 -10681 213901 179969 104230 296931 332693 38691 557507 235140 68073 -100475
13297 224676 177398 302159 -40026 -190202 308855 286196 148072 -155539 229200 -9010
13286B20303A04356J21880c5530I7703J32369c6194j47252b4093D35987j69366
13276B66621J51941A49204P7380i2849C5300Q4231P1714A9010J72476H796L6761
13265D5557a7361h88A31700c2576C01326L1815j3093A8588i8852L1588C02903
13253b1028G592a9359D0147L95062e0819M385A94987a20317E7438J12474a72591
13241C37964a22090c3135C88220C004b6888G833J02848K55079r7449K178d12929
13229C87885A32909a0066G5507J2207a02636C02501c74437B35393J90218j60218
13219B65393A1659L6730M22174B32601d4701C8348L4031K41560j31176q0948h1158
13207A69800o9360d2386j40661A12780J0935b1272C98908D2656a76717h3724A0423
$$ plain form
13286 220303 104356 226236 -35530 97703 230072 -36194 -183446 -24093 435987 266621
13276 266621 418562 149204 226584 -92849 35300 119531 191245 19010 191486 8796 45557
13265 45557 -17361 -888 131700 -32576 301326 333141 320048 18588 -98852 -67264 302903
13253 -21028 7592 -19359 40147 435209 -50819 -46434 194987 -120317 57438 169912 -172591
13241 337964 -122090 -33135 388220 3004 -26888 7833 110681 365760 268311 270489 -412929
13229 387885 132909 -10066 75507 87714 -102636 302501 -374437 235393 425611 265393
13219 265393 11659 48389 470563 232601 -44701 38348 72379 313939 182763 101815 -81158
13207 169800 100440 -42386 -183047 112780 123715 -21272 398908 42656 -176717 -83724 10423
13195C04519a39233H4314L66318d0551j73832C00095A01684K7566a65766A92189
13184A06602P3066C5608e7636A695c7371k20036K5164B09269R4397f6403B18573
13172b0132A45987e816l38426E3597J68189K5491D8888J46617r736L1969a08353
13160b27179c5257A38468J42992i8127C47983H7006b01456B44049a02854A77624
13149I5241J59708g9434C55537A2925J98573C5028J72552c37854C96628j97988
13139A98640g8051j14258I0777P8935J06592a13703B94N39K51604a08971r358
13128a18329A54932J64564A04530b79778a27703A97341D5829c3912A91373J4907
13118B06280A00743K29532g317k17386B41408b24529E2615O6128F354a307n91
$$ plain form
13195 304519 -139233 84314 450632 -40551 -214383 300095 101684 129250 -165766 192189
13184 106602 179668 35608 -57636 1695 -37371 -257407 -232243 209269 303666 -66403 218573
13172 -20132 145987 -5816 -344242 53597 221786 247277 48888 195505 185769 217738 -108353
13160 -227179 -35257 138468 281460 -98127 347983 87006 -201456 244049 -102854 177624
13149 95241 254949 -79434 355537 12925 211498 35028 207580 -337854 396628 198640
13139 198640 -78051 -192309 90777 169712 276304 -113703 294 833 252437 -108971 -118329
13128 -118329 154932 319496 104530 -279778 -127703 197341 45829 -33912 191373 206280
13118 206280 100743 330275 -7317 -224703 241408 -224529 52615 118743 6354 -1307 -1898
13107a898H4948k4395b9577q3253A11404B5670b57086F1725R6404D0770a1468
13095C6818p274K63825J47191B0855J99594a40713b7042G5698p748f9213A77207
13083a95287D66145A97021K14349i3703k4471B33058a7799H5080c46990d8923
13072B02342A9902J28188J37083F0229g3108g928l79834a90423p0808C25451A01317
13060b6495G3670d0228L838J6732F4141j6094d0669C05940j30329H0246f2749
13048C04617A17822a41671H4725J77628E1020J88212a37571c3447A17785n5700
13038F2085c14910J11412K7846G329c18933f5104E7027O8488I647i2224C17332
13026G5578l7763M4053c65990C45038A40103l2756K25918G2517J13089L88572
$$ plain form
13107 -1898 84948 60553 -29577 -112830 111404 25670 -257086 61725 158129 40770 -11468
13095 36818 29544 293369 440560 20855 220449 -140713 -27042 75698 67950 -69213 177207
13083 -195287 466145 197021 411370 -93703 -118174 233058 -17799 85080 -346990 -48923
13072 202342 19902 148090 285173 60229 -73108 -7928 -387762 -190423 -261231 325451 101317
13060 -26495 73670 -40228 -36390 -19658 64141 48047 -40669 305940 175611 80246 -62749
13048 304617 117822 -141671 84725 262353 51020 239232 -137571 -33447 117785 62085
13038 62085 -314910 -203498 -175652 7329 -318933 -65104 57027 125515 9647 -92224 317332
13026 75578 37815 81868 -365990 345038 140103 107347 333265 72517 185606 574178
13016E74178k70497D3233f4377H6930J09295L14770B23661P6516D2653r897i7168
13004b42213b3829j40175B3138J14171d5062j1794A33485n9320i7874C96008a25414
12992b00954b8404k82799a19172N3181j77258o9518j04766A21012a10343C92821
12981i1567B30334c5370B31576l2693q8179B1339c4191A62707a7691j71739G496
12969g9675B75308j36653J63376A8210b7819l9694I5352D2030i9119H4362L6147
12958A20509O7605Q6767B8501P0507h231k99667B87520a95725A07624c5303A70239
12946B09357K07697A00299k7938Q4516D7666K94181A06878J76048a97566A88883
12935H6470K77153f8822j02969C2648a22931C54162C245a80667A85207a53965
$$ plain form
13016 574178 303681 43233 -64377 86930 196225 510995 223661 300177 42653 32756 -97168
13004 -242213 -23829 -164004 23138 137309 -45062 -56856 133485 74165 -97874 396008 -125414
12992 -200954 -28404 -311203 -119172 -65991 -243249 -312767 -417533 121012 -110343 392821
12981 -91567 230334 -35370 231576 198883 110704 21339 -34191 162707 -17691 -189430 7496
12969 -79675 275308 138655 302031 18210 -27819 -67513 95352 42030 -99119 84362 120509
12958 120509 188114 274881 28501 99008 -8231 -307898 287520 -195725 107624 -35303 170239
12946 209357 417054 100299 72361 156877 47666 341847 106878 282926 -197566 188883
12935 86470 363623 -68822 -171791 32648 -122931 354162 3245 -180667 185207 -153965
12924H0824M17646a3379l9740A9346b44131J5167a5389o9002C91149a77173H4475
12912I2031L5418a09159r9770E5970e4639B39836c0327B14635a33497j63717A40530
12900A1544J8723L59557a1523D4748b3162j02238A63070O0835h2122d301j23359
12889a27660C03843F8290N6881K9776e4604A13042L6000a85924B35851e5179n8575
12878a13754p4824G9745J48568G9649c261j31463G6026e23110E6907J04312Q0742
12867B41961b68799E1723J27539F5178N242h1699J958A5051M7958c4000H8429
12855G6820e42559F7219J65955b18590G3268e6032j60160J2152A01623a6447j26466
12844a42913I8960k253M6016B6655Q7697P5342d6106A83359a17515A15062J30985
$$ plain form
12924 80824 498470 -13379 -53119 19346 -244131 -228964 -15389 -84391 391149 -177173 84475
12912 92031 127449 -109159 -208929 55970 -54639 239836 -30327 214635 -133497 -297214 140530
12900 11544 30267 389824 -11523 44748 -23162 -125400 163070 223905 -82122 -4301 -127660
12889 -127660 303843 68290 125171 154947 -54604 113042 149042 -185924 235851 -55179 -113754
12878 -113754 -188578 79745 228313 79649 -3261 -134724 76026 -523110 56907 161219 241961
12867 241961 -268799 51723 179262 65178 70420 -81699 -79741 15051 63009 -34000 88429
12855 76820 -542559 67219 233174 -218590 73268 -56032 -216192 -204040 101623 -16447 -142913
12844 -142913 98960 96707 142723 26655 114352 189694 -46106 183359 -117515 115062 246047
12833B46047m4626c145A07893K72683g8658B6492n516c03433e9292A64322b1966
12821a85505A04798B1154c971C65794h7695h877B17365C0364c33645C7679a15875
12809A37992m250a73487D80844a37284q941f0387A6443c3942l53965C08642A02963
12797B7557d6270q8251J0776o877J575J6294M3134L516B12556d48907H8633H055
12784a2096q9055m8604G6765a13554l0859A78486b35664F0229J06612M1664J68921
12773C77426a67324B8284e4527j75396d6925A10954O2286a83465A1227J97730
12763B08957C3842a38586D9916a14817A3993J32069l2491M1539b93018A67454
12752E524a19319G1341N6092a41510I7089k9287G845a50904I3738a00350A37788
$$ plain form
12833 246047 201421 -3145 107893 380576 -78658 26492 20976 -303433 -59292 164322 -21966
12821 -185505 104798 21154 -3971 365794 -87695 -8877 217365 30364 -333645 37679 -115875
12809 137992 133742 -173487 480844 -137284 -146225 -60387 16443 -33942 -387907 308642 102963
12797 27557 -46270 -134521 -123745 -130622 -129047 -112753 -69619 -66103 212556 -448907 88633 8055
12784 -12096 -101151 -149755 76765 -113554 -144413 178486 -235664 60229 166841 208505 377426
12773 377426 -167324 28284 -54527 -229923 -46925 110954 173240 -183465 11227 208957
12763 208957 33842 -138586 49916 -114817 13993 146062 113571 155110 -293018 167454
12752 5524 -119319 71341 127433 -141510 97089 67802 7845 -150904 93738 -100350 137788
12740b9269k02670R0274A72598b08319a03270M2562C05009i7832B15042J27555
12730C42597B926f0374h772A47996a83047A9537d5061l69019J26133g1105I5313
12718a99451D63915E6283G934M9601F845a23446A95400J23604j31182A4594K24307
12707B38901J24937a1735C64544a82113Q4974j40673B66545A04590j7336l4334
12697E2920d5799D89915c59354D4995i3552b3838l2380A2864K49758G9347J5017
12686I4364a04921L8643A16236b26868A11402a33126A80734a48148A59772k47
12676A59525K05163j59819q9773l5754C117g65B2728K04684j10537a29888A54502
12664B95988G1126c4497m1916C80289e4438D3398j0986K4504c41460g4496J6829
$$ plain form
12740 -29269 -231939 -141665 172598 -208319 -103270 -60708 305009 -97832 215042 342597
12730 342597 2926 -60374 -8772 147996 -183047 19537 -45061 -414080 -287947 -71105 95313
12718 -199451 463915 56283 7934 57535 6845 -123446 195400 319004 187822 14594 238901
12707 238901 363838 -11735 364544 -182113 -97139 -237812 266545 104590 87254 52920
12697 52920 -45799 489915 -359354 44995 -93552 -23838 -56218 12864 262622 79347 94364
12686 94364 -104921 -66278 116236 -226868 111402 -133126 180734 -148148 159772 159525
12676 159525 364688 204869 115096 79342 3117 -765 22728 227412 116875 -129888 154502
12664 295988 71126 -34497 -76413 380289 -54438 43398 32412 56916 -341460 -74496 -57667
12653e7667j40852n6569N1386A23104K6255a84487j19863c1635j03901d0869j59661
12642b00530f1214j03437B30087a06001b184B28674c5098B13203J5010c83985
12631A79970i3404A2784M02267a83456f2599A42435J18055j9660a35124d303B58392
12619B38653A4474J02750c40833A87458m4933l6452J61807l9039A01636A6599
12608d2219C18107b2308I3685i56B2242L51547K2015b0798j7714q7389c8360C88802
12595C24119a94734b2667j34588B42963a09481B3451L43025A55828M2990K95524
12585D94342m203b64626B10661a88686f0798G5140c2979A90034c84644A36964
12574b36479A27268R8177C8173J13444b61484A17601k0508d8527k2044B33891
$$ plain form
12653 -57667 -198519 -255088 -203702 123104 149359 -184487 -304350 -31635 -135536 -40869 -200530
12642 -200530 -61214 -164651 230087 -106001 -2184 228674 -35098 213203 228213 -383985
12631 179970 -93404 12784 415051 -183456 -62599 142435 260490 240830 -135124 -4303 258392
12619 238653 14474 117224 -340833 187458 142525 106073 267880 228841 101636 16599
12608 -42219 318107 -22308 93685 -956 22242 373789 395804 -20798 -38512 -125901 -38360 388802
12595 324119 -194734 -22667 -157255 242963 -109481 23451 366476 155828 198818 494342
12585 494342 490139 -264626 210661 -188686 -60798 75140 -32979 190034 -384644 136964
12574 -236479 127268 225445 38173 151617 -261484 117601 97093 -48527 -70571 233891
12563b1479A44235m9132a03129B21753b15039A5640K08831l1594B3608N664d10054
12551a67014A55980J57504a86227G249L2110h6299I3f2511k43919A66713F4207
12539a02980o0129F6287K9983K1050f5007b1254k08131j90950C07612g0110B34482
12527e7517F8290i5065a0944I764J43468b83611d7610A79348b69793G6191J10061
12516A86252f2734r5675P2004q3160I8962K13595a72400F8231B5215o364K25419
12505B44270b69331j35281C65086F7036b08599h453j68945A61227M8338m2755
12495A66810P9310b6029j3613A56578b99676q4139J78012c3636D15e1539A72055
12483A47527a22201k31409J12415J12770o5404A44303J18864b62187L3717J03161
$$ plain form
12563 -21479 144235 95103 -103129 221753 -215039 15640 224471 192877 23608 29272 -410054
12551 -167014 155980 313484 -186227 7249 39359 -86299 93 -62511 -306430 166713 64207
12539 -102980 -163109 66287 96270 117320 -65007 -21254 -229385 -420335 307612 -70110 234482
12527 -57517 68290 -95065 -10944 9764 153232 -283611 -47610 179348 -269793 76191 186252
12516 186252 -62734 -158409 -86405 -169565 98962 312557 -172400 68231 25215 18851 244270
12505 244270 -269331 -404612 365086 67036 -208599 -8453 -177398 161227 209565 166810
12495 166810 246120 -26029 -39642 156578 -299676 -383815 -205803 -33636 415 -51539 172055
12483 147527 -122201 -353610 -241195 -128425 -193829 144303 263167 -262187 -228470 -125309
12473a25309M5214F9295b27718a0290A88764b05304A27957B5650a7635m2576B257
12461a49713b7419j2874k01023f6126C1646N0980a7522A20055c09177h765H1440
12449a74545m0084a2422A32747F3390C436J52455K65041B10013c5182k01127M8598
12438a87711A28893b64712a17336C5332K9062J61110A3890a06093k15021E6203
12427B81772C204f4864R488A5890a04722B21367M711F1149O4897n2660L1164a25900
12414B3864J94165q3877a26337f1194K4323C50898e2963k65480P7177A81542a30364
12402E8455b08061d0729p2562B36492c88139b5212E1691d1400a5257P053A85882
12390a52242L8886j26165L244A18480b23303A31954d8072j7439j02179C17341
$$ plain form
12473 -125309 -80095 69295 -227718 -10290 188764 -205304 127957 25650 -17635 -60211 2257
12461 -149713 -27419 -40293 -241316 -66126 31646 82626 -17522 120055 -309177 -8765 81440
12449 -174545 -214629 -12422 132747 63390 3436 155891 420932 210013 -35182 -236309 -187711
12438 -187711 128893 -264712 -117336 35332 64394 225504 13890 -106093 -321114 56203
12427 281772 3204 -64864 -55376 15890 -104722 221367 226078 61149 126046 73386 104550 -125900
12414 23864 218029 134152 -126337 -61194 -36871 350898 -52963 -318443 -241266 181542 -130364
12402 58455 -208061 -40729 -113291 236492 -388139 -25212 51691 -41400 -15257 -8204 185882
12390 -152242 -113356 -239521 -236277 118480 -223303 131954 -48072 -65511 -167690 317341
12379E1739O7077J96808K6135a9920A79351a92723D3382B0392e7843m2113A13166
12367b41121H4752b34173c8909G77J05217b5123l5064B53368g9375m0024a0118
12355I093h924C21543I5200b36080E5081p03j9900d7100E7577k3763a37787E920
12342A14793E2628A7232K7228J79898a11449C27102l8836b4496p8867d5797q1044
12331a26841M0846m9012a39k5693H6241c5664I8923c3326l0053A33710b41545
12319B4419b0742k57886D0229L77716a27705N7670k720p6856B47840g7331D918
12307e0687o562j0882A69143i4315l6583r261k38411i3452F592J21017B914J68605
12295A71519J15486a28152C08796A06981g6590B32498j02634m6420O5742a55343
$$ plain form
12379 51739 118816 315624 341759 -19920 179351 -192723 43382 20392 -57843 -99956 113166
12367 -241121 84752 -234173 -38909 777 105994 -25123 -60187 253368 -79375 -119399 -10118
12355 9093 -8924 321543 95200 -236080 55081 54378 34478 -47100 57577 33814 -137787 5920
12342 114793 52628 17232 44460 224358 -111449 327102 288266 -24496 -103363 -45797 -126841
12331 -126841 -85995 -135007 -139 -25832 86241 -35664 98923 -33326 -63379 133710 -241545
12319 24419 -20742 -278628 40229 417945 -127705 -70035 -72755 -149611 247840 -77331 4918
12307 -50687 -57249 -68131 169143 -94315 -130898 -140159 -378570 -93452 6592 127609 2914 171519
12295 171519 287005 -128152 308796 106981 -76590 232498 129864 83444 149186 -155343
12284B52832k9174b74407A77488i134B22413G0843M8274A9086a34964C66330E2758
12272a0707A6373a31300F8362B5685M52624a2018m9012j43911e3044B99266A03592
12260d8577j2802D26297A70690b88017E6242J36981p5232a44500B95623b115B50858
12248E3322L7186a70057A17811a77478m4272C76906H210a3010j7400A68195J29436
12237B97631a03674B50625p9591b8415p8657b9771F8507L9163J46526J24212r6865
12226B81543J70204a36945G0087R4957l2663a4045j11121A76559O4410l513C0560
12214B4394a70651B36042k1559m9597L6275J73871C7138R0016L33243A28110D2080
12202C92628j59264J03403A49032L81835d4144F0838J43880M3909j6801K8887
$$ plain form
12284 252832 223658 -274407 177488 -9134 222413 70843 119117 19086 -134964 366330 52758
12272 -10707 16373 -131300 68362 25685 478309 -12018 -61030 -204941 -53044 299266 103592
12260 -48577 -61379 426297 170690 -288017 56242 193223 117991 -144500 295623 -2115 250858
12248 53322 90508 -170057 117811 -177478 -221750 376906 8210 -13010 -30410 168195 297631
12237 297631 -103674 250625 171034 -28415 -107072 -29771 68507 107670 254196 378408 281543
12226 281543 451747 -136945 70087 165044 132381 -14045 -125166 176559 240969 237456 30560
12214 24394 -170651 236042 214483 164886 201161 375032 37138 127154 460397 128110 42080
12202 392628 233364 336767 149032 530867 -44144 60838 204718 248627 231826 260713
12192B60713B9635M6838C3604L8803e0497A02513a65813C65693A80122G7523L6342
12181A13865K02676i1254B36500h2276D5692J01264J78221A22798l2392B0597
12170B17679r4985A6026K34792j0376a56808G0940J3588l3093M2002a7548A26584
12158A17750b36338A6728N844P5866g0052M492B06722G7915k0132L76672G3988
12146a30964A12934r633a17092O291C01795b57092C49782b19064A77320O3579
12136B40899a71490A56425l9891A9810L66728f2515I9497a6002B46361I8590C1442
12124a36289K6611A13606A2883N7325N7686d4155E7570h1655E4712k109c3214
12112F0355M3847c30789B08138B7688K38481a06145D01833B5409b67963a7856
$$ plain form
12192 260713 29635 76473 33604 72407 -50497 102513 -165813 365693 180122 77523 113865
12181 113865 316541 -91254 236500 -82276 45692 146956 325177 122798 90406 20597
12170 217679 122694 16026 250818 240442 -156808 70940 84528 51435 93437 -17548 126584
12158 117750 -236338 16728 22572 98438 -70052 -65560 206722 77915 57783 434455 73988
12146 -130964 112934 103301 -117092 -110801 301795 -257092 349782 -219064 177320 240899
12136 240899 -171490 156425 116534 19810 386538 -62515 99497 -16002 246361 98590 31442
12124 -136289 -109678 113606 12883 70208 127894 -44155 57570 -81655 54712 52603 -33214
12112 60355 104202 -330789 208138 27688 266169 -106145 401833 25409 -267963 -17856
12101c2142l4871E659M7529a04231k99964a21832C3036a19973d9701j48059A9583
12089a11603C40610I8411D5764a31322L8897q8921N743D01212i4576K5758j25755
12078a94573A73051m2268b78996M4706A80494J69480A65283K56837P47644l05967
12068H63797C06765D6304g9175L6606l4273j61998f8070D6013h3373A60709e4531
12056H4857b34207A77003F3636N8094j7627J32670a95276I352K46091b0930F6812
12044G7993a48865C23573I0148a16258C51094h7432l3142N1833k9945G4635k6373
12033D8262J5381b57429C8021e0801j47423B71946h514k38919M8029G1202K3639
12022I4841K4267J54259o6608M4466I7281J11579a08305A0741a59800c753I4739
$$ plain form
12101 -32142 -67013 5659 53188 -104231 -404195 -121832 33036 -119973 -49701 -197760 19583
12089 -111603 340610 98411 45764 -131322 -92425 -181346 -175603 401212 -94576 -68818 -194573
12078 -194573 173051 130783 -278996 -234290 180494 349974 165283 422120 1169764 863797
12068 863797 306765 46304 -79175 -42569 -76842 -238840 -68070 46013 -83373 160709 -54531
12056 84857 -234207 177003 63636 121730 104103 236773 -195276 9352 255443 -20930 66812
12044 77993 -148865 323573 90148 -116258 351094 -87432 -120574 -68741 -98686 74635 48262
12033 48262 63643 -257429 38021 -50801 -198224 271946 -8514 -247433 -199404 71202 94841
12022 94841 119108 273367 206759 251225 97281 208860 -108305 10741 -159800 -3753 94739
12010I6210b24206C85094f0784j06415e0969F7234J95072E695b36491a0680H895
11998F5316k3804K9028b77922Q0889j1962k0436m5532P4014k4365l3928a17394
11986b24053a1117C8971J0845H198M2424a1405l32196H4519a77286A45726a0408
11974c22638A29447j2251d5712A44173c732A88178D7040A0458K11422h8890K5046
11963f3844j755A06373m9423i6994B06569D9583e87773A89285a92920Q5772A60250
11951i5410A61141b94644c6043A69815b0977j31914d4111B5900a58286K596A43130
11939C06969j31520g4517D75478j94777a89388f3016A63168Q7703a88567R635
11929a78932O6181k0813e857l1375j30758Q14B66529G7891b1242C1698K78490
$$ plain form
12010 96210 -224206 385094 -60784 -167199 -50969 67234 262306 5695 -236491 -10680 8895
11998 65316 41512 70540 -277922 -197033 -208995 -229431 -274963 -200949 -225314 -259242 -117394
11986 -224053 -11117 38971 49816 8198 50622 -11405 -343601 84519 -177286 145726 -10408
11974 -322638 129447 117196 -45712 144173 -3732 188178 47040 10458 221880 -88890 -63844
11963 -63844 -65599 106373 56950 -96994 206569 49583 -587773 189285 -192920 -107148 160250
11951 -95410 161141 -294644 -36043 169815 -20977 -152891 -44111 25900 -158286 -155690 143130
11939 306969 175449 -74517 475478 280701 -189388 -63016 163168 250871 -188567 -178932
11929 -178932 -112751 -133564 -5857 -37232 -167990 -167176 266529 77891 -21242 31698 310188
11918C10188A03005J39876a2198E7978B5943B17a17364k774k89519a08341K5687
11907h2654A51458a73145p3049I033b7686B06492Q5894E3740a38590j20330A09447
11895d83644J22197A4866d77397K17967B45207c42602O823A1371d2180E9830b33183
11883C4821a36667L6092H5307B3969J41877P6742f5169A41196b58794C22135F2803
11871c2444j27039B43418a62914K3266G0302b50827O6996a9706q0833A78502a4312
11859A63991e8314F9183J01014b31807D3011b15950a01666A87521E329a56709
11848I4375b60631A54783a19636a8723q6840n4390L4564E21294b06940g8851B0355
11836C8744c360l63599A75483c01522c1545D021c44556j14271A22562a82518A59480
$$ plain form
11918 310188 103005 242881 -12198 57978 25943 217 -117364 -120138 -409657 -108341 -82654
11907 -82654 151458 -173145 -246194 9033 -27686 206492 292386 53740 -138590 -258920 109447
11895 -483644 -361447 14866 -477397 -259430 245207 -342602 -335779 11371 -42180 59830 -233183
11883 34821 -136667 -100575 85307 23969 165846 242588 -65169 141196 -258794 322135 62803
11871 -32444 -159483 243418 -162914 -139648 70302 -250827 -183831 -19706 -100539 178502 -14312
11859 163991 -58314 69183 170197 -231807 43011 -215950 -101666 187521 5329 -156709
11848 94375 -260631 154783 -119636 -18723 -105563 -159953 -125389 521294 -206940 -78851 20355
11836 38744 -3360 -366959 175483 -301522 -31545 4021 -344556 -458827 122562 -182518 159480
11824i2256M4634k7427E3845J26362A452P1708a27508b9966B13144p8508a68836
11812a4931m9655r2220B43853a99323d9928j25580B97941p8154a62116K9450A68385
11800a99775A28117g2073n5117F5356b74000A81132C8078Q7241d6892A37059a33443
11788B7216J79923m5156A8447K6898c50171a06414p1123D29730g0131H9188c18201
11776A51055b60555a12744j999N0879L035B81919g0235m758j33203C9683J97770
11765B37453F416L1236R935A5127N5750c21492m5718a4556f062l27448E0736b71617
11752b44390r2147E5135K22764m8217K62463B1796c6236r4993A17647l9474i6744
11740e2561j78488F2223K56697b750n5794D6312J98967a52614n3194E3727A3919
$$ plain form
11824 -92256 -47622 -75049 53845 180207 1452 73160 -127508 -29966 213144 134636 -168836
11812 -14931 -64586 -156806 243853 -199323 -49928 -175508 297941 219787 -162116 -132666 168385
11800 -199775 128117 -72073 -127190 65356 -274000 181132 38078 125319 -46892 137059 -133443
11788 27216 207139 161983 18447 45345 -350171 -106414 -177537 429730 -70131 89188 -318201
11776 151055 -260555 -112744 -114743 -63864 -60829 281919 -70235 -74993 -208196 39683 237453
11765 237453 6416 37652 47587 15127 70877 -321492 -367210 -14556 -6062 -333510 50736 -271617
11752 -244390 -336537 55135 277899 229682 492145 21796 -36236 -131229 117647 78173 -96744
11740 -52561 -231049 62223 318920 -2750 -58544 46312 245279 -152614 -205808 53727 13919
11728D2822i7357A14454J57793b33539B07109q7725J22967b6277B32118a72417
11717a39181f6001A68261F2986c82336A89501i9215M0938K3499A07324J05278
11707B12602C5900N9668A7247c9957B64121G4173b32463M3954C16372A47862d23747
11695a04635a1533A17440J67775m4063a19444B18821F7037J11886b6050I6630
11684A76115J7951a81375J6923j17040A79568H7263K85262f9267p0321C16906
11673E5901c6178F6073d5201B11666Q4993I3461j4983a78037f7420E7696j7040
11662D0656a45329b0539A51663e3461m07k77757B03626b61090a06557b1363j3450
11651c4813F2773e6236b2753k31792H7714J13245a21922B7912L92177h5738j95521
$$ plain form
11728 42822 -97357 114454 272247 -233539 207109 119384 242351 -26277 232118 -172417
11717 -139181 -66001 168261 62986 -382336 189501 -99215 -58277 -34778 107324 212602
11707 212602 35900 95568 17247 -39957 264121 74173 -232463 -188509 316372 147862 -423747
11695 -104635 -11533 117440 285215 241152 -119444 218821 67037 178923 -26050 96630
11684 176115 194066 -181375 -164452 -281492 179568 87263 372525 -69267 -139588 316906
11673 55901 -36178 66073 -45201 211666 296659 93461 78478 -178037 -67420 57696 40656
11662 40656 -145329 -20539 151663 -53461 -53868 -331625 203626 -261090 -106557 -21363 -34813
11651 -34813 62773 -56236 -22753 -254545 87714 200959 -121922 27912 420089 -85738 -281259
11640b81259a06827a9458C8740a0566A4867J4334O0135N5498d2073k14823A27362
11628D37319G7862a46793C3641J0030B1422K5353L2905P6655E6274M969c3957
11616E1452K0531a18B5467L4316e7768k39357J47404j8888D03188C8413b04257
11604d1575J3827m6539p135A1426K52835m9773d9219A21651R3078k5749a63966
11592a32549D3925J24027G1436A1383J82194J79019e8878B10615G7441b06361
11581A20985f2268A27596D267a45601A83211C7965c6751A8437N85494c6353B9770
11569A70877G6721a47765A7453K94437c37601A51711c0544A1752J27826c7631
11558B98677k7517q4089l8564O7254I9111j4454a23866e3554A50086J04810J40153
$$ plain form
11640 -281259 -106827 -19458 38740 -10566 14867 29201 89336 144834 -42073 -256896 127362
11628 437319 77862 -146793 33641 43671 21422 46775 79680 156335 56274 61243 -33957
11616 51452 71983 -118 25467 59783 -57768 -297125 -149721 -168609 403188 38413 -204257
11604 -41575 -27748 -74287 -81422 11426 264261 214488 -49219 121651 214729 188980 -163966
11592 -132549 43925 167952 71436 11383 193577 372596 -58878 210615 77441 -206361
11581 120985 -62268 127596 4267 -145601 183211 37965 -36751 18437 603931 -36353 29770
11569 170877 76721 -147765 17453 311890 -337601 151711 -30544 11752 139578 -37631
11558 298677 271160 187071 148507 215761 99111 84657 -123866 -53554 150086 254896 395049
11547C95049J46289A575d51093D3770A5038J64977A3289N8790N6148a25010n6367
11536a81377A47447d8076p6063D16828i0213B27827E7087L37149j78982g6644
11525B58793o5775a92422A85466b29221B11770k822J45102a00502C360J53059
11515A56419c1994r3650C20749A1623L1713K34312G7152L60237c8495C73852A85244
11503H1594a24227C7751a269C8205E211J65251L4175I6848m0440B6112J50788
11492A76900G5454A515c69582f8502B73703a63906D14155a35258c6521j13683
11482a50204C76304h6113B55310J74043A81984G4714L7308K8507K04065P6277
11472D20871j70573C4084c1556p2431B0953L14010a55731I299M14149h5826A73880
$$ plain form
11547 395049 541338 1575 -451093 43770 15038 180015 13289 72079 128227 -125010 -181377
11536 -181377 147447 -48076 -124139 416828 -90213 227827 57087 394236 215254 -76644
11525 258793 193018 -192422 185466 -229221 211770 208948 354050 -100502 3360 156419
11515 156419 -31994 -125644 320749 11623 43336 277648 77152 437389 -38495 373852 185244
11503 81594 -124227 37751 -1269 38205 5211 170462 204637 96848 56408 26112 176900
11492 176900 75454 1515 -369582 -68502 273703 -163906 414155 -135258 -36521 -150204
11482 -150204 376304 -86113 255310 429353 181984 74714 112022 140529 344594 420871
11472 420871 250298 34084 -31556 -103987 20953 334963 -155731 9299 423448 -85826 173880
11460c88878A60643J63602A60571m4409L20677j7766i3113D40677j68403a78645
11449B18301p0164a5240j01752l6588O4266j25245A7758c36701A41193m4761c4942
11437C73197I3904K83608A62736b19646O4264C38354b07055O0344A03715f1310
11426d49461c1547H4120f9975l69694H3971a57599A35917d6167A35524l689l3106
11415I8729a13733A29369a67072E4801f5959a4889m96D5760i2135B0011b73732
11403B1340H96J56719L2543H0781P5033G1969g4195A9150h3937E7118e5926A16314
11390a94726k01763A00174d01023E4486d10073O570d993j31914m2869A43074a38858
11378B7052J33421L6905p2892H394L66440a88486i2537j79708i8042B21577O4948
$$ plain form
11460 -388878 160643 324245 160571 116162 436839 419073 -93113 440677 272274 -178645
11449 218301 148137 -15240 -116992 -153580 -89314 -214559 17758 -336701 141193 96432 -34942
11437 373197 93904 377512 162736 -219646 -155382 338354 -207055 -146711 103715 -61310
11426 -449461 -31547 84120 -69975 -439669 83971 -157599 135917 -46167 135524 131835 98729
11415 98729 -113733 129369 -167072 54801 -65959 -14889 -15385 45760 -92135 20011 -273732
11403 21340 896 157615 190158 80781 155814 71969 -74195 19150 -83937 57118 -55926 116314
11390 -194726 -396489 100174 -401023 54486 -410073 -403503 -4993 -136907 -179776 143074 -138858
11378 27052 160473 197378 124486 8394 374834 -188486 -92537 -272245 -98042 221577 286525
11367B86525f6612A65761n1367k7502e9992l4244C30177d8935K604m6069J6896
11356g5504q7298d3553C3808a5642G1136d869m26900I8934J7433K9210j4711J08938
11344B39804a72466H4522a42544E52595b57425Q3947B14359m8486F6269i4321
11333i2190A08057e8374G9976k4784J94286f3627a1346F459a32519q3828c2275
11321a94196f6645B19933f2009H2851c09921D7273L49548F0534b76314A36371
11310B43701c65913F2036J04079h7834m1436l69380B8649b40358Q8757B6534b36400
11298c0422l2930A08676k6179J46430Q2313b13058h4469H0087N4234a27095N8300
11287f8795A10503h4581j93396a7640m3520C24893i2470k52276B59246A13840
$$ plain form
11367 286525 -66612 165761 114394 86892 -59992 -94236 330177 -48935 -46331 -92400 -75504
11356 -75504 -162802 -43553 33808 -15642 71136 -4869 -431769 98934 116367 145577 130866 239804
11344 239804 -172466 84522 -142544 552595 -257425 -173478 214359 165873 66269 -94321
11333 -92190 108057 -58374 79976 55192 249478 -63627 -11346 6459 -132519 -216347 -32275
11321 -194196 -66645 219933 -62009 82851 -309921 47273 396821 60534 -276314 136371
11310 243701 -365913 62036 166115 -87834 -129270 -498650 28649 -240358 -151601 26534 -236400
11298 -30422 -63352 108676 82497 228927 311240 -213058 -84469 80087 134321 -127095 -68795
11287 -68795 110503 -84581 -277977 -17640 -61160 324893 -92470 -344746 259246 113840
11276c87895a92432k80136A13373O9345a07697M5724E1112b85637a37161B032
11265A57511K9899c80700F4191g4150j20578e5607j21813m3406F6648J33578b40601
11253b54919E0421O7938E8012b52970D6320h9987B2375i4536l42043J60281k55543
11242e31841K18535d7475j34418a648A79605c29913F5756C1421c07228I2897J72302
11231B65199b48110J9062A83870j6445J90325a14523k09297A11560n2532b63636
11220c4700A30029l8732B9158a83665E8410J9138a48043G7006J8361L8885b09233
11208a45032J7353l0727j4215A26390b75089a11594Q943j21978p8278b3542H8490
11196g6574j02252A15337A6377b50363E3442A9904h6755E4860J46688j3043H9460
$$ plain form
11276 -387895 -192432 -472568 113373 182718 -107697 -61973 51112 -285637 -137161 2032
11265 157511 187410 -380700 64191 -74150 -194728 -55607 -177420 -220826 66648 200226 -240601
11253 -254919 50421 118359 58012 -252970 46320 -89987 22375 -94536 -436579 -276298 -531841
11242 -531841 -313306 -47475 -181893 -1648 179605 -329913 65756 31421 -307228 92897 265199
11231 265199 -248110 -229048 183870 167425 357750 -114523 -323820 111560 59028 -263636
11220 -34700 130029 91297 29158 -183665 58410 77548 -148043 77006 95367 134252 -209233
11208 -145032 -127679 -158406 -172621 126390 -275089 -111594 -102651 -224629 -302907 -23542 88490
11196 -76574 -178826 115337 16377 -250363 53442 19904 -86755 54860 201548 188505 89460
11184a06676j85834A14044d55870E1567N5934D0161e9860A8965P8809R1797J39022
11173C28593A53042g5592a0252B17599b86418A87123h3646k4171k1009J9504A91738
11161a72666g7178j46497n735a03602D51175F8667b5651A01722J20579l9651j9812
11150A62838a54502j32522A38491n3128c80227g7964B2765a26281r4899l9654
11140b60834c4203k20545Q7594k42073H4364a24686l84700B39062A9216e7222
11129f6412B05165F960J90216p5584c9355n719n5853A8767O4986a33156j794B7967
11116c937q5278m1849B05715d2624B79160F8974J32311J710A5733P1740a94337
11104B24273J15872j56358M4258a30674C39335J2428g9581B28242E0364K42767
$$ plain form
11184 -106676 -292510 114044 -455870 51567 107501 40161 -59860 18965 97774 189571 328593
11173 328593 153042 -75592 -10252 217599 -286418 187123 -83646 -107817 -128826 -109322 191738
11161 -172666 -77178 -223675 -229410 -103602 451175 68667 -25651 101722 222301 182650 162838
11150 162838 -154502 -287024 138491 85363 -380227 -77964 22765 -126281 -221180 -260834
11140 -260834 -34203 -254748 -167154 -409227 84364 -124686 -509386 239062 19216 -57222
11129 -66412 205165 6960 197176 121592 -39355 -45074 -100927 18767 83753 -133156 -134950 27967
11116 -3937 -89215 -131064 205715 -42624 279160 68974 201285 202995 15733 87473 -194337
11104 224273 340145 183787 228045 -130674 339335 351763 -79581 228242 50364 293131
11094B93131b30439h5814l305A70511b46468F7319K69799H6543L84050A60330
11083A6795E17K86313a01783D34669A29235a5540C96142q675j17141o0801j7666
11072A91859L2350J19047n114n3951b727C39608j48936j9691L80925j14128j86626
11061B51152j19150L77231L7767P7281r5154J05867j58683j36435J20638L57283
11051H17797k29523K43656k2001l4532j28593l8492m616j87693j12499K18538
11041E22042L06912l30326L15785J6923j58351K3153p8230K49029j80017r7475
11031E89445J05262k26730J53548N5240o79K39684k79658l13020J34482N2318
11021E09892j07251K1458k00629M43967k97494J7443J15732L34835j92039l2761
$$ plain form
11094 293131 -230439 -85814 -89119 170511 -246468 67319 337118 86543 470593 160330
11083 16795 517 286830 -101783 434669 129235 -15540 396142 387467 270326 209525 191859
11072 191859 224209 343256 338142 284191 -2727 339608 190672 170981 551906 437778 251152
11061 251152 132002 509233 547000 624281 529127 634994 476311 339876 460514 817797
11051 817797 588274 831930 809929 775397 646804 608312 603696 416003 303504 522042
11041 522042 828954 498628 814413 831336 672985 696138 617908 866937 686920 589445
11031 589445 694707 467977 621525 676765 676086 915770 636112 323092 457574 509892
11021 509892 402641 424099 223470 667437 369943 387386 503118 837953 645914 613153
11011F13153k5169K14932l34522M6708M0685k63356K75275m4509j31484J227K28003
11000F20943l03869R8853L19282R7262l08865k7609N8959j12665O152K07796J31299
10989G87538L33927m56111K83196J68428l03323l1899j42351L17078K7447J38940
10979A122870L97743k78171K59950J2245M05635M49499K47857J57993l19538K14931
10969B671014l7565j7238m28931k96266l01415L3392p2324J08564j05173K89558
10959A843616l83217M01690k20051k03541N38338l40011l69766N8868l74493j22607
10949H28826J36737D05051J75779j49358A60797M73937C9581P2204K16867j14200
10939B14452o3682J25809a8361l58229A42924r38P8071q1851J71432b6387n8848
$$ plain form
11011 613153 587984 802916 468394 515102 555787 292431 567706 523197 391713 392940 620943
11000 620943 317074 415927 735209 832471 523606 495997 554956 442291 448443 656239 787538
10989 787538 1121465 665354 948550 1116978 813655 781756 639405 956483 983930 1122870
10979 1122870 1520613 1242442 1502392 1514637 1920272 2369771 2617628 2775621 2456083 2671014
10969 2671014 2633449 2616211 2187280 1891014 1589599 1622991 1550667 1659231 1554058 1843616
10959 1843616 1460399 1862089 1642038 1438497 1976835 1636824 1267058 1325926 951433 828826
10949 828826 965563 405051 580830 431472 160797 634734 39581 111785 328652 214452
10939 214452 150770 276579 -18361 -376590 142924 141986 220057 138206 309638 -26387 -85235
10928h5235a7234A09733D5740J99827n5169R4827a28535B72883a06174n2838I5471
10916F2425M12305A52140a02175E3294a12724B57872I3445R519K13026b71433
10905G669c75429B11526D3519a904k8889C4178b21430C67119b45562k6760A64483
10893B37811j10309c1353j25900B47072H4680b31427O167A50946b72010B0265
10882B18828q4051e2539A51394i8529J2603A13052L4583H018a84602G5079g7930
10870F3054c68760J63225Q2164n66818b91698J04732g9374A60732a72125A03981
10859C4899a43351D2898M9419N7052b23083j5447A59493a46829q2240B43661c6303
10847a23704b663k95145A24276b35678B1926J0352f8906E3821b65484j32306a36171
$$ plain form
10928 -85235 -17234 109733 45740 245567 190398 285225 -128535 272883 -106174 -159012 95471
10916 62425 474730 152140 -102175 53294 -112724 257872 93445 102964 315990 -271433
10905 7669 -375429 211526 43519 -1904 -30793 34178 -221430 367119 -245562 -272322 164483
10893 237811 127502 -31353 -157253 247072 84680 -231427 -225260 150946 -272010 20265
10882 218828 134777 -52539 151394 -98529 -85926 113052 147635 8018 -184602 75079 -77930
10870 63054 -368760 -205535 -123371 -690189 -291698 -186966 -79374 160732 -172125 103981
10859 34899 -143351 42898 92317 149369 -223083 -238530 159493 -146829 -229069 243661 -36303
10847 -123704 -2663 -297808 124276 -235678 21926 32278 -68906 53821 -265484 -397790 -136171
10835b7212j41547K7141O9075A03513L6940m5773H086c10888J41556h1681k89621
10824c71302I153a85329p4713H4275d2751k0115F6655J3269b19315A73958b31357
10812c1115l09618g0162H5308a819k05871b7002d16j30257A61418a49166K6109
10801a23057G4336A2810J09920d7981A44667C5083a88999N6126A0604c1614q9701
10790a21315F1616e4400l71887a89690n7898e0189B9812h3557G7536a05601k0356
10779a25957B97771d49366e9665b4671F9411O3729a17641A42551b49491A40393
10768G0158b95232G523h8430o3361C0407h4852J8495k147N780A85118A2233b11800
10755d7384r5691o122d1921p5552m7134C83395a09793c0766j05533A22892a91175
$$ plain form
10835 -27212 -168759 -141618 -72543 103513 140453 94680 8086 -310888 -169332 -81681 -371302
10824 -371302 9153 -185329 -260042 84275 -42751 -62866 66655 79924 -219315 173958 -231357
10812 -31115 -340733 -70162 85308 -1819 -207690 -27002 -416 -130673 161418 -149166 -123057
10801 -123057 74336 12810 122730 -47981 144667 35083 -188999 -132873 10604 -31614 -121315
10790 -121315 61616 -54400 -426287 -189690 -247588 -50189 29812 -83557 77536 -105601 -125957
10779 -125957 297771 -449366 -59665 -24671 69411 133140 -117641 142551 -249491 140393
10768 70158 -295232 7523 -88430 -151791 30407 -84852 -66357 -68504 -62724 185118 12233 -211800
10755 -47384 -143075 -149197 -41921 -117473 -164607 383395 -109793 -30766 -136299 122892 -191175
10743b85246d220j2237I4402H463Q4695b58463a06438n9270m259a4369G4374K20037
10731B94411i4436K9117E5928B3128a09132L2175C3934b1762j71194g68k4571
10720b5339E1976D297A179a9335J777A7000b80313C3178a20233k91677L1909g1712
10707c13623A04827n0546d24755A10571B1425O1735b9273e3p2898n0144k2382
10696a45477J5141j20895O5436d8022a0222j61146G0696O7962N2678E7149i0586
10684a48021F5627g4793D921d2752H8565D3514n11K1800a25041M3718j73771d9253
10671C76902D8407a82386A46725c8781A52610a64972C177f6847A13724C4428b94550
10659b23104f9645m75I9585i8937j5729d3474C064a36149k47655G7370a0544D3834
$$ plain form
10743 -285246 -4220 -16457 94402 8463 93158 -258463 -106438 -165708 -169967 -14369 74374 294411
10731 294411 -94436 -65319 55928 23128 -109132 -76957 33934 -21762 -192956 -768 -25339
10720 -25339 51976 4297 1179 -19335 -17558 17000 -280313 33178 -120233 -411910 -380001 -71712
10707 -313623 104827 54281 -424755 110571 21425 83160 -29273 -53 -72951 -123095 -145477
10696 -145477 -130336 -251231 -185795 -48022 -10222 -171368 70696 138658 191336 57149 -90586
10684 -148021 65627 -74793 4921 -42752 88565 43514 43003 64803 -125041 -81323 -255094 -49253
10671 376902 48407 -182386 146725 -38781 152610 -164972 3177 -66847 113724 34428 -294550
10659 -223104 -69645 -70120 99585 -98937 -114666 -43474 3064 -136149 -383804 77370 -10544 43834
10646a13987b1004A30266a3774l35228a24552O1195l47201E4539b21140j36552
10636c57692a20521j3122r7582D9310i7151k13508a017j91811l0409A22479M2600
10625A65079b2067k81785A15832f4095B67565b68693A61382b49016E9680k5946
10615C3734c18968j99960c0945j04903b3117A55154A8762a09416G3165a80385
10604B71485a81587B93605N412a32400p9673C3663d68263h2213r4902e6555A03003
10592a88537l0819r5262G8975a94475j1522f5178r4502B3404a8155n9176A12518
10580a74425H9886f3109j85549E6658a31027f0253j3188A95183b08626n8164A19700
10568a6316k26741I0176a27812j91009A11614Q5450a6636n1029A83039g5463b5806
$$ plain form
10646 -113987 -21004 130266 -13774 -349002 -124552 -63357 -410558 54539 -221140 -357692
10636 -357692 -120521 -133643 -231225 49310 -97151 -310659 -1017 -192828 -223237 122479 165079
10625 165079 -22067 -303852 115832 -64095 267565 -268693 161382 -249016 59680 33734
10615 33734 -318968 -518928 -30945 -135848 -23117 155154 18762 -109416 73165 -180385
10604 271485 -181587 293605 299017 -132400 -212073 33663 -468263 -82213 -177115 -56555 103003
10592 -188537 -219356 -314618 78975 -194475 -205997 -65178 -159680 23404 -18155 -77331 112518
10580 -174425 89886 -63109 -248658 56658 -131027 -60253 -73441 195183 -208626 -266790 119700
10568 -16316 -243057 90176 -127812 -318821 111614 197064 -16636 -67665 183039 -75463 -25806
10556A31825a03306F1507d5231F0127a73647d0867j31729A43593c1825j44289
10546a76114C5292a60987n136F1337b63611j08809D7728b26207A12193c27996
10535f6464h393l04517b3448j29011K1687A81566K6123E9532c6504i147k31100
10524b40247P4535E8441R3954c34563h6937K7030F1572a48339c8075A78221a01666
10512A15668c93613R4492i8872B34311r7619D2890a27663A94044H8327a70406
10501B65353A09900b33929a3093j3981k50739i3860a9660r3245C5915b8603B69899
10489A23266g2662k5768k53484A96440P6675k9985D7828K59788O58756m05184
10479E61188j1002B67512N08398a42573I1469K22727A54809M1600A0555b49337
$$ plain form
10556 131825 -103306 61507 -45231 60127 -173647 -40867 -172596 143593 -31825 -176114
10546 -176114 35292 -160987 -166123 61337 -263611 -372420 47728 -226207 112193 -327996
10535 -66464 -8393 -312910 -23448 -152459 -130772 181566 207689 59532 -36504 -9147 -240247
10524 -240247 -165712 58441 152395 -334563 -86937 -59907 61572 -148339 -38075 178221 -101666
10512 115668 -393613 -299121 -98872 234311 136692 42890 -127663 194044 88327 -170406
10501 265353 109900 -233929 -13093 -27074 -277813 -93860 -19660 -112905 35915 -28603 269899
10489 123266 -72662 -98430 -351914 196440 273115 243130 47828 307616 966372 561188
10479 561188 550186 267512 775910 -142573 91469 314196 154809 196409 10555 -249337
10468A24982c1491k01055h035B44126F2660a15502A15555L9060L5434f06000f1942
10456b09740c556A46316J48796a8572D2323j8237f0561A76694p2202c36652f1585
10444G5669a70079D8589J59781m8090P9724C1153c02301m8645h1046A87805a96336
10432C60826d6239l9711j9191J4095A11297b1650m384B8495a23048B59194C0297
10420c8703k86303i5429A31873D0283J9264b4435A4048a76142n9099A30543b17167
10408C18700b614F0979b90298F0208K19484a54353q8796b0041m00253a8519m3883
10397f2402a0569k3642K227A91165a17593A52831L05744a2017I0326a62301l8966
10386b01267A04644a4631G3054P4734k014b05413d4272a6107Q93C28231L2420
$$ plain form
10468 124982 -31491 -232546 -8035 244126 62660 -115502 115555 154615 190049 -606000 -61942
10456 -209740 -3556 146316 295112 -18572 42323 24086 -60561 176694 104492 -336652 -61585
10444 75669 -170079 48589 208370 160280 240004 31153 -302301 -350946 -81046 187805 -196336
10432 360826 -46239 -85950 -105141 -91046 111297 -21650 -26034 28495 -123048 259194 30297
10420 -38703 -325006 -95429 131873 40283 59547 -24435 14048 -176142 -235241 130543 -217167
10408 318700 -2614 60979 -290298 60208 279692 -154353 -243149 -20041 -420294 -18519 -62402
10397 -62402 -10569 -34211 -31984 191165 -117593 152831 458575 -12017 90326 -162301 -201267
10386 -201267 104644 -14631 73054 147788 145774 -205413 -44272 -16107 -15214 328231 360651
10375C60651Q2963A21335K21379a75283e9953C55378J66339A00060K10515r1881
10365B18694L82638j69560j91237O6425O0709A1421K47333p252C2795J32041R2874
10354B57710N251j7635K28052J5362A49587J22908I1436K28928l6380j821J31573
10343D13736P9882j65955j41619L22584B35821Q0659l497j10351a81695E5121
10332B26002a64133b599E40416a91025j16365A09334A9866d4404l4395C5286L98975
10321D34261B01982K2997K95618b88668a04341a9134D70269a30908C16177A6845
10310b73297B41286b8102H5506N309P2464b31674H3608k9398a2303D5369K71997
10299C17366c474H4978J6912c97416a07932C24J46538a7761I7339b1915J0366
$$ plain form
10375 360651 443614 121335 342714 -175283 -59953 355378 521717 100060 310575 218694
10365 218694 601332 431772 240535 306960 367669 11421 258754 251502 32795 164836 257710
10354 257710 262961 245326 473378 488740 149587 272495 91436 320364 283984 282163 413736
10343 413736 493618 327663 186044 508628 235821 316480 312983 202632 -181695 55121
10332 226002 -164133 -2599 540416 -191025 -307390 109334 19866 -44404 -78799 35286 434261
10321 434261 201982 224979 520597 -288668 -104341 -19134 470269 -130908 316177 16845
10310 -273297 241286 -28102 85506 90815 163279 -231674 83608 54210 -12303 45369 317366
10299 317366 -3474 84978 101890 -397416 -107932 324 146862 -17761 97339 -21915 -11549
10288a1549C38773a02566C66015H7153a57883j8953j18155A24151b73090J12692
10278a60398A05363p561b44971o633a8455A1644J57316a49155A57304l3291J6764
10267A40777o268N5221D9143K48555e3043n6129A07696J73625L57791l04514j30772
10256B03826l4915a65846P0114b4282F0351a35858a3884k6872j13265j71642A4784
10244c29743A17954a60658f8207a8995n8668k0592A37140h5646A28102J7995M7983
10233A94080h0740p0665O6684A3760b47672k4160B25824d8112j79634H8737J18446
10222B07183b27749d7081F8395A8037b18668m2848N3780H1778d4628j31862F2167
10210c03299a34464B93725l3824E6924P1154B0322i3147D28b3747A20952b15122
$$ plain form
10288 -11549 338773 -102566 366015 87153 -157883 -176836 -294991 124151 -273090 -160398
10278 -160398 105363 97802 -244971 -251604 -18455 11644 168960 -149155 157304 124013 140777
10267 140777 134509 189730 49143 297698 -53043 -109172 107696 281321 639112 334598 203826
10256 203826 168911 -165846 -95732 -24282 60351 -135858 -13884 -40756 -154021 -325663 14784
10244 -329743 117954 -160658 -68207 -18995 -77663 -98255 137140 -85646 128102 146097 194080
10233 194080 -80740 -151405 -84721 13760 -247672 -271832 225824 -48112 -227746 88737 207183
10222 207183 -227749 -47081 68395 18037 -218668 -261516 -207736 81778 -44628 -176490 62167
10210 -303299 -134464 293725 259901 56924 128078 20322 -93147 428 -23747 120952 -215122
10198e95006a52198j41599A83386B6899b61423e085q3643a7756o7195a7546N214
10187a2332I8416k5715c34236b8133m0252C30946b79609D0508J21584a50739j02550
10176b53289a4700j2937r6328d6878k01009J03220A16268M2893b82946c6047C7518
10164c8174H2966J6104K51057i9316L217k90481A83748a22588e1325j7629n2882
10153a21836A82711C7879M3351c44520C65104h090o5064j23146A8171i716k01353
10142b11069j81285H6746a20705j8091l37378a53699k3046A14659E6253c7457
10131f15990a40632j98704c1388j75794n0952a04140k85008F9626f7134k30005
10121b97139R9382A33127a29930G5045b64014I7343J35213l4509c37716h3662
$$ plain form
10198 -595006 -152198 -293797 183386 26899 -261423 -5085 -88728 -17756 -84951 -17546 -12332
10187 -12332 98416 72701 -334236 -28133 -68385 330946 -279609 40508 162092 -150739 -253289
10176 -253289 -14700 -27637 -123965 -46878 -247887 -144667 116268 159161 -282946 -36047 37518
10164 -38174 82966 99070 350127 -99316 -96099 -386580 183748 -122588 -51325 -68954 -121836
10153 -121836 182711 37879 81230 -344520 365104 -8090 -73154 -196300 18171 -9716 -211069
10142 -211069 -392354 86746 -120705 -138796 -476174 -153699 -176745 114659 56253 -37457
10131 -615990 -140632 -339336 -31388 -207182 -258134 -104140 -389148 69626 -67134 -297139
10121 -297139 -197757 133127 -129930 75045 -264014 97343 232556 198047 -337716 -83662
10110G0396c01093m0839A91042c2536l4910A12826m7284c18369A40388b6566D2505
10098E43656B04657J21380h9066k19134J45955I6387D4673K9991C5985b54260
10087f6721b3955m6938c0174A56309B1728a85882B6804K7387B0816b11846J5528
10076a96318c0574B12377c38401A78333c44658P7797a22416j47278k2954a36315
10065b56135k1725a4325k50010a6247j69873A46991c9805B27075a59800K2631
10055a37169e6050A87973p2677b35268j58079i647i95q5929m4922b0301k31856
10044b52157d3867j81201b5838k83831J47276b0520j76962H0421J83819l6247
10034B27993H0562a3961l02545H3539d35410E0997i8634A10665A0090a34360I6746
$$ plain form
10110 70396 -301093 -341932 191042 -32536 -67446 112826 65542 -318369 140388 -26566 42505
10098 543656 204657 326037 -89066 -308200 -162245 96387 44673 74664 35985 -254260
10087 -66721 -23955 -70893 -30174 156309 21728 -185882 26804 54191 20816 -211846 -196318
10076 -196318 -30574 212377 -338401 178333 -344658 -266861 -122416 -269694 -292648 -136315
10065 -256135 -277860 -14325 -264335 -16247 -186120 146991 -39805 227075 -159800 -137169
10055 -137169 -56050 187973 115296 -235268 -393347 -9647 -995 -86924 -131846 -20301 -252157
10044 -252157 -43867 -225068 -25838 -309669 -162393 -20520 -197482 80421 264240 227993
10034 227993 80562 -13961 -316506 83539 -435410 50997 -98634 110665 10090 -134360 96746
10022a96113j81563a00811B01426e9074p648n5183L7050r6594J5444N4295I2123
10010b24482f0147C4771a47606A86431a61677m9234i0463D2052J72572n3589f51110
9998B15934h6156G7515d6965j30076C32101a38314c5585j18693j07441C2000K776
9987C4776a78962N9124l2361A76082a14253B23844c57914B38972l6516b51190
9976B03411c09401e3040n472H4982b03012B62378a32732A63475c3330j27658j45480
9965c06468G0405j0293c98221C6637a33196A44376a0550m60210a91825k42962
9955d34787K1581h0526B41860c3120B27714f5542m6541l562r9989P9988M2565
9944i3081j13456f667p5294D1432a65445m13420a28840k7609O3807j93795a32299
$$ plain form
10022 -196113 -377676 -100811 201426 -59074 -66722 -121905 -84855 -181449 -166005 -111710 92123
10010 -224482 -60147 34771 -147606 186431 -161677 -210911 -90463 42052 214624 161035 -651110
9998 215934 -86156 77515 -46965 -177041 332101 -138314 -35585 -154278 -261719 32000 34776
9987 34776 -178962 -119838 -152199 176082 -114253 223844 -357914 238972 202456 -251190
9976 203411 -309401 -53040 -58512 84982 -203012 262378 -132732 163475 -33330 -160988 -306468
9965 -306468 70405 60112 -398221 36637 -133196 144376 -10550 -470760 -191825 -434787
9955 -434787 -413206 -80526 241860 -33120 227714 -65542 -112083 -115645 -215634 -135646 -93081
9944 -93081 -206537 -6667 -81961 41432 -165445 -578865 -128840 -156449 -92642 -286437 -132299
9932a8637j72082j97099N4868A19825J22891h3961D0062e395l01839A28745a89356
9920b1328l12230F5954a33944A32786C6586K8748h7783C4930d44432a19431d1171
9908a44902b6162G8573b73483A53363j6410e9395A64446D9926d16478B40825A03934
9896a30059a9503B96834G3078a51043g1432D2698J22073a44625P1305A65725o3985
9885A01740b38714P8249a2553l49770d3722n0696b4857g723j31452F3441d4626
9873b11424P1620c5014j54909Q7630l74142A7176c27080J34171m5480E0357a86816
9861d47401a00283A93289a09780c672G7364J20712i9633A43602K07526I2787a80666
9849c01564e793A8645b5463j79902q8181D723Q1148A8102N7724i378B87529C6828
$$ plain form
9932 -18637 -190719 -387818 -332950 119825 242716 -83961 40062 -5395 -307234 128745 -189356
9920 -21328 -333558 65954 -133944 132786 36586 65334 -87783 34930 -444432 -119431 -41171
9908 -144902 -26162 78573 -273483 153363 136953 -59395 164446 49926 -416478 240825 103934
9896 -130059 -19503 296834 73078 -151043 -71432 42698 164771 -144625 -73320 165725 101740
9885 101740 -238714 -160465 -12553 -362323 -43722 -94418 -24857 -7723 -139175 63441 -44626
9873 -211424 -139804 -35014 -189923 -102293 -476435 17176 -327080 -192909 -238389 50357 -186816
9861 -447401 -100283 193289 -109780 -3672 77364 198076 -99633 143602 351128 92787 -180666
9849 -301564 -5793 18645 -25463 -205365 -293546 4723 85871 18102 75826 -9378 287529 36828
9836E991M6040J80530a16016j16046A88563m1538a1275q2825j69353H6316J17996
9825B04312B9135J44654d75338a18459L6796F0556J56480h2022D6866P9679a77511
9813e462k50076h5527m9814d5220A59145A461a79316A21853a15414R933l77706
9802d83187i6404A36473p749a94976B20870a0010j45766k3477o8823F4053J71314
9791B35367d28330J05863G7926b71961l5648G7247b88486B27635c79345c731A81675
9779A5563R2708i8132C70722b18996O3289H41a68757a2738k71174A31915b72620
9767G2609K13838I0773c49136a70538D2214c50901K7146D4063a61865c6842n3265
9756i0107H5356b58353j8935J34601j62221f6165E7569b88971k6121j11167A27912
$$ plain form
9836 5991 52031 232561 -116016 -232062 188563 147025 -11275 -94100 -263453 86316 204312
9825 204312 29135 173789 -475338 -118459 -81663 60556 217036 -82022 46866 126545 -177511
9813 -5462 -255538 -85527 -135341 -45220 159145 1461 -179316 121853 -115414 -105481 -483187
9802 -483187 -96404 136473 128724 -194976 220870 -10010 -155776 -179253 -248076 64053 235367
9791 235367 -428330 -322467 77926 -271961 -307609 77247 -288486 227635 -379345 -3731 181675
9779 15563 108271 -98132 370722 -218996 -155707 841 -168757 -12738 -283912 131915 -272620
9767 72609 286447 90773 -349136 -170538 42214 -350901 -323755 44063 -161865 -36842 -90107
9756 -90107 85356 -258353 -277288 -142687 -304908 -66165 57569 -288971 -315092 -426259 127912
9744D7351M5498a88817M8163H2089J51536c5940A6019b54030A09685D151K63052
9733B67203A505M3778d58611a04935C7631g4641l9517l039I2386b0192j02682
9722a22874r7390G4952a75899A61177e63912a26708D17739A59172b0120k61182
9712b81302N6114J04654C8626b54130C88055A03140E459d93744A22782d35070
9701a86242n42p3582H8174C1941c01718A05358b84174J13931l0375k62271a09685
9689c98567a29980K7829M0838j22970q3743r9753l6291a25286A30213o0380d5509
9677a3202j51883c7624B04368c7614l95772J10589N5829R8690A0537a0546B59436
9665a1786m28386d7073q4434a2048l25723J49571N9800A00319J59509c98622A27488
$$ plain form
9744 47351 92849 -188817 -140654 82089 233625 -35940 16019 -254030 109685 4151 267203
9733 267203 1505 45283 -458611 -104935 37631 -74641 -114158 -117197 92386 -20192 -122874
9722 -122874 -220264 74952 -175899 161177 -563912 -126708 417739 159172 -20120 -281302
9712 -281302 -225188 -120534 38626 -254130 388055 103140 5459 -493744 122782 -435070
9701 -186242 -186784 -260366 88174 31941 -301718 105358 -284174 -170243 -200618 -462889 -109685
9689 -398567 -129980 -102151 -61313 -184283 -268026 -367779 -404070 -125286 130213 69833 -45509
9677 -13202 -165085 -37624 204368 -37614 -433386 -322797 -266968 -168278 10537 -10546 259436
9665 -11786 -440172 -47073 -131507 -12048 -337771 -188200 -128400 100319 259828 -398622 127488
9653h986k17851A01308d08596G0128f56305b1973j68576A89198E0963a35403B14407
9641a34479n5218r9388j14312a7602G9504R371c9906l45628J78989E9078d2045
9629a30900A60960O3997J44754i0303G8227a22230j009H9469r241o430K40390
9618C14188a82537c6422D9131c89933a5263A34273b67302a22758M0086E870J49710
9607A55580L3464P257a80981C0223K67017a04299L8175o5192N1520j38619M4510
9596a73905K9735o911L2092j36572o7255J31717A16652J5429a28655e4618A78239
9584i0091n6096A1852c15651A03287c65301a30070o2039g6318l27203I4451d30939
9572b65372j5524j19147J77243J9994E2978b64172I3122k2466i4269A24916B8695
$$ plain form
9653 -8986 -226837 101308 -408596 70128 -656305 -21973 -190549 189198 50963 -135403 214407
9641 -134479 -189697 -289085 -403397 -17602 79504 88875 -39906 -385534 -206545 59078 -42045
9629 -130900 160960 224957 369711 -90303 78227 -122230 -123239 89469 80228 73798 314188
9618 314188 -182537 -36422 49131 -389933 -15263 134273 -267302 -122758 -82672 5870 155580
9607 155580 189044 196301 -180981 30223 297240 -104299 -66124 -131316 -79796 -218415 -173905
9596 -173905 -144170 -151081 -118989 -255561 -322816 -191099 116652 132081 -128655 -54618 178239
9584 -90091 -146187 11852 -315651 103287 -365301 -130070 -192109 -76318 -403521 94451 -430939
9572 -265372 -280896 -400043 -222800 -202806 52978 -264172 93122 70656 -94269 124916 28695
9560c94626e3928c251q9141m6565d043F6312g7030D0843b00743A00322A0411K54373
9548B64784A12365b15719C6351a78461f9412D47Q0640i0100c5455F6318b25166
9536A50444J6166b02924k4612E8144N7262a06655k5802F3188e0600k11615A3056
9524a4381k55205J13229j93012D8566b05587A03360d500G990J44375c472A65853
9512a67397F6430b51651K1574e5082n6281j71963a08783A94361J81680c925D5093
9500D7893f4826h678r2730E759N5394B8309J28873b2668E3559K24981e462n2398
9488e7860B06613a91220c1292k89939A80223a19359A76879A9862a41047f5982
9477a24492c7992k8611D23494d53531B70214a30462o008j18898g2999D6195q061
$$ plain form
9560 -394626 -53928 -3251 -92392 -138957 -4043 66312 -77030 40843 -200743 100322 10411 264784
9548 264784 112365 -215719 36351 -178461 -69412 447 81087 -90100 -35455 66318 -225166
9536 150444 166610 -202924 -227536 58144 115406 -106655 -132457 63188 -50600 -262215 13056
9524 -14381 -269586 -156357 -349369 48566 -205587 103360 -4500 7990 152365 -3472 165853
9512 -167397 66430 -251651 -230077 -55082 -111363 -283326 -108783 194361 376041 -3925 45093
9500 47893 -64826 -8678 -101408 5759 61153 28309 157182 -22668 53559 278540 -5462 -57860
9488 -57860 206613 -191220 -31292 -321231 180223 -119359 176879 19862 -141047 -65982
9477 -124492 -37992 -66603 423494 -453531 270214 -130462 -136470 -255368 -72999 46195 38134
9466C8134b60744A68803c3318n1590k29004i6146p3622A6476c75725Q5077A41418
9454F0158Q1456a03506j88355j49269J83397j41232B33556a34083n0190F4250
9443A54326b81135f3322m1179A09140m3717b2643k22489J22090M0457K4553j06756
9432a64788A86891K46476H7832d1604B36261b5511k11324A39716n5490c7113j08459
9421a45572M6523k56409A63202f4014L1782B34001a79238A8281e5165j36862M6310
9410a45717B3607J03102A9041a46116j47198b6830k83286K5551a28142n0256I9713
9398h5926A33317g0040k9159j77707g1766m5459E234P7230J09911i3848C07030
9386A40696i0608k3276c8509k57757A72163c29226E3725h3417j43248F3241B2412
$$ plain form
9466 38134 -260744 168803 -33318 -84908 -313912 -96146 -169768 16476 -375725 -290648 141418
9454 60158 141614 -103506 -291861 -441130 -257733 -398965 233556 -134083 -184273 64250
9443 154326 -281135 -63322 -104501 109140 65423 -22643 -245132 -123042 -82585 -58032 -164788
9432 -164788 186891 433367 87832 -41604 236261 -25511 -236835 139716 84226 -37113 -145572
9421 -145572 -99049 -355458 163202 -64014 -32232 234001 -179238 18281 -55165 -192027 -145717
9410 -145717 23607 126709 19041 -146116 -293314 -26830 -310116 -284565 -128142 -178398 99713
9398 -85926 133317 -70040 -99199 -276906 -71766 -117225 5234 82464 192375 -93848 307030
9386 140696 -90608 -113884 -38509 -296266 172163 -329226 53725 -83417 -226665 63241 22412
9374b87169b2358D3022A4893M0865J42590h6402j50234n9654B00785a77016q6876
9363b63892K744i2458A60082c53560A63173B4895J14110J53964A2912c5128k54345
9352b89473p2199b4682j24276B16657j6655b8261B6605b47309O3912k1200O0791
9341a43806j67681p2489a81031k201M3170j47112A4320a06951k07654e123j86301
9330a91424m057j026B95182b70548P9505H6417c78091Q689E9286a32838n0195
9319a83033l8384c5783E45011a51259a4315A79176b31907Q9095l298F4860b21971
9307E8006c08371a26995B16649a76731B50834a24928j969m3735M9524q8663I5980
9295d9474m9327k00880B50418A2866K207b29951G1199B3452a79527O1468B56647
$$ plain form
9374 -287169 -22358 43022 14893 55758 198348 -86402 -236636 -296290 200785 -177016 -263892
9363 -263892 -261148 -92458 160082 -353560 163173 24895 139005 292969 12912 -35128 -289473
9352 -289473 -361672 -24682 -148958 216657 200002 -28261 26605 -247309 -183397 -204597 -143806
9341 -143806 -311487 -383976 -181031 -183232 -140062 -287174 14320 -106951 -314605 -5123 -191424
9330 -191424 -195481 -196507 295182 -270548 -191043 86417 -378091 -369402 59286 -132838 -183033
9319 -183033 -221417 -35783 545011 -151259 -14315 179176 -231907 -142812 -146110 64860 -221971
9307 58006 -308371 -126995 216649 -176731 250834 -124928 -126897 -170632 -121108 -209771 95980
9295 -49474 -98801 -299681 250418 12866 15073 -229951 71199 23452 -179527 -118059 256647
9283a11804k26310h5862c7847A2883N6042a02011l45286a53996b8161j1071l3219
9272g2451q085l8805J3013E7156k5939a22944A41362a58470e2071k63688B68515
9260A84618g0779j50057A10137J2002n9244a51498r020g6555b7877F9971e0950
9248a95823K8423B73526B882J00863Q6330d03431J45119J18439A2363K37327m8233
9237B01457j9974a47139I5823f771k66977j0968b7145C6151J80035J18221j51428
9226A82979c64222C6779b71736d9581j55594Q7076k85885J45008J29454G3117
9215b28266R0415e9445C31802a54614M1926L7134k50246a26321a0125j83516e3281
9203c42053L7281D5225a59307l49049J22535A12980K12548A7411c1457k02586
$$ plain form
9283 -111804 -338114 -85862 -37847 12883 68925 -102011 -447297 -153996 -28161 -39232 -72451
9272 -72451 -80536 -119341 -106328 57156 31217 -122944 141362 -158470 -52071 -315759 268515
9260 184618 -70779 -220836 110137 122139 62895 -151498 -160518 -76555 -27877 69971 -50950
9248 -195823 -167400 273526 2882 103745 190075 -403431 -258312 -139873 12363 249690 201457
9237 201457 181483 -147139 95823 -6771 -273748 -284716 -27145 36151 216186 334407 182979
9226 182979 -364222 36779 -271736 -49581 -205175 -118099 -403984 -258976 -129522 73117
9215 -228266 -137851 -59445 331802 -154614 -112688 -75554 -325800 -126321 -10125 -193641 -53281
9203 -342053 -304772 45225 -159307 -508356 -385821 112980 325528 17411 -31457 -234043
9193b34043l8431J17360J8745B94327h6490k20660G7995g5664j50189L9611K2347
9182a63895j16761B98586G0317e0531B54306j26510a02362j60224A2316a02507
9171a31874j285L6954B59048N5682a59889j02333J02539H8141B2555a66329A38540
9159G9761d22722I2146d4502I3872K49765c681A02258B3026c15820d966l38676
9148c43642h2857c0670k49935G5605a03887j2595k24711R8825A96006c02931A2625
9136a4708D3979a48202f4955k56598A21846J34368h6219A10992a33349p9684j43580
9125c56613n1858A37928L894b94839F820c23182E5197a99041C53627a688m3767
9114d5455D8625M803f5391H6489a65828F5549F079h828A08069l5706M7008M4781
$$ plain form
9193 -234043 -272474 -155114 -136369 294327 -86490 -307150 77995 -75664 -225853 -186242 -163895
9182 -163895 -280656 298586 70317 -50531 254306 127796 -102362 -262586 12316 -102507
9171 -131874 -133159 -96205 259048 314730 -159889 -262222 -159683 88141 22555 -166329 138540
9159 79761 -422722 92146 -44502 93872 343637 -3681 102258 23026 -315820 -4966 -343642
9148 -343642 -82857 -30670 -280605 75605 -103887 -116482 -341193 -242368 196006 -302931 12625
9136 -14708 43979 -148202 -64955 -321553 121846 256214 -86219 110992 -133349 -213033 -356613
9125 -356613 -408471 137928 141822 -294839 6820 -323182 55197 -199041 353627 -1688 -45455
9114 -45455 48625 53428 -65391 86489 -165828 65549 6079 -8828 108069 72363 119371 164152
9102A64152c05795G2042c8381A71698B5826L47114j70159d2381m95829c7359F8661
9090b42939G0016d1584l11900a11966D3401Q2050m5010a40827k85607a16628A64370
9078i7409I2411b85026F1335a7775k3122E6957c92517C69015a5742l0201G2997
9066B9640Q1339K5002b15317A70610E7928J72239a03818A0804J16662a21755D9078
9054f6651j1432I2217L0562i5089a7212l15009B4898a21168r9119o8224A3047
9042a46598N7141I7038d74399H4107d5681l15187a07991k39285P6958E4165D622
9030i1079L4376A77627q4617a44321A00960f3638H6902L7351n7234b8193j94543
9019b22736M6833d2795H0301J50432b26437c6771E3308k2195c71556a33573c606
$$ plain form
9102 164152 -305795 72042 -38381 171698 25826 372940 202781 -42381 -538210 -37359 68661
9090 -242939 70016 -41584 -353484 -111966 43401 125451 80441 -140827 -426434 -116628 164370
9078 -97409 92411 -285026 61335 -17775 -40897 56957 -392517 369015 -15742 -45943 72997
9066 29640 110979 135981 -215317 170610 57928 230167 -103818 10804 127466 -121755 49078
9054 -66651 -78083 92217 122779 -95089 -17212 -332221 24898 -121168 -220287 -288511 13047
9042 -146598 -89457 97038 -474399 84107 -45681 -360868 -107991 -347276 -270318 54165 4622
9030 -91079 -56703 177627 93010 -144321 100960 -63638 86902 124253 67019 -28193 -222736
9019 -222736 -175903 -42795 80301 230733 -226437 -36771 53308 31113 -371556 -133573 -3606
9007g7641k9672R003A47902d6042m66473K42073M9420M5503H2304K11675a80672
8995h7449M136n2861k55870E6688L388a68039A7275L4109b5660k5108H6838c24742
8982a74611E1734a80205Q4341F0132b63223j44210J88180C02949a07684c4793
8971a57362f8428p6106B38237k529b10235j0687C5551a20173b1676l16907J06598
8960b31985F2906b76208A65023b47820a06975L5009H6124b92305J10235A18413
8949h8453C9677d2216J0120j82666D408M03457b42722d2049k8656J4648n340A79873
8936a64918B77599L98509k41915A48707A2489J61407i7326G0504i4033A10443
8925C61738N26131Q01277K511739R372716l894462B453387H71178j78336j49345
$$ plain form
9007 -77641 -107313 -98310 147902 -46042 -512515 -270442 -221022 -175519 82304 293979 -180672
8995 -87449 -83313 -136174 -392044 56688 60076 -168039 17275 51384 -25660 -50768 86838 -324742
8982 -174611 51734 -180205 -95864 60132 -263223 -407433 -219253 302949 -107684 -34793
8971 -157362 -68428 -144534 238237 235708 -210235 -220922 35551 -120173 -21676 -338583 -231985
8960 -231985 62906 -276208 165023 -247820 -106975 -71966 86124 -292305 -182070 118413
8949 -88453 39677 -42216 -32096 -214762 4408 407865 -242722 -42049 -70705 -56057 -61397 179873
8936 -164918 277599 676108 434193 148707 12489 173896 -97326 70504 -94033 110443
8925 361738 887869 1689146 4200885 13573601 9679139 2453387 871178 692842 543497
8916E43497A70958J01475H7071k3981Q0920G063J44534b35018E05523a37542l173
8905a40715F13947b31813B77083L6448j27688q0243D8113K05126c13330a45961
8894A46671b75611E4810a21294Q09B3397M26921A54469a70493M154H993K02632
8883B11625o0205c2591r3223j40127A19998a10444m1428K500A14461d00359f3775
8871b36195A1279h3404F9126B5283O6637b6253B5539d2039j25852D7584a8081
$$ plain form
8916 543497 170958 272433 87071 63090 144010 7063 151597 -235018 505523 -137542 -140715
8905 -140715 613947 -231813 277083 313531 185843 105600 48113 253239 -313330 -145961
8894 146671 -275611 54810 -121294 -120485 23397 450318 154469 -170493 -166339 8993 211625
8883 211625 151420 -32591 -125814 -265941 119998 -110444 -151872 -149372 114461 -400359 -63775
8871 -236195 11279 -83404 69126 25283 91920 -26253 25539 -42039 -167891 47584 -18081
$$ [...]
##END NTUPLES=NMR SPECTRUM
##END=
