
##TITLE=AC1352_CHIAH12170_6672572_iBDQRKUdyq
##JCAMPDX= 6.0         $$ Bruker NMR JCAMP-DX V2.0
##DATA TYPE= NMR SPECTRUM
##DATA CLASS= NTUPLES
##ORIGIN= BRUKER
##OWNER= Administrator
$$ 1.72 TOPSPIN		Version 2.1
$$ 2012-12-14 02:35:33.261 -0500  Administrator@X
$$ Compression mode = diff/dup
##.OBSERVE FREQUENCY= 400.02188249412
##.OBSERVE NUCLEUS= ^1H
##.ACQUISITION MODE= SIMULTANEOUS (DQD)
##.ACQUISITION SCHEME= undefined
##.AVERAGES= 8
##.DIGITISER RES= 22
##SPECTROMETER/DATA SYSTEM= spect
##.PULSE SEQUENCE= zg30
##.SOLVENT NAME= COFFEE_meoh
##.SHIFT REFERENCE= INTERNAL, COFFEE_meoh, 1, 14.98509
##AUDIT TRAIL= $$ (NUMBER, WHEN, WHO, WHERE, PROCESS, VERSION, WHAT)
$$ ##TITLE= Audit trail, TOPSPIN		Version 2.1
$$ ##JCAMPDX= 5.01
$$ ##ORIGIN= Bruker BioSpin GmbH
$$ ##OWNER= Administrator
$$ $$ E:\/data/COFFEE/nmr/AC1352_CHIAH12170_6672572_iBDQRKUdyq/20/pdata/1/auditp.txt
$$ ##AUDIT TRAIL=  $$ (NUMBER, WHEN, WHO, WHERE, PROCESS, VERSION, WHAT)
(   1,<2012-12-14 02:35:25.058 -0500>,<Administrator>,<X>,<go>,<TOPSPIN 2.1>,
      <created by zg
	started at 2012-12-14 02:34:18.980 -0500,
	POWCHK enabled, PULCHK disabled,
       configuration hash MD5:
       86 BA 57 50 F2 9D 5C 9B 26 00 A9 28 5F 66 2E 89
       data hash MD5: 64K
       A7 4A 35 D9 D8 0A 3C 7F A9 37 CA 7D C1 46 4B DC>)
(   2,<2012-12-14 02:35:28.120 -0500>,<Administrator>,<X>,<proc1d>,<TOPSPIN 2.1>,
      <Start of raw data processing
       efp LB = 0 FT_mod = 6 PKNL = 1 PHC0 = 0 PHC1 = 0 SI = 32K 
       data hash MD5: 32K
       55 E9 2A 78 7F 7F 61 EC 12 8B 9E 40 D3 10 33 D7>)
(   3,<2012-12-14 02:35:28.605 -0500>,<Administrator>,<X>,<proc1d>,<TOPSPIN 2.1>,
      <pk PHC0 = 101.8652 PHC1 = 0 
       data hash MD5: 32K
       81 BB ED A4 C0 35 C0 9C 79 4D B4 C8 83 04 2A 44>)
(   4,<2012-12-14 02:35:28.823 -0500>,<Administrator>,<X>,<proc1d>,<TOPSPIN 2.1>,
      <abs ABSG = 1 
       data hash MD5: 32K
       09 24 F9 FE CE F5 9C 2F 3F F6 DA DC ED 91 8B 14>)
(   5,<2012-12-14 02:35:28.980 -0500>,<Administrator>,<X>,<proc1d>,<TOPSPIN 2.1>,
      <abs ABSG = 2 
       data hash MD5: 32K
       9D 0F 35 92 6E D2 C1 D8 F9 D5 AE 29 68 10 C1 14>)
(   6,<2012-12-14 02:35:29.136 -0500>,<Administrator>,<X>,<proc1d>,<TOPSPIN 2.1>,
      <abs ABSG = 3 
       data hash MD5: 32K
       74 56 F1 E2 BC EF EA AC 80 91 97 DE 72 37 78 10>)
(   7,<2012-12-14 02:35:29.277 -0500>,<Administrator>,<X>,<proc1d>,<TOPSPIN 2.1>,
      <abs ABSG = 4 
       data hash MD5: 32K
       BF 97 31 D6 C3 99 40 65 6E 18 57 1D CA 80 B3 94>)
(   8,<2012-12-14 02:35:29.433 -0500>,<Administrator>,<X>,<proc1d>,<TOPSPIN 2.1>,
      <abs ABSG = 5 
       data hash MD5: 32K
       8A 12 CA 6B 93 B4 67 31 A6 84 05 9B DC 57 64 D4>)
$$ ##END=
$$ 
$$ $$ hash MD5
$$ $$ B6 99 23 51 EC E6 C4 F8 4A 7C 14 F1 B6 32 3B FA
##$RELAX= 
##$RELAX= 
##$RELAX= 
##$RELAX= 
##$RELAX= 
##$RELAX= 
##$RELAX= 
$$ Bruker specific parameters
$$ --------------------------
##$DU= <E:\>
##$EXPNO= 20
##$NAME= <AC1352_CHIAH12170_6672572_iBDQRKUdyq>
$$ [...]
##$TP= (0..7)
150 150 150 150 150 150 150 150
##$TP07= 0
##$TPNAME0= <>
##$TPNAME1= <>
##$TPNAME2= <>
##$TPNAME3= <>
##$TPNAME4= <>
##$TPNAME5= <>
##$TPNAME6= <>
##$TPNAME7= <>
##$TPOAL= (0..7)
0.5 0.5 0.5 0.5 0.5 0.5 0.5 0.5
##$TPOFFS= (0..7)
0 0 0 0 0 0 0 0
##$TUNHIN= 0
##$TUNHOUT= 0
##$TUNXOUT= 0
##$USERA1= <user>
##$USERA2= <user>
##$USERA3= <user>
##$USERA4= <user>
##$USERA5= <user>
##$V9= 5
##$VALIST= <valist>
##$VCLIST= <CCCCCCCCCCCCCCC>
##$VD= 0
##$VDLIST= <DDDDDDDDDDDDDDD>
##$VPLIST= <PPPPPPPPPPPPPPP>
##$VTLIST= <TTTTTTTTTTTTTTT>
##$WBST= 1024
##$WBSW= 4
##$XGAIN= (0..3)
0 0 0 0
##$XL= 0
##$YL= 0
##$YMAX_a= 657929
##$YMIN_a= -560851
##$ZGOPTNS= <>
##$ZL1= 120
##$ZL2= 120
##$ZL3= 120
##$ZL4= 120
##$ABSF1= 14.98509
##$ABSF2= -5.573092
##$ABSG= 5
##$ABSL= 3
##$ALPHA= 0
##$AQORDER= 0
##$ASSFAC= 0
##$ASSFACI= 0
##$ASSFACX= 0
##$ASSWID= 0
##$AUNMP= <proc_prof1d_extract_pilot.lims>
##$AXLEFT= 0
##$AXNAME= <>
##$AXNUC= <1H>
##$AXRIGHT= 0
##$AXTYPE= 0
##$AXUNIT= <>
##$AZFE= 0.1
##$AZFW= 0.1
##$BCFW= 0
##$BC_mod= 0
##$BYTORDP= 0
##$COROFFS= 0
##$CY= 15
##$DATMOD= 1
##$DC= 0
##$DFILT= <>
##$DTYPP= 0
##$F1P= 0
##$F2P= 0
##$FCOR= 0.5
##$FTSIZE= 32768
##$FT_mod= 6
##$GAMMA= 0
##$GB= 0
##$INTBC= 1
##$INTSCL= 1
##$ISEN= 128
##$LB= 0
##$LEV0= 0
##$LPBIN= 0
##$MAXI= 10000
##$MC2= 0
##$MEAN= 0
##$ME_mod= 0
##$MI= 0
##$NCOEF= 0
##$NC_proc= -8
##$NLEV= 6
##$NOISF1= 0
##$NOISF2= 0
##$NSP= 0
##$NTH_PI= 0
##$NZP= 0
##$OFFSET= 14.98509
##$PC= 1
##$PHC0= 101.8652
##$PHC1= 0
##$PH_mod= 1
##$PKNL= yes
##$PPARMOD= 0
##$PPDIAG= 0
##$PPIPTYP= 0
##$PPMPNUM= 2147483647
##$PPRESOL= 1
##$PSCAL= 4
##$PSIGN= 0
##$PYNMP= <proc.py>
##$REVERSE= no
##$SF= 400.02
##$SI= 32768
##$SIGF1= 0
##$SIGF2= 0
##$SINO= 400
##$SIOLD= 32768
##$SPECTYP= <>
##$SREGLST= <1H.CDCl3>
##$SSB= 0
##$STSI= 32768
##$STSR= 0
##$SW_p= 8223.68421052631
##$SYMM= 0
##$S_DEV= 0
##$TDeff= 65536
##$TDoff= 0
##$TI= <>
##$TILT= no
##$TM1= 0
##$TM2= 0
##$TOPLEV= 0
##$USERP1= <user>
##$USERP2= <user>
##$USERP3= <user>
##$USERP4= <user>
##$USERP5= <user>
##$WDW= 1
##$XDIM= 32768
##$YMAX_p= 463493061
##$YMIN_p= -836239
##$CURPLOT= <Network HP LaserJet P1505>
##$CURPRIN= <$Network HP LaserJet P1505>
##$DFORMAT= <normdp>
##$LAYOUT= <+/1D_H.xwp>
##$LFORMAT= <normlp>
##$PFORMAT= <normpl>
##$SURQMSG= 1
$$ End of Bruker specific parameters
$$ ---------------------------------
##NTUPLES= NMR SPECTRUM
##VAR_NAME=  FREQUENCY,     SPECTRUM/REAL,   SPECTRUM/IMAG
##SYMBOL=    X,             R,               I
##VAR_TYPE=  INDEPENDENT,   DEPENDENT,       DEPENDENT
##VAR_FORM=  AFFN,          ASDF,            ASDF
##VAR_DIM=   32768,         32768,           32768
##UNITS=     HZ,            ARBITRARY UNITS, ARBITRARY UNITS
##FACTOR=    0.250966925370066, 1,           1
##FIRST=     8223.43324360094, 24602,        32409
##LAST=      0,             -212171,         172225
##MIN=       0,             -836239,         0
##MAX=       8223.43324360094, 463493061,    0
$$ Real data points
##PAGE= N=1
##DATA TABLE= (X++(R..R)), XYDATA
$$ [...]
19537C969a82035A72545n1367a68663g6198K846k2662n4564j4989A24420F194
$$ 3969 -182035 172545 121178 -168663 -76198 -73352 -96014 -150578 -165567 124420 6194
19525c27031J34691n5529R7541A32003a63814A66083a55403B71630q7768B9788
$$ -327031 -192340 -247869 -150328 132003 -163814 166083 -155403 271630 183862 29788
19514a63820m6647A39825a3450k3797p7202k34656a39788c2956l30690G3622I24
$$ -163820 -210467 139825 -13450 -37247 -114449 -349105 -139788 -32956 -363646 73622 924
19502B85335j08966j0357c09242a52931p7587H8066a58420d5284j8755j79520
$$ 285335 176369 166012 -309242 -152931 -230518 88066 -158420 -45284 -64039 -243559
19492b43559i5398j22193E4638a386q7842M0480j7360l6234M0935A01148a52589
$$ -243559 -95398 -217591 54638 -1386 -89228 -48748 -66108 -102342 -61407 101148 -152589
19480B51436b05209K4678C2376c09575H1970N8569a67851l00917D35374a05794
$$ 251436 -205209 -180531 32376 -309575 81970 140539 -167851 -468768 435374 -105794
19469a09969k29957a01827B8947a86905M3406d6511k40071E3005h0494B51197
$$ -109969 -339926 -101827 28947 -186905 -143499 -46511 -286582 53005 -80494 251197
19458H7317b78090E780a91168A90230H2990a57353j8357A24426b50041b196l36705
$$ 87317 -278090 5780 -191168 190230 82990 -157353 -175710 124426 -250041 -2196 -338901
19447c38901a5079m9246j89555n6126A98264a90169a1020l23830O6014J5471Q9809
$$ -338901 -15079 -64325 -253880 -310006 198264 -190169 -11020 -334850 -268836 -253365 -163556
19436a63556M532A20612l9927c02277g4556E7837K13497d01528a16360k11498
$$ -163556 -159024 120612 80685 -302277 -74556 57837 271334 -401528 -116360 -327858
19426c27858C5621e346D7739J60564b89617B91795b48721J12534k2560B6382L60683
$$ -327858 35621 -5346 47739 208303 -289617 291795 -248721 -136187 -158747 26382 387065
19415C87065I0045f8162q0633a3224j01138B34377a00060A88734c528l8770G6866
$$ 387065 90045 -68162 -148795 -13224 -114362 234377 -100060 188734 -3528 -42298 76866
19403d32027a57037g93E4069L6769I980N5451b06172K4175P7381M5406j58168
$$ -432027 -157037 -793 54069 90838 9980 65431 -206172 -181997 -104616 -59210 -217378
19392b17378l389D7340L4518A140N8095Q0390d49815a43070o7264m0955g4854
$$ -217378 -220767 47340 81858 1140 59235 139625 -449815 -143070 -210334 -251289 -74854
19380a93897h0004a2524A74937i6474o4216C22394E5034i4562k0339N2798j15906
$$ -193897 -80004 -12524 174937 -96474 -160690 322394 55034 -94562 -114901 -62103 -178009
19369a78009J6128j56676e3745o0708b2499A25948a42574c7496A31194b34003
$$ -178009 -161881 -318557 -53745 -114453 -22499 125948 -142574 -37496 131194 -234003
19358a0345A0926g4844k01466a03950p3130B5380a56688L6133k8848M1288c9185
$$ -10345 10926 -74844 -276310 -103950 -177080 25380 -156688 -120555 -149403 -108115 -39185
19346D85226a36327A83344B6498K37990a6287A05658m8102d7256a8536j06427
$$ 485226 -136327 183344 26498 264488 -16287 105658 57556 -47256 -18536 -124963
19336a24963p0689k26397d968k57628B49058a69700C27443b297j25215H201J51125
$$ -124963 -195652 -422049 -4968 -262596 249058 -169700 327443 -2297 -127512 8201 159326
19325A59326p5164a92941h4387L45m0198K8497E6118f3259j17110A65008B37K60410
$$ 159326 84162 -192941 -84387 -84042 -124240 -95743 56118 -63259 -180369 165008 237 260647
19313B60647C9306b90412p4881h5666K8768A38710c971r5977L3906H5787b16923
$$ 260647 39306 -290412 -365293 -85666 -56898 138710 -3971 -99948 -66042 85787 -216923
19301g3149j58390C823c27578R5752P0528k66901A1482b08993C5373b31908q6996
$$ -73149 -231539 3823 -327578 -231826 -161298 -428199 11482 -208993 35373 -231908 -318904
19290c18904C3105a89513I3057O184b7181l37405A19654a9487k9148C0274J14866
$$ -318904 33105 -189513 93057 99241 -27181 -364586 119654 -19487 -48635 30274 145140
19279A45140a47331n7653A00696h684N13k81711l9235c55j79085j18550i6654
$$ 145140 -147331 -204984 100696 -8684 -8171 -289882 -329117 -355 -179440 -297990 -96654
19267c7542A24008a04382K9784k05961a07792N1991D0951K81968E9420i2457j88052
$$ -37542 124008 -104382 -74598 -280559 -107792 -55801 40951 322919 59420 -92457 -280509
19256b80509o8736O3208k1669k6080A80678a01097D10060a12106j10222a04392
$$ -280509 -349245 -286037 -307706 -333786 180678 -101097 410060 -112106 -222328 -104392
19245A57083n5778d9200F7693O3480c2505A99052H9707a37971m67359a00975n9924
$$ 157083 101305 -49200 67693 131173 -32505 199052 89707 -137971 -605330 -100975 -160899
19234a60899d9057k30394P5332l73055H3576J2750a85842B21658B1327b20072
$$ -160899 -49057 -279451 -204119 -577174 83576 96326 -185842 221658 21327 -220072
19223a19813E5412b77469E7636K1866b32087N553f0623g809p9357j614b5343P219
$$ -119813 55412 -277469 57636 79502 -232087 -226534 -60623 -7809 -87166 -88780 -25343 -18124
19211a8124o2946j25219G4113b74687P112A16361O410b5160k4852A48348e0074
$$ -18124 -81070 -206289 74113 -274687 -267575 116361 122771 -25160 -50012 148348 -50074
19199a05596H9214P969O5025D8788b50704A7587a32205L71r4805a01400A586P2986
$$ -105596 89214 97183 162208 48788 -250704 17587 -132205 -131834 -226639 -101400 1586 74572
19187G4572n86b29160P5714N5914Q763a0191j90530a4897k81536a5379E33b31629
$$ 74572 73986 -229160 -153446 -97532 -88769 -10191 -200721 -14897 -296433 -15379 533 -231629
19174g1381A34918d4574j38243A11008G864b88168n2830d9453j53131k96939h6611
$$ -71381 134918 -44574 -182817 111008 7864 -288168 -340998 -49453 -202584 -499523 -86611
19162a27417c1798j12153B49044c7554j59519B38113m270h7799j89802G0541J30825
$$ -127417 -31798 -143951 249044 -37554 -197073 238113 233843 -87799 -277601 70541 201366
19151B01366o9791e5493A21441b53994h467E2196a33422j47653b3640j60022A77431
$$ 201366 131575 -55493 121441 -253994 -8467 52196 -133422 -281075 -23640 -183662 177431
19139b17560j45014i9876A41719a9555j46516C3702K86398G4749e4083a5420H7281
$$ -217560 -362574 -99876 141719 -19555 -166071 33702 320100 74749 -54083 -15420 87281
19127a1233A50556b00011L6017j41031a42555r8646A22511E0289d43878B48318
$$ -11233 150556 -200011 -163994 -305025 -142555 -241201 122511 50289 -443878 248318
19116a46716n7195J01634j49207e2316E559Q3006M1292a80108C84082a22846l18267
$$ -146716 -203911 -102277 -251484 -52316 5559 88565 129857 -180108 384082 -122846 -441113
19105d41113g0297l24970J11843D9496a35604I1442a80393A57545c13738H9117
$$ -441113 -70297 -395267 -283424 49496 -135604 91442 -180393 157545 -313738 89117
19094f685p4283D4743b61517a18610I9007C6165a20962j04424A81134o3588b7767
$$ -6685 -80968 44743 -261517 -118610 99007 36165 -120962 -225386 181134 117546 -27767
19082a27258k6250A52678c5763k30379n0745G4336K32773i7744I0250a85965N92
$$ -127258 -153508 152678 -35763 -266142 -316887 74336 307109 -97744 90250 -185965 -185373
19071a85373G07a29312B19530D0033N9279h1383A72148d2869G5788g1205D71188
$$ -185373 707 -129312 219530 40033 99312 -81383 172148 -42869 75788 -71205 471188
19059a23523k18447H68a15844j9023c7813E8468e33326H7748M6809a56583B47299
$$ -123523 -341970 868 -115844 -134867 -37813 58468 -533326 87748 134557 -156583 247299
19047g8366j14540B6986b79043A08269i4875k51403K0918I9162a2687A16678g943
$$ -78366 -192906 26986 -279043 108269 -94875 -346278 -325360 99162 -12687 116678 -7943
19035B26508g8763L8244A88840K11672A93321J17910d357j76828B58093H3547
$$ 226508 -78763 -40519 188840 400512 193321 311231 -4357 -181185 258093 83547
19024I1322K71496f7043A47316b7967Q351B23077c36435A59601a02869B07243
$$ 91322 362818 -67043 147316 -27967 -19616 223077 -336435 159601 -102869 207243
19013a5980I8898L20377E9169f4344j41491J8147E7170d8555j04231E5398f1683
$$ -15980 98898 419275 59169 -64344 -205835 -187688 57170 -48555 -152786 55398 -61683
19001A02835a33988e5622C1080g1760A39695F6713b88979A30372L59960a07059
$$ 102835 -133988 -55622 31080 -71760 139695 66713 -288979 130372 490332 -107059
18990h8007j27367G2220b38563j40686O9287I5724a2900l00207H5554c6364A05821
$$ -88007 -215374 72220 -238563 -379249 -309962 95724 -12900 -313107 85554 -36364 105821
18978A11314A4282b66344D9692J72079e6929j73881a00138p8939g4131K706K6000
$$ 111314 14282 -266344 49692 221771 -56929 -230810 -100138 -179077 -74131 -71425 -45425
18967d5425K0738Q100l28433J71842F6612b19907d6820j4614D04829b25678R5770
$$ -45425 -24687 -16587 -345020 -173178 66612 -219907 -46820 -61434 404829 -225678 -129908
18956a29908L168O1220r9224p1594J14913l0901B1585P7038D5469a49797A7383
$$ -129908 -126740 -65520 -164744 -236338 -121425 -152326 21585 98623 45469 -149797 17383
18944g4054j54740j07294d5133H18L1818a0790k04735B73096b74970E9360d376
$$ -74054 -228794 -336088 -45133 818 32636 -10790 -215525 273096 -274970 59360 -4376
18932D26532c20695j25826D5353O3293a52422A1162d8030j8616F1144i896I9684
$$ 426532 -320695 -446521 45353 108646 -152422 11162 -48030 -66646 61144 -9896 99684
18920b89288g703j93604D2498K02996A4658N7900h0062j9620n0436E2865e20368
$$ -289288 -7703 -201307 42498 245494 14658 72558 -80062 -99682 -150118 52865 -520368
18908g9322J5227j58892A16544b45035B0359P8453h9616j47458e8860m0159A35375
$$ -79322 -64095 -222987 116544 -245035 20359 98812 -89616 -237074 -58860 -99019 135375
18896a0077q5724o1955j5581d5416k94054Q9728O9516D6756c0674B47485b23451
$$ -10077 -95801 -157756 -173337 -45416 -339470 -249742 -180226 46756 -30674 247485 -223451
18884b1415H2007d5963j14940O2823A33867c24834A77691E7182b58996c9372k44494
$$ -21415 82007 -45963 -160903 -98080 133867 -324834 177691 57182 -258996 -39372 -283866
18873b83866a6019m65992G5107K00007H0820a04299p1813H9332N4785a90617C102
$$ -283866 -16019 -482011 75107 275114 80820 -104299 -176112 89332 144117 -190617 3102
18861D175Q1968b5391A53476J06277f2026r8712B92689a72767A31091K9059k5450
$$ 4175 86143 -25391 153476 259753 -62026 -160738 292689 -172767 131091 160150 134700
18850A34700O9740D7757d7236A54791Q1567b0077A34399L3891K85460A31764D4062
$$ 134700 204440 47757 -47236 154791 236358 -20077 134399 168290 453750 131764 44062
18838A37874d7181j36484K2278j74842B71109F7978b50061h3934B72807a82334
$$ 137874 -47181 -183665 -161387 -336229 271109 67978 -250061 -83934 272807 -182334
18827a91724C44643C1143a47884o8131a9554k62375A66555b10039C875a92376
$$ -191724 344643 31143 -147884 -216015 -19554 -281929 166555 -210039 3875 -192376
18816h5858E9484M6003d09637H8572a3940j49474D36930a78900f6864A35729e6293
$$ -85858 59484 105487 -409637 88572 -13940 -163414 436930 -178900 -66864 135729 -56293
18804a20735A92269n8901J92365a41205d1386o8657F253K4710K30113c66911C0575
$$ -120735 192269 133368 325733 -141205 -41386 -110043 6253 30963 261076 -366911 30575
18792b57353a26434f273j23964B08518a11225q4285B7583J8311c41513a60669
$$ -257353 -126434 -6273 -130237 208518 -111225 -195510 27583 45894 -341513 -160669
18781A45927a30240H1850b09523a01294c998k32471p1727j4302J25574H4389a51038
$$ 145927 -130240 81850 -209523 -101294 -3998 -236469 -308196 -322498 -196924 84389 -151038
18769C52168g9401B1647J47030d7710A356b75555a18371B11633c917k0450E1780
$$ 352168 -79401 21647 168677 -47710 1356 -275555 -118371 211633 -3917 -24367 51780
18757c0118E3698a2696j45107O7646E772a86174A27121c24381A3005b00069A22961
$$ -30118 53698 -12696 -157803 -90157 5772 -186174 127121 -324381 13005 -200069 122961
18745G0980b32999e4870B29236J07973f3095j57750J07456r4688O9018A24464
$$ 70980 -232999 -54870 229236 337209 -63095 -220845 -113389 -208077 -139059 124464
18734a40738M1262G0776F224b87597J41231c3832F1231c32033a54340j13088C4195
$$ -140738 -99476 70776 6224 -287597 -146366 -33832 61231 -332033 -154340 -267428 34195
18722D0036K09241a63082J8254L5733q6615c977o64898c6619B57326h8511j33143
$$ 40036 249277 -163082 -144828 -109095 -195710 -3977 -668875 -36619 257326 -88511 -221654
18711b21654B61077c66965C7679J2118K9896M19494k23743a46119J7876j01960
$$ -221654 261077 -366965 37679 49797 79693 499187 275444 -146119 -128243 -230203
18701b30203i164A23106a7704j75746k57121A68937c39791h3532j97616B6476
$$ -230203 -9164 123106 -17704 -193450 -450571 168937 -339791 -83532 -281148 26476
18690I3692J1213b63341e057q1781b0985k04911b7643E4342c2013k61922J15817
$$ 93692 104905 -263341 -5057 -86838 -20985 -225896 -27643 54342 -32013 -293935 -178118
18679a78118B29717j02351h5125o8011F9739E11e0799B1780a03133j35373a01258
$$ -178118 229717 127366 -85125 -153136 69739 511 -50799 21780 -103133 -238506 -101258
18667h4852o9278L9762j89350a6959j60901f0003A1622a08474j56046F1999K2416
$$ -84852 -154130 -114368 -303718 -16959 -177860 -60003 11622 -108474 -264520 61999 84415
18656H4415K08489a80676P6143j34811A67886e7482A22927d24135f6388H2843
$$ 84415 292904 -180676 -104533 -239344 167886 -57482 122927 -424135 -66388 82843
18645I6574a13612L6432m5487e9172A04941b89525h3524j02161L5877A22854c38068
$$ 96574 -113612 -77180 -122667 -59172 104941 -289525 -83524 -185685 -149808 122854 -338068
18633a29848e2668J4970F5010i9918j10012g1910l06786c0675o5405j10452a0620
$$ -129848 -52668 -37698 65010 -99918 -209930 -71910 -378696 -30675 -96080 -206532 -10620
18621b1711n8926l08526J19554k56315d4339k87937a6489k08417B71290a54308
$$ -21711 -80637 -389163 -269609 -525924 -44339 -332276 -16489 -224906 271290 -154308
18610c07785I3399b5632j70165A19780a1307j30195H3520c6928k49987g8729A1606
$$ -307785 93399 -25632 -195797 119780 -11307 -141502 83520 -36928 -286915 -78729 11606
18598a38509D19069b54211g6271b2907E5042a05740l8002p5006J1402j5147F5934
$$ -138509 419069 -254211 -76271 -22907 55042 -105740 -143742 -218748 -207346 -222493 65934
18586F566b83805K6528G7431n440J3949L4784a79295G9460a26650B11578a17810
$$ 6566 -283805 -257277 77431 71991 85940 120724 -179295 79460 -126650 211578 -117810
18574d50905B11875b11441Q1497l4653B64602d07009A63949k1458a50798A28124
$$ -450905 211875 -211441 -129944 -164597 264602 -407009 163949 142491 -150798 128124
18563g6679k2266k536A4602a725j41557r8007h581k01815A24469e7919A23902
$$ -76679 -98945 -101481 14602 -1725 -143282 -241289 -8581 -210396 124469 -57919 123902
18551E5682L2237a12779B9826J24311d27476e5376l3364E7244b50531q750C21886
$$ 55682 87919 -112779 29826 154137 -427476 -55376 -88740 57244 -250531 -259281 321886
18539A8816b85050N4267C50710c6697m9703q9993B25227b84379O4113i2074B95304
$$ 18816 -285050 -230783 350710 -36697 -86400 -176393 225227 -284379 -220266 -92074 295304
18527h6817L8474n981m1984c5058k22571e4390r1640F3i584j5043A70636D7009
$$ -86817 -48343 -54324 -96308 -35058 -257629 -54390 -146030 63 -9584 -24627 170636 47009
18514C10374c5280n0605E6273a67205L5629B0309J50132C5555a2111l6012r7999
$$ 310374 -35280 -85885 56273 -167205 -131576 20309 170441 35555 -12111 -48123 -146122
18503a46122C42808b17174M9329O6846b0994A33855f0810R269j11380A68589A3575
$$ -146122 342808 -217174 -167845 -100999 -20994 133855 -60810 -51541 -162921 168589 13575
18491a54897a4074p2626j55216B43691G5973a13772e2280q9285L5392m836j50706
$$ -154897 -14074 -86700 -241916 243691 75973 -113772 -52280 -141565 -106173 -111009 -261715
18480b61715B20150e5888A36506i8236j99068N6090a12953A8221b50199H551a07325
$$ -261715 220150 -55888 136506 -98236 -297304 -241214 -112953 18221 -250199 8551 -107325
18468d1737A22267a17935o657I4766L7838K0596o1342b64802C2319J05839a61996
$$ -41737 122267 -117935 -124592 94766 132604 153200 91858 -264802 32319 138158 -161996
18456g9522k88198F2357a63854c9126B41491b08579L4107A18461J00155a99380
$$ -79522 -367720 62357 -163854 -39126 241491 -208579 -174472 118461 218616 -199380
18445c90603J59419P3673k11125a13581A491a88398A17230g7617B20727c3086
$$ -390603 -231184 -157511 -368636 -113581 1491 -188398 117230 -77617 220727 -33086
18434a0817q3863k7715c2235B16275l3507d75580B2110B529h9821F3211e6568
$$ -10817 -94680 -122395 -32235 216275 182768 -475580 22110 2529 -89821 63211 -56568
18422C09254g9980K3412q6686C5648K84678a64673A64706b86801D7112e5660j94960
$$ 309254 -79980 -56568 -143254 35648 320326 -164673 164706 -286801 47112 -55660 -250620
18411b50620N0127d5476A80555G1229a51909a5241A59557j6765J25290j28146
$$ -250620 -200493 -45476 180555 71229 -151909 -15241 159557 142792 268082 139936
18401A39936a3334H8446a86654F4798h3237A3166a56051G7770J16315a7979j00549
$$ 139936 -13334 88446 -186654 64798 -83237 13166 -156051 77770 194085 -17979 -118528
18390a18528A57124a93023g0486j30572K8458j54471A42830c75574A26627k562
$$ -118528 157124 -193023 -70486 -201058 -172600 -327071 142830 -375574 126627 124065
18380A24065B6585a52232k13010E20480A49832a70517k04931B87340b12553B21401
$$ 124065 26585 -152232 -365242 520480 149832 -170517 -375448 287340 -212553 221401
18369E9569L4649N7177F0769J08583C9124N9663a41042j05249A78930b88251f2710
$$ 59569 94218 151395 60769 169352 39124 98787 -141042 -246291 178930 -288251 -62710
18357i1766d217D9691a42926m6968Q3599J3158J7245B12122g1470j59261A8508
$$ -91766 -4217 49691 -142926 -189894 -106295 -93137 -75892 212122 -71470 -230731 18508
18345b84759B40901a09433A25067a87094A96752b05700N7743A17049a65223B7946
$$ -284759 240901 -109433 125067 -187094 196752 -205700 -147957 117049 -165223 27946
18334f8733I0947l7604b97723J05711L5556j4923P5773a2186j67460p7264L4718
$$ -68733 90947 53343 -297723 -192012 -156456 -171379 -95606 -12186 -179646 -256910 -222192
18323b22192P0991b1351B7730i96k06326k44045A69671d98597K48305E0884a88318
$$ -222192 -151201 -21351 27730 -996 -207322 -451367 169671 -498597 -250292 50884 -188318
18311b33511g9183A96228a34649F7321i3552j02599B58348C70O0855g7289K0955
$$ -233511 -79183 196228 -134649 67321 -93552 -196151 258348 370 61225 -77289 -56334
18300e6334j74418A27780k1231L619j0580c05498f6256D7543Q9063a03741D6760
$$ -56334 -230752 127780 106549 110168 99588 -305498 -66256 47543 136606 -103741 46760
18288a21735j3942A36489C6458J97523e9191E6510Q0724b1108A54221a95999h3148
$$ -121735 -135677 136489 36458 233981 -59191 56510 137234 -21108 154221 -195999 -83148
18276a24177j54430m66B5516b5027F3590K3887c7625D2659b92995l1925f8704
$$ -124177 -278607 -279073 25516 -25027 63590 87477 -37625 42659 -292995 -324920 -68704
18264d83754h0404a0575F2342a12603G0208N5793b72135a33183r8504a02184L9682
$$ -483754 -80404 -10575 62342 -112603 70208 126001 -272135 -133183 -231687 -102184 -62502
18253f2502A05585h8744B2907i741A38232l8778J33721f6341j55779Q7033D8587
$$ -62502 105585 -88744 22907 -9741 138232 99454 233175 -66341 -222120 -135087 48587
18241a95148K4179j43531B99396a29635a2858j40759l6863G2130f8463b0059j29918
$$ -195148 -170969 -314500 299396 -129635 -12858 -153617 -190480 72130 -68463 -20059 -149977
18230a49977O2179A91002p4041e6898j61921h9732d1571j97409A0972g1778f755
$$ -149977 -87798 191002 116961 -56898 -218819 -89732 -41571 -238980 10972 -71778 -6755
18218a67600j15350A58720o7947a33722d4004q9250H1093b35705B34799l2749
$$ -167600 -282950 158720 90773 -133722 -44004 -133254 81093 -235705 234799 202050
18208B02050n3131a07529B88990G7024a5921l0136H8400a682B69358k6010b53124
$$ 202050 148919 -107529 288990 77024 -15921 -46057 88400 -1682 269358 243348 -253124
18196b04538B5149b29982E1830K9388a87305b2558C17484B3809a47763A52759
$$ -204538 25149 -229982 51830 81218 -187305 -22558 317484 23809 -147763 152759
18185G7323J64091a16937j0102C81570A20933a81094F5163e46096e8284k20246
$$ 77323 241414 -116937 -127039 381570 120933 -181094 65163 -546096 -58284 -278530
18175b78530J27539m93398f2535C84260A48278J71599b20144F8316K00465D029
$$ -278530 -150991 -644389 -62535 384260 148278 319877 -220144 68316 268781 4029
18164a51449o6066D4439a67006O3703b8140o1100p928D1997d04187A64749C9320
$$ -151449 -217515 44439 -167006 -103303 -28140 -89240 -97168 41997 -404187 164749 39320
18152g8130C60865a30923N2113J6864A33331K20024D8378M6789d4089G8952k4132
$$ -78130 360865 -130923 -78810 -61946 133331 353355 48378 95167 -44089 78952 54820
18141E4820D543a4796k07023O2198H5191b34354L6063F7904e1538k03926R1636
$$ 54820 4543 -14796 -221819 -159621 85191 -234354 -198291 67904 -51538 -255464 -163828
18130a63828B43477E7752a28984G6856b82525B46867a71894G4421J14779b03548
$$ -163828 243477 57752 -128984 76856 -282525 246867 -171894 74421 189200 -203548
18119B08241a638j35699b3943A03120k8666J7512b2606l28310a17168m0410B51292
$$ 208241 -1638 -137337 -23943 103120 74454 91966 -22606 -350916 -117168 -157578 251292
18107f5926k49663o2935a37850A26502e9681k0550C200b5484i983o9052H1238
$$ -65926 -315589 -378524 -137850 126502 -59681 -80231 3200 -25484 -9983 -79035 81238
18095A16422k2546b04028B17895l5019a7893k2834a4335A0871J03802a67711E1776
$$ 116422 93876 -204028 217895 182876 -17893 -40727 -14335 10871 114673 -167711 51776
18083g2190l10865b0542k31410J05241B65430a64383A26801P9336k9498a63006
$$ -72190 -383055 -20542 -251952 -146711 265430 -164383 126801 206137 176639 -163006
18072A84100i916j16629k5379j30826B89632i2934c8853j82547C442b07024k5725
$$ 184100 -9916 -126545 -151924 -282750 289632 -92934 -38853 -221400 3442 -207024 -232749
18061b32749b9572B2812b4633j3489B00628d5121E3732d84568F7039a49196d6264
$$ -232749 -29572 22812 -24633 -38122 200628 -45121 53732 -484568 67039 -149196 -46264
18049c19831a38090D6184b35915F9056e5321o9065d9466A05645a09891j06750
$$ -319831 -138090 46184 -235915 69056 -55321 -124386 -49466 105645 -109891 -216641
18039b16641b237l41452E230K5995G739a72738B41523a88014J1331C839J29227
$$ -216641 -2237 -343689 5230 31225 7739 -172738 241523 -188014 -176683 3839 133066
18028A33066P5694a51397M8900I1283J21055d1395k7316m7390B52872c55474H4594
$$ 133066 208760 -151397 -102497 91283 212338 -41395 -68711 -116101 252872 -355474 84594
18016a79951n0126f5760j40592B08547k2065q7256A6106a29397o4145P8949j49299
$$ -179951 -230077 -65760 -206352 208547 186482 99226 16106 -129397 -193542 -114593 -263892
18005b63892M628A10544a67298c3234q9042M8699G1025P8930e192E9362a3190
$$ -263892 -259264 110544 -167298 -33234 -122276 -73577 71025 149955 -5192 59362 -13190
17993a58494j15394A47694J24102r0023l1111a93164O1987G1313E168d25974a31071
$$ -158494 -273888 147694 271796 181773 150662 -193164 -131177 71313 5168 -425974 -131071
17981b68815A16679b89346c1691l48483A41583f3130E0346C450c18538A23693
$$ -268815 116679 -289346 -31691 -380174 141583 -63130 50346 3450 -318538 123693
17970B01014G1386c2274m9530G6828c0848q6628a671G4965b17581O5726H7079
$$ 201014 71386 -32274 -81804 76828 -30848 -117476 -1671 74965 -217581 -151855 87079
17958B73408a28893l1390F7464b02508g3134b8077j0727k37668L8277H5973b93352
$$ 273408 -128893 -160283 67464 -202508 -73134 -28077 -38804 -276472 -238195 85973 -293352
17946A08457A4976e3740A3073a70139b5377O373o9838E92277f6881B68203A9117
$$ 108457 14976 -53740 13073 -170139 -25377 -19004 -88842 592277 -66881 268203 19117
17934i3534K5197A48072D2654L8010b10874i6511G219N2369Q7877f0302E9973
$$ -93534 -68337 148072 42654 80664 -210874 -96511 7219 59588 147465 -60302 59973
17922a02946A04406C9193M748J14593j9708P7135F6160K0693O8604f4509J4532
$$ -102946 104406 39193 43941 158534 138826 215961 66160 86853 155457 -64509 -49977
17911d9977E4368a66948A43383a42567K5386K8407b5400l023C1204b08702C16943
$$ -49977 54368 -166948 143383 -142567 -117181 -88774 -25400 -28423 31204 -208702 316943
17899A14728c44196B5227K2301g532A29105c73913a37439N4870j97779B25147
$$ 114728 -344196 25227 47528 -7532 129105 -373913 -137439 -82569 -280348 225147
17888b17057C2274L62184A80096p4437K70925B0804a85695M3767L9248a0001n17
$$ -217057 32274 394458 180096 105659 376584 20804 -185695 -141928 -102680 -10001 -10518
17877a0518D90662B07069c7586m349p5484J5268A922K9335c12393j14121b03241
$$ -10518 490662 207069 -37586 -41935 -117419 -102151 1922 31257 -312393 -426514 -203241
17865f3181A43588b22094B28772D3605J08562J77333H4058L9978c86604A02534
$$ -63181 143588 -222094 228772 43605 152167 329500 84058 124036 -386604 102534
17854c61714A57619c29975A37532a00838A9214a9131m8820j1183F2813J74012
$$ -361714 157619 -329975 137532 -100838 19214 -19131 -67951 -79134 62813 236825
17844B36825m6251K9393a91643m8972b5652o4244j39260e3461E6824J6400L46032
$$ 236825 190574 219967 -191643 -240615 -25652 -89896 -229156 -53461 56824 73224 419256
17833D19256d3214A6881b60491c4128l10693F6930J00529B8209b38381R841A8247
$$ 419256 -43214 16881 -260491 -34128 -344821 66930 167459 28209 -238381 -228540 18247
17821F7885b0638o9468H5599J4001i7763A02192J12359C2073J42968F8326l0325
$$ 67885 -20638 -90106 85599 99600 -97763 102192 214551 32073 175041 68326 38001
17810C8001b07643c1358j76360E4511N1271a20520p8457L1309k30523E0053a31707
$$ 38001 -207643 -31358 -207718 54511 105782 -120520 -198977 -167668 -398191 50053 -131707
17798b91094a9589l56512a30243B8179e7073a9222j44113k09886i8533D1122a63499
$$ -291094 -19589 -376101 -130243 28179 -57073 -19222 -163335 -373221 -98533 41122 -163499
17786G9156K23625b31030J03717D7283b43938A43029d1263l3587j70345E4778
$$ 79156 302781 -231030 -127313 47283 -243938 143029 -41263 -74850 -245195 54778
17775A29541D0441K30090q8957a26269B54100d834j94600A40268B3100b5631k54630
$$ 129541 40441 270531 181574 -126269 254100 -4834 -199434 140268 23100 -25631 -280261
17764b80261a00135E56205d488n8979B41779a02263K7361k14339e0925r7371j2035
$$ -280261 -100135 556205 -4488 -63467 241779 -102263 -74902 -289241 -50925 -148296 -160331
17753a60331r1058a22063D13170b84965f0770a2730B23498c52658A03169a40316
$$ -160331 -251389 -122063 413170 -284965 -60770 -12730 223498 -352658 103169 -140316
17742a47940j74127C937a47907j42722B56092e1581A71410C1845i4741A81192
$$ -147940 -322067 3937 -147907 -290629 256092 -51581 171410 31845 -94741 181192
17731a68591I390K89986j16794n9766J3229k8514J07170i1590P363n9160B81221
$$ -168591 9390 299376 182582 122816 136045 107531 214701 -91590 -84227 -143387 281221
17719a19770D41779b37985E9094a1519H9410J35480a14951j54178A88165A3734
$$ -119770 441779 -237985 59094 -11519 89410 224890 -114951 -269129 188165 13734
17708B71912f5545B58549a53189O7012j0793l98226a34842a2414j67257M4229
$$ 271912 -65545 258549 -153189 -86177 -96970 -495196 -134842 -12414 -179671 -135442
17698a35442A35833E342d8174m4671D20030a61641m6829k7476a06916K5948C14
$$ -135442 135833 5342 -48174 -92845 420030 -161641 -208470 -235946 -106916 -80968 314
17686A20732O310J83855a18241f804j21097c0431B45402H6760a1784j67173A23583
$$ 120732 127042 310897 -118241 -6804 -127901 -30431 245402 86760 -11784 -178957 123583
17674H0385j4488J33232a83222o4054R4054A08999J21567h3987A53437g288F8731
$$ 80385 65897 199129 -183222 -247276 -153222 108999 230566 -83987 153437 -7288 68731
17662d5586B08617f9101p2548K6800L8510A90383C3756Q6346P5526q3448C8878
$$ -45586 208617 -69101 -141649 -114849 -76339 190383 33756 120102 195628 112180 38878
17650a22904e2599K4506G6247f2469A81703m8709j9342m1350b5886B71615A16222
$$ -122904 -52599 -28093 76247 -62469 181703 132994 113652 72302 -25886 271615 116222
17638B55654b23693B2768J36108d5976J4421A90934a19061a4262q1514A71124
$$ 255654 -223693 22768 158876 -45976 -31555 190934 -119061 -14262 -95776 171124
17627a17657r8364A16639a02353m2554c708C4880a1737A66195J53535a56249A36214
$$ -117657 -216021 116639 -102353 -144907 -3708 34880 -11737 166195 319730 -156249 136214
17615c59490J57183b4547J0962A17581d5594A21110E9529J6811c05311C0306K88015
$$ -359490 -202307 -24547 -13585 117581 -45594 121110 59529 76340 -305311 30306 318321
17604C18321I8965A4818J63713k8100c4140k40111A42174C5841L1329a22540C18721
$$ 318321 98965 14818 178531 150431 -34140 -274251 142174 35841 67170 -122540 318721
17592B40382l7208a69077g477p1197m8403A69076b28901B92399a63923A82475
$$ 240382 203174 -169077 -7477 -78674 -127077 169076 -228901 292399 -163923 182475
17581E0717a82459g0964B78315r487E6105d7786m6910D9520J55605a84137f4483
$$ 50717 -182459 -70964 278315 268828 56105 -47786 -94696 49520 205125 -184137 -64483
17569F3272f1282n972j52610f9014B58651a34941j75335E8058b13617N6972j07258
$$ 63272 -61282 -67254 -219864 -69014 258651 -134941 -310276 58058 -213617 -156645 -263903
17558b63903j70229a14588a2167m2757k5395q2026N5267A16267c755q5987E8325
$$ -263903 -434132 -114588 -12167 -54924 -80319 -162345 -107078 116267 -3755 -89742 58325
17546D09630A16680n7187J90929D0164O8557c50189b2931Q161C9869f4093J9973
$$ 409630 116680 59493 250422 40164 108721 -350189 -22931 -14770 39869 -64093 -44120
17535d4120D3808O2978L92522B10050a73528h4233j55867N6712f4420A13147L5443
$$ -44120 43808 106786 499308 210050 -173528 -84233 -240100 -183388 -64420 113147 148590
17524A48590J89786M1694j58952n4612o6025A8816b6659A26961E3573a93214J4574
$$ 148590 338376 380070 221118 166506 100481 18816 -26659 126961 53573 -193214 -178640
17513a78640h7699j0064D46817D3371K08762i3300G9065K35462A6040K23633A8366
$$ -178640 -87699 -97763 446817 43371 252133 -93300 79065 314527 16040 239673 18366
17501A55722C7343J45744J70309A42201J12368K08301j82062a40312A14230l5731
$$ 155722 37343 183087 353396 142201 254569 462870 280808 -140312 114230 78499
17491G8499K02666b60124I9L3178J58061h9926j23192B55534q2031D3661J77287
$$ 78499 281165 -260124 99 33277 191338 -89926 -213118 255534 173503 43661 220948
17480B20948p5014b73740I8324K26271A5900K41394K68625A25912n8068J77261
$$ 220948 145934 -273740 98324 324595 15900 257294 525919 125912 67844 245105
17470B45105D0374J10710l2399K57790A07698b08003B63706q7227f4091B3843
$$ 245105 40374 151084 118685 376475 107698 -208003 263706 176479 -64091 23843
17459A24448M9439a64446A00202J70711b8740A53040J07692L53364j45771j87013
$$ 124448 173887 -164446 100202 270913 -28740 153040 260732 614096 468325 281312
17449B81312j29981c0713B11470p172n0824N400K51970I7012I964J32048Q1139
$$ 281312 151331 -30713 211470 204298 153474 158874 410844 97012 9964 142012 223151
17438B23151J13799o7229J23544A0696L79544I8137K65030b9626j69347B46054
$$ 223151 336950 269721 393265 10696 390240 98137 363167 -29626 -198973 246054
17427b0541E61008B7384J09373L97262b40513B94954J92157J26039r3336J00307
$$ -20541 561008 27384 136757 534019 -240513 294954 487111 613150 519814 620121
17417F20121B12060L81644i6570C06546j9057n1862M5818A05789M505J34223O4736
$$ 620121 212060 593704 -96570 306546 287489 235627 281445 105789 110294 244517 309253
17406C09253G7855a62658B80275a12317A46092f1361H7140J26362p2972J31824
$$ 309253 77855 -162658 280275 -112317 146092 -61361 87140 213502 140530 272354
17396B72354c6760A26795n2589L37275j53872G5656L05665H2363g8228I1239K3208
$$ 272354 -36760 126795 74206 411481 257609 75656 381321 82363 -78228 91239 114447
17385A14447C6737L1320l1390j2841K87436m8374c39297J64629E3011j0105i899
$$ 114447 36737 68057 36667 23826 311262 262888 -339297 -174668 53011 42906 -9899
17373A76921m0068j4217J75163r6607Q6188l3205L08087k10327j27179J090H4167
$$ 176921 136853 122636 297799 201192 287380 254175 562262 351935 224756 225846 84167
17361a2976C20824A31237H049K76407a71470f8554j29981A06708a60519E0650
$$ -12976 320824 131237 8049 284456 -171470 -68554 -198535 106708 -160519 50650
17350A70771C7389L4924h3872C27750j8329j36778r571m4364K08505A41975q262
$$ 170771 37389 72313 -83872 327750 309421 172643 163072 118708 327213 141975 133713
17339A33713C3677J38398p480O4734J12600d3704j8837C3653L72630b24774C22408
$$ 133713 33677 172075 164595 229329 341929 -43704 -62541 33653 406283 -224774 322408
17327C77724j20043J204A03562a18178H0124N41a37883C28649K9977A10295J0061
$$ 377724 257681 258885 103562 -118178 80124 80665 -137883 328649 358626 110295 120356
17316A20356a6130j96450C2207J2015N3333K05336K2185j58875L65550A63416
$$ 120356 -16130 -212580 32207 44222 97555 302891 325076 166201 531751 163416
17305B07117H0823R1787j3525d2986A39690J40302K4523H4103Q5604F3092N8701
$$ 207117 80823 172610 159085 -42986 139690 279992 304515 84103 169707 63092 121793
17294A21793J83354E448K0084K07557i342C9556J64828o9830m9703b46992C12125
$$ 121793 305147 5448 25532 233089 -9342 39556 204384 134554 84851 -246992 312125
17282A62823J93134c7184d261A09745J26917G3716J00864H5327J44451p9149F0952
$$ 162823 355957 -37184 -4261 109745 236662 73716 174580 85327 229778 150629 60952
17270E2081K31492a51253c3470B27398H5697L18455C9081c1862E90910B92494
$$ 52081 283573 -151253 -33470 227398 85697 404152 39081 -31862 590910 292494
17259b01947C21948A32284E7580L67277I8385A7194a34331D74065J4943j17019
$$ -201947 321948 132284 57580 424857 98385 17194 -134331 474065 489008 371989
17249C71989F0911J95542A18312O1330C373M36736G9749K70998N0773A82392q2111
$$ 371989 60911 256453 118312 179642 3373 440109 79749 350747 401520 182392 100281
17238A00281P2237J9994K88119B0303N6867b8431B65117e4560B07985q4414h7751
$$ 100281 172518 192512 480631 20303 77170 -28431 265117 -54560 207985 123571 -87751
17226A45038n632K19334k5084k1684j12716N4601j02062D0245J42024K56277k15835
$$ 145038 139406 358740 333656 311972 199256 253857 151795 40245 182269 438546 222711
17215B22711a79802A01699J18594J5045o8799K55335I3367K47548j22407K77113
$$ 222711 -179802 101699 220293 235338 166539 421874 93367 340915 218508 495621
17205D95621k36267o222D4140N50016j95202j00988P9472D2964M802N18252A47025
$$ 495621 259354 253132 44140 594156 398954 297966 377438 42964 47766 566018 147025
17193G228J50043K20460E1802J30617J94371o3491o9426c6807D10830H4603j1061
$$ 7228 157271 377731 51802 182419 376790 313299 243873 -36807 410830 84603 73542
17182G3542J61214a21911B10779K04577j38442L7907o7550r2272J41658j39457
$$ 73542 234756 -121911 210779 415356 276914 314821 247271 154999 296657 157200
17172A57200N3215r6310K00050K33546H1385L75483k25009Q3528a8918A95327
$$ 157200 210415 114105 314155 547701 81385 456868 231859 315387 -18918 195327
17161B80272p154o2298K761k6200R4443J6292J87081B3594L98801j93004m9878
$$ 280272 273118 210820 213581 187381 281824 298116 485197 23594 422395 229391 179513
17150A79513C8314L74234j06410n6771M0584K20950B04956J63631j16982K30589
$$ 179513 38314 412548 306138 249367 289951 510901 204956 368587 251605 482194
17140D82194j32494j22614j07770O6976L32332M5830k53959a71304B61259R5906
$$ 482194 349700 227086 119316 186292 518624 564454 310495 -171304 261259 357165
17130C57165n0754a10959G3015K00480m5739K23052j25526B5934L84383j30960
$$ 357165 306411 -110959 73015 273495 227756 450808 325282 25934 410317 279357
17120B79357O6422K3806J75817j23547j80238R3487l9951j13959K80746L13914
$$ 279357 345779 369585 545402 421855 241617 335104 295153 181194 461940 775854
17110G75854B31323L72995B74996L14449H7940L93406j59971n0967K14595J76003
$$ 775854 231323 604318 274996 589445 87940 481346 321375 270408 485003 661006
17100F61006B72262F4928n492K72341K18114k14717Q3306J48912j8270j81228
$$ 661006 272262 64928 59436 331777 549891 335174 418480 567392 549122 367894
17090C67894Q4005J4338J50061k45115p8114J75917n2414Q9162j6020J16323B33469
$$ 367894 451899 466237 616298 371183 293069 468986 416572 505734 489714 606037 233469
17078E43987B22940N13657j43812k81476p4230I0847N59355B93945L23024E6248
$$ 543987 222940 736597 592785 311309 237079 90847 650202 293945 616969 56248
17067D00599O4601O1339J52443j17648k47029J14617q5847J17782J06080k36099
$$ 400599 465200 526539 678982 561334 314305 428922 343075 460857 566937 330838
17057C30838J66658K70405j00515J0006j00237J79847l17319M67170D29225N20871
$$ 330838 497496 767901 667386 677392 577155 757002 439683 906853 429225 950096
17047I50096C86887L6330j27236L94369j88479K34731k20430J88332j03346A31285
$$ 950096 386887 423217 295981 690350 501871 736602 516172 704504 601158 131285
17036E33565J6956M10606C77329L63290j8050K59363l64067j41452N4555k0671
$$ 533565 550521 961127 377329 740619 722569 981932 617865 476413 530968 510297
17026E10297J29159J02973C70378L37272B62722M72198m4178j04674r2438P3903
$$ 510297 639456 742429 370378 707650 262722 734920 690742 586068 493630 567533
17016E67533r9474K86357l18900L28036j21216N183N1625K30019j22168k12143
$$ 567533 468059 754416 435516 763552 642336 647519 699144 929163 806995 594852
17006E94852J9059K45048k54218K45030p4782J81757j95034M0063o5405j44738
$$ 594852 613911 858959 604741 849771 774989 956746 761712 801775 736370 591632
16996E91632o9183M92284j79100J63455p9488J47506l47153K48032k79643J18154
$$ 591632 522449 1014733 835633 999088 919600 1067106 719953 967985 688342 806496
16986H06496k631K28568j68702K226K15190R6121k81350K28749J4712K1847q9386
$$ 806496 803865 1032433 863731 865957 1081147 1177268 895918 1124667 1139379 1161226 1071840
16975A071840J13355k50734j28724K87444J67818k0233m61066K80248j66646J00955
$$ 1071840 1185195 934461 805737 1093181 1260999 1240766 779700 1059948 893302 994257
16965I94257k58658M14650M2071p9570J40606J64622l73955J07612p3219j70843
$$ 994257 735599 1150249 1192320 1112750 1253356 1417978 1044023 1151635 1078416 907573
16955I07573L85261m25616J66702J81180l26793M85739n03407N69659k85043l1535
$$ 907573 1292834 867218 1033920 1215100 888307 1374046 870639 1440298 1155255 1123720
16945A123720K48779J520k19923M2012K39805j26138N325j1577j3312j3731l55396
$$ 1123720 1372499 1374019 1154096 1196108 1435913 1309775 1315100 1303523 1290211 1276480 921084
16934I21084L03697L33468l56247M79687m1515k55939K26001o02607N08323J69027
$$ 921084 1224781 1558249 1202002 1681689 1640174 1384235 1610236 1007629 1515952 1684979
16924A684979l04000J13296j66042J03019J61586l8520L21529k35060k38127L11571
$$ 1684979 1380979 1494275 1328233 1431252 1592838 1554318 1875847 1640787 1402660 1714231
16914A714231L34688m86814l6438K75178l0861J10821k19328k81260O56863j20647
$$ 1714231 2048919 1562105 1525667 1800845 1769984 1880805 1661477 1380217 2037080 1916433
16904A916433m5504J0738K25968l81493L68971k68380m4547j26371M15519k23665
$$ 1916433 1870929 1881667 2107635 1726142 2095113 1826733 1782186 1655815 2071334 1847669
16894A847669L1793J71746n9392J30380o564J07313j23088p1260O12080k59137
$$ 1847669 1879462 2051208 1991816 2122196 2115632 2222945 2099857 2028597 2640677 2381540
16884B381540j9927r3662R7542k56859J64588K23072K5131k64777L59947N1169
$$ 2381540 2361613 2267951 2365493 2108634 2273222 2496294 2521425 2256648 2616595 2667764
16874B667764j69435K86934j78717K0445Q0267J88237j36470K13138K4982j92718
$$ 2667764 2498329 2785263 2606546 2626991 2707258 2895495 2759025 2972163 2997145 2804427
16864B804427L10227J25613l74284J08679j13856K77527J4461R8715J72791j07538
$$ 2804427 3114654 3240267 2865983 2974662 2860806 3138333 3152794 3251509 3424300 3316762
16854C316762K70577j58384m1967j56428K26320K56942l14152N13503l85920O56849
$$ 3316762 3587339 3428955 3386988 3230560 3456880 3713822 3399670 3913173 3527253 4184102
16844D184102l54874K66317j83557K34600j76881M50287N8941J54728l88747K34340
$$ 4184102 3829228 4095545 3911988 4146588 3969707 4419994 4478935 4633663 4244916 4479256
16834D479256M39555o30912m7129K98485M10891j33384L87764Q5611j61282L33598
$$ 4479256 4918811 4287899 4240770 4539255 4950146 4816762 5204526 5290137 5128855 5462453
16824E462453j70736M93657O2814J80694N0495j1278j87078L76640K49843P9722
$$ 5462453 5291717 5785374 5848188 6028882 6079377 6068099 5881021 6257661 6507504 6587226
16814F587226j57590L18837L04571k89300K75722J68250K77676L63288j71721
$$ 6587226 6429636 6748473 7053044 6763744 7039466 7207716 7485392 7848680 7676959
16805G676959L13087L1414K00041M4758N88346P0079k76596Q17217L4968q6602
$$ 7676959 7990046 8021460 8221501 8266259 8854605 8924684 8648088 9465305 9500273 9413671
16795I413671J05813R00063q8502K62996k5776N04779N33348M0289L02188M63067
$$ 9413671 9519484 10419547 10331045 10594041 10568265 11073044 11606392 11646681 11948869 12411936
16785A2411936M74236K98270j64093J173292J35117M07466J80799Q68581K62717
$$ 12411936 12886172 13184442 13020349 14193641 14328758 14736224 14917023 15785604 16048321
16776A6048321O05848L08563L09112R93843L87032P06169O29160N34843R13807
$$ 16048321 16654169 16962732 17271844 18265687 18652719 19358888 19988048 20522891 21436698
16767B1436698M81610J258520P24916Q17257Q90249J052984J042587O72539J195872
$$ 21436698 21918308 23176828 23901744 24719001 25609250 26662234 27704821 28377360 29573232
16758B9573232J408051Q87931J647100J250929J567653J504317J900891J441147
$$ 29573232 30981283 31869214 33516314 34767243 36334896 37839213 39740104 41181251
16750D1181251J508643K210939J893798K331802K265502K495328K280237L141771
$$ 41181251 42689894 44900833 46794631 49126433 51391935 53887263 56167500 59309271
16742E9309271L070074K819394L496178L519061L703525L893309L837992M709570
$$ 59309271 62379345 65198739 68694917 72213978 75917503 79810812 83648804 88358374
16734H8358374M384606M849627M832555N301086N649703N250597N676005N968098
$$ 88358374 92742980 97592607 102425162 107726248 113375951 118626548 124302553 130270651
16726A30270651N357766N586784N252915N382987M499246M291193L453397L255540
$$ 130270651 135628417 141215201 146468116 151851103 156350349 160641542 164094939 167350479
16718A67350479K639733J294940M63844k45475j063092k260661k611135l426816
$$ 167350479 169990212 171285152 171748996 171503521 170440429 168179768 165568633 162141817
16710A62141817m316275m699709n183341n128170n881667n419876n693785n903654
$$ 162141817 157825542 153125833 147942492 142814322 136932655 131512779 125818994 119915340
16702A19915340n781561n516714n544083m790539n261744m450319m583437m475549
$$ 119915340 114133779 108617065 103072982 98282443 93020699 88570380 83986943 79511394
16694G9511394m152605m000444l204541l562871l214827l081946k682425k746779
$$ 79511394 75358789 71358345 68153804 64590933 61376106 58294160 55611735 52864956
16686E2864956k106866k725641k175829j989758k243955j764817j448386j744567
$$ 52864956 50758090 48032449 45856620 43866862 41622907 39858090 38409704 36665137
16678C6665137j406864j867824j386662j056792j630129r20825j191866p60951
$$ 36665137 35258273 33390449 32003787 30946995 29316866 28396041 27204175 26443224
16670B6443224o86637j540186o85039j258421l98055q21615n09369r83111l84712
$$ 26443224 25756587 24216401 23531362 22272941 21874886 21053271 20543902 19560791 19176079
16661A9176079p13532o90387o79986l10111n14916l80209q95080l34886k58130
$$ 19176079 18462547 17772160 17092174 16782063 16267147 15886938 14991858 14656972 14398842
16652A4398842o94466K02015q37678L0445m72391l88323n98209r6616n10125m08664
$$ 14398842 13704376 13906391 13068713 13099158 12626767 12238444 11640235 11543619 11033494 10624830
16642A0624830J00139m68218J31970l04792k30982m85138k06002n63933j37630
$$ 10624830 10724969 10256751 10388721 10083929 9852947 9367809 9161807 8597874 8460244
16633H460244l52505J84139L5984j81366l27825k37883l32899K58343n07137r7281
$$ 8460244 8107739 8291878 8327862 8146496 7818671 7580788 7247889 7506232 6999095 6901814
16623F901814m1240m21828K09233j72067O5015m17155n1844n9292l65906j54314
$$ 6901814 6860574 6438746 6647979 6475912 6540927 6123772 6071928 6012636 5646730 5492416
16613E492416k15720K58386K2083m97716N4020o8141l57224N9955k10966J06659
$$ 5492416 5276696 5535082 5557165 5059449 5113469 5045328 4688104 4748059 4537093 4643752
16603D643752K0593M5037n30386R9257q6571m7370J76561l62311l2526J18139
$$ 4643752 4664345 4709382 4178996 4278253 4191682 4144312 4320873 3958562 3926036 4044175
16593D044175q869n07890K69741k42693J42040k93175n0167R7597j37498J72147
$$ 4044175 4035306 3527416 3797157 3554464 3696504 3403329 3353162 3450759 3313261 3485408
16583C485408l06237J46170N6121k18481l17206J91688J99711l53894j1520J39077
$$ 3485408 3179171 3325341 3381462 3162981 2845775 3037463 3237174 2883280 2871760 3010837
16573C010837J16079n70161P2054l90705N42139k18762j32632J82514J02562p5993
$$ 3010837 3126916 2556755 2628809 2238104 2780243 2561481 2428849 2611363 2713925 2637932
16563B637932m79243K31055J3986l8242J9103J8743j71219o6542L89259l17389
$$ 2637932 2158689 2389744 2403730 2365488 2384591 2403334 2232115 2165573 2554832 2237443
16553B237443p5628j36062j13066L61534p2008j12373j29651j28051P468j15157
$$ 2237443 2161815 2025753 1912687 2274221 2202213 2089840 1960189 1832138 1839606 1724449
16543A724449K13161k00593M58968k59177K54903l21711k29463P1812J6379l60172
$$ 1724449 1937610 1737017 2195985 1936808 2191711 1870000 1640537 1712349 1728728 1368556
16533A368556K99187j42921Q0514j30248Q369J54340k32869K51763k43840M3126
$$ 1368556 1667743 1524822 1605336 1475088 1483457 1637797 1404928 1656691 1412851 1455977
16523A455977l2843l3583j27391L7354M6661L46122k76289k22754l9878K31729
$$ 1455977 1423134 1389551 1262160 1299514 1346175 1692297 1416008 1193254 1153376 1385105
16513A385105n9175j36251j10445M99235m94499K56263k99508K18501J30259n52493
$$ 1385105 1325930 1189679 1079234 1578469 1083970 1340233 1040725 1259226 1389485 836992
16503H36992K56620p8386J80768m4161O3968k3972k15482j10478L12499P6590
$$ 836992 1093612 1015226 1195994 1151833 1215801 1191829 976347 865869 1178368 1254958
16493A254958j71254J17374k13779O9842k34497J39786K04400j73090N9399j03069
$$ 1254958 1083704 1201078 987299 1057141 822644 962430 1166830 993740 1053139 950070
16483I50070k12229J14415J29267o8855L60045m05267k06883K56155J204M5302
$$ 950070 737841 852256 981523 912668 1272713 867446 660563 916718 917922 963224
16473I63224Q752l62090K24899J5615k59545K62840J63302j37134R930n5264J21502
$$ 963224 971976 609886 834785 850400 590855 853695 1016997 879863 889793 834529 956031
16462I56031k52797J64118j16792k8286M27106O429l89451B57728K18230M47380
$$ 956031 703234 867352 750560 722274 1149380 1155809 766358 257728 475958 923338
16452I23338j30754k24868j74714J48736J30263L02471l79149m6398K44357j80874
$$ 923338 792584 567716 393002 541738 672001 974472 595323 548925 793282 612408
16442F12408K01581D01778J74855P0164l03610K07365L6092M6615q4152L6716
$$ 612408 813989 401778 576633 646797 343187 550552 586644 633259 549107 585823
16432E85823j03759K37928q5261n0601j04259k18569M63212j49874B78163J10685
$$ 585823 482064 719992 634731 584130 479871 261302 724514 574640 278163 388848
16422C88848K26667K33853C71225K21054O6354N657B45262M00072R5206h952H15552
$$ 388848 615515 849368 371225 592279 658633 664290 245262 645334 740540 -8952 815552
16410A065091l62185m4592q0978B26863K24123j66944K98001J48445j62607n2209
$$ 1065091 702906 658314 577336 226863 450986 284042 582043 730488 567881 515672
16400E15672k32455L50878p4718K49851C96463M7788p910k01704M89070r6910
$$ 515672 283217 634095 559377 809228 396463 444251 436341 234637 723707 626797
16390F26797j29529F0679A691M70968J39276j45280J67895j53207j0385k20109
$$ 626797 497268 60679 1691 472659 611935 466655 634550 481343 470958 250849
16380B50849J23322K1745j23940o9j2508J53792J37707j91607m3119J0379R275
$$ 250849 374171 395916 271976 271907 259399 413191 550898 359291 316172 326551 335826
16369C35826j21508O95336l58885n1542A54609M40726k745B72121j24694J36830
$$ 335826 214318 909654 550769 499227 154609 595335 592590 272121 147427 284257
16359B84257K58975j44183R781J93394j72349p2845K71160k89647F1524N9202
$$ 284257 543232 399049 408830 602224 429875 357030 628190 338543 61524 120726
16349A20726B8405M14225L1200j82865J53288j22648l2859K44715A83518J44324
$$ 120726 28405 442630 473830 290965 444253 321605 288746 533461 183518 327842
16339C27842L8434j45346L57510B62545M02701l27766Q6159j72802o3354M1786
$$ 327842 366276 220930 578440 262545 665246 337480 423639 250837 187483 229269
16329B29269L7742n9735d8846B52441M3411A45379J70592K9868r4066j8874Q248
$$ 229269 267011 207276 -48846 252441 295852 145379 315971 345839 251773 232899 241147
16318B41147L7783I0572K15264J82589q1454A98854P2580R955J67875K3249E3235
$$ 241147 278930 90572 305836 488425 406971 198854 271434 281389 449264 472513 53235
16306G744N2757J89675A14014p221O6631J98013K621A82926K12473G1794J06313
$$ 7744 60501 250176 114014 106793 173424 371437 374058 182926 395399 71794 178107
16295A78107I653M69295r0075o6481j2476O5444A36789J0327K3552J51029d448
$$ 178107 9653 478948 388873 322392 309916 375360 136789 147116 170668 321697 -4448
16283C76549q5131a14677A75739i6096a145A560J84716C0395J43171a57112C72586
$$ 376549 291418 -114677 175739 -96096 -1145 1560 186276 30395 173566 -157112 372586
16271A269c5229H8481J63834A10211P2117J73517o7511f7554C02391A00323J21576
$$ 1269 -35229 88481 252315 110211 182328 355845 288334 -67554 302391 100323 221899
16260B21899o8984P1991I8058K86791J05217B40690k3942p5952N2035m4771E4947
$$ 221899 152915 224906 98058 384849 490066 240690 216748 140796 192831 148060 54947
16248D15565A15123a2426A57415P6988j3196B6499J54934B3623K46660K25910
$$ 415565 115123 -12426 157415 234403 221207 26499 181433 23623 270283 496193
16238D96193r826A20644E8640J0269R1620J96131b2272A79606k1612R8062h8277
$$ 496193 486367 120644 58640 68909 160529 356660 -22272 179606 157994 256056 -88277
16226B88406g7963j6847A03761g3232B12609F4672J29023M7908e4363A15324P8764
$$ 288406 -77963 -94810 103761 -73232 212609 64672 193695 241603 -54363 115324 194088
16215A94088M4157C5327L06616E7564K57302a64902E14521A85799c1552C27258
$$ 194088 238245 35327 341943 57564 314866 -164902 514521 185799 -31552 327258
16204A20127C1395J11737J26890j29448K1525a90971C70548e6401I234a23505
$$ 120127 31395 143132 270022 140574 162099 -190971 370548 -56401 9234 -123505
16193B58860m6468K67584c27969C07204b92243a45G2253c8198B04789a27592C78133
$$ 258860 212392 479976 -327969 307204 -292243 -145 72253 -38198 204789 -127592 378133
16181H1964a61745l32829C6613K51196B588e5312A53787b4820l9417B4889h8A39170
$$ 81964 -161745 -494574 36613 287809 2588 -55312 153787 -24820 -64237 24889 -88 139170
16168C49853e9789A0173K63822J23054j4756b55363b8865B6900L24457b6483p1604
$$ 349853 -59789 10173 273995 397049 382293 -255363 -28865 26900 351357 -26483 -98087
16157i8087a4928B17773m0767E4636J20633D1083Q0578a07367q4259A63582g8248
$$ -98087 -14928 217773 177006 54636 175269 41083 121661 -107367 -191626 163582 -78248
16145A02917h7559B54276A2515f521o8644m1603A59825O5089r0490g6360C19454
$$ 102917 -87559 254276 12515 -6521 -75165 -116768 159825 224914 134424 -76360 319454
16133E06368k43735A09811f5817I5430j9359K25075a74535A11770a89201C9665
$$ 506368 262633 109811 -65817 95430 76071 301146 -174535 111770 -189201 39665
16122C87119j07244b79338F5678a23267k8168B08525L6000e3265C36002e7360
$$ 387119 279875 -279338 65678 -123267 -151435 208525 244525 -53265 336002 -57360
16111b71292A72420l1897Q1764A1288J75709b63719A27142E8387b13878C3319
$$ -271292 172420 140523 222287 11288 186997 -263719 127142 58387 -213878 33319
16100B56556a43882A05952a08956N4390E4860L2282a62006A93842c7449A14321
$$ 256556 -143882 105952 -108956 -54566 54860 87142 -162006 193842 -37449 114321
16089a56480j24331D410b6803E9817B5584N3473l8981b38323C23258a01141j34642
$$ -156480 -280811 4410 -26803 59817 25584 79057 40076 -238323 323258 -101141 -235783
16078b35783B63390a64856A4338M34003a229I5339a15124c7658j56476C04393
$$ -235783 263390 -164856 14338 448341 -1229 95339 -115124 -37658 -194134 304393
16067C0106a27546A74481a13785D37421i5957D5768b10574B9259a17256M5419
$$ 30106 -127546 174481 -113785 437421 -95957 45768 -210574 29259 -117256 -71837
16057g1837A30529a32494B99968b7713B5829a37181B24280r1215g2341j78119
$$ -71837 130529 -132494 299968 -27713 25829 -137181 224280 133065 -72341 -250460
16047b50460N934g94B8117J76630a14568C4107b81823G8632b42436a06138B43248
$$ -250460 -244526 -794 28117 204747 -114568 34107 -281823 78632 -242436 -106138 243248
16035a10925A07527c20991J24344A4957a87751G4279a7969r3588K6314F7976R5695
$$ -110925 107527 -320991 -196647 14957 -187751 74279 -17969 -111557 -85243 67976 163671
16024A63671D6754B2378K29043e2459j90148O7298a3183A24869b6714j74135Q4043
$$ 163671 46754 22378 251421 -52459 -242607 -175309 -13183 124869 -26714 -200849 -116806
16013a16806m552O524j30635B04648E6515B6654a67764B4876c05288g3389F0540
$$ -116806 -121358 -114834 -245469 204648 56515 26654 -167764 24876 -305288 -73389 60540
16001c70823B0692d70429a18280A22238K33761a76148k2080A01957i3403K2495
$$ -370823 20692 -470429 -118280 122238 355999 -176148 -198228 101957 -93403 -70908
15991g0908a7142B68105p2385a51733B24728J19822j59095D0857b20226D26939
$$ -70908 -17142 268105 195720 -151733 224728 344550 185455 40857 -220226 426939
15980D56508A33320l4319J23894E6108J86274D9312a29680I4070b68874A02758
$$ 456508 133320 99001 222895 56108 242382 49312 -129680 94070 -268874 102758
15969g2000j29080L0414J0481A52432F7861a29346K8935M8740b0088k60487A91783
$$ -72000 -201080 -170666 -160185 152432 67861 -129346 -100411 -51671 -20088 -280575 191783
15957G9188c96556h5144M0807C0609c01691E8907J35510P1569p9746K29868F3142
$$ 79188 -396556 -85144 -44337 30609 -301691 58907 194417 265986 186240 416108 63142
15945a48572b1417A44752d9279r4349j02265L1483d417k48731A74503c84056B3650
$$ -148572 -21417 144752 -49279 -143628 -245893 -214410 -4417 -253148 174503 -384056 23650
15933i1354B44944a46850c2429A07743a91712A82029h3531C11655l6878b74298
$$ -91354 244944 -146850 -32429 107743 -191712 182029 -83531 311655 274777 -274298
15922b42925D1989b86019B66274L3594m7310F821a5292r5100b6227k28769A11147
$$ -242925 41989 -286019 266274 299868 252558 6821 -15292 -110392 -26227 -254996 111147
15910e5712N525j31929B26458A09682d2557J2648H6558b47884A85837i8060L5750
$$ -55712 -50187 -182116 226458 109682 -42557 -29909 86558 -247884 185837 -98060 -62310
15899f2310j26297P2187E9950J09985G5032a14399F587K7794e13608K29908G5208
$$ -62310 -188607 -116420 59950 169935 75032 -114399 6587 34381 -513608 -283700 75208
15887C76161a25040G3492A4287J48384L9920c1617n2210j93785B67733c58827
$$ 376161 -125040 73492 14287 162671 202591 -31617 -83827 -277612 267733 -358827
15876a9029k2763k20370B81365a67642A26333C1335b37746A70646k9397i654k36474
$$ -19029 -41792 -262162 281365 -167642 126333 31335 -237746 170646 141249 -9654 -246128
15865b46128j5991h3006j03643c2791B433c67583a81237f7460A91359d81720B29695
$$ -246128 -262119 -83006 -186649 -32791 2433 -367583 -181237 -67460 191359 -481720 229695
15853I190b544l5504C07920A36256c32999a33527c4415A58448C8171b30485A05495
$$ 9190 -2544 -38048 307920 136256 -332999 -133527 -34415 158448 38171 -230485 105495
15841A15152A9091O4522a20803j42923b345p788C88873b9764a401A60611a06204
$$ 115152 19091 83613 -120803 -263726 -2345 -10133 388873 -29764 -1401 160611 -106204
15829a08619j89171P8441e414B06a77004k56502I5452a04402a9902C2003K1324
$$ -108619 -297790 -219349 -5414 206 -177004 -433506 95452 -104402 -19902 32003 53327
15818E3327Q3296b80800n1824b3459j66923C07033h4082d0342j80301c2108k55022
$$ 53327 136623 -280800 -332624 -23459 -190382 307033 -84082 -40342 -220643 -32108 -287130
15807b87130a7794A45695k0377a76869D40374e7947B3058K60856A14691d07947
$$ -287130 -17794 145695 125318 -176869 440374 -57947 23058 283914 114691 -407947
15796a50961A28572J118h4602o185j28345N792I0279a61173p4388A81079B2762
$$ -150961 128572 129690 -84602 -90787 -219132 -213340 90279 -161173 -235561 181079 22762
15784a62339N071O7859M0819D8420A1197L21493b12365A06265K9605i0697p4733
$$ -162339 -157268 -89409 -48590 48420 11197 332690 -212365 106265 135870 -90697 -165430
15773a65430C04615j30593a02500j10149K3650d0913P752l14467a60281E4122
$$ -165430 304615 174022 -102500 -212649 -188999 -40913 -33161 -347628 -160281 54122
15762b25947E5266P8353J26749A07338B1950h5839C40895a37702L2144B09728
$$ -225947 55266 133619 260368 107338 21950 -85839 340895 -137702 -105558 209728
15751C2378N21653A62478i3498F211i3705F8420a33035p6944A66090Q5456K0910
$$ 32378 554031 162478 -93498 6211 -93705 68420 -133035 -209979 166090 251546 272456
15740B72456d723A09664d7321A4596i2772B9705a33254j66571c9900k00227a13249
$$ 272456 -4723 109664 -47321 14596 -92772 29705 -133254 -299825 -39900 -240127 -113249
15728d2042g852A36573J01417C338J03214a88877A20463a13660E6734c11859a23979
$$ -42042 -7852 136573 237990 3338 106552 -188877 120463 -113660 56734 -311859 -123979
15716g4073A71625a29794K5524M0923H037c4627j13567C94461A13907c10102G9752
$$ -74073 171625 -129794 -104270 -63347 8037 -34627 -148194 394461 113907 -310102 79752
15704B1589d0173B60401A3275C690P0962c00803B03275b30801a0717G5048K00531
$$ 21589 -40173 260401 13275 3690 74652 -300803 203275 -230801 -10717 75048 275579
15693B75579o3992q4313m9834e244A23722a31940k8561C43511a98133K3048C09770
$$ 275579 211587 127274 77440 -5244 123722 -131940 -160501 343511 -198133 -175085 309770
15681f8702o5671j79737A57365c77136C8234b04836B7955d01840D3295L418K33696
$$ -68702 -134373 -314110 157365 -377136 38234 -204836 27955 -401840 43295 46713 280409
15670B80409N7892A07118b8356B72O786a94381Q2628o1004g8282A73085M6353
$$ 280409 338301 107118 -28356 272 7058 -194381 -111753 -172757 -78282 173085 219438
15659B19438b72402A50734D4845f030A38593B5707M7262e9768I8433P881a68502
$$ 219438 -272402 150734 44845 -6030 138593 25707 72969 -59768 98433 106314 -168502
15647a60997b6376d883A0678M720N4496P2711N497c2295I8147b88371C7819i5546
$$ -160997 -26376 -4883 10678 15398 69894 142605 148102 -32295 98147 -288371 37819 -95546
15634C06015j47144l1183D275i8432k8009e6898B07010n9077a50322M7207A35080
$$ 306015 158871 127688 4275 -98432 -126441 -56898 207010 147933 -150322 -103115 135080
15622I6871l0922A6653K17369f7915F9330d38673a93434c3648A99146e7901H086
$$ 96871 65949 16653 234022 -67915 69330 -438673 -193434 -33648 199146 -57901 8086
15610G2473c07604B71227o6034a3714j20593c6878k98432a56711e8892A06455
$$ 72473 -307604 271227 205193 -13714 -134307 -36878 -335310 -156711 -58892 106455
15599A76283d61855D2759K37677E195a77624j35200M7033k95604g571o0397M236
$$ 176283 -461855 42759 280436 5195 -177624 -312824 -265791 -561395 -7571 -67968 -63732
15588f3732B28030H7417N3312e5823G6834R4305C6369a3351B88766a51014A7447
$$ -63732 228030 87417 140729 -55823 76834 171139 36369 -13351 288766 -151014 17447
15576a93227L1786E7831e3306n9483A73899a880B2745J6467b192j11720q4047
$$ -193227 -161441 57831 -53306 -112789 173899 -1880 22745 39212 -2192 -113912 -197959
15565a97959L2932A09400D8955L1633L4607L3067o9226b33604B1632Q0962a58420
$$ -197959 -165027 109400 48955 80588 115195 148262 79036 -233604 21632 102594 -158420
15553b32300e7431k41662c1057k41267A2316c44957c1629l31148o9172g2890A20521
$$ -232300 -57431 -299093 -31057 -272324 12316 -344957 -31629 -362777 -431949 -72890 120521
15541b25437B01981q1932L4833C6605f5616A76422i288j68624d2298A02370K48005
$$ -225437 201981 120049 154882 36605 -65616 176422 -9288 -177912 -42298 102370 350375
15530C50375d680q2909A10405b87012B97054H0460L56168A02601a84625R0008
$$ 350375 -4680 -87589 110405 -287012 297054 80460 436628 102601 -184625 -94617
15520i4617A128a02118o0069B55585a24447L6471q7258J8912j77490g6411a9707
$$ -94617 1128 -102118 -162187 255585 -124447 -87976 -175234 -156322 -333812 -76411 -19707
15508a20957d1006j18968C496c4904E956L9719d30930B56782a83790b2246d867
$$ -120957 -41006 -159974 3496 -34904 5956 45675 -430930 256782 -183790 -22246 -4867
15496b08616E8466J19023b21297l2485a10590j6664d2342B54799a185k26208c8296
$$ -208616 58466 177489 -221297 -253782 -110590 -127254 -42342 254799 -1185 -227393 -38296
15484a49697l3677A85367M7822J38784a00978I8511J87478A0245M3387N2209a13344
$$ -149697 -183374 185367 233189 371973 -100978 98511 285989 10245 53632 105841 -113344
15472D7171f1431B11613h1828Q62B34009J96800j40780K20304f4528B23224a21805
$$ 47171 -61431 211613 -81828 -80966 234009 430809 290029 510333 -64528 223224 -121805
15460a29320K5401I0759J8700N0497D9744b37203D1878a30960A05963l7729J91969
$$ -129320 -103919 90759 109459 159956 49744 -237203 41878 -130960 105963 68234 260203
15449B60203k7834j04671O7663a35305j32841e1738m4941q1848G490b52654j6181
$$ 260203 232369 127698 195361 -135305 -268146 -51738 -96679 -178527 7490 -252654 -268835
15438b68835J27215B36123a1901n7848k37051A86537i0891r9679J789c0778E3503
$$ -268835 -141620 236123 -11901 -69749 -306800 186537 -90891 -190570 -188781 -30778 53503
15426A28878a77780j21446Q5703D0185a57228j41501D5649a94168F7490A8915
$$ 128878 -177780 -299226 -213523 40185 -157228 -298729 45649 -194168 67490 18915
15415F5756O7853b02871P5222b740C6391J35805B6308J31396C3186J48564n7483
$$ 65756 133609 -202871 -127649 -2740 36391 172196 26308 157704 33186 181750 124267
15404A24267h9294I3930a4257k8859A07041c04017J09484o1410m6022D5142J89874
$$ 124267 -89294 93930 -14257 -43116 107041 -304017 -194533 -255943 -301965 45142 235016
15393B35016J66163i3183d5072I0662J10828j8655B2816M06512i0073b9888C1574
$$ 235016 401179 -93183 -45072 90662 201490 182835 22816 429328 -90073 -29888 31574
15381A4473R7452J33467a37692O3937j13557f5343k44362n8335A68912c4200j3372
$$ 14473 111925 245392 -137692 -73755 -187312 -65343 -309705 -368040 168912 -34200 -47572
15370d7572C39496C6570J7737j7541b5023A18788K2220a28216B10234D3491M61275
$$ -47572 339496 36570 54307 36766 -25023 118788 141008 -128216 210234 43491 504766
15359E04766I2195a31835j06169n3962A06064a53702e3326H3397J59126a4273
$$ 504766 92195 -131835 -238004 -291966 106064 -153702 -53326 83397 242523 -14273
15348B2065b65466D7262b3378m3718j03066I0519a21752G3062j2165J18059K25500
$$ 22065 -265466 47262 -23378 -67096 -170162 90519 -121752 73062 60897 178956 404456
15337D04456F2832p693a49029B16522a84631A30403a06840a0325A41774a61154
$$ 404456 62832 55139 -149029 216522 -184631 130403 -106840 -10325 141774 -161154
15326f0933A27868b9391H5083M6507c79033B25628L5131a99842b0868n9246B17124
$$ -60933 127868 -29391 85083 131590 -379033 225628 260759 -199842 -20868 -80114 217124
15314a28489N1372k96862B45027b3477B00616a50046B85711A38225A1973M82543
$$ -128489 -77117 -373979 245027 -23477 200616 -150046 285711 138225 11973 494516
15304D94516k10608n8809b05928g4919B1669K51186j23098A8373K18025g9225
$$ 494516 283908 225099 -205928 -74919 21669 272855 149757 18373 236398 -79225
15293c15006B0400J7850c9744D8839N5498C7010N1149b9745B245R0687k4128K1292
$$ -315006 20400 38250 -39744 48839 104337 37010 88159 -29745 2245 92932 68804 90096
15281I0096a8025j32689A24656a77289C07263C3617J08376a83997b4591A11078
$$ 90096 -18025 -150714 124656 -177289 307263 33617 141993 -183997 -24591 111078
15270I9908J445G28f3550C9007J0005O7254a87221A15982i857A87752q5854J8971
$$ 99908 101353 728 -63550 39007 49012 116266 -187221 115982 -9857 187752 101898 120869
15258A20869n1580a40097C65780A18181l533N388J10973j2372J77390R42746R142
$$ 120869 69289 -140097 365780 118181 114648 120036 231009 218637 396027 1338773 1347915
15247A347915j01712L4984n57010H0307J94801H4426c5555A82531a52724D82887
$$ 1347915 1246203 1281187 724177 80307 275108 84426 -35555 182531 -152724 482887
15236a6449j87346B02662G0515J14296c05922A43811D7519f6703B18942K7597
$$ -16449 -203795 202662 70515 184811 -305922 143811 47519 -66703 218942 246539
15226B46539m3537b29504A29835d8990A02072k383K614a90873A73792a2508F797
$$ 246539 203002 -229504 129835 -48990 102072 99689 102303 -190873 173792 -12508 6797
15214A32492a27911E1362K72277B8373P3525b96014A89785b26224A46636J34904
$$ 132492 -127911 51362 323639 28373 101898 -296014 189785 -226224 146636 281540
15204B81540g2627m774B3648K59577a66732C72209R133a40619A38690D6765g2639
$$ 281540 -72627 -77401 23648 283225 -166732 372209 381342 -140619 138690 46765 -72639
15192f6079a8458B94265a45395C9794c13405C34936j24388a48164A28461O0716
$$ -66079 -18458 294265 -145395 39794 -313405 334936 210548 -148164 128461 189177
15182A89177L6938f0620l5161A9895J86927M9912d23140C5820d4456J1648o6179
$$ 189177 226115 -60620 -95781 19895 206822 256734 -423140 35820 -44456 -32808 -98987
15171i8987C33275j36883a27367E045K66118b30309N1476A68960M4325I0261b55057
$$ -98987 333275 196392 -127367 5045 271163 -230309 -178833 168960 213285 90261 -255057
15159a60595G8662O0056a90313D9532R446d2384B4641P6813P0594n2592J67572
$$ -160595 78662 138718 -190313 49532 58978 -42384 24641 101454 172048 119456 287028
15148B87028c58470A99116n6827b50834B90075A15347J51528n4877J81950j29301
$$ 287028 -358470 199116 142289 -250834 290075 115347 266875 211998 393948 264647
15138B64647M790a22882j8198D4284N3865J56559j04652J11889m8084a2469A00628
$$ 264647 269437 -122882 -141080 44284 98149 254708 150056 261945 213861 -12469 100628
15126A37449b856j18607I3117L93541j61115A40107L29206c0320r6238p9511A80835
$$ 137449 -2856 -121463 93117 486658 325543 140107 469313 -30320 -126558 -206069 180835
15114C42000I0078B8816J16795b49249g956B29075k0497K29130A53954L43682
$$ 342000 90078 28816 145611 -249249 -7956 229075 208578 437708 153954 497636
15104D97636a37888A90743q760P6001o1082a40478A48380K5521R948a17650H9042
$$ 497636 -137888 190743 181983 257984 196902 -140478 148380 173901 183849 -117650 89042
15092A36259a4760B63387F2734L99324a3641o8537A28882J01424L7264K3548i0565
$$ 136259 -14760 263387 62734 462058 -13641 -82178 128882 230306 267570 291118 -90565
15080D4606K67417E4373d153o3980m3042B27441d4799B87701O0932H351J81963
$$ 44606 312023 54373 -4153 -68133 -111175 227441 -44799 287701 348633 8351 190314
15069A90314a68035k7302A79151F1307a17323I0053A5396K34081K94979A42025
$$ 190314 -168035 -195337 179151 61307 -117323 90053 15396 249477 544456 142025
15058a99890C91116J62022A74837k9097E2645A4776M12497d315n7813J6861F1382
$$ -199890 391116 553138 174837 145740 52645 14776 427273 -4315 -62128 -45267 61382
15046B60739L3902q2146K5524p7975E2961J44835R9182b9467B21814A06601A2783
$$ 260739 294641 212495 238019 160044 52961 197796 296978 -29467 221814 106601 12783
15034C93788j80881K9276H7947J2846K64188k8569q1736A21325d1780B35226A11391
$$ 393788 212907 242183 87947 100793 364981 336412 254676 121325 -41780 235226 111391
15022A03566K15481A03705L5758J59887A09566r900i457C56686j45413H6776J91890
$$ 103566 319047 103705 139463 299350 109566 99666 -9457 356686 211273 86776 278666
15011B78666k0776m3004Q493f4518A7990J59676o3665J60121A19002b4676B83199
$$ 278666 257890 214886 223379 -64518 17990 177666 114001 274122 119002 -24676 283199
14999A6233c5912A07689K71385c2701A83823R1045k0459L9L14827k77012J98183
$$ 16233 -35912 107689 379074 -32701 183823 274868 254409 254448 569275 292263 490446
14988D90446B23044p4878J37120g4530A28875L64289B26040L04163l4030j22976
$$ 490446 223044 148166 285286 -74530 128875 493164 226040 530203 496173 373197
14978C73197i3066H2032a06384b2453C30670J54100k20009q8884P3244J33037
$$ 373197 -93066 82032 -106384 -22453 330670 484770 264761 175877 249121 382158
14968C82158A05394M4415O1355K2511E9966L17212j53401A06244K32888A28760
$$ 382158 105394 149809 211164 233675 59966 377178 223777 106244 339132 128760
14957B97346j27078J00580f1458k5099B45106j03106N2028l2493K38116j51033
$$ 297346 170268 270848 -61458 -86557 245106 142000 194028 161535 399651 248618
14947B48618q263I1914K27260q7292J5738J85562A28438K24517C4451J69238K24072
$$ 248618 240355 91914 319174 231882 247620 433182 128438 352955 34451 203689 427761
14936D27761j85157k2330F3904K34854n0896J32458F9916a25323C00091P8233
$$ 427761 242604 220274 63904 298758 247862 380320 69916 -125323 300091 378324
14926C78324A15685L13681j03747Q9307n9836J1729b8073C94779L1087A88493
$$ 378324 115685 429366 325619 414926 355090 366819 -28073 394779 425866 188493
14915B99426H374J91088G4677K35129j12552K28342j73417J05973j6269C2204
$$ 299426 8374 199462 74677 309806 197254 425596 252179 358152 341883 32204
14904D7978J26439K98333A75440o2644J33606A04456M33689k18196J11257j08179
$$ 47978 174417 472750 175440 112796 246402 104456 538145 319949 431206 323027
14894C23027L18420Q0533A86115n5549L56129B09244J14871K66356B45215J13434
$$ 323027 641447 721980 186115 130566 486695 209244 324115 590471 245215 358649
14884C58649J73953p5181j5452j1987f0633C35541k9j2912F7892J18003L44459
$$ 358649 532602 457421 441969 429982 -60633 335541 335512 322600 67892 185895 530354
14873E30354B34506J66527c1613C82734j02549J35959N55543B35319p043K32183
$$ 530354 234506 401033 -31613 382734 280185 416144 971687 235319 228276 460459
14863D60459j75025p4367K0696a52550A02482K32256j13004l6724L51863j01855
$$ 460459 285434 211067 231763 -152550 102482 334738 221734 185010 536873 435018
14853D35018F131M24401L40792j37883j24504j40680J08504F8584J69487K56761
$$ 435018 6131 430532 771324 633441 508937 368257 476761 68584 238071 494832
14843D94832N7612j42349j61126R8512q9500A7152L0341L46282G9870N21578j17895
$$ 494832 552444 410095 248969 347481 257981 17152 47493 393775 79870 601448 483553
14832D83553K09131B32284K69530a8881C25037p2805K10465J3669j18365M126
$$ 483553 692684 232284 501814 -18881 325037 252232 462697 476366 358001 362127
14822C62127k5444K11590O2815q0261q8471J59511B29220N5138N27474A60021
$$ 362127 336683 548273 611088 530827 442356 601867 229220 284358 811832 160021
14811F89138I2186K60821J84838j09278q8554L15K91907j13657A49773L32358
$$ 689138 92186 353007 537845 428567 340013 340328 632235 518578 149773 482131
14801D82131k301K11771j71397k6428R7578j01833j22416J29912q5634j72747
$$ 482131 479830 691601 520204 493776 591354 489521 367105 497017 411383 238636
14791B38636J68557N3302K48177j84033n9356J07145m5648R4663j94193n5610
$$ 238636 407193 460495 708672 524639 465283 572428 526780 621443 427250 371640
14781C71640J12921j48004J65537o4100L37186j11071p0754K5499O4151k78044
$$ 371640 484561 336557 502094 437994 775180 664109 593355 618854 683005 404961
14771D04961J00361M59187l58649B44376L68445j96508R5269J54011j78877L56345
$$ 404961 505322 964509 605860 244376 612821 416313 511582 665593 486716 843061
14761H43061k29207r737j79895j59111M71126C37557A02277N77811K65317j26886
$$ 843061 613854 604117 424222 265111 736237 337557 102277 680088 945405 818519
14751H18519k23415j85159N3554J54501K45333m06377K45446K28876D41278M21354
$$ 818519 595104 409945 463499 618000 863333 456956 702402 931278 441278 862632
14741H62632m3661o9718l0926N7030j17385L51888m63624J14662j26891J54901
$$ 862632 818971 749253 718327 775357 657972 1009860 546236 660898 534007 688908
14731F88908L717j35688L2225P5608J70739J23637k25184r6913k90782O68742
$$ 688908 692625 556937 589162 664770 835509 959146 733962 637049 346267 1015009
14721A015009D79072J52490J65409K2763l22901N41542k66973P7076j58569J90286
$$ 1015009 479072 631562 796971 819734 496833 1038375 771402 848478 689909 880195
14711H80195j81143L03916D75087M90240m70736M63053j95779k16071K19180o4669
$$ 880195 699052 1002968 475087 965327 494591 957644 761865 545794 764974 700305
14701G00305L7378j15290J17581n5364J14556n1275N35636l79566Q7523l20212
$$ 700305 737683 622393 739974 684610 799166 747891 1283527 903961 991484 671272
14691F71272J55624L0181j80256J46764K07100j47631p1067j94324M49525l35607
$$ 671272 826896 857077 676821 823585 1030685 883054 811987 617663 1067188 731581
14681G31581L18954n9763J6755J08126l28542J26396J0023k73683M70962K0915
$$ 731581 1050535 990772 1007527 1115653 787111 913507 923530 649847 1120809 1141724
14671A141724l03013K31718j70831L48006n46488O61852l69132j32023K95479
$$ 1141724 838711 1070429 899598 1247604 701116 1362968 993836 861813 1157292
14662A157292P4673k032j08066l03845M5742K21120M32723o42845n1588M40219
$$ 1157292 1231965 1229933 1121867 818022 863764 1084884 1517607 874762 823174 1263393
14652A263393k20110K7038J69899K09351k28535k77595J38993l05990M32125j10532
$$ 1263393 1043283 1070321 1240220 1449571 1221036 943441 1082434 776444 1208569 1098037
14642A098037P2094m27475J22427J07783m1194J13898K38264J96836j00653k5943
$$ 1098037 1170131 742656 865083 972866 931672 1045570 1283834 1480670 1380017 1354074
14632A354074m50783L15952K24905P6347j71707l45676K65078m6584k5828o9880
$$ 1354074 903291 1219243 1444148 1520495 1348788 1003112 1268190 1221606 1195778 1125898
14622A125898L30104j42595j26633L46967l50454N61247n29223n9135L31670k05214
$$ 1125898 1456002 1313407 1186774 1533741 1183287 1744534 1215311 1156176 1487846 1282632
14612A282632Q7575J64040J45971l68580J00282j96648L18535J28065l4094N8501
$$ 1282632 1370207 1534247 1680218 1311638 1411920 1215272 1533807 1661872 1627778 1686279
14602A686279l01572N9704L8670N2416J3799K3123K71086K8215o02304L43312
$$ 1686279 1384707 1444411 1483081 1535497 1549296 1572419 1843505 1871720 1269416 1612728
14592A612728p5913J96769N84940m48959k50790J84427j99769J8878M08448k18661
$$ 1612728 1536815 1733584 2318524 1869565 1618775 1803202 1603433 1622311 2030759 1812098
14582A812098L30897o8805l39703J27619J7170Q1452J79722j28210j59450J51264
$$ 1812098 2142995 2074190 1734487 1862106 1879276 1960728 2140450 2012240 1852790 2004054
14572B004054R3845O8003K74292j88586r3932K04635k03551K08232K22480l75311
$$ 2004054 2097899 2165902 2440194 2251608 2157676 2362311 2158760 2366992 2589472 2214161
14562B214161M7854L11886N799P8850J18985j4168M00249J31699L08914m4182
$$ 2214161 2262015 2573901 2579700 2658550 2777535 2763367 3163616 3295315 3604229 3560047
14552C560047Q18235N97791J203927K011692N379599R370705J7133461K253199
$$ 3560047 4378282 4976073 6180000 8191692 13571291 22941996 40075457 42328656
14544D2328656k0363790G648398l776067j147081o67437J89487l15793Q9217k38253
$$ 42328656 21964866 7648398 3872331 2725250 2057813 2247300 1931507 2020724 1782471
14535A782471L24631k40281j81298L18009L06014j92146j36085k33132K02807
$$ 1782471 2107102 1866821 1685523 2003532 2309546 2117400 1981315 1748183 1950990
14526A950990J08114L33316k02448J47341R9083j34518J40899J64201j25149k62361
$$ 1950990 2059104 2392420 2189972 2337313 2436396 2301878 2442777 2606978 2481829 2219468
14516B219468J37398J30714J09280L4353j3295j76641N38130m8256o1910j59612
$$ 2219468 2356866 2487580 2596860 2631213 2617918 2441277 2979407 2931151 2869241 2709629
14506B709629L14363J93599m94570o5067K15256K18187j07222j30761M6088R6493
$$ 2709629 3023992 3217591 2723021 2657954 2873210 3091397 2984175 2853414 2899502 2995995
14496B995995J06404N229n6865K62037o3269J16464J85227k06357K94355m49614
$$ 2995995 3102399 3107628 3050763 3312800 3249531 3365995 3551222 3344865 3639220 3189606
14486C189606M63362j85203L37006j01567j17655K47686k65220K58644j09041
$$ 3189606 3652968 3467765 3804771 3703204 3585549 3833235 3568015 3826659 3717618
14477C717618L69416j46904Q9601J18800m16596M87388j78431L25328j82405K14660
$$ 3717618 4087034 3940130 4029731 4148531 3731935 4219323 4040892 4366220 4183815 4398475
14467D398475j76201K71130L2838K0419P2186j76332K31188Q2275j23168n7042
$$ 4398475 4222274 4493404 4526242 4546661 4618847 4442515 4673703 4755978 4632810 4575768
14457D575768N97247k22195K59996M4711m33755L00660J87888J35644q0598Q6713
$$ 4575768 5173015 4950820 5210816 5255527 4821772 5122432 5310320 5445964 5365366 5452079
14447E452079M24079l17255K0049J19877J5116j6516J89680J84111o918k5637
$$ 5452079 5876158 5558903 5578952 5698829 5713945 5697429 5887109 6071220 6064302 6038665
14437F038665L92445P893N6601O0477p4952N46147k45898L03861J45103k14267
$$ 6038665 6431110 6439003 6495604 6556081 6481129 7027276 6781378 7085239 7230342 7016075
14427G016075K84194j26522J83864K41252m51357N50636K65806M0004k43782M85355
$$ 7016075 7300269 7173747 7357611 7598863 7147506 7698142 7963948 8003952 7760170 8245525
14417H245525K6529J12913m448J68291J65035r1036K39039K28633K58559k31955
$$ 8245525 8272054 8384967 8380519 8548810 8713845 8622809 8861848 9090481 9349040 9117085
14407I117085M52296j243K48619M93345j89246M2730N4105K45726K27009L32519
$$ 9117085 9569381 9568138 9816757 10310102 10120856 10163586 10217691 10463417 10690426 11022945
14397A1022945K18895J20378p8088K61435K87134O3307N61303k49965J82153J06507
$$ 11022945 11241840 11362218 11284130 11545565 11832699 11896006 12457309 12207344 12389497 12496004
14387A2496004N29855L1077K98876J13799N69698P7479L74530K19439K48512J05886
$$ 12496004 13025859 13056936 13355812 13469611 14039309 14116788 14491318 14710757 14959269 15065155
14377A5065155O62707j42177L06657J22137P37154M31136k14469O49715L03679
$$ 15065155 15727862 15585685 15892342 16014479 16751633 17182769 16968300 17618015 17921694
14368A7921694M89826j12808M29590O83114L83674O18096M49475q2996N04597
$$ 17921694 18411520 18298712 18728302 19411416 19795090 20413186 20862661 20779665 21284262
14359B1284262O06447O14589O34697N74651O12794M10526O86603N16005R71969
$$ 21284262 21890709 22505298 23139995 23714646 24327440 24737966 25424569 25940574 26912543
14350B6912543L08064N19420Q04745Q17870N57746P00410R53733N64102J329164
$$ 26912543 27220607 27740027 28544772 29362642 29920388 30620798 31574531 32138633 33467797
14341C3467797O00030O81686J052489J073038J142070J223813J176448J018956
$$ 33467797 34067827 34749513 35802002 36875040 38017110 39240923 40417371 41436327
14333D1436327J145076J502284J008192J569861J559578J438343J352795J843499
$$ 41436327 42581403 44083687 45091879 46661740 48221318 49659661 51012456 52855955
14325E2855955J908863K092766J754035J867254K237978J904340K577121K488964
$$ 52855955 54764818 56857584 58611619 60478873 62716851 64621191 67198312 69687276
14317F9687276K636802K591346L149525K667299L158103L305670L447120L829223
$$ 69687276 72324078 74915424 78064949 80732248 83890351 87196021 90643141 94472364
14309I4472364L923530L954961M848030M208610M976860N252303N582293O130303
$$ 94472364 98395894 102350855 107198885 111407495 116384355 121636658 127218951 133349254
14301A33349254O018878O833247O491967P589160P825688P916860Q780766R102345
$$ 133349254 139368132 146201379 152693346 160282506 168108194 176025054 184805820 193908165
14293A93908165J0028935J0078343J0652262J1337327J2266741J2367444J3129060
$$ 193908165 203937100 214015443 224667705 236005032 248271773 260639217 273768277
14286B73768277J3814079J4030468J4527277J4768393J5206327J5122344J5247229
$$ 273768277 287582356 301612824 316140101 330908494 346114821 361237165 376484394
14279C76484394J4843905J4526518J4045884J2791574J1261540R778239N317495
$$ 376484394 391328299 405854817 419900701 432692275 443953815 453732054 459049549
14272D59049549J556136O16148K19764J603175M48289k011866n749874q569013
$$ 459049549 460605685 461221833 461441597 463044772 463493061 461481195 455731321 447162308
14264D47162308j0012555j2049182j3420773j4110677j5012436j5379254j6034435
$$ 447162308 437149753 425100571 411679798 397569121 382556685 367177431 351142996
14257C51142996j5902640j5302234j4805802j4549132j4489898j3801648j3336532
$$ 351142996 335240356 319938122 305132320 290583188 276093290 262291642 248955110
14250B48955110j2137169j2318314j0786697j0871909r856003r573987q193921
$$ 248955110 236817941 224499627 213712930 202841021 192985018 183411031 175217110
14243A75217110q872049p833287p233242p036107o771496n683608n850216n498081
$$ 175217110 166345061 158511774 151278532 144242425 137470929 131787321 125937105 120439024
14235A20439024n065230n004305n126963l571520l920956m215709l621695l587750
$$ 120439024 115373794 110369489 105242526 101671006 97750050 93534341 89912646 86324896
14227H6324896l639498k910028l331099k307251l053565k410708k259832k147216
$$ 86324896 82685398 79775370 76444271 74137020 71083455 68672747 66412915 64265699
14219F4265699k001311k309407k062496k009889j746386j567223j183455j771828
$$ 64265699 62264388 59954981 57892485 55882596 54136210 52568987 51385532 49613704
14211D9613704j708002q77939j642855j641319p76450p55909j136388j631667
$$ 49613704 47905702 47027763 45384908 43743589 42967139 42211230 41074842 39443175
14203C9443175j235199q76854q24956n61201j125596j171612j221927o52090n41416
$$ 39443175 38207976 37331122 36506166 35944965 34819369 33647757 32425830 31773740 31232324
14194C1232324o89407r53542n92981o67302p76829o43575q93251m96841p05154
$$ 31232324 30542917 29589375 28996394 28329092 27552263 26908688 26015437 25518596 24813442
14185B4813442n35940l63913n53798p10491l55912p65126j06316l29044j51262
$$ 24813442 24277502 23913589 23359791 22649300 22293388 21528262 21421946 21092902 20941640
14176B0941640p81533m89701k36588l60594m02951m33783k21671n41468k83536
$$ 20941640 20160107 19670406 19433818 19073224 18670273 18236490 18014819 17473351 17189815
14167A7189815l99772p8700o75705j12952k62732l59881k01398l63415n43205
$$ 17189815 16790043 16711343 16035638 15922686 15659954 15300073 15098675 14735260 14192055
14158A4192055j54915k80756l3766j08462k07001m00341n41237J03622j37992
$$ 14192055 14037140 13756384 13722618 13614156 13407155 13006814 12465577 12569199 12431207
14149A2431207M199n49123o3034k61911j16007L18722o49715j82072q1159l52384
$$ 12431207 12435406 11886283 11823249 11561338 11445331 11764053 11114338 10932266 10851107 10498723
14139A0498723J39305j00547l46512p9695k15197k49506k45614m6561l7240q8054
$$ 10498723 10638028 10537481 10190969 10111274 9896077 9646571 9400957 9354396 9317156 9229102
14129I229102r0429l57727n8459j09074r9603Q1589n46420J45047k20819j27101
$$ 9229102 9138673 8780946 8722487 8613413 8513810 8595399 8048979 8194026 7973207 7846106
14119G846106N7748l73835R6437Q936j16845j49310K08567n60533J59901k40401
$$ 7846106 7903854 7530019 7626456 7635392 7518547 7369237 7577804 7017271 7177172 6936771
14109F936771j07698m0220j05803L1654m33648M78451l50432m0527l1442q8687
$$ 6936771 6829073 6788853 6683050 6714704 6281056 6759507 6409075 6368548 6337106 6248419
14099F248419j65047j33767K01267k47680K36502n39479L11960q5197k97258o4435
$$ 6248419 6083372 5949605 6150872 5903192 6139694 5600215 5912175 5826978 5529720 5465285
14089E465285k02392N01003k23027l63354L55309l59430J33243j08771j57910
$$ 5465285 5262893 5763896 5540869 5177515 5532824 5173394 5306637 5197866 5039956
14080E039956K70224n02439J48340J35832n91080J06282j2079k53635M89730o37799
$$ 5039956 5310180 4807741 4956081 5091913 4500833 4607115 4595036 4341401 4831131 4193332
14070D193332J13935O1842l13629J68384J59044K24539k59091l9298k1197K14069
$$ 4193332 4307267 4369109 4055480 4223864 4382908 4607447 4348356 4309058 4287861 4501930
14060D501930k15150n5489j82091n5943j07482K38896q8973j72784o7096m48541
$$ 4501930 4286780 4231291 4049200 3993257 3885775 4124671 4035698 3862914 3795818 3347277
14050C347277M58422m6299K09325o98882L45450J09335l9272J32182r5167k70695
$$ 3347277 3805699 3759400 3968725 3269843 3615293 3724628 3685356 3817538 3722371 3451676
14040C451676L54348l75147r1455n4044j19726J44569M9134k34132K99536k11769
$$ 3451676 3806024 3430877 3339422 3285378 3165652 3310221 3359355 3125223 3424759 3212990
14030C212990o7813k314j28457k07019P3399L96099l21135m0700n6349P7434p7056
$$ 3212990 3145177 3142863 3014406 2807387 2880786 3276885 2955750 2915050 2858701 2936135 2859079
14019B859079K6074P7341m41602N6830l2464J26369N5726p4319k96767J47524
$$ 2859079 2885153 2962494 2520892 2577722 2545258 2671627 2727353 2653034 2356267 2503791
14009B503791J04421r7983j73223J14262J85297m96156j02063L67422j89353M4650
$$ 2503791 2608212 2510229 2337006 2451268 2636565 2140409 2038346 2405768 2216415 2261065
13999B261065K53612m19424J63981k0605k20968L46920J92454j44020K21810J24570
$$ 2261065 2514677 2095253 2259234 2238629 2017661 2364581 2557035 2413015 2634825 2759395
13989B759395J354645L796431P945550J7023835J0376227j5256868A2995349n109580
$$ 2759395 4114040 7910471 15856021 32879856 43256083 27999215 12995349 7885769
13981G885769k043900j422932l41897m61501l83488K17452n67690J07901k76845
$$ 7885769 5841869 4418937 4077040 3615539 3232051 3449503 2881813 2989714 2712869
13972B712869k16257K09433j03217j98375L0953k69278L85301m06097K50432J56752
$$ 2712869 2496612 2706045 2602828 2404453 2435406 2166128 2551429 2145332 2395764 2552516
13962B552516k95441R894N103k04769R7357l912K06813o33289J64846j29898K45158
$$ 2552516 2257075 2266969 2272072 2067303 2164660 2160748 2367561 1734272 1899118 1769220 2014378
13951B014378P451K9023l58268K00822L22640k43481r6218k56940j52967M94940
$$ 2014378 2021829 2050852 1692584 1893406 2216046 1972565 1876347 1619407 1466440 1961380
13941A961380m47888M32866k71141J74038J07386j99440J00208k26061N0486M51770
$$ 1961380 1513492 1946358 1675217 1849255 1956641 1757201 1857409 1631348 1681834 2133604
13931B133604m55218l43636N98818k64183r9001O3071p9526J66114j1502n9315
$$ 2133604 1678386 1334750 1933568 1669385 1570384 1633455 1553929 1720043 1708541 1649226
13921A649226k33113J68163Q3589n06639N51487j7886j53656L52111j94184j67949
$$ 1649226 1416113 1584276 1667865 1161226 1712713 1694827 1541171 1893282 1699098 1531149
13911A531149j18843J75708J1795k91506N05014m56234L13524m28167J81801r1383
$$ 1531149 1412306 1588014 1599809 1308303 1813317 1357083 1670607 1242440 1424241 1332858
13901A332858J82577P8341N6453q7997m29265L83711j62947k51690K31358J13454
$$ 1332858 1515435 1593776 1650229 1562232 1132967 1516678 1353731 1102041 1333399 1446853
13891A446853P6301N3690k15489k14743K52996l8257o5537K86113o00218M69274
$$ 1446853 1523154 1576844 1361355 1146612 1399608 1361351 1295814 1581927 981709 1450983
13881A450983m42977P33810m89811k1900J04045J16038k72755Q3308K88624l25670
$$ 1450983 1008006 1741816 1252005 1230105 1334150 1450188 1177433 1260741 1549365 1223695
13871A223695j00170M6646L00811k25392K8052L726J04169r6224k10664L25219
$$ 1223695 1123525 1170171 1470982 1245590 1273642 1277368 1381537 1285313 1074649 1399868
13861A399868k65333m0446J722R25j62831N22936l66334R8267P9578j301N4209
$$ 1399868 1134535 1094089 1095811 1096736 933905 1456841 1090507 1188774 1268352 1267051 1321260
13850A321260j47837j19080j19375L12133j28285l07639N07740k99836n6332K6223
$$ 1321260 1173423 1054343 934968 1247101 1118816 811177 1318917 1019081 962749 988972
13840I88972l9506j24743n6606L06467N6965p0833j46132L15446k10374k83798
$$ 988972 949466 824723 768117 1074584 1131549 1060716 914584 1230030 1019656 735858
13830G35858J21195k21385N42648l03520K67004k44711j66884K36872J0659j08191
$$ 735858 857053 635668 1178316 874796 1141800 897089 730205 967077 977736 869545
13820H69545K17009k97148j4320J72363C99166O91976m39121M44061l79632J89822
$$ 869545 1086554 789406 775086 947449 399166 1091142 652021 1096082 716450 906272
13810I06272n7395k91809o0176L52142K13957l14245q6853q6862K64442o4020
$$ 906272 848877 557068 496892 849034 1062991 748746 661893 575031 839473 775453
13800G75453L7151J75191j42297l27840K37743L56830k17910j31126K61303r9734
$$ 775453 812604 987795 845498 517658 755401 1112231 894321 763195 1024498 924764
13790I24764l74244l9992J45041J80702M5181l627K36696l81974J97735N3326
$$ 924764 550520 510528 655569 836271 881452 877825 1114521 732547 930282 983608
13780I83608l43340J56740r8821J42804p6216p0895M2779K14350M8939D17259
$$ 983608 640268 797008 698187 840991 764775 693880 736659 951009 999948 417259
13769I10638p9379K15390J7618m03599Q2270j48309L52467m53527K65811R9515
$$ 910638 831259 1046649 1064267 660668 742938 594629 947096 493569 759380 858895
13759H58895l51385K25479Q1833C01221L99321r467l00536j3048M10558l90230
$$ 858895 507510 732989 814822 301221 700542 691075 390539 377491 788049 397819
13749C97819L5371K25041r3391K38493L9073j01409J37477k33190J59328k87352
$$ 397819 433190 658231 564840 803333 842406 740997 878474 645284 804612 517260
13739E17260Q5198m5779j419J01398N2328K53562j03547k02572n0281j73221Q8516
$$ 517260 602458 556679 555260 656658 708986 962548 859001 656429 606148 432927 521443
13728E21443P3541K59097L0850o9832k20769P9078p4257j18240L04814j19954
$$ 521443 594984 854081 884931 815099 594330 673408 599151 480911 785725 665771
13718F65771k33380J52637J89366j6233l56539K0356K86672j87906j71298K64404
$$ 665771 432391 585028 774394 758161 401622 421978 708650 520744 349446 613850
13708F13850J360k31567J69393R4709m8493j1141J15133J55691C65782R261K68009
$$ 613850 615210 383643 553036 647745 599252 588111 703244 858935 365782 375043 643052
13697F43052B93110J87734O8355k69066N01991j90694R379M26563l30563j28228
$$ 643052 293110 480844 549199 280133 782124 591430 600809 1027372 696809 568581
13687E68581J76066k87064k07107L30304p6177k18537J98540j76700L46667J8973
$$ 568581 744647 457583 250476 580780 504603 286066 484606 307906 654573 673546
13677F73546B98720K27707k00200K02077J42679A92109N23812k05841J52104j56848
$$ 673546 298720 526427 326227 528304 670983 192109 715921 510080 662184 505336
13667E05336j72139L55440p9536B94763K66733J28482k10656J76344j78707j51088
$$ 505336 333197 688637 609101 294763 561496 689978 479322 655666 476959 325871
13657C25871M54544k42215k17885r932p2494N60031B90629J11660J63223J4938
$$ 325871 780415 538200 320315 310383 237889 797920 290629 402289 565512 580450
13647E80450j42489k02115L80787B91820L52443k64986J05290o7880A67499L93413
$$ 580450 437961 235846 616633 291820 644263 379277 484567 416687 167499 560912
13637E60912A69037N67528C01400L64363m1409J1380k30668A96718J6219I4625
$$ 560912 169037 736565 301400 665763 624354 635734 405066 196718 212937 94625
13626D17473o6297J14183n7358d3128E46038l5006A31163N16385B81459J30158
$$ 417473 351176 465359 408001 -43128 546038 511032 131163 647548 281459 411617
13616D11617A86998L02098A38379L02368j51567J61095J96898l09637l8588J97578
$$ 411617 186998 489096 138379 440747 289180 450275 647173 337536 298948 496526
13606D96526K49158C09736J06186j87279O6554J17360k9322r4034J43965L34600
$$ 496526 745684 309736 415922 228643 295197 412557 383235 289201 433166 767766
13596G67766A80731J30380R9375O0810o2051k0515A53337M98309k27589A88047
$$ 767766 180731 311111 410486 471296 409245 388730 153337 651646 424057 188047
13585C67544K2875m5031R6664J87477n8873j73175m6529J480A54424J39422r581
$$ 367544 390419 345388 442052 629529 570656 397481 350952 352432 154424 293846 284265
13574B84265M33863A90430K82331J39788a3767G04226k44777j56879J2724j2259
$$ 284265 718128 190430 472761 612549 -13767 704226 459449 302570 315294 303035
13564C03035J55176L3328j83580L94724j59428A45490M41338A08876L83509j24022
$$ 303035 458211 491539 307959 702683 543255 145490 586828 108876 492385 368363
13554C68363q179a8461E46123k8242A86275M85695C24574J76447j72021n2070
$$ 368363 360184 -18461 546123 517881 186275 671970 324574 501021 329000 276930
13544B76930J12841A64387N90784k50002k02404P6798J90578B55307l9722J20822
$$ 276930 389771 164387 755171 505169 302765 379563 570141 255307 215585 336407
13534C36407O5499Q8904j7106F0109J81548Q5916d5521B94060l3999J80720A30998
$$ 336407 401906 490810 473704 60109 241657 327573 -45521 294060 260061 440781 130998
13522A74463j9526K50385J32563B56733K04398l1192M1705M4794A05173J16526
$$ 174463 154937 405322 537885 256733 461131 429939 471644 516438 105173 221699
13512B21699J78665j668C4797a11587B85986A10021j0721Q928J90544G9433Q8406
$$ 221699 400364 398696 34797 -111587 285986 110021 99300 108228 298772 79433 167839
13501A67839K04965M5311A90292L00910O2357k55739A3395L12365A56136L51878
$$ 167839 372804 418115 190292 491202 553559 297820 13395 325760 156136 508014
13491E08014k36174K5796a34680F07882A82324a49021E59231j15051j44267I0542
$$ 508014 271840 297636 -134680 607882 182324 -149021 559231 444180 299913 90542
13480B99238A45452k3584M9550J43912J91419o7576k1229a5184C08675B1967N7740
$$ 299238 145452 121868 171418 315330 506749 439173 417944 -15184 308675 21967 79707
13469G9707M48970l2464q7531A12699K62345o6515K1897L7130k9532K80064d0494
$$ 79707 528677 496213 408682 112699 375044 308529 330426 367556 338024 618088 -40494
13457C22736Q5043n4100m7917E9621f9514E7295J61045q1684Q2118l8918m880
$$ 322736 407779 353679 305762 59621 -69514 57295 218340 136656 218774 179856 174976
13446A74976k7161L13825C0581K07847P1925J14131A69646L20933k04183F6705
$$ 174976 147815 461640 30581 238428 310353 424484 169646 490579 286396 66705
13435E03511B15066m4059o9389a74432E5787K19249A1942J69103J87967c6714
$$ 503511 215066 171007 101618 -174432 55787 275036 11942 181045 369012 -36714
13424A32114N5434K09216a72576C2559K54909E7559K72136K2905A26327K81136
$$ 132114 187548 396764 -172576 32559 287468 57559 329695 352600 126327 407463
13414D07463j46601L9400j28252L43030j83573H6372K13683D8071L99855a30068
$$ 407463 260862 300262 172010 515040 331467 86372 300055 48071 447926 -130068
13403B49197c1469j0079C88003a13627C77599D4843M58075j41651a19391B99553
$$ 249197 -31469 -41548 388003 -113627 377599 44843 502918 361267 -119391 299553
13392C15260A32889c9362A03719K48616K02907a62802C03268a34909B36114K25976
$$ 315260 132889 -39362 103719 352335 555242 -162802 303268 -134909 236114 462090
13382D62090A76686j6146K0288m3660m3527L33514q7751A30012J60340j30866
$$ 462090 176686 160540 180828 137168 93641 427155 339404 130012 290352 159486
13372A59486L16834E9384J67101G8580J27628R5523E6694k998J77796J86057k02010
$$ 159486 476320 59384 226485 78580 206208 301731 56694 53696 231492 417549 215539
13361B15539E4376K34646j30970j0728k9199K69551B6149L18892j56802J56771
$$ 215539 54376 289022 158052 147324 118125 387676 26149 345041 188239 345010
13351C45010j00646J5489a02728H6233d9757C20604j9023K52598j72842J37953
$$ 345010 244364 259853 -102728 86233 -49757 320604 301581 554179 381337 519290
13341E19290E2708M56075j58802F8430J06786K91035k18350L8244H7151J35370
$$ 519290 52708 508783 349981 68430 175216 466251 247901 286145 87151 222521
13331B22521H2553j2601K95860i842A65485K3146M38520A71103K08523j09333
$$ 222521 82553 69952 365812 -9842 165485 188631 627151 171103 379626 270293
13321B70293R203r7896J47039o7217K04160L31175B32151o2510p3325A0137J39235
$$ 270293 279496 181600 328639 261422 465582 796757 232151 169641 96316 10137 149372
13310A49372K27183F9479a62930B73311F3221K19520A23481J96293E6493L31709
$$ 149372 376555 69479 -162930 273311 63221 282741 123481 319774 56493 388202
13300C88202A43008F1992J04186j3204o7783J31704r8904R826K07180n4719j23019
$$ 388202 143008 61992 166178 152974 85191 216895 117991 127817 334997 280278 157259
13289A57259K39488k6281j38693g587B12972F7577P3977K6955c4568A39362a93658
$$ 157259 396747 370466 231773 -7587 212972 67577 141554 168509 -34568 139362 -193658
13277i4721B0406J33370A8777K44314j0420L386a77278B1375M4071J42564J3074
$$ -94721 20406 153776 18777 263091 252671 256057 -177278 21375 65446 208010 221084
13266B21084G9559J57854a6047f008F9267g6289A72000N5063J48145L6701O5401
$$ 221084 79559 237413 -16047 -6008 69267 -76289 172000 227063 375208 411909 477310
13255D77310b5502B86403j09673B3246J54578j6589b96080b0672A04519L05535
$$ 477310 -25502 286403 176730 23246 177824 161235 -296080 -20672 104519 410054
13245D10054B866J82727K97327a63890A22619a01080C79982B7791a32103a4931
$$ 410054 2866 185593 482920 -163890 122619 -101080 379982 27791 -132103 -14931
13234h8104B36785j6719J1726j07748b479B91047r9755M3817n2578K3317K88084
$$ -88104 236785 220066 231792 124044 -2479 291047 191292 235109 182531 205848 493932
13223D93932j50805A44746j4232q574P8920I4803L77183D1436K02542Q401C0406
$$ 493932 343127 144746 130514 121940 200860 94803 471986 41436 243978 252379 30406
13211H203M07364j52634a6505C52481I5463J29138m1070J0953I4402a11302L1416
$$ 8203 415567 262933 -16505 352481 95463 224601 183531 194484 94402 -111302 -79886
13200g9886B20409n9227A2530f4465A33797N1105m051H0988b68002A45780R1476
$$ -79886 220409 161182 12530 -64465 133797 184902 180851 80988 -268002 145780 237256
13189B37256j3869B7832O2514E270a3002G3936L58125B3568M13152h0044A63356
$$ 237256 223387 27832 90346 5270 -13002 73936 432061 23568 436720 -80044 163356
13177C92325j20560L8191f7176B8233a80219A98050K09259a38546B25843r8670
$$ 392325 271765 309956 -67176 28233 -180219 198050 407309 -138546 225843 127173
13167A27173b16452A2888a66631C89116C3331M3313B9805g9347A35319j9881h1011
$$ 127173 -216452 12888 -166631 389116 33331 76644 29805 -79347 135319 115438 -81011
13155f6612B40487j07339b87749a37346N1773J5168h569A81363J89659j9779A63214
$$ -66612 240487 133148 -287749 -137346 -85573 -70405 -8569 181363 371022 351243 163214
13143b31318A52422p3593K00554J88291B05168J95788A77735b98869B69470F0613
$$ -231318 152422 78829 279383 467674 205168 400956 177735 -298869 269470 60613
13132C02103A29845k802m4457J88045b61399J04864A80699O2791g6194K5745B30933
$$ 302103 129845 127043 82586 270631 -261399 -156535 180699 243490 -76194 -50449 230933
13120B47976I5187J49800A22152g2945k99160A8739K77724b13278E3777O132a26806
$$ 247976 95187 244987 122152 -72945 -372105 18739 296463 -213278 53777 59909 -126806
13108C6052L6473b2022B87906e367A24275e9541a8695j4759B20658J6353C1213
$$ 36052 72525 -22022 287906 -5367 124275 -59541 -18695 -33454 220658 237011 31213
13096A63295m7732K69419b22932C23670c0252A98502i1472A84144J11528B4608
$$ 163295 115563 384982 -222932 323670 -30252 198502 -91472 184144 295672 24608
13085B40862h9061c4928C2384b19343f0882D296K60041b42367I218f7923E9215
$$ 240862 -89061 -34928 32384 -219343 -60882 4296 264337 -242367 9218 -67923 59215
13073B7448K21085a76632A39525b7857A12960J14791F8215j1725e4708B62025
$$ 27448 248533 -176632 139525 -27857 112960 227751 68215 56490 -54708 262025
13062C6580N1318K39284A01009J49419H7682L45385f0123D93530A12500L76765
$$ 36580 87898 327182 101009 250428 87682 433067 -60123 493530 112500 489265
13052D89265A62279K95326F7327J36646A3524J80160k3320A1801P5081L18713
$$ 489265 162279 457605 67327 203973 13524 193684 170364 11801 86882 405595
13042D05595d1466B57132a55401C73057j63481b27158B17230C0309J41037n0291
$$ 405595 -41466 257132 -155401 373057 209576 -227158 217230 30309 171346 121055
13032A21055a06418B76542b69520B05090L6733G6583J71990p4408m7079J98931
$$ 121055 -106418 276542 -269520 205090 241823 76583 248573 174165 127086 326017
13022C26017L8932A34122Q267K60445d4032k0172C03263I8703b04867H6119J7542
$$ 326017 364949 134122 142389 402834 -44032 -64204 303263 98703 -204867 86119 103661
13011A03661J2156L3278F2611a55660B49415B4837a17967B41214B0790b77590
$$ 103661 115817 149095 62611 -155660 249415 24837 -117967 241214 20790 -277590
13000C9716K00908I4769f0455A06560O5133R740l124g7264C06619q0090A12105
$$ 39716 240624 94769 -60455 106560 171693 181433 178309 -77264 306619 226529 112105
12988E0307a82659C20303G803K21082n4913l2236e4339B61314d3510G9299J0935
$$ 50307 -182659 320303 7803 228885 173972 141736 -54339 261314 -43510 79299 90234
12977I0234d10684G1660a0849A08407j7184M8743J71425j52712f6861j58237C31287
$$ 90234 -410684 71660 -10849 108407 91223 139966 311391 158679 -66861 -225098 331287
12965F9864J35204i4253B7721J21166b4207G9347f2773k0850A54419r525C7624
$$ 69864 205068 -94253 27721 148887 -24207 79347 -62773 -83623 154419 144894 37624
12953C55075A19663O9598p5141a02253A06027b04441e0815A9687J55698a93544
$$ 355075 119663 189261 114120 -102253 106027 -204441 -50815 19687 175385 -193544
12942a04135l2722B23626a07620B98727e4721q9559C93697j17554G308f6599o0716
$$ -104135 -136857 223626 -107620 298727 -54721 -144280 393697 276143 7308 -66599 -127315
12931a27315B11745E4484a41594A66538b42821H6758J19414J01180A06099c4579
$$ -127315 211745 54484 -141594 166538 -242821 86758 206172 307352 106099 -34579
12920b8176k13720A4429n877b92113A94242o4708m0862b44331O8490N8129G1886
$$ -28176 -241896 14429 8552 -292113 194242 129534 88672 -244331 -175841 -117712 71886
12908a31872A49801K59059j92289l7357a73587c472j28930I3500i0517J7015b5701
$$ -131872 149801 408860 216571 179214 -173587 -3472 -132402 93500 -90517 -73502 -25701
12896H9514B7881b4233j20046e3011A84371k6327K51441D526K84378A6137R476
$$ 89514 27881 -24233 -144279 -53011 184371 158044 409485 4526 288904 16137 25613
12885B5613a0293m5611j01615A69494f5689G9266K7319a94849F4588J92707G4091
$$ 25613 -10293 -55904 -157519 169494 -65689 79266 106585 -194849 64588 257295 74091
12873E6028K80217e0827B4693Q2724J06274C1999J44028b06446E2806O7152D6711
$$ 56028 336245 -50827 24693 107417 213691 31999 176027 -206446 52806 119958 46711
12861A25133A6833J09894h7225A85351K4517O4706b0213E3755K18781j35571b60212
$$ 125133 16833 126727 -87225 185351 209868 274574 -20213 53755 272536 136965 -260212
12849A53696J64481b83782A05334c32512h8951I8874J33334J78993c35736o9915
$$ 153696 318177 -283782 105334 -332512 -88951 98874 232208 411201 -335736 -405651
12839d05651B02143g9695k0355n002A26247J01522h5499D2705N37i0951A01747
$$ -405651 202143 -79695 -100050 -105052 126247 227769 -85499 42705 43242 -90951 101747
12827H9671b3387H4812Q1764A5591a12537C75252A85361m3k5274a6640r3844G1791
$$ 89671 -23387 84812 166576 15591 -112537 375252 185361 185318 160044 -16640 -110484 71791
12814a10821k19078e7293A89973A463c2657j45019A57322k1892a09865b1342B3666
$$ -110821 -329899 -57293 189973 1463 -32657 -177676 157322 135430 -109865 -21342 23666
12802A71128E7124a57098E98440B18352G4036K0807L7572J37280j31256A1892
$$ 171128 57124 -157098 598440 218352 74036 94843 132415 269695 138439 11892
12791C54306A21419N9332a14929L7078C1029d9475J2557k66033B08219f6258f805
$$ 354306 121419 180751 -114929 -77851 31029 -49475 -36918 -302951 208219 -66258 -6805
12779i7292F7768J27254J59130a31707A09359a91432M4056l8141b21A5860f0385
$$ -97292 67768 195022 354152 -131707 109359 -191432 -147376 -185517 -221 15860 -60385
12767I7516b60685C95143H3000a36621b325l8889C34690D5894j4402a05182J3123
$$ 97516 -260685 395143 83000 -136621 -2325 -41214 334690 45894 31492 -105182 -92059
12756i2059F9080g2101l5367K5804E3807A6879O3033J1715a56658d9218D8627
$$ -92059 69080 -72101 -107468 -81664 53807 16879 79912 91627 -156658 -49218 48627
12744A87688C6584G230a653A72848b98921I3222K38077j04595m4748a11077I4875
$$ 187688 36584 7230 -1653 172848 -298921 93222 331299 226704 181956 -111077 94875
12732C16557q3499A7284b5770r0910B04126c4640G6907J1875R1326a48728E54038
$$ 316557 233058 17284 -25770 -116680 204126 -34640 76907 88782 180108 -148728 554038
12720B18482C7536O6117b85319h3787C67377I0709m3660J15931M7050G8210J51155
$$ 218482 37536 103653 -285319 -83787 367377 90709 47049 162980 210030 78210 229365
12709B29365a33397d1484F2226b20392B54474R4294p8396o141A08578K35704A40323
$$ 229365 -133397 -41484 62226 -220392 254474 348768 270372 264231 108578 344282 140323
12697B81957E4608N8152b71134C95185H9439d9600B50194b85261B0780i8933k6943
$$ 281957 54608 112760 -271134 395185 89439 -49600 250194 -285261 20780 -98933 -125876
12686a25876B24570a62837q192C15266c9981A12175j431K23235G5169J53870B1238
$$ -125876 224570 -162837 -171029 315266 -39981 112175 110744 333979 75169 229039 21238
12674I321J39683k0125g0682r7052A02442K7145a63003C100K24668q7057J2660
$$ 9321 149004 128879 -70682 -167734 102442 129587 -163003 3100 227768 140711 153371
12663A53371b03781A75886C6336L118J50304K36072j35612a45167c7555A21897
$$ 153371 -203781 175886 36336 39454 189758 425830 290218 -145167 -37555 121897
12652B71918j630g3532B06042f1183l6953p2230D8029d01304A755L19279a04656
$$ 271918 270288 -73532 206042 -61183 -98136 -170366 48029 -401304 1755 321034 -104656
12640c6256q0541e732B51262L9497a1630D3993J55470j4014a9693j7208p8747
$$ -36256 -116797 -5732 251262 290759 -11630 43993 199463 185449 -19693 -36901 -115648
12629a15648B07893l2944J94565F010J87591C3821a13142E5356I775J93467J92790
$$ -115648 207893 174949 369514 6010 193601 33821 -113142 55356 9775 203242 396032
12618C96032E8725a01037j97179F6739g8567j69575B56983j6186a75628H1344
$$ 396032 58725 -101037 -298216 66739 -78567 -248142 256983 240797 -175628 81344
12607a23441D55656A1571J525O0651Q3737P5902L2050j13471G1688a856B02872
$$ -123441 455656 11571 13096 73747 157484 233386 265436 151965 71688 -1856 202872
12595D73903a14215B96678A7986A550h1473F8941b86700A49022J34666j07917
$$ 473903 -114215 296678 17986 1550 -81473 68941 -286700 149022 283688 175771
12585A75771a13540F9041a25124D6332J30241R3696J3979c385o592D7535b50275
$$ 175771 -113540 69041 -125124 46332 176573 270269 284248 -3385 -9977 47535 -250275
12573H5981b14866R7102B20106N1296C2581d8937B3206J45442a8520k8105C1560
$$ 85981 -214866 -117764 220106 271402 32581 -48937 23206 168648 -18520 -46625 31560
12561B23775K3297q5080b01171O2679e1109j41054B5436M7926c75245A24369L0665
$$ 223775 247072 161992 -201171 -138492 -51109 -192163 25436 73362 -375245 124369 155034
12550A55034a89074f4457C89939a58855g1007B74953a62253E7453M2650K3145
$$ 155034 -189074 -64457 389939 -158855 -71007 274953 -162253 57453 100103 123248
12540A23248A3484J64845f8306C39777a928p9000c6790I589M19107a88491K2258
$$ 123248 13484 178329 -68306 339777 -1928 -80928 -36790 9589 428696 -188491 -166233
12529a66233a422A37485A5691N1298B2536f117p0886A69146C7348J04248D0259
$$ -166233 -1422 137485 15691 66989 22536 -6117 -77003 169146 37348 141596 40259
12517B2784e11908a22314B40388j4187a85965f1546k55133J54472H1108J0591
$$ 22784 -511908 -122314 240388 226201 -185965 -61546 -316679 -162207 81108 91699
12507I1699C1613a86734A86601B3280L648M7035a22008l6848I8283b91306B48683
$$ 91699 31613 -186734 186601 23280 26928 73963 -122008 -158856 98283 -291306 248683
12495F0548i0163B13289b84893H9361a42065A24485a6698A6835L1341b9915C37621
$$ 60548 -90163 213289 -284893 89361 -142065 124485 -16698 16835 48176 -29915 337621
12483a61412f6996j61266c6017H7856Q300a88888E5264b11491A83438J50424D2829
$$ -161412 -66996 -228262 -36017 87856 96156 -188888 55264 -211491 183438 333862 42829
12471E529a57592M341D03389h3882A442M61529A10549K7034A0761O6914f6488
$$ 5529 -157592 -153251 403389 -83882 1442 462971 110549 137583 10761 77675 -66488
12459I1800b11146m6552M1232o4031i5426A88584a9582B06890b41295g4096q1760
$$ 91800 -211146 -257698 -216466 -280497 -95426 188584 -19582 206890 -241295 -74096 -155856
12448a55856B82077b35134C00987b4918A02104J0683a08202D42i1431k3999B26546
$$ -155856 282077 -235134 300987 -24918 102104 112787 -108202 442 -91431 -115430 226546
12436b13353H6424b6066A99629r4544h4063j17798Q2007l25366e4352l1074E0580
$$ -213353 86424 -26066 199629 105085 -84063 -201861 -119854 -445220 -54352 -85426 50580
12424E3327a5582q830B59036d5516k15882a22865n2893A91721H1663j6806J95868
$$ 53327 -15582 -24412 259036 -45516 -261398 -122865 -175758 191721 81663 64857 260725
12413B60725q6686q6558a26132r301D4757a85214A51991I638b29522P2065A21005
$$ 260725 174039 87481 -126132 -135433 44757 -185214 151991 9638 -229522 -157457 121005
12401c1070k31365j05493I1357a388F1969A8624C839P4178K67688j41698b19439
$$ -31070 -262435 -367928 91357 -1388 61969 18624 3839 78017 345705 204007 -219439
12389A65052a86483F7921c297A12500m4675J19460h9973b5019j5998A60000C6902
$$ 165052 -186483 67921 -3297 112500 67825 187285 -89973 -25019 -41017 160000 36902
12377B85274C9811b13617A68456A4428B291b29265I2756H552g4376I0386b72155
$$ 285274 39811 -213617 168456 14428 2291 -229265 92756 8552 -74376 90386 -272155
12365h5448E8026A8894c69491A65629a77767G1596j9669P4605M64448b09001A33521
$$ -85448 58026 18894 -369491 165629 -177767 71596 51927 126532 590980 -209001 133521
12353a85908M3238j2142C7081K47800H9488d418A0853c35172J17518i3571F6970
$$ -185908 -142670 -154812 37081 284881 89488 -4418 10853 -335172 -217654 -93571 66970
12341A60745M3453a02164A14331k7281a01967B29628J00336F3412a2276B9638
$$ 160745 204198 -102164 114331 87050 -101967 229628 329964 63412 -12276 29638
12330F5391J03139M562q2374b04955j84417d2911B07848h2368k51556D30188H4223
$$ 65391 168530 173092 90718 -204955 -389372 -42911 207848 -82368 -333924 430188 84223
12318c8512C45883c35102c5272o6236I8763d4286j51391B91114i150G8306J69411
$$ -38512 345883 -335102 -35272 -101508 98763 -44286 -195677 291114 -9150 78306 247717
12307B47717j05625o8197a85866l59296a91873b2935A0050R7671d6792n0475A68304
$$ 247717 142092 73895 -185866 -545162 -191873 -22935 10050 107721 -46792 -97267 168304
12295H8719g1740B06733m7641B8233b93286A55210a87039I5218P3448K57027k09937
$$ 88719 -71740 206733 159092 28233 -293286 155210 -187039 95218 168666 425693 215756
12284B15756r2365N1301b9436M244A42742D8376K25943I9405N30019C11394D3068
$$ 215756 123391 174692 -29436 -25192 142742 48376 274319 99405 629424 311394 43068
12272A77316n3705P1273b74469A24779f8022A24450K5130J25099j01138l6210
$$ 177316 123611 194884 -274469 124779 -68022 124450 149580 274679 173541 137331
12262A37331c0245C20877p4867I3317h2106D73604A31724K24053g5724A56060
$$ 137331 -30245 320877 246010 93317 -82106 473604 131724 355777 -75724 156060
12251A13724K3577I435L39772o2937f2894L677j22104B79585j09425c542m5127
$$ 113724 137301 9435 349207 286270 -62894 -59217 -181321 279585 170160 -3542 -48669
12240d8669A78152P9518f3274b7407C48668a6845B00009b4260F9151a19577e9047
$$ -48669 178152 257670 -63274 -27407 348668 -16845 200009 -24260 69151 -119577 -59047
12228F3199J15299A4142J42419K07840A16070K03795i4538E2681P4045M8999n528
$$ 63199 178498 14142 156561 364401 116070 319865 -94538 52681 126726 175725 170197
12217A70197K82985j99675j18861K93544i7881A60987J49902A6792N6728a7005
$$ 170197 453182 253507 134646 428190 -97881 160987 310889 16792 73520 -17005
12206A20828J69475j15k6219j15775D5793e3321B04470D2004K62221j37135o2840
$$ 120828 290303 290188 263969 148194 45793 -53321 204470 42004 304225 167090 104250
12195A04250E186P9478a35076B2121K76710d0344B73413b22067H7815b64525A55886
$$ 104250 5186 84664 -135076 22121 298831 -40344 273413 -222067 87815 -264525 155886
12183e8034b8503B79023j14051J8296A3359J40143l2379J15370p6276a31042B0745
$$ -58034 -28503 279023 164972 183268 13359 153502 121123 236493 160217 -131042 20745
12171a01871A91613r336C2552b513j7899A58656c7924B21294L72378k89491e960
$$ -101871 191613 182277 32552 -2513 -20412 158656 -37924 221294 593672 304181 -5960
12159A13340l2818f8045A40542B8230K7107b02086o947C9092J63497i4663j83025
$$ 113340 80522 -68045 140542 28230 55337 -202086 -209033 39092 202589 -94663 -277688
12148b77688E2653h3803F3658J15591d3076A77716k4293o0397A4263C818a16051
$$ -277688 52653 -83803 63658 179249 -43076 177716 153423 93026 14263 3818 -116051
12136B04770B2659f2713A98920a93538d9578a2837p3068p6529F1452J51786b51182
$$ 204770 22659 -62713 198920 -193538 -49578 -12837 -85905 -162434 61452 213238 -251182
12124A41525K7646K641c28459a56046C6223K94147C9049c91429a4059c865I593
$$ 141525 169171 171812 -328459 -156046 36223 330370 39049 -391429 -14059 -3865 9593
12112a18972A14689D3218d05781a47868B9871J70617a24192k50728J02055h4370
$$ -118972 114689 43218 -405781 -147868 29871 200488 -124192 -374920 -272865 -84370
12101d2574J2202A85297a15331A40468J6398D0985b25439F9486L66775A20325
$$ -42574 -30372 185297 -115331 140468 156866 40985 -225439 69486 436261 120325
12090D6000M5672e2573f10A05191b66586A01318J95765D9912Q1422J32374c24880
$$ 46000 91672 -52573 -610 105191 -266586 101318 297083 49912 131334 263708 -324880
12078f3337B59498N24993K9921J079326n26095F47064A74947f6685A95431l5722
$$ -63337 259498 784491 814412 1893738 1367643 647064 174947 -66685 195431 159709
12068A59709b71524j70996A0096L6692a48836A60686f734I6219c2210j33352C94191
$$ 159709 -271524 -442520 10096 46788 -148836 160686 -6734 96219 -32210 -165562 394191
12056A0421P4068C0206J84680G0638K73371H375h5048A4021K4135d14870I3169
$$ 10421 84489 30206 214886 70638 344009 8375 -85048 14021 38156 -414870 93169
12044b05776C79726j61116a26217A2220e230l12005Q2217F1645f8745A76113O3195
$$ -205776 379726 218610 -126217 12220 -5230 -317235 -235018 61645 -68745 176113 239308
12033B39308F8813O6113b80725a30658J3177B05814b11172N6844D4512J43634
$$ 239308 68813 134926 -280725 -130658 -117481 205814 -211172 -154328 44512 188146
12023A88146D0315j4679J53911i0118C8188J34785b61806R9055B17584N793f5051
$$ 188146 40315 25636 179547 -90118 38188 172973 -261806 -162751 217584 223377 -65051
12011A93764a53889B0871J23705h0531b7577H1103a10306B40378B9022a11345
$$ 193764 -153889 20871 144576 -80531 -27577 81103 -110306 240378 29022 -111345
12000B1989a09897j33578D5430a05899A19207Q7524h7351C00958I8536h9455c5248
$$ 21989 -109897 -243475 45430 -105899 119207 206731 -87351 300958 98536 -89455 -35248
11988b09608C6820a84077K0518n290G4952P0990n7458n034r776c95073e4720E7795
$$ -209608 36820 -184077 -163559 -168849 74952 145942 88484 83450 73674 -395073 -54720 57795
11975A20566J10930e1670j64318E640J80406c5059j70792B77482H2377J23966
$$ 120566 231496 -51670 -215988 5640 186046 -35059 -205851 277482 82377 206343
11965B06343o513J31042A28730c11024c8544B94139C9132c73548b6031k38768
$$ 206343 199830 330872 128730 -311024 -38544 294139 39132 -373548 -26031 -264799
11955b64799H5144b72020L8308J09341B83464j34324p2742g3045D1255a16603
$$ -264799 85144 -272020 -233712 -124371 283464 149140 76398 -73045 41255 -116603
11944a29959A21314k6754e1987n1105o6500B63409b82194I3281c01006g2079C57198
$$ -129959 121314 94560 -51987 -103092 -169592 263409 -282194 93281 -301006 -72079 357198
11932C4573J41133a26867A14316C1723a35045A0662a48890m2737C114a74094g3501
$$ 34573 175706 -126867 114316 31723 -135045 10662 -148890 -191627 3114 -174094 -73501
11920A59545M762Q8081b0648C6980a62121A26060c24622c7562j76663a2454A16545
$$ 159545 164307 252388 -20648 36980 -162121 126060 -324622 -37562 -214225 -12454 116545
11908G1900k9168j7868h9839A44382C2781O0188B0942J13907J75283n0872i4584
$$ 71900 42732 24864 -89839 144382 32781 92969 20942 134849 310132 259260 -94584
11896e2752E9143a43455r7738A4264a66281k10094B54067g3029o9736b280n8016
$$ -52752 59143 -143455 -241193 14264 -166281 -376375 254067 -73029 -142765 -2280 -60296
11885f0296B10035C3980a1956A22150a12101M5121D012a55912f3510q0644l5839
$$ -60296 210035 33980 -11956 122150 -112101 -66980 4012 -155912 -63510 -144154 -179993
11874a79993I7142j1500L9911E9557K0403h5672b694l671A05896J43815b6140
$$ -179993 97142 85642 125553 59557 79960 -85672 -2694 -6365 105896 249711 -26140
11862F02e1636m29813a61780G0741A4132O5913c16229A64838C5351R2748a5438
$$ 602 -51636 -481449 -161780 70741 14132 80045 -316229 164838 35351 128099 -15438
11850d7586A45772F6980b50482r8060j17447e5897k1600q3521j7715D8968J25257
$$ -47586 145772 66980 -250482 -348542 -465989 -55897 -77497 -161018 -178733 48968 174225
11839A74225a8448G2318a05274L028j92726K4675J3835c3672k27477e141A85120
$$ 174225 -18448 72318 -105274 -102246 -294972 -270297 -256462 -33672 -261149 -5141 185120
11827I5548l6226b26049D3470b45268J22535A07286A5973a89470B29854E876R2425
$$ 95548 59322 -226049 43470 -245268 -122733 107286 15973 -189470 229854 5876 98301
11816I8301g7823A29629a52155L0135B52922a47995l9591b5185l7245j24147A32639
$$ 98301 -77823 129629 -152155 -122020 252922 -147995 -187586 -25185 -62430 -186577 132639
11804a22677H5440K59386d1030l215j3714j00079B23049b61356C8382c08417a00832
$$ -122677 85440 344826 -41030 -44245 -57959 -158038 223049 -261356 38382 -308417 -100832
11792D6970b07897A99754l6443p0775a12188p3577j09018a30355C88799a2300
$$ 46970 -207897 199754 163311 92536 -112188 -185765 -294783 -130355 388799 -12300
11781a37731M6252E1358d0542C43507g6802n8364j77621J32758A31696P200d8310
$$ -137731 -91479 51358 -40542 343507 -76802 -135166 -312787 -180029 131696 138896 -48310
11769F1L99008a51126G3130a143A27713A8494K04600g2359a0772k31360a9315
$$ 61 399069 -151126 73130 -1143 127713 18494 223094 -72359 -10772 -242132 -19315
11757a94925L4814c7674C37696C123L7079c1501k80697B47382A4751K04176B9981
$$ -194925 -160111 -37674 337696 3123 40202 -31501 -312198 247382 14751 218927 29981
11745a8866l00707a03438c1205E1223J67102d3540A9151e1422m14203E1722A5273
$$ -18866 -319573 -103438 -31205 51223 218325 -43540 19151 -51422 -465625 51722 15273
11733c52883J60865b588B78553o3912a18716c4213A77686L0495a23085A06277
$$ -352883 -192018 -2588 278553 214641 -118716 -34213 177686 208181 -123085 106277
11722A36792B4046J54929H6225K71829i6831l74448g9678A19813K5225a87178
$$ 136792 24046 178975 86225 358054 -96831 -471279 -79678 119813 145038 -187178
11711a7176F91b2437j80561B44698D3703J41146h3330F4982c11963D00412a98262
$$ -17176 691 -22437 -202998 244698 43703 184849 -83330 64982 -311963 400412 -198262
11699a1166k53564C1551a93622B07084e7632p5288A98103n3885J22119d6570k70058
$$ -11166 -264730 31551 -193622 207084 -57632 -132920 198103 144218 266337 -46570 -316628
11688c16628B73286c0309j56608K7619O9491A46758F6528N06468e8898l20016
$$ -316628 273286 -30309 -186917 -159298 -89807 146758 66528 572996 -58898 -378914
11678c78914C98333A41239F0644J8884a22422D27079f3873n9321A07793i2429
$$ -378914 398333 141239 60644 79528 -122422 427079 -63873 -123194 107793 -92429
11667A32825e8295k81251a43868G9006C040K9268e4472A8521M2996L32461r1854
$$ 132825 -58295 -339546 -143868 79006 3040 32308 -54472 18521 61517 393978 302124
11656C02124g4237n7544c8711C3320J94453j5155m41p8460J14775b77080G6246
$$ 302124 -74237 -131781 -38711 33320 227773 212618 212177 133717 248492 -277080 76246
11644A78747b16679C13294f62p4629C72778a18562R340o2494l94Q846A77196a91395
$$ 178747 -216679 313294 -662 -75291 372778 -118562 -109222 -171716 -172110 -163264 177196 -191395
11631A29369F3203K46552E7371J21565a22866a9759A58580a26904j72240H7848
$$ 129369 63203 309755 57371 178936 -122866 -19759 158580 -126904 -299144 87848
11620a56600b1314B23322I4030A2894b22506n5616J23795A63951b16582E9415
$$ -156600 -21314 223322 94030 12894 -222506 -278122 -154327 163951 -216582 59415
11609A04494f2617G1885C4417b9998B38477j08241f2456C304a32025A99160n4987
$$ 104494 -62617 71885 34417 -29998 238477 130236 -62456 3304 -132025 199160 144173
11598A44173K09391A43092D5040b4514B62159e5347p0350j52632C27901n6815
$$ 144173 353564 143092 45040 -24514 262159 -55347 -125697 -278329 327901 271086
11588B71086E2693a61843a606n9597H2795a34784c6724A91613a47864N0787a1971
$$ 271086 52693 -161843 -1606 -61203 82795 -134784 -36724 191613 -147864 -97077 -11971
11576a15809H4319f2373A82691n4692O9759k5650d4819A4831f8875A07401b85701
$$ -115809 84319 -62373 182691 127999 197758 172108 -44819 14831 -68875 107401 -285701
11564A40265C6443a89172A37221L2486d5551A14595e2010j9206j22652D2712R5306
$$ 140265 36443 -189172 137221 169707 -45551 114595 -52010 -71216 -193868 42712 138018
11553A38018f6818A7552J20449D2938P5738Q2909E9551j2206A2456K99522h3014
$$ 138018 -66818 17552 138001 42938 118676 201585 59551 47345 12456 311978 -83014
11541C2476K0086J06940b4149E8080K75792j7803j03336p2831J44985j18353N9176
$$ 32476 52562 159502 -24149 58080 333872 316069 212733 139902 284887 166534 225710
11530B25710L2275m0173k5712a07030F3096f87B74017D0824P2358J679a4097p0180
$$ 225710 257985 217812 192100 -107030 63096 -687 274017 40824 113182 114861 -14097 -84277
11518h4277C28731j10002M0412B4073f1718G1106M20838A15701Q3964a87928C2173
$$ -84277 328731 218729 259141 24073 -61718 71106 491944 115701 199665 -187928 32173
11506A18549K23604j66751a95937B31825E8058J90219A7941O5976a04243I7139
$$ 118549 342153 175402 -195937 231825 58058 248277 17941 83917 -104243 97139
11495C33220B4406a00710b0599k31513D07299g3980A70463G1152a17406p0185
$$ 333220 24406 -100710 -20599 -252112 407299 -73980 170463 71152 -117406 -187591
11485a87591B61262P6831J35954m4958A21143k3103G553K07052h8002l2367B45945
$$ -187591 261262 338093 474047 429089 121143 98040 7553 214605 -88002 -120369 245945
11473B09142a55093B32622A14894a31902H51J58136j7480Q359J26343j11133m4412
$$ 209142 -155093 232622 114894 -131902 851 158987 141507 149866 276209 165076 120664
11462A20664K16817E005a48267g543A40159d3239J5138C09444i9709n4425O6315
$$ 120664 337481 5005 -148267 -7543 140159 -43239 -28101 309444 -99709 -154134 -87819
11451h7819l06071B47072H5355J81730A00879P7157a25546c6339j78941A78234
$$ -87819 -393890 247072 85355 267085 100879 178036 -125546 -36339 -215280 178234
11440b89124C23196A40148a11389C49312j45218k2084i6345A50284g2956j21208
$$ -289124 323196 140148 -111389 349312 204094 182010 -96345 150284 -72956 -194164
11430a94164C06761k1135e3508B20601a58665G4244f0765J2466A6931K70204I5761
$$ -194164 306761 285626 -53508 220601 -158665 74244 -60765 -48299 16931 287135 95761
11418a33230A38062k5525d010A138d9126j34577j85899A87544M7582b08364H6014
$$ -133230 138062 112537 -4010 1138 -49126 -183703 -369602 187544 235126 -208364 86014
11406a19601A10723m0892e165J609A4685L6658L6142d2486D9967J55931n1174
$$ -119601 110723 69831 -5165 -3556 14685 51343 87485 -42486 49967 205898 154724
11395A54724k1867G827b30154F1342i6346j12512B321g6015I3366J64799q6182
$$ 154724 132857 7827 -230154 61342 -96346 -208858 2321 -76015 93366 258165 171983
11384A71983o1990a32765H5428c13712J27834M4989J5538m2946F1252B2945B185
$$ 171983 109993 -132765 85428 -313712 -185878 -140889 -125351 -168297 61252 22945 2185
11372H7766J09670c5801C78940j47760c123k05351C7052a03446D58146c15274
$$ 87766 197436 -35801 378940 231180 -3123 -208474 37052 -103446 458146 -315274
11361b25045J05803A87920p7726J60311b16864f6060a1121A71769k1034a56282
$$ -225045 -119242 187920 110194 270505 -216864 -66060 -11121 171769 150735 -156282
11350g0606B33677i9771l2999A10072M2773a73341B31779p3718E6854L8183c92756
$$ -70606 233677 -99771 -132770 110072 152845 -173341 231779 158061 56854 95037 -392756
11338b3963E8827A7659a02930k895c8591p9127H7926a36354C28741b69184A59337
$$ -23963 58827 17659 -102930 -105825 -38591 -117718 87926 -136354 328741 -269184 159337
11326i2403M213B8519P4b03947j61646A06260a88053Q4595j700A8087J63494o108
$$ -92403 -88190 28519 28593 -203947 -365593 106260 -188053 -103458 -105158 18087 181581 175473
11314A75473o1149d8240k68426k0395a07603j80293a9212l7919A46721a87268
$$ 175473 114324 -48240 -316666 -337061 -107603 -287896 -19212 -57131 146721 -187268
11303b43349a1290m6890l1839o023q2285A60914b63453c4033B05079J1878p6315
$$ -243349 -11290 -58180 -90019 -96042 -178327 160914 -263453 -34033 205079 216957 140642
11292A40642c2928I1180a64133j7036H0663B2744b96594I9965c3655j25977B43878
$$ 140642 -32928 91180 -164133 -181169 80663 22744 -296594 99965 -33655 -159632 243878
11280a79293A61905a69283K4014j85595J19873I8777a283E8794a87355Q3313j69753
$$ -179293 161905 -169283 -145269 -330864 -210991 98777 -1283 58794 -187355 -104042 -273795
11269b73795B17623b24289R4273q4891J02947j5155K4028D8148A4246d6372B38719
$$ -273795 217623 -224289 -130016 -214907 -111960 -127115 -103087 48148 14246 -46372 238719
11257A96148a59866A3788b10906c2271B92498b72844j33562K8866J83113g1716
$$ 196148 -159866 13788 -210906 -32271 292498 -272844 -406406 -377540 -194427 -71716
11246b11765A78138p7084b30635r7052l8450d5440q940A25061a4033j9448B16848
$$ -211765 178138 101054 -230635 -327687 -366137 -45440 -54380 125061 -14033 -33481 216848
11234d7726C51416I5161f7354L568j08697f5329H1519i956r8459A65748A9987
$$ -47726 351416 95161 -67354 -63786 -172483 -65329 81519 -9956 -108415 165748 19987
11222A56461o3493a79333m2177A55882C6934a05957M4391p7360C26033j00396
$$ 156461 92968 -179333 -221510 155882 36934 -105957 -61566 -138926 326033 225637
11212B25637a33921B14927a671G6553j3873c64198P2068A1620c04634g2584A14904
$$ 225637 -133921 214927 -1671 76553 62680 -364198 -292130 11620 -304634 -72584 114904
11200A39849d9373r1767k5209G5198K64511A5514d35049e655j26812j56504I4259
$$ 139849 -49373 -141140 -166349 75198 339709 15514 -435049 -5655 -132467 -288971 94259
11188h2094j54348E5854A6949a32591b6386D8318J29463a5305j11698B52310o4521
$$ -82094 -236442 55854 16949 -132591 -26386 48318 177781 -15305 -127003 252310 187789
11177A87789D6091b70585i485j29335e9451k11023A48087a64415A3821g3575D00710
$$ 187789 46091 -270585 -9485 -138820 -59451 -270474 148087 -164415 13821 -73575 400710
11165F7590f1631I1204J7210e0516j11076J5608f9711B78699D4483b80446H3900
$$ 67590 -61631 91204 108414 -50516 -161592 -145984 -69711 278699 44483 -280446 83900
11153a92533h7096C372J24055b46102b9134j48555P3608D00454e4343G8639J51249
$$ -192533 -87096 3372 127427 -246102 -29134 -177689 -104081 400454 -54343 78639 229888
11142B29888F3855l8b71160B03807a22071F3157Q9676L1814D7794Q9733J37321
$$ 229888 63855 63817 -271160 203807 -122071 63157 152833 184647 47794 137527 274848
11131B74848f8399r1489B25874j9783a65269j76843E2218b6789k0081D88994A13470
$$ 274848 -68399 -159888 225874 206091 -165269 -342112 52218 -26789 -46870 488994 113470
11119I3010i0924Q3I3301B3723J89520M9184B8815f7759I7554e5815C58962f4780
$$ 93010 -90924 -90841 93301 23723 213243 262427 28815 -67759 97554 -55815 358962 -64780
11106A34388L04161H5497J65677M4893N105c4710B13921j03320a17248F2026a7866
$$ 134388 438549 85497 251174 296067 301172 -34710 213921 110601 -117248 62026 -17866
11094c4654k13122B74107b4613A21680O6210a8095D14490A5246M9677J59134M3605
$$ -34654 -247776 274107 -24613 121680 187890 -18095 414490 15246 64923 224057 267662
11083B67662J05086a06756C19751k8245I7117J94955F8701K20295f4350B30724
$$ 267662 372748 -106756 319751 291506 97117 292072 68701 288996 -64350 230724
11072B21328m3208J56531J15167j67956J43910K1909J63886k68737K36594k25973
$$ 221328 178120 334651 449818 281862 425772 447681 611567 342830 579424 353451
11062C53451k527J58846r5907L57229k74706k6991J60101G6642K68088J81343
$$ 353451 350924 509770 413863 771092 496386 469395 629496 76642 344730 526073
11052E26073O4077L5756J68632j24264k34732J86245B54637M54675j44778K13397
$$ 526073 590150 625906 794538 670274 435542 621787 254637 709312 564534 777931
11042G77931L65589m31029k4438P3191K740J67115k52873J36308o5125A71866
$$ 777931 1143520 712491 688053 761244 763984 931099 678226 814534 749409 171866
11031F26429K67112k228k98469j01398K35217k21941J6412K95983j71803k50526
$$ 626429 893541 891313 592844 491446 726663 504722 521134 817117 645314 394788
11021C94788K63361r9281j91964K86701k92428K69040p5139B13715O05009l31033
$$ 394788 658149 558868 366904 653605 361177 630217 555078 213715 818724 487691
11011D87691M4044K81105C51850N35442k19674j11571n4485N1399J90800j43704
$$ 487691 531735 812840 351850 887292 667618 556047 501562 552961 743761 600057
11001F00057j11903L79024r7741J39986k14324j53926j10429j58047N77211q0334
$$ 600057 488154 867178 769437 909423 695099 541173 430744 272697 849908 769574
10991G69574q472n9437j04168k7135n916p0376P01942k71592N8228m4071J33730
$$ 769574 761102 701665 597497 570362 564446 494070 1196012 924420 982648 938577 1072307
10980A072307j06359L93757p8889P6082N43397J48470K02398K11932M74401l88018
$$ 1072307 965948 1359705 1280816 1356898 1900295 2048765 2251163 2463095 2937496 2549478
10970B549478L18757l05970k1809n91480J94839l50409j0293k37806m8847k62423
$$ 2549478 2868235 2562265 2540456 1948976 2143815 1793406 1783113 1545307 1496460 1234037
10960A234037M73083q5566j8730l5872J03316r3812Q5122M2011n60294l6049J49780
$$ 1234037 1707120 1621554 1602824 1566952 1670268 1576456 1661578 1703589 1143295 1107246 1257026
10949A257026n86667j07305R8782C21801K44728J14939j5126B13610p3910A2917
$$ 1257026 670359 563054 661836 321801 566529 681468 666342 213610 139700 12917
10938B33596l0349A5179b36377E32542a23358B84630L8090d5528B73243h0563
$$ 233596 203247 15179 -236377 532542 -123358 284630 322720 -45528 273243 -80563
10927a50740D75710D7317f3571A16694n0571a42265D6372j5836a77144A30305
$$ -150740 475710 47317 -63571 116694 66123 -142265 46372 30536 -177144 130305
10916i9624A3242J36342a82717Q9077J9502o9443B75727d1552A25106e4567o8897
$$ -99624 13242 149584 -182717 -93640 -74138 -143581 275727 -41552 125106 -54567 -123464
10905a23464H4934K34057f8542k76022e0067k3486H1851b09432n5098a28009r1445
$$ -123464 84934 318991 -68542 -344564 -50067 -73553 81851 -209432 -264530 -128009 -219454
10894b19454j34201C10435e15561d8760l0748J9612I5948b6250l3093e808D6338
$$ -219454 -353655 310435 -515561 -48760 -79508 -59896 95948 -26250 -59343 -5808 46338
10882F8672a32836A4855J71679h6113r2740H9184b5800C2981a0559A55030b45805
$$ 68672 -132836 14855 186534 -86113 -178853 89184 -25800 32981 -10559 155030 -245805
10870a62950f8622a4382k47963C10170B004J59872E3606a65805n2262H9856c72061
$$ -162950 -68622 -14382 -262345 310170 2004 161876 53606 -165805 -218067 89856 -372061
10858C2429K06244k6252b24323R8125G6042c6548C16575A33351J8079J87550I9462
$$ 32429 238673 212421 -224323 -126198 76042 -36548 316575 133351 151430 338980 99462
10846B47965a53603f1408D5274j1231A321L41265f873A040b82739L1993A65597
$$ 247965 -153603 -61408 45274 34043 1321 342586 -6873 1040 -282739 -250746 165597
10834a83277h1833D85998A55985j843f1091A96023k6195F7699f169I7880a36379
$$ -183277 -81833 485998 155985 154142 -61091 196023 169828 67699 -6169 97880 -136379
10822B33189c96440A55299K82294C9395b00403C046M6070d7238B45896c3344m8814
$$ 233189 -396440 155299 437593 39395 -200403 3046 49116 -47238 245896 -33344 -82158
10811h2158G0750a61694r2904a25314A42129c1315A98106b53492B29812r0736
$$ -82158 70750 -161694 -254598 -125314 142129 -31315 198106 -253492 229812 139076
10801A39076b1272m25389C6773a2246j24714n4032l9382O7065A13571i6238A1211
$$ 139076 -21272 -446661 36773 -12246 -136960 -190992 -230374 -163309 113571 -96238 11211
10789e9033n5206i983B18807C1905M8137L1139g9715G4038a44015D4837a18577
$$ -59033 -114239 -9983 218807 31905 80042 111181 -79715 74038 -144015 44837 -118577
10777f489E450f9063l77547K10618R2072B76741K9127H2142D423a85056g8476
$$ -6489 5450 -69063 -446610 -235992 -143920 276741 305868 82142 4423 -185056 -78476
10765A23965a53798O0431C2962b64863J22496G2275b95708d8790E9409c03780
$$ 123965 -153798 -93367 32962 -264863 -142367 72275 -295708 -48790 59409 -303780
10754b59660a12909F0802J41730f4259A17972i9864G4957L0130P8514F1907d37036
$$ -259660 -112909 60802 202532 -64259 117972 -99864 74957 105087 183601 61907 -437036
10742B93196d5761B81469a74048D1589b0786l5088G1691B8458d0096J8912A02540
$$ 293196 -45761 281469 -174048 41589 -20786 -55874 71691 28458 -40096 -21184 102540
10730a03943n5605g9730B347b44786B08018g4376B22962H3321A7261K24443A01736
$$ -103943 -159548 -79730 2347 -244786 208018 -74376 222962 83321 17261 241704 101736
10718f19203b97085k6374J57208B73911a41663k92670E2762K97017A37781o7646
$$ -619203 -297085 -323459 -166251 273911 -141663 -434333 52762 349779 137781 70135
10708G0135b75295a34810j4154j08642g7141G8579a9279l00531A04925a096B68886
$$ 70135 -275295 -134810 -148964 -257606 -77141 78579 -19279 -319810 104925 -1096 268886
10696a17536k62501C0815b06539o298e8028K5816j46313C6997b7969E2464J20553
$$ -117536 -380037 30815 -206539 -212837 -58028 -32212 -178525 36997 -27969 52464 173017
10685A73017a21720B85940H967d40323a32431A10057c0260k31724d8889n46640
$$ 173017 -121720 285940 8967 -440323 -132431 110057 -30260 -261984 -48889 -595529
10675e95529E2964d2780B34185f5286F1623K03204G8964A9866c09606I7642o937
$$ -595529 52964 -42780 234185 -65286 61623 264827 78964 19866 -309606 97642 90705
10664I0705d64187A13553i1849j4907A54023a83325F7144b09620A92207k8330
$$ 90705 -464187 113553 -91849 -106756 154023 -183325 67144 -209620 192207 163877
10654A63877m5523b19787J1871Q3458j24887J22182j83845k4916L7817e1944C9287
$$ 163877 118354 -219787 -207916 -124458 -249345 -127163 -311008 -335924 -298107 -51944 39287
10642D4304N7373D2950J57348F7611c1412j42723f8188j98192A18169d23221d9447
$$ 44304 101677 42950 200298 67611 -31412 -174135 -68188 -266380 118169 -423221 -49447
10630B03257b62171C8065J39903b80615D5809J72080b22330D9147N9448e18980
$$ 203257 -262171 38065 177968 -280615 45809 217889 -222330 49147 108595 -518980
10619b35974Q3564N1690a9247B442b67161i7741A96215b13821n9013C5606a25647
$$ -235974 -152410 -100720 -19247 2442 -267161 -97741 196215 -213821 -272834 35606 -125647
10607c9344j77119J6530e3725j91861B69084j03871c28604A59376e1586D0378
$$ -39344 -216463 -199933 -53725 -245586 269084 165213 -328604 159376 -51586 40378
10596h9410H204d4002m3151A24201a33741d3301j09619G1084n788M3959a2832
$$ -89410 8204 -44002 -87153 124201 -133741 -43301 -152920 71084 65296 109255 -12832
10584G3838E139h3709G2166O9188a08020j98373A22274c39587J68174j18583Q5537
$$ 73838 5139 -83709 72166 141354 -108020 -306393 122274 -339587 -171413 -289996 -204459
10573b04459h4455B3690a76057E8220d3858a6446C33940o9719i341j60369B4016
$$ -204459 -84455 23690 -176057 58220 -43858 -16446 333940 264221 -9341 -169710 24016
10561C0165b3683B37983c0801A37374b4381n29k9828j5833j2884j29688C5583
$$ 30165 -23683 237983 -30801 137374 -24381 -24910 -54738 -70571 -83455 -213143 35583
10549A13130h8062K1165C884b4299B1039P375a06014p5508B7110c18082a57539
$$ 113130 -88062 -66897 3884 -24299 21039 28414 -106014 -181522 27110 -318082 -157539
10537E3424d855B534k90a31676A06363C1637a19189H3311B6350O6344C4129d6073
$$ 53424 -4855 2534 2244 -131676 106363 31637 -119189 83311 26350 92694 34129 -46073
10524b5304D6454a60787G2450M6403b4208o0420k61435H4746e2295I3589D3572
$$ -25304 46454 -160787 72450 118853 -24208 -84628 -346063 84746 -52295 93589 43572
10512B08317p6886g5130K008A33444a61927N1741L2333q525E019N917a28311j55524
$$ 208317 131431 -75130 -73122 133444 -161927 -110186 -77853 -86378 5019 10936 -128311 -283835
10500b83835C18595j53787F3283P5624m960a10410B3003a76458K5812A41538k5770
$$ -283835 318595 164808 63283 138907 133947 -110410 23003 -176458 -150646 141538 115768
10489A15768b35634A36331k9791D9639J72148K7570N8884k2576L67359J18772
$$ 115768 -235634 136331 106540 49639 221787 249357 308241 285665 653024 771796
10479G71796J73674A87272K5491D2763L01843A07203D5147K41530I6000a36676
$$ 771796 945470 187272 212763 42763 344606 107203 45147 286677 96000 -136676
10468G3829a9073k06860B3066b10613A66766a11446A43314e2374B45793a55533
$$ 73829 -19073 -225933 23066 -210613 166766 -111446 143314 -52374 245793 -155533
10457E33290E9422a58043A19523b50109H4909i888C06947b11387C96417a06809
$$ 533290 59422 -158043 119523 -250109 84909 -9888 306947 -211387 396417 -106809
10446B0071L1933a85386C0441h7229m044l22275B38207G427b10466O0221f5107
$$ 20071 52004 -185386 30441 -87229 -91273 -413548 238207 7427 -210466 -150245 -65107
10434B43829q8482a70052A5787b43494h5251G3899O3480a59602k06426J25864
$$ 243829 155347 -170052 15787 -243494 -85251 73899 137379 -159602 -366028 -240164
10424b40164m624e6746A38420O1203c7748j81348I7304N6786b7576j32815a0368
$$ -240164 -244788 -56746 138420 199623 -37748 -219096 97304 154090 -27576 -160391 -10368
10412C770b8204A49159m0796a75337f9464b1891m8267j96171C19168c5382m4832
$$ 3770 -28204 149159 108363 -175337 -69464 -21891 -70158 -266329 319168 -35382 -80214
10401h0214J5361k33150g4999A20864N755b64330a071B36432J68173b2096A67254
$$ -80214 -64853 -298003 -74999 120864 126619 -264330 -1071 236432 404605 -22096 167254
10389A71418A6524G31K12780q5789M5886i1825A02643P8567a01290n7574C98964
$$ 171418 16524 731 213511 127722 173608 -91825 102643 181210 -101290 -158864 398964
10377a80883F889K94640P5714R2774k04918K89472j37469A75232J23413A13398
$$ -180883 6889 301529 377243 470017 265099 554571 417102 175232 298645 113398
10366D90048K700q3396A83876L88265A115L30285A39392k5062m8252L082K44956
$$ 490048 492748 409352 183876 572141 1115 331400 139392 114330 66078 69160 314116
10355C14116b051A90214f2688B05978M2449K24696j21243K36037a4030C58671
$$ 314116 -2051 190214 -62688 205978 248427 473123 351880 587917 -14030 358671
10344A34230L25322q1710p5347n3769I1338L77080e7417A65912P1206O0282c14330
$$ 134230 459552 377842 302495 248726 91338 468418 -57417 165912 237118 297400 -314330
10332f4389D55825c6353A7343R2365M3513i1968d2118A66041P0053A3487K13989
$$ -64389 455825 -36353 17343 109708 153221 -91968 -42118 166041 236094 13487 227476
10321B27476L13730j61792A65079d0075E01098B46413F3217a68411q276A02822
$$ 227476 541206 379414 165079 -40075 501098 246413 63217 -168411 -176687 102822
10310A06079a09979A02453a19323J6439k1906j97032D6902K4102g1563q2195B7341
$$ 106079 -109979 102453 -119323 -102884 -124790 -321822 46902 71004 -71563 -153758 27341
10298A65958a58215A61096e007C4120A6620J98718c80290A45469a88571b7653
$$ 165958 -158215 161096 -5007 34120 16620 215338 -380290 145469 -188571 -27653
10287c66325A79457g5915Q688I8318D8762h3780j6080j35106A30384D048O0422
$$ -366325 179457 -75915 -67227 98318 48762 -83780 -99860 -234966 130384 4048 64470
10276F4470d0468n227q8847G2753g3206I4914l9795J47644a37522B07140L8838
$$ 64470 -40468 -45695 -134542 72753 -73206 94914 55119 202763 -137522 207140 245978
10265B45978H8320c2806j58808A32375m4194b7405C98459f2367B05438J11967
$$ 245978 88320 -32806 -191614 132375 88181 -27405 398459 -62367 205438 317405
10255C17405J956c09015A52323g7924n42m93101b11408D42521G2856J24606C9808
$$ 317405 319361 -309015 152323 -77924 -78466 -571567 -211408 442521 72856 197462 39808
10243b93782H7424i1817o3320j8328b6844p8737n7046M1037L673j25099B02770
$$ -293782 87424 -91817 -155137 -173465 -26844 -105581 -162627 -121590 -117917 -243016 202770
10231A46355b57945A57371a12167j11051i5255j70715A2866c81291C49600A53380
$$ 146355 -257945 157371 -112167 -223218 -95255 -265970 12866 -381291 349600 153380
10220b6216J1469k5575p8892d806l06517i1142c3487I763J40644l6498a74207
$$ -26216 -14747 -40322 -119214 -4806 -311323 -91142 -33487 9763 150407 113909 -174207
10208c8016k3464J3746j19729B58910D3893h7268H906O3926J0691J2777c42846
$$ -38016 -61480 -47734 -167463 258910 43893 -87268 8906 72832 83523 96300 -342846
10196d4904j29127e9111r4453k6122j30776L3213B6106g7934C7044b7389l41166
$$ -44904 -174031 -59111 -153564 -179686 -310462 -277249 26106 -77934 37044 -27389 -368555
10185c68555D1842O0458P6473o6790a1169l83054a35325E6909j5734a15494A94615
$$ -368555 41842 102300 178773 111983 -11169 -394223 -135325 56909 41175 -115494 194615
10173b48628a6227m2013k61167R8170D6959K13618a9027A2554e7374j45798E3604
$$ -248628 -16227 -58240 -319407 -221237 46959 260577 -19027 12554 -57374 -203172 53604
10161b19506j34721B2755J44956b20924q7002r1323f9096k52160f3896r3473a1893
$$ -219506 -354227 22755 167711 -220924 -307926 -399249 -69096 -321256 -63896 -157369 -11893
10149c09007P0736G3892a79762N4030o863D10089d45899a07154a5497k09741l3392
$$ -309007 -238271 73892 -179762 -125732 -132595 410089 -445899 -107154 -15497 -225238 -258630
10138b58630A61849P2034B5838f4391j88135a23300j88959p5309J00881M6718
$$ -258630 161849 233883 25838 -64391 -252526 -123300 -312259 -387568 -286687 -239969
10128b39969E7042P4363b32441h6833a7329k43273J19768B8281a99908I824R3280
$$ -239969 57042 131405 -232441 -86833 -17329 -260602 -140834 28281 -199908 9824 103104
10117A03104B8367a10011j22565g3085B66489b66024c6522p2641n5724I5235a46004
$$ 103104 28367 -110011 -232576 -73085 266489 -266024 -36522 -109163 -164887 95235 -146004
10105f6711G7298Q3287B5932K23984a01209b8962p20r9230F7800M5591h0847L7907
$$ -66711 77298 160585 25932 249916 -101209 -28962 -29682 -128912 67800 113391 -80847 -42940
10093d2940o7113F1084k8879P783b07394K8250n2627i3584A6331b12122c5694
$$ -42940 -110053 61084 32205 39988 -207394 -179144 -231771 -93584 16331 -212122 -35694
10081A09992a6751l09976k5418D4117i1676C6381a63061j17033A30514g6078A58013
$$ 109992 -16751 -326727 -352145 44117 -91676 36381 -163061 -280094 130514 -76078 158013
10069c85854a72493A54567j2077R6134B195g7255j34842G0058e0072D46478A53608
$$ -385854 -172493 154567 142490 238624 2195 -77255 -212097 70058 -50072 446478 153608
10057B21745C1868g4834k07507J23103E4275b46383A45200h9825g783j04195A48995
$$ 221745 31868 -74834 -282341 -159238 54275 -246383 145200 -89825 -7783 -111978 148995
10045A12328j0783i2427b1236j24894P2168A74838l2758K15751c06234b9088B64880
$$ 112328 101545 -92427 -21236 -146130 -73962 174838 142080 357831 -306234 -29088 264880
10033c32524J34962r831g2712E1901d29063g2422F3709b96324a10823j84936F5274
$$ -332524 -197562 -207393 -72712 51901 -429063 -72422 63709 -296324 -110823 -295759 65274
10021G2426A1763K0920b2902j25018C36637g9938H98a58504P3148H9347l7440
$$ 72426 11763 32683 -22902 -147920 336637 -79938 898 -158504 -85356 89347 51907
10010E1907a46288C8136A1245b6426l61935E8223a32232H0281d43994e7983m2301
$$ 51907 -146288 38136 11245 -26426 -388361 58223 -132232 80281 -443994 -57983 -100284
9999a00284A2166a68179o5430f6687A04372a05660a6790k2152A35148b90046C3077
$$ -100284 12166 -168179 -233609 -66687 104372 -105660 -16790 -38942 135148 -290046 33077
9987C98847A04288b20662J04248k52275B70328a44272A4361a33674o4524f6968
$$ 398847 104288 -220662 -116414 -368689 270328 -144272 14361 -133674 -198198 -66968
9976A4492c4745j53079g2346H2356i7720B3391F528P544e00911a83312c344j69127
$$ 14492 -34745 -187824 -72346 82356 -97720 23391 6528 14072 -500911 -183312 -3344 -172471
9964a72471N2746A77512h302l57763a31702I5449c83781a25044H8339b22969e6607
$$ -172471 -119725 177512 -8302 -366065 -131702 95449 -383781 -125044 88339 -222969 -56607
9952f4735c0573a2330j13207A52347a02466m7996l86884B71059d28697a77070
$$ -64735 -30573 -12330 -125537 152347 -102466 -150462 -537346 271059 -428697 -177070
9941b8829D8643Q8976a30876E9358Q4657D5051A1545L7673b71096b0611o2908
$$ -28829 48643 137619 -130876 59358 144015 45051 11545 49218 -271096 -20611 -83519
9930h3519m05260B4512J90347b72344a34572B89115a18997h319j24449A48757
$$ -83519 -488779 24512 214859 -272344 -134572 289115 -118997 -8319 -132768 148757
9919b39305J15039A33335m1661a72452N9317a1598B06662l4190a9467A23277M6296
$$ -239305 -124266 133335 91674 -172452 -113135 -11598 206662 172472 -19467 123277 169573
9908A69573G3714k7607h1148m3527b4844j76747q8360h1429A92453c70608A49217
$$ 169573 73714 46107 -81148 -124675 -24844 -201591 -289951 -81429 192453 -370608 149217
9896d3581p7887A79810i4748k3638A33060a04529o5131K4649B4938a25872r8009
$$ -43581 -121468 179810 -94748 -118386 133060 -104529 -169660 -145011 24938 -125872 -223881
9885b23881A91353b37046a518k68840l1241I2728d7910k87285M8791H6954a03008
$$ -223881 191353 -237046 -1518 -270358 -301599 92728 -47910 -335195 -286404 86954 -103008
9873E1924L17445c8567B17319d8027l68641A67791H0234K05814b51951C5201J84849
$$ 51924 369369 -38567 217319 -48027 -416668 167791 80234 286048 -251951 35201 220050
9862B20050b41439d4223A29520l4698a00730e481k64248G3768Q7630D2031h9499
$$ 220050 -241439 -44223 129520 94822 -100730 -5481 -269729 73768 161398 42031 -89499
9850a07075M6424l52763A7859h6478l11508a12972E2210K1315A9902N7573k7254
$$ -107075 -60651 -413414 17859 -86478 -397986 -112972 52210 73525 19902 77475 50221
9839E0221c02496e8200A1636J55126b2k178j88493M111k2316p5972e2200A18898
$$ 50221 -302496 -58200 11636 166762 -22 -2200 -190693 -186582 -208898 -284870 -52200 118898
9826E7549e8987j50018d1009n4639A50324a98663a4449A26211b40287Q9956k41455
$$ 57549 -58987 -209005 -41009 -95648 150324 -198663 -14449 126211 -240287 -150331 -391786
9815c91786a59837C9260A490M8702a66485a2134I9166J0314c12239J07501B15126
$$ -391786 -159837 39260 1490 50192 -166485 -12134 99166 109480 -312239 -204738 215126
9803A53850g3237A67229a17918j74565Q6662j7566K8624j2465E3434b45516J13376
$$ 153850 -73237 167229 -117918 -292483 -205821 -223387 -194763 -207228 53434 -245516 -132140
9792a32140a0505B89102d7373a1529j7210B15531d15078A69978d43813A97188
$$ -132140 -10505 289102 -47373 -11529 -28739 215531 -415078 169978 -443813 197188
9781a23621H5722e1837m5384k98150A83288F6121c183l90828F4813K37000b49744
$$ -123621 85722 -51837 -97221 -395371 183288 66121 -3183 -394011 64813 301813 -249744
9769b8923j93914D6655C111c11308R1486E3707J48070a92557j5297e7974I1951
$$ -28923 -222837 46655 3111 -311308 -219822 53707 201777 -192557 -207854 -57974 91951
9757b56556Q730i6266L1500a199j17609d743k46407P3642H762K79071a71896l94412
$$ -256556 -247826 -96266 -64766 -1199 -118808 -4743 -251150 -177508 8762 287833 -171896 -566308
9745e66308B71641m7740B9801c01393a42826c2345H7476b58242B30239a56994
$$ -566308 271641 223901 29801 -301393 -142826 -32345 87476 -258242 230239 -156994
9734c85324d0945j02207A65067K2756b77254J31248J1362e4935j13113C3815G519
$$ -385324 -40945 -143152 165067 187823 -277254 -146006 -134644 -54935 -168048 33815 7519
9722a0093j33189I8238a84745A973a06939B37014a04216M0379A64031a53162q1475
$$ -10093 -143282 98238 -184745 1973 -106939 237014 -104216 -63837 164031 -153162 -234637
9711b34637A13746a00405j32137j6892E139j311O1642P5019K2663a82467G22e8737
$$ -234637 113746 -100405 -232542 -249434 5139 3828 65470 140489 163152 -182467 722 -58737
9698C5992J99538C7569b31120A67293i0345o9124A94575h6055k31996C23062j37813
$$ 35992 235530 37569 -231120 167293 -90345 -159469 194575 -86055 -318051 323062 185249
9687A85249d32536d4328A15056a36543N9868A4604h4529j64975m0549O7768d8083
$$ 185249 -432536 -44328 115056 -136543 -76675 14604 -84529 -249504 -290053 -222285 -48083
9675g7405j28971k79914c0910A2215b88661i4756P417L6370A73166A7975J09748
$$ -77405 -206376 -486290 -30910 12215 -288661 -94756 -87339 -50969 173166 17975 127723
9664A27723E4207a33186B76512a9055j09487G2405i6362L5063B40943K79171a26070
$$ 127723 54207 -133186 276512 -19055 -128542 72405 -96362 -61299 240943 520114 -126070
9652A64086e0149p8045j60889L3396B73812a34927M1723j74544A64496D6807a13975
$$ 164086 -50149 -128194 -289083 -255687 273812 -134927 -93204 -267748 164496 46807 -113975
9640C2947a69937A65519c463A68793d49235i3102j2249D6360e626l03801g4773
$$ 32947 -169937 165519 -3463 168793 -449235 -93102 -105351 46360 -5626 -309427 -74773
9628d4142F61M2367c31040c9864a378q8038G7672b70665a20562b3379l64424A44119
$$ -44142 661 43028 -331040 -39864 -1378 -89416 77672 -270665 -120562 -23379 -387803 144119
9615A7733R2938g7648K5965j09929C09706j15199a44914A5406J8141b15653E802
$$ 17733 110671 -77648 -51683 -161612 309706 194507 -144914 15406 33547 -215653 5802
9603B46102A13793e8315p29A1557a66294f8490k47229N1576C18119f3145L0930
$$ 246102 113793 -58315 -59044 11557 -166294 -68490 -315719 -264143 318119 -63145 -32215
9592c2215G3993M5057b1183k14061B18633h8299o5796P3591A8302b41317F3464
$$ -32215 73993 119050 -21183 -235244 218633 -88299 -154095 -80504 18302 -241317 63464
9580b6884A6702L5438L34048d7710n7399B02624l7662i9309M0775q7141p2058
$$ -26884 16702 52140 386188 -47710 -105109 202624 164962 -99309 -58534 -145675 -217733
9569b17733L5936k86741B10520I543J08100d4734q2851k63201B7280a63298D0409
$$ -217733 -181797 -468538 210520 9543 117643 -44734 -127585 -390786 27280 -163298 40409
9557h9037A05731R0792D655a63646A32724b46885c2676n8739H5837a9545A55155
$$ -89037 105731 196523 4655 -163646 132724 -246885 -32676 -91415 85837 -19545 155155
9545a82996k4693C1802b25615E3820a78774G7651a5918F3958J48121D6036f8913
$$ -182996 -207689 31802 -225615 53820 -178774 77651 -15918 63958 212079 46036 -68913
9533b5821l6593A9874c81829A76640o0067L2379h3336J1035o5833p928H8993b25077
$$ -25821 -62414 19874 -381829 176640 116573 148952 -83336 -72301 -138134 -146062 88993 -225077
9520a22432l4853A63677L3564n7931r572c5560B6430a14984r8374j57144A9752
$$ -122432 -157285 163677 197241 139310 129738 -35560 26430 -114984 -213358 -370502 19752
9508D00531i8846C29152q3548a60363A37726b06121D33263a48856B0823b42070
$$ 400531 -98846 329152 245604 -160363 137726 -206121 433263 -148856 20823 -242070
9497b3970j7107j6126o2642G5090J25451b38931A26129a82726N0349J3432A45084
$$ -23970 -41077 -57203 -119845 75090 200541 -238931 126129 -182726 -132377 -118945 145084
9485a35831G1909k2079b35023h5623F9421j0614a0669o4908n533k31345R1126
$$ -135831 71909 49830 -235023 -85623 69421 58807 -10669 -75577 -81110 -312455 -221329
9474b21329Q9701b9251F784Q7486c90951i1098A39666a26426L7036L5039j97013
$$ -221329 -131628 -29251 6784 94270 -390951 -91098 139666 -126426 -89390 -54351 -251364
9463b51364a13538l6230K9749j56729i31j67467A20839b26110A84899a5214l15576
$$ -251364 -113538 -149768 -120019 -276748 -931 -168398 120839 -226110 184899 -15214 -330790
9452c30790e6810E1144O7276i1997l28333g1550C11794b5234I5778D1919a42396
$$ -330790 -56810 51144 118420 -91997 -420330 -71550 311794 -25234 95778 41919 -142396
9440c3887j48496C10330a15359a0512A13713a62705O962e9277j16495B5858f7525
$$ -33887 -182383 310330 -115359 -10512 113713 -162705 -155743 -59277 -175772 25858 -67525
9428h8847P01A63210n9552a81371j9712P5750L2463j96598E0133b08833A5638
$$ -88847 -88146 163210 103658 -181371 -201083 -125333 -92870 -289468 50133 -208833 15638
9416f7914E4453a53257M5797k12327p7390N1297a56883C2220e3781A27893L2545
$$ -67914 54453 -153257 -107460 -319787 -397177 -345880 -156883 32220 -53781 127893 160438
9405A60438i3249c7157A8209b95052h091A37283d11295O5461a48983B41632a3434
$$ 160438 -93249 -37157 18209 -295052 -8091 137283 -411295 -345834 -148983 241632 -13434
9393C7807b85535I3341b74994b0830j24325c7036D1629a02122A77659a44369A72295
$$ 37807 -285535 93341 -274994 -20830 -145155 -37036 41629 -102122 177659 -144369 172295
9381B96180a25743E9022a65869E1457R18b26645c4478A3517i7502p0224A32662
$$ 296180 -125743 59022 -165869 51457 52375 -226645 -34478 13517 -97502 -167726 132662
9369c1422A01727K8045f5612r3412A11783b1253j69676O1313f1491j4504n6600
$$ -31422 101727 129772 -65612 -159024 111783 -21253 -190929 -129616 -61491 -75995 -132595
9358a32595j00475j12019i5535j97261j9636A4988M2006k2887h0503B38576b87579
$$ -132595 -233070 -345089 -95535 -292796 -312432 14988 56994 34107 -80503 238576 -287579
9346h2671j45405J4818B88113a7867c960B32338B8228C450i4866a2774C09449
$$ -82671 -228076 -213258 288113 -17867 -3960 232338 28228 3450 -94866 -12774 309449
9334B5889M67109a1129d398l69960J52867n2766C8353b52568g2558p3735N3588
$$ 25889 492998 -11129 -4398 -374358 -221491 -274257 38353 -252568 -72558 -146293 -92705
9323i2705G2843e6310A21174E6765l177c53579j6708D5689K59584D8526J33386
$$ -92705 72843 -56310 121174 56765 53588 -353579 -370287 45689 305273 48526 181912
9312A81912m6924D2780J8083a88130j60785a38250B55433b6969l160k27264j58805
$$ 181912 134988 42780 60863 -188130 -348915 -138250 255433 -26969 -30129 -257393 -416198
9301d16198B07677h5004r7851C29141a65516K7278j23028m498i2879d1205M218
$$ -416198 207677 -85004 -182855 329141 -165516 -138238 -261266 -265764 -92879 -41205 -36987
9290c6987r4928A85581m0763b94457h2750k9173b3618A42063b83249G5594b62446
$$ -36987 -131915 185581 144818 -294457 -82750 -111923 -23618 142063 -283249 75594 -262446
9278h7028c5112k77160d7810j2638b9838I4216Q1921c59982G2274d12147a78527
$$ -87028 -35112 -312272 -47810 -60448 -29838 94216 176137 -359982 72274 -412147 -178527
9266d95214J29491a31512A34089M78m5659c89103a02071L3511I7678B3573n105
$$ -495214 -365723 -131512 134089 134567 88908 -389103 -102071 -68560 97678 23573 18468
9255A8468a54923i636A7095J38223g1672j02811K3820j38658F7842a66472k50107
$$ 18468 -154923 -9636 17095 155318 -71672 -174483 -150663 -289321 67842 -166472 -416579
9244d16579J84088B49712q4020a32685q7060O2065c2774B54629E5374a29722j18105
$$ -416579 -232491 249712 165692 -132685 -219745 -157680 -32774 254629 55374 -129722 -247827
9233b47827a09670k23199h4790m67859E2822f1591q889l48103a29100a5912I7656
$$ -247827 -109670 -332869 -84790 -552649 52822 -61591 -70480 -418583 -129100 -15912 97656
9221B22249a13238L4737k9448o4404A45238a15110A74837O769b04749B8149c09439
$$ 222249 -113238 -78501 -107949 -172353 145238 -115110 174837 181606 -204749 28149 -309439
9209E2497c26065B55254R8259A70560a83254N1188A17244l2486j2908a92332j06396
$$ 52497 -326065 255254 353513 170560 -183254 -132066 117244 84758 71850 -192332 -298728
9198b98728Q8488b6562j2393j56339a9076H2124O1628a98965C2664a18035o5610
$$ -298728 -210240 -26562 -38955 -195294 -19076 82124 143752 -198965 32664 -118035 -183645
9187a83645N4126a9763A42977a9937A66556g3008A08873F167a77905f7861K2671
$$ -183645 -129519 -19763 142977 -19937 166556 -73008 108873 6167 -177905 -67861 -45190
9176d5190k63360a00864j18468r5281J10804A07382g6140q096B09437b13272d2576
$$ -45190 -308550 -100864 -219332 -314613 -203809 107382 -76140 -84236 209437 -213272 -42576
9164a83158k02554J35778n0623A45886a55257C12760a00294L0052A441N8584n536
$$ -183158 -385712 -249934 -300557 145886 -155257 312760 -100294 -70242 1441 60025 54489
9153E4489d177j65754p111C4201P6084f9553A21129A105R4908a0725A57260G4567
$$ 54489 -4177 -169931 -177042 34201 110285 -69553 121129 1105 96013 -10725 157260 74567
9140c8023R984l4439a7801E1257Q1923j6318a40218B74880i268G5141e2728k93646
$$ -38023 -28039 -62478 -17801 51257 133180 116862 -140218 274880 -9268 75141 -52728 -346374
9128c46374A53129b48029o194D86537D9186c49044B89061m8746c9425A20971o421
$$ -346374 153129 -248029 -254223 486537 49186 -349044 289061 240315 -39425 120971 114550
9117A14550a17490k31802a68228P4972A9756K47103i2695D2086a51298O5392q5357
$$ 114550 -117490 -349292 -168228 -93256 19756 266859 -92695 42086 -151298 -85906 -171263
9106a71263j59473J25451l2296C68018a15742J4624R941F6248R3993P5200d6238
$$ -171263 -330736 -205285 -237581 368018 -115742 -101118 -91177 66248 160241 235441 -46238
9094i3428l1696k0947r1107O6246K024D0773a17020j0972B8809a43775B3333h7041
$$ -93428 -125124 -146071 -237178 -170932 -168908 40773 -117020 -127992 28809 -143775 23333 -87041
9081a93537g081n0882j66353k06617A29328a65227k4172g2548I2344e9717j33407
$$ -193537 -7081 -57963 -224316 -430933 129328 -165227 -189399 -72548 92344 -59717 -193124
9070a93124B3178a3356l27893a4147m5618l8187a1631K469j99140o1049A80597
$$ -193124 23178 -13356 -341249 -14147 -59765 -97952 -11631 -9162 -208302 -269351 180597
9058c58672a56406D0Q4950j6070b57452a15886p1926B43229A6776g2053l82457
$$ -358672 -156406 40 84990 68920 -257452 -115886 -187812 243229 16776 -72053 -454510
9047d54510N8403J33576B37010A15160f5142k85608e1104H2041b3345A33058J4535
$$ -454510 -396107 -262531 237010 115160 -65142 -350750 -51104 82041 -23345 133058 147593
9036A47593p0089b88843a22330N8808b8193A54821a10426j81703f2249L218j50119
$$ 147593 77504 -288843 -122330 -63522 -28193 154821 -110426 -292129 -62249 -59031 -209150
9025b09150A6622K38180A3505b32644B10167b83509g4018A52063C2205J02693
$$ -209150 16622 254802 13505 -232644 210167 -283509 -74018 152063 32205 134898
9015A34898E5566g7593A49277b30159A52978D5347a14605B62152b28707G1269
$$ 134898 55566 -77593 149277 -230159 152978 45347 -114605 262152 -228707 71269
9004b03589j26546i5526C2404J08194c34135A29709a50298r7409R2854m8532N3723
$$ -203589 -330135 -95526 32404 140598 -334135 129709 -150298 -247707 -154853 -203385 -149662
8993a49662j33806A07024b0049l83256G7144c34401I5829d6097D57484a77333
$$ -149662 -283468 107024 -20049 -403305 77144 -334401 95829 -46097 457484 -177333
8982A50879n0324A1062b4311C9920K12671J21470b2296B60313r5267q1382f9254
$$ 150879 100555 11062 -24311 39920 252591 374061 -22296 260313 165046 83664 -69254
8970c01793G508M4857a37109A45019f7832m0644J4309C1618a14376B33152g1950
$$ -301793 7508 52365 -137109 145019 -67832 -108476 -94167 31618 -114376 233152 -71950
8958a63150A13620a1748n0143k0263n1047j68315a40399J4307l7930L7334m03796
$$ -163150 113620 -11748 -61891 -82154 -133201 -301516 -140399 -126092 -164022 -126688 -530484
8947e30484B56757f8913C0508K82410b16885i2823r3777K3090g7359B04105b01449
$$ -530484 256757 -68913 30508 312918 -216885 -92823 -186600 -163510 -77359 204105 -201449
8935c6362p0222B12119k5576m7572a53544d2661a6667l8016p6152e1972D88803
$$ -36362 -106584 212119 186543 138971 -153544 -42661 -16667 -54683 -130835 -51972 488803
8923A188766R92960L336219L18132A952900B86368A01120a64225B55446J20444
$$ 1188766 2181726 5517945 5836077 1952900 286368 101120 -164225 255446 375890
8914C75890B6674b33793A68126c56968B0303M3080K79989m9179f8396j67913g7681
$$ 375890 26674 -233793 168126 -356968 20303 63383 343372 294193 -68396 -236309 -77681
8902b02413d9065H0634a47567E0843i1993a2188j79376j22890A33981E4852M0462
$$ -202413 -49065 80634 -147567 50843 -91993 -12188 -191564 -314454 133981 54852 95314
8891I5314g6025C3842d20127D0295d64577b03384k12190j63812C2220a16903B58905
$$ 95314 -76025 33842 -420127 40295 -464577 -203384 -415574 -579386 32220 -116903 258905
8879b52590a6686H5003m568J3332a52234P0050A87290F453a78719K1113A86791
$$ -252590 -16686 85003 80435 93767 -152234 -82184 187290 6453 -178719 -157606 186791
8867a59581e3502B10786f6336k00636I6906a91392b0977B12154b57840N3487A97087
$$ -159581 -53502 210786 -66336 -266972 96906 -191392 -20977 212154 -257840 -204353 197087
$$ [...]
##END NTUPLES=NMR SPECTRUM
##END=
