
##TITLE=AC1353_CTIAH12172_6648025_TjZmtJMwxs
##JCAMPDX= 6.0         $$ Bruker NMR JCAMP-DX V2.0
##DATA TYPE= NMR SPECTRUM
##DATA CLASS= NTUPLES
##ORIGIN= BRUKER
##OWNER= Administrator
$$ 1.72 TOPSPIN		Version 2.1
$$ 2012-08-10 20:00:27.890 -0500  Administrator@TOPSPIN
$$ Compression mode = diff/dup
##.OBSERVE FREQUENCY= 400.02188249412
##.OBSERVE NUCLEUS= ^1H
##.ACQUISITION MODE= SIMULTANEOUS (DQD)
##.ACQUISITION SCHEME= undefined
##.AVERAGES= 8
##.DIGITISER RES= 22
##SPECTROMETER/DATA SYSTEM= spect
##.PULSE SEQUENCE= zg30
##.SOLVENT NAME= COFFEE_meoh
##.SHIFT REFERENCE= INTERNAL, COFFEE_meoh, 1, 14.98509
##AUDIT TRAIL= $$ (NUMBER, WHEN, WHO, WHERE, PROCESS, VERSION, WHAT)
$$ ##TITLE= Audit trail, TOPSPIN		Version 2.1
$$ ##JCAMPDX= 5.01
$$ ##ORIGIN= Bruker BioSpin GmbH
$$ ##OWNER= Administrator
$$ $$ C:\Bruker\TOPSPIN/data/COFFEE/nmr/AC1353_CTIAH12172_6648025_TjZmtJMwxs/10/pdata/1/auditp.txt
$$ ##AUDIT TRAIL=  $$ (NUMBER, WHEN, WHO, WHERE, PROCESS, VERSION, WHAT)
(   1,<2012-08-10 20:00:20.218 -0500>,<Administrator>,<TOPSPIN>,<go>,<TOPSPIN 2.1>,
      <created by zg
	started at 2012-08-10 19:59:12.968 -0500,
	POWCHK enabled, PULCHK disabled,
       configuration hash MD5:
       6B 1B 68 BB D9 2E 58 E2 7F 35 AD 54 07 DF 0E 41
       data hash MD5: 64K
       B6 77 DB BB A1 13 B6 E8 9D 0F 4C 53 79 07 0A C6>)
(   2,<2012-08-10 20:00:23.656 -0500>,<Administrator>,<TOPSPIN>,<proc1d>,<TOPSPIN 2.1>,
      <Start of raw data processing
       efp LB = 0 FT_mod = 6 PKNL = 1 PHC0 = 0 PHC1 = 0 SI = 32K 
       data hash MD5: 32K
       FE 48 6A 30 99 17 41 3C 78 D1 BB 1A 61 CE BF CB>)
(   3,<2012-08-10 20:00:23.984 -0500>,<Administrator>,<TOPSPIN>,<proc1d>,<TOPSPIN 2.1>,
      <pk PHC0 = 183.2629 PHC1 = 0 
       data hash MD5: 32K
       A3 8B 38 80 19 89 5B A6 5D B7 01 CB AA DB 94 31>)
(   4,<2012-08-10 20:00:24.046 -0500>,<Administrator>,<TOPSPIN>,<proc1d>,<TOPSPIN 2.1>,
      <abs ABSG = 1 
       data hash MD5: 32K
       38 73 52 06 4D E5 AF 64 40 00 45 DD 9A B9 51 16>)
(   5,<2012-08-10 20:00:24.078 -0500>,<Administrator>,<TOPSPIN>,<proc1d>,<TOPSPIN 2.1>,
      <abs ABSG = 2 
       data hash MD5: 32K
       47 1D 51 1D D7 56 96 98 35 9F A0 50 9D 3D 91 D0>)
(   6,<2012-08-10 20:00:24.109 -0500>,<Administrator>,<TOPSPIN>,<proc1d>,<TOPSPIN 2.1>,
      <abs ABSG = 3 
       data hash MD5: 32K
       C2 D5 66 D8 29 0A C5 C6 38 E6 1B 3C 76 29 18 40>)
(   7,<2012-08-10 20:00:24.140 -0500>,<Administrator>,<TOPSPIN>,<proc1d>,<TOPSPIN 2.1>,
      <abs ABSG = 4 
       data hash MD5: 32K
       7F F1 2C 96 A8 ED 0D C3 EB 8C D3 28 CD 4B D1 BF>)
(   8,<2012-08-10 20:00:24.171 -0500>,<Administrator>,<TOPSPIN>,<proc1d>,<TOPSPIN 2.1>,
      <abs ABSG = 5 
       data hash MD5: 32K
       4F BF D9 FA E1 D6 59 11 98 D8 82 48 9E EE D1 8B>)
$$ ##END=
$$ 
$$ $$ hash MD5
$$ $$ 16 19 81 BC 1E 07 24 5A B3 70 0A 86 01 F6 0F 34
##$RELAX= 
##$RELAX= 
##$RELAX= 
##$RELAX= 
##$RELAX= 
##$RELAX= 
##$RELAX= 
$$ Bruker specific parameters
$$ --------------------------
$$ [...]
150 150 150 150 150 150 150 150
##$TP07= 0
##$TPNAME0= <>
##$TPNAME1= <>
##$TPNAME2= <>
##$TPNAME3= <>
##$TPNAME4= <>
##$TPNAME5= <>
##$TPNAME6= <>
##$TPNAME7= <>
##$TPOAL= (0..7)
0.5 0.5 0.5 0.5 0.5 0.5 0.5 0.5
##$TPOFFS= (0..7)
0 0 0 0 0 0 0 0
##$TUNHIN= 0
##$TUNHOUT= 0
##$TUNXOUT= 0
##$USERA1= <user>
##$USERA2= <user>
##$USERA3= <user>
##$USERA4= <user>
##$USERA5= <user>
##$V9= 5
##$VALIST= <valist>
##$VCLIST= <CCCCCCCCCCCCCCC>
##$VD= 0
##$VDLIST= <DDDDDDDDDDDDDDD>
##$VPLIST= <PPPPPPPPPPPPPPP>
##$VTLIST= <TTTTTTTTTTTTTTT>
##$WBST= 1024
##$WBSW= 4
##$XGAIN= (0..3)
0 0 0 0
##$XL= 0
##$YL= 0
##$YMAX_a= 455057
##$YMIN_a= -594312
##$ZGOPTNS= <>
##$ZL1= 120
##$ZL2= 120
##$ZL3= 120
##$ZL4= 120
##$ABSF1= 14.98509
##$ABSF2= -5.573092
##$ABSG= 5
##$ABSL= 3
##$ALPHA= 0
##$AQORDER= 0
##$ASSFAC= 0
##$ASSFACI= 0
##$ASSFACX= 0
##$ASSWID= 0
##$AUNMP= <proc_prof1d_extract_pilot.lims>
##$AXLEFT= 0
##$AXNAME= <>
##$AXNUC= <1H>
##$AXRIGHT= 0
##$AXTYPE= 0
##$AXUNIT= <>
##$AZFE= 0.1
##$AZFW= 0.1
##$BCFW= 0
##$BC_mod= 0
##$BYTORDP= 0
##$COROFFS= 0
##$CY= 15
##$DATMOD= 1
##$DC= 0
##$DFILT= <>
##$DTYPP= 0
##$F1P= 0
##$F2P= 0
##$FCOR= 0.5
##$FTSIZE= 32768
##$FT_mod= 6
##$GAMMA= 0
##$GB= 0
##$INTBC= 1
##$INTSCL= 1
##$ISEN= 128
##$LB= 0
##$LEV0= 0
##$LPBIN= 0
##$MAXI= 10000
##$MC2= 0
##$MEAN= 0
##$ME_mod= 0
##$MI= 0
##$NCOEF= 0
##$NC_proc= -8
##$NLEV= 6
##$NOISF1= 0
##$NOISF2= 0
##$NSP= 0
##$NTH_PI= 0
##$NZP= 0
##$OFFSET= 14.98509
##$PC= 1
##$PHC0= 183.2629
##$PHC1= 0
##$PH_mod= 1
##$PKNL= yes
##$PPARMOD= 0
##$PPDIAG= 0
##$PPIPTYP= 0
##$PPMPNUM= 2147483647
##$PPRESOL= 1
##$PSCAL= 4
##$PSIGN= 0
##$PYNMP= <proc.py>
##$REVERSE= no
##$SF= 400.02
##$SI= 32768
##$SIGF1= 0
##$SIGF2= 0
##$SINO= 400
##$SIOLD= 32768
##$SPECTYP= <>
##$SREGLST= <1H.CDCl3>
##$SSB= 0
##$STSI= 32768
##$STSR= 0
##$SW_p= 8223.68421052631
##$SYMM= 0
##$S_DEV= 0
##$TDeff= 65536
##$TDoff= 0
##$TI= <>
##$TILT= no
##$TM1= 0
##$TM2= 0
##$TOPLEV= 0
##$USERP1= <user>
##$USERP2= <user>
##$USERP3= <user>
##$USERP4= <user>
##$USERP5= <user>
##$WDW= 1
##$XDIM= 32768
##$YMAX_p= 455963536
##$YMIN_p= -729008
##$CURPLOT= <Network HP LaserJet P1505>
##$CURPRIN= <$Network HP LaserJet P1505>
##$DFORMAT= <normdp>
##$LAYOUT= <+/1D_H.xwp>
##$LFORMAT= <normlp>
##$PFORMAT= <normpl>
##$SURQMSG= 1
$$ End of Bruker specific parameters
$$ ---------------------------------
##NTUPLES= NMR SPECTRUM
##VAR_NAME=  FREQUENCY,     SPECTRUM/REAL,   SPECTRUM/IMAG
##SYMBOL=    X,             R,               I
##VAR_TYPE=  INDEPENDENT,   DEPENDENT,       DEPENDENT
##VAR_FORM=  AFFN,          ASDF,            ASDF
##VAR_DIM=   32768,         32768,           32768
##UNITS=     HZ,            ARBITRARY UNITS, ARBITRARY UNITS
##FACTOR=    0.250966925370066, 1,           1
##FIRST=     8223.43324360094, -16815,       -230130
##LAST=      0,             -80669,          -276550
##MIN=       0,             -729008,         0
##MAX=       8223.43324360094, 455963536,    0
$$ Real data points
##PAGE= N=1
##DATA TABLE= (X++(R..R)), XYDATA
$$ [...]
19479a59638m6923Q2242m6704A48159P9027f0061B37768Q7019a19792D2392K2181
19468F4573J11140b38184L4120b0690k09238D0099a128C999L70409a93224a8656
19456c12100h4745J1954k4320l06351A346b60316G4730f1734a4144j08732A99448
19444a9686A61002c35460B3461g8999m2627k42514c2403G547J9788a05491k72422
19433c77913a42175e5374o9726L7222p3488D3829b55921O5924j67946i7492l8430
19422a35922k68625d5935j47353l2576b8917A08961h2208a3565A02488i1961o8360
19411a60321B126L6024A7867b2630A06993b76642J12062g9246c3085C64509q7514
19400B76995a95006l8477b3571l32926a6063B4428P0504m6858f8589l7881A75815
$$ plain form
19479 -159638 -206561 -124319 -171023 148159 227186 -60061 237768 324787 -119792 42392 64573
19468 64573 175713 -238184 -204064 -20690 -229928 40099 -1128 3999 374408 -193224 -18656
19456 -312100 -84745 -72791 -97111 -403462 1346 -260316 74730 -61734 -14144 -122876 199448
19444 -19686 161002 -335460 23461 -78999 -121626 -364140 -32403 7547 27335 -105491 -377913
19433 -377913 -142175 -55374 -125100 -87878 -161366 43829 -255921 -189997 -357943 -97492 -135922
19422 -135922 -404547 -45935 -193288 -225864 -28917 108961 -82208 -13565 102488 -91961 -160321
19411 -160321 2126 38150 17867 -22630 106993 -276642 -164580 -79246 -33085 364509 276995
19400 276995 -195006 -233483 -23571 -356497 -16063 24428 94932 48074 -68589 -106470 175815
19388c43076G2938a55038O6752B75125b72072Q096M1814C74290A19860a09533
19377B90259f3634B83317a52821I6112f3088J9380n752j45941O6895r3131p26
19366b22363I3115b73370A4754a05117j58752h0226p0954B6202b58684k45000
19356e03684D07405a23957l1922q7744A38491b90714b3410o7945k5034d9176k20126
19345b69302A2367a93581A12710D3151J27615f3953j29640j52119A71467C4608
19334i745k01211g8470C5584J04943b18752P7869l5417A47932b84630R6389N4070
19323a34171M4267l0021A18369n7779a94734B1670B847a23965D37887e6518j2842
19312f9360l2480q8011C2706b72609j97227B3614a46890C3678C723c67818B7824
$$ plain form
19388 -343076 72938 -155038 -88286 275125 -272072 -263976 -222162 374290 119860 -109533
19377 290259 -63634 283317 -152821 96112 -63088 -43708 -49460 -195401 -128506 -221637 -222363
19366 -222363 93115 -273370 14754 -105117 -263869 -80226 -151180 26202 -258684 -503684
19356 -503684 407405 -123957 -155879 -243623 138491 -290714 -23410 -91355 -116389 -49176 -269302
19345 -269302 12367 -193581 112710 43151 170766 -63953 -193593 -345712 171467 34608
19334 -9745 -210956 -78470 35584 140527 -218752 -140883 -176300 147932 -284630 -188241 -134171
19323 -134171 -89904 -119925 118369 60590 -194734 21670 2847 -123965 437887 -56518 -69360
19312 -69360 -101840 -189851 32706 -272609 -469836 23614 -146890 33678 3723 -367818 27824
19300a60753f3131C25724e4979k46495I6463l6494e0203C93171a33381o4737f9537
19288C6931O1275d2858K1143L615k13884R5895A02724A2580b81520A36319b56335
19276f4787R104j12190k54470H1713C5017a71775A97342b02923I214a26635L3181
19265i3454A85245i6251G4270c2206j40935B1805L81447B00976b2838m45343a11425
19253b24816D6114b10761j013j7095B9347h0542G4165J29010b4050A37884F618
19241a0710E936f8272l7940j21544g8206F7365B4696g6190H9814a64015M3211
19230a20804j47591g299m3043J7683j88697F6123a07542B9690R4800a67411J8928
19219a48483j18611c4571l16814a37541j63620a25779L1206F9422h4332j12860
$$ plain form
19300 -160753 -63131 325724 -54979 -301474 96463 59969 -50203 393171 -133381 -198118 -69537
19288 36931 98206 -42858 -21715 -18100 -231984 -136089 102724 12580 -281520 136319 -256335
19276 -64787 -55683 -167873 -422343 81713 35017 -171775 197342 -202923 9214 -126635 -93454
19265 -93454 185245 -96251 74270 -32206 -173141 21805 403252 200976 -22838 -468181 -111425
19253 -224816 46114 -210761 -211774 -228869 29347 -80542 74165 203175 -24050 137884 6618
19241 -10710 5936 -68272 -106212 -227756 -78206 67365 24696 -76190 89814 -164015 -120804
19230 -120804 -268395 -7299 -50342 -32659 -221356 66123 -107542 29690 124490 -167411 -148483
19219 -148483 -267094 -34571 -351385 -137541 -301161 -125779 -94573 69422 -84332 -197192
19209a97192K4802j4159g1025A65851D7942A5083b05593d5498k19575f3262c497
19197b8707q6848I3063m4981h8500d2343A43819K637m9394J21974a77313k83628
19186d60941E2101h4957E8348R411J06821G1874b16076a5477k993A96227a31567
19174B30755a56872m9066e7225A89799f281A03002a02767A4767c87374f7641F6041
19162b12408h5248b2248C12972a69410P7138B32858r2664C5519b14532d8667n7663
19151a06330p9154j4946R9817l5476L9712j36006K7305f1488F4744J99850a0044
19139I8204a64050A07843a10586j61875F2580b59807c8152o6894L5572m7172J9134
19128i7512A36373c5491k73698j63923i2286j12093I9597a2576E478K48802O484
$$ plain form
19209 -197192 -172390 -186549 -71025 165851 47942 15083 -205593 -45498 -265073 -63262 -3497
19197 -28707 -115555 93063 48082 -88500 -42343 143819 146456 97062 219036 -177313 -460941
19186 -460941 52101 -84957 58348 67759 174580 71874 -216076 -15477 -18470 196227 -131567
19174 230755 -156872 -205938 -57225 189799 -6281 103002 -102767 14767 -387374 -67641 66041
19162 -212408 -85248 -22248 312972 -169410 -92272 232858 140194 35519 -214532 -48667 -106330
19151 -106330 -185484 -200430 -100613 -136089 -96377 -232383 -205078 -61488 64744 264594 -10044
19139 98204 -164050 107843 -110586 -272461 62580 -259807 -38152 -105046 -69474 -116646 -97512
19128 -97512 136373 -35491 -309189 -473112 -92286 -204379 99597 -12576 5478 254280 260764
19117B60764a42930B30798d1811j93516a12815l0226b9235A0162J04837a868B48664
19105a96897K6532A46748a30531M9313l63366a27856r9504A20877b43261I2067
19094A20137G460l342K82979a8226j81220h8606m3530q629e6217k15111f1533
19082a34330L7520j47893B1961h1764p2417G2126c82483E3893a31A91707B2684
19070F0583B9095K3065N9988h3038A7436a21723j61377m7499i1112r8489R2031
19059i7570A82420q0603c021A49873J44318a94278B01266e9141l97489e4591C1851
19047a29443j19107P9407M5642l87914d5521P294A01940a64825I6739H068a74512
19035a6447k40327a6225P510k56925J1667A08734J82992A41149J83522A7588P6422
$$ plain form
19117 260764 -142930 230798 -41811 -235327 -112815 -143041 -29235 10162 114999 -1868 248664
19105 -196897 -170365 146748 -130531 -81218 -444584 -127856 -227360 120877 -243261 92067
19094 120137 7460 4118 287097 -18226 -199446 -88606 -132136 -140765 -56217 -271328 -61533
19082 -134330 -96810 -244703 21961 -81764 -154181 72126 -382483 53893 -131 191707 22684
19070 60583 29095 52160 112148 -83038 17436 -121723 -283100 -330599 -91112 -189601 -97570
19059 -97570 182420 101817 -3021 149873 294191 -194278 201266 -59141 -456630 -54591 31851
19047 -129443 -248550 -169143 -123501 -511415 -45521 -38227 101940 -164825 96739 8068 -174512
19035 -16447 -256774 -16225 -8715 -265640 -253973 108734 291726 141149 324671 17588 94010
19024I4010K05039l5392l9495F8633K82947j59396b1750j3356j85711e5253A53504
19012e1153A75534N3398a41959E1168b74362E8248a6425n1624o5538O1139j24524
19001a96972O2373d5528C4348L9478f7757j77654A0491a00187A01733G547b93513
18989a38127m0293Q5929a9601k34787P3572A13218M11395a32651F0910b23509
18978a04678l0929L9256B48183b17870h8325D70856j98229J48476P3786C2961
18967A37296b96382A7928K54690l9299a27660A49660R8386b86117b6432l6766
18957f3198o8296n6533O7426o1768A36366a11605B41220A06634P1161a02486K5792
18946g6694k18097a08468I0771c55483A1956g7128A37922d2336q2275j8601O5797
$$ plain form
19024 94010 299049 263657 224162 68633 351580 192184 -21750 -35106 -220817 -55253 153504
19012 -51153 175534 228932 -141959 51168 -274362 58248 -16425 -68049 -133587 -72448 -196972
19001 -196972 -134599 -45528 34348 73826 -67757 -245411 10491 -100187 101733 7547 -293513
18989 -138127 -178420 -92491 -19601 -254388 -180816 113218 524613 -132651 60910 -223509
18978 -104678 -135607 -96351 248183 -217870 -88325 470856 272627 421103 494889 32961
18967 137296 -296382 17928 272618 233319 -127660 149660 248046 -286117 -26432 -63198
18957 -63198 -131494 -188027 -120601 -182369 136366 -111605 241220 106634 177795 -102486 -76694
18946 -76694 -294791 -108468 90771 -355483 11956 -77128 137922 -42336 -124611 -143212 -77415
18935g7415A017d7413G753K60914c98130J06696d0497F5232C1052c06200A64724
18923b80115a04997B29881c76406k1903E3242d617r1256B1016p077K9213f1101
18911A33322c02751C28368c1232F99101o4402k10418A1116L46550E3938a08325
18900c1590B43688o4047c94818a23493A82865b75416c8975H076J1928c4576k9058
18889f3634j43058A99027D2025A9926i3011j18579a3376k86049O859A08310J46320
18878B54630c68558B28444a91592I0039b2990j43854n363b5349B91525e6058K0978
18867c5080j01054D9543a20218H073J32227c3876F2098B419L10725A0156h635
18855a43990j3134A42239d4566A34749b466C60417d3603B2501a08894d6994K814
$$ plain form
18935 -77415 1017 -47413 7753 268667 -398130 -291434 -40497 65232 31052 -306200 164724
18923 -280115 -104997 229881 -376406 -398309 53242 -4617 -95873 21016 13939 43152 -61101
18911 133322 -302751 328368 -31232 699101 634699 424281 11116 357666 53938 -108325
18900 -31590 243688 179641 -394818 -123493 182865 -275416 -38975 8076 20004 -34576 -63634
18889 -63634 -206692 199027 42025 19926 -93011 -211590 -13376 -299425 -292566 108310 254630
18878 254630 -368558 228444 -191592 90039 -22990 -166844 -172207 -25349 291525 -56058 -35080
18867 -35080 -136134 49543 -120218 8073 140300 -33876 62098 2419 313144 10156 -8635
18855 -143990 -157124 142239 -44566 134749 -2466 360417 -43603 22501 -108894 -46994 -44180
18844d4180l01H4761b69780F4452c31663M0112A33653n0437a46784G8677a08944
18832A68806a08135H0591g3362g629k3120F6833b01076B4851f6732J1730j33836
18821a88838e172j41328j02990m2320C84533f6991l62946i133m01231C19310i9371
18809F7853J69037g6922B25533h1388j7456J862h508k55265d1383F2898b16743
18797c17935o4694a88652k56173b19412H1529a56164A90075C8704b11241O4074
18787a47167j16904P3398J7286N1751J3525L9813j04871A96923g8634l41337D5025
18775e75795C6270a3191A00865c5254k5383J4512Q536a5511A86395n7503c07044
18763b02706H3137a83272P6077H7721J2499b05418A57952c8895m14611a19772
$$ plain form
18844 -44180 -44481 84761 -269780 64452 -331663 -291551 133653 83216 -146784 78677 -108944
18832 168806 -108135 80591 -73362 -7629 -30749 66833 -201076 24851 -66732 -55002 -188838
18821 -188838 -5172 -146500 -249490 -291810 384533 -66991 -429937 -9133 -410364 319310 -99371
18809 67853 236890 -76922 225533 -81388 -98844 -96982 -8508 -263773 -41383 62898 -216743
18797 -317935 -382629 -188652 -444825 -219412 81529 -156164 190075 38704 -211241 -147167
18787 -147167 -264071 -190673 -173387 -121636 -108111 -68298 -173169 196923 -78634 -419971 45025
18775 -575795 36270 -13191 100865 -35254 -60637 -46125 -37589 -15511 186395 128892 -307044
18763 -202706 83137 -183272 -107195 87721 100220 -205418 157952 -38895 -453506 -119772
18752A88145a00325K297K6039A5639g4239B97308C495L77390b6171B27865a5855
18740b88760J38512j36141B41637b80611A80180Q926i1256K4821D7049b1213j55725
18729a76938A28474R1725C6851J74964i255j65097N9196L442F3679k3014K6926
18718F7591g9996A2343P9284g5002k31684J50210m8183j16676a9108j59669f6302
18706a09157K0130A29916f6067A0070e1840A64681E3977a02607B34084a16902
18695B01601i8917D1947J29127f9477O588A91476a53851j47225J26645J6111A834
18683c17481E4690d5556A41496J11504b2778j28334J6522i681j51052N7483H7034
18671C86942b83584J3248r1420O7893A1841g0832J9196f199k8665I7307n710g6738
$$ plain form
18752 188145 -100325 -98028 -71989 15639 -74239 297308 3495 380885 -26171 227865 -15855
18740 -288760 -150248 -286389 241637 -280611 180180 189106 -91256 -66435 47049 -21213 -176938
18729 -176938 128474 220199 36851 211815 -9255 -174352 -115156 -111714 63679 40665 67591
18718 67591 -79996 12343 91627 -75002 -306686 -156476 -204659 -321335 -19108 -178777 -66302
18706 -109157 -89027 129916 -66067 10070 -51840 164681 53977 -102607 234084 -116902
18695 201601 -98917 41947 171074 -69477 -62889 191476 -153851 -301076 -174431 -158320 1834
18683 -317481 54690 -45556 141496 253000 -22778 -151112 -134590 -9681 -160733 -103250 87034
18671 386942 -283584 -270336 -361756 -293863 11841 -70832 -51636 -6199 -34864 97307 91597 -76738
18658h4403k404A56635c1191A7220c02620a09173D0866H317J660b07231A72177
18646A63189o225p3534g1016j51796n0621g6179k45699a59514q0335C12066a43925
18634A82634a55621j39003f2685j41750e6657A09716J79454a3949j25637p6849
18624b16435m7350i2999b5906m0350B05379l8480A4898J41086b06933G5389J3477
18613H8866a44918A85144h7517I3517b57614J00707k14249H976N2299m400d36
18601c31545a09151A65589N8341b12262A45033e7224D6897b70291A77210a80824
18590i9879a6609I9351f9560B20297A0574d4856A71481a50732E2658a9632A65786
18578A82959a45172A96847J5907d16186a57349M1276r9217O8548L2311L8471G1821
$$ plain form
18658 -84403 -86807 156635 -31191 17220 -302620 -109173 40866 8317 9977 -207231 172177
18646 163189 156964 83430 -71016 -222812 -273433 -76179 -321878 -159514 -239849 312066 -143925
18634 182634 -155621 -294624 -62685 -204435 -56657 109716 289170 -13949 -139586 -216435
18624 -216435 -263785 -92999 -25906 -66256 205379 166899 14898 155984 -206933 75389 88866
18613 88866 -144918 185144 -87517 93517 -257614 -156907 -371156 8976 61275 56875 -436
18601 -331545 -109151 165589 223930 -212262 145033 -57224 46897 -270291 177210 -180824
18590 -99879 -16609 99351 -69560 220297 10574 -44856 171481 -150732 52658 -19632 165786
18578 182959 -145172 196847 212754 -416186 -157349 -116073 -215290 -146742 -114431 -75960 71821
18566e2257a6807k2803l11820a68582B05722c99450i5367j56878F8041g5959J1813
18555f4146k27483A84172f5396D3293b920m4527k31713C7531e7422O843a3724
18543b0743j7641j15474A01512k1716a85788d7958j5079B9713j4312L9545b00624
18531a18006O976a2030A98619a12508o1921E6045a79777B69351a42677G5980M0822
18520A16802E5307f2284D2561a09178k41715A1687B339e2603m4884A11761f9507
18508C9292b10908B36243b00562M051i8231p3342E2266K2608e064o9670o5111
18497a39845n1614E8667d9248F118J13541f8A97136A6934P445d2214j98715J14061
18485a26868N3696l94407a93485j1944D9293d6434q2744j54849B89312d18882
$$ plain form
18566 -52257 -16807 -39610 -351430 -168582 205722 -399450 -95367 -252245 68041 -75959 -64146
18555 -64146 -291629 184172 -65396 43293 -2920 -47447 -279160 37531 -57422 -50579 -13724
18543 -20743 -38384 -153858 101512 79796 -185788 -47958 -63037 29713 15401 54946 -200624
18531 -118006 -111030 -12030 198619 -112508 -174429 56045 -179777 269351 -142677 75980 116802
18520 116802 55307 -62284 42561 -109178 -350893 11687 2339 -52603 -97487 111761 -69507
18508 39292 -210908 236243 -200562 -196511 -98231 -171573 52266 74874 -5064 -74734 -139845
18497 -139845 -191459 58667 -49248 6118 119659 -68 197136 16934 24379 -42214 -240929 -126868
18485 -126868 -73172 -467579 -193485 -205429 49293 -46434 -129178 -284027 289312 -418882
18474c01904F9542b38477A38895b21278I6876a33942C25578j53604c05822R3751
18464b12071D855c36385A91627d9216A5560J7032h8042A77276a81972O6672e0556
18452b26587B6204K62117c61386B67735D6810b85578a35579d5820n887j96432
18442b48139H0096J64204d4046J1689j64101C4552P2072a86844A0390K03084a54287
18430H6569i9333k68206e7972j61476g0882j3276M1852F9582r766K5555a50987
18418a81816B07696B4766L63720a01557l7549j29538Q9338M98B82998b33527k0886
18407b54413G8102i8813j96828a43636n644B39469L9569b56792B8368K4739e2064
18395a57898B88815b52402G1659J48141a52814A42800b56242a831j68977A07361
$$ plain form
18474 -301904 69542 -238477 138895 -221278 96876 -133942 325578 171974 -305822 -212071
18464 -212071 4855 -336385 191627 -49216 15560 32592 -88042 177276 -181972 -115300 -50556
18452 -226587 26204 288321 -361386 267735 46810 -285578 -135579 -45820 -51707 -248139
18442 -248139 80096 244300 -44046 -32357 -196458 34552 106624 -186844 10390 213474 -154287
18430 86569 -99333 -367539 -57972 -219448 -70882 -84158 -42306 69582 59816 85371 -150987
18418 -181816 207696 24766 388486 -101557 -139106 -268644 -179306 -178808 282998 -233527 -254413
18407 -254413 78102 -98813 -295641 -143636 -149280 239469 279038 -256792 28368 53107 -52064
18395 -157898 288815 -252402 71659 219800 -152814 142800 -256242 -1831 -170808 107361
18384F0796J04228b81766a9867j76002E8612d9152G1558a34567l7781K5295A53843
18372d86290h8783o9889A31945h7814k324B59867a94892q4551e2798B4318b21177
18360A26666J73841c80386f3719l32581d6943H9K11859a28526D98a14291o6795
18349a81086A7546J13437d2802H1070a86801F6099L1234c3164a0228b705H067
18337c26997J19312Q8523h839A8138P8844J55734H3829a25776A7465q416d2779
18325a79796f4990C34686a40262O6313k33100A06568Q3320e0448q4896K5152j94013
18314c04205Q3796k40721D7181J17622i0208A40327J6811j3977M0078b08846a1875
18302A05691b02420f7445j30454j50124h2404A52933b31731D29717c6350k79641
$$ plain form
18384 60796 165024 -281766 -19867 -195869 58612 -49152 71558 -134567 -172348 -147053 153843
18372 -486290 -88783 -158672 131945 -87814 -90138 259867 -194892 -279443 -52798 24318 -221177
18360 126666 300507 -380386 -63719 -396300 -46943 89 211948 -128526 498 -114291 -181086
18349 -181086 17546 130983 -42802 81070 -186801 66099 97333 -33164 -10228 -2705 8067
18337 -326997 -207685 -119162 -8839 18138 96982 252716 83829 -125776 17465 9049 -42779
18325 -179796 -64990 334686 -140262 -73949 -307049 106568 189888 -50448 -135344 -110192 -304205
18314 -304205 -220409 -461130 47181 164803 -90208 140327 157138 143161 183239 -208846 -11875
18302 105691 -202420 -67445 -197899 -348023 -82404 152933 -231731 429717 -36350 -315991
18292c15991J09971E7993b16251C03977a88856j1204A56313c95175A38856F0668
18281a96598A19535L8608b49349k5925F8736k900a25449G3229e411C2739a38940
18269C5520d11554B64723c91782c6019A47645c13293c9644k31026c5135a6591
18258b13977l6122O9206E5585R3264a50447j98660a3684j30826O8043A84165L4005
18247B18170h9873A55677b56418J11070A77914a7903k81541B3548a92879h8712
18236C77983a75119A99723a8752B5818a14493E3580g7793c0690H372a19695j97991
18225c17686Q9144A56409c00235R0565P82j72531A96163a45355A5384b5481B00426
18213h9133j84668A4933c27451B75787h884p9006j04425B11092d33137J62848
$$ plain form
18292 -315991 -206020 57993 -216251 303977 -188856 -200060 156313 -395175 138856 60668
18281 -196598 119535 158143 -249349 -275274 68736 65836 -125449 73229 -5411 32739 -138940
18269 35520 -411554 264723 -391782 -36019 147645 -313293 -39644 -270670 -35135 -16591
18258 -213977 -250099 -180893 55585 148849 -150447 -349107 -13684 -144510 -76467 184165 218170
18247 218170 -89873 155677 -256418 -145348 177914 -17903 -299444 23548 -192879 -88712
18236 377983 -175119 199723 -18752 25818 -114493 53580 -77793 -30690 8372 -119695 -317686
18225 -317686 -228542 156409 -300235 -209670 -208888 -381419 196163 -145355 15384 -25481 200426
18213 -89133 -273801 14933 -327451 275787 -8884 -87890 -192315 211092 -433137 -270289
18203b70289F4663M0287D9439a09650I2855L7447c8113j85165A6463a07961A48644
18191a41370B88435A14773L5823k4529l8545B7857b30927A73672C8283R5636k3836
18180A10083C2218c81876E3935K58179E3030a80596B36461M7932a07525L9723
18170f7802p6927C62313i530H1142c1532k0501G5206a69058D3536M5756a8933
18158b79176e817A03835C8130j6257K5698g0498J2716A2202c5921j60568j68308
18147c64797a57257k23390A9746J25881K0281i7864A84662i554j42264L1266a4718
18135A6117N4841a07749D05189b15430Q5281n9931N5291Q202B1201Q5973d9712
18123G6544a15559D3284b8883j28988A17636J81379j21271a16221k26815B7779
$$ plain form
18203 -270289 64663 104950 49439 -109650 92855 130302 -38113 -223278 16463 -107961 148644
18191 -141370 288435 114773 150596 126067 87522 27857 -230927 173672 38283 133919 110083
18180 110083 32218 -381876 53935 312114 53030 -180596 236461 284393 -107525 -67802
18170 -67802 -144729 362313 -9530 81142 -31532 -52033 75206 -169058 43536 89292 -18933
18158 -279176 -5817 103835 38130 21873 47571 -70498 -57782 12202 -35921 -196489 -364797
18147 -364797 -157257 -380647 19746 145627 165908 -97864 184662 -9554 -151818 -120552 -14718
18135 16117 70958 -107749 405189 -215430 -130149 -190080 -134789 -126587 21201 107174 -49712
18123 76544 -115559 43284 -28883 -157871 117636 299015 177744 -116221 -343036 27779
18112A33574a00490J0124n2846B91476e3929j08153A7011c6677G7230a42463k228
18101a44691e7514k03499a17410G0933J74893c95768B15198f2728j5076r0138
18091a67942A03146P8745a56178C8479i0140C0445M0432a19615b7172A44404a30394
18079h2227C8362e6160j21560j10048J36626B98627A8240c83505a61327B21914
18068A45108b7004a2243j33745F5367b7032D1404L19375b48304J19889J3396A6916
18056A70416b77554E5680A4259K3076J52006a81413L5649C49730e1163p7778M8252
18045h0689a1994A69574k6268a38396C5750a64838A76415M4009k0083m8474L6984
18034A88851e5417A936Q1378J05298a33399K4762i102C23332p0673A3474a3284
$$ plain form
18112 133574 -100490 -90366 -143212 291476 -53929 -162082 17011 -36677 77230 -142463 -144691
18101 -144691 -57514 -261013 -117410 70933 245826 -395768 215198 -62728 -77804 -167942
18091 -167942 103146 181891 -156178 38479 -90140 30445 70877 -119615 -27172 144404 -130394
18079 -82227 38362 -56160 -177720 -287768 -151142 298627 18240 -383505 -161327 221914
18068 145108 -27004 -12243 -145988 65367 -27032 41404 360779 -248304 -128415 -115019 16916
18056 170416 -277554 55680 14259 37335 189341 -181413 -145764 349730 -51163 -128941 -80689
18045 -80689 -11994 169574 143306 -138396 35750 -164838 176415 220424 200341 151867 188851
18034 188851 -55417 1936 83314 188612 -133399 -108637 -9102 323332 252659 13474 -13284
18022h8246L4208J8898k55359e0843a896j34056N9710a8905A64935m9755a28391
18010A98878d9330B71151B849P8345a12093A00173A9767J89366B2405a66412B44777
17998e9532D34643b07736C8869b01710q4241C2386a09388j05375E3619b34A20901
17986H8985h4061A92075N6688H7496f8643A07379a33387A03571K4079d04569a66472
17974b51483f1048A56915b32270Q8891k77691A42979N921a01346B15803c18741
17963b7606m6827r1745p6137b7536j12713A72791g3336n7286o1009A6817K1147
17952C7964j3456b42444J04710J3576A85099d5991A76564P2092A09737k268l0396
17941G7073j0874K84653D7342J05907g5911J5709n4810A6766a41232A14668J77446
$$ plain form
18022 -88246 -54038 -35140 -290499 -50843 -1896 -135952 -76242 -18905 164935 115180 -128391
18010 198878 -49330 271151 2849 81194 -112093 100173 19767 209133 22405 -166412 244777
17998 -59532 434643 -207736 38869 -201710 -285951 32386 -109388 -214763 53619 -234 120901
17986 88985 -84061 192075 248763 87496 -68643 107379 -133387 103571 127650 -404569 -166472
17974 -251483 -61048 156915 -232270 -143379 -421070 142979 148900 -101346 215803 -318741
17963 -27606 -74433 -166178 -242315 -27536 -140249 172791 -73336 -130622 -191631 16817 37964
17952 37964 24508 -242444 -137734 -124158 185099 -45991 176564 248656 109737 107469 77073
17941 77073 66199 350852 47342 153249 -75911 -60202 -115012 16766 -141232 114668 292114
17930B92114A35764n5804A1694B100K03218a02960B89220q7590j4063a65454B31173
17918i6119K5566C69381e3011a378B06592E7051a13468A33024a3806A46641B2094
17906a36037d032k25838h9522E6921b344k71532f7985q6451j06652g3397k4147
17895i7544A19332K7200f6431m8223b1639B03903e7051C03938a44843A63816A7642
17883A30579J79392A30491l6954J98559A22189K6279a06004B46305a10693A80704
17872A34222l7438D8110R351d4028A47237K66347F4237b74208d8720D7801L8712
17861H6513K2475n4236g8113j57592E03785a31299B06570e8750I1835D4326Q8264
17850A32590A6109a19600H0613a16821A4024e4878i81n3363k2578A10885n2153
$$ plain form
17930 292114 135764 79960 11694 2100 205318 -102960 289220 201630 187567 -165454 231173
17918 -96119 -70553 369381 -53011 -1378 206592 57051 -113468 133024 -13806 146641 22094
17906 -136037 -4032 -229870 -89522 56921 -2344 -273876 -67985 -154436 -261088 -73397 -97544
17895 -97544 119332 146532 -66431 -114654 -21639 203903 -57051 303938 -144843 163816 17642
17883 130579 309971 130491 93537 292096 122189 148468 -106004 246305 -110693 180704
17872 134222 96784 48110 57461 -44028 147237 413584 64237 -274208 -48720 47801 86513
17861 86513 108988 54752 -78113 -235705 503785 -131299 206570 -58750 91835 44326 132590
17850 132590 16109 -119600 80613 -116821 14024 -54878 -981 -54344 -76922 110885 58732
17839E8732a53135K1164H0957a77715Q4042j37201R0067A48401a04374d0221k33701
17828b73922a2967A0744c48000A20670f1524j55372A3025K14320n1792J28352
17818C03905C5752J62861q0255h3054C66154G0132K17220a61440A15574A5069
17807d6690k42250A11113K28039b53508f4086C06305a15489B27483D0135j4367
17797B5768J87405b43360m2349A31447e1662B286h6870G1646A8589J48490J19441
17786B86520A07797O8154j9120a36048A65616L030d8985B40793M22c7938l2391
17775g0329G6374D891L90715F7318e4978A68285J92281j52597K17320A42505E2643
17763F2204M2544b34869C1304a23233f0377B72034a33473H4338K6138a05870A09739
$$ plain form
17839 58732 -153135 -131971 80957 -177715 -93673 -230874 -140807 148401 -104374 -40221 -273922
17828 -273922 -12967 10744 -348000 120670 -61524 -216896 13025 227345 175553 303905
17818 303905 35752 198613 118358 -83054 366154 70132 287352 -161440 115574 15069
17807 -46690 -288940 111113 339152 -253508 -64086 306305 -115489 227483 40135 25768
17797 25768 213173 -243360 -285709 131447 -51662 2286 -86870 71646 18589 167079 286520
17786 286520 107797 175951 156831 -136048 165616 168646 -48985 240793 241215 -37938 -70329
17775 -70329 76374 4891 395606 67318 -54978 168285 360566 207969 425289 142505 52643
17763 62204 104748 -234869 31304 -123233 -60377 272034 -133473 84338 110476 -105870 109739
17751g2754j89432C7797c15429Q1727B79714A38662a28074B4944f2685B60238
17740C15672A40959B4704L00547J30024I2582g16j22960B45895g9371l2620A14432
17728A36763A9777R901J05414b33305H3962j4152e4125I9927C5629J02787K64910
17717D03326a29530A9255e1686A10094h1042A4919M87883A90623c33561I2350
17706e6323j16440A99116f5474J3025p1653A0675J60258B1597N4375a18046C02558
17694F3456e1603G1843d2362G1701l458Q0369P9260o7939d6712B9046J43687O8008
17682B40741J02383E6399K25662J31565b5193B4998b85542B38891q7917E6464
17671a65635f4864K2931G2166N6629L4066L23117c4511A20778R8162L06645k30369
$$ plain form
17751 -72754 -262186 37797 -315429 -233702 279714 138662 -128074 24944 -62685 260238
17740 315672 140959 24704 325251 455275 92582 -716 -123676 245895 -79371 -111991 114432
17728 136763 19777 29678 135092 -233305 83962 69810 -54125 99927 35629 138416 403326
17717 403326 -129530 19255 -51686 110094 -81042 14919 502802 190623 -333561 92350
17706 -56323 -172763 199116 -65474 -52449 -124102 10675 170933 21597 75972 -118046 302558
17694 63456 -51603 71843 -42362 71701 68243 148612 227872 159933 -46712 29046 172733 240741
17682 240741 343124 56399 282061 413626 -25193 24998 -285542 238891 150974 56464
17671 -165635 -64864 -41933 72166 128795 162861 485978 -34511 120778 218940 525585 295216
17660B95216G6543R9643k7345O740c1674j7880C53103A72832a86282h6177k1411
17649a07588A40654o4805J28172h6581h5C20332K3371B8910q558J74776K14524
17638D09652j80025H9959B3209a61079B02859h29A62675b63730a27073C83737
17627a7729A7635J47007a70984g902k05368c94A10818O9823P1996A05430K12589
17616C18019j25361a1896A71944K7151F8893j3982B5669J47046L70751k9522a67588
17604a39021A54015R0185K7852a17469d9232A25706b26789A31203h8274D4242
17593B47159k8474J00888E7729K19606L8431A50138o6898J68540d20762J22881
17583b97881B52931O492J0228A682g4285C29017H9686i1781C88203A52130Q4034
$$ plain form
17660 295216 76543 176186 148841 155581 -31674 -49554 353103 172832 -186282 -86177 -107588
17649 -107588 140654 75849 204021 -86581 -85 320332 343703 28910 20352 195128 409652
17638 409652 229627 89959 23209 -161079 202859 -829 162675 -263730 -127073 383737
17627 -17729 17635 164642 -170984 -7902 -213270 -394 110818 180641 252637 105430 318019
17616 318019 192658 -11896 171944 199095 68893 54911 25669 172715 543466 513944 -167588
17604 -139021 154015 244200 272052 -117469 -49232 125706 -226789 131203 -88274 44242
17593 247159 218685 319573 57729 277335 315766 150138 83240 251780 -420762 -297881
17583 -297881 252931 259423 269651 1682 -74285 329017 89686 -91781 388203 152130 236164
17572B36164p92a5675k8138J7409A88161c43757A75856a72872A01618P882q138
17561A01362b60502B90145A26719M19171H5421g2710A04908l4967K55438j9402
17551C05977o0592o0178K24387I5399J52789J05144C1609J32167e3977C84573
17540H5064J56728G606c3019A16932K88231E7377M6873D8109P3148L52180j58029
17529C15408J97988k02292M24170j01599L06716K26351J93685o74530j16777J07604
17519F76724k39141R7961j50552O498O9447l1600k13163K51342l2168L93959J3802
17508H43109K25354L05077m75035l86611J4374j79885o448j18950L0871A19087
17497F48392A08443J70557j0058a9425B13278K14605j54981l1442L57473o6697
$$ plain form
17572 236164 235372 -15675 -43813 -26404 188161 -343757 175856 -172872 101618 109500 101362
17561 101362 -260502 290145 126719 545890 85421 -72710 104908 69941 325379 305977
17551 305977 245385 185207 409594 95399 248188 353332 31609 163776 -53977 384573
17540 85064 241792 7606 -33019 116932 405163 57377 104250 48109 121257 473437 315408
17529 315408 513396 311104 735274 633675 940391 1166742 1360427 685897 569120 676724
17519 676724 437583 535544 384992 391490 460937 429337 216174 467516 435348 829307 843109
17508 843109 1068463 1373540 898505 511894 526268 346383 339935 220985 251856 119087
17497 648392 108443 279000 268942 -19425 213278 427883 272902 241460 598933 532236
17487E32236b7657D69115j88843O6034D0109J2438M07393J56929B11816K72354
17477D84170j31023J9184I1079K96157A84259G6323J88305A24188K42327J53648
17467E20163B5560j2217J84211F3450L57805A86400J93629p9772A30462J97269
17457C27731A15164J49598K09236A33199J04717H9357R0372L72226k11519l2947
17447C07489R4905j12923K97042p6770k8729r5002l2049j24844k3172J30433J14141
17436D50521J35703k63561j3550L15996a83005C16004A10581j1431J90548R0492
17426C80190C5520J05428J19342O0074L7949J30566B30033J09318N2003J0610
17416D01964j76520K2080o2776J00242J79851m537C6932M04894q269j61217M4679
$$ plain form
17487 532236 -27657 469115 280272 346306 40109 52547 459940 616869 211816 484170
17477 484170 353147 372331 91079 387236 184259 76323 264628 124188 366515 520163
17467 520163 25560 13343 197554 63450 421255 186400 380029 300257 130462 327731
17457 327731 115164 264762 473998 133199 237916 89357 179729 551955 340436 307489
17447 307489 402394 289471 586513 509743 481014 386012 353963 229119 205947 336380 450521
17436 450521 586224 322663 309113 625109 -183005 316004 110581 99150 289698 380190
17426 380190 35520 140948 260290 320364 358313 488879 230033 339351 391354 401964
17416 401964 225444 247524 184748 284990 464841 460304 36932 441826 433557 272340 317019
17405C17019A06910L33158j2497K3264A24694d9824g913A28962M0721K45057M8948
17394D63688a02418B03582L19349j60399f3417A23730j5560K68683c1294B49935
17383D52288j86966m0327E572K22050f9704B61851J8923m2924L37987d8844B41130
17371B54994J09232P3746A91918N9188m6362K42578j18274P3040N383A97702B6491
17359A98450k7317l016J46450J84192A56483L2713K14414o3919A17178M11103
17349E28281I7702K79355r2321j15598C2786J88027N8189a6127A75981J17814
17339B93795O3261j09954J90814a32504A46564P0133q2203m1984M10148j92924
17329C09734p59P3799A86085P6428O9465J4848A63114N35938j86616B47117a33504
$$ plain form
17405 317019 106910 440068 427571 450835 124694 -49824 -7913 128962 169683 414740 463688
17394 463688 -102418 203582 522931 362532 -63417 123730 108170 376853 -31294 249935
17383 452288 265322 224995 5572 227622 -69704 261851 280774 237850 575837 -48844 241130
17371 254994 364226 437972 191918 251106 204744 447322 329048 402088 407471 197702 26491
17359 198450 171133 168117 314567 498759 156483 189196 403610 339691 117178 528281
17349 528281 97702 377057 284736 169138 32786 220813 279002 -16127 175981 293795
17339 293795 357056 247102 437916 -132504 146564 216697 134494 92510 502658 309734
17329 309734 308975 382774 186085 262513 331978 346826 163114 699052 512436 247117 -133504
17317C60451q8303J0429J15162j52574A14264K91787j86297J21942J07961n1164
17307C98493j21209G3039K86320A46666a45350C26086O4844j63560M5731D4652
17296C09428j2052R6064r7284J02998j6330L6569m9481O186j25598J63416P9759
17285D93675j95379a18605C10980n1997n0409a89091O0510A17353O7509C9269
17274C43593q2677J13745j05804J81234j69576p4813J42257a21125C27379P0701
17264C98080A82741J79804j60842K50021J37278B26063N16669l03254J21094k75020
17254B85552A05834L63310j66604K28522j6704I9094J83647m9586J93752D8826
17243B29766m707L6986I703J94786L46632B26940K02156j37187o3604L9502n856
$$ plain form
17317 360451 272148 282577 397739 245165 114264 406051 219754 341696 449657 398493
17307 398493 277284 73039 359359 146666 -145350 326086 390930 227370 273101 44652
17296 309428 297376 393440 296156 399154 382824 419393 369912 376098 250500 413916 493675
17285 493675 298296 -118605 310980 258983 208574 -189091 -128581 117353 184862 39269
17274 343593 260916 374661 268857 450091 280515 205702 347959 -121125 327379 398080
17264 398080 182741 362545 201703 451724 589002 226063 742732 439478 560572 285552
17254 285552 105834 469144 302540 531062 514358 99094 282741 233155 426907 48826
17243 229766 225059 262045 9703 204489 551121 226940 429096 291909 228305 267807 261951
17232B61951M64724q7868A23943M2910J75376I4214O07141B48207K67187A51596
17221E78758k32269M4989j90351a3870B04678j9699h9641B79895K9605n7912L01840
17210E53428j40867L5733q6421q3865G9483J07160L68390A20915K76675R3545
17200D91135r9649j17684L73450A23667O81045C85250J91943j42225j17054K02915
17190E20829A396K10605J80485j76846I9368M61211r0780A44493N18739O2903
17180G26135k44788j02083J21732Q8186k05728L9613M1686J8020Q1639O2896a7495
17168D60374j29024N6492j49993J30155J72382A76875K35483j75713L18160j14470
17158D40335R2997n3706j24979r5655R4856A32732L96880j05466o9727O4299q1117
$$ plain form
17232 261951 726675 638807 123943 166853 342229 94214 701355 248207 515394 151596
17221 578758 346489 391478 201127 -13870 204678 184979 -89641 279895 309500 251588 553428
17210 553428 412561 448294 361873 278008 79483 186643 555033 120915 397590 491135
17200 491135 391486 273802 647252 123667 804712 385250 577193 434968 317914 520829
17190 520829 1396 212001 392486 215640 99368 560579 469799 144493 663232 726135
17180 726135 481347 379264 500996 589182 383454 423067 464753 482773 564412 627308 -17495
17168 460374 331350 387842 237849 368004 540386 176875 412358 236645 554805 440335
17158 440335 533332 479626 354647 258992 353848 132732 529612 424146 354419 418718 337601
17147C37601L96641M7403l62062j83067L80103m7236L9105j45319R3364j70941
17137C85592M16380A69138N12059C08568K33753j5678n838j19320K01424p5882
17127E27027l5937J35818p8537o9630j72194M62435l47910J9597J12027M2163
17117E94859k5307j53779K97138C53192n8595L03211j35179L72009B20654L08355
17107E29009K08638l43502K88035L5438j97916M61024l34441J43114j54571j22959
17097E11869j34077J58602k4131N1506K0156K11138l82072P8281M56890k21770
17087G26392j08469J57965j34029K63313p9036j99204K30097j26604r3506M7321
17077F84240o8572J21795k1748J45157k3262j51663l29236N81056j94791k51021
$$ plain form
17147 337601 734242 781645 419583 236516 616619 569383 608488 463169 556533 385592
17137 385592 801972 169138 681197 308568 542321 526643 520805 401485 602909 527027
17127 527027 491090 626908 548371 478741 306547 768982 421072 440669 552696 594859
17117 594859 569552 415773 712911 353192 294597 597808 462629 834638 220654 529009
17107 529009 737647 394145 682180 717618 519702 980726 646285 789399 634828 511869
17097 511869 377792 536394 512263 563769 583925 795063 412991 491272 948162 726392
17087 726392 617923 775888 641859 905172 826136 626932 857029 730425 636919 684240
17077 684240 615668 737463 715715 860872 837610 685947 356711 937767 742976 491955
17067D91955K51797k35324J80706J75956k55648K19349C57570N24909J7816j26411
17057G73884l29285L04677j95724M47308m91596K79157k39256K45854q462J77638
17047I64195k50006J78254K45570m74997K49146k12181Q8691O7257O9754l13078
17037F12605K60817m7965l39L23235k79473r7585K10461j6590j22918Q4355l00048
17026F26555K12765J96712l77360M21745k14969l56758M85903k29518R9950L35165
17016A200190l07452m587P8880k61982L63259j34326o9519K05527L13317k47138
17006A136169J41520m15639l2556L30091j08894J09497q3851R2129J00575k56144
16996A012897K41877m55947K79362j383K12889Q471j9768n9064j79261J58962
$$ plain form
17067 491955 743752 508428 689134 865090 609442 828791 357570 882479 900295 773884
17057 773884 444599 749276 553552 1000860 509264 788421 549165 795019 786557 964195
17047 964195 714189 892443 1138013 663016 912162 699981 788672 855929 925683 612605
17037 612605 873422 825457 825118 1148353 868880 771295 981756 965166 842248 926603 626555
17026 626555 839320 1036032 658672 1080417 865448 508690 994593 765075 865025 1200190
17016 1200190 892738 888151 967031 705049 1068308 933982 864463 1069990 1383307 1136169
17006 1136169 1277689 862050 829494 1159585 1050691 1160188 1076337 1168466 1269041 1012897
16996 1012897 1254774 798827 1078189 1076806 1289695 1298166 1278398 1219334 1040073 1199035
16986A199035p7045K4387l2931K59957j84891l2260j9470P9124k60941L56508
16976A311473J32368k18141k3342J18300K93467j04911J51580l37771K9085K63760
16966A615868l71385K21479L20186m59202Q6599J25036k10243o9063M12546q3278
16956A588543L6391m42607N22753o18850K72725Q5311L61687l2043k17034M00845
16946A957721l18001q7601K85036k85468J41311J15314l25598M67521j10687q0437
16936A759111L31602l01539l54138K86679L80551l74191J74857J52087m52015
16927A603004M87143r2576l12462M13300n11628P95896n43235J19405p8546j3034
16917A867267O4000K9609M60342j78602k0831n4680J27387l9305J28263j6056
$$ plain form
16986 1199035 1121990 1146377 1113446 1373403 1188512 1156252 1136782 1215906 954965 1311473
16976 1311473 1443841 1225700 1202358 1320658 1614125 1509214 1660794 1323023 1352108 1615868
16966 1615868 1244483 1465962 1786148 1326946 1413545 1538581 1328338 1259275 1671821 1588543
16956 1588543 1624934 1182327 1705080 1086230 1358955 1444266 1805953 1773910 1556876 1957721
16946 1957721 1639720 1552119 1837155 1551687 1692998 1808312 1482714 1950235 1839548 1759111
16936 1759111 2090713 1789174 1435036 1721715 2102266 1728075 1902932 2055019 1603004
16927 1603004 2090147 1997571 1685109 2098409 1586781 2382677 1839442 1958847 1880301 1867267
16917 1867267 1931267 1960876 2421218 2242616 2221785 2167105 2294492 2255187 2383450 2367394
16907B367394K73197m11589l6926L11492j43837M01488j33730M02151k91401k1944
16897B716295N8043l47506M32744m2159r911k08355O3368J41173j52667L49736
16887C000761l26096O13644m00343N5610L31260j33723J45438l09434J18495J49833
16877C245445J99896k65156J17K35231J70728k81272L7700L84522p582k57027
16867C462602M81336k74695N97103l4410l83865M54277k80620J94881J4901J17089
16857D348599n1709L16253k08536p5818M52054j42669J14243J43579R1637K16726
16847E204359k25195N62785n41042M17645j93296N48480j93864l27503L36380
16838E588749N28715n7925l43103L58742j73065J22533J90075j46187L65649J70319
$$ plain form
16907 2367394 2640591 2229002 2192076 2503568 2359731 2761219 2627489 3029640 2738239 2716295
16897 2716295 2774338 2426832 2859576 2817417 2807506 2599151 2662519 2803692 2651025 3000761
16887 3000761 2674665 3288309 2887966 2943576 3274836 3141113 3286551 2977117 3095612 3245445
16877 3245445 3445341 3180185 3180302 3415533 3586261 3304989 3342689 3727211 3719629 3462602
16867 3462602 3943938 3669243 4266346 4231936 3848071 4302348 4021728 4216609 4231510 4348599
16857 4348599 4296890 4613143 4404607 4328789 4780843 4638174 4752417 4895996 4987633 5204359
16847 5204359 4979164 5541949 5000907 5418552 5225256 5773736 5579872 5252369 5588749
16838 5588749 6117464 6059539 5716436 6075178 5902113 6024646 6214721 6068534 6434183 6604502
16828F604502K10254K8078J38541j6215O40355k44200M76051n0398L19660j43061
16818G963567L49383o1524L3951M44869N802L80875j658L81586m2196L75994L28046
16807A0158695P4267K03713m5010L33033L47497m3761O57487L45609J7510J84572
16797A2233612N77107J25431L22045M23431K5537O77585K66870j15173O29080
16788A5165525N67342K69180N67965Q1707M77054P53800L54201N23249L75356
16779A9135379Q22850K25384P87812K69621J064039N55710O94472N58526J122477
16770B5236270P40815K03359J528385L44460J436890O24073P49295J051605O33156
16761C2548308J388715R74788J517487J262789J546306J259157J360363J494181
$$ plain form
16828 6604502 6814756 6842834 6981375 6965160 7605515 7361315 7837366 7786968 8106628 7963567
16818 7963567 8312950 8251426 8285377 8730246 8736048 9116923 9115265 9496851 9454655 9830649 10158695
16807 10158695 10232962 10436675 10391665 10724698 11072195 11028434 11685921 12031530 12049040 12233612
16797 12233612 12810719 12936150 13258195 13681626 13707163 14384748 14651618 14536445 15165525
16788 15165525 15732867 16002047 16570012 16651719 17128773 17882573 18236774 18760023 19135379
16779 19135379 19958229 20183613 20971425 21241046 22305085 22860795 23555267 24113793 25236270
16770 25236270 25977085 26180444 27708829 28053289 29490179 30114252 30863547 31915152 32548308
16761 32548308 33937023 34911811 36429298 37692087 39238393 40497550 41857913 43352094
16753D3352094J602173J879554J473519J627812J752440J956885K191356J789662
16745E7625495K336396K185604K396800K185197K080095K601744K501116K648388
16737G6560835K521902K556718K285596L030632K378706K667249K159443K558712
16729I6719793K251270J909030J948978K008411J419871J812974M41129J043218
16721A09554674L67123P91304j02390J3980j094176o24257j151635j164153j839381
16712A04751089j742157j722909k204349j957529k708976k214848k613088k708906
16704H6878327k514385k810607k349477k757145k609935k531563k425494k120149
16696F6759572k348910k283144k688049j850567j755407k159817j846154j963702
$$ plain form
16753 43352094 44954267 46833821 48307340 49935152 51687592 53644477 55835833 57625495
16745 57625495 59961891 62147495 64544295 66729492 68809587 71411331 73912447 76560835
16737 76560835 79082737 81639455 83925051 86955683 89334389 92001638 94161081 96719793
16729 96719793 98971063 100880093 102829071 104837482 106257353 108070327 108511456 109554674
16721 109554674 109921797 110713101 110610711 110624691 109530515 108906258 107754623 106590470 104751089
16712 104751089 103008932 101286023 99081674 97124145 94415169 92200321 89587233 86878327
16704 86878327 84363942 81553335 79203858 76446713 73836778 71305215 68879721 66759572
16696 66759572 64410662 62127518 59439469 57588902 55833495 53673678 51827524 49863822
16688D9863822j763582j561896k099757j290743j552925j213992j463057j128670
16680C7789200j433844j194423j333098r31788j093174j153841j001026o04301
16672B9043705j247547q50053q10631j075274o47728o94131p27114j08410j130986
16663B1751831o16302m55043m81373o52608n33665n60274m90560m81924n03114
16654A6976968k82359q41724j32036n51797k62679k29482n55397m21226k95156
16645A3405112j0110m05316m68056p5313j66086m26049k30701l19207j80627l98321
16635A0725326k50018j44107q715m71737R5105m44985m1280l88295J22883k79432
16625H914745n67218L82258m07201R1172l04605k26597k41554J47841k77505m26907
$$ plain form
16688 49863822 48100240 46538344 44438587 43147844 41594919 40380927 38917870 37789200
16680 37789200 36355356 35160933 33827835 32896047 31802873 30649032 29648006 29043705
16672 29043705 27796158 26946105 26135474 25060200 24412472 23718341 22991227 22882817 21751831
16663 21751831 21135529 20680486 20199113 19546505 19012840 18452566 17962006 17480082 16976968
16654 16976968 16694609 15852885 15720849 15169052 14906373 14676891 14121494 13700268 13405112
16645 13405112 13395002 12989686 12521630 12446317 12280231 11854182 11623481 11304274 11123647 10725326
16635 10725326 10475308 10331201 10322486 9850749 9945854 9500869 9459589 9071294 9194177 8914745
16625 8914745 8347527 8729785 8322584 8413756 8109151 7882554 7641000 7788841 7511336 7084429
16615G084429q7578j07477l6303j48009p4421j63997J9240J1027l68844L94698
16605F522765n66485j32849J10383l99520j35130M6144j21402J19865k25829J31622
16595E349564k8999j73775j09500j83593r0871L99705m65609J63053l39283r8807
16585D421885O67J97110j96330l22018Q7219N3490j65070j74722J7856j32288
16575C787799J15290m36436K05000J22410k91721L89092m68855J0201o0881K47827
16565C619726p1301n5160p6913j82170L0637l25626K10357k11097L62922m41030
16555B860345k4154J70489q3389L28947m85465J5901k15194L64991k29804K26420
16545B929087p1894j96810K33687l21050J24381l54184J84315j29403L22727l80471
$$ plain form
16615 7084429 6996851 6889374 6853071 6705062 6630641 6466644 6485884 6496911 6128067 6522765
16605 6522765 5956280 5823431 5933814 5534294 5399164 5445308 5323906 5443771 5217942 5349564
16595 5349564 5320565 5146790 5037290 4853697 4762826 5162531 4696922 4859975 4520692 4421885
16585 4421885 4422552 4619662 4423332 4101314 4188533 4242023 4076953 3902231 3920087 3787799
16575 3787799 3903089 3466653 3671653 3794063 3502342 3891434 3422579 3432780 3371899 3619726
16565 3619726 3548425 3493265 3416352 3234182 3264819 2939193 3149550 2938453 3301375 2860345
16555 2860345 2836191 3006680 2923291 3252238 2766773 2782674 2567480 2932471 2702667 2929087
16545 2929087 2857193 2660383 2894070 2573020 2697401 2343217 2527532 2398129 2720856 2340385
16535B340385J7927P6629k8401r5453r4590J94326k16964K60326n81399M58942
16525B331728n3852q563l52941J63576J26705k06523o7350L49579l11801k70496
16515A700062K6897J6792N0203J78348l77862K29207K54256j78216N457J55768
16505B060912k87959K27645n0226k15568j07165J07120J16262j95954K51892k17784
16495A689175J93788l68969J80172K6247L3991k3620l60505L24144L3852l98450
16485A329825K58864R8977j4273l6243K4423j8080j02350j00490J19409j0840
16475A549222m14132r899M56995L2942l34315J08100l86486N78000l27694M29973
16465A682706l39147n9977J47462m00028J39170J01835k44354Q7714K13065m37862
$$ plain form
16535 2340385 2358312 2434941 2406540 2311087 2216497 2410823 2193859 2454185 1872786 2331728
16525 2331728 2277876 2269313 1916372 2079948 2206653 2000130 1932780 2282359 1970558 1700062
16515 1700062 1726959 1743751 1793954 1972302 1594440 1823647 2077903 1899687 1905144 2060912
16505 2060912 1772953 2000598 1950372 1734804 1627639 1734759 1851021 1655067 1906959 1689175
16495 1689175 1882963 1513994 1694166 1720413 1754404 1730784 1370279 1694423 1728275 1329825
16485 1329825 1588689 1687666 1673393 1637150 1661573 1643493 1541143 1440653 1560062 1549222
16475 1549222 1135090 1125191 1582186 1615128 1280813 1388913 1002427 1580427 1252733 1682706
16465 1682706 1343559 1283582 1431044 1031016 1170186 1272021 1027667 1115381 1328446 890584
16455H90584J30620J24847l8688J34053j40846q9581J174R9391N2981p5195J01515
16444A190855k18673K16018j63887M25293l12556j0246P3692N0047k07859J21908
16434A164592o4794j54314k41059K4832L36883k93082J07989L43961k67656D59832
16423A193393j18095n996l01757M20085m13858K5894J15484p0772n9661N7097
16413H41814K66936k15289l6339R5663k02369L27413l44073K10494j2118j47208
16403G84924m4866K57240K30913k37391k72813L15276k90310M56724l15163j08010
16393G76524C79918O65739m43389L41200l11266J77443O1366o7220B55112N64343
16383H19455P5750m26593L78478P1990j47191p8519K65708o1592j64685l45675
$$ plain form
16455 890584 1021204 1146051 1107363 1241416 1100570 1010989 1012163 1111554 1164535 1089340 1190855
16444 1190855 972182 1188200 1024313 1449606 1137050 1126804 1200496 1250543 1042684 1164592
16434 1164592 1099798 945484 704425 729257 1066140 773058 881047 1225008 957352 459832
16423 1193393 1075298 1069302 767545 1187630 773772 799666 915150 844378 784717 841814
16413 841814 1108750 893461 857122 952785 750416 1077829 733756 944250 932132 784924
16403 784924 740058 997298 1228211 990820 718007 1033283 742973 1199697 884534 776524
16393 776524 379918 1045657 602268 943468 632202 809645 871011 803791 255112 819455
16383 819455 895205 468612 847090 919080 771889 693370 959078 897486 732801 387126
16373C87126J10970J79177j31849N6031K74407k01820j70678J12391o2j92260
16363D23433M59207l27766J17392K4949m8911J76714j3677j25073J81853D01715
16352G43029j53797m0597M18828l43645J9962P461l6560K6475j64682N3985L19129
16341H49588j02627j79737J87380j33721Q2383M7207J65177C84951K71628p6241
16331E80338j36916j32852L05493j44691O0433j37696M78934C15225M47260B92209
16320D46069J0694l1035l2592J15151j23743J10233M7382K15629k93030K19227
16310F83985C05711J55421J04853A31164N36488j43860j97867L28840j68563j04256
16300C81946K81673k52972O8131j23537O1869j2653M8409L21402j61557j93640
$$ plain form
16373 387126 498096 677273 545424 601455 875862 674042 503364 615755 615693 423433
16363 423433 882640 554874 672266 697215 648304 825018 811341 686268 868121 401715
16352 743029 589232 548635 967463 623818 643780 651241 614681 641156 476474 530459 849588
16341 849588 746961 567224 754604 620883 703266 750473 915650 384951 656579 580338
16331 580338 443422 310570 616063 471372 531805 394109 873043 315225 762485 292209
16320 446069 456763 425728 393136 508287 384544 494777 542159 757788 464758 683985
16310 683985 305711 461132 565985 131164 667652 523792 325925 654765 486202 381946
16300 381946 663619 410647 478778 355241 417110 404457 452866 774268 612711 419071
16290D19071J20728J28340A37913M02578P1184A91481M56263j05663k03705I5505
16279C68382L67673k17409B27789K97336A10321J87636p9208L73469k08955o9089
16269C14174j40052L59117A84793L42109k42604R4962O5806A69044R1198J94402
16259D54644A30858M90072B85243K14178J60571B97686o1680M52892j38583j31051
16249D19264A98369J56683a5998C59372b1943B15245L42859A39487K65243p3785
16239C30945p2053A17170m9493J63440L54163b01928F3898L92435A51646K74741
16229D26387j1437n5911A56519K54636k00130J06967q8979P1155o5414Q1376M3117
16218C59247K08798c645C22884j15433p7847d2982C42853R856G7452J38508J80967
$$ plain form
16290 419071 539799 668139 137913 540491 611675 191481 647744 542081 338376 95505
16279 368382 736055 518646 227789 525125 110321 297957 218749 592218 383263 314174
16269 314174 174122 533239 184793 526902 284298 379260 445066 169044 260242 454644
16259 454644 130858 620930 285243 499421 659992 297686 236006 688898 550315 419264
16249 419264 198369 355052 -15998 359372 -21943 215245 558104 139487 404730 330945
16239 330945 258892 117170 67677 231117 585280 -201928 63898 456333 151646 426387
16229 426387 414950 359039 156519 411155 211025 317992 229013 300168 234754 316130 359247
16218 359247 568045 -3645 322884 207451 129604 -42982 342853 352709 77452 215960 396927
16207C96927j1958A22336K08094L84j14233Q7794k4112K85964j50642A75326k6908
16196A48418K3173J09366j18883R7797J09387A78339o9655e4638A49673O7661
16186B17334k9247D991J59271J45647L01281k33049j30452n8859N3479a5400A39379
16174B01081d3137A5058J87339l2661K29252A77981J2735o0032J06365k907o5813
16163A68329E8395J46319j4798K26878j83710B3479N30041A33724L78173B34931
16152C20709c6370B54134J038o0926g023A18030J57118F1341i1108A2949d4701
16140a28049A74162G9641J50175I0352O2525J13917A08774J48081j27022J52049
16130B81882d8670a4129I0295K8768q860O2267L5738L7603r1105Q7291h141q3973
$$ plain form
16207 396927 384969 122336 330430 330814 216581 304375 280263 566227 415585 175326 148418
16196 148418 171591 280957 162074 259871 369258 178339 108684 -54638 149673 217334
16186 217334 188087 4991 164262 309909 611190 378141 247689 188830 242309 -15400 139379
16174 201081 -43137 15058 202397 169736 398988 177981 190716 130684 237049 234142 168329
16163 168329 58395 204714 189916 416794 233084 23479 553520 133724 511897 234931
16152 320709 -36370 254134 255172 194246 -7023 118030 275148 61341 -91108 12949 -44701
16140 -128049 174162 79641 229816 90352 152877 266794 108774 256855 129833 281882
16130 281882 -48670 -14129 90295 119063 110203 172470 208208 245811 154706 241997 -8141 -92114
16118i2114l70414B90468J39378j58261p6009I434L84644A69010M2047d7827E1431
16106B25287a24077C18129c1915H4634a04608B31889f2168A85435Q8763b7013
16095C62990q6959H9612l3541K2730J18512a41703C90950r1150k2571M5673I8914
16083A06037J2105B4916c9659D35314A84408L01236I8678J6546N4633a29861j96646
16072c26507a55670j8666C16564a55358c6694A44727K49378I197L67011A85694
16061A52947l8874j7705B7423M26721j24070f2001I2524f0528B41798j17910d9246
16049A96263k1248a10911D51067A64366p4297L7241a17654A06738J62822r6067
16039A73493d4273k50043C08975J44585a343k8080K074j61532j1523I0203l1690
$$ plain form
16118 -92114 -462528 290468 429846 271585 195576 9434 394078 169010 211057 -47827 51431
16106 225287 -124077 318129 -31915 84634 -104608 231889 -62168 185435 274198 -27013
16095 362990 276031 89612 56071 78801 197313 -141703 390950 299800 277229 322902 98914
16083 106037 118142 24916 -39659 435314 184408 485644 98678 115224 169857 -129861 -326507
16072 -326507 -155670 -174336 316564 -155358 -36694 144727 394105 9197 376208 185694
16061 152947 114073 96368 27423 454144 330074 -62001 92524 -60528 241798 123888 -49246
16049 196263 175015 -110911 451067 164366 90069 127310 -117654 106738 269560 173493
16039 173493 -44273 -294316 308975 453560 -1343 -29423 -27349 -188881 -200404 90203 58513
16028E8513d9105B38007I6383a89687A57453b72930C40972I3940P8872a59491
16017a09492A39200l068a35076a7110C60686a85195f2413k70110g1810A57856
16006B24409P1196a31626A64677P30J0382J15977a41871g0286B04985c5507o309
15995d1816j07820A83928h8408A65676G4171R6709O5345j5312N04145J29926J00314
15984I55298N8539j56750l61208j56254K39929A96524F9100e3184a6676B15324
15973e2968K2634j9822l7004j98184E2982N9350a38716B75020a61807A91386M9007
15962B40393L7919j27521h007o804l012j32839F3009M8277J94581B6589J2034
15951C8623J67411g4277A08680a43047a4208B33448j11206e030F2164a41587A71401
$$ plain form
16028 58513 -49105 238007 96383 -189687 157453 -272930 340972 93940 172812 -159491
16017 -109492 139200 136132 -135076 -17110 360686 -185195 -62413 -332523 -71810 157856
16006 224409 295605 -131626 164677 165407 175789 291766 -141871 -70286 204985 -35507 -41816
15995 -41816 -149636 183928 -88408 165676 74171 170880 236225 220913 725058 854984 955298
15984 955298 1013837 857087 495879 339625 579554 196524 69100 -53184 -16676 215324
15973 -52968 -30334 -50156 -87160 -285344 52982 112332 -138716 275020 -161807 191386 240393
15962 240393 278312 150791 -8007 -14811 -17823 -150662 63009 111286 305867 26589 38623
15951 38623 206034 -74277 108680 -143047 -14208 233448 122242 -5030 62164 -141587 171401
15939I0350k8059a99154C03105E8487K72078B2484g103H0912f1233C43103d9686
15927c23784b2801j66183F1794c6113j4444C7330a57599o260b2663j67925f3246
15915a13244B16012D8666m11J58841d9415j64065j19694Q9824F5334g1549j02379
15904a73928N2915F5673N2183J33067a97011M8780E39579A45207J4043b89804
15893e5847A15171C3924b36336a4130k45511e4984j16964a913k31807A33915E4994
15881b60821H2390F480k330e2856F8744a18949A36379b2911C43972a4473j70693
15870a85166g1466k4441k06471e4302B03877a73053N3136B706a8085A01090M3617
15859A44707b99708f298C86b62970a21178j65039C60776q0427D1919N7791B0812
$$ plain form
15939 90350 62291 -199154 303105 58487 330565 22484 -7103 80912 -61233 343103 -49686
15927 -323784 -22801 -188984 61794 -36113 -50557 37330 -157599 -163859 -22663 -190588 -63246
15915 -113244 216012 48666 48255 207096 -49415 -213480 -333174 -243350 65334 -71549 -173928
15904 -173928 -121013 65673 117856 250923 -197011 -148231 539579 145207 159250 -289804
15893 -55847 115171 33924 -236336 -14130 -259641 -54984 -171948 -1913 -233720 133915 54994
15881 -260821 82390 6480 4150 -52856 68744 -118949 136379 -22911 343972 -14473 -185166
15870 -185166 -71466 -95907 -302378 -54302 203877 -173053 -119917 2706 -18085 101090 144707
15859 144707 -299708 -6298 386 -262970 -121178 -286217 360776 280349 41919 99710 20812
15847a9996n2116j25429B34929b73634h2780f654B4306a08084D2197P249a41584
15835a67242E3521g4077C1891b779o0124k15757A35237a12157C40207H9452b37395
15823c5793j00761l7732b5660j12806b2727o5220p3561D4701J16473b3085A17496
15811C6902d71974B49979K85806D9769i8239c4234B31021j6323J62368b20283
15800B34157a94405O4577j29098H997J93921c9572m6023r5j21753a02446r9850
15789b02296M1969B06953M6760A15338c8767D42856G0272b17010a7566B37955
15778A03413e2657j7507I7779a08555A70474a68979B14145c63793A2094L38799
15768C50893a857j15012r747a8093B34036n7412J4524k1451c51533i3580C39810
$$ plain form
15847 -19996 -72112 -197541 234929 -273634 -82780 -6654 24306 -108084 42197 49446 -141584
15835 -167242 53521 -74077 31891 -2779 -62903 -278660 135237 -112157 340207 89452 -237395
15823 -35793 -136554 -174286 -25660 -138466 -22727 -87947 -161508 44701 161174 -23085 117496
15811 36902 -471974 249979 535785 49769 -98239 -34234 231021 214698 377066 -220283
15800 234157 -194405 -129828 -258926 8997 202918 -39572 -85595 -85690 -207443 -102446 -202296
15789 -202296 -160327 206953 253713 115338 -38767 442856 70272 -217010 -17566 237955
15778 103413 -52657 -70164 97779 -108555 170474 -168979 214145 -363793 12094 350893
15768 350893 -1857 -116869 -126616 -18093 234036 176624 191148 169697 -351533 -93580 339810
15756b79936B53192f6119K7946C38520b60899M7112g7000j22445A36773b85096
15745I1987b8021C01612j29245a83681D869b6968j55719r9582b3182H8905a68081
15733B16127m9652a4489k25336A37235P5094a15195p1106j48508B01957b16671
15722b63045a02257l1600c7172A24044b54792A11963g6001k41572A38975l8543
15712A00432L4262e3378l47967A16733g9740j52957J10072j41965J8801A67430
15701B24572Q397a17036p3009L4660C8784j8655O4602o182a16328I8816D5628
15689a76714B57825q3973A7126M3538a0662A8997J09921D8625O1859a4967j94375
15678b09342I3344i5117k0268c1224A60446F6542b54582E2512h474k73380a7365
$$ plain form
15756 -279936 253192 -66119 -38173 338520 -260899 -213787 -77000 -199445 136773 -285096
15745 91987 -28021 301612 172367 -183681 4869 -26968 -182687 -282269 -23182 88905 -168081
15733 216127 166475 -14489 -239825 137235 212329 -115195 -186301 -334809 201957 -216671
15722 -263045 -102257 -133857 -37172 124044 -254792 111963 -76001 -317573 138975 100432
15712 100432 134694 -53378 -401345 116733 -79740 -232697 -122625 -264590 -245789 167430
15701 224572 232969 -117036 -190045 -155385 38784 20129 84731 78549 -116328 98816 45628
15689 -176714 257825 173852 17126 60664 -10662 18997 128918 48625 110484 -14967 -209342
15678 -209342 93344 -95117 -115385 -31224 160446 66542 -254582 52512 -8474 -281854 -17365
15666e3590a2315C46845H5741D787d7204F7444A174a93665c7493p4232A66782
15654A34752g2691k25107B69298A8486b96764I0901a89688O986b5315o8902l00585
15643c94802E0521c0425j86010m2492A78945a11292o1191K2333l2344m2574B55668
15631H1229a09155n0497M7713B4673J28196J59770A00138a37071e18A02512P7039
15620A79551B5440M7573a7643A61144f8630A39673f5267G9884c19132a03579d0827
15608B02648A9138a8879p3520J1806B2835b03178q9736F3293a4714j29575I370
15596F7246O2092b22631B14487a71511k0448o026f4621m1482j43424b8433C7253
15584a70146k5500B7983d0537C07066E3297b19573J05516c2342p292A9341i2208
$$ plain form
15666 -53590 -12315 346845 85741 4787 -47204 67444 1174 -193665 -37493 -111725 166782
15654 134752 -72691 -297798 269298 18486 -296764 90901 -189688 -182702 -25315 -94217 -394802
15643 -394802 50521 -30425 -216435 -258927 178945 -111292 -172483 -150150 -182494 -225068 255668
15631 81229 -109155 -159652 -111939 24673 152869 312639 100138 -137071 -518 102512 179551
15620 179551 25440 73013 -17643 161144 -68630 139673 -65267 79884 -319132 -103579 -40827
15608 202648 19138 -18879 -92399 -80593 22835 -203178 -292914 63293 -14714 -144289 9370
15596 67246 129338 -222631 214487 -171511 -191959 -197985 -64621 -106103 -249527 -28433 37253
15584 -170146 -195646 27983 -40537 307066 53297 -219573 -114057 -32342 -39634 19341 -92208
15572b7526n6476A80867a69996A3295J28455h2987I2836C8247Q5950i8053m0216
15561a38269b2838j25579I9698a30529B52974H8806e4039A24331b38296A93192
15550C50614F7035b59108A64136d8952A60820j1866e4907G7419a36028N3112J7660
15539f5256C66053a23982l20039I6061k281O3843a5357n3719A06430B2329c30119
15527A73668g2359D6866K072a78447D80088g901o4423K3340A26202c13510A21785
15515d3934I1117J3661M17914B02579R4018a9509B26050L4975f762l5195A84824
15503c956B88105m3026R8637A49642M16573A17615E5382K21069j18421h1096B0547
15491B92415j24088k911j5512h2554A26612K38538C8137a52291A80125e3403a4992
$$ plain form
15572 -27526 -84002 180867 -169996 13295 141750 -82987 92836 38247 124197 -98053 -138269
15561 -138269 -22838 -148417 99698 -130529 252974 88806 -54039 124331 -238296 193192
15550 350614 67035 -259108 164136 -48952 160820 148954 -54907 77419 -136028 -82916 -65256
15539 -65256 366053 -123982 -444021 96061 93780 157623 -15357 -69076 106430 22329 -330119
15527 173668 -72359 46866 48938 -178447 480088 -7901 -72324 -48984 126202 -313510 121785
15515 -43934 91117 104778 522692 202579 296597 -19509 226050 261025 -6762 -41957 184824
15503 -3956 288105 245079 343716 149642 566215 117615 55382 276451 158030 -81096 20547
15491 292415 168327 165416 149904 -82554 126612 365150 38137 -152291 180125 -53403 -14992
15479a82967A57319K9395f044A85126J59024L29425J63435j06406l21887p673
15469D01044r8270a26227j18946E7972e2627l7993j06872k13456a86832N9041
15459a27791A62077E5307P0113J58698i4447n4698l5280q1627E3462P0823C5263
15447F5480R3821a4909A12685N90897m4247L24753M55217l12087j23583l51233
15437F52402B88303j15554k3987O1939q5902J31746a20910A28766o1138N4609
15427A22237c0737m2888c0948l13391A75090a61517A38699a52053q4161C94124
15416a64205C01327c03405d5658j35758A9555M0457J0807d501C690J1091a99356
15404F9870M6378J05149a88453A05584i7032j89029c7591F8572a16552B70670
$$ plain form
15479 -182967 157319 186714 -6044 185126 344150 673575 837010 730604 408717 401044
15469 401044 302774 -126227 -245173 57972 -52627 -90620 -197492 -410948 -186832 -127791
15459 -127791 162077 55307 125420 284118 -94447 -149145 -184425 -266052 53462 124285 35263
15447 65480 159301 -14909 112685 703582 659335 984088 1439305 1127218 1003635 652402
15437 652402 288303 172749 148762 210701 124799 256545 -120910 128766 67628 122237
15427 122237 -30737 -73625 -30948 -344339 175090 -161517 138699 -152053 -236214 394124
15416 -164205 301327 -303405 -45658 -181416 19555 60012 70819 -4501 3690 14781 -199356
15404 69870 116248 221397 -188453 105584 -97032 -286061 -37591 68572 -116552 270670
15393D1547K21936q7783o3524a24644B38253J44639d08A11343a04455C6088J4028
15382E0116J70232J61191f8226A47605g5726j18053B19660J34318I2143L27910
15372D20053j93527I5950L27108n0975A5316J62496J310L078J31566j04435a77475
15360A22459K17014j37720l0607Q9907K4999o1264J21679l8932j36855L48087
15350E18767k37175C5221O0204j3843J12226M88659k76492o0055J99349B46047
15339C18229A31944K88412j29104J52039A5757J75116J07362D7365M35145b91815
15328B02540P5917B1430a39550d39B92982C7844a8914D04105H3554g1756G5279
15316C30777g3440C78688C4424b0439C6015a9585C49654A0318P9388J0396P6997
$$ plain form
15393 41547 263483 175700 112176 -124644 238253 382892 -408 111343 -104455 36088 50116
15382 50116 220348 381539 -68226 147605 -75726 -193779 219660 353978 92143 420053
15372 420053 226526 95950 423058 372083 15316 177812 179122 182200 313766 209331 -177475
15360 122459 339473 201753 171146 261053 286052 224788 346467 307535 170680 518767
15350 518767 281592 35221 95425 81582 193808 682467 405975 345920 545269 246047
15339 318229 131944 420356 291252 443291 15757 190873 298235 47365 482510 -291815
15328 202540 278457 21430 -139550 -439 292982 37844 -18914 404105 83554 -71756 75279
15316 330777 -73440 378688 34424 -20439 36015 -19585 349654 10318 89706 100102 177099
15305A77099j3860b76762G4546L09331C588J36063m4472J39737n5609J397F1307
15293D56387A60889a08310D42615l2835H7238A1597b8309g648p2587F0984R4426
15282A55410k5084N8178b52314B16941a66370B32372a33258N7255j97331M4106
15272b29228B02266C6079i5022D9451K8503d33722a76990e5645F5558M1051b09952
15260h4745B0686c261j65262k4741O7060B76257a20491B32949b18735C36221i5066
15248A6429K83659r9834a58766B78820J60434R40749M13692n96491L34412K02974
15238A734590F01737B46494M5231B9344L03850a60796d748B15457F1638h3071
15227B91672j44419M5483a73563E5171b3353H2047k8953J6650J87752G3564c41325
$$ plain form
15305 177099 163239 -276762 74546 383877 3588 139651 95179 234916 179307 180704 61307
15293 456387 160889 -108310 442615 409780 87238 11597 -28309 -7648 -80235 60984 155410
15282 155410 130326 188504 -252314 216941 -166370 232372 -133258 -76003 -273334 -229228
15272 -229228 202266 36079 -95022 49451 77954 -433722 -176990 -55645 65558 106609 -209952
15260 -84745 20686 -3261 -168523 -193264 -126204 276257 -120491 232949 -218735 336221 -95066
15248 16429 300088 200254 -158766 278820 439254 1380003 1793695 1197204 1531616 1734590
15238 1734590 601737 246494 291725 29344 333194 -160796 -4748 215457 61638 -83071
15227 291672 147253 192736 -173563 55171 -23353 82047 53094 69744 257496 73564 -341325
15215D965c67202b4592m0234k13477K0341E4543O1893m8173P8789d8548D25186
15203D8896h8110p8321A68190P6695G8556G209J52854P3769C1492J97208K28709
15192D57409a10418B50130F8799a64547c4516B40632a84903c3159A32420a41536
15181H3587l6109a63797n87M4958c142C47219A24524b09325d3520p9182A20977
15169a55468B06567J83255a324j50204C06064a12812D2067k0861a43217c5622
15158a50344b3664A68383b8166B90179h7439D72430k00439A17173J18026I5686
15147e8605A77628K18629o3632A45891a94350B17650j00374E7865K34864i1955
15136B1360K44733I4767A035J84040C830O1538K69355A6205J49902o0166J48091
$$ plain form
15215 4965 -367202 -24592 -64826 -278303 -257962 54543 116436 68263 147052 -48548 425186
15203 48896 -88110 -166431 168190 244885 78556 7209 160063 233832 31492 228700 457409
15192 457409 -110418 250130 68799 -164547 -34516 240632 -184903 -33159 132420 -141536
15181 83587 47478 -163797 -164384 -119426 -3142 347219 124524 -209325 -43520 -122702 120977
15169 -155468 206567 389822 -1324 -151528 306064 -112812 42067 21206 -143217 -35622
15158 -150344 -23664 168383 -28166 290179 -87439 472430 271991 117173 235199 95686
15147 -58605 177628 396257 332625 145891 -194350 217650 117276 57865 292729 -91955
15136 21360 266093 94767 1035 185075 3830 65368 334723 16205 166107 105941 254032
15125B54032b89671B15806E8890L04593k6693J34911A13862K86047A58461N8356
15115B16817a56671C64830E5521Q5379J16869o8080R1507A16041O4570e6361j1698
15104f8059H1198K19529a8544m863i150B62265J60622a16612a8468F8874L11159
15093C80033A86660C2575i0958C47964j16349p6598K78351p4468a8566l1294B60981
15081a08266c0038j30480a7073E24521a75726D2470L38584B2190g1394B11820
15070A57793J76158o3901f032A5361J12249K87552K0092A0494K71205a3255B2035
15058C98203A88394p000L8089J79184K5582j04205m491J99687G454N93280k36860
15047C63874j48791K73722H8869J3898J05452Q175J73723q1754J42033A52650
$$ plain form
15125 254032 -289671 215806 58890 363483 336790 471701 113862 399909 158461 216817
15115 216817 -156671 364830 55521 140900 257769 189689 281196 116041 180611 -56361 -68059
15104 -68059 81198 300727 -18544 -23407 -9150 262265 422887 -116612 -18468 68874 380033
15093 380033 186660 32575 -90958 347964 231615 155017 433368 358900 -18566 -49860 260981
15081 -108266 -30038 -160518 -17073 524521 -175726 42470 381054 22190 -71394 211820
15070 157793 333951 270050 -6032 15361 127610 415162 435254 10494 281699 -13255 22035
15058 398203 188394 181394 219483 398667 424249 320044 315553 515240 7454 600734 363874
15047 363874 215083 488805 88869 102767 208219 216394 390117 308363 450396 152650
15036A47695M25487B32848M6894K65666j85760K42709k21735N50658j88511j15245
15026F27524j74192r0140r5155K48324j9576N4666j67307J18766B21588K62457
15016D84045j14918M3784K30236p8057p0136O8351K2884l1768A59844M23083r3721
15005D89206B32334H8004L88992j78307A24111K97742O8340O2436J9695A64262
14994C29881K69482A87812L61n4562M16717j39320L10294l41105R2225A28478
14983B09925K22864J30802B53985O18566j2861J41599D74718k10602M02569k74882
14973C91803J71080m7762Q6262B97122M24924A61046l3660n6606L35794J65941
14963E72515I8956a71092C77435J60443A61106K82094n3040A79850E8640M26850
$$ plain form
15036 147695 573182 232848 279742 545408 359648 602357 380622 931280 742769 627524
15026 627524 453332 363192 268037 516361 496785 551451 384144 502910 221588 484045
15016 484045 369127 412911 643147 565090 494954 563305 586189 554421 159844 582927 489206
15005 489206 232334 88004 476996 298689 124111 421853 490193 552629 572324 164262
14994 329881 599363 187812 188173 133611 550328 411008 721302 380197 472422 128478
14983 209925 432789 563591 253985 872551 859690 1001289 474718 264116 666685 391803
14973 391803 562883 515121 601383 297122 722046 161046 127386 70780 406574 572515
14963 572515 98956 -171092 377435 537878 161106 443200 390160 179850 58640 485490
14953D85490K77715B01906L17478A79695l0594l6310J21882J46927J90009K48292
14943H19901K6621k01171k349K30681C52701N6969o0458j27351L33518p2012J20055
14932F03422j39645L20126J55622M65475j05382l2379M35534j00799J84581J65864
14922A952419n52118O6635M5653J5102N37437O31650l62289K0285n40482j54052
14912A660240n33019M35699n53585l62313k23654K05440k11753A24430K20786
14903C45216J18581A72798L50774A06482K80945J66912m6368r2454K6991A29423
14892D00423j82034J52426J47792r1941K69583j94917R662N96842k09151j31782
14882G66903J02920l2564O8691N9970J8836l84122L14011k61871J05455l54960
$$ plain form
14953 485490 763205 201906 519384 179695 149101 112791 234673 381600 571609 819901
14943 819901 846522 645351 643002 873683 352701 409670 349212 221861 555379 483367 603422
14932 603422 463777 783903 939525 1405000 1299618 1267239 1702773 1601974 1786555 1952419
14922 1952419 1400301 1466936 1512589 1527691 2065128 2696778 2334489 2354774 1814292 1660240
14912 1660240 1127221 1562920 1009335 647022 423368 628808 417055 124430 345216
14903 345216 463797 172798 523572 106482 387427 554339 507971 415517 442508 129423
14892 400423 218389 370815 518607 426666 696249 501332 510994 1107836 898685 766903
14882 766903 869823 837259 905950 965920 984756 600634 914645 652774 758229 403269
14872D03269j13497K41599B39740Q7704L55090B85599O36564k47134k08221M10676
14862H77484l28681k50450R2293J92136n0139j62651P4148Q224Q3779N7205k20426
14851C72922N4987r7046j736M2106J34855K96140C15813O66956j40659q8960N32166
14840A285316k45581J44823J64815l28616m00720N3904j48244k20902K16056J11334
14830F32185l02159R6774N1294L33026C19563K29280j39232o6706K80406O5876
14820F89187k15138J42232K82903j2222L9687k30735j57769j6386M0928P9097
14810F41784K1134K70755l63626j79747L43949Q0636p4700J46994j5110j47981
14800G24088O1556k29706B57137L02766O7074k2626J29P2898k64434M16802B88032
$$ plain form
14872 403269 289772 531371 239740 327444 682534 285599 922163 675029 466808 877484
14862 877484 548803 298353 390646 582782 532643 369992 444140 452364 536143 593348 372922
14851 372922 427909 330863 329127 371233 506088 802228 315813 982769 842110 753150 1285316
14840 1285316 1039735 1184558 1349373 1020757 620037 673941 525697 304795 520851 632185
14830 632185 330026 426800 478094 811120 319563 548843 409611 342905 623311 689187
14820 689187 474049 616281 899184 886962 926649 695914 538145 521759 562687 641784
14810 641784 662918 933673 570047 390300 734249 814885 740185 887179 872069 724088
14800 724088 785644 555938 257137 559903 626977 604351 604480 677378 412944 829746 288032
14788G77775l15765R0382N6654k58026L99507C70563L0113K06638J48372L4894
14778G90580r7281l1425J49290j62776L38014j60134k27950J39640r9951k38954
14768C99053J66905K32315l6816l27232R5448k45208K66469k49066J61523j42328
14758C21063k4437K59033j11994j16887K64852l21O9395J52726j78236P630J04255
14747G47079C73383L10076j26730O6560J8313j78597K25188k79756J77799k0144
14737E66092L2128J04197J60020j14803k26079j36770O11488q8301K32114K68487
14727A408573K26298r3266J29399o546k75894l18329o3698j71071l2388r74J87589
14716I89693l9524q8972N1980J68269j81332k13989K13419j50782K80136l29747
$$ plain form
14788 777775 462010 552392 609046 351020 750527 370563 400676 607314 755686 790580
14778 790580 693299 661874 811164 648388 986402 826268 598318 737958 638007 399053
14768 399053 565958 798273 761457 434225 529673 284465 550934 301868 463391 321063
14758 321063 296626 555659 443665 326778 591630 591309 660704 813430 635194 642824 747079
14747 747079 373383 683459 556729 623289 641602 463005 688193 408437 586236 566092
14737 566092 598220 702417 862437 747634 521555 384785 996273 907972 1140086 1408573
14727 1408573 1634871 1541605 1671004 1664458 1388564 1070235 1006537 835466 803078 802104 989693
14716 989693 950169 861197 913177 1081446 900114 686125 899544 748762 1028898 699151
14706F99151J42932m6394K28426L17589n9147L74312M23561l39329J29816l92025
14696A478892n78913o264K16823k34256k12160j287J9096j99326K69698J15500
14686H67803m20238J92579J63452J12197j46913q414p4869r223K93450k91689
14676F78135P2025q9065k5039K81341Q7323k79188r6793M88886l38890J96328
14666I75063l00135J33773N0663l4809j9674J12131j59091L8448K72103o3993
14656A004479l2732j98762K25322j7692J98811j01072K00352k74825J58316N0467
14646A212664l35269M0637Q0930o4212O5761J6230N7655O2676O6126j87333k7194
14635I88671K24111n17366P78173m93308R0851j53219K22138k20985K10128k79843
$$ plain form
14706 699151 842083 795689 1024115 1341704 1282557 1656869 2080430 1741101 1870917 1478892
14696 1478892 899979 893715 1110538 876282 664122 662835 681931 482605 752303 867803
14686 867803 447565 640144 803596 915793 768880 760466 685597 676374 969824 678135
14676 678135 750160 661095 636056 917397 1004720 725532 628739 1117625 778735 975063
14666 975063 674928 808701 859364 824555 804881 917012 757921 796369 1068472 1004479
14656 1004479 971747 772985 998307 980615 1179426 1078354 1278706 1003881 1162197 1212664
14646 1212664 877395 918032 998962 934750 1000511 1016741 1074396 1137072 1203198 1015865 988671
14635 988671 1212782 695416 1473589 980281 1071132 917913 1140051 919066 1129194 849351
14625H49351J96923J77169j88063N3692J77868j12440j44546Q7775M960m0020
14615A062669L38259k04429k746j15992K4118L51364m60837O5337L12174m02777
14605I67140K18208k657J63839j91148P1463O2988K04206k17107J21143Q638L11687
14594A718400n40049K5765K09783L05461k29958J5485j30546K02189k70440L6020
14584A342110J67489j25734j88660K02674J93151l12072L61541K84194l54973
14575A569720L75489l44158p2200K08869k2612q286l9127K25008j7908k15438
14565A659357N09001J03626N3814k59982K48640k2334k24403j19186L40185L26367
14555B615085J27435j70582N81215K58827N55490P07281R72991L368574P316133
$$ plain form
14625 849351 1046274 1223443 1035380 1089072 1266940 1154500 1009954 1097729 1102689 1062669
14615 1062669 1400928 1196499 1193753 1077761 1101879 1453243 992406 1057743 1369917 967140
14605 967140 1185348 1182691 1346530 1155382 1226845 1289833 1494039 1276932 1398075 1406713 1718400
14594 1718400 1178351 1204116 1413899 1719360 1489402 1504887 1374341 1576530 1306090 1342110
14584 1342110 1509599 1383865 1195205 1397879 1591030 1278958 1640499 1924693 1569720
14575 1569720 1945209 1601051 1528851 1737720 1715108 1706822 1667695 1892703 1874795 1659357
14565 1659357 2168358 2271984 2325798 2065816 2314456 2292122 2067719 1948533 2288718 2615085
14555 2615085 2742520 2571938 3153153 3411980 3967470 4674751 5647742 9016316 16332449
14546A6332449J7336641J2447075B1649005G161484C402415n95693n68387Q85707
14538C124042J669734q43817j822917j01514j34307n15770M22291j74614R2928
14529A716056N2051M57288m01477K55068k17269k80080L56836j33975L22066j13232
14519B013332K10214o349k25456M30517j04609m89667M24338k5794K55704k42297
14509B239933J89560p3319p1413k25014M03327K06989j15643J45855q4669J13066
14499B728672k24920K77108j19810J66273k63662N403P922K18112j42863K80044
14489B932279l72626N56986j62089K35770r3868O0635J36990o16565N19764K94667
14479C491943m62349J77362K05061j00778J28358L6813J70386j78556K04975j65077
$$ plain form
14546 16332449 33669090 46116165 21649005 7161484 3402415 2806722 2238335 3124042
14538 3124042 4793776 3949959 2127042 2025528 1891221 1375451 1797742 1623128 1716056
14529 1716056 1768107 2225395 1823918 2078986 1861717 1581637 1938473 1804498 2126564 2013332
14519 2013332 2223546 2217197 1991741 2422258 2317649 1827982 2252320 2226526 2482230 2239933
14509 2239933 2429493 2356174 2284761 2059747 2463074 2670063 2554420 2700275 2615606 2728672
14499 2728672 2503752 2780860 2661050 2827323 2563661 2569064 2576986 2795098 2652235 2932279
14489 2932279 2559653 3116639 2954550 3190320 3096452 3157087 3294077 2677512 3197276 3491943
14479 3491943 3029594 3206956 3412017 3311239 3439597 3476410 3646796 3468240 3673215 3508138
14469C508138K53Q2300K92248r4394k31130L66910m0381j9505P5211p3751j02700
14458C763199m3690L47485J55472j91905R1012K67910n18579M84512j72900Q1201
14448D263717L83837r0443K24111J30348m02701K56200l04587O72969j98153K75053
14438E210351n6126K18445O9701O6677n1761m59583L94874M01637n63942N67329
14428E797602J55863J4622N4062K53511k83202J13405M58535l4953N25685j35687
14418F919443J71722L39052j40141k48855K12310j9385Q7406M03017p2881K65326
14408G917014L7480O13804k44088J57297L09393k2857j14099K2156m77301O52855
14398H851654J21388Q2460L25515j6491L45524J27205K38154M36457j72328N43734
$$ plain form
14469 3508138 3508391 3590691 3882939 3788545 3557415 3924325 3883944 3864439 3939650 3865899 3763199
14458 3763199 3719509 4066994 4222466 4030561 4121573 4389483 3870904 4355416 4182516 4263717
14448 4263717 4647554 4557111 4781222 4911570 4508869 4765069 4460482 5133451 4935298 5210351
14438 5210351 5154225 5372670 5442371 5509048 5457287 4997704 5392578 5794215 5230273 5797602
14428 5797602 5953465 5968087 6022149 6275660 5992458 6105863 6564398 6529445 7055130 6919443
14418 6919443 7091165 7430217 7290076 7041221 7253531 7234146 7321552 7724569 7651688 7917014
14408 7917014 7954494 8568298 8324210 8481507 8790900 8768043 8653944 8676100 8198799 8851654
14398 8851654 8973042 9055502 9381017 9364526 9710050 9837255 10075409 10511866 10339538 10883272
14388A0883272J83969j47137K54058K85656n1449P90978j00802L31784J97306
14379A2627635K21109L44659p8920K53501K17104L42702R8285M76952J19218L77617
14369A4999862N19028L1337Q38267L43465K24676o129L87064o8761Q70235K11070
14359A8350114N1322O02491M71522L78436M66130N26052M24354P30216M60481
14350B2461118M64829M71418N98722P03897Q24122O57075N55048R92006K863J086334
14340B8817432O82819J013866J066114P68565L62836J335249J169662O36907J251819
14331C7105269J470746R52372J227812J426245J175615J712661J475563J596567
14323D8142850J775064J462508J924877J842636K177317K268518J512953K035170
$$ plain form
14388 10883272 11067241 10920104 11174162 11459818 11408369 12199347 12098545 12430329 12627635
14379 12627635 12848744 13193403 13114483 13367984 13585088 13927790 14026075 14503027 14622245 14999862
14369 14999862 15518890 15550227 16388494 16731959 16956635 16950506 17337570 17268809 18139044 18350114
14359 18350114 18401436 19003927 19475449 19853885 20320015 20846067 21270421 22000637 22461118
14350 22461118 22925947 23397365 23996087 24699984 25524106 26181181 26736229 27728235 27731098 28817432
14340 28817432 29500251 30514117 31580231 32348796 32711632 34046881 35216543 35853450 37105269
14331 37105269 38576015 39528387 40756199 42182444 43358059 45070720 46546283 48142850
14323 48142850 49917914 51380422 53305299 55147935 57325252 59593770 61106723 63141893
14315F3141893K725005K459147K803633K583673L308289L047765L258694L827966
14307H7156065L940482M207909M419632M517562M883943M650129N617872N996318
14299A25389912O307495O443156P366904P643785Q135772Q439359R317094R974049
14291A89017526J0290471J0820904J1876188J1946466J3425346J3678809J4468360
14284B75524070J4970155J5308339J5455035J6674617J5858885J5994080J5930458
14277C85715639J5318488J4443262J2814476J1488154P489954N109904K610559
14270D54990436R73100o66939j836689l30301o163216r451888j0880903j2997708
14262D13635892j4152218j5681414j6106928j6788431j6252131j6962719j5939781
$$ plain form
14315 63141893 65866898 68326045 71129678 73713351 77021640 80069405 83328099 87156065
14307 87156065 91096547 95304456 99724088 104241650 109125593 113775722 119393594 125389912
14299 125389912 131697407 138140563 145507467 153151252 161287024 169726383 179043477 189017526
14291 189017526 199307997 210128901 222005089 233951555 247376901 261055710 275524070
14284 275524070 290494225 305802564 321257599 337932216 353791101 369785181 385715639
14277 385715639 401034127 415477389 428291865 439780019 447269973 452379877 454990436
14270 454990436 455963536 455296597 453459908 453129607 446966391 437514503 426633600 413635892
14262 413635892 399483674 383802260 367695332 350906901 334654770 317692051 301752270
14255C01752270j5441438j5079948j4287214j3959743j3032346j2372708j1270394
14248B06308479r298449j0318554j0170671r012970q137953q064232p842457o823932
14240A36639261o622487o281150n477311n291421m990113n178148m369695m495028
14232I3933908l796422l643999l470170l284095l792534k631704l158983k800834
14224F7355167k281755k477190k289685k106085j905299j669542k293320j920319
14216E0411972j790539j459178j421172j017096j101240k044212j104720j295123
14208C9178692j015917m45722r71406j639567r82323j574665p40543q1933o13713
14199C1112903o45062j586379o86164r09823l64888r51145l21248q45475k27396
$$ plain form
14255 301752270 286310832 271230884 256943670 242983927 229951581 217578873 206308479
14248 206308479 197010030 186691476 176520805 167507835 159369882 151305650 143463193 136639261
14240 136639261 130016774 123735624 118258313 112966892 107976779 102798631 98428936 93933908
14232 93933908 90137486 86493487 83023317 79739222 75946688 73314984 70156001 67355167
14224 67355167 65073412 62596222 60306537 58200452 56295153 54625611 52332291 50411972
14216 50411972 48621433 47162255 45741083 44723987 43622747 41578535 40473815 39178692
14208 39178692 38162775 37717053 36745647 35106080 34123757 32549092 31808549 31726616 31112903
14199 31112903 30467841 28881462 28195298 27285475 26920587 25969442 25648194 24802719 24575323
14190B4575323j001955n50372n95944o49305o69807j88196l34538n24571p46132
14181A9314503k34492p43213j78544r4110m13200p06768j62475l61550k98197
14172A6121954l44455l00498j48297k62260l69606l63558l56556q3351l96216
14163A3497157L0576n54891Q8915l03799k21238m32450k96095k94417j10822j22229
14153A1280707R3756j75013k96732l87664k09140l6690k59446N0745k73110M3182
14143I830595r20001M37676N941m12228M17745j91927p58745K00995j48887k3479
14133H437685l52958K16782k21283k12933L57602j25476p35685J5523J28855k17749
14123G290363k16190K76786n12548O9361n357P6043p0175n67314J6232j18915
$$ plain form
14190 24575323 23573368 23022996 22427052 21777747 21107940 20919744 20585206 20060635 19314503
14181 19314503 19080011 18336798 18158254 18064144 17650944 16944176 16781701 16420151 16121954
14172 16121954 15777499 15477001 15328704 15066444 14696838 14333280 13976724 13893373 13497157
14163 13497157 13527733 12972842 13061757 12757958 12536720 12104270 11808175 11513758 11402936 11280707
14153 11280707 11374463 11199450 10902718 10515054 10305914 10269224 10009778 10060523 9787413 9830595
14143 9830595 8910594 9348270 9354211 8941983 9359728 9167801 8409056 8610051 8461164 8437685
14133 8437685 8084727 8301509 8080226 7867293 8224895 8099419 7363734 7379257 7508112 7290363
14123 7290363 7074173 7350959 6838411 6907772 6902415 6978458 6908283 6340969 6357201 6238286
14113F238286K1775J72751k54019P8838k25234j9594k5068q2340m62252J75098
14103E618241p4289k28698J78676j35254J23648j42173M7524l76638L4019j19409
14093D925647N3069j4141q0101l69617K98470K20701l04857k81479J35156j83625
14083D399223p9587P9029M286l04781O8676n0457N0678j10327k85846L29344m69369
14072C630869L91500l61816J59239J15051j46553j12852K09714k40083j2125J37020
14062C769964k58989R3677R9395L23398m38307J17896j81206j62456J91013j19087
14052C435298q2498k970n0486k23594L66653j26109j79040k8900k01488p4657
14042B832209q820j6316J13735o6383k94257K30243P8129q2756j09996J0107J5153
$$ plain form
14113 6238286 6260061 6432812 6178793 6257631 6032397 6012803 5987735 5905395 5443143 5618241
14103 5618241 5543952 5315254 5493930 5358676 5482324 5340151 5387675 5011037 5045056 4925647
14093 4925647 4978716 4964575 4884474 4514857 4813327 5034028 4729171 4447692 4582848 4399223
14083 4399223 4319636 4398665 4402951 4098170 4166846 4116389 4167067 4056740 3770894 4100238 3630869
14072 3630869 4022369 3660553 3819792 3934843 3788290 3675438 3885152 3645069 3632944 3769964
14062 3769964 3510975 3604652 3704047 4027445 3589138 3707034 3525828 3363372 3554385 3435298
14052 3435298 3352800 3349830 3299344 3075750 3442403 3316294 3137254 3108354 2906866 2832209
14042 2832209 2823389 2807073 2920808 2854425 2560168 2790411 2868540 2785784 2675788 2685895 2701048
14031B701048l6379m8843J72556l07535n7190Q8817j762O7736l97757K38101J70482
14020B589274n70332J93845K46586n98297M98759q1261K31937j35825m7467P4365
14010B401584m07473j46791K32740n9764p9827M551j67471L10094K27942o13470
14000A702115L86811k28601j36745j8784N6221L3158J55188k68411K19054M2055
13990A942061N01814N60714J620179N390510J5886312K0636095j6760273A3018868
13981G293699k231227j351959p6854m11398n68664J20258l51296J58835n52712
13972B028682K48712m7550K9159k08867R9117K95979n25034m9746M5138l0671
13962A884919M5256l80972J29582J27614l85913M43981j28393J73325j22848j19209
$$ plain form
14031 2701048 2664669 2615826 2788382 2480847 2423657 2512474 2510712 2578448 2180691 2418792 2589274
14020 2589274 2018942 2212787 2459373 1861076 2359835 2278574 2510511 2374686 2327219 2401584
14010 2401584 1994111 1847320 2080060 2020296 1940469 1945020 1777549 2087643 2315585 1702115
14000 1702115 2088926 1860325 1723580 1704796 1761017 1794175 1949363 1680952 1900006 1942061
13990 1942061 2443875 3004589 4624768 10015278 25901590 46537685 29777412 13018868
13981 7293699 5062472 3710513 3633659 3222261 2653597 2773855 2422559 2581394 2028682
13972 2028682 2277394 2229844 2259003 2050136 2149253 2445232 1920198 1870452 1915590 1884919
13962 1884919 1930175 1549203 1678785 1806399 1420486 1864467 1736074 1909399 1786551 1667342
13952A667342J69275n3913K04607m66278J71401j57664K773O6510K79117m25557
13942A457613L14706m12347K72705M9363O5674k62574K38836l92761M35456l00188
13932A466483Q2198j44782L36029n926k58026m0024n8186j3112j36050R8528J9587
13921A346719P4557l81332M31000r3156M0589l80470L91221L34578m11425P2130
13911A424411l4442k7223P4694j27008J41075l96524J07074K63253k38920j8424
13901A167966k0588K34404k51924R9873J29303q6283J7303N8996j77791j70614
13891A000645J89427k02316j45972M56297j53056J7537l91470N90557j16625j64000
13881A081024J42838k59j57916J2954o2072J20067J91272k98269j19748m9591
$$ plain form
13952 1667342 1836617 1782704 1987311 1521033 1692434 1534770 1537543 1604053 1883170 1457613
13942 1457613 1772319 1359972 1632677 1682040 1747714 1485140 1723976 1331215 1766671 1466483
13932 1466483 1548681 1403899 1739928 1734002 1475976 1435952 1377766 1364654 1228604 1327132 1346719
13921 1346719 1421276 1039944 1470944 1377788 1418377 1037907 1429128 1763706 1352281 1424411
13911 1424411 1389969 1362746 1437440 1310432 1451507 1054983 1162057 1425310 1186390 1167966
13901 1167966 1147378 1381782 1129858 1229731 1359034 1272751 1290054 1349050 1171259 1000645
13891 1000645 1190072 987756 841784 1298081 1145025 1162562 771092 1361649 1245024 1081024
13881 1081024 1223862 1223603 1065687 1078641 1016569 1136636 1327908 1029639 909891 860300
13871H60300k1347J06163j31588N76276j28488k61011J4833j51388J59129n3133
13861I69746M1675m50437L87753Q98q8632J58979k98635J94665J38019J36556
13851A190587M6116k34314k74264L00026l58344L01580k012j21999M9232o0755
13841H35853J11927j19897L20829k40858k11357K54556l20739K40124k53163N75467
13831A192742m71125L63954k80852l61678N53617k35843l57568M17269J32517
13822I53033l45738n5728L22424l71485K11715J91023J21757D20085P0526K02165
13812F92776J34072j00997L8734o8768l11966M83565J88483j09179k01125j08798
13802F36797q0243M57966k08013J96697m56860k5688k6974J33272l3801L12338
$$ plain form
13871 860300 838953 945116 813528 1389804 1261316 1000305 1015138 863750 1022879 969746
13861 969746 1011421 560984 948737 949635 861003 1019982 721347 916012 1054031 1190587
13851 1190587 1236703 1002389 728125 1028151 669807 971387 969375 847376 896608 835853
13841 835853 947780 827883 1148712 907854 696497 951053 630314 870438 617275 1192742
13831 1192742 721617 1085571 804719 443041 996658 760815 403247 820516 953033
13822 953033 607295 551567 873991 502506 714221 905244 1027001 420085 490611 692776
13812 692776 826848 725851 764585 695817 383851 867416 1055899 946720 745595 636797
13802 636797 556554 1014520 806507 1003204 546344 520656 493682 626954 593153 905491
13792I05491l79499K54730k44637q0873M17651j95672J21594j2534B61825L95259
13782F57084k70908M07189K09587k26164j13482j21656m4037K70555k48843K84498
13772H03823q0043j28568o5923k04937M62093j66810j29805L38041j57447j7611
13762F52813p5191K21408l98683L84625k27434l1258K60807k38321M5553q4819
13752E09500L81307j43307l42299K57377p2968J31268l10196K90319J48661j26659
13742G23003n7706Q9736k91123L2068J33918J09025j43429q4811l2027n1533j02616
13731C24505J13489P355m6543J5228K93017r7896j95955L01305q3868J22516C44889
13719F67409l2719C14012L49630C21897M45673l34269K76936O1832l16525o086
$$ plain form
13792 905491 525992 780722 536085 455212 872863 677191 798785 786251 261825 657084
13782 657084 386176 793365 1002952 776788 663306 541650 497613 768168 519325 803823
13772 803823 723780 595212 529289 324352 786445 619635 489830 827871 670424 652813
13762 652813 577622 799030 400347 784972 557538 526280 787087 548766 594319 509500
13752 509500 890807 747500 405201 662578 589610 720878 410682 701001 849662 723003
13742 723003 665297 755033 463910 495978 629896 738921 595492 510681 478654 427121 324505
13731 324505 437994 445349 398806 414034 707051 609155 413200 714505 630637 753153 344889
13719 667409 634690 314012 663642 321897 767570 433301 710237 772069 455544 449458
13709D49458l2632J27518m9408P0790j13025j09639K45030j02753k16153R9785
13699C68971j048K91067n1656j27851j69341I4595J79060L32273j63836J30464
13689E72556r010k42786P6805J75743E4275N14043p8152B37205K47785P465P7987
13678E70442k40600A21300L58163r9853j37114P3777J82443A77600K45790H8202
13667D32062k3913N326J73204k91810J12788N9271J39722B40403K48141O3840
13657E52384j42870J58733k04501j35057J75621j39781K60885j37551A68383N7877
13647B26260K56988J5627d5420F47686B04482J9836J86654K5221p7880J70433
13637E28746A06599K43854L4667j37755J41522K02119j04969B19576L51397k59334
$$ plain form
13709 449458 416826 544344 494936 565726 452701 343062 588092 485339 269186 368971
13699 368971 367923 658990 607334 479483 310142 94595 273655 605928 442092 572556
13689 572556 563546 320760 397565 573308 54275 568318 490166 237205 484990 492455 570442
13678 570442 329842 121300 479463 379610 242496 316273 498716 177600 423390 88202
13667 432062 408149 413475 586679 294869 407657 466928 606650 240403 488544 552384
13657 552384 409514 568247 363746 228689 404310 264529 525414 387863 168383 226260
13647 226260 483248 498875 -45420 647686 204482 224318 410972 436193 358313 528746
13637 528746 106599 350453 385120 247365 388887 591006 486037 219576 570973 311639
13627C11639k1438o2098l9310J18689l1480O4255J5097O4516k02724L31829k62102
13616B86873K20863P847k21446K48817E1773K14803r9079J66128n7961J2963L1319
13605C19946J89235j84787J05848l7217K72072C25121M7717l5400K07623k68274
13595B76787l9463k5026K99719k48200n1165N9495J91254j49749K86286j59451
13585D40487B19299J84018J86431A92010L7703D9018J11378J97186H8157M82494
13575E70651n8853A93480J13943A45783E1910K97068A55487K88416j95651K83549
13565E31801J2876G3349N4330J0537O6940c6506J5593D48548r4253K27275J34109
13554G15679a23103e8837C98836K8972r0055L70144B49820P2476F7212K68047
$$ plain form
13627 311639 290201 228103 188793 307482 276002 340257 355354 419870 217146 548975 286873
13616 286873 507736 515583 294137 542954 51773 266576 167497 333625 275664 288627 319946
13605 319946 509181 324394 430242 393025 665097 325121 372838 337438 545061 276787
13595 276787 237324 212298 512017 263817 212652 272147 463401 313652 599938 440487
13585 440487 219299 403317 589748 192010 229713 49018 160396 357582 88157 570651
13575 570651 511798 193480 307423 145783 51910 348978 155487 443903 248252 531801
13565 531801 544677 73349 127679 138216 205156 -36506 -20913 448548 354295 581570 715679
13554 715679 -123103 -58837 398836 427808 337753 707897 249820 322296 67212 335259
13544C35259j38064O2208A03958K55175A8845K16829j02834K05996R00B0960L89903
13533D10863A76936o9125f4703C56187k0980J02790A66718J11333P1620p9697
13523B69974M1478L4238J6874J15174A30357J32714O1744j44989a28746B07114
13512D40344n5757A36760R6750J25226A47418J3739N7792K26408B09108J47548
13502C56656k2371j33154g6784B32921h4258B92916j34446L25292B581K2287J66975
13491A91843O0150l9532N9814k2873J89836N6517B23104g1199b6149B58339J95890
13480D54229b0142E5571f0338A28098L63743I7071K34074J01837E9051J08969
13470A68020k0085K37615A69952L0278L48743d077A32428Q6986I2558J80029Q3467
$$ plain form
13544 335259 197195 259403 103958 359133 18845 235674 132840 338836 339736 20960 410863
13533 410863 176936 107811 -64703 356187 335207 437997 166718 278051 349671 269974
13523 269974 311452 345690 362564 477738 130357 263071 324815 179826 -128746 207114
13512 440344 384587 136760 233510 358736 147418 161157 218949 445357 209108 356656
13502 356656 334285 201131 -76784 232921 -84258 292916 158470 483762 2581 24868 191843
13491 191843 251993 212461 272275 249402 439238 495755 223104 -71199 -26149 258339 454229
13480 454229 -20142 55571 -60338 128098 491841 97071 331145 432982 59051 168020
13470 168020 147935 385550 169952 200230 548973 -4077 132428 219414 92558 272587 356054
13459C56054A34874N0410K38066j24035l2393p1375K6927d1446B23155L9319k4242
13448B38232K1684G8597K50516A609J50318K70725J08527k61440n4873J86489
13438D01355a1680C06808o6167l5156R5244b0474H6708L5186K03191J95188f8762
13426D098K12846J9502m9536b14902C73243j48174m0724o1343K1956e942E10034
13414A47465J5671J75237a03407B22460L71415H5429C3411a9368A80261J19962
13404C00223E1691K51328f1082A53345a63653E3119b7716Q845B35203k0914J48308
13393C62597A60325h2226B16324E7654J05270K45875a07765B22876b18639C3730
13382C45377O5071h8220B60780J49404o9906I3505K332J88149a71165C59K16610
$$ plain form
13459 356054 134874 185284 423350 299315 266922 195547 222474 -41446 223155 262474 238232
13448 238232 259916 78597 329113 1609 151927 422652 531179 269739 214866 401355
13438 401355 -11680 306808 240641 205485 300729 -20474 86708 121894 325085 520273 -68762
13426 4098 216944 236446 186910 -214902 373243 225069 184345 123002 144958 -5942 510034
13414 147465 163136 338373 -103407 222460 593875 85429 33411 -19368 180261 300223
13404 300223 51691 303019 -61082 153345 -163653 53119 -27716 -18871 235203 214289 362597
13393 362597 160325 -82226 216324 57654 162924 408799 -107765 222876 -218639 33730
13382 345377 410448 -88220 260780 410184 340278 93505 95837 283986 -171165 359 216969
13371B16969K40143j99888p8777J84483C5599J18934L04848b4974A98714J1444
13361B10158j00120R7459N4600H2007i2714F4728M20244k24671m99K2048h714
13349B87095e9691E01067L8276A37037K73206j1701j50283M42484A00780Q5496
13339A86276L0581j04168a43241A09873J07865D8361J2898e0916D04923j42194
13329B62729N3276P9688A58082M0153d0148H7437K53049m5267j44534K0358b69491
13317B9411K40926G560L78387a31664d3023D20565A41364a00796A08638R8677
13307B07315K43049j71132A3663O3570O214M0466a00070B36469B4434L94344A07111
13295a65524d6462A25869d5061B0507M39434F1832K30370A43607j0473a08637
$$ plain form
13371 216969 457112 257224 178447 362930 35599 154533 459381 -24974 198714 210158
13361 210158 110038 207497 262097 82007 -92714 64728 484972 260301 259802 281850 -8714
13349 287095 -59691 501067 539343 137037 410243 398542 248259 690743 100780 186276
13339 186276 216857 112689 -143241 109873 217738 48361 61259 -50916 404923 262729
13329 262729 316005 395693 158082 198235 -40148 87437 340486 295219 150685 171043 -269491
13317 29411 270337 7560 385947 -131664 -43023 420565 141364 -100796 108638 207315
13307 207315 450364 279232 13663 77233 83447 123913 -100070 236469 24434 418778 107111
13295 -165524 -46462 125869 -45061 20507 459941 61832 292202 143607 133134 -108637
13284A72953J03676n3803J12150h3786A10223J05733i9779G822j284c9810C33735
13272b35189D00353E4824K204K8766L6274a40294D8032K9858K27196j01396h5598
13260B70556a0686I3036M64061g2590C3151c56299B3534L4139d0552D07043D9448
13248B94841A05458R8684J85816D5537a75433B7921J43762m3780N866K6526b5537
13236e6095B32197L2971a52784A46449j6890a79972c7971B43282f4483D4982K41031
13225B86013d5075E6631J33558a8571H1687N0842L1235O2008I3459K7848L5413
13214A56720n8250a7414j53044E0579J32686m7718D8116M80373E6083d0705G5262
13202H8941j7899k8487a55544A08120B0884M9217l2428K94644b81208D8049L1662
$$ plain form
13284 172953 276629 222826 334976 -83786 110223 215956 -99779 7822 6538 -39810 333735
13272 -235189 400353 54824 57028 85794 122068 -140294 48032 77890 305086 203690 -85598
13260 270556 -10686 93036 557097 -72590 33151 -356299 23534 57673 -40552 407043 49448
13248 294841 105458 204142 389958 45537 -175433 27921 171683 127903 133769 160295 -25537
13236 -56095 232197 265168 -152784 146449 129559 -179972 -37971 243282 -64483 44982 286013
13225 286013 -45075 56631 190189 -18571 81687 132529 163764 225772 93459 121307 156720
13214 156720 98470 -17414 -170458 50579 183265 135547 48116 528489 56083 -40705 75262
13202 88941 71042 42555 -155544 108120 20884 70101 37673 332317 -281208 48049 79711
13191G9711L8606b17358A57792l9717i8447A09560L7452G0020j7884i5335F2430
13179A0457b7111C04447h8659a1129d250B68013a65148A98877e1025C46174j11915
13168B34259C3806r029d499a449A83766b01804H7804b75866A69776J71924h814
13156C13951A10580b4453A35873J88629A8554J58642R4309J32738l0487a25053
13145a10439J8601B32249b66062C4024J0366M1866J22466n1479Q691j4177E2691
13133E21056j81949E4547e27690C9493A9574f7403M516D4408a5515A8882P9656
13122I8538L0858C4895g1518L2920I985L5304Q7303D2324L2288C891L7756h624
13109A45700b8609A69441J4799k6672l0032K4232L7978d0576j37656B54004C1461
$$ plain form
13191 79711 118317 -217358 157792 118075 -98447 109560 147012 70020 52136 -95335 62430
13179 10457 -27111 304447 -88659 -11129 -4250 268013 -165148 198877 -51025 346174 234259
13168 234259 33806 24777 -4499 -1449 183766 -201804 87804 -275866 169776 341700 -8814
13156 313951 110580 -24453 135873 324502 18554 177196 271505 404243 373756 -125053
13145 -110439 -91838 232249 -266062 34024 44390 86256 208722 157243 165934 151757 52691
13133 521056 339107 54547 -527690 39493 19574 -67403 -62887 44408 -15515 18882 98538
13122 98538 129396 34895 -71518 -38598 9985 45289 132592 42324 74612 3891 41647 -8624
13109 145700 -28609 169441 184240 157568 127536 151768 189746 -40576 -178232 254004 31461
13097D46984a09212A45635B4171L86915A4750b96143B73003b57185A46138J26315
13087B72453j11915J5661a0482I4413a33818B14175F2040L4766l8834b14744d8592
13075I2464a25950e8913m6409E7682m147J01081O3349d7720A34079F1279J05031
13064A66310b20685Q4154f1773A65381p7350L66647H6205a03074E0521b1352B92289
13052H3033b53541B2127a1515C07981f8441m547j27221A83228a74056I3370k9296
13041F4074R1245F4044Q9404i777M084B66402a26866G1593J15396c0097I7266
13029a4507D209Q1671C7585N05054G8919c0201B77018H5956N0778K87709A01984
13017A80354m0614o1727R2788a9216G4470c10081a16373A37003k9808K18975a02343
$$ plain form
13097 446984 -109212 145635 24171 411086 14750 -296143 273003 -257185 146138 272453
13087 272453 160538 176199 -10482 94413 -133818 214175 62040 96806 57972 -214744 -48592
13075 92464 -125950 -58913 -105322 57682 53535 154616 217965 -47720 134079 61279 166310
13064 166310 -220685 -136531 -61773 165381 88031 454678 86205 -103074 50521 -21352 292289
13052 83033 -253541 22127 -11515 307981 -68441 -72988 -200209 183228 -174056 93370 64074
13041 64074 155319 64044 153448 -9777 -5693 266402 -126866 71593 186989 -30097 97266
13029 -14507 4209 85880 37585 542639 78919 -30201 277018 85956 136734 424443 101984
13017 180354 139740 78013 170801 -19216 74470 -310081 -116373 137003 107195 326170 -102343
13005B71962j08744b01746B47504Q5241c5298A25987b51705C29721i4827A9489
12994a49523a1808j04497F53J72115e7535A29783a59495A19179Q2172G7427b90891
12982A32286M809a98257Q2052A80990a97646e3291A50851h6784K289A74956q1833
12971I3123a53482P4836C10857A2015k28i9398q5231A21132c1730B31018B2397
12959E3642Q3992h8923b0932k26238C217L68J85624J49307j63352J15365a58550
12947a47192P0967b3378j53919Q623E2345b621n2957l71642A8700b37476d8612
12935f2859A68765a27201k4393a4068I7329R2232B4046a18682E7991a41764M2417
12924i9347A57328p5024j1265J40335a11640D3268N89939b07836F6126f5588o5759
$$ plain form
13005 271962 163218 -201746 247504 332745 -35298 125987 -251705 329721 -94827 19489
12994 -149523 -11808 -116305 653 172768 -57535 129783 -159495 119179 201351 77427 -290891
12982 132286 137095 -198257 -116205 180990 -197646 -53291 150851 -86784 -84495 174956 93123
12971 93123 -153482 -78646 310857 12015 11787 -99398 -184629 121132 -31730 231018 22397
12959 53642 137634 -88923 -20932 -247170 3217 3585 189209 338516 175164 290529 -158550
12947 -147192 -76225 -23378 -177297 -168674 52345 -2621 -55578 -427220 18700 -237476 -48612
12935 -62859 168765 -127201 -151594 -14068 97329 189561 24046 -118682 57991 -141764 -99347
12924 -99347 157328 82304 71039 211374 -111640 43268 633207 -207836 66126 -65588 -131347
12913a31347B59638A28006F2482e7973B07725G469r29J79997b9219B12232a65329
12901E1659J41592a9219A97569M3092E4130k5995b04089B47871A2024Q2950J61523
12890B56497a6813j38002N1372I2639J74357j04685i461j37266c4054C8770b29529
12878f9380F1920b53802B52583A04342J38564a73233O2788E2172J14309A2761
12867a25312M9732B8334b38699d6434B52524b09585C1443J81001D3620c5948F3886
12855C00850j8521a80644d96F366J09290n5059k243K4535N7820a09599G637H81
12842a47347b6446B58120a21620A15136N6068A1461a32942B89561a03360N020
12832i8340n2409O4404l0991A34629n1629M6586b05751G5989a21081I7453b20449
$$ plain form
12913 -131347 259638 128006 62482 -57973 207725 7469 6540 186537 -29219 212232 -165329
12901 51659 193251 -19219 197569 240661 54130 28135 -204089 247871 12024 94974 256497
12890 256497 -16813 -154815 -103443 92639 266996 162311 -9461 -146727 -34054 38770 -229529
12878 -69380 61920 -253802 252583 104342 242906 -173233 -110445 52172 166481 12761
12867 -125312 -75580 28334 -238699 -46434 252524 -209585 31443 212444 43620 -35948 63886
12855 300850 282329 -180644 -496 6366 115656 60597 58354 82889 140709 -109599 7637 881
12842 -147347 -26446 258120 -121620 115136 171204 11461 -132942 289561 -103360 -98340
12832 -98340 -150749 -86345 -117336 134629 83000 129586 -205751 75989 -121081 97453 -220449
12820H9432a00293N458A8814N3683O4374a67834a078k23338I4098c5454q8449
12809a23903E7367a50851j73399B60456d3144d908j11730H6234c9906a2030C14106
12797B61323K84309A57313a84966b5015a1922A89302P6489p7571b3013C1856K05430
12786B37286b56959E2163a41024L4914j62414F0020M45177A5093M3262j0527J070
12775D8898M6303i985j18192G3221i7511C00219j26715G7956b35609A86865B484
12763a22477K4871q1809f6527C07340D0418K19747A04623c7558l9606N077j18139
12752a90226C0372a72400P6060m5008B32791a25584A81132K2527c23419B76352
12741I7186c66947A07776b47200A96074o3645m1353a83852B29431b48604Q5412
$$ plain form
12820 89432 -100293 -94835 18814 72497 136871 -167834 -1078 -224416 94098 -35454 -123903
12809 -123903 57367 -150851 -324250 260456 -43144 -4908 -116638 86234 -39906 -12030 314106
12797 261323 545632 157313 -184966 -25015 -11922 189302 265791 188220 -23013 31856 237286
12786 237286 -256959 52163 -141024 -106110 -268524 60020 505197 15093 58355 47828 48898
12775 48898 95201 -9985 -128177 73221 -97511 300219 173504 77956 -235609 186865 2484
12763 -122477 -97606 -179415 -66527 307340 40418 260165 104623 -37558 -77164 -72087 -190226
12752 -190226 30372 -172400 -96340 -141348 232791 -125584 181132 203659 -323419 276352
12741 97186 -366947 107776 -247200 196074 132429 91076 -183852 229431 -248604 -163192
12731a63192f2605j20493o0894A1882Q7100J28135b27762M7094a9286B02530f9061
12719c10586e1760B171f9405B8660a6956k03089H1391i4349c8018A13571J00089
12708B13660G9189J84198H5615N6187a56152B39122d037j20309B63736d9973j18559
12697a68532B96076O8935j11595j22583B6392O4091K29741a82534k8539B68775
12686b2544F4045J37996a66129m7261B22625b67450g1875I6754a18428B3788a25806
12674B68986c4569k95948D1580c01109C7670h650A74884j3777L7939b29139P4655
12663a54484A73851H2192A9029Q0942c346C39026A35037K4173A0500O7636K89875
12652C68011l5886j53135a05208C90688A2503J46949b5917m14270F7448g8289
$$ plain form
12731 -163192 -62605 -183098 -243992 11882 98982 227117 -227762 -180668 -19286 202530 -69061
12719 -310586 -51760 2171 -69405 28660 -16956 -220045 81391 -94349 -38018 113571 213660
12708 213660 79189 263387 85615 141802 -156152 239122 -4037 -124346 263736 -49973 -168532
12697 -168532 296076 365011 253416 130833 26392 90483 320224 -182534 -211073 268775
12686 -22544 64045 202041 -166129 -213390 222625 -267450 -71875 96754 -118428 23788 -125806
12674 268986 -34569 -330517 41580 -301109 37670 -8650 174884 161107 199046 -229139 -154484
12663 -154484 173851 82192 19029 99971 -3346 339026 135037 159210 10500 78136 368011
12652 368011 332125 178990 -105208 390688 12503 159452 -25917 -440187 67448 -78289
12641f1321B58895A09969a80174d2109A67529C9052b7847E07407d2386A2566K03603
12630B16169c728E8770k0768K04232a920F1905J11530K3423a97027F1980J88038
12619B50018p9940o8244A594J24446j7298q704b43108P6446k75517A52843E6838
12607a68454A36600J00995A4740M9492J5474R6119a28172B03417F9610E991L88575
12596C94566C4282O0230b55370A09490a93759c5795B10168Q8949E5461a74796
12585B7366M2357K68896b1650G9880c9974A7340b9513A65376a4159G0855b8359
12573A74758p3830b03520J3001I2165b33269L0887A21409a03849j58758g4609
12562a28035k51943A60370d2002n4404G7935b06203a2756k86366A80730E5677
$$ plain form
12641 -61321 258895 109969 -180174 -42109 167529 39052 -27847 507407 -42386 12566 216169
12630 216169 -3728 58770 38002 242234 -1920 61905 173435 196858 -197027 61980 250018
12619 250018 170078 101834 1594 126040 108742 100038 -243108 -166662 -442179 152843 56838
12607 -168454 136600 237595 14740 64232 79706 175825 -128172 203417 69610 5991 394566
12596 394566 34282 94512 -255370 109490 -193759 -35795 210168 299117 55461 -174796
12585 27366 69723 338619 -21650 79880 -39974 17340 -29513 165376 -14159 70855 -28359
12573 174758 100928 -203520 -190519 92165 -233269 -202382 121409 -103849 -262607 -74609
12562 -128035 -379978 160370 -42002 -96406 77935 -206203 -12756 -299122 180730 55677
12551D1321b14385F5546j8448a60319L7327G0790b62202a5930A98624b78012I126
12539a29447D1835J45459E4781b2209j60898a9425A42144k5292a77272q7341A6697
12527a41815j29155A01689C8452J1738a47905A37814f4081J1312j64324B9142
12516d3017G6007b14526d6248B7563j1892J36936o0071a51557d1188l70063K03544
12505b07707A49162b83658A22302a88734q0189B21095m5967a6965A40702a24859
12494A63269B0556a9522l768j022a2047A65719a23443c5501j3992l4988A28866
12482A40481a90497A55845A2512a46379J0248E7823e8549H6720a65002B2511f9915
12470E6112c0837p7103M5000J786D6294c65009J32742q7171k47072E5135c93309
$$ plain form
12551 41321 -214385 65546 47098 -160319 -122992 70790 -262202 -15930 198624 -278012 9126
12539 -129447 41835 187294 54781 -22209 -183107 -19425 142144 116852 -177272 -264613 16697
12527 -141815 -270970 101689 38452 50190 -147905 137814 -64081 -52769 -217093 29142
12516 -43017 76007 -214526 -46248 27563 15671 152607 92536 -151557 -41188 -411251 -207707
12505 -207707 149162 -283658 122302 -188734 -268923 221095 175128 -16965 140702 -124859
12494 163269 20556 -19522 -23290 -24312 -12047 165719 -123443 -35501 -49493 -84481 128866
12482 140481 -190497 155845 12512 -146379 -136131 57823 -58549 86720 -165002 22511 -69915
12470 56112 -30837 -107940 -62940 -61154 46294 -365009 -232267 -319438 -566510 55135 -393309
12458A69698e0429A5749K17493h1319A28128h7362c8679A21421a33438C27083
12447e7648A29464a11193A12874h2545A40644i4652A39768i0420A88379D8115
12436A88209A5484c41302J26932f3272q7561f1268n2947A0535f9207A65019B1577
12424A60507b4767m07794i6262k13046K7517J25421f7386b145k08102a7835A6972
12412A91129b95183b2941E3563a24589K2500A03991j2536a78131B37356q2375
12402A54981i133p2733j76546k67725b771F55218D6636a34819B52781d3054B85408
12390B522a91867C48410A50162j1036j5654E6658i8926B4912J10940l3349b66378
12378A9954R9573r468c8951m4995q8135C57187A3074P9970b0648B936b83943A39434
$$ plain form
12458 169698 -50429 15749 233242 -81319 128128 -87362 -38679 121421 -133438 327083
12447 -57648 129464 -111193 112874 -82545 140644 -94652 139768 -90420 188379 48115
12436 188209 15484 -341302 -214370 -63272 -150833 -61268 -114215 10535 -69207 165019 21577
12424 160507 -24767 -432561 -96262 -309308 -281791 -156370 -67386 -2145 -210247 -17835 16972
12412 191129 -295183 -22941 53563 -124589 -102089 103991 91455 -178131 237356 154981
12402 154981 -9133 -81866 -258412 -526137 -2771 655218 46636 -134819 252781 -43054 285408
12390 2522 -191867 348410 150162 139126 123472 56658 -98926 24912 135852 102503 -266378
12378 19954 119527 110059 -38951 -83946 -172081 357187 13074 93044 -20648 2936 -283943 139434
12365B44614f2459f302n718j56361O1926j37575O1409G0727J86603d572A85928
12353G9891K86g0603d908k38591D7947M699B3024c8451a7186B69898g6166C3330
12340b75607B65216I3220b33128D4569d5849A66949a2176q920j00607K7022j3298
12329a07979A65884p3618K0915a17983j99271B92381a48141E3992J37849K6077
12319B17918A03021K25643r5585B5463q979L99615k07197q4414K28296D7569j5959
12308C1610L1496g7534q1326O2848D38395B02390b08117D4141j9627a09210q2391
12297a91601A545b37215b4448H3932J29062K0397c2565A52756J59001A8215i9964
12285C16455A21700B8414i3555E1247a64678I4134J6430K00242A36365K4584m3775
$$ plain form
12365 244614 -62459 -6302 -12020 -168381 -106455 -244030 -182621 70727 257330 -4572 185928
12353 79891 80177 -70603 -4908 -243499 47947 52646 23024 -38451 -17186 269898 -76166 33330
12340 -275607 265216 93220 -233128 44569 -45849 166949 -12176 -21096 -121703 -94681 -107979
12329 -107979 165884 92266 113181 -117983 -317254 292381 -148141 53992 191841 217918
12319 217918 103021 328664 233079 25463 16484 416099 208902 124488 352784 47569 31610
12308 31610 63106 -77534 -158860 -96012 438395 202390 -208117 44141 24514 -109210 -191601
12297 -191601 1545 -237215 -24448 83932 212994 233391 -32565 152756 311757 18215 -99964
12285 316455 121700 28414 -93555 51247 -164678 94134 110564 310806 136365 160949 117174
12274A17174J37575c253r151r990A24404j1914K72931E7855K33144G4003b53417
12262A68543a05444A12834J69220n1234j15007e479l2541E9493M9661K34610a33906
12250B7292J85389M0577a10924B20707N2443K68694h6696A29494i9053D03641
12239c131I5973K75112j48622J90202A89393e1271H0763J60424a73257H8487K14887
12228C03374J65258d0285B60490j9868A08866J65264I665L05588K6595a50381
12217D99924A85807n2238N29404A20109m1321a58697H7344a7302C60020i8811
12206G4684J14594q1569j8017k3446j9450B270K00121j6667a64972B79316A12807
12194A46355f0503A60372R859a0187D31720b5887J75B92154p2448a88416b8168
$$ plain form
12274 117174 254749 -3253 -12404 -22394 124404 112490 385421 57855 290999 74003 -253417
12262 168543 -105444 112834 282054 230820 115813 -5479 -38020 59493 109154 343764 -133906
12250 27292 212681 253258 -110924 220707 273150 541844 -86696 129494 -99053 403641
12239 -3131 95973 371085 222463 412665 189393 -51271 80763 241187 -173257 88487 303374
12228 303374 468632 -40285 260490 240622 108866 274130 9665 315253 341848 -150381
12217 499924 185807 133569 662973 120109 78788 -158697 87344 -17302 360020 -98811
12206 74684 189278 107709 89692 66246 46796 2270 202391 185724 -164972 279316 112807
12194 146355 -60503 160372 170231 -10187 431720 -25887 -25712 292154 219706 -188416 -28168
12182A86841K13340A24401a6343B9136P3348k51o455J39332H7542c00435H8481
12170C91447q9953k0346J90595C5623K76503E6797K08266n2973K22595k12307
12160B22378J97106A95663J3968K1811a0818A97576G2228A2600L00125a75053
12149D024b26729d5216D9153a2649E8916K30742h9918D9966a12796d994j3694
12138a8688B38391b9524I9414A9856K30902a97544a6173n836C8127L5415g912
12126B26644B9821d0050B58752F5159L20911g1078B58461E9019K2204K4126c9731
12114a51271C4144K68319A22959j9991P0135a51395A64519b24224B4179c2186
12103B23612b90675A98008q2945j9941B3968Q6644P2329C2546a2427B015a58187
$$ plain form
12182 186841 400181 124401 -16343 29136 102484 102233 95778 235110 87542 -300435 88481
12170 391447 301494 281148 471743 35623 312126 56797 265063 212090 434685 222378
12160 222378 419484 195663 209631 231442 -10818 197576 72228 12600 312725 -175053
12149 4024 -226729 -45216 49153 -12649 58916 289658 -89918 49966 -112796 -4994 -18688
12138 -18688 238391 -29524 99414 19856 250758 -197544 -16173 -22009 38127 73542 -7912
12126 226644 29821 -40050 258752 65159 386070 -71078 258461 59019 81223 105349 -39731
12114 -151271 34144 302463 122959 102968 173103 -151395 164519 -224224 24179 -32186
12103 223612 -290675 198008 115063 95122 23968 110612 182941 32546 -12427 2015 -158187
12091A07655n2156J11104M10817b1383A40210B735K43875a50211k24529a22137
12080A5283c0327D5888P5113i8439G0852a3384F3848K400K84526A67053a17043
12068C532M35937A11579a91703B19738c20420a05769D2718M1222R9943L1419J32871
12057C48173j31362b32309r0361A71332n2061C6707j8192K14263H315K53374G728
12045e233A01242i7066r253A76166g1077A13076e136k29172A5147L55542a88876
12033A3040a08664P096c2793D4699L58379A24678a10150J2443A95292a50311F3247
12021f0048A43658m5668k9621L9579j4599K87870A55568b90840d1212A97152k0335
12010A76817i7541r9170A29853b9934j07664E8407a76618r0551J03229C98966
$$ plain form
12091 107655 55499 166603 577420 -21383 140210 2735 246610 -150211 -374740 -122137
12080 15283 -30327 45888 121001 -98439 70852 -13384 63848 66248 350774 167053 -117043
12068 3532 439469 111579 -191703 219738 -320420 -105769 42718 83940 183883 215302 348173
12057 348173 216811 -232309 -322670 171332 119271 36707 18515 232778 8315 261689 7728
12045 -5233 101242 -97066 -106319 176166 -71077 113076 -5136 -234308 15147 370689 -188876
12033 13040 -108664 -101568 -32793 44699 403078 124678 -110150 -97707 195292 -150311 63247
12021 -60048 143658 97990 68369 107948 93349 381219 155568 -290840 -41212 197152 176817
12010 176817 -97541 -196711 129853 -29934 -137598 58407 -176618 -267169 -163940 398966
11999a43827e2596H1295B888R8902a51087A69175b26256c0A46779K457c03082
11987h8860a2755j31207l7584j38653C30453c0889A41255E5866a55015l7432B12605
11975f5383k0481C4312c9589a9706k04548J04276e9185i889A21797a7607q0922
11964i8529c916B6674K2521K53874h357q7830k96493a46849A44819a74802g7186
11952b16573E30967g5460n8043M6189L3433k01846D2179J8345b0634j78527D1495
11940B26399r1577J18852a35406C8169b7282D7040b18066A80834b27925A23452
11929A68184i4811j9346B42237H3235J406L7740g8573D4198A0092a74657A25574
11917A38142k755D8794L34981e3041a0382A3292P3507a36775A02055l7146j1546
$$ plain form
11999 -143827 -52596 81295 2888 101790 -151087 169175 -226256 -30 146779 149236 -303082
11987 -88860 -12755 -143962 -181546 -320199 330453 -30889 141255 55866 -155015 -192447 212605
11975 -65383 -85864 34312 -39589 -19706 -224254 -119978 -59185 -9889 121797 -17607 -98529
11964 -98529 -3916 26674 49195 303069 -8357 -96187 -392680 -146849 144819 -174802 -77186
11952 -216573 530967 -75460 -133503 -87314 -53881 -255727 42179 60524 -20634 -199161 41495
11940 226399 134822 253674 -135406 38169 -27282 47040 -218066 180834 -227925 123452
11929 168184 -94811 -114157 242237 83235 84641 122381 -78573 44198 10092 -174657 125574
11917 138142 135387 48794 383775 -53041 -10382 13292 86799 -136775 102055 64909 53363
11906E3363c073j44943a0590k30641m7786G1294a41096A97584b12268B09321b87840
11894b03834E1515a68185A9089Q1035a51106A69452E2900a02165l7671K7970k6292
11883a38158E3065d8842p0110A0129M74662A97437J19211j35866i7937j74402
11873b72339h9150A64150i814n5297A13136b73162I3463c4780A45356f7170a4328
11861a98684R3688A64763b70485A12314L9440B2005e3913k1406l19061M7521Q7834
11850b59025b9671A05949a99957f9244j27893A46319a57589o1402C2701b4754
11839H2400L8170e6786k29128k49176A69450a87240b2262B17203d6030a3767k01718
11828b15485A60809c1963q9942l5713A49750a87509g984A29016a3320j19195n3520
$$ plain form
11906 53363 -3073 -148016 -10590 -241231 -289017 71294 -141096 197584 -212268 209321 -287840
11894 -203834 51515 -168185 19089 100124 -151106 169452 52900 -102165 -139836 -111866 -138158
11883 -138158 53065 -48842 -118952 10129 484791 197437 316648 180782 -97937 -272339
11873 -272339 -89150 164150 -9814 -65111 113136 -273162 93463 -34780 145356 -67170 -14328
11861 -198684 -104996 164763 -270485 112314 151754 22005 -53913 -75319 -394380 -346859 -259025
11850 -259025 -29671 105949 -199957 -69244 -197137 146319 -157589 -218991 32701 -24754
11839 82400 120570 -56786 -285914 -535090 169450 -187240 -22262 217203 -46030 -13767 -215485
11828 -215485 160809 -31963 -121905 -157618 149750 -187509 -7984 129016 -13320 -132515 -186035
11817a86035A0443a47732J2788M7117K6493f185C8165K5826b78056E1409a5885
11805a9017D4759a5713j22458L1303B39290b28010a2060k89426B85980B2579n243
11794A7336a17367E6628R1050b8358E8979c44403A49571b13739j00663A3825J666
11783A5491a15560A87250d1398m7458D3987b21085E5081a80046K9138E4004J61623
11772B15627f7819G7661P2184d569A9881b42899I9539l7785i8012r5199D11221
11760d874m6516H889Q5966b85887N5906D05564a24011I7926a11992I8897R6551
11749A95448b63130g9565A67598D1761L6084R993l5890b35891E8724N1182J5339
11738A25245b24117F3042J45714q9814Q265L1793a37546j34018A9983R3481r893
$$ plain form
11817 -186035 10443 -147732 -134944 -87827 -61334 -6185 38165 63991 -278056 51409 -15885
11805 -19017 44759 -15713 -138171 -106868 239290 -228010 -12060 -301486 285980 22579 17336
11794 17336 -117367 56628 147678 -28358 58979 -344403 149571 -213739 -314402 13825 15491
11783 15491 -115560 187250 -41398 -88856 43987 -221085 55081 -180046 -150908 54004 215627
11772 215627 -67819 77661 149845 -4569 19881 -242899 99539 61754 -98012 -193211 411221
11760 -4874 -51390 8889 94855 -285887 -229981 405564 -124011 97926 -111992 98897 195448
11749 195448 -263130 -79565 167598 41761 77845 87838 51948 -235891 58724 109906 125245
11738 125245 -224117 63042 208756 118942 127207 159000 -137546 -271564 19983 113464 103571
11727A03571a33106A66703d36l17454a34906B86455I3506i8875A62369a44878
11716a07482j62021E5971M5553Q9707B3558J01524b15181G2333j8501J5604J6393
11705H5829a53417E5169B5144a12193j277C36550C1939J70044r7726a81421l79421
11694e60842a95029A70706F7676a05786E3517c18421J33552O7186j58625A28919
11683i9730j8269D9755b31792R6086O6475B32250H5133J67696F2553Q2793Q1555
11672B26901i4207m6061l8006b800l37181G8511J6449c6376K45B02802f3288o5560
11660a28848k08271e2597j41808G5547a65147O2823l1234d9736A92777b21208
11649f1638c0789b408l3599I6994a74948A84954k4229F9964j5548L3364L3684
$$ plain form
11727 103571 -133106 166703 -436 -317890 -134906 286455 93506 -98875 162369 -144878
11716 -107482 -269503 55971 101524 191231 23558 125082 -215181 72333 53832 69436 85829
11705 85829 -153417 55169 25144 -112193 -113470 336550 31939 201983 104257 -181421 -560842
11694 -560842 -195029 170706 67676 -105786 53517 -318421 -184869 -117683 -276308 128919
11683 -99730 -117999 49755 -231792 -135706 -69231 232250 85133 252829 62553 145346 226901
11672 226901 -94207 -140268 -178274 -2800 -339981 78511 94960 -36376 -36131 202802 -63288 -128848
11660 -128848 -337119 -52597 -194405 75547 -165147 -102324 -133558 -49736 192777 -221208
11649 -61638 -30789 -2408 -36007 96994 -174948 184954 160725 69964 54416 87780 121464
11638A21464g4189F9683J37790F2072b4962j81812N7771m3236b0945q3480p3314
11627a77739K6956A42822H501J56519K6075F8900j1476Q1378k5250k0063J17622
11616B11111q2572a65257L0152J9516k39728A8005a40883A19157L34733b12079
11605I1503m2609a09656m0648B1823K70854i8750A83383f7135A4552L3831J92357
11594B40740J19635A12024D4800Q9574E6968r828g4466A4623K61176b47567A17769
11582A56945i4828B15386H9782g1976q5151A22317h8787B0826Q416i7021H325
11570e907E73308b15567C29211a46522d1334C13349h1266Q332n9664L285r9428
11559b28741B5801a97271B81953d0464B58974m5352a38530A4317b77915R7627
$$ plain form
11638 121464 -74189 69683 207473 62072 -24962 -206774 -149003 -192239 -20945 -104425 -177739
11627 -177739 -150783 142822 8501 165020 191095 68900 57424 138802 113552 93489 211111
11616 211111 128539 -165257 -135105 -115589 -355317 18005 -140883 119157 453890 -212079
11605 91503 48894 -109656 -150304 21823 292677 -98750 183383 -67135 14552 48383 240740
11594 240740 360375 112024 44800 134374 56968 47140 -74466 14623 275799 -247567 117769
11582 156945 -94828 215386 89782 -71976 -157127 122317 -88787 20826 29242 -97021 8325
11570 -5907 573308 -215567 329211 -146522 -41334 313349 -81266 -72934 -132598 -129313 -228741
11559 -228741 25801 -197271 281953 -40464 258974 213622 -138530 14317 -277915 -180288
11549a80288j86188e5740E728a43480O820A16412D0701K19800i6178q7165a5488
11537C4542d9612L928B9709a65264A61901O082J0116F2493f1858H8611f6439H5204
11524a90309C1235K19882r8184O8459a02573B29516B7493i8145A80973D2525J96734
11513B39259D6438P0981f8594p6364A8266N6626F736J4096K68547d2490A06386
11501d9047A48117N6781J38478K0178g3513j29559j04724A10287b01446C85439
11490G2992b801q1322A02478O5883K05820j33605J26116a44751D9551J8112M32202
11479D99865G3184J20644p934p2887L15862D9340a67127C7153K35852D0125I668
11467C14420f5500A86824o2527i8919n7687A64707L16257k18462b37672H7411
$$ plain form
11549 -180288 -366476 -55740 5728 -143480 -136660 116412 40701 260501 -96178 -183343 -15488
11537 34542 -49612 -45684 29709 -165264 161901 167983 178099 62493 -61858 88611 -66439 85204
11524 -190309 31235 251117 152933 221392 -102573 229516 27493 -98145 180973 42525 239259
11513 239259 46438 117419 -68594 -144958 18266 74892 6736 20832 289379 -42490 106386
11501 -49047 148117 204898 343376 363554 -73513 -203072 -307796 110287 -201446 385439
11490 72992 -2801 -84123 102478 168361 374181 240576 366692 -144751 49551 67663 499865
11479 499865 73184 193828 185894 113007 428869 49340 -167127 37153 273005 40125 9668
11467 314420 -65500 186824 124297 -98919 -156606 164707 480964 262502 -237672 87411
11456B51678b06155C8154J52430n2876o662K22893A04283d02268A76775J55112
11446C31887A2635J57843f7912C18157h2778K7137K6675H4217k8236a63725C25631
11434a18723A02813J34468a14042A73437a3725n5324A06749g0657F9776g7916
11423A29776Q7818b1530q6834p947C4129O2606K5965b7506l9630j67216b297k7632
11411b9929p7862o046j5132E0111g0717A42840h5420c9328Q216D823d0288I0925
11398C28065C7142e0678J1435q6572E1865f0292B55140d95783A69163J9376b47998
11386B1731M04992b63943A0854J09419l9125a01141k8777A57860J49625J7466
11376C24951H6788F860K85231o0400B1403K55712A31188n5284B4088h1588K5787
$$ plain form
11456 251678 -206155 38154 190584 137708 131046 353939 104283 -402268 176775 331887
11446 331887 12635 170478 -67912 318157 -82778 -55641 -28966 84217 55981 -163725 325631
11434 -118723 102813 237281 -114042 173437 -13725 -69049 106749 -70657 69776 -77916
11423 129776 217594 -21530 -108364 -116311 34129 96735 122700 -27506 -67136 -234352 -2297 -29929
11411 -29929 -107791 -113837 -128969 50111 -70717 142840 -85420 -39328 -31112 4823 -40288 90925
11398 328065 37142 -50678 -39243 -125815 51865 -60292 255140 -495783 169163 188539 -247998
11386 21731 426723 -263943 10854 120273 81148 -101141 -129918 157860 307485 324951
11376 324951 86788 6860 292091 231691 21403 277115 131188 75904 24088 -81588 -55801
11365e5801d007j13930c7531r5163k30052j1609M2745a08859r0150A24593d08638
11353b0201l21804J65049k77291A21960a26360D1000a77580o7518A70846F8412
11342a58485g0744A97842a82947F43156f9339i124B40632b91106a8128E9259b17070
11330b61537c7947j66939e4950k34437a26035C934a5182A75768i1944j49839j7646
11319b59429F6759B5846a5760j68780G1531a99127F3586d512l9782D3305a20439
11307a59239A5689K85733b15930p859A1839a57608j25144A32051h4447A59324
11296a24544a8404K329m1647j73705E6617b36198p0489A65095l6102b19419A19924
11284B85990a11622I0460J4512a31645J315E2700b83922L264M3310R3065l4650
$$ plain form
11365 -55801 -4007 -117937 -37531 -132694 -362746 -374355 -331610 -108859 -199009 124593 -408638
11353 -20201 -342005 -176956 -454247 121960 -126360 41000 -177580 -245098 170846 68412
11342 -158485 -70744 197842 -182947 643156 -69339 -9124 240632 -291106 -18128 59259 -217070
11330 -261537 -37947 -204886 -54950 -289387 -126035 3934 -15182 175768 -91944 -241783 -259429
11319 -259429 66759 25846 -15760 -184540 71531 -199127 63586 -4512 -44294 43305 -120439
11307 -159239 15689 301422 -215930 -223789 11839 -157608 -282752 132051 -84447 159324
11296 -124544 -18404 -16075 -57722 -231427 56617 -236198 -306687 165095 128993 -219419 119924
11284 285990 -111622 90460 104972 -131645 -130330 52700 -283922 -280658 -237348 -144283 -178933
11273a78933C15939a90629C16991c80416B4742a46290C47664j51256a29229A94189
11262a31304j1996B30994c69902J71137h4115l86836K09985h1998c136j77210
11252a80346h6359B01688r9107h4493I9089a21895a7217k90234a23741p6582Q7325
11241a12998B52124a68071D2408J0819a79171j41177J50970B66741I8312b95262
11230d87566A13636C8591r839b0812k12988H649J0642d00932A70900d8671A58206
11218E035K9720J09250c25833a35956k68175J52436R6749I5807b96200f1861H6168
11206A50794a84956a0580B2744a0960B25109l502A1393h7654A9906J1390b06025
11194e7387A85330b81454E5797J72930c87490h6747p9099a6573C4654d4291m1851
$$ plain form
11273 -178933 315939 -190629 316991 -380416 24742 -146290 347664 196408 -129229 194189
11262 -131304 -143300 230994 -369902 -198765 -84115 -470951 -260966 -81998 -3136 -180346
11252 -180346 -86359 201688 102581 -84493 99089 -121895 -17217 -307451 -123741 -200323 -112998
11241 -112998 252124 -168071 42408 53227 -179171 -320348 -169378 266741 98312 -295262
11230 -487566 113636 38591 28752 -20812 -233800 8649 19291 -400932 170900 -48671 158206
11218 5035 34755 144005 -325833 -135956 -404131 -251695 -154946 95807 -296200 -61861 86168
11206 150794 -184956 -10580 22744 -10960 225109 221607 11393 -87654 19906 31296 -206025
11194 -57387 185330 -281454 55797 228727 -387490 -86747 -165846 -16573 34654 -44291 -86142
11183h6142k24115a23628A90151R7648b13332A50500a66018p0A80951Q7818A31866
11171A86371a66438A65235A9379c06230f5315B9957K3594K3244b77227G1136i5999
11159a03434j38134q4728B22671J092c1367j6985E5017b54820B98838F7514N6381
11148A23895l9087L7349J15907a56606G8490a25712J4527A19684D8723e3045B01847
11136a90387A38977i6761K7113F1049R4888g3556H0465c40579A92265a92161o3522
11125b55683f8516A16574J00556a1791A39496D1893d6595c23C68673l2641c50870
11113e05062b01721j27684J11447A05252a28940p173J9674e4245A26121m9614
11103G6507m983j4629R3715b37862a6976l9930B39658b0861B0546M93704B27598
$$ plain form
11183 -86142 -310257 -123628 190151 287799 -213332 150500 -166018 -166088 180951 268769 131866
11171 186371 -166438 165235 19379 -306230 -65315 29957 53551 76795 -277227 71136 -95999
11159 -103434 -241568 -326296 222671 223763 -31367 -48352 55017 -254820 298838 67514 123895
11148 123895 84808 122157 238064 -156606 78490 -125712 -111185 119684 48723 -53045 201847
11136 -190387 138977 -96761 -69648 61049 155937 -73556 80465 -340579 192265 -192161 -255683
11125 -255683 -68516 116574 217130 -11791 139496 41893 -46595 -323 368673 336032 -350870
11113 -505062 -201721 -329405 -217958 105252 -128940 -136113 -116439 -54245 126121 76507
11103 76507 71524 56895 150610 -237862 -16976 -56906 239658 -20861 20546 514250 227598
11091C07877j6009j27094J45862Q2784J0533j59620a44404B93729A7109J656b13049
11079B79383a4524D6387K12941D3188K41621A08819K3216J25421H7126J53889
11069B41015K75341j36332j01610K8700J19701A04967L85601A19216K35256l9883
11059C14589l942j34399J87068Q8017L4961j82424P3132P3086q1874J09036o1039
11048D16211J46315J07037k05743J92101j78304M17002B15078N20414j24089J50480
11038G61883p8523j83963j51999M10596l60555N85852C39217K33555K2212j01828
11028D93156K96196k62842J16134j92464q4681K35093k08690L07203l19857M7717
11018D26965K18062B94400J82511B20219L00743O5667j00358j03882O4687M4425
$$ plain form
11091 307877 291868 164774 310636 393420 403953 244333 -144404 293729 17109 18765 -213049
11079 279383 -14524 46387 259328 43188 284809 108819 132035 257456 87126 241015
11069 241015 516356 380024 278414 307114 426815 104967 490568 119216 354472 314589
11059 314589 310647 176248 363316 451333 486294 303870 377002 450088 368214 477250 416211
11048 416211 562526 669563 463820 655921 477617 894619 215078 735492 611403 761883
11038 761883 683360 499397 347398 757994 397439 983291 339217 572772 594984 493156
11028 493156 789352 526510 642644 450180 365499 600592 391902 699105 379248 426965
11018 426965 645027 294400 476911 220219 520962 586629 486271 382389 447076 491501
11008D91501r5602J12753j17494J33726A62309L66546j48982j77710J82791M6656
10998D31610o0752j13879N03668C62968K10675P4408r7458J68308q8770C07378
10987E01726J82087r1058k79960M0396N13099j42892K09715J4230l75015K37790
10977H10118Q1726J68250k17034L62749O3015O6517L11437M68631L00073j97722
10967B217760J10615j13707j94595l79121l0172k16007Q4125l26647M4132j02542
10957A093841J58275m15243K77209K29437k00098N81025o12769L21006o28284
10948H04399L58585l88083o5670r379k73265K3270K4426k18575R6820a93525C86087
10936A04377R9255M05957B09070C2232J41368a64852Q707A67186m5094K4045f6047
$$ plain form
11008 491501 395899 508652 391158 524884 162309 528855 379873 202163 384954 431610
10998 431610 370858 256979 760647 362968 573643 648051 550593 718901 630131 307378
10987 501726 683813 592755 312795 353191 866290 723398 933113 947343 572328 810118
10977 810118 891844 1060094 843060 1205809 1268824 1335341 1646778 2115409 2415482 2217760
10967 2217760 2328375 2214668 2020073 1640952 1610780 1394773 1478898 1152251 1196383 1093841
10957 1093841 1252116 836873 1114082 1343519 1143421 1724446 1111677 1432683 804399
10948 804399 1162984 774901 709231 699852 426587 449857 474283 255708 352528 -193525 386087
10936 104377 203632 609589 209070 32232 173600 -164852 -156145 167186 122092 146137 -66047
10924A31354B0896e6298j52183C76476b11084A36317a63570A1990L2310b06573
10913a30148B00702m5458J12784a31340A72281c8412G9471J40785a1249A77763
10902A97815J56147i4824n9783C9082J95785g1147b3843D8415b88546b8274l0166
10891e8440J3250A88946a43113j10060J10078f0440A2080J12695L6941b8702A79666
10879a63087L4851a3064j8681F1385c75976k5921Q4647c6632J2487m3495A9185
10867e0739A72408H2890f7486b4428p4732A45705a4874p182k86746D890b17895
10855b44478C09226j29176c1662A82599a607p4497i225H1332O7609F1945g3409
10843c51069A1746A908J78657b71368A62206J90525a22108k04666B00592m8759
$$ plain form
10924 131354 20896 -56298 -208481 376476 -211084 136317 -163570 11990 44300 -206573
10913 -130148 200702 155244 268028 -131340 172281 -38412 79471 220256 -11249 177763
10902 197815 353962 -94824 -154607 39082 234867 -71147 -23843 48415 -288546 -28274 -58440
10891 -58440 -45190 188946 -143113 -253173 -143095 -60440 12080 124775 161716 -28702 179666
10879 -163087 -128236 -13064 -31745 61385 -375976 -401897 -317250 -36632 -24145 -67640 19185
10867 -50739 172408 82890 -67486 -24428 -99160 145705 -14874 -22056 -308802 4890 -217895
10855 -244478 309226 180050 -31662 182599 -1607 -76104 -9225 81332 148941 61945 -73409
10843 -351069 11746 1908 180565 -271368 162206 352731 -122108 -326774 200592 151833
10833A51833O3759a77383d2999A01518a89164Q1487r2077j12757D0128i8686B14688
10821b12824C6531b40941L9475m7790A72671a43281j49085J03269H2565j6334
10811F6231b02156d8379I6905c49741d7607B69252e3096j53564I7029c37653B63882
10799A93416b04736d5210A6548K7970b21635r4834A61546m3115L8034E4977d86
10787a0369p4332j44582O5439o9677l2351E15906a30893b0767A75019a48258f7472
10775a35924B57910g964l9087B25863l3084r65K875b1577l15336a31072M6267
10764h4805C54156b83836a2411F580K0222c54272B704O2613J40799b76396G2690
10752A34534a84555A75073e2307G3994H989R0198f8731B75404A25453l2632a11102
$$ plain form
10833 151833 215592 -177383 -42999 101518 -189164 -107677 -199754 -312511 40128 -98686 214688
10821 -212824 36531 -240941 -201466 -249256 172671 -143281 -292366 -189097 82565 66231
10811 66231 -202156 -48379 96905 -349741 -47607 269252 -53096 -206660 97029 -337653 263882
10799 193416 -204736 -45210 16548 44518 -221635 -316469 161546 118431 156465 54977 -486
10787 -10369 -84701 -229283 -163844 -233521 -265872 515906 -130893 -20767 175019 -148258 -67472
10775 -135924 257910 -7964 -47051 225863 192779 191814 194689 -21577 -336913 -131072 -84805
10764 -84805 354156 -283836 -12411 6580 26802 -354272 2704 65317 206116 -276396 72690
10752 134534 -184555 175073 -52307 73994 8989 99187 -68731 275404 125453 92821 -111102
10740c4395B0971b50570Q2237H2811f1893m56452D2176b72830i5834C7979K2882
10729F0861b79251e5258I297b48971r4419A42181J74910g4082C36900g64H0232
10717c56921A78830a02007A57477k8759c0424n7582m46114d4897K0722B31558
10706a18977H177b3519H511a52778m766M1296d5492A50796d6314k6098A23462
10694h3034k31735J50517M6508K9693H7470i623A85916a15269j40039O0537E0059
10682A34621J15992C6383i7231j9928r7986n7894A15130a48260J8706H284d7687
10670b86462A65948f2209h983k08808l8270J13166G5827i5216B28167b83896M97
10659b83399J39085B13206a9703j20853b1717F8290a20864B12284b09473K204
$$ plain form
10740 -34395 20971 -250570 -168333 82811 -61893 -518345 42176 -272830 -95834 37979 60861
10729 60861 -279251 -55258 9297 -248971 -343390 142181 317091 -74082 336900 -764 80232
10717 -356921 178830 -102007 157477 128718 -30424 -88006 -534120 -44897 -24175 231558
10706 -118977 8177 -23519 8511 -152778 -157544 -116248 -45492 150796 -46314 -72412 123462
10694 -83034 -314769 -164252 -117744 -88051 87470 -9623 185916 -115269 -255308 -194771 50059
10682 134621 250613 36383 -97231 -117159 -215145 -273039 115130 -148260 -129554 8284 -47687
10670 -286462 165948 -62209 -8983 -217791 -256061 -142895 75827 -95216 228167 -283896 -283399
10659 -283399 -144314 213206 -19703 -140556 -21717 68290 -120864 212284 -209473 -207269
10649b07269K8345F529b74877g2352m12291B02842a4518A09619a97135f9076k28004
10638b97080O2857A15456B9844J51505a24548L1620M2122J5798j82477P2406A5448
10626A79414a28688K0017c6693F0181c018r4851d2339A05693C1107c14934i4222
10614a37164l2559F9494e3903r7981O7316H340O3120b03168A18892b18618R4367
10603a24251J4615A67805m7718j9175b64934B29298a62330m499a8723j0542k7116
10592e6381j33281G1368c53710B0623J02931e4984J7726j78989b4691j27679B23843
10580A68588d4025B33613B3168b12813h6456j61895f6561a6203B12484q4537D1500
10568g1442C8366a71373j70202N7915R3765P7781D1632a30693d0887p1480j41375
$$ plain form
10649 -207269 -178924 6529 -274877 -72352 -484643 202842 -14518 109619 -197135 -69076 -297080
10638 -297080 -234223 115456 29844 181349 -124548 -92928 -50806 -35008 -217485 -145079 15448
10626 179414 -128688 -108671 -36693 60181 -3018 -97869 -42339 105693 31107 -314934 -94222
10614 -137164 -169723 69494 -53903 -151884 -84568 8340 71460 -203168 118892 -218618 -124251
10603 -124251 -109636 167805 120087 100912 -264934 229298 -162330 -166829 -18723 -29265 -56381
10592 -56381 -189662 71368 -353710 20623 123554 -54984 -37258 -216247 -24691 -152370 223843
10580 168588 -44025 233613 23168 -212813 -86456 -248351 -66561 -16203 212484 127947 41500
10568 -71442 38366 -171373 -341575 -283660 -189895 -112114 41632 -130693 -40887 -112367 -253742
10557b53742H0198c65197J70384g5579F7145J27133I6441c6894l3492E6206a83758
10545h957A30569c73649e4091c586I311L3955a01535a7513A19894b8140E9673
10533F4684J2466a16569N2073j08268H2103J5145c30829a49931B34875g8144j10749
10522a88893B5157J15103e2391o4334K1780o2980l5010d9823j87047H3768a44377
10510B39760r104f7957F5224f2591l530A18630J16967m6618M3091o5042k1384
10499A45644a66935K602C27450d1726A44821F7799h4924K1528B1405a07683q4102
10488a91785h6098j07798A45455a63398o8553E978b4802j01435G7017K46567j45575
10477A78009q0891L14323j24199J66843j06494j62803a05329A74251K56484A87482
$$ plain form
10557 -253742 80198 -365197 -194813 -75579 67145 194278 96441 -36894 -70386 56206 -183758
10545 -8957 130569 -373649 -54091 -3586 9311 43266 -101535 -17513 119894 -28140 59673
10533 64684 77150 -116569 -64496 -172764 82103 97248 -330829 -149931 234875 -78144 -188893
10522 -188893 25157 140260 -52391 -116725 -94945 -157925 -192935 -49823 -236870 83768 -144377
10510 239760 230656 -67957 65224 -62591 -66121 118630 235597 188979 232070 167028 145644
10499 145644 -166935 -164333 327450 -41726 144821 67799 -84924 -63396 21405 -107683 -191785
10488 -191785 -86098 -193896 145455 -163398 -231951 5978 -24802 -126237 77017 323584 178009
10477 178009 97118 411441 287242 454085 347591 184788 -105329 174251 430735 187482
10466e0227M463A6094K69901d1603C6925c77320A02383e2034j06552C7582K46169
10455B83751a35373A50782R6828n035j09940c320A24556f3463C24998f7223k53576
10444c20799J29449g2860F7790q02J82335p6599a93275Q3863p0316j17495F9951
10432B01240c28410J32434B74773a40239k6747B56067H0241b67620e1347k1366
10422g2713G6827K34848a64331q5072B04082b15821L2819L8819k76341E2840J01667
10411A54507h973j47825n0190g1461l12879B49621Q8656b10196A84626a46797
10400a14936c8440A54445l2264a42226j05562J14267I9086e5460K5919j24208
10390a53749B23203a02122L1142o2211A50973P9667k2644e8780F6413g6463D38376
$$ plain form
10466 -50227 -45764 16094 285995 -41603 36925 -377320 102383 -52034 -158586 37582 283751
10455 283751 -135373 150782 247610 242575 132635 -3320 124556 -63463 324998 -67223 -320799
10444 -320799 -191350 -72860 67790 66988 249323 172724 -193275 -109412 -179728 -297223 69951
10432 201240 -328410 -195976 274773 -140239 -166986 256067 80241 -267620 -51347 -72713
10422 -72713 76827 311675 -164331 -249403 204082 -215821 -183002 -144183 -420524 52840 154507
10411 154507 -8973 -156798 -206988 -71461 -384340 249621 338277 -210196 184626 -146797
10400 -114936 -38440 154445 122181 -142226 -247788 -133521 99086 -55460 -29541 -153749
10390 -153749 223203 -102122 -70980 -133191 150973 230640 207996 -58780 66413 -76463 438376
10378e2290A43879d2891C08255a88137A94217J3754K93732k42210G9193a82019
10367A84281L93017k16296F6688J45710N34692A56540J30463N459r246H3734K15878
10356B99612j26341f1067A22885o0754J78446D2003K15422K04794j67243F5995
10345D08225j67802B9252K88392A6003L97114A80708O5290c08687A48698K29390
10335C78088j75713M8530C8350K07130q0659D1845a98027B87794a7506r8141I8451
10323A25119e8634A57179a42529A30466F325g0197A28838M3546b87289E2758b2422
10311c0367q1066I25M18305a8942j35574A22469b41535Q1048C39991l8670i8838
10299a04492A93912i4257r8987H9576B977a59013e7677k39219B73699d21826C08388
$$ plain form
10378 -52290 143879 -42891 308255 -188137 194217 207971 501703 259493 79193 -182019
10367 184281 577298 361002 66688 212398 747090 156540 287003 292462 283216 83734 299612
10356 299612 173271 -61067 122885 62131 240577 42003 257425 462219 294976 65995
10345 408225 240423 29252 317644 16003 413117 180708 245998 -308687 148698 378088
10335 378088 202375 250905 38350 245480 164821 41845 -198027 287794 -17506 -115647 98451
10323 125119 -58634 157179 -142529 130466 6325 -70197 128838 172384 -287289 52758 -22422
10311 -30367 -111433 925 419230 -18942 -154516 122469 -241535 -160487 339991 301321 -98838
10299 -104492 193912 -94257 -193244 89576 2977 -159013 -57677 -296896 273699 -421826 308388
10287C53256K6157c72372i6931k65799H0648l0857O0301e2457o3930c2257n0886
10276h3143l0485M2560F4092c32970B7435h1375j71795d8876k5607k33097d5046
10264A39612n2098G489K6736R7183b93796C4786d7204j77706A25401d5851B92712
10252C57942j59689b11941C58739j26353D4346b14303B57893E5362A2406m457
10242G949N0045a22084q5734B01606a1355p2785G2876A3660J25290c36222J31845
10231b04377A56713C0253d9799l06523b4867l86675a79680I2682a86134P2286
10221a13848r8996e7767l6295j3020G0041k8459b14893e4884r6613m582L8139
10210a17940A75668d35059A60272a23870l9016d1786p4792C1985c8347k28288
$$ plain form
10287 353256 379413 -372372 -96931 -362730 80648 49791 110092 -52457 -116387 -32257 -83143
10276 -83143 -113628 -71068 64092 -332970 27435 -81375 -253170 -48876 -74483 -307580 -45046
10264 139612 87514 7489 34225 131408 -293796 34786 -47204 -224910 125401 -45851 292712
10252 357942 198253 -211941 358739 232386 44346 -214303 257893 55362 12406 7949
10242 7949 57994 -122084 -207818 201606 -11355 -84140 72876 13660 138950 -336222 -204377
10231 -204377 156713 30253 -49799 -356322 -24867 -411542 -179680 92682 -186134 -113848
10221 -113848 -212844 -57767 -94062 -107082 70041 41582 -214893 -54884 -151497 -156079 -117940
10210 -117940 175668 -435059 160272 -123870 -162886 -41786 -116578 31985 -38347 -266635
10200b66635A81480P689g5939B6051J67872L4051b51101A79376G0922P7701j4411
10189A34212a3544j59759Q2867l5415n8234c9099k28024C13442a28217E036J38839
10178A43875c30152J58153m8808e5044p7202A9732e8938j76650b5068A60576F1265
10166B18667b22944K9004A22282c7277b414j44063G718C610b44048N71A74333
10154B08501b39524A29167b5075D62266a97871N5890B3304g0341j17557A21947
10143b7874m2245A81947b35012A94062b43827A04569k5802c8148o5936A6674a00910
10131A85021d1197j22051I1099c03390a46360A97383c3182j76439J7868o3942
10121b55695F3797f4111k26523R7986b1034q6681A99980f3258I2683J82289j4512
$$ plain form
10200 -266635 181480 189169 -75939 26051 193923 227974 -251101 179376 70922 148623 134212
10189 134212 -13544 -173303 -90436 -125851 -184085 -39099 -267123 313442 -128217 5036 143875
10178 143875 -330152 -171999 -220807 -55044 -132246 19732 -58938 -235588 -25068 160576 61265
10166 218667 -222944 -193940 122282 -37277 -2414 -146477 7718 3610 -244048 -243477 174333
10154 208501 -239524 129167 -25075 462266 -197871 -141981 23304 -70341 -187898 121947
10143 -27874 -70119 181947 -235012 194062 -243827 104569 78767 -38148 -104084 16674 -100910
10131 185021 -41197 -163248 91099 -303390 -146360 197383 -33182 -209621 -191753 -255695
10121 -255695 63797 -64111 -290634 -192648 -21034 -107715 199980 -63258 92683 274972 260460
10110B60460D4532c6937d795k20049C8674j5833i3224j55069Q2813B5295a31904
10098a04040c9451E9793g6459l01704B1596H230L98479c9869k2730j50531a05855
10086B97867a84027j69472C91603i5601b806F3824b54303r1196C3701K8995J67323
10075B30019a9808C2404h241j23522J9792H4038a53150C8606J94196b3442l26715
10064c50157A66679c40231A68319d6494C64222P0731E8636K8909a73491F4764
10053G7721b55703j4438k62944a54900M516B13769I1341a66623C21744b92082
10042B46507a75217k568A27474a17189o2832f7029j10613F9998b74761H2482N1172
10031A33654a57499D3228K31902r4569c88671J69342i1162k7666j2488r4115A9586
$$ plain form
10110 260460 44532 -36937 -4795 -224844 38674 22841 -93224 -248293 -165480 25295 -131904
10098 -104040 -39451 59793 -76459 -378163 21596 8230 406709 -39869 -62599 -213130 -105855
10086 297867 -184027 -353499 391603 -95601 -2806 63824 -254303 -345499 33701 62696 230019
10075 230019 -19808 32404 -8241 -131763 -111971 84038 -153150 38606 232802 -23442 -350157
10064 -350157 166679 -340231 168319 -46494 364222 434953 58636 87545 -173491 64764
10053 77721 -255703 -270141 -533085 -154900 -150384 213769 91341 -166623 321744 -292082
10042 246507 -175217 -177785 127474 -117189 -180021 -67029 -177642 69998 -274761 82482 133654
10031 133654 -157499 43228 275130 180561 -388671 -219329 -91162 -118828 -131316 -225431 19586
10019h6045j14063N5438j61606O8025d0319j3633C60789E7106b45340J03114j0510
10008a52736K7360A30799d00672J81230p8320n623P4521k15985N9679J38277B82052
9996c64956a18483E2580J75606b59137a12225j81705j7531E2203J04041B0092
9985a00301j17279a6927F111b58202c1236B05586a25876d9179j47020A24981c04074
9973a78147O5092j40312o2605A68126a31442K5064l03145J48092B3291M7628a56935
9961B58758B3001b49050h9580C3559a20265e0141k15531J1706a214j01418C43684
9949b58726B16099I2740j6904b46976I3393a73531P1889A52655b52646E1237K88070
9938C39307A56639J25052G4795a43620L8671E0197a25478A24300e4488n8189l04818
$$ plain form
10019 -86045 -200108 -144670 -306276 -238251 -40319 -53952 360789 57106 -245340 -142226 -152736
10008 -152736 -125376 130799 -400672 -219442 -297762 -303385 -228864 -444849 -385170 -246893 282052
9996 -364956 -118483 52580 228186 -259137 -112225 -293930 -311461 52203 156244 20092
9985 -100301 -217580 -16927 6111 -258202 -31236 205586 -125876 -49179 -196199 124981 -304074
9973 -178147 -113055 -253367 -315972 168126 -131442 -106378 -409523 -261431 23291 70919 -156935
9961 258758 23001 -249050 -89580 33559 -120265 -50141 -265672 -253966 -1214 -102632 343684
9949 -258726 216099 92740 75836 -246976 93393 -173531 -101642 152655 -252646 51237 339307
9938 339307 156639 281691 74795 -143620 -104949 50197 -125478 124300 -54488 -112677 -417495
9927d17495a53265O8617C52403a43525j05911A18336a63016j1687C4546N5744
9917I0290a81643Q8652a4724k64406i5242q4931B71089A09527E0149J45634f2582
9905C11374j04851a03387A35320b22877A49634a27287j65070A40848a1213j58628
9895a69841O5865D800a01599J7963p4512j16251E9483B2290i2308j60008D0054
9883A08813m9363c09556G126P9993a97134K2094j22271a16444J8784K9084r6918
9872a65494f7836A21132A0750R9902D8727h3747A2656b65623G2743b96024D8066
9860b63519A79880E2173a04321E9868R2968G933a4293L039B01112f8250l5329
9849a03579j66808B19397H9422b31849i5274A8884P4745b26279J08454A80201
$$ plain form
9927 -417495 -153265 -84648 352403 -143525 -249436 118336 -163016 -174703 34546 90290
9917 90290 -181643 -92991 -14724 -279130 -95242 -180173 271089 109527 50149 195783 -62582
9905 311374 206523 -103387 135320 -222877 149634 -127287 -292357 140848 -11213 -169841
9895 -169841 -103976 4800 -101599 -83636 -158148 -274399 59483 22290 -92308 -252316 40054
9883 108813 59450 -309556 7126 87119 -197134 -175040 -297311 -116444 -97660 -68576 -165494
9872 -165494 -67836 121132 10750 110652 48727 -83747 12656 -265623 72743 -296024 48066
9860 -263519 179880 52173 -104321 59868 152836 7933 -14293 -11254 201112 -68250 -103579
9849 -103579 -270387 219397 89422 -231849 -95274 18884 93629 -226279 -117825 180201
9838a13702j35072A59342a63715q3579L2092e3981A94569b01162A05569a16339
9827E494a28846e7502j512J1682D6127a30821A66671a05775l2521p2387h9654
9815a79257C1909b85907c569o197A56369a84690m6508P0881k3239E1564O2821
9804A14385E0650a7275C0340a06159B08858D7110c06857i3373K6348A15341a16685
9792G2107G107b74628K9949C2949b40260I5863m6989r119a04529A20785g0406
9780a23499j71624J26663A34543g6218q8281L9466R587j58076i4663B04894a89166
9768i8224A00633b44134A7497b02886F6670c3807H0207b382A43718M9924a00243
9756A10298f3055A5743i8825j5292j69830h0367n813l6625A8457c53023J26063
$$ plain form
9838 -113702 -248774 159342 -163715 -247294 -215202 -53981 194569 -201162 105569 -116339
9827 5494 -128846 -57502 -59014 -47332 46127 -130821 166671 -105775 -138296 -210683 -89654
9815 -179257 31909 -285907 -3569 -9766 156369 -184690 -231198 -160317 -183556 51564 114385
9804 114385 50650 -17275 30340 -106159 208858 47110 -306857 -93373 -67025 115341 -116685
9792 72107 7107 -274628 -244679 32949 -240260 95863 48874 39755 -104529 120785 -70406
9780 -123499 -295123 -168460 134543 -76218 -164499 -125033 -115446 -273522 -94663 204894 -189166
9768 -98224 100633 -244134 17497 -202886 66670 -33807 80207 -2382 143718 193642 -100243
9756 110298 -63055 15743 -98825 -114117 -283947 -80367 -86180 -122805 18457 -353023 -226960
9745b26960b4330k066A12787B054a91157R5215a5472A2809h7410k72136b9418
9733b9075k77258B57104l3859a96729a893E2039g6796j08663j2576B36657B5768
9721c48115A99502a77390O449j5479r3143B69973i1249C42532c7579C65K45774
9710B46139d67275J86486M3668A889d9650i682k3707m1177a1345m5766k34295
9699b91406B04731a39264r5489A21748G556a43521k56622a11634G2315a32494
9688c21103d3505A91715a60283j09554B2919E29g4014l21278d1715j6163q6688
9677a44566A2570P363R4043d00682a92268A52069j9403a22686c7210o3282h731
9665d24322b01042G9299J23000m6784A2990c42165A17542J86581I1776j4595c06520
$$ plain form
9745 -226960 -24330 -26396 112787 2054 -191157 -95942 -15472 12809 -87410 -359546 -29418
9733 -29075 -306333 257104 223245 -196729 -1893 52039 -76796 -185459 -198035 236657 25768
9721 -348115 199502 -177390 -170941 -186420 -279563 269973 -91249 342532 -37579 365 246139
9710 246139 -467275 -280789 -237121 1889 -49650 -9682 -33389 -74566 -11345 -57111 -291406
9699 -291406 204731 -139264 -234753 121748 7556 -143521 -400143 -111634 72315 -132494
9688 -321103 -43505 191715 -160283 -269837 22919 529 -74014 -395292 -41715 -57878 -144566
9677 -144566 12570 19933 113976 -400682 -192268 152069 132666 -122686 -37210 -100492 -8731
9665 -424322 -201042 79299 202299 155515 12990 -342165 117542 304123 91776 77181 -306520
9653A8070N2221J3373a99413J0359a8300j19774p5747A55867f7967A06793a0523
9641F0231a23096a779l00409A34983d14500A30111b82167b7086j4087B89884h1963
9629a41635b5022k78169a1305q2920p971N819H089K80767A18271h3303k39144
9618c22447B47155E9552d0824F2722b72829j7743J28653e6121p6075A9250d44991
9606h4033A38821a81167h930j03103A5194e8113C166K33228a55142l1513C4936
9594c13885I6099C9379O4353a90160Q9395j30331E5266a65184J2823A78955f7254
9582E1329a59049a2104A56889J17040j19320a13964n5617l9394k62155A43905
9571A6757Q0649o607J27104c4444H844K0175f5963l8007j53177C6381h0667j08707
$$ plain form
9653 18070 70291 83664 -199413 -189054 -18300 -138074 -213821 155867 -67967 106793 -10523
9641 60231 -123096 -1779 -302188 134983 -414500 130111 -282167 -27086 -41173 289884 -81963
9629 -141635 -25022 -303191 -11305 -94225 -102196 -96377 8089 288856 118271 -83303 -322447
9618 -322447 247155 59552 -40824 62722 -272829 -290572 -161919 -56121 -132196 19250 -444991
9606 -84033 138821 -181167 -8930 -112033 15194 -58113 3166 236394 -155142 -186655 34936
9594 -313885 96099 39379 103732 -190160 -100765 -231096 55266 -165184 -152361 178955 -67254
9582 51329 -159049 -12104 156889 273929 154609 -113964 -169581 -208975 -471130 143905
9571 16757 97406 90799 217903 -34444 8844 29019 -65963 -103970 -257147 36381 -80667 -189374
9559a89374e4541j80756f6095l8714m294N4091B52459G4902g3255K6011l0406
9548g7650K4382n8391n3269A51467b34781B39175g8310n9677A4077J16853a20911
9536a11843M0798H5776i6741k39632B07108b51536G0882Q1932a39861q721J3418
9525a35164I7895J07483B3946K8149a76167O4402l3451K5748a6418E6510a59557
9513B42067a76061m1233Q8439q8525J5098C16889e18946A01320c4528A86203h1632
9501e2065j44115A33983m3423C5789k914J22814a8659M227j85865n0223J10393
9490a40127b7888l3592p2288B99210a2715k3866F0040I474a85363g8159A2085
9478b20363k06527g5144c6756r3747j50617a23158j32014E1297h7894H8900b78072
$$ plain form
9559 -189374 -54541 -235297 -66095 -104809 -109103 -55012 252459 74902 -73255 -47244 -77650
9548 -77650 -53268 -111659 -164928 151467 -234781 239175 -78310 -137987 14077 130930 -120911
9536 -111843 -71045 85776 -96741 -336373 207108 -251536 70882 152814 -139861 -148582 -135164
9525 -135164 97895 205378 23946 52095 -176167 -111765 -145216 -119468 -16418 56510 -159557
9513 242067 -176061 -217294 -128855 -217380 -202282 316889 -518946 101320 -34528 186203 -81632
9501 -52065 -196180 133983 90560 35789 32875 155689 -18659 -14432 -200297 -250520 -140127
9490 -140127 -27888 -61480 -133768 299210 -12715 -36581 60040 9474 -185363 -78159 12085
9478 -220363 -426890 -75144 -36756 -130503 -281120 -123158 -255172 51297 -87894 88900 -278072
9466a80491F4481L5004e9572I8460b1260j22723J7694I3670N0395a88219J960
9455a86259B81603c00557J04296h4297n7329A72020a08198r6698L8206g6743r5449
9444a72192J0896C2206a1647A40066C6759i673j22554j2947J670J9247A98057
9432d0597j24736H9582c13279E3583O713a61284H9132J69422b44404p3886b2552
9420e0439D9787g3848H4464a76404B35454O1234E6093J15537a0363j01379A290
9408a261m3988j00621j39288b0553A92132j3340a63321B27809F1279a28030A82967
9396G337b14958m6045I2543b5704f549j74993B08200o8284c25812d7012A9241
9384a92802f7635I0249g9822l5052F4907L0249m1431a01391n0839B0744e5588
$$ plain form
9466 -180491 64481 99485 -59572 98460 -21260 -143983 -126289 93670 144065 -188219 -186259
9455 -186259 281603 -300557 -196261 -84297 -141626 172020 -108198 -204896 -166690 -76743 -172192
9444 -172192 -161296 32206 -11647 140066 36759 -9673 -132227 -145174 -143504 -124257 198057
9432 -40597 -165333 89582 -313279 53583 60296 -161284 89132 258554 -244404 -318290 -22552
9420 -50439 49787 -73848 84464 -176404 235454 296688 56093 171630 -10363 -111742 1290
9408 -1261 -45249 -145870 -285158 -20553 192132 178792 -163321 227809 61279 -128030 182967
9396 7337 -214958 -261003 92543 -25704 -6549 -181542 208200 139916 -325812 -47012 19241
9384 -192802 -67635 90249 -79822 -114874 64907 95156 53725 -101391 -152230 20744 -55588
9372b48927E277a19899m3268I0143b63300k9250A07313c36289d7038K0427m3390
9361g0001A59683F9005a17728p5755A39411d0803a2816A17681f3324j0216L0245
9350d3295m5613M489B28441c9461a2952j87007A60515P7867a70421j87909R2639
9339b65691B29521C1407a88214A20046b33971f0312C47748b6781A56752C9812
9328E2798j1586c704j74643j08962J3817d6341j4505A12754c59386C6241b52526
9316a38056N1506k19962a39080K7178B2830a33498o8630b5484q1720c1000j00271
9305a31271M6136k3950b6823j24078N4946D9615L3392h4596p247A58959d2561
9293e3083A51598c28406J60790B03433F5027R2947C5455b55834B64026G0220b50501
$$ plain form
9372 -248927 5277 -119899 -163167 90143 -263300 -292550 107313 -336289 -47038 -26611 -70001
9361 -70001 159683 69005 -117728 -193483 139411 -40803 -12816 117681 -63324 -73540 -43295
9350 -43295 -88908 -84419 228441 -39461 -12952 -199959 160515 238382 -170421 -358330 -265691
9339 -265691 229521 31407 -188214 120046 -233971 -60312 347748 -26781 156752 39812
9328 52798 41212 -3704 -178347 -287309 -273492 -46341 -60846 112754 -359386 36241 -252526
9316 -138056 -86550 -306512 -139080 -111902 22830 -133498 -202128 -25484 -107204 -31000 -131271
9305 -131271 -85135 -109085 -26823 -150901 -95955 49615 83007 -84596 -91843 158959 -42561
9293 -53083 151598 -328406 -167616 203433 65027 157974 35455 -255834 264026 70220 -250501
9281b99604J19247p8682B8363e7992k93885J42598E7408a33693R815c5777C6519
9269a13495C6670b89284A21993D2893a86836c3489G6766J34979a84550A00072
9258d31194H8044L3503d9061o4791j74755j0302L1365f9613o6404I7796K8802
9247A26598g3357a3346B08524b68712h0872A06261C3177d3680A43113i1923R564
9236h2359k8116M2712E1773a02378K5046I6487J9618a49250A49937c51271D8729
9224a88103P8916c4532p8479d7181G9156c1029k12534K7433A04534O2703b54555
9212A17857b40554A5997b4499k09406A03701A4459J58269R1449H9022J83244J47258
9201D19524c85921C2473b56320a14844j57586H2274i1849r9341F1293i7565r3988
$$ plain form
9281 -299604 -180357 -259039 28363 -57992 -351877 -209279 57408 -133693 -123878 -35777 36519
9269 -113495 36670 -289284 121993 42893 -186836 -33489 76766 211745 -184550 100072
9258 -431194 88044 121547 -49061 -113852 -288607 -298909 -267544 -69613 -136017 97796 126598
9247 126598 -73357 -13346 208524 -268712 -80872 106261 33177 -43680 143113 -91923 -82359
9236 -82359 -110475 -67763 51773 -102378 -77332 96487 116105 -149250 149937 -351271 48729
9224 -188103 -109187 -34532 -113011 -47181 79156 -31029 -243563 -216130 104534 167237 -254555
9212 117857 -240554 15997 -24499 -233905 103701 14459 172728 264177 89022 272266 419524
9201 419524 -385921 32473 -256320 -114844 -272430 82274 -91849 -191190 61293 -97565 -191553
9190a91553c7463k58351a29866j63600Q3419a0066j17356A49896a5308k9891J0190
9179c5009k27123B65841n4635b86905d9653R420i932j29917f9807B3828i4492
9167I3461J6636c56526C99433A6756b08722O9063k70961i6671C9611J13199d52471
9155a96021A93242d6334A9583b5838k31421e5635j37294j01125A65131B1751c14
9143a06102j9002b3510r2221A65314o5289O4856k8268b28333i6282A28681o0467
9132F8214b69641C12694c1559r7572d1148I2659a67758f2524l13775B9058h9259
9120c7846F6129K0653i7761A53377c67754g1026G3679b15502C3662L443K4587
9109F1692a56202A39698B6514K24112g0718I570a65080n4885D8774d7533l7552
$$ plain form
9190 -191553 -37463 -295814 -129866 -293466 -210047 -10066 -127422 149896 -15308 -45199 -35009
9179 -35009 -262132 265841 211206 -286905 -49653 -40233 -9932 -139849 -69807 23828 -94492
9167 93461 110097 -356526 399433 16756 -208722 -139659 -410620 -96671 39611 152810 -452471
9155 -196021 193242 -46334 19583 -25838 -257259 -55635 -192929 -294054 165131 21751 -314
9143 -106102 -125104 -23510 -115731 165314 100025 164881 136613 -228333 -96282 128681 68214
9132 68214 -269641 312694 -31559 -129131 -41148 92659 -167758 -62524 -376299 29058 -89259
9120 -37846 66129 86782 -97761 153377 -367754 -71026 73679 -215502 33662 37105 61692
9109 61692 -156202 139698 26514 250626 -70718 9570 -165080 -219965 48774 -47533 -85085
9098h5085j27544C0608g3905B30632l297a58051H7787O2477b35946N5139F4351
9086a10481j03106i4656o5777B57980a05932H4770k9003a69388A76968b31876
9075a10192N4966B1248a15031e4462k28400C2116N6561a111k04898P93j01414
9064c06630D3989b00248g5533F5705J0509c9875j5123B58013a66825A05882A8583
9052b18425M9603G2068C5735c0094G7542a09498b4242l1822p871A09831b7792
9040A22779a44132J3708E9607b60700B21051a67464E9985i0123B6049e5654O288
9029d9366j99926c7720k22681A91517a65947n8993L0214D7700J0118L3713c47998
9017a11201k05518e4751q5256C5649A232f6900j29521A08931g2561K86k6527C1293
$$ plain form
9098 -85085 -212629 30608 -73905 230632 227335 -158051 87787 150264 -235946 -180807 64351
9086 -110481 -213587 -94656 -160433 257980 -105932 84770 55767 -169388 176968 -231876
9075 -110192 -55226 21248 -115031 -54462 -282862 32116 88677 -1111 -206009 -205216 -306630
9064 -306630 43989 -200248 -75533 65705 76214 -39875 -54998 258013 -166825 105882 18583
9052 -218425 -168822 72068 35735 -30094 77542 -109498 -24242 -56064 -63935 109831 -27792
9040 122779 -144132 -130424 59607 -260700 221051 -167464 59985 -90123 26049 -55654 -49366
9029 -49366 -249292 -37720 -260401 191517 -165947 -224940 -194726 47700 57818 91531 -347998
9017 -111201 -316719 -54751 -140007 35649 1232 -66900 -196421 108931 -72561 -72275 -98802 31293
9004A0718J85830G9660K80787e3210B45470H8323K5815b2225k44610F1469a10146
8992b6607k64518e3950C6480K94344j64531c8466B41092c7203N576I7947b40097
8980a55258M0619j44008h1078l58226A12177a65906O4498k7077e5410k32374A33479
8968a258A13945b588l2157A19648i1872m6589o3964L0379O4930c0850j21640A82377
8955a74966K1154b6837k09098k17188H5640c68727f522k19177j1907A57620a64790
8943B92082F7206i2395b9978A87118a32969I4887a4933r4590J8900A08126i4194
8931B77990H7434J0996m7423c36j29263b5812H5521a92721E39735O3603Q38583
8920A441921L562231J0388056p012129A733277B48119J03001p9722o4700G249
$$ plain form
9004 10718 196548 79660 360447 -53210 245470 88323 114138 -22225 -266835 61469 -110146
8992 -26607 -291125 -53950 36480 330824 166293 -38466 241092 -37203 -31627 97947 -240097
8980 -155258 -114639 -258647 -81078 -439304 112177 -165906 -101408 -128485 -55410 -287784 133479
8968 -1258 113945 -2588 -34745 119648 -91872 -138461 -202425 -172046 -107116 -30850 -152490 182377
8955 -174966 -153812 -26837 -235935 -453123 85640 -368727 -6522 -225699 -237606 157620 -164790
8943 292082 67206 -92395 -29978 187118 -132969 94887 -14933 -109523 -90623 108126 -94194
8931 277990 87434 98430 51007 -336 -129599 -25812 85521 -192721 539735 603338 1441921
8920 1441921 5004152 15392208 8380079 1733277 248119 351120 271398 206698 7249
8910a38510e4088B96837A3286L96194j68419A01040b64559d2527j08716d96B27609
8898H4937J9206d903l3920C3515b01370l7258a10161l5335F55c2292n1833m082
8886h8207p2346P7671L6400A78490g0475F7910J37315i0045p2545d314k03539
8875b07853j7684g1322k30072g5596k38853A45739b80631E0644k3568g9906j24478
8864b04384I5719a64561A05285G617Q2324B1615g5514j09853J2528h3629C38371
$$ plain form
8910 -138510 -54088 296837 13286 409480 241061 101040 -264559 -42527 -151243 -496 227609
8898 84937 104143 -4903 -38823 33515 -201370 -238628 -110161 -145496 655 -32292 -84125 -88207
8886 -88207 -160553 -82882 -46482 178490 -70475 67910 205225 -90045 -162590 -4314 -207853
8875 -207853 -225537 -71322 -301394 -75596 -314449 145739 -280631 50644 27076 -79906 -204384
8864 -204384 95719 -164561 105285 7617 89941 21615 -75514 -185367 -172839 -83629 338371
$$ [...]
##END NTUPLES=NMR SPECTRUM
##END=
