
##TITLE=AC1353_CTIAH12172_6648025_TjZmtJMwxs
##JCAMPDX= 6.0         $$ Bruker NMR JCAMP-DX V2.0
##DATA TYPE= NMR SPECTRUM
##DATA CLASS= NTUPLES
##ORIGIN= BRUKER
##OWNER= Administrator
$$ 1.72 TOPSPIN		Version 2.1
$$ 2012-08-10 20:13:30.609 -0500  Administrator@TOPSPIN
$$ Compression mode = diff/dup
##.OBSERVE FREQUENCY= 400.02188249412
##.OBSERVE NUCLEUS= ^1H
##.ACQUISITION MODE= SIMULTANEOUS (DQD)
##.ACQUISITION SCHEME= undefined
##.AVERAGES= 64
##.DIGITISER RES= 22
##SPECTROMETER/DATA SYSTEM= spect
##.PULSE SEQUENCE= noesygpps1d.comp
##.SOLVENT NAME= COFFEE_meoh
##.SHIFT REFERENCE= INTERNAL, COFFEE_meoh, 1, 14.96256
##AUDIT TRAIL= $$ (NUMBER, WHEN, WHO, WHERE, PROCESS, VERSION, WHAT)
$$ ##TITLE= Audit trail, TOPSPIN		Version 2.1
$$ ##JCAMPDX= 5.01
$$ ##ORIGIN= Bruker BioSpin GmbH
$$ ##OWNER= Administrator
$$ $$ C:\Bruker\TOPSPIN/data/COFFEE/nmr/AC1353_CTIAH12172_6648025_TjZmtJMwxs/12/pdata/1/auditp.txt
$$ ##AUDIT TRAIL=  $$ (NUMBER, WHEN, WHO, WHERE, PROCESS, VERSION, WHAT)
(   1,<2012-08-10 20:13:25.578 -0500>,<Administrator>,<TOPSPIN>,<go>,<TOPSPIN 2.1>,
      <created by zg
	started at 2012-08-10 20:01:55.312 -0500,
	POWCHK enabled, PULCHK disabled,
       configuration hash MD5:
       6B 1B 68 BB D9 2E 58 E2 7F 35 AD 54 07 DF 0E 41
       data hash MD5: 64K
       95 EB 36 48 BE 7F 9B DA 60 1A 07 1D E7 A0 0C F8>)
(   2,<2012-08-10 20:13:28.546 -0500>,<Administrator>,<TOPSPIN>,<proc1d>,<TOPSPIN 2.1>,
      <Start of raw data processing
       efp LB = 0.3 FT_mod = 6 PKNL = 1 PHC0 = 0 PHC1 = 0 SI = 128K 
       data hash MD5: 128K
       D9 91 82 0A B2 1E 58 51 6C A5 3B B8 12 32 A4 E0>)
(   3,<2012-08-10 20:13:29.750 -0500>,<Administrator>,<TOPSPIN>,<proc1d>,<TOPSPIN 2.1>,
      <pk PHC0 = 5.328369 PHC1 = 0 
       data hash MD5: 128K
       40 C7 03 8C 57 E4 D3 87 36 06 75 F7 29 46 9A 36>)
(   4,<2012-08-10 20:13:30.281 -0500>,<Administrator>,<TOPSPIN>,<proc1d>,<TOPSPIN 2.1>,
      <abs ABSG = 1 
       data hash MD5: 128K
       80 71 C4 14 E7 03 9A 7E F9 D0 48 AD BD 9F 29 C5>)
(   5,<2012-08-10 20:13:30.375 -0500>,<Administrator>,<TOPSPIN>,<proc1d>,<TOPSPIN 2.1>,
      <abs ABSG = 2 
       data hash MD5: 128K
       C6 91 1D A5 FE B3 63 C8 41 37 30 05 07 A4 E4 27>)
(   6,<2012-08-10 20:13:30.421 -0500>,<Administrator>,<TOPSPIN>,<proc1d>,<TOPSPIN 2.1>,
      <abs ABSG = 3 
       data hash MD5: 128K
       8F FE D4 E6 16 BE E3 95 51 D0 BB A6 59 C7 41 9D>)
(   7,<2012-08-10 20:13:30.468 -0500>,<Administrator>,<TOPSPIN>,<proc1d>,<TOPSPIN 2.1>,
      <abs ABSG = 4 
       data hash MD5: 128K
       AA 9D 38 20 12 56 EE 97 97 E4 0C F3 FC E8 0C E9>)
(   8,<2012-08-10 20:13:30.531 -0500>,<Administrator>,<TOPSPIN>,<proc1d>,<TOPSPIN 2.1>,
      <abs ABSG = 5 
       data hash MD5: 128K
       2D EB D0 10 7F B2 32 C7 2E B0 C5 EA 31 8A 94 F3>)
$$ ##END=
$$ 
$$ $$ hash MD5
$$ $$ 07 B6 AC C1 DF 51 B0 8E 07 1E 57 46 B1 21 D1 3D
##$RELAX= 
##$RELAX= 
##$RELAX= 
##$RELAX= 
##$RELAX= 
##$RELAX= 
##$RELAX= 
##$RELAX= 
$$ Bruker specific parameters
$$ [...]
150 150 150 150 150 150 150 150
##$TP07= 0
##$TPNAME0= <>
##$TPNAME1= <>
##$TPNAME2= <>
##$TPNAME3= <>
##$TPNAME4= <>
##$TPNAME5= <>
##$TPNAME6= <>
##$TPNAME7= <>
##$TPOAL= (0..7)
0.5 0.5 0.5 0.5 0.5 0.5 0.5 0.5
##$TPOFFS= (0..7)
0 0 0 0 0 0 0 0
##$TUNHIN= 0
##$TUNHOUT= 0
##$TUNXOUT= 0
##$USERA1= <user>
##$USERA2= <user>
##$USERA3= <user>
##$USERA4= <user>
##$USERA5= <user>
##$V9= 5
##$VALIST= <valist>
##$VCLIST= <CCCCCCCCCCCCCCC>
##$VD= 0
##$VDLIST= <DDDDDDDDDDDDDDD>
##$VPLIST= <PPPPPPPPPPPPPPP>
##$VTLIST= <TTTTTTTTTTTTTTT>
##$WBST= 1024
##$WBSW= 4
##$XGAIN= (0..3)
0 0 0 0
##$XL= 0
##$YL= 0
##$YMAX_a= 15750856
##$YMIN_a= -8397131
##$ZGOPTNS= <>
##$ZL1= 120
##$ZL2= 120
##$ZL3= 120
##$ZL4= 120
##$ABSF1= 14.96256
##$ABSF2= -5.595622
##$ABSG= 5
##$ABSL= 3
##$ALPHA= 0
##$AQORDER= 0
##$ASSFAC= 0
##$ASSFACI= 0
##$ASSFACX= 0
##$ASSWID= 0
##$AUNMP= <proc_prof1d_extract.lims>
##$AXLEFT= 0
##$AXNAME= <>
##$AXNUC= <1H>
##$AXRIGHT= 0
##$AXTYPE= 0
##$AXUNIT= <>
##$AZFE= 0.1
##$AZFW= 0.1
##$BCFW= 0
##$BC_mod= 0
##$BYTORDP= 0
##$COROFFS= 0
##$CY= 15
##$DATMOD= 1
##$DC= 0
##$DFILT= <>
##$DTYPP= 0
##$F1P= 0
##$F2P= 0
##$FCOR= 0.5
##$FTSIZE= 131072
##$FT_mod= 6
##$GAMMA= 0
##$GB= 0
##$INTBC= 1
##$INTSCL= 1
##$ISEN= 128
##$LB= 0.3
##$LEV0= 0
##$LPBIN= 0
##$MAXI= 10000
##$MC2= 0
##$MEAN= 0
##$ME_mod= 0
##$MI= 0
##$NCOEF= 0
##$NC_proc= -2
##$NLEV= 6
##$NOISF1= 0
##$NOISF2= 0
##$NSP= 0
##$NTH_PI= 0
##$NZP= 0
##$OFFSET= 14.96256
##$PC= 1
##$PHC0= 5.328369
##$PHC1= 0
##$PH_mod= 1
##$PKNL= yes
##$PPARMOD= 0
##$PPDIAG= 0
##$PPIPTYP= 0
##$PPMPNUM= 2147483647
##$PPRESOL= 1
##$PSCAL= 4
##$PSIGN= 0
##$PYNMP= <proc.py>
##$REVERSE= no
##$SF= 400.020009013728
##$SI= 131072
##$SIGF1= 0
##$SIGF2= 0
##$SINO= 400
##$SIOLD= 131072
##$SPECTYP= <>
##$SREGLST= <1H.CDCl3>
##$SSB= 0
##$STSI= 131072
##$STSR= 0
##$SW_p= 8223.68421052631
##$SYMM= 0
##$S_DEV= 0
##$TDeff= 65536
##$TDoff= 0
##$TI= <>
##$TILT= no
##$TM1= 0
##$TM2= 0
##$TOPLEV= 0
##$USERP1= <user>
##$USERP2= <user>
##$USERP3= <user>
##$USERP4= <user>
##$USERP5= <user>
##$WDW= 1
##$XDIM= 131072
##$YMAX_p= 413189878
##$YMIN_p= -13128
##$CURPLOT= <Network HP LaserJet P1505>
##$CURPRIN= <$Network HP LaserJet P1505>
##$DFORMAT= <normdp>
##$LAYOUT= <+/1D_H.xwp>
##$LFORMAT= <normlp>
##$PFORMAT= <normpl>
##$SURQMSG= 1
$$ End of Bruker specific parameters
$$ ---------------------------------
##NTUPLES= NMR SPECTRUM
##VAR_NAME=  FREQUENCY,     SPECTRUM/REAL,   SPECTRUM/IMAG
##SYMBOL=    X,             R,               I
##VAR_TYPE=  INDEPENDENT,   DEPENDENT,       DEPENDENT
##VAR_FORM=  AFFN,          ASDF,            ASDF
##VAR_DIM=   131072,        131072,          131072
##UNITS=     HZ,            ARBITRARY UNITS, ARBITRARY UNITS
##FACTOR=    0.0627417313425164, 1,          1
##FIRST=     8223.62146879497, 3896,         -53665
##LAST=      0,             4963,            -53574
##MIN=       0,             -13128,          0
##MAX=       8223.62146879497, 413189878,    0
$$ Real data points
##PAGE= N=1
##DATA TABLE= (X++(R..R)), XYDATA
$$ [...]
63234D25613J5360J6750J7923J9149K0355K1451K2531K3516K4059K3961K3435
$$ 425613 440973 457723 475646 494795 515150 536601 559132 582648 606707 630668 654103
63223F54103K2758K1891K0692J9312J8120J7322J6937J6999J7509J8174J8517
$$ 654103 676861 698752 719444 738756 756876 774198 791135 808134 825643 843817 862334
63212H62334J8364J7902J7065J5166J1549O476R74m301r523j4929k0109k4452
$$ 862334 880698 898600 915665 930831 942380 948856 949830 945529 936006 921077 900968 876516
63200H76516k7944l0895l3078l3725l2575l0386k8135k6054k3690k0720j7327
$$ 876516 848572 817677 784599 750874 718299 687913 659778 633724 610034 589314 571987
63189E71987j3892j0614p522m733k464o97J002L027N068O372O812P236Q384R916
$$ 571987 558095 547481 539959 535226 532762 532065 533067 536094 541162 547534 554346 561582 569966 579882
63175E79882J1014J1554J1901J2024J1690J1361J1738J2375J1965J0301Q764Q293
$$ 579882 590896 602450 614351 626375 638065 649426 661164 673539 685504 695805 704569 712862
63163G12862Q000O700M690K904J079j785n489q579j0298j1379j2680j4050j4916
$$ 712862 720862 727562 732252 735156 736235 734450 728961 720382 710084 698705 686025 671975 657059
63150F57059j5180j5078j4712j4119j3378j2418j1081r556q318p497o747n838
$$ 657059 641879 626801 612089 597970 584592 572174 561093 551537 543219 535722 528975 523137
63138E23137m931m062k931j484k78J74Q3J06N85J370K190K854L233L314L248L218
$$ 523137 518206 514144 511213 509729 509451 509625 509708 509814 510399 511769 513959 516813 520046 523360 526608 529826
63122E29826L312L555L914M196M190L953L803L920M173M353M391M297M163M177
$$ 529826 533138 536693 540607 544803 548993 552946 556749 560669 564842 569195 573586 577883 582046 586223
63108E86223M392M473M053L378L094L314L449L177K918K923K609J486K75Q1P27
$$ 586223 590615 595088 599141 602519 605613 608927 612376 615553 618471 621394 624003 625489 625764 625845 626572
63093F26572Q29k60j577j961j485r19m11M35J531K229K287K226K546L132L649
$$ 626572 627401 627141 625564 623603 622118 621199 620788 621223 622754 624983 627270 629496 632042 635174 638823
63078F38823M109M702N381N970O529P309Q369R441J0207J0560J0697J0937J1397
$$ 638823 642932 647634 653015 658985 665514 672823 681192 690633 700840 711400 722097 733034 744431
63065G44431J1869J2126J2356J3044J4386J6115J7960J9924K1920K3597K4865
$$ 744431 756300 768426 780782 793826 808212 824327 842287 862211 884131 907728 932593
63054I32593K6306K8546L1472L4448L7141L9651M1898M3504M4343M4752M5089
$$ 932593 958899 987445 1018917 1053365 1090506 1130157 1172055 1215559 1259902 1304654 1349743
63043A349743M5393M5506M5205M4305M2947M1788M1414M1632M1760M1622M1689
$$ 1349743 1395136 1440642 1485847 1530152 1573099 1614887 1656301 1697933 1739693 1781315 1823004
63032A823004M2200M2723M2760M2185M0814L8039L3260K6300J7308O653m872j6332
$$ 1823004 1865204 1907927 1950687 1992872 2033686 2071725 2104985 2131285 2148593 2155246 2150374 2134042
63020B134042k7415l8384m8978n7945o4206o8013p0336p1477p0896o8168o3550
$$ 2134042 2106627 2068243 2019265 1961320 1897114 1829101 1758765 1687288 1616392 1548224 1484674
63009A484674n7704n1374m5197l9440l3852k8126k2356j6899j1945p574l885p74
$$ 1484674 1426970 1375596 1330399 1290959 1257107 1228981 1206625 1189726 1177781 1170207 1166322 1165548
62997A165548K189N212P868R626J0663J1692J3003J4118J4453J4054J3557J3487
$$ 1165548 1167737 1172949 1180817 1190443 1201106 1212798 1225801 1239919 1254372 1268426 1281983 1295470
62985A295470J3644J3261J1917J0096Q438O626L707m69m942r099j3431j8404k3382
$$ 1295470 1309114 1322375 1334292 1344388 1352826 1359452 1363159 1362690 1357748 1348649 1335218 1316814 1293432
62972A293432k7530l1051l4584l7832l9773m0043l9178l7714l5861l3926l2162
$$ 1293432 1265902 1234851 1200267 1162435 1122662 1082619 1043441 1005727 969866 935940 903778
62961I03778l0267k7773k4887k2283k0099j7935j5705j3732j1982j0058q003o371
$$ 903778 873511 845738 820851 798568 778469 760534 744829 731097 719115 709057 701054 694683
62949F94683n414m844m496m503m761m898m914n134n520n738n948o728p994q813
$$ 694683 689269 684425 679929 675426 670665 665767 660853 655719 650199 644461 638513 631785 623791 614978
62935F14978q600p738o838o053n492n443n808n941n489m813m264l680l000k693
$$ 614978 606378 598640 591802 585749 580257 574814 569006 563065 557576 552763 548499 544819 541819 539126
62921E39126l056l603l650l092k192j108q9L88J20n15j118j669k089k069j750
$$ 539126 536070 532467 528817 525725 523533 522425 522336 522724 522844 522329 521211 519542 517453 515384 513634
62906E13634j855k507k628j328O47J762J683J358J382J342R33N72N28K04j068
$$ 513634 511779 509272 506644 505316 505963 507725 509408 510766 512148 513490 514423 514995 515523 515727 514659
62891E14659k952m399m820m514m060l707l454l364l509l706l565k964k236j719
$$ 514659 511707 507308 502488 497974 493914 490207 486753 483389 479880 476174 472609 469645 467409 465690
62877D65690j316p74j95J16K11L46L84j04r42j279p42m8n8o86j340j868k419k719
$$ 465690 464374 463600 463405 463521 463732 464078 464462 464358 463416 462137 461395 461347 461289 460603 459263 457395 454976 452257
62859D52257k371j733j675k302k759k497k059k134k467k312j632j153j276j551
$$ 452257 449886 448153 446478 444176 441417 438920 436861 434727 432260 429948 428316 427163 425887 424336
62845D24336j435j059r12j099j298j338j303j078k81J046K058J913Q20j01r0M80
$$ 424336 422901 421842 420930 419831 418533 417195 415892 414814 414533 415579 417637 419550 420370 420269 420179 420659
62829D20659O77P2r29j630j698j311q23l95o6K9k59p13q33m86j66k74m87k78K60
$$ 420659 421336 421408 420479 418849 417151 415840 415017 414622 414556 414585 414326 413613 412780 412294 412128 411854 411367 411089 411349
62810D11349O30Q75J545K715L680L901L718L825M400N109N676O095O473O890P393
$$ 411349 411979 412854 414399 417114 420794 424695 428413 432238 436638 441747 447423 453518 459991 466881 474274
62795D74274Q015Q870J0179J1961J3763J5026J5750J6475J7532J8743J9943K1475
$$ 474274 482289 491159 501338 513299 527062 542088 557838 574313 591845 610588 630531 652006
62783F52006K3861K7161L0855L4331L7484M0916M5397N0939N6647O1701O6270
$$ 652006 675867 703028 733883 768214 805698 846614 892011 942950 999597 1061298 1127568
62772A127568P0985P5700P9522Q1894Q2986Q2889Q1133P7263P1243O3113N2756
$$ 1127568 1198553 1274253 1353775 1435669 1518655 1601544 1682677 1759940 1831183 1894296 1947052
62761A947052M0316K6365J1405m278k0063l4850m7890n9230o8966p6528q1230
$$ 1947052 1987368 2013733 2025138 2020860 2000797 1965947 1918057 1858827 1789861 1713333 1632103
62750A632103q3153q3084q1833p9914p7584p4747p1068o6488o1442n6396n1420
$$ 1632103 1548950 1465866 1384033 1304119 1226535 1151788 1080720 1014232 952790 896394 844974
62739H44974m6493m1878l7922l4690l2051k9765k7382k4471k1186j8244j6116
$$ 844974 798481 756603 718681 683991 651940 622175 594793 570322 549136 530892 514776
62728E14776j4609j3397j2435j1531j0199q396o929o456o463n888m544l270k746
$$ 514776 500167 486770 474335 462804 452605 444209 437280 430824 424361 418473 413929 410659 407913
62715D07913k677k305j305n6Q68J333J750K516L581M756O174P958R679J0849J1823
$$ 407913 405236 402931 401626 401570 402438 403771 405521 408037 411618 416374 422548 430506 440185 451034 462857
62700D62857J3435J5681J7697J9140K0626K2515K4378K6099K8350L1318L3994
$$ 462857 476292 491973 509670 528810 549436 571951 596329 622428 650778 682096 716090
62689G16090L5668L6995L8535L9203L7614L4270L0883K7826K3801J7978J1067
$$ 716090 751758 788753 827288 866491 904105 938375 969258 997084 1020885 1038863 1049930
62678A049930M037l005j0203j7072k2806k7050l0142l2856l5714l8172l8912l7505
$$ 1049930 1053967 1050962 1040759 1023687 1000881 973831 943689 910833 875119 836947 798035 760530
62666G60530l5314l3876l2889l0991k8139k5739k4388k3102k1128j9117j7725
$$ 760530 725216 691340 658451 627460 599321 573582 549194 526092 504964 485847 468122
62655D68122j6331j4171j1781j0244r506q578p136o029o091p084p952p802o562
$$ 468122 451791 437620 425839 415595 406089 397511 390375 384346 378255 371171 363219 355417 348855
62642C48855m974l924l711l992m324m556m615m384l919l531l464l654l846l755
$$ 348855 343881 339957 336246 332254 327930 323374 318759 314375 310456 306925 303461 299807 295961 292206
62628B92206l133k070j189j099j573j729j147l88k05o88j376j750j427k59J339
$$ 292206 289073 287003 285814 284715 283142 281413 280266 279878 279673 278985 277609 275859 274432 274173 275512
62613B75512K514K754K396K158K370K918L578M188M662N176O111P605R230J0461
$$ 275512 278026 280780 283176 285334 287704 290622 294200 298388 303050 308226 314337 321942 331172 341633
62599C41633J1278J2109J3248J4630J6114J7838K0140K3238K6956L0821L4390
$$ 341633 352911 365020 378268 392898 409012 426850 446990 470228 497184 528005 562395
62588E62395L7532M0274M2547M4177M5088M5260M4433M2103L8000L2468K6201
$$ 562395 599927 640201 682748 726925 772013 817273 861706 903809 941809 974277 1000478
62577A000478J9577J2341M154m581j2681j9231k4462k9146l3346l6296l7577l7674
$$ 1000478 1020055 1032396 1036550 1031969 1019288 1000057 975595 946449 913103 876807 839230 801556
62565H01556l7092l5684l3331l0672k8451k6581k4584k2558k0982j9762j8319
$$ 801556 764464 728780 695449 664777 636326 609745 585161 562603 541621 521859 503540
62554E03540j6518j4786j3408j2383j1882j2055j2396j2164j1448j1030j1059
$$ 503540 487022 472236 458828 446445 434563 422508 410112 397948 386500 375470 364411
62543C64411j0751r640q245p111o028m726l671l369l418k970j904r41o08o55n11
$$ 364411 353660 344020 335775 328664 322636 317910 314239 310870 307452 304482 302578 301637 301029 300374 299863
62528B99863NN73Q55J001J571K822M186M847M693M355M311M515M959O006P763
$$ 299863 299868 300441 301296 302297 303868 306690 310876 315723 320416 324771 329082 333597 338556 344562 352325
62513C52325R646J1074J2260J3829J5819J7503J8361J8783J9605K1080K2509K2988
$$ 352325 361971 373045 385305 399134 414953 432456 450817 469600 489205 510285 532794 555782
62501E55782K2286K0776J8656J5695J1846P608L462n63m432p726j0265j2635j5352
$$ 555782 578068 598844 617500 633195 645041 652649 656111 655548 651116 643390 633125 620490 605138
62488F05138j7896j9373j9844k0064k0088j9177j7173j4917j3113j1626j0203
$$ 605138 587242 567869 548025 527961 507873 488696 471523 456606 443493 431867 421664
62477D21664q964p838o350m421k673j500n52N45J602K422L216M055M603M818N141
$$ 421664 412700 404862 398512 394091 391418 389918 389366 389911 391513 393935 397151 401206 405809 410627 415768
62462D15768N566N398M503L937M526N627O136O017N926N969N952O333P695R501
$$ 415768 421334 426732 431235 435172 439698 445325 451461 457478 463404 469373 475325 481658 489353 498854
62448D98854J0563J0636J0434J0160R176P288N250L537J619j120m426p642j0508
$$ 498854 509417 520053 530487 540647 549823 557111 562361 565898 567517 566397 561971 554329 543821
62435E43821j3046j5057j6226j6463j5847j4562j3084j2023j1449j0734r394p746
$$ 543821 530775 515718 499492 483029 467182 452620 439536 427513 416064 405330 395936 388190
62423C88190o413n480m636l842l349l088k538j368J30J397K160K496K588K663
$$ 388190 381777 376297 371661 367819 364470 361382 358844 357476 357606 359003 361163 363659 366247 368910
62409C68910K941L379L607L447L395M123N421O151N624M512L913L881L590K693
$$ 368910 371851 375230 378837 382284 385679 389802 395223 401374 406998 411510 415423 419304 422894 425587
62395D25587J697R37N7j156k223k768l178l923m649m617l858l182l124l306k817
$$ 425587 427284 428221 428278 427122 424899 422131 418953 415030 410381 405764 401906 398724 395600 392294 389477
62380C89477r42K204N415P110O903O263P011R301J1783J3661J5689J8751K2353
$$ 389477 388535 390739 396154 403264 410167 416430 423441 432742 444525 458186 473875 492626 514979
62367E14979K5213K7040K8931L2005L6171M0455M4222M7671N1172N4362N6197
$$ 514979 540192 567232 596163 628168 664339 704794 749016 796687 847859 902221 958418
62356I58418N5874N3558M9990M5510L9725L2175K3102J3399L906m894j2573j8539
$$ 958418 1014292 1067850 1117840 1163350 1203075 1235250 1258352 1271751 1275657 1270763 1258190 1239651
62344A239651k2554k5329k8100l1437l4736l7103l8355l8837l8600l7319l4995
$$ 1239651 1217097 1191768 1163668 1132231 1097495 1060392 1022037 983200 944600 907281 872286
62333H72286l2183k9431k6865k4509k2567k1196k0299j9727j9442j9304j8899
$$ 872286 840103 810672 783807 759298 736731 715535 695236 675509 656067 636763 617864
62322F17864j7867j6259j4450j2773j1264r720p993o353n352n112m940m077k659
$$ 617864 599997 583738 569288 556515 545251 535531 527538 521185 515833 510721 505781 501704 499045
62309D99045j497j003r07j083j860l248m512m934m626m191l931l719l374k892
$$ 499045 497548 496545 495638 494555 492695 489447 484935 480001 475375 471184 467253 463534 460160 457268
62295D57268k465k344k438k064p06J030J930J872K147L647N574O557O416O026
$$ 457268 454803 452459 450021 447957 447251 448281 450211 452083 454230 457877 463451 470008 476424 482450
62281D82450O027O483P392Q594R468R623R677J0527J2061J3413J4339J5365J6634
$$ 482450 488477 494960 502352 510946 520414 530037 539714 550241 562302 575715 590054 605419 622053
62268F22053J7663J8431J9694K1861K4328K6537K8900L2153L6247M0546M4690
$$ 622053 639716 658147 677841 699702 724030 750567 779467 811620 847867 888413 933103
62257I33103M8677N2304N5006N6186N5320N1970M6139L8541L0067K0977J1000
$$ 933103 981780 1034084 1089090 1145276 1200596 1252566 1298705 1337246 1367313 1388290 1399290
62246A399290L50r805j8152k4453k9608l4555l9335m3302m5960m7314m7484m6363
$$ 1399290 1399640 1389835 1371683 1347230 1317622 1283067 1243732 1200430 1154470 1107156 1059672 1013309
62234A013309m3895m0426l6564l2703k8851k4875k0841j7058j3851j1256r000
$$ 1013309 969414 928988 892424 859721 830870 805995 785154 768096 754245 742989 733989
62223G33989o871n036l827l247k971k782k689k608k353k094k317l047l472k847
$$ 733989 727118 722082 718255 715008 712037 709255 706566 703958 701605 699511 697194 694147 690675 687828
62209F87828j458k84J30M7q6k8M55J721L814O170Q019R090R769J0557J1519J2423
$$ 687828 686370 686086 686216 686263 686177 686149 686604 688325 692139 698309 706328 715418 725187 735744 747263 759686
62193G59686J3367J4901J7319K0093K2458K4308K5943K7093K7010K5642K3875
$$ 759686 773053 787954 805273 825366 847824 872132 898075 925168 952178 977820 1001695
62182A001695K2195J9898J6330J2200Q883O813N474M695N025O756R469J2687J6366
$$ 1001695 1023890 1043788 1060118 1072318 1081201 1088014 1093488 1098183 1103208 1109964 1119433 1132120 1148486
62169A148486K0449K4568K8399L1955L5191L7629L8644L7912L5383L1115K5335
$$ 1148486 1168935 1193503 1221902 1253857 1289048 1326677 1365321 1403233 1438616 1469731 1495066
62158A495066J8623J1821N724Q49k645m919o375p578r101j1156j3376j5156j6209
$$ 1495066 1513689 1525510 1531234 1532083 1529438 1524519 1518144 1510566 1501465 1490309 1476933 1461777 1445568
62145A445568j6541j5930j4031j1128q286o229m542k484k42J274J672J497J400
$$ 1445568 1429027 1413097 1399066 1387938 1379652 1373423 1368881 1366397 1366155 1367429 1369101 1370598 1371998
62132A371998J497J632J824K279L211M753O769Q799J0428J1700J2985J4474J5992
$$ 1371998 1373495 1375127 1376951 1379230 1382441 1387194 1393963 1402762 1413190 1424890 1437875 1452349 1468341
62119A468341J7265J8158J8753J9352K0215K1219K1969K2423K2988K3817K4479
$$ 1468341 1485606 1503764 1522517 1541869 1562084 1583303 1605272 1627695 1650683 1674500 1698979
62108A698979K4723K5037K5871K6736K6847K6419K6521K7681K9404L1098L2745
$$ 1698979 1723702 1748739 1774610 1801346 1828193 1854612 1881133 1908814 1938218 1969316 2002061
62097B002061L4532L6454L8493M0648M2523M3421M3058M1837M0243L8470L6839
$$ 2002061 2036593 2073047 2111540 2152188 2194711 2238132 2281190 2323027 2363270 2401740 2438579
62086B438579L6142L7076L9520M2677M5737M8140M9362M8831M6389M2754L9270
$$ 2438579 2474721 2511797 2551317 2593994 2639731 2687871 2737233 2786064 2832453 2875207 2914477
62075B914477L6904L5534L4488L3702L3868L5291L7289L9049M0570M2191M3746
$$ 2914477 2951381 2986915 3021403 3055105 3088973 3124264 3161553 3200602 3241172 3283363 3327109
62064C327109M4822M5376M5238M3384L8782L1964K4784J8466J2726P046J775k490
$$ 3327109 3371931 3417307 3462545 3505929 3544711 3576675 3601459 3619925 3632651 3639697 3641472 3638982
62052C638982n935r281j2949j6972k1298k5659k9374l1778l2793l2800l2142l0921
$$ 3638982 3633047 3623766 3610817 3593845 3572547 3546888 3517514 3485736 3452943 3420143 3388001 3357080
62040C357080k9210k7133k4861k2578k0417j8319j6171j4076j2291j0897r753
$$ 3357080 3327870 3300737 3275876 3253298 3232881 3214562 3198391 3184315 3172024 3161127 3151374
62029C151374q844q382q372q343p718o415n017m307m539n082m965l950k888k739
$$ 3151374 3142530 3134148 3125776 3117433 3109715 3103300 3098283 3093976 3089437 3084355 3079390 3075440 3072552 3069813
62015C069813l520m481n095n465n854o345o893p358p483p206o898o920p098p033
$$ 3069813 3066293 3061812 3056717 3051252 3045398 3039053 3032160 3024802 3017319 3010113 3003215 2996295 2989197 2982164
62001B982164o842o980p440p739p837q466j0355j3496j7325k1271k5091k8933
$$ 2982164 2975322 2968342 2960902 2953163 2945326 2936860 2926505 2913009 2895684 2874413 2849322 2820389
61989B820389l3143l7628m1485m3668m4007m3132m1559l9446l7120l5117l3458
$$ 2820389 2787246 2749618 2708133 2664465 2620458 2577326 2535767 2496321 2459201 2424084 2390626
61978B390626l1601k9353k7240k5728k4643k3614k2568k1471k0168j8780j7796
$$ 2390626 2359025 2329672 2302432 2276704 2252061 2228447 2205879 2184408 2164240 2145460 2127664
61967B127664j7316j6747j5677j4585j4178j4329j4316j3897j3498j3398j3268
$$ 2127664 2110348 2093601 2077924 2063339 2049161 2034832 2020516 2006619 1993121 1979723 1966455
61956A966455j2707j1834j1123j0806j0644j0303r728r073q375p426o047m251
$$ 1966455 1953748 1941914 1930791 1919985 1909341 1899038 1889310 1880237 1871862 1864436 1858389 1854138
61944A854138k112K53K521M296N640P084Q932J0884J2675J4613J7069J9873K2738
$$ 1854138 1852026 1852279 1854800 1859096 1864736 1871820 1880752 1891636 1904311 1918924 1935993 1955866 1978604
61931A978604K5864K9440L2948L5809L8481M2019M6714N2037N7829O4557P2387
$$ 1978604 2004468 2033908 2066856 2102665 2141146 2183165 2229879 2281916 2339745 2404302 2476689
61920B476689Q1031R0669J02072J15532J30659J47555J67260J90631K17632K48194
$$ 2476689 2557720 2648389 2750461 2865993 2996652 3144207 3311467 3502098 3719730 3967924
61910C967924K82946L22433L66451M14856M68368N27740N92374O60280P28567
$$ 3967924 4250870 4573303 4939754 5354610 5822978 6350718 6943092 7603372 8331939
61901H331939P92923Q46502Q80016Q83209Q46550P62898O29462M49623K33714
$$ 8331939 9124862 9971364 10851380 11734589 12581139 13344037 13973499 14423122 14656836
61892A4656836j637k35753m47881o21905p49251q28698q64302q63523q35615p89731
$$ 14656836 14655199 14419446 13971565 13349660 12600409 11771711 10907409 10043886 9208271 8418540
61882H418540p33220o71306o07865n46025m88037m35042l87214l44205l05599
$$ 8418540 7685320 7014014 6406149 5860124 5372087 4937045 4549831 4205626 3900027
61873C900027k71117k40520k13567j90163j70310j53565j38795j24891j11690
$$ 3900027 3628910 3388390 3174823 2984660 2814350 2660785 2521990 2397099 2285409
61864B285409r9719q9209p9837p1350o3736n6781n0153m3966l8632l4109k9856
$$ 2285409 2185690 2096481 2016644 1945294 1881558 1824777 1774624 1730658 1692026 1657917 1628061
61853A628061k5623k1556j7545j3293r176o121m375l150j823o66p9O3j40q81j948
$$ 1628061 1602438 1580882 1563337 1550044 1540868 1534747 1530372 1527222 1525399 1524733 1524654 1524717 1524577 1523696 1521748
61838A521748k550k435k294k485k210p33J388L162M584O242P975Q940Q851Q257
$$ 1521748 1519198 1516763 1514469 1511984 1509774 1509041 1510429 1513591 1518175 1524417 1532392 1541332 1550183 1558440
61824A558440P752P508P481P525P395P151P298Q168R393J0431J1337J2638J4705
$$ 1558440 1566192 1573700 1581181 1588706 1596101 1603252 1610550 1618718 1628111 1638542 1649879 1662517 1677222
61811A677222J7648K1487K5982L0589L4954L9254M3811M8686N3782N8976O4068
$$ 1677222 1694870 1716357 1742339 1772928 1807882 1847136 1890947 1939633 1993415 2052391 2116459
61800B116459O9137P4940Q2177R0350R8255J05860J14545J25098J36727J48676
$$ 2116459 2185596 2260536 2342713 2433063 2531318 2637178 2751723 2876821 3013548 3162224
61790C162224J61601J76494J93483K12814K35844K63652K95522L30298L68694
$$ 3162224 3323825 3500319 3693802 3906616 4142460 4406112 4701634 5031932 5400626
61781E400626M12803M63957N22523N89386O65943P52596Q48621R53378J066055
$$ 5400626 5813429 6277386 6799909 7389295 8055238 8807834 9656455 10609833 11675888
61772A1675888J183815J300923J409257J498019J552719J556080J491404J345955
$$ 11675888 12859703 14160626 15569883 17067902 18620621 20176701 21668105 23014060
61764B3014060J113579P98137M16940K38m14904p93080j106977j340580j489609
$$ 23014060 24127639 24925776 25342716 25342954 24928050 24134970 23027993 21687413 20197804
61755B0197804j559539j562215j512773j427362j320756j204327j085907r71148
$$ 20197804 18638265 17076050 15563277 14135915 12815159 11610832 10524925 9553777
61747I553777q64160p66858o79122o00504n31332m71812m20724l75807l35325
$$ 9553777 8689617 7922759 7243637 6643133 6111801 5639989 5219265 4843458 4508133
61738D508133k98865k66801k39209k15305j93844j74175j56633j41649j28702
$$ 4508133 4209268 3942467 3703258 3487953 3294109 3119934 2963301 2821652 2692950
61729B692950j16732j05412r5294q6745p9368p2674o6706o1790n8014n5079n2412
$$ 2692950 2576218 2470806 2375512 2288767 2209399 2136725 2070019 2008229 1950215 1895136 1842724
61718A842724m9475m6258m3354m1157l9265l7019l4429l1928k9572k7149k4870
$$ 1842724 1793249 1746991 1703637 1662480 1623215 1586196 1551767 1519839 1490267 1463118 1438248
61707A438248k3183k1916k0409j8556j7011j6367j6608j7350j8048j8118j7429
$$ 1438248 1415065 1393149 1372740 1354184 1337173 1320806 1304198 1286848 1268800 1250682 1233253
61696A233253j6594j6120j5587j4358j2814j1995j2133j2501j2552j2304j1748
$$ 1233253 1216659 1200539 1184952 1170594 1157780 1145785 1133652 1121151 1108599 1096295 1084547
61685A084547j0900j0334j0552j0919j0404r340r073r791j0177r597r032r282
$$ 1084547 1073647 1063313 1052761 1041842 1031438 1022098 1013025 1003234 993057 983460 974428 965146
61673I65146r636r305q822q915q992q047o358n151m970n257n296m750l682k673
$$ 965146 955510 946205 937383 928468 919476 911429 905071 899920 894950 889693 884397 879647 875965 873292
61659H73292k571l499m498m669m153l491k682j593o11l1N82J546K114J485L38
$$ 873292 870721 867222 862724 858055 853902 850411 847729 846136 845525 845494 846076 847622 849736 851221 851559
61644H51559K03J364K510K565J847J236J034J113J413J814J962J658J224J152
$$ 851559 851762 853126 855636 858201 860048 861284 862318 863431 864844 866658 868620 870278 871502 872654
61630H72654J553K054K158J632P64J63J92N42N59j08j305k691m050n307o436p371
$$ 872654 874207 876261 878419 880051 880815 880978 881170 881712 882271 882163 880858 878167 874117 868810 862374 855003
61614H55003p948q065p888p683p383o680n666m975n004n331n324m954m632m460
$$ 855003 847055 838990 831102 823419 816036 809356 803690 798715 793711 788380 783056 778102 773470 769010
61600G69010m204l818l440k959k101r75j08K71N34J189K314L575M543M958M955
$$ 769010 764806 760988 757548 754589 752488 751513 751405 751676 752210 753399 755713 759288 763831 768789 773744
61585G73744N136O067P603R009R890J0688J2008J3788J5455J6748J7876J9032
$$ 773744 778880 784947 792550 801559 811449 822137 834145 847933 863388 880136 898012 917044
61573I17044K0236K1741K4013K6900K9343L0387L0381L0593L1685L3037L3694
$$ 917044 937280 959021 983034 1009934 1039277 1069664 1100045 1130638 1162323 1195360 1229054
61562A229054L3433L2705L1950L1255L0421K9129K7273K5286K3779K2754K1518
$$ 1229054 1262487 1295192 1327142 1358397 1388818 1417947 1445220 1470506 1494285 1517039 1538557
61551A538557J9742J8027J7057J6461J5119J2398Q627M512N34l139o583r984j3298
$$ 1538557 1558299 1576326 1593383 1609844 1624963 1637361 1645988 1650500 1651034 1647895 1641312 1631328 1618030
61538A618030j6129j8082j9137j9466j9168j8388j7347j5985j3930j1162q309
$$ 1618030 1601901 1583819 1564682 1545216 1526048 1507660 1490313 1474328 1460398 1449236 1440927
61527A440927n851l475p55K088M717P558J1335J6014K1062K6490L2798L9898M7046
$$ 1440927 1435076 1431601 1430846 1432934 1437651 1445209 1456544 1472558 1493620 1520110 1552908 1592806 1639852
61514A639852N3910O1008O9004P8168Q8568J00200J12876J26532J41586J58481
$$ 1639852 1693762 1754770 1823774 1901942 1990510 2090710 2203586 2330118 2471704 2630185
61504B630185J77054J96882K17944K40055K61829K81133K96311L06042L08147
$$ 2630185 2807239 3004121 3222065 3462120 3723949 4005082 4301393 4607435 4915582
61495D915582K99818K79336K46698K02652J48471Q7125K3536l7221r1589j37441
$$ 4915582 5215400 5494736 5741434 5944086 6092557 6179682 6203218 6165997 6074408 5936967
61485E936967j73572j99853k17062k25944k26913k20925k09849j95526j79123
$$ 5936967 5763395 5563542 5346480 5120536 4893623 4672698 4462849 4267323 4088200
61476D088200j61618j44025j26763j09660r2904p7099o2083m6950l1800j8203
$$ 4088200 3926582 3782557 3655794 3546134 3453230 3376131 3314048 3267098 3235298 3217095
61466C217095p054K850J2964K2787L0877L7220M3064M8745N3203N5651N6365N5803
$$ 3217095 3210041 3212891 3225855 3248642 3279519 3316739 3359803 3408548 3461751 3517402 3573767 3629570
61454C629570N4085N1661M9442M7788M6151M4153M2434M1991M3135M5505M8767
$$ 3629570 3683655 3735316 3784758 3832546 3878697 3922850 3965284 4007275 4050410 4095915 4144682
61443D144682N2707N6769O0032O1896O2518O2262O0877N7645N2380M5803L8608
$$ 4144682 4197389 4254158 4314190 4376086 4438604 4500866 4561743 4619388 4671768 4717571 4756179
61432D756179L0689K1745J2150K504p243j7360k7283l5968m3239m9591n4668n7183
$$ 4756179 4786868 4808613 4820763 4823267 4816024 4798664 4771381 4735413 4692174 4642583 4587915 4530732
61420D530732n6783n4788n2485m9671m5571m0291l4587k8868k3206j7731j2376
$$ 4530732 4473949 4419161 4366676 4317005 4271434 4231143 4196556 4167688 4144482 4126751 4114375
61409D114375o839j396K855N149N814N329L390l09n088r888j4296j8196k1063
$$ 4114375 4107536 4106140 4108995 4114144 4119958 4125287 4128677 4128368 4123280 4113392 4099096 4080900 4059837
61396D059837k2391k2219k0340j5704p658K776J4059K6247M0710N8016P7336R7902
$$ 4059837 4037446 4015227 3994887 3979183 3971525 3974301 3988360 4014607 4055317 4113333 4190669 4288571
61384D288571J19827J43225J67625J92600K18191K44198K69507K92475L11530
$$ 4288571 4408398 4551623 4719248 4911848 5130039 5374237 5643744 5936219 6247749
61375F247749L25179L31734L29244L15674K89382K50064J99414J40782P8113J5116
$$ 6247749 6572928 6904662 7233906 7549580 7838962 8089026 8288440 8429222 8507335 8522451
61365H522451m5059r9927j47707j87482k19582k45569k67040k84179k95984l01983
$$ 8522451 8477392 8377465 8229758 8042276 7822694 7577125 7310085 7025906 6729922 6427939
61355F427939l02913k99534k91935k80556k66835k51989k35973k18584k00681
$$ 6427939 6125026 5825492 5533557 5253001 4986166 4734177 4498204 4279620 4078939
61346D078939j83262j66056j48339j30655j14329r9588q5377p1012n6903m3612
$$ 4078939 3895677 3729621 3581282 3450627 3336298 3236710 3151333 3080321 3023418 2979806
61336B979806l1208j9645q878J366J1271K0468K8584L5963M2981M9000N3003N5097
$$ 2979806 2948598 2928953 2920075 2921441 2932712 2953180 2981764 3017727 3060708 3109708 3162711 3217808
61324C217808N6325N7061N6763N5205N2846M9885M6095M1811L7998L4982L2077
$$ 3217808 3274133 3331194 3387957 3443162 3496008 3545893 3591988 3633799 3671797 3706779 3738856
61313C738856K8832K5709K3213K1157J9174J7184J4964J1958P916L105k309q500
$$ 3738856 3767688 3793397 3816610 3837767 3856941 3874125 3889089 3901047 3908963 3912068 3909759 3901259
61301C901259j5331k2218k8862l5435m1818m7422n2073n6331o0479o3950o6134
$$ 3901259 3885928 3863710 3834848 3799413 3757595 3710173 3658100 3601769 3541290 3477340 3411206
61290C411206o7124o7156o5970o3237n9165n4166m8395m2055l5766l0107k5068
$$ 3411206 3344082 3276926 3210956 3147719 3088554 3034388 2985993 2943938 2908172 2878065 2852997
61279B852997k0349j5927j2027q843o625n796o573q587j1057j3311j5039j6311
$$ 2852997 2832648 2816721 2804694 2795851 2789226 2783430 2776857 2768270 2757213 2743902 2728863 2712552
61267B712552j7362j8175j8277j7216j5190j2770j0101o751k318L329J0382J9073
$$ 2712552 2695190 2677015 2658738 2641522 2626332 2613562 2603461 2596710 2594392 2597721 2608103 2627176
61255B627176K9247M0440N2438O5291P8814R2650J06760J21092J34733J46195
$$ 2627176 2656423 2696863 2749301 2814592 2893406 2986056 3092816 3213908 3348641 3494836
61245C494836J54530J59332J59353J52272J36435J12097Q0512M2776M18m3631
$$ 3494836 3649366 3808698 3968051 4120323 4256758 4368855 4449367 4492143 4492561 4448930
61235D448930q5788j23272j54235j77011j90485j95199j93163j86306j75715j62392
$$ 4448930 4363142 4239870 4085635 3908624 3718139 3522940 3329777 3143471 2967756 2805364
61225B805364j47897j33734j20496j08058r6413q5946p6944o9113o1847n4907
$$ 2805364 2657467 2523733 2403237 2295179 2198766 2112820 2035876 1966763 1904916 1850009
61215A850009m8661m3504l9153l4823l0076k5124k0250j5278j0011m783j60L836
$$ 1850009 1801348 1757844 1718691 1683868 1653792 1628668 1608418 1593140 1583129 1578346 1578186 1582022
61203A582022P709J1674J5265J7872J9448K0365K0749K0171J8075J4430R910N463
$$ 1582022 1589731 1601405 1616670 1634542 1653990 1674355 1695104 1715275 1733350 1747780 1757690 1763153
61191A763153J682j507m551p682j0612j2899j4578j6280j8517k1045k3139k4402
$$ 1763153 1764835 1763328 1758777 1751095 1740483 1727584 1713006 1696726 1678209 1657164 1634025 1609623
61179A609623k5072k5556k6046k6594k7257k7904k8155k7746k6857k5974k5556
$$ 1609623 1584551 1558995 1532949 1506355 1479098 1451194 1423039 1395293 1368436 1342462 1316906
61168A316906k5823k6558k7134k7057k6670k6887k8019k9196k9260k8005k6246
$$ 1316906 1291083 1264525 1237391 1210334 1183664 1156777 1128758 1099562 1070302 1042297 1016051
61157A016051k4813k3755k2483k0552j8363j7002j7075j7911j8342j8212j8372
$$ 1016051 991238 967483 945000 924448 906085 889083 872008 854097 835755 817543 799171
61146G99171j9186j9880j9763j9101j8262j6787j4195j1152q810p335n902m013
$$ 799171 779985 760105 740342 721241 702979 686192 671997 660845 652035 644700 638798 634785
61134F34785j995k67J155K416L661N148O938Q545R368R483R544R958J0595J1190
$$ 634785 632790 632523 633678 636094 639755 644903 651841 660386 669754 679237 688781 698739 709334 720524
61120G20524J1647J1911J1958J1868J1656J1227J0696J0479J0672J0707J0103
$$ 720524 732171 744082 756040 767908 779564 790791 801487 811966 822638 833345 843448
61109H43448R226Q796Q868Q845Q216O705M086N14l089n653o981p657q156q628
$$ 843448 852674 861470 870338 879183 887399 894104 898190 898704 895615 889962 882981 875324 867168 858540
61095H58540r337j0545j1964j2865j2912j2455j2065j2138j2809j3755j4228j3733
$$ 858540 849203 838658 826694 813829 800917 788462 776397 764259 751450 737695 723467 709734
61083G09734j2648j1738j1241j0829j0207r311q120o820n922n709n709n270m455
$$ 709734 697086 685348 674107 663278 653071 643760 635640 628820 622898 617189 611480 606210 601755
61070F01755l803l348k489r10R09K189K624K577K672L102L382L000K266J943K031
$$ 601755 597952 594604 592115 591205 592114 594303 596927 599504 602176 605278 608660 611660 613926 615869 617900
61055F17900J652L98r68j521j233o14o3O5m45j024n98R85K647L718M851O635Q428
$$ 617900 619552 619950 618982 617461 616228 615614 615551 615616 615171 614147 613549 614534 617181 620899 625750 632385 640813
61038F40813R452J0013J0594J0804J0328R990J0660J1872J2677J3104J3551J3619
$$ 640813 650265 660278 670872 681676 692004 701994 712654 724526 737203 750307 763858 777477
61026G77477J2862J1963J1786J1922J1503J0819J0780J1405J2102J2847J3820
$$ 777477 790339 802302 814088 826010 837513 848332 859112 870517 882619 895466 909286
61015I09286J4576J4820J5341J6948J9291K1850K5021K8897L2265L4477L6970
$$ 909286 923862 938682 954023 970971 990262 1012112 1037133 1066030 1098295 1132772 1169742
61004A169742M1122M5814M9093N1101N3320N6138N9434O4330P2008Q1915R3270
$$ 1169742 1210864 1256678 1305771 1356872 1410192 1466330 1525764 1590094 1662102 1744017 1837287
60993A837287J06818J22654J38256J51829J65886J84269K07775K36615K74636
$$ 1837287 1944105 2066759 2205015 2356844 2522730 2706999 2914774 3151389 3426025
60984C426025L26031L90161M65874N59314O80691Q35098J024806J258371J544385
$$ 3426025 3752056 4142217 4608091 5167405 5848096 6683194 7708000 8966371 10510756
60975A0510756J873043K214241K532177K777481K852814K621373K008621J120289
$$ 10510756 12383799 14598040 17130217 19907698 22760512 25381885 27390506 28510795
60967B8510795K32496l73428n81712m60358j48213K30212N41076O03721K61464
$$ 28510795 28743291 28369863 27788151 27327793 27179580 27409792 27950868 28554589 28816053
60958B8816053m77870j396655k195162k676848k822075k720272k471207k147976
$$ 28816053 28338183 26941528 24746366 22069518 19247443 16527171 14055964 11907988
60950A1907988j806826j490175j217289r88112p99045o48217n29416m32668l52798
$$ 11907988 10101162 8610987 7393698 6405586 5606541 4958324 4428908 3996240 3643442
60941C643442k90621k45192k11296j85044j65923j52345j40563j29149j19681
$$ 3643442 3352821 3107629 2896333 2711289 2545366 2393021 2252458 2123309 2003628
60932B003628j11953j02986r1980q1813p4306o7949o1757n7508n6329n6383n5689
$$ 2003628 1891675 1788689 1696709 1614896 1540590 1472641 1410884 1353376 1297047 1240664 1184975
60921A184975n4364n2598m9341m4549m0086l6857l3469k9101k5168k2708k0528
$$ 1184975 1130611 1078013 1028672 984123 944037 907180 873711 844610 819442 796734 776206
60910G76206j7612j5043j3909j3243j1805j0138r303r066q774q532q281p210n302
$$ 776206 758594 743551 729642 716399 704594 694456 685153 676087 667313 658781 650500 643290 637988
60897F37988l963l912l898k670q08N76J524K360K586J930J358J715K438K690K703
$$ 637988 634025 630113 626215 623545 622737 623313 624837 627197 629783 631713 633071 634786 637224 639914 642617
60882F42617K883K719J738N63j00o37j641k747l436m063n111o159o653o914p424
$$ 642617 645500 648219 649957 650520 650420 649783 648142 645395 641959 637896 632785 626626 619973 613059 605635
60867F05635p773p271o046m668l277j836p07j28L79J360K575L417L782M048M589
$$ 605635 597862 590591 584545 579877 576600 574764 574057 573929 574308 575668 578243 581660 585442 589490 594079
60852E94079N673P393R339J0842J1767J2582J3516J4329J5049J6117J7530J8626
$$ 594079 599752 607145 616484 627326 639093 651675 665191 679520 694569 710686 728216 746842
60840G46842J8895J8304J6765J4089J0720P566M996K837J367J163J825K045J285
$$ 746842 765737 784041 800806 814895 825615 833181 838177 841014 842381 843544 845369 847414 848699
60827H48699K06q06k260m265n889o454o325n907n015l845l397m163n388o308p162
$$ 848699 848905 848099 845839 841574 835685 829231 822906 816999 811984 808139 804742 800579 795191 788883 781721
60812G81721q246r059r128q865q784q734q534q536q878q943q319p420o613n547
$$ 781721 773475 764416 755288 746423 737639 728905 720371 711835 702957 694014 685695 678275 671662 666115
60798F66115m013k594j766j155m39n0j71J00J568L624N053N678O244P117Q003
$$ 666115 662102 659508 657742 656587 656148 656098 655927 656027 657595 661219 666272 671950 678194 685311 693314
60783F93314Q761R652J0867J2281J3588J4415J4552J4223J3817J3268J2258J1043
$$ 693314 702075 711727 722594 734875 748463 762878 777430 791653 805470 818738 830996 842039
60771H42039J0359J0328J0217R507Q489P566O734N975N281M176K126k96j698j730
$$ 842039 852398 862726 872943 882450 890939 898505 905239 911214 916495 920671 922797 922501 920803 919073
60757I19073j583k250l322m023m361m583m442l813l185k968k951k972l269l654
$$ 919073 917490 915240 911918 907895 903534 898951 894509 890696 887511 884543 881592 878620 875351 871697
60743H71697l316k118j159j376k440l655n022o596p674p608o837o224n855n239
$$ 871697 868381 866263 865104 863728 861288 857633 852611 846015 838341 830733 823896 817672 811817 806578
60729H06578m248l177k233j437o65M27K026L542M174M124M308M749M457L189J944
$$ 806578 802330 799153 796920 795483 794818 795245 797271 800813 804987 809111 813419 818168 822625 825814 827758
60714H27758J240K84j393k896l541m113n420o714o844o073n515n464n420n172
$$ 827758 828998 829282 827889 824993 821452 817339 811919 805205 798361 792288 786773 781309 775889 770717
60700G70717m782m130l328l021l413l694l285k911l512m821n948o708p410q008
$$ 770717 765935 761805 758477 755456 752043 748349 745064 742153 738641 733820 727872 721164 713754 705746
60686G05746q384q836r420r559r007q482q484q403p635o647n891m781k823q61
$$ 705746 697362 688526 679106 669547 660540 652058 643574 635171 627536 620889 614998 610217 607394 606533
60672F06533J18M64R63J436J606K279M017N606N639M851M962N812N747M533L676
$$ 606533 606651 607115 608078 609514 611120 613399 617416 623022 628661 633512 638474 644286 650033 654566 658242
60657F58242L765L629K501J192N47K85N1K38J140K315L375M466N482N731M912
$$ 658242 662007 665636 668137 669329 669876 670161 670212 670450 671590 673905 677280 681746 687228 692959 697871
60642F97871L635K681K301K421K779K772K056J367J915L756N666O806P632Q801
$$ 697871 701506 704187 706488 708909 711688 714460 716516 717883 719798 723554 729220 736026 743658 752459
60628G52459J0091J0884J1073J0956J0667J0134R321Q312P290O426N571M248K348
$$ 752459 762550 773434 784507 795463 806130 816264 825585 833897 841187 847613 853184 857432 859780
60615H59780N10o68j527k781m339n354n330m515l322k100j258r49p43l20k28j198
$$ 859780 860290 859622 858095 855314 850975 845621 840291 835776 832454 830354 829096 828147 827404 827084 826856 825658
60599H25658k957m579n791o965p963q150p567o954o389n028k638l35P93J077J564
$$ 825658 822701 818122 812331 805366 797403 789253 781686 774732 768343 763315 760677 760342 761135 762212 763776
60584G63776K567L548M047M015L444K231N03j241k442k849k603j929q34O61K012
$$ 763776 766343 769891 773938 777953 781397 783628 784131 782890 780448 777599 774996 773067 772233 772894 774906
60569G74906K340J441L00P4P79J442J378Q15K73j71q53j985l324m327m731m900
$$ 774906 777246 778687 778987 779061 779840 781282 782660 783475 783748 783577 782724 780739 777415 773088 768357 763457
60553G63457n295n659n240l867k200p04Q86K761M488N803P235R280J1522J3355
$$ 763457 758162 752503 747263 743396 741196 740492 741378 744139 748627 754430 761665 770945 782467 795822
60539G95822J5057J7400K0625K4524K9098L4239L9024M2037M2293L9342L3018
$$ 795822 810879 828279 848904 873428 902526 936765 975789 1017826 1060119 1099461 1132479
60528A132479K3783J2950J798r252j9882k8802l4336l5942l4410l0811k5934k0437
$$ 1132479 1156262 1169212 1171010 1161758 1141876 1113074 1078738 1042796 1008386 977575 951641 931204
60516I31204j4758q964l325J325M434O532Q386R776R950R004P870P154O899P292
$$ 931204 916446 907482 904157 905482 909916 916448 924834 934610 944560 953564 961434 968588 975487 982779
60502I82779Q717J1190J4523J8862K4334L0439L6583M2969N0104N7754O5275P2755
$$ 982779 991496 1002686 1017209 1036071 1060405 1090844 1127427 1170396 1220500 1278254 1343529 1416284
60490A416284Q0782Q9264R7563J05802J15101J26530J40816J59123J82918K12490
$$ 1416284 1497066 1586330 1683893 1789695 1904796 2031326 2172142 2331265 2514183 2726673
60480B726673K45995K80119L10866L33337L41224L27419K86361K17264J25818
$$ 2726673 2972668 3252787 3563653 3896990 4238214 4565633 4851994 5069258 5195076
60471E195076K2192q3200j81857k65975l27886l63017l72812l63176l40297l08980
$$ 5195076 5217268 5134068 4952211 4686236 4358350 3995333 3622521 3259345 2919048 2610068
60461B610068k73700k38578k05899j76159j49812j27569j09131r3254p9446o8144
$$ 2610068 2336368 2097790 1891891 1715732 1565920 1438351 1329220 1235966 1156520 1088376
60451A088376n9041n0830m3072l6750l2410k9036k5549k2178j9567j7530j5619
$$ 1088376 1029335 978505 935433 898683 866273 837237 811688 789510 769943 752413 736794
60440G36794j4053j3270j3018j2665j1986j1195j0563j0294j0339j0165r199p625
$$ 736794 722741 709471 696453 683788 671802 660607 650044 639750 629411 619246 610047 602422
60428F02422o235n407m861m438m281m211l710k772j940j352m91Q44K061K569K430
$$ 602422 596187 590780 585919 581481 577200 572989 569279 566507 564567 563215 562724 563568 565629 568198 570628
60413E70628K057J814K022K691L219L000K350K161K698L525M416N360N797N078
$$ 570628 572685 574499 576521 579212 582431 585431 587781 589942 592640 596165 600581 605941 611738 616816
60399F16816L833L650N009O617P148O695O043N535N175N055N008M573L705K966
$$ 616816 620649 624299 629308 635925 643073 649768 655811 661346 666521 671576 676584 681157 684862 687828
60385F87828K549J848L93j387k748l483l778l804l748l855m126m342m402m285
$$ 687828 690377 692225 692618 691231 688483 685000 681222 677418 673670 669815 665689 661347 656945 652660
60371F52660l758k718j673j222j125p55k62l26p85o17M80J552J827J719J999K657
$$ 652660 648902 646184 644511 643289 642164 641409 641147 640821 640036 639419 639899 641451 643278 644997 646996 649653
60355F49653L102K913K144J337J290K248L430L959M120M799N955O688O779O906
$$ 649653 652755 655668 657812 659149 660439 662687 666117 670076 674196 678995 684950 691638 698417 705323
60341G05323P284P318O826O387O158N455L953K281J111N40N97J339K278K761L104
$$ 705323 712607 719925 726751 733138 739296 744751 748704 750985 752096 752636 753233 754572 756850 759611 762715
60326G62715M194N782O486N778M646L882L073J721N5j847m347o982q308p793o649
$$ 762715 766909 772691 779177 784955 789601 793483 796556 798277 798332 796485 792138 785156 776848 769055 762406
60311G62406o007n483m377l006j922r56n3R9o45j079k39J121J783J884K249K794
$$ 762406 756399 750916 746539 743533 741611 740655 740602 740701 740056 738977 738738 739859 741642 743526 745775 748569
60295G48569K920K826L098L489L347K945L176M130M982N161M833M349L928L721
$$ 748569 751489 754315 757413 760902 764249 767194 770370 774500 779482 784643 789476 793825 797753 801474
60281H01474L666L467L131L062L340L468L293L411M133M863N160N595O729Q033
$$ 801474 805140 808607 811738 814800 818140 821608 824901 828312 832445 837308 842468 848063 854792 862825
60267H62825Q741R171J0133J1596J2951J4190J5814J7864J9983K2202K4769K7432
$$ 862825 871566 880737 890870 902466 915417 929607 945421 963285 983268 1005470 1030239 1057671
60255A057671K9707L1814L4583L8461M3192M8348N3665N8978O4378P0365P7457
$$ 1057671 1087378 1119192 1153775 1192236 1235428 1283776 1337441 1396419 1460797 1531162 1608619
60244A608619Q5672R4571J03630J12354J20455J28040J35335J41958J46910J49348
$$ 1608619 1694291 1788862 1892492 2004846 2125301 2253341 2388676 2530634 2677544 2826892
60234B826892J48939J45441J38657J28914J16859J02694Q6448O9002N1723L4762
$$ 2826892 2975831 3121272 3259929 3388843 3505702 3608396 3694844 3763846 3815569 3850331
60224C850331J6985j877k0141l5919m8813n9069o6187o9500o9358o6608o1446
$$ 3850331 3867316 3865439 3845298 3809379 3760566 3701497 3635310 3565810 3496452 3429844 3368398
60213C368398n3674m3596l1888j8964n137R168K3925L9588N6050P2242Q7459J02252
$$ 3368398 3314724 3271128 3239240 3220276 3215139 3224307 3248232 3287820 3343870 3416112 3503571 3605823
60201C605823J17193J31443J43299J51629J55989J56109J52041J44205J32596
$$ 3605823 3723016 3854459 3997758 4149387 4305376 4461485 4613526 4757731 4890327
60192D890327J16654R6623P4209N1024K7186K333k2826m6983o9456q9773j06737
$$ 4890327 5006981 5103604 5177813 5228837 5256023 5258356 5235530 5188547 5119091 5029318 4922581
60181D922581j19108j26751j30154j29320j24148j15315j03683q9325p2269n3679
$$ 4922581 4803473 4676722 4546568 4417248 4293100 4177785 4074102 3984777 3912508 3858829
60171C858829l5137j6988J451K0360L9060N6872P3233Q7136R7472J03788J05948
$$ 3858829 3823692 3806704 3808155 3828515 3867575 3924447 3997680 4084816 4182288 4286076 4392024
60160D392024J03379R5606Q3330O8118N1136L2986J4453l405j9800l4180m5824
$$ 4392024 4495403 4591009 4674339 4742457 4793593 4826579 4841032 4837627 4817827 4783647 4737823
60149D737823n4054n8615n9293n5635m7632l6205k2393o557J1097K9935M9607
$$ 4737823 4683769 4625154 4565861 4510226 4462594 4426389 4403996 4397439 4408536 4438471 4488078
60138D488078P0596R3239J16842J40720J65407J91898K20253K49902K80654L12255
$$ 4488078 4558674 4651913 4768755 4909475 5074882 5266780 5487033 5736935 6017589 6329844
60128F329844L43509L72920L99717M23255M42015M54428M60060M58709M48837
$$ 6329844 6673353 7046273 7445990 7869245 8311260 8765688 9225748 9684457 10133294
60119A0133294M28497L97818L59189L14877K65502K10911J51492Q8418K3253m2478
$$ 10133294 10561791 10959609 11318798 11633675 11899177 12110088 12261580 12349998 12373251 12330773
60109A2330773j07787j71996k33575k89645l37291l75011m02294m18499m22977
$$ 12330773 12222986 12050990 11817415 11527770 11190479 10815468 10413174 9994675 9571698
60100I571698m15907l98279l71550l37803k99452k58003k13833j67780j21890
$$ 9571698 9155791 8757512 8385962 8048159 7748707 7490704 7276871 7109091 6987201
60091F987201p7721l5155N976M4261P8160J07762J33343J53212J64933J68064
$$ 6987201 6909480 6874325 6880301 6924562 7002722 7110484 7243827 7397039 7561972 7730036
60081G730036J63762J52344J33274J07256P6366M2258O125k9885o3172r2778j19309
$$ 7730036 7893798 8046142 8179416 8286672 8363038 8405296 8411421 8381536 8318364 8225586 8106277
60070H106277j42899j63027j80137j95395k08568k18032k23138k24799k23492
$$ 8106277 7963378 7800351 7620214 7424819 7216251 6998219 6775081 6550282 6326790
60061F326790k18589k10014j98731j85036j68161j48144j26436j03984q0335n5452
$$ 6326790 6108201 5898187 5699456 5514420 5346259 5198115 5071679 4967695 4887360 4831908
60051D831908l0768p411J5340L8791O3078Q7342J10583J31531J48707J61507J70307
$$ 4831908 4801140 4793729 4809069 4847860 4910938 4998280 5108863 5240394 5389101 5550608 5720915
60040E720915J74823J73310J64266J48165J26779J01440P2762M1428Q472k4942
$$ 5720915 5895738 6069048 6233314 6381479 6508258 6609698 6682460 6723888 6732360 6707418
60030F707418n7628q8544j17071j42707j64353j80570j90698j95151j94463j88789
$$ 6707418 6649790 6561246 6444175 6301468 6137115 5956545 5765847 5570696 5376233 5187444
60020E187444j78435j64333j47731j29752j11137r1852p1317m9610k8035p575
$$ 5187444 5009009 4844676 4696945 4567193 4456056 4364204 4292887 4243277 4215242 4207667
60010D207667J2709L4519N7992Q1842J05574J29905J54857J78917K00452K18612
$$ 4207667 4220376 4254895 4312887 4394729 4500303 4630208 4785065 4963982 5164434 5383046
60000E383046K32529K40853K42561K37208K24255K03327J75525J43172J07965
$$ 5383046 5615575 5856428 6098989 6336197 6560452 6763779 6939304 7082476 7190441
59991G190441P0405L1257p869m5817q2459j17252j48421j74171j93757k06771
$$ 7190441 7260846 7292103 7284234 7238417 7155958 7038706 6890285 6716114 6522357 6315586
59981F315586k12374k10066k00523j85220j65757j43653j19880r4425o7172l9303
$$ 6315586 6103212 5893146 5692623 5507403 5341646 5197993 5078113 4983688 4916516 4877213
59971D877213j2728J1864L5106N6996P6418R3019J07846J21353J32235J39194
$$ 4877213 4864485 4876349 4911455 4968451 5044869 5137888 5245734 5367087 5499322 5638516
59961E638516J42563J43061J40067J32490J20660J06165R0262P3415N6027L8729
$$ 5638516 5781079 5924140 6064207 6196697 6317357 6423522 6513784 6587199 6643226 6681955
59951F681955K2122O823o364j6630k3343k5881k3731j6839n390J0806L2192N8747
$$ 6681955 6704077 6710900 6704536 6687906 6664563 6638682 6614951 6598112 6592722 6603528 6635720 6694467
59939F694467R0056J25882J65844K08666K52877K98201L45111L92860M39098M81409
$$ 6694467 6784523 6910405 7076249 7284915 7537792 7835993 8181104 8573964 9013062 9494471
59929I494471N17870N45742N61045N60116N40596N00642M38709L55135K53188
$$ 9494471 10012341 10558083 11119128 11679244 12219840 12720482 13159191 13514326 13767514
59920A3767514J38032J5567j07381k23191l25116m08823m72212n14651n36825
$$ 13767514 13905546 13921113 13813732 13590541 13265425 12856602 12384390 11869739 11332914
59911A1332914n40562n28279n02924m68167m27559l83242l36346k88391k41070
$$ 11332914 10792352 10264073 9761149 9292982 8865423 8482181 8145835 7857444 7616374
59902G616374j94705j48497j02589n8341j6232K4846O5496J04545J40578J73360
$$ 7616374 7421669 7273172 7170583 7112242 7096010 7120856 7186352 7290897 7431475 7604835
59892G604835K02851K27983K47125K58692K60612K50444K26999J90978J43637
$$ 7604835 7807686 8035669 8282794 8541486 8802098 9052542 9279541 9470519 9614156
59883I614156Q6099K0490m9545j20185j88150k49783l01126l39963l66517l81523
$$ 9614156 9700255 9720745 9671200 9551015 9362865 9113082 8811956 8471993 8105476 7723953
59873G723953l85108l78278l63736l43911l19595k91545k61855k32429k03523
$$ 7723953 7338845 6960567 6596831 6252920 5933325 5641780 5379925 5147496 4943973
59864D943973j75283j49382j27551j09596r4445q2229p3797o8991o6829o6578
$$ 4943973 4768690 4619308 4491757 4382161 4287716 4205487 4131690 4062699 3995870 3929292
59854C929292o7322o7302o5168o1177n5949m8960l9551k8596j7736p695J166P500
$$ 3929292 3861970 3794668 3729500 3668323 3612374 3563414 3523863 3495267 3477531 3469836 3471002 3478502
59842C478502R775P864K494o237j8206l1795m4625n5417o3762o8783o9745o7604
$$ 3478502 3488277 3496141 3498635 3492398 3474192 3442397 3397772 3342355 3278593 3209810 3140065 3072461
59830C072461o4144n9680n3237m4872l6133k7982j9783j0808j479P271J4849K0907
$$ 3072461 3008317 2948637 2895400 2850528 2814395 2786413 2766630 2755822 2754343 2761614 2776463 2797370
59818B797370K5463K9533L4886M2521N1842O1469P0320P7659Q2548Q3804Q0645
$$ 2797370 2822833 2852366 2887252 2929773 2981615 3043084 3113404 3191063 3273611 3357415 3438060
59807C438060P3471O3808N3103M1655K9259J6655N434l585j0779j6226j8949j8290
$$ 3438060 3511531 3575339 3628442 3670097 3699356 3716011 3721445 3717860 3707081 3690855 3671906 3653616
59795C653616j4887r466j701Q913K1905L6466N2517P0327Q9882J11412J35738
$$ 3653616 3638729 3629263 3627562 3636475 3658380 3694846 3747363 3817690 3907572 4018984 4154722
59784D154722J63400J94264K28686K67890L12284L60294M09482M57307M99432
$$ 4154722 4318122 4512386 4741072 5008962 5321246 5681540 6091022 6548329 7047761
59775G047761N28305N34793N10779M50104L50068K15256N9708r6853k35949l44401
$$ 7047761 7576066 8110859 8621638 9071742 9421810 9637066 9696774 9599921 9363972 9019571
59765I019571m15228m48366m50537m31514l99131l58155l12641k66884k23824
$$ 9019571 8604343 8155977 7705440 7273926 6874795 6516640 6203999 5937115 5713291
59756E713291j84353j48684j17143q9398o4397m1467k0498r66J8117L7129N5620
$$ 5713291 5528938 5380254 5263111 5173713 5109316 5067849 5047351 5046385 5064502 5101631 5157251
59745E157251P3339R0683J08145J26121J45132J65517J87049K09501K33262K58778
$$ 5157251 5230590 5321273 5429418 5555539 5700671 5866188 6053237 6262738 6496000 6754778
59735F754778K85987L15092L47140L82930M21985M63593N07976N55111O03293
$$ 6754778 7040765 7355857 7702997 8085927 8507912 8971505 9479481 10034592 10637885
59726A0637885O50250O94871P36051P70348P92828Q00188P91613P67047P26884
$$ 10637885 11288135 11983006 12719057 13489405 14282233 15082421 15874034 16641081 17367965
59717A7367965O73855O13697N53491N00116M59877M37503M34661M50224M81938
$$ 17367965 18041820 18655517 19209008 19709124 20169001 20606504 21041165 21491389 21973327
59708B1973327N26797N80047O35364O86403P27213P51449P52961P27807O74919
$$ 21973327 22500124 23080171 23715535 24401938 25129151 25880600 26633561 27361368 28036287
59699B8036287N95099M90890L67669K33310R6160l6054j55682k55438l30218l77889
$$ 28036287 28631386 29122276 29489945 29723255 29819415 29783361 29627679 29372241 29042023 28664134
59689B8664134l98144l91549l59929l06511k34877j48200m9441N8625J73997K95503
$$ 28664134 28265990 27874441 27514512 27208001 26973124 26824924 26775483 26834108 27008105 27303608
59679B7303608M22280N53561O88428Q24731R58240J083474J194597J284149J341376
$$ 27303608 27725888 28279449 28967877 29792608 30750848 31834322 33028919 34313068 35654444
59670C5654444J353622J309980J203144J029083P87941M87040J42423k23054n83278
$$ 35654444 37008066 38318046 39521190 40550273 41338214 41825254 41967677 41744623 41161345
59661D1161345r12411j188664j397708j533587j597162j594698j537246j439206
$$ 41161345 40248934 39060270 37662562 36128975 34531813 32937115 31399869 29960663
59653B9960663j315840j182056j052832r43048q65624q29307q36796q82805r53397
$$ 29960663 28644823 27462767 26409935 25466887 24601263 23771956 22935160 22052355 21098958
59644B1098958j029201j091659j128141j133477j108946j060261r94838r19472
$$ 21098958 20069757 18978098 17849957 16716480 15607534 14547273 13552435 12632963
59636A2632963q39822p60846o86175o17117n53399m95029m42552l95811l53837
$$ 12632963 11793141 11032295 10346120 9729003 9175604 8680575 8238023 7842212 7488375
59627G488375l16024k82260k51842k23524j96824j72250j50034j29713j11008
$$ 7488375 7172351 6890091 6638249 6414725 6217901 6045651 5895617 5765904 5654896
59618E654896r4097p8938o5397n4065m5922m1129l9169m0038m4145n1146o0066
$$ 5654896 5560799 5481861 5416464 5362399 5316477 5275348 5236179 5196141 5151996 5100850 5040784
59607E040784p0408q1852r3050j02226j08983j14027j17170j17252j14193j09328
$$ 5040784 4970376 4888524 4795474 4693248 4584265 4470238 4353068 4235816 4121623 4012295
59597D012295j03401r5875q6733p7203o8050n8730m8940l9588l1292k3319j4934
$$ 4012295 3908894 3813019 3726286 3649083 3581033 3522303 3473363 3433775 3402483 3379164 3364230
59586C364230o696M91O674J2330J7396K1608K4990K7474K8770K9036K8961K8809
$$ 3364230 3357534 3358025 3364699 3377029 3394425 3416033 3441023 3468497 3497267 3526303 3555264 3584073
59574C584073K8287K7618K7770K9265L1771L5299M0698M8395N7603O7255P7018
$$ 3584073 3612360 3639978 3667748 3697013 3728784 3764083 3804781 3853176 3910779 3978034 4055052
59563D055052Q7039R7637J09451J23043J38079J53850J70563J88933K08612K28450
$$ 4055052 4142091 4239728 4349179 4472222 4610301 4764151 4934714 5123647 5332259 5560709
59553E560709K48447K69699K91977L13022L30867L45287L56295L62910L64388
$$ 5560709 5809156 6078855 6370832 6683854 7014721 7360008 7716303 8079213 8443601
59544H443601L61125L53330L40230L21747K99593K75546K49932K23050J96516
$$ 8443601 8804726 9158056 9498286 9820033 10119626 10395172 10645104 10868154 11064670
59535A1064670J71375J45949J17843Q7919O0713M0839L0147K8257L4392M8004
$$ 11064670 11236045 11381994 11499837 11587756 11648469 11689308 11719455 11747712 11782104 11830108
59525A1830108O8273R3407J20422J45631J65458J76603J75749J59997J28183Q1306
$$ 11830108 11898381 11991788 12112210 12257841 12423299 12599902 12775651 12935648 13063831 13145137
59515A3145137K1565m8285j24528k02510k77975l47890m09633m60255m97317n20149
$$ 13145137 13166702 13118417 12993889 12791379 12513404 12165514 11755881 11295626 10798309 10278160
59505A0278160n29693n27484n15152m94484m67437m36022m02110l66976l31159
$$ 10278160 9748467 9220983 8705831 8211347 7743910 7307888 6905778 6538802 6207643
59496F207643k95271k60635k28479j98715j70547j44022j19905r8052p7286n7054
$$ 6207643 5912372 5651737 5423258 5224543 5053996 4909974 4790069 4692017 4614731 4557677
59486D557677l7947k0200k917J4763L2809N1073O9899Q9465J09484J29947J51313
$$ 4557677 4519730 4499530 4496613 4511376 4544185 4595258 4665157 4754622 4864106 4994053 5145366
59475E145366J73628J96371K19294K42342K64593K84468L01199L14764L23907
$$ 5145366 5318994 5515365 5734659 5977001 6241594 6526062 6827261 7142025 7465932
59466G465932L25606L17093K97361K66397K24308J71916J11068M3924k6928r7524
$$ 7465932 7791538 8108631 8405992 8672389 8896697 9068613 9179681 9223605 9196677 9099153
59456I099153j63349k21860k72689l14849l45659l63507l70128l68743l61142
$$ 9099153 8935804 8713944 8441255 8126406 7780747 7417240 7047112 6678369 6317227
59447F317227l47825l29854l09014k86836k64476k42904k22326k02164j82413
$$ 6317227 5969402 5639548 5330534 5043698 4779222 4536318 4313992 4111828 3929415
59438C929415j64119j47825j32653j17789j03784r1417q0317o9816o0123n1499
$$ 3929415 3765296 3617471 3484818 3367029 3263245 3171828 3091511 3021695 2961572 2910073
59428B910073m3222l4625k6376j9451j3499p481j401L848P913J1174J3773J5602
$$ 2910073 2866851 2832226 2805850 2786399 2772900 2765419 2764018 2767866 2775779 2786953 2800726 2816328
59416B816328J7174J9530K3184K7667L2182L6274L9720M1856M1289L7020L0455
$$ 2816328 2833502 2853032 2876216 2903883 2936065 2972339 3012059 3053915 3095204 3132224 3162679
59405C162679K5589K6023L2063M1615N3272O6982Q2319R8095J13543J27923J39307
$$ 3162679 3188268 3214291 3246354 3287969 3341241 3408223 3490542 3588637 3702180 3830103 3969410
59394C969410J46459J52272J62588J80642K04998K33585K66838L05405L47726
$$ 3969410 4115869 4268141 4430729 4611371 4816369 5049954 5316792 5622197 5969923
59385E969923L92072M38768M88172N38263N86434O31785O73193P06660P27132
$$ 5969923 6361995 6800763 7288935 7827198 8413632 9045417 9718610 10425270 11152402
59376A1152402P32018P20906O93398O50089N94871N33529M70208M07128L46843
$$ 11152402 11884420 12605326 13298724 13948813 14543684 15077213 15547421 15954549 16301392
59367A6301392K92181K43920K00636J60706J22655Q3895M1305o645n9726j17552
$$ 16301392 16593573 16837493 17038129 17198835 17321490 17405385 17446690 17440045 17380319 17262767
59357A7262767j79453k42714l02685l55066l97149m27261m44729m50727m48022
$$ 17262767 17083314 16840600 16537915 16182849 15785700 15358439 14913710 14462983 14014961
59348A4014961m39875m29798m21761m18907m21885m29186m38792m48720m56667
$$ 14014961 13575086 13145288 12723527 12304620 11882735 11453549 11014757 10566037 10109370
59339A0109370m60608m59564m52985m40151m21255l98278l73318l46651l17823
$$ 10109370 9648762 9189198 8736213 8296062 7874807 7476529 7103211 6756560 6438737
59330F438737k88023k59569k33441k08805j84851j61711j39780j19417j01060
$$ 6438737 6150714 5891145 5657704 5448899 5264048 5102337 4962557 4843140 4742080
59321D742080q4517o8592n2618l7776k5517j5310n553L867J1643J7388K2061K6068
$$ 4742080 4657563 4588971 4536353 4498577 4473060 4457750 4452197 4456064 4467707 4485095 4507156 4533224
59309D533224K8598K9033K7630K4655J9999J3799O443j882j0678j8576k4389k8401
$$ 4533224 4561822 4590855 4618485 4643140 4663139 4676938 4683381 4681499 4670821 4652245 4627856 4599455
59297D599455l1387l2874l1731k8067k3016j6830q756J286J2411K4293L7635N2841
$$ 4599455 4568068 4535194 4503463 4475396 4452380 4435550 4426794 4428080 4440491 4464784 4502419 4555260
59285D555260O9322Q6232J03086J19634J35964J52459J68895J83934J96301K05820
$$ 4555260 4624582 4710814 4813900 4933534 5069498 5221957 5390852 5574786 5771087 5976907
59275E976907K12354K14557K10939K01327J85799J62824J30463Q9411M3684j638
$$ 5976907 6189261 6403818 6614757 6816084 7001883 7164707 7295170 7384581 7428265 7426627
59265G426627m2411p6085j02192j22059j36818j46011j49253j48200j45243j40985
$$ 7426627 7384216 7308131 7205939 7083880 6947062 6801051 6651798 6503598 6358355 6217370
59255F217370j34992j28355j23147j19502j15466j10007j04154r8853r3501q7078
$$ 6217370 6082378 5954023 5830876 5711374 5595908 5485901 5381747 5282894 5189393 5102315
59245E102315p9207o9729n8613m6481l3876j9932l099J6780L8507O1631Q6949
$$ 5102315 5023108 4953379 4894766 4848285 4814409 4794477 4791378 4808158 4846665 4908296 4995245
59234D995245J14961J45399J78448K14796K54134K95093L36871L79404M21504
$$ 4995245 5110206 5255605 5434053 5648849 5902983 6198076 6534947 6914351 7335855
59225G335855M60100M91618N12919N20802N12044M84476M37311L70648K85890
$$ 7335855 7795955 8287573 8800492 9321294 9833338 10317814 10755125 11125773 11411663
59216A1411663J86543P7236l7844j54312k65906l65519m48262n12176n56162n79287
$$ 11411663 11598206 11675442 11637598 11483286 11217380 10851861 10403599 9891423 9335261 8755974
59206H755974n82557n69571n44645n11321m72712m31616l89793l48364l09086
$$ 8755974 8173417 7603846 7059201 6547880 6075168 5643552 5253759 4905395 4596309
59197D596309k73845k42755k14356j88048j64894j45701j29815j16219j04397
$$ 4596309 4322464 4079709 3865353 3677305 3512411 3366710 3236895 3120676 3016279
59188C016279r3715q3339p3301o4487n7218n0970m5535m1074l6927l1870k5871
$$ 3016279 2922564 2839225 2765924 2701437 2644219 2593249 2547714 2506640 2469713 2437843 2411972
59177B411972k0198j5475j1063o576k477J182N145R618J3936J7983K2538K7812
$$ 2411972 2391774 2376299 2365236 2358660 2356183 2357365 2362510 2372128 2386064 2404047 2426585 2454397
59165B454397L2964L7475M1814M6323N0649N4576N8243O1332O3312O4592O6099
$$ 2454397 2487361 2524836 2566650 2612973 2663622 2718198 2776441 2837773 2901085 2965677 3031776
59154C031776O7586O7716O5895O2614N7935N1354M3252L4793K6129J6401N841
$$ 3031776 3099362 3167078 3232973 3295587 3353522 3404876 3448128 3482921 3509050 3525451 3531292
59143C531292l971j2250j9673k6450l1606l4762l6769l7937l7350l4687l0994
$$ 3531292 3527321 3515071 3495398 3468948 3437342 3402580 3365811 3327874 3290524 3255837 3224843
59132C224843k6885k1648j4910p569j94P942J7352K7392L7629M8627O0558P2543
$$ 3224843 3197958 3176310 3161400 3153831 3153637 3161579 3178931 3206323 3243952 3292579 3353137 3425680
59120C425680Q4261R6760J10636J24916J38738J52771J67921J83949K00420K17757
$$ 3425680 3509941 3606701 3717337 3842253 3980991 4133762 4301683 4485632 4686052 4903809
59110D903809K36191K54728K72188K88212L02200L12213L15898L11711K98441
$$ 4903809 5140000 5394728 5666916 5955128 6257328 6569541 6885439 7197150 7495591
59101G495591K74453K38365J90084J30885O3403q201p9256j46351k07303k59521
$$ 7495591 7770044 8008409 8198493 8329378 8392781 8384580 8305324 8158973 7951670 7692149
59091G692149l00127l28176l45301l53546l53959l47741l36943l22990l06005
$$ 7692149 7392022 7063846 6718545 6364999 6011040 5663299 5326356 5003366 4697361
59082D697361k86408k65860k45721k26001k06633j88397j71666j55753j40473
$$ 4697361 4410953 4145093 3899372 3673371 3466738 3278341 3106675 2950922 2810449
59073B810449j26959j15858j06140r6764q8214q1154p4865o8355o1922n6295n1187
$$ 2810449 2683490 2567632 2461492 2364728 2276514 2195360 2120495 2052140 1990218 1933923 1882736
59062A882736m5972m0936l6673l2944k9231k5738k2875k0473j8317j6776j6012
$$ 1882736 1836764 1795828 1759155 1726211 1696980 1671242 1648367 1627894 1609577 1592801 1576789
59051A576789j5422j4683j4600j6028j8524k0933k2687k3887k4601k4749k4227
$$ 1576789 1561367 1546684 1532084 1516056 1497532 1476599 1453912 1430025 1405424 1380675 1356448
59040A356448k2824k0464j7701j5235j2938j0143o872l721o30L032P061J0525
$$ 1356448 1333624 1313160 1295459 1280224 1267286 1257143 1250271 1246550 1245920 1248952 1256013 1266538
59028A266538J3254J5902J8430K0072K0856K1495K1620J9954J6488J2656R091
$$ 1266538 1279792 1295694 1314124 1334196 1355052 1376547 1398167 1418121 1434609 1447265 1456356
59017A456356N149J023j854l145m156n299n229l381j151N99K989O712J0228J1971
$$ 1456356 1461505 1462528 1460674 1457529 1453373 1448074 1442845 1439464 1438313 1438912 1441901 1448613 1458841 1470812
59003A470812J2514J3003J3071J1941J0115Q377O379L697J103m73j211j551j250
$$ 1470812 1483326 1496329 1509400 1521341 1531456 1539833 1546212 1549909 1551012 1550539 1549328 1547777 1546527
58990A546527k51P63J546K677M062M679M583N235O885P709O794N904O797Q681
$$ 1546527 1546276 1547039 1548585 1551262 1555324 1560003 1564586 1569821 1576706 1584415 1591209 1597113 1603910 1612591
58976A612591R966J0730J1753J2780J3499J4762J7190J9949K2320K5015K8500
$$ 1612591 1622557 1633287 1645040 1657820 1671319 1686081 1703271 1723220 1745540 1770555 1799055
58965A799055L1649L3588L5162L7142L8651L9026L9340M0412M1128M0658M0351
$$ 1799055 1830704 1864292 1899454 1936596 1975247 2014273 2053613 2094025 2135153 2175811 2216162
58954B216162M1426M2649M2620M2615M4632M8215N1696N5305O0342O6355P1826
$$ 2216162 2257588 2300237 2342857 2385472 2430104 2478319 2530015 2585320 2645662 2712017 2783843
58943B783843P6892Q2963R0219R7713J05383J13977J23476J33433J44158J55898
$$ 2783843 2860735 2943698 3033917 3131630 3237013 3350990 3474466 3607899 3752057 3907955
58933C907955J67804J79417J92193K07702K25415K44216K64886K88943L16046
$$ 3907955 4075759 4255176 4447369 4655071 4880486 5124702 5389588 5678531 5994577
58924E994577L44842L75540M09491M46906M87134N30455N77476O27375O78687
$$ 5994577 6339419 6714959 7124450 7571356 8058490 8588945 9166421 9793796 10472483
58915A0472483P31014P83987Q35195Q81100R19105R46665R59216R51219R18751
$$ 10472483 11203497 11987484 12822679 13703779 14622884 15569549 16528765 17479984 18398735
58906A8398735Q59278P70060O49492M99931L27484J39685n4880k45937m23462
$$ 18398735 19258013 20028073 20677565 21177496 21504980 21644665 21589785 21343848 20920386
58897B0920386n80369p12027q14433q85372r26654r42684r37158r13037q74803
$$ 20920386 20340017 19627990 18813557 17928185 17001531 16058847 15121689 14208652 13333849
58888A3333849q27786p75374p19151o61446o05394n52628n03205m57660m17036
$$ 13333849 12506063 11730689 11011538 10350092 9744698 9192070 8688865 8231205 7814169
58879G814169l81041l48444l19399k95276k76084k59865k44708k29830k14846
$$ 7814169 7433128 7084684 6765285 6470009 6193925 5934060 5689352 5459522 5244676
58870E244676j99760j85452j72680j60780j48692j36682j25598j15178j04808
$$ 5244676 5044916 4859464 4686784 4526004 4377312 4240630 4115032 3999854 3895046
58861C895046r5028q6511p8364o9450o0493n2880m6272l9464l2722k6858k0990
$$ 3895046 3800018 3713507 3635143 3565693 3505200 3452320 3406048 3366584 3333862 3307004 3286014
58850C286014j3693n695J186P141J3786K1027K7371L2981L9569M7309N4601O1014
$$ 3286014 3272321 3266626 3267812 3274953 3288739 3309766 3337137 3370118 3409687 3456996 3511597 3572611
58838C572611O7850P5613Q3390R1037R9626J09425J19563J29953J41547J54558
$$ 3572611 3640461 3716074 3799464 3890501 3990127 4099552 4219115 4349068 4490615 4645173
58828D645173J68376J83254K00113K18762K38279K59017K82256L08102L35901
$$ 4645173 4813549 4996803 5196916 5415678 5653957 5912974 6195230 6503332 6839233
58819F839233L66457M01580M41562M85156N31873N81973O34442O87305P39790
$$ 6839233 7205690 7607270 8048832 8533988 9065861 9647834 10282276 10969581 11709371
58810A1709371P91778Q41011Q82993R13564R29366R26027Q98357Q42665P57150
$$ 11709371 12501149 13342160 14225153 15138717 16068083 16994110 17892467 18735132 19492282
58801A9492282O40833M94834L24777J39594n1930k41559m19717n76947p07661
$$ 19492282 20133115 20627949 20952726 21092320 21040390 20798831 20379114 19802167 19094506
58792A9094506q10182q83482r26979r43512r39047r18616q84987q41409p92467
$$ 19094506 18284324 17400842 16473863 15530351 14591304 13672688 12787701 11946292 11153825
58783A1153825p41403o89202o37022n87019n40167m95763m53735m15139l80040
$$ 11153825 10412422 9723220 9086198 8499179 7959012 7463249 7009514 6594375 6214335
58774F214335l47425l17613k92191k71099k52322k34890k19543k06040j92629
$$ 6214335 5866910 5549297 5257106 4986007 4733685 4498795 4279252 4073212 3880583
58765C880583j78883j66357j55602j45146j34189j23746j14340j05061r5770q7728
$$ 3880583 3701700 3535343 3379741 3234595 3100406 2976660 2862320 2757259 2661489 2573761
58755B573761q1123p4384o6867n9935n4525m9809m5125m1020l7648l4246l0797
$$ 2573761 2492638 2418254 2351387 2291452 2236927 2187118 2141993 2100973 2063325 2029079 1998282
58744A998282k8104k5751k2309j7998j4759j3206j1987j0600j0235j1250j2405
$$ 1998282 1970178 1944427 1922118 1904120 1889361 1876155 1864168 1853568 1843333 1832083 1819678
58733A819678j3172j4301j5628j6023j5986j7357j9999k1747k2286k3861k7293
$$ 1819678 1806506 1792205 1776577 1760554 1744568 1727211 1707212 1685465 1663179 1639318 1612025
58722A612025l0557l2359l3819l5449l5699l4102l2677l2520l1962k9760k7278
$$ 1612025 1581468 1549109 1515290 1479841 1444142 1410040 1377363 1344843 1312881 1283121 1255843
58711A255843k5727k4046k1349j8887j7686j6691j5049j3775j3456j2799j1175
$$ 1255843 1230116 1206070 1184721 1165834 1148148 1131457 1116408 1102633 1089177 1076378 1065203
58700A065203j0169j0719j1206j0301r267r412r545q212o330n412n001m031l058
$$ 1065203 1055034 1044315 1033109 1022808 1013541 1004129 994584 986372 980042 974630 969629 965598 962540
58687I62540l184m190n456p269r687j1607j2310j2432j2374j1470r740q431p787
$$ 962540 959356 955166 949710 942441 932754 921147 908837 896405 884031 872561 862821 854390 846603
58674H46603o410l943k019j423q00N19J056M1q85n57k96j134j614l61J404K043
$$ 846603 840193 836250 834231 832808 832008 832527 833583 833624 832739 832182 831886 830752 829138 828777 830181 832224
58658H32224K020K179J715K3j436j303n29l50J03K045M630O402P624R260J1055
$$ 832224 834244 836423 838138 838161 836725 835422 834893 834543 834646 836691 841321 847723 855347 864607 875662
58643H75662J2398J3766J5685J7645J9310K1198K3169K4176K4666K6938L1687
$$ 875662 888060 901826 917511 935156 954466 975664 998833 1023009 1047675 1074613 1106300
58632A106300L6540L9609M2222M6413N1939N7689O3812P0715P7894Q5541R5271
$$ 1106300 1142840 1182449 1224671 1271084 1323023 1380712 1444524 1515239 1593133 1678674 1773945
58621A773945J07613J20923J34352J49604J68072J88570K09540K31059K52761
$$ 1773945 1881558 2002481 2136833 2286437 2454509 2643079 2852619 3083678 3336439
58612C336439K72271K87518K98193L03056K98502K81860K53595K14443J63396
$$ 3336439 3608710 3896228 4194421 4497477 4795979 5077839 5331434 5545877 5709273
58603E709273J01045L2258l6923j02598j61316k08511k41842k63502k76255k79654
$$ 5709273 5810318 5842576 5805653 5703055 5541739 5333228 5091386 4827884 4551629 4271975
58593D271975k73030k59468k43331k26007k07202j88206j70406j52672j33666
$$ 4271975 3998945 3739477 3496146 3270139 3062937 2874731 2704325 2551653 2417987
58584B417987j15102r9513q6498p4297o3324n4827m7769m0506l4150l0952l0548
$$ 2417987 2302885 2203372 2116874 2042577 1979253 1924426 1876657 1836151 1802001 1771049 1740501
58573A740501l0822l1336l2820l4527l5096l5044l5604l6122l5131l2977l0921
$$ 1740501 1709679 1678343 1645523 1610996 1575900 1540856 1505252 1469130 1433999 1401022 1370101
58562A370101k8925k6737k5614k6485k7861k7907k7120k6603k5522k2905j9963
$$ 1370101 1341176 1314439 1288825 1262340 1234479 1206572 1179452 1152849 1127327 1104422 1084459
58551A084459j8006j5884j2390r136q135q354p722o718o810p177o317n263n887
$$ 1084459 1066453 1050569 1038179 1029043 1020908 1012554 1004832 998114 991304 984127 977810 972547 966660
58538I66660p500q324q846j0467j2300j2590j1936j1952j2155j1373j0641j1488
$$ 966660 959160 950836 941990 931523 919223 906633 894697 882745 870590 859217 848576 837088
58526H37088j2737j2413j1324j1487j2348j2028j0921j0696j0890r882q106p113
$$ 837088 824351 811938 800614 789127 776779 764751 753830 743134 732244 722362 714256 707143
58514G07143o644n625m736m907m896l439k068k528l268k042q1J44n12M10K262
$$ 707143 700499 694874 690138 685231 680335 676896 674828 672300 669032 666990 666909 667053 666541 666951 669213
58499F69213K596J758J996L038K807J643J709K965L615L747M772O106O168N733
$$ 669213 671809 673567 675563 678601 681408 683051 684760 687725 691340 695087 699859 705965 712133 717866
58485G17866O510P472O481M521M280N500N799N179N527O407N589L233J497N06
$$ 717866 724376 731848 738329 742850 747130 752630 758429 763608 769135 775542 781131 784364 785861 786367
58471G86367j376l871n249n944p787j0179j0882j0021r613r786r110p986p931
$$ 786367 784991 781120 775871 769927 762140 751961 741079 731058 721445 711659 702549 694563 686632
58458F86632q348p645o609o985p883p440o671p512q477o809l695k628l571l581
$$ 686632 678284 670639 664030 657045 649162 641722 635051 627539 619062 612253 608558 605930 602359 598778
58444E98778k265j694j611K15L220M486L830L812M977N539N399N990O604N383
$$ 598778 596513 594819 593208 593423 596643 601129 604959 608771 613748 619287 624686 630676 637280 642663
58430F42663L500L729N364N277L449K704L451L546K915L426M631M434L547M326
$$ 642663 646163 649892 655256 660533 663982 666686 670137 673683 676598 680024 684655 689089 692636 696962
58416F96962N838N149K865K085K555J443o54m13J781K096Q8o88P29J361J45n53
$$ 696962 702800 707949 710814 712899 715454 716897 716243 715830 717611 719707 719795 719107 719836 721197 721342 720789
58400G20789n6n25k260k969k501l175m949n238l943l613m392l879k110j462j664
$$ 720789 720733 720208 717948 714979 712478 709303 704354 699116 695173 691560 687168 683289 681179 679717 678053
58385F78053k58K133K549J477K088L988L865K185K840O022P932P797Q552J0245
$$ 678053 677795 679928 682477 683954 686042 690030 693895 696080 698920 704942 712874 720671 729223 739468
58371G39468R614O849N905P290P344N507N278P014O904M376L400M908M987K308
$$ 739468 749082 755931 761836 769126 776470 781977 787255 794269 801173 805549 808949 813857 818844 821152
58357H21152M78J148J524N30Q74L130M244L570M004N703N317K759J910L288L053
$$ 821152 821630 822778 824302 824832 825706 828836 833080 836650 840654 846357 851674 854433 856343 859631 862684
58342H62684N83k19J477J995P96J817N518P349O144O172Q858J0314R245R349J1586
$$ 862684 863267 863048 864525 866520 867316 869133 874651 882000 888144 894316 903174 913488 922733 932082 943668
58327I43668J2069R997R598J1849J2359R948Q947J0556J0470P646O705Q850R377
$$ 943668 955737 965734 975332 987181 999540 1009488 1018435 1028991 1039461 1047107 1053812 1062662 1072039
58314A072039P121P229J1221J3541J1539R751J0631J0296P272O190Q660R756P588
$$ 1072039 1079160 1086389 1097610 1111151 1122690 1132441 1143072 1153368 1160640 1166830 1175490 1185246 1192834
58301A192834P094J0255J2091J0579J0738J4523J6496J4295J3365J6448J8332
$$ 1192834 1199928 1210183 1222274 1232853 1243591 1258114 1274610 1288905 1302270 1318718 1337050
58290A337050J6135J4764J7013J8361J6717J7076K1242K3443K1399K1059K4949
$$ 1337050 1353185 1367949 1384962 1403323 1420040 1437116 1458358 1481801 1503200 1524259 1549208
58279A549208K7067K4949K5123L0521L4330L2929L2784L7555M0563L7558L4753
$$ 1549208 1576275 1601224 1626347 1656868 1691198 1724127 1756911 1794466 1835029 1872587 1907340
58268A907340L6543L7385L3827L2189L6123L8958L6675L5917M0659M4032M2029
$$ 1907340 1943883 1981268 2015095 2047284 2083407 2122365 2159040 2194957 2235616 2279648 2321677
58257B321677M1922M7904N2259N0276M9917N6576O2681O2878O4818P3759Q1407
$$ 2321677 2363599 2411503 2463762 2514038 2563955 2620531 2683212 2746090 2810908 2884667 2966074
58246B966074Q1636Q2324Q9656R6066R5922R7490J06580J14464J15169J18046
$$ 2966074 3047710 3130034 3219690 3315756 3411678 3509168 3615748 3730212 3845381 3963427
58236C963427J29551J39921J42134J46218J59708J72595J77370J84793K03170
$$ 3963427 4092978 4232899 4375033 4521251 4680959 4853554 5030924 5215717 5418887
58227E418887K21850K32597K46551K71929K96666L12330L32419L66593M00872
$$ 5418887 5640737 5873334 6119885 6391814 6688480 7000810 7333229 7699822 8100694
58218H100694M25043M54247N00223N48137N87011O34641P05298P82844Q55192
$$ 8100694 8525737 8979984 9480207 10028344 10615355 11249996 11955294 12738138 13593330
58209A3593330R43314J064334J200230J338279J506152J729248J993223K290807
$$ 13593330 14536644 15600978 16801208 18139487 19645639 21374887 23368110 25658917
58201B5658917K662024L140912L710618M365408N165889O175210P405216Q901386
$$ 25658917 28320941 31461853 35172471 39537879 44703768 50878978 58284194 67185580
58193F7185580J0814059J3296281J6399948K0158904K4647872K9770488L5030947
$$ 67185580 77999639 91295920 107695868 127854772 152502644 182273132 217304079
58186B17304079L9624775M2557786M2393926L7191549K5585723Q532040j0275216
$$ 217304079 256928854 299486640 341880566 379072115 404657838 413189878 402914662
58179D02914662k6296316l6722213m1362021m1558631l8826380l4408287k9357735
$$ 402914662 376618346 339896133 298534112 256975481 218149101 183740814 154383079
58172A54383079k4453031k0059463j6268996j3121573j0606290q591848o924112
$$ 154383079 129930048 109870585 93601589 80480016 69873726 61281878 54357766
58165E4357766n545156m427313l472070k576654j729438r40555j47170P09106
$$ 54357766 48812610 44385297 40913227 38336573 36607135 35666580 35519410 36228516
58157C6228516J572944K343483K972129L351132L169284K095742J86980k000942
$$ 36228516 37801460 40144943 43117072 46468204 49637488 51733230 51920210 49919268
58149D9919268l785488m805014n104246m912063m439266l835412l209997k635022
$$ 49919268 46133780 41328766 36224520 31312457 26873191 23037779 19827782 17192760
58141A7192760k143485j741872j422583j171061r73371q18962o96588n95003n09466
$$ 17192760 15049275 13307403 11884820 10713759 9740388 8921426 8224838 7629835 7120369
58132G120369m40421l85644l40872l06148k82581k65154k47899k32963k24804
$$ 7120369 6679948 6294304 5953432 5647284 5364703 5099549 4851650 4618687 4393883
58123D393883k19030k07528j91001j75748j61706j44610j26487j12869j02602
$$ 4393883 4174853 3967325 3776324 3600576 3438870 3294260 3167773 3054904 2952302
58114B952302r0973q0022p5414p6146p7226p9036q4173q8699q6805q0864p7012
$$ 2952302 2861329 2781307 2705893 2629747 2552521 2473485 2389312 2300613 2213808 2132944 2055932
58103B055932p4291o8016o0180n6218n4693n0238m3837m0312l8660l4592k9804
$$ 2055932 1981641 1913625 1853445 1797227 1742534 1692296 1648459 1608147 1569487 1534895 1505091
58092A505091k9050l0666k9512k6611k6568k8094k6492k3029k2533k4044k3115
$$ 1505091 1476041 1445375 1415863 1389252 1362684 1334590 1308098 1285069 1262536 1238492 1215377
58081A215377k1107k2818k6813k7370k4447k2890k3235k1921j9238j8547j8905
$$ 1215377 1194270 1171452 1144639 1117269 1092822 1069932 1046697 1024776 1005538 986991 968086
58070I68086j6662j3041j2263j3446j2315r421q749r639q081m831m185n758n418
$$ 968086 951424 938383 926120 912674 900359 890938 882189 872550 864469 859638 855453 849695 844277
58057H44277l497m221p570r333q822r262j0879j0703q941q677r610q664o342n916
$$ 844277 840780 836559 828989 819656 810834 801572 790693 779990 771049 762372 752762 744098 737756 731840
58043G31840o892n821l025k031k860k334m66j32r40J73K711L285J955J758K506
$$ 731840 724948 719127 716102 714071 711211 708877 708411 708279 707339 707512 710223 713508 715463 717221 719727
58028G19727J344j092j492l17r76l055k959j022j242l820m637k659j403k317k876
$$ 719727 721071 719979 718487 718170 717194 714139 711180 710158 708916 705096 700459 697800 696397 694080 691204
58013F91204k146k397m111m870m215m479o001o453n524n390o101n346l119j830
$$ 691204 689058 686661 682550 677680 673465 668986 662985 656532 651008 645618 639517 634171 631052 629222
57999F29222j582k36J834K092R63J402L254L341J424O30J511J151j132k499j892
$$ 629222 627640 627404 629238 631330 632293 633695 636949 640290 641714 642344 643855 645006 643874 641375 639483
57984F39483j525k107j572L64J161M0q37o44r45j790j217O05J169J43k29L46k06
$$ 639483 637958 635851 634279 634643 635804 635844 635007 634363 633418 631628 630411 631016 632185 632328 632099 632445 632239
57967F32239j792k044j095j584l273k805L01K513K237J851K503J954q03l575n260
$$ 632239 630447 628403 627308 625724 622451 619646 619947 622460 624697 626548 629051 631005 630202 626627 621367
57952F21367p556j0696j2053j0726r182q589o869l144J50J571K904N181O487N747
$$ 621367 613811 603115 591062 580336 571154 562565 555696 552552 552702 554273 557177 562358 568845 574592
57938E74592M832M876M291K353R35P25n28l889p018q192r004j0934j2638j2897
$$ 574592 579424 584300 588591 590944 591879 592604 592076 588187 581169 572977 563973 553039 540401 527504
57924E27504j2904j3435j2849j0161p141n372l992k208j056q75k5K052L449L314
$$ 527504 514600 501165 488316 478155 471014 465642 461650 459442 458386 457511 457486 459538 462987 466301
57910D66301L589N449P058O933O458O964P245O165M922M550L868K047O01O58P60
$$ 466301 469890 475339 482397 489330 495788 502752 509997 516162 521084 525634 529502 531549 532150 532808 533568
57895E33568m70j941k431k812l922m684m437m696o413p857p429o304o106o158
$$ 533568 533098 531157 528726 525914 521992 517308 512871 508175 501762 493905 486476 480172 474066 467908
57881D67908n335m520m783m992l541j079O22J100Q96K51l17K79K041L495M078
$$ 467908 462573 458053 453270 448278 444737 443658 444280 445380 446276 446527 446210 446489 448530 452025 456103
57866D56103M974O488O941N534M064M120M724M449L689L178K326Q32j22k9l92
$$ 456103 461077 467565 474506 480040 484104 488224 492948 497397 501086 504264 506590 507422 507300 507271 506879
57851E06879k176l986m451m399m859n045m211l527m034m678m267l569l544l395
$$ 506879 504703 500717 496266 491867 487008 481963 477752 474225 470191 465513 461246 457677 454133 450738
57837D50738k343j488j905k646k626k724l888m943m475l377l338m210m950n787
$$ 450738 448395 446907 445002 442356 439730 437006 433118 428175 423700 420323 416985 412775 407825 402038
57823D02038p259q413q056o779n857n219m309l759m322n177n068m185l403k674
$$ 402038 394779 386366 378310 371531 365674 360455 356146 352387 348065 342888 337820 333635 330232 327558
57809C27558j692j004j025j003l43L13N24J160K783M439N443O767R168J1538J2580
$$ 327558 325866 324862 323837 322834 322491 322804 323328 324488 327271 331710 337153 343920 353088 364626 377206
57794C77206J2491J1534Q826M367M86q09l54J39Q98K855N151O233O205O012N395
$$ 377206 389697 401231 410057 414424 414910 414101 413747 413886 414784 417639 422790 429023 435228 441240 446635
57779D46635L675J437n64k996o476r696j1021j0889j0635j0119q573o715n841
$$ 446635 450310 451747 451183 448187 441711 432015 420994 410105 399470 389351 380778 374063 368222
57766C68222n596m789l540k813k498j875j111o17K07J844L314L725M134N931Q371
$$ 368222 362626 357837 354297 351484 348986 347111 346000 345383 345590 347434 350748 354473 358607 364538 372909
57751C72909R635R492R026Q642Q128P742P370N747K457l50m24J408K702L021L691
$$ 372909 382544 392036 401062 409704 417832 425574 432944 438691 441148 440798 440374 441782 444484 447505 451196
57736D51196M761M852L739K731K531K688L045L919N039N912O911Q493R920J0332
$$ 451196 455957 460809 464548 467279 469810 472498 475543 479462 484501 490413 497324 505817 515737 526069
57722E26069J0406J1297J2678J3560J4190J5318J6357J6384J6172J7100J8703
$$ 526069 536475 547772 560450 574010 588200 603518 619875 636259 652431 669531 688234
57711F88234J9479J9559K0375K2133K3862K5677K8632L2601L6421M0064M4564
$$ 688234 707713 727272 747647 769780 793642 819319 847951 880552 916973 957037 1001601
57700A001601M9878N4965N9984O6362P4605Q3936R4212J06231J20088J34983J50909
$$ 1001601 1051479 1106444 1166428 1232790 1307395 1391331 1485543 1591774 1711862 1846845 1997754
57689A997754J68731J88435K08915K29559K50342K70057K85994K95504K96699
$$ 1997754 2166485 2354920 2563835 2793394 3043736 3313793 3599787 3895291 4191990
57680D191990K87650K66442K32336J86014J29291O5968K385n4718j01053j34770
$$ 4191990 4479640 4746082 4978418 5164432 5293723 5359691 5362076 5307358 5206305 5071535
57670E071535j54815j61333j57326j48140j39601j37619j47593j70589k00017
$$ 5071535 4916720 4755387 4598061 4449921 4310320 4172701 4025108 3854519 3654502
57661C654502k24921k37635k37096k25806k06593j82683j57761j34195j12468
$$ 3654502 3429581 3191946 2954850 2729044 2522451 2339768 2182007 2047812 1935344
57652A935344r2835p6090o2258n0309l9681l0621k2749j4898o832M72O646J2592
$$ 1935344 1842509 1766419 1704161 1653852 1614171 1583550 1560801 1545903 1539071 1539543 1546189 1558781
57640A558781J9064K6003L3567M2271N1807O1227P0626Q1232R3539J06818J20674
$$ 1558781 1577845 1603848 1637415 1679686 1731493 1792720 1863346 1944578 2038117 2144935 2265609
57629B265609J35694J52190J69640J87561K05581K22480K36348K45796K49632
$$ 2265609 2401303 2553493 2723133 2910694 3116275 3338755 3575103 3820899 4070531
57620D070531K45575K30857K04265J66276J17617N9631l836o6888j24412j73350
$$ 4070531 4316106 4546963 4751228 4917504 5035121 5094752 5090916 5024028 4899616 4726266
57610D726266k11636k37994k53102k59034k57284k48754k35516k20364k04379
$$ 4726266 4514630 4276636 4023534 3764500 3507216 3258462 3022946 2802582 2598203
57601B598203j87015j68840j52022j37588j24346j11348r9410q9468q1112p3581
$$ 2598203 2411188 2242348 2090326 1952738 1828392 1717044 1617634 1528166 1447054 1373473
57591A373473o6662o0109n3658m7998m4060m1118l7425l2956k9375k7070k4550
$$ 1373473 1306811 1246702 1193044 1145046 1100986 1059868 1022443 989487 960112 933042 908492
57580I08492k1331j8887j7848j6762j4766j3085j2514j1749r761p751o964o480
$$ 908492 887161 868274 850426 833664 818898 805813 793299 781550 771789 764038 757074 750594
57568G50594m956k970j777j172k70Q45J821L204N323P269Q322R320J1132J3092
$$ 750594 745638 742668 740891 739719 739449 740294 742115 745319 750642 757911 766233 775553 786685 799777
57554G99777J4328J5390J7072J8843K0077K1594K4320K7456K9844L2209L6200
$$ 799777 814105 829495 846567 865410 885487 907081 931401 958857 988701 1020910 1057110
57543A057110M1890M7998N4077O0864O8762P7506Q7070R7660J09066J21040J33881
$$ 1057110 1099000 1146998 1201075 1261939 1330701 1408207 1495277 1592937 1702003 1823043 1956924
57532A956924J47707J61733J75117J87685J98703K05816K06442J99509J84604
$$ 1956924 2104631 2266364 2441481 2629166 2827869 3033685 3240127 3439636 3624240
57523C624240J60398J25715Q1841L2414j8700o8243j12844j49263j75777j92464
$$ 3624240 3784638 3910353 3992194 4024608 4005908 3937665 3824821 3675558 3499781 3307317
57513C307317k00301k00670j95380j86122j73942j59704j44638j29765j15427
$$ 3307317 3107016 2906346 2710966 2524844 2350902 2191198 2046560 1916795 1801368
57504A801368j01961r0148q0128p0854o1623n3305m6825m1203l4619k6930j9681
$$ 1801368 1699407 1609259 1529131 1458277 1396654 1343349 1296524 1255321 1220702 1193772 1174091
57493A174091j3886r249n383k317L83L743Q182J3070J7736K2255K7034L2260L7957
$$ 1174091 1160205 1150956 1145573 1143256 1143639 1147382 1155564 1168634 1186370 1208625 1235659 1267919 1305876
57480A305876M4222N1224N9094O7826P7213Q7197R8267J10952J24860J38864J52353
$$ 1305876 1350098 1401322 1460416 1528242 1605455 1692652 1790919 1901871 2026731 2165595 2317948
57469B317948J65411J77460J86777J91740J91468J84592J68670J41944J05050
$$ 2317948 2483359 2660819 2847596 3039336 3230804 3415396 3584066 3726010 3831060
57460C831060O0258J0074m2404r2784j36568j71013j95262k09483k14777k13169
$$ 3831060 3891318 3901392 3858988 3766204 3629636 3458623 3263361 3053878 2839101 2625932
57450B625932k06490j95587j81359j65767j50739j36709j23234j10483r9037q8767
$$ 2625932 2419442 2223855 2042496 1876729 1725990 1589281 1466047 1355564 1256527 1167760
57440A167760p9146p0272o2639n6171n0453m5518m1548l8135l4708l1259k7984
$$ 1167760 1088614 1018342 955703 899532 849079 803561 762013 723878 689170 657911 629927
57429F29927k4762k1693j9487j8393j7508j6052j4580j3895j3538j2585j1238
$$ 629927 605165 583472 563985 545592 528084 512032 497452 483557 470019 457434 446196
57418D46196j0309r665q643p561p377q038q427p915o859n762m879m493m608m634
$$ 446196 435887 426222 417579 410018 402641 394603 386176 378261 371402 365640 360761 356268 351660 347026
57404C47026m132l512l180k603j282OJ50n34p93l66j33n82j254j641j617j177
$$ 347026 342894 339382 336202 333599 332317 332323 332473 331939 331146 330780 330647 330065 328811 327170 325553 324376
57388C24376n82m77r93j312r65p76j439k076j647q94j190k128k163j271q77j313
$$ 324376 323794 323317 322324 321012 320047 319271 317832 315756 314109 313215 312025 309897 307734 306463 305586 304273
57372C04273j395o94k26n21q05o65p79j377j532p36J26K62J95P08J463J606J009
$$ 304273 302878 302184 301958 301437 300632 299967 299188 297811 296279 295543 295669 295931 296126 296834 298297 299903 300912
57355C00912K67r5J01P45J435J834K089K474K723K349J503Q38O10O52R88J634
$$ 300912 301179 301084 301185 301930 303365 305199 307288 309762 312485 314834 316337 317175 317785 318437 319425 321059
57339C21059K007J589J004J380K659L612L554K995K585K443K610L108L474L193
$$ 321059 323066 324655 325659 327039 329698 333310 336864 339859 342444 344887 347497 350605 354079 357272
57325C57272K689K928L946M804N006M976N013M865M534M505M918N311N398N373
$$ 357272 359961 362889 366835 371639 376645 381621 386634 391499 396033 400538 405456 410767 416165 421538
57311D21538N427N680O453P769Q835Q882Q304Q001Q053Q147Q798J0696J3049J4265
$$ 421538 426965 432645 439098 446867 455702 464584 472888 480889 488942 497089 505887 516583 529632 543897
57297E43897J4244J4456J5698J7324J8845K0624K2618K4054K4941K6388K8804
$$ 543897 558141 572597 588295 605619 624464 645088 667706 691760 716701 743089 771893
57286G71893L1044L2035L2102L2015L1800L1109K9796K7510K3575J7910J1346
$$ 771893 802937 834972 867074 899089 930889 961998 991794 1019304 1042879 1060789 1072135
57275A072135M719j746p927j3574j8746k3648k7903l0818l2374l3042l2728l1060
$$ 1072135 1076854 1075108 1067181 1053607 1034861 1011213 983310 952492 920118 887076 854348 823288
57263H23288k8540k6265k4407k2223j9599j7285j5545j3834j1934j0128q319o264
$$ 823288 794748 768483 744076 721853 702254 684969 669424 655590 643656 633528 625209 618945
57251F18945m650m365m753m183k387o15N06J483K323K426K326L350N120N622M361
$$ 618945 614295 609930 605177 600994 598607 597992 598498 599981 602304 604730 607056 610406 615526 621148 625509
57236F25509L273L621M243L943L505L958M693M792M680N103N784O276O862P562
$$ 625509 628782 632403 636646 640589 644094 648052 652745 657537 662217 667320 673104 679380 686242 693804
57222F93804P643P094P096Q083Q889Q849Q964R893J0551J0125R720J0461J1553
$$ 693804 701447 708541 715637 723720 732609 741458 750422 760315 770866 780991 790711 801172 812725
57209H12725J1845J1867J2614J3651J4016J3903J3897J3753J3339J3480J4390
$$ 812725 824570 836437 849051 862702 876718 890621 904518 918271 931610 945090 959480
57198I59480J4661J3428J2071J2091J2657J2195J1077J0662J0821J0590J0320
$$ 959480 974141 987569 999640 1011731 1024388 1036583 1047660 1058322 1069143 1079733 1090053
57187A090053J1083J2602J3779J4673J6019J7405J7813J7495J7568J8211J8814
$$ 1090053 1101136 1113738 1127517 1142190 1158209 1175614 1193427 1210922 1228490 1246701 1265515
57176A265515J9401K0286K0973K0933K0882K1674K2676K2798K2360K2216K1950
$$ 1265515 1284916 1305202 1326175 1347108 1367990 1389664 1412340 1435138 1457498 1479714 1501664
57165A501664K0754J9430J9411K0405K0947K0875K1261K2346K3348K4111K5137
$$ 1501664 1522418 1541848 1561259 1581664 1602611 1623486 1644747 1667093 1690441 1714552 1739689
57154A739689K6304K7218K8405L0504L2785L4150L5088L6780L8970M0645M2255
$$ 1739689 1765993 1793211 1821616 1852120 1884905 1919055 1954143 1990923 2029893 2070538 2112793
57143B112793M4998M8341N0466N1023N1357N2067N2462N2343N2255N1953N0581
$$ 2112793 2157791 2206132 2256598 2307621 2358978 2411045 2463507 2515850 2568105 2620058 2670639
57132B670639M8462M6890M6115M5388M4869M5521M7185M8675M9840N1680N4434
$$ 2670639 2719101 2765991 2812106 2857494 2902363 2947884 2995069 3043744 3093584 3145264 3199698
57121C199698N7431O0780O5289P0724P5974Q0840Q5871R0619R4102R6765J00055
$$ 3199698 3257129 3317909 3383198 3453922 3529896 3610736 3696607 3787226 3881328 3978093 4078148
57110D078148J04462J10024J18314J31422J49300J70538J95468K25980K62734
$$ 4078148 4182610 4292634 4410948 4542370 4691670 4862208 5057676 5283656 5546390
57101E546390L05663L57163M21729N02426O00685P19194Q61371J027598J215621
$$ 5546390 5852053 6209216 6630945 7133371 7734056 8453250 9314621 10342219 11557840
57092A1557840J424928J656913J909916K177086K448324K709618K941089L122295
$$ 11557840 12982768 14639681 16549597 18726683 21175007 23884625 26825714 29948009
57084B9948009L240515L288173L254127L131116K936902K711426K473009K178567
$$ 29948009 33188524 36476697 39730824 42861940 45798842 48510268 50983277 53161844
57076E3161844J744079J113611L06806n96385j503414k339128l048043l590915
$$ 53161844 54905923 56019534 56326340 55729955 54226541 51887413 48839370 45248455
57068D5248455l947391m117547m117455l973871l721042l396376l034313k662405
$$ 45248455 41301064 37183517 33066062 29092191 25371149 21974773 18940460 16278055
57060A6278055k301415j966360j666372j404871j181232r92837q36236p07532
$$ 16278055 13976640 12010280 10343908 8939037 7757805 6764968 5928732 5221200
57052E221200o02590n17198m47420l90055l42754l03536k70404k41581k15962
$$ 5221200 4618610 4101412 3653992 3263937 2921183 2617647 2347243 2105662 1889700
57043A889700j93097j72751j54551j37993j22715j08636r5760q3974p3212o3766
$$ 1889700 1696603 1523852 1369301 1231308 1108593 999957 904197 820223 747011 683245
57033F83245n6040m9996m5114m0947l7262l3746l0080k6414k3222k0593j8187
$$ 683245 627205 577209 532095 491148 453886 420140 390060 363646 340424 319831 301644
57022C01644j5868j3772j1733r458p267n767m709l213j164Q55L243P369J3257
$$ 301644 285776 272004 260271 250813 243546 237779 233070 229857 228693 229548 232791 240160 253417
57009B53417J8998K3500K8382L5984M6955O1256P9869J03470J30548J58649J85338
$$ 253417 272415 295915 324297 360281 407236 468492 548361 651831 782379 941028 1126366
56998A126366K04150K00827J60088Q0620j8088j07013j66203j92812j94729j80953
$$ 1126366 1330516 1531343 1691431 1772051 1753963 1646950 1480747 1287935 1093206 912253
56988I12253j58127j31521j05296q1684o1447m5123l3017k4525j8805j6132j7284
$$ 912253 754126 622605 517309 435625 374178 329055 296038 271513 252708 236576 219292
56977B19292k1340k5362k7008k6571k5594k4387k2012j8115j3441F783B835N01
$$ 219292 197952 172590 145582 119011 93417 69030 47018 28903 15462 6783 2835 3336
56965C336M146O912R329J1801J4429J7456K1101K4904K8058L0297L1513L0568
$$ 3336 7482 14394 23723 35524 49953 67409 88510 113414 141472 171769 203282 233850
56953B33850K5683J6404M441p555j7302k3226k4917k3615k1188j8308j4499r966
$$ 233850 259533 275937 280378 272823 255521 232295 207378 183763 162575 144267 129768 119802
56941A19802o062l454j263J435M402P257J0472J4607J9430K4548K9969L5222L8640
$$ 119802 113740 110286 109023 110458 114860 122117 132589 147196 166626 191174 221143 256365 295005
56928B95005L8237L2762K1808O197j1071k5551l4303l7632l7515l5320l1739k7658
$$ 295005 333242 366004 387812 394009 382938 357387 323084 285452 247937 212617 180878 153220
56916A53220k3746j9849j5793j2299j0188r214q481p531o343m864l258k098j668
$$ 153220 129474 109625 93832 81533 71345 62131 53650 46119 39776 34912 31654 29556 27888
56903B7888j554j351j105p55M6J117J763K057L035N104P369R195J1194J3944J6996
$$ 27888 26334 24983 23878 23123 23169 24286 26049 28106 31141 36245 43614 52809 64003 77947 94943
56888I4943K0093K3990K8916L3456L6096L6620L4760K8981J8528N806n218j2508
$$ 94943 115036 139026 167942 201398 237494 274114 308874 337855 356383 362189 356971 344463
56876C44463j6439j7591j6056j2659r070o270l998j623J333N309J0350J5816K1333
$$ 344463 328024 310433 294377 281718 272648 266378 262380 260757 262090 267399 277749 293565 314898
56863C14898K7575L5307M4202N3448O2617P0460P3467O7419N0765K5898k397k8789
$$ 314898 342473 377780 421982 475430 538047 608507 681974 749393 800158 826056 823659 794870
56851G94870m8623n9430o1867n8489n1571m2467l2329k2201j2569l645M309J1711
$$ 794870 746247 686817 624950 566461 514890 472423 440094 417893 405324 401679 405988 417699
56839D17699K0112L0883M3814N7932P2978Q8954J04567J16967J22335J15952R3393
$$ 417699 437811 468694 512508 570440 643418 732372 836939 953906 1076241 1192193 1285586
56828A285586N4255M980m3492q1586j04744j13174j10203j00587q8160p4359n9506
$$ 1285586 1339841 1344821 1301329 1219743 1114999 1001825 891622 791035 702875 628516 569010
56817E69010m4984l2607k2238j1915n45J1062K2139L3324M5494N8334P0670Q1111
$$ 569010 524026 491419 469181 457266 456721 467783 489922 523246 568740 627074 697744 778855
56805G78855Q7429Q5867P2336M5303Q290l0488o2110q1814r0263r0452q4591p4352
$$ 778855 866284 952151 1024487 1069790 1078080 1047592 985482 903668 813405 722953 638362 564010
56793E64010o2251n0819m0876l1899k3622j6123q957j515O074J3457K0999K9067
$$ 564010 501759 450940 410064 378165 354543 338420 329463 327948 334022 347479 368478 397545
56781C97545L6882M3063M6627M6338M0060K6472P249j3614l2205m5731n2614n3398
$$ 397545 434427 477490 524117 570455 610515 636987 644236 630622 598417 552686 500072 446674
56769D46674n0799m7110m2196l5439k8420k3454k0329j6990j3027j0025q618p683
$$ 446674 395875 348765 306569 271130 242710 219256 198927 181937 168910 158885 150267 142584
56757A42584o584n880n513m579l255k888l635l975l156k193j886j665j089p45
$$ 142584 136000 130120 124607 120028 116773 113885 110250 106275 103119 100926 99040 97375 96286 95541
56743I5541r16r27n15m45j050j499j186o44m81n09m14k36N9M54L23q65k300k628
$$ 95541 94625 93698 93183 92738 91688 90189 89003 88359 87878 87369 86955 86719 86778 87232 87555 86690 84390 81762
56725H1762j938j480j537j280o44m89p34k77Q48J212L98k42J46P34P65P29J039
$$ 81762 79824 78344 76807 75527 74883 74394 73660 73383 74231 75443 75841 75599 75745 76479 77244 77973 79012
56708G9012J180R76J068J462J194K05j70N69J112N72%M86J296J271P46P68J355
$$ 79012 80192 81168 82236 83698 84892 85097 84927 85496 86608 87180 87180 87666 88962 90233 90979 91747 93102
56691I3102J815J905J660R33k6l63K20Q55P67K27k57p01r39l26J107K197K164
$$ 93102 94917 96822 98482 99415 99389 99026 99246 100101 100868 101095 100838 100137 99198 98872 99979 102176 104340
56674A04340J568J161Q13K80k2J34R4o83j753k490k930l226l129k623k264k291
$$ 104340 105908 107069 107882 108162 108140 108274 108368 107685 105932 103442 100512 97286 94157 91534 89270 86979
56658H6979k210j743j391j525j768j756j661j670j635j525j429j013M1R89P03
$$ 86979 84769 83026 81635 80110 78342 76586 74925 73255 71620 70095 68666 67653 67694 68683 69386
56643F9386n17j113m49N61J169J692K267K266J500O96K53k14p05o07jK06j32j19
$$ 69386 68869 67756 67307 67868 69037 70729 72996 75262 76762 77458 77711 77497 76792 76185 76184 76390 76258 76139
56625G6139M74P79N56O90J489K174K504L229M262M332L176K261K401K539J864
$$ 76139 76613 77392 77948 78638 80127 82301 84805 88034 92296 96628 99804 102065 104466 107005 108869
56610A08869J222J283J128P9p64l20N91O10j50q58j498k264k523j761o71j27K
$$ 108869 110091 111374 112502 112581 111817 111497 112088 112698 112548 111690 110192 107928 105405 103644 102973 102846 102848
56593A02848N0l37j283j869j321j21Q77J458J515P36l94n89L20Q65J64p11n17
$$ 102848 102898 102561 101278 99409 98088 97967 98844 100302 101817 102553 102159 101570 101890 102755 102919 102208 101691
56576A01691L95J131J648K053J885J213J101J939K650K570K587L295L652K796
$$ 101691 102086 103217 104865 106918 108803 110016 111117 113056 115706 118276 120863 124158 127810 130606
56562A30606J764J875K698L106L134L340L463L137K961L500M183M286M080L927
$$ 130606 132370 134245 136943 140049 143183 146523 149986 153123 156084 159584 163767 168053 172133 176060
56548A76060L377K202J195Q70O18J0l85l93q72j983k481j906j723k913m175m107
$$ 176060 179437 181639 182834 183704 184322 184332 183947 183554 182682 180699 178218 176312 174589 171676 167501 163394
56532A63394l365l068k764j802j142j681k245j349J77L98q50k188k929l244k955
$$ 163394 160029 156961 154197 152395 151253 149572 147327 145978 146155 146553 145703 143515 140586 137342 134387
56517A34387j880p44k58m2L37K51o84j467j206o77q71j259r99o20q68j177q48
$$ 134387 132507 131763 131505 131463 131800 132051 131367 129900 128694 128017 127146 125887 124888 124268 123400 122223 121375
56500A21375n48r73j342q46l01n76p93N9J032P80n4j3P04R80R50J377J843J560
$$ 121375 120827 119854 118512 117666 117365 116789 115996 116055 117087 117867 117813 117800 118504 119484 120434 121811 123654 125214
56482A25214J119J523K306K472K359K791L243K751J729J236J309J572K316L371
$$ 125214 126333 127856 130162 132634 134993 137784 141027 143778 145507 146743 148052 149624 151940 155311
56468A55311L338J813Q66K259M554N222M266L425L079K461J872K044K163R90o99
$$ 155311 158649 160462 161328 163587 168141 173363 177629 181054 184133 186594 188466 190510 192673 193663 192964
56453A92964j165m76NN8L33M99m0m26L25J157M86r64j259m41q7m06k77L31M61
$$ 192964 191799 191323 191328 191386 191719 192218 192178 191752 192077 193234 193720 192756 191497 191056 190969 190563 190286 190617 191078
56434A91078K31M45P08J10o68k58R01J186L88m67j303k711m185m786m979n687
$$ 191078 191309 191754 192462 192572 191904 191646 192547 193733 194121 193654 192351 189640 185455 180669 175690 170003
56418A70003o205n320l709k911k756k114j392j677k262j631l45k18j199j633j194
$$ 170003 163798 158478 154769 151858 149102 146988 145596 143919 141657 140026 139681 139463 138264 136631 135437
56403A35437r57j000m12N93R80Q53R91J005K24m46J65J124Q37j39k49J38k51p18
$$ 135437 134480 133480 133068 133661 134641 135494 136485 137490 137714 137268 137433 138557 139394 139255 139006 139144 138893 138175
56385A38175K61J913K227J435J336J910J780J333K113L705M494M950O775R177
$$ 138175 138436 140349 142576 144011 145347 147257 149037 150370 152483 156188 160682 165632 172407 181584
56371A81584R664Q196P110O926N860L586K044K104K511K472K427K237J351O53
$$ 181584 191248 199444 206554 213480 219340 222926 224970 227074 229585 232057 234484 236721 238072 238725
56357B38725J304K180J386k27m07M24j0j414j370J18O05j77J49K058L193K602
$$ 238725 240029 242209 243595 243368 242961 243385 243375 241961 240591 240709 241314 241137 241286 243344 246537 249139
56341B49139K136K767L240L114L566M473M135K665K249L391M392N005O923R924
$$ 249139 251275 254042 257282 260396 263962 268435 272570 275235 277484 280875 285267 290272 297195 307119
56327C07119J1344J0363R212R201R082Q342Q395R377R343P863O983P449P379N868
$$ 307119 318463 328826 338038 347239 356321 364663 373058 382435 391778 399641 406624 414073 421452 427320
56313D27320M483L948K741L36j455j772k127l259l720k860k135k230j918r80j003
$$ 427320 431803 435751 438492 438828 437373 435601 433474 430215 426495 423635 421500 419270 417352 416372 415369
56298D15369k130k188l52J455K041K658M076N078N264O190Q355J0055J0484J1089
$$ 415369 413239 411051 410699 412154 414195 416853 420929 426007 431271 437461 445816 455871 466355 477444
56284D77444J2668J4053J4758J5944J7834J9110J9803K1640K4773K7395K9327
$$ 477444 490112 504165 518923 534867 552701 571811 591614 613254 638027 665422 694749
56273F94749L2487L7096M1069M4037M8132N3822N8993O3363O9724P9346R0048
$$ 694749 727236 764332 805401 849438 897570 951392 1010385 1073748 1143472 1222818 1312866
56262A312866J00374J11717J24770J37751J49924J63001J77320J90375K00855
$$ 1312866 1413240 1524957 1649727 1787478 1937402 2100403 2277723 2468098 2668953
56253B668953K10205K18462K22528K20592K14368K04844J89672J67130J39172
$$ 2668953 2879158 3097620 3320148 3540740 3755108 3959952 4149624 4316754 4455926
56244D455926J08315P4936L9817N895k4659n2106p6163r4754j07380j16208j22245
$$ 4455926 4564241 4639177 4678994 4684889 4660230 4608124 4531961 4437207 4329827 4213619 4091374
56233D091374j24183j22607j21185j21660j21654j19627j18000j19058j21531
$$ 4091374 3967191 3844584 3723399 3601739 3480085 3360458 3242458 3123400 3001869
56224C001869j23623j25764j28097j28883j27622j26305j25678j23763j19709
$$ 3001869 2878246 2752482 2624385 2495502 2367880 2241575 2115897 1992134 1872425
56215A872425j15231j10687j03997r5235q7732q2641p6922o8911o1089n5188m9405
$$ 1872425 1757194 1646507 1542510 1447275 1359543 1276902 1199980 1131069 1069980 1014792 965387
56204I65387m2954l8355l6423l3948k9303k5437k4234k2904j9340j6052j5223
$$ 965387 922433 884078 847655 813707 784404 758967 734733 711829 692489 676437 661214
56193F61214j4552j1885r303q828q468o350m417m265l628q62J479J444J640M385
$$ 661214 646662 634777 625474 616646 608178 601828 597411 593146 589518 588656 590135 591579 593219 597604
56179E97604P238P520P122Q594J0388J0261R558J0040J0178Q446O593N985M656
$$ 597604 604842 612362 619484 628078 638466 648727 658285 668325 678503 686949 693542 699527 704183
56166G04183J466j023j328k143m989o672m981l070l830m842l418j685j988k005
$$ 704183 705649 704626 703298 701155 696166 689494 684513 681443 677613 672771 669353 667668 665680 663675
56152F63675O00L337L685M119P359J1202J3117J5357K0377K5865K9575L4478M3553
$$ 663675 664275 667612 671297 675416 682775 693977 707094 722451 742828 768693 798268 832746 876299
56139H76299N4159O3079P2520Q5321R8814J09359J18462J28125J34428J32055
$$ 876299 930458 993537 1066057 1151378 1250192 1359551 1478013 1606138 1740566 1872621
56129A872621J21760J07687R1424P4270O0797N3854M9760M4044L7700L2238K3807
$$ 1872621 1994381 2102068 2193492 2267762 2328559 2382413 2432173 2476217 2513917 2546155 2569962
56118B569962Q991p971k0534k8432l4881l9877m2991m8369n9870p4782q8479j00945
$$ 2569962 2578953 2570982 2550448 2522016 2487135 2447258 2404267 2355898 2296028 2221246 2132767 2031822
56106B031822j12672j19211j16863j09161j00922r0776p6520o2465n3598m7344
$$ 2031822 1919150 1799939 1683076 1573915 1472993 1382217 1305697 1243232 1189634 1142290
56096A142290l9101l1065k7533k6157k2347j7851j6580j6281j2886q768q188q807
$$ 1142290 1103189 1072124 1044591 1018434 996087 978236 961656 945375 932489 923721 915533 906726
56084I06726o324l106l493m928k683Q96R53m41J442M603M542L445N768Q986Q285
$$ 906726 900402 897296 893803 888875 886192 887088 888041 887600 889042 893645 898187 901632 907400 916386 924671
56069I24671O155P658J0546R987Q453J0806J4074J2725R595J0788J4167J3839
$$ 924671 930826 938484 949030 959017 967470 978276 992350 1005075 1014670 1025458 1039625 1053464
56057A053464J1693J3251J6308J5241J2437J3841J7173J6261J3186J4172J7490
$$ 1053464 1065157 1078408 1094716 1109957 1122394 1136235 1153408 1169669 1182855 1197027 1214517
56046A214517J7308J5557J7838K1688K1137J8750K0724K4523K3998K2116K5483
$$ 1214517 1231825 1247382 1265220 1286908 1308045 1326795 1347519 1372042 1396040 1418156 1443639
56035A443639L1054L1819L0629L4421L9825L9134L5524L7212M1591M0663L7231
$$ 1443639 1474693 1506512 1537141 1571562 1611387 1650521 1686045 1723257 1764848 1805511 1842742
56024A842742L9544M4814M4577M1547M4124M9189M7960M3944M6700N2745N1751
$$ 1842742 1882286 1927100 1971677 2013224 2057348 2106537 2154497 2198441 2245141 2297886 2349637
56013B349637M6926M9528N7604O0441N9821O5880P6019P9456P8757Q4906R4970
$$ 2349637 2396563 2446091 2503695 2564136 2623957 2689837 2765856 2845312 2924069 3008975 3103945
56002C103945R7380R5370J01590J13349J17653J17052J25044J39350J46077J47147
$$ 3103945 3201325 3296695 3398285 3511634 3629287 3746339 3871383 4010733 4156810 4303957
55992D303957J56436J71863J79449J81974J94453K14189K25719K32295K50595
$$ 4303957 4460393 4632256 4811705 4993679 5188132 5402321 5628040 5860335 6110930
55983F110930K77230K94099L04292L27502L62241L89576M12064M50057N01253
$$ 6110930 6388160 6682259 6986551 7314053 7676294 8065870 8477934 8927991 9429244
55974I429244N44967N85043O45422P24593Q00180Q77238R82994J115223J248903
$$ 9429244 9974211 10559254 11204676 11929269 12729449 13606687 14589681 15704904 16953807
55965A6953807J393511J587007J833931K111583K437238K860731L389999M000232
$$ 16953807 18347318 19934325 21768256 23879839 26317077 29177808 32567807 36568039
55957C6568039M719787N624600O748711Q101582R782611J1965635J4754268J8170299
$$ 36568039 41287826 46912426 53661137 61762719 71545330 83510965 98265233 116435532
55949A16435532K2275096K7100078L2369158L7415964M1346429M2967246M0514946
$$ 116435532 138710628 165810706 198179864 235595828 276942257 319909503 360424449
55942C60424449L2136171J7490191r70448j8820725l2191091l9643509m1928101
$$ 360424449 392560620 410050811 409080363 390259638 358068547 318425038 276496937
55935B76496937m0562592l6912493l2109130k7085832k2427499j8352375j4915908
$$ 276496937 235934345 199021852 166912722 139826890 117399391 99047016 84131108
55928H4131108j2135039r941369q187900o765809n638816m758244m038138l429273
$$ 84131108 71996069 62054700 53866800 47100991 41462175 36703931 32665793 29236520
55920B9236520k936747k548957k218377j923159j681783j494433j328239j170579
$$ 29236520 26299773 23750816 21532439 19609280 17927497 16433064 15104825 13934246
55912A3934246j041915r45389q54391p59763o81812o25957n70762n09132m59566
$$ 13934246 12892331 11946942 11092551 10332788 9650976 9025019 8454257 7945125 7485559
55903G485559m27313l93683l52668l21068l03604k83317k55000k34557k26854
$$ 7485559 7058246 6664563 6311895 5990827 5687223 5403906 5148906 4914349 4687495
55894D687495k16204j96999j83157j79152j70941j53820j41254j38072j31621
$$ 4687495 4471291 4274292 4091135 3911983 3741042 3587222 3445968 3307896 3176275
55885C176275j17368j07463j06136j01466q9379q1829q3373q2500p3989o7818
$$ 3176275 3058907 2951444 2845308 2743842 2654463 2572634 2489261 2406761 2332772 2264954
55875B264954o8398o6200n7597n2462n4652n4521m7978m3921m5944m5325l8987
$$ 2264954 2196556 2130356 2072759 2020297 1965645 1911124 1863146 1819225 1773281 1727956 1688969
55864A688969l6086l9861m0635l3770k7431k5840k1673j1942n116n556o569n391
$$ 1688969 1652883 1613022 1572387 1538617 1511186 1485346 1463673 1451731 1446615 1441059 1434490 1429099
55852A429099r383k0550k9147k9757k9282l2243l2521k6636k1419k1230k0485
$$ 1429099 1419716 1399166 1370019 1340262 1310980 1278737 1246216 1219580 1198161 1176931 1156446
55841A156446j5672j2393j3983j5227j3489j4241j9616k3256k2193k2306k6390
$$ 1156446 1140774 1128381 1114398 1099171 1085682 1071441 1051825 1028569 1006376 984070 957680
55830I57680k8444k5284k2458k3167k2648j8889j7448k0219k0744j6364j3750
$$ 957680 929236 903952 881494 858327 835679 816790 799342 779123 758379 742015 728265
55819G28265j6544j8707j6177j4172j6368j7550j3761r824r934j0134o823l760
$$ 728265 711721 693014 676837 662665 646297 628747 614986 605162 595228 585094 578271 574511
55807E74511m109m054o47K101J033k14J291K073n06k885k460k591n593q085p975
$$ 574511 570402 566348 565701 567802 568835 568621 569912 571985 571479 568594 566134 563543 557950 549865 541890
55792E41890q592j1475j2661j0425r020j0423j0410p029m809o038o148k541K92
$$ 541890 533298 521823 509162 498737 489717 479294 468884 461855 457046 451008 444860 442319 442611
55779D42611n69r37K094M102J283l119n632q481j3311j6222j4625j2246j2190
$$ 442611 442042 441105 443199 447301 448584 445465 439833 431352 418041 401819 387194 374948 362758
55766C62758j1691q675o502p130o669k979o99l234o546o441n395o438o842l801
$$ 362758 351067 342392 335890 328760 322091 319112 318413 315179 308633 302192 296797 290359 283517 279716
55752B79716l30K98K58J912K613J69k169j625j162l585n983n383m387n811p081
$$ 279716 279386 279684 279942 281854 284467 284636 282467 280842 279680 276095 270112 264729 260342 254531 247450
55737B47450n418l314l486l537r76J470R06l03O68J675J19j937k151k615n235
$$ 247450 242032 238718 235232 231695 230719 232189 233095 232792 233460 235135 235254 233317 231166 228551 223316
55722B23316p220o149m779n837o817n002k848l254m119k787j266j897k356j66
$$ 223316 216096 209947 205168 199331 192514 187512 184664 181410 177291 174504 173238 171341 168985 168819
55708A68819K291K365K316M762P425P543P061Q285Q848O331L491L351L461O66
$$ 168819 171110 173475 175791 180553 187978 195521 202582 210867 219715 226046 229537 232888 236349 237015
55694B37015k576k430l73R5l22N51J021j207l850l802k881m253o209n246k457
$$ 237015 234439 232009 231636 231731 231409 231960 232981 231774 227924 224122 221241 216988 210779 205533 203076
55679B03076j280j443n14R25Q63J89O38Q38r65k830k304r77j367k131r31Q53Q87
$$ 203076 201796 200353 199839 200764 201627 201816 202454 203292 202327 199497 197193 196216 194849 192718 191787 192640 193527
55662A93527M44J542K614J679P65K302M158L261J215J211K243J538k2p9K11j465
$$ 193527 193971 195513 198127 199806 200571 202873 207031 210292 211507 212718 214961 216499 216477 216398 216609 215144
55646B15144l674l798l129m344o343o468n529n662n789m151k804m221o109m992
$$ 215144 211470 207672 204543 200199 193856 187388 181859 176197 170408 166257 163453 159232 153123 148131
55632A48131k518k610m573m895l795m119n348m641k634k435l820l864k442j976
$$ 148131 145613 143003 138430 133535 129740 125621 120273 115632 112998 110563 106743 102879 100437 98461
55618I8461k478j856l79n2m58K28J097j0k008k132r10r85k108j974q96j022j910
$$ 98461 95983 94127 93748 93696 93238 93466 94563 94553 92545 90413 89503 88518 86410 84436 83540 82518 80608
55601H0608j539o24j256k415j557L90M79q52o87Q22R41l46m37P85Q20o75j501
$$ 80608 79069 78445 77189 74774 73217 73607 74086 73234 72547 73369 74310 73964 73527 74312 75132 74457 72956
55584G2956j161j228j669j061r2p26k218k070n21J2n34j06J192J251J17j57N51
$$ 72956 71795 70567 68898 67837 67745 67019 64801 62731 62210 62222 61688 61582 62774 64025 64142 63985 64536
55567F4536N83J63Q86K057J566j7l01N67M46n16l54N09j36j915k415j708k001
$$ 64536 65119 65282 66168 68225 69791 69774 69473 70040 70486 69970 69616 70125 69989 68074 65659 63951 61950
55550F1950l138k897j520j403k348j707N71J566M37m55J05P41Q89J610K550J956
$$ 61950 58812 55915 54395 52992 50644 48937 49508 51074 51511 51056 51161 51902 52791 54401 56951 58907
55534E8907J18q28o93j146j871q54J368J944N83L2J261K096J392O16N51J26p31
$$ 58907 59025 58197 57504 56358 54487 53633 55001 56945 57528 57560 58821 60917 62309 62925 63476 63602 62871
55517F2871o06L79N08p9O34K732L947L528L011K752J404p52j624j059j184k456
$$ 62871 62265 62644 63152 63073 63707 66439 70386 73914 76925 79677 81081 80329 78705 77646 76462 74006
55501G4006k933k138j941k913l327k589k190k444j772n2O62k99j169j024q96j032
$$ 74006 71073 68935 66994 64081 60754 58165 55975 53531 51759 51707 52369 52070 50901 49877 48981 47949
55485D7949k63J150J303J8o63p3J92m81q00m72p94j768j803r59j084k230k327
$$ 47949 47686 48836 50139 50157 49494 49421 49613 49132 48332 47860 47066 45298 43495 42536 41452 39222 36895
55468C6895j002k81q17r61k60k66j074p76O78Q31r27k042j125j3j54l84J51K20
$$ 36895 35893 35612 34795 33834 33574 33308 32234 31458 32136 32967 32040 29998 28873 28860 28706 28322 28473 28693
55450B8693p23j113k41L69j13l83J49J32q33j042J54J078Q76Q75J536J289j51
$$ 28693 27970 26857 26616 26985 26872 26489 26638 26770 25937 24895 25049 26127 27003 27878 29414 30703 30552
55433C0552o25O68J378m8j711j563n28k15k35J88K75n24j033m21K44J49K42J096
$$ 30552 29927 30595 31973 31925 30214 28651 28123 27908 27673 27861 28136 27612 26579 26158 26402 26551 26793 27889
55415B7889J438M62n76n81l08m94m04L39O33j3l92J74O45M29M31Q38L64j096j608
$$ 27889 29327 29789 29213 28632 28324 27830 27426 27765 28398 28385 27993 28167 28812 29241 29672 30510 30874 29778 28170
55396B8170l74P93O26L93J168J690P98l14k13M21L36k78q69j664k385j791R8J378
$$ 28170 27796 28589 29215 29608 30776 32466 33264 32950 32737 33158 33494 33216 32347 30683 28298 26507 26605 27983
55378B7983J076N06O32N02l97o88L52J237Q77L96P34P89k56j126q54p31j888l008
$$ 27983 29059 29565 30197 30699 30302 29614 29966 31203 32080 32476 33210 33999 33743 32617 31763 31032 29144 26136
55360B6136k575j384q41o12N1M24j63o53j9Q36P68M06O55Q26J05o09j57Q23J042
$$ 26136 23561 22177 21336 20724 20775 21199 21036 20383 20364 21200 21968 22374 23029 23855 23960 23351 23194 24017 25059
55341B5059N25n2o99j418j503q07l35n25m40K11K00r10j555p45J59j71p35j8J489
$$ 25059 25584 25532 24833 23415 21912 21105 20770 20245 19805 20016 20216 19306 17751 17006 17165 16994 16259 16241 17730
55322A7730K369K345J789N54j126k069j779j276j213q06K14N73k98q77K3J288
$$ 17730 20099 22444 24233 24787 23661 21592 19813 18537 17324 16518 16732 17305 17007 16130 16153 17441
55306A7441J500J104R65O03m60j227p98N0L98P26J530K027J635J137J070O40m06
$$ 17441 18941 20045 21010 21613 21153 19926 19128 19178 19576 20302 21832 23859 25494 26631 27701 28341 27935
55289B7935p93P2Q10M69J27N82O54m95j408p44L26J25q94j436j500j422o09Q52
$$ 27935 27142 27214 28024 28493 28620 29202 29856 29361 27953 27209 27535 27660 26766 25330 23830 22408 21799 22651
55271B2651J250j18j260m70Q84P67k48m37M7O7j42J27K38m50p84K96J508J081
$$ 22651 23901 23783 22523 22053 22937 23704 23456 23019 23066 23133 22991 23118 23356 22906 22122 22418 23926 25007
55253B5007m37j420j818k267k053m56J141J008q8j66Q11J379J163Q66N49O5J53
$$ 25007 24570 23150 21332 19065 17012 16556 17697 18705 18617 18451 19262 20641 21804 22670 23219 23284 23437
55236B3437J087J384k3j556j194L03Q35L68L65Q25O55K60R57K261K328R03n02
$$ 23437 24524 25908 25885 24329 23135 23438 24273 24641 25006 25831 26486 26746 27703 29964 32292 33195 32693
55219C2693j128j450j469o85L35M39j68k66K58M04p0l89k32N4M21R77J265R78
$$ 32693 31565 30115 28646 27961 28296 28735 28567 28301 28559 28963 28893 28504 28272 28326 28747 29724 30989 31967
55201C1967P72J184J498R02n9n23p40j118j019p5N30k11j255j157m13l85r04r12
$$ 31967 32739 33923 35421 36323 36264 35741 35001 33883 32864 32789 33319 33108 31853 30696 30283 29898 28994 28082
55183B8082m56j96Q5O81P88j09q38m12N9n97j189j93J188P30j049j754r31k53
$$ 28082 27626 27430 27515 28196 28984 28875 28037 27625 27684 27087 25898 25705 26893 27623 26574 24820 23889 23636
55165B3636m02m54j03J14N18J745K782K030J43o20K21R64O61J08j75o43j195j009
$$ 23636 23234 22780 22677 22791 23309 25054 27836 29866 30009 29389 29610 30574 31235 31343 31168 30525 29330 28321
55147B8321k49n1o14r48o33k18P1N00P98M98J02L71Q09M09m77o62j68m6m95p68
$$ 28321 28072 28021 27407 26459 25826 25608 25679 26179 26977 27475 27577 27948 28757 29166 28689 28027 27859 27813 27318 26550
55127B6550o53n10k15M67R92R74J255K439L299K456P78J35N78P60M20K65J35n11
$$ 26550 25897 25387 25172 25639 26631 27605 28860 31299 34598 37054 37832 37967 38545 39305 39725 39990 40125 39614
55109C9614r49k52O69L69m70j22J107J486R78J048J652J305P1k57P89J669J504
$$ 39614 38665 38413 39082 39451 38981 38859 39966 41452 42430 43478 45130 46435 46506 46249 47038 48707 50211
55092E0211J057Q29M68K53R67K032K040J213J082J631J237k80j039j62R36R73
$$ 50211 51268 52097 52565 52818 53785 55817 57857 59070 60152 61783 63020 62740 61701 61539 62475 63448
55076F3448M27K4m32r67q87j09M44L05p2m62j091j597j312n77l07l38J22P40N20
$$ 63448 63875 63899 63467 62500 61613 61504 61948 62253 62181 61719 60628 59031 57719 57142 56835 56497 56619 57359 57879
55057E7879k33l99j59n86j337j120k54m02j673k420k072j755j863j448m33mk85
$$ 57879 57646 57247 57088 56502 55165 54045 53791 53389 51716 49296 47224 45469 43606 42158 41725 41721 41436
55040D1436K0J091J413M39m37l06qk30l37L4J17m02p10l99j11r7K48R76J394J461
$$ 41436 41456 42547 43960 44399 43962 43656 43648 43418 43081 43115 43232 42830 42120 41721 41610 41513 41761 42737 44131 45592
55020D5592J697J704P25l60J07J652K063R29J14L40J89p81q70O13J810J355N16
$$ 45592 47289 48993 49718 49358 49465 51117 53180 54109 54223 54563 54752 53971 53101 53714 55524 56879 57395
55003E7395O73R89K80p29q49m50m49o78p01r06j473j598q45KL65P48J254R06n27
$$ 57395 58068 59057 59337 58608 57759 57309 56860 56182 55481 54575 53102 51504 50659 50661 51026 51774 53028 53934 53407
54984E3407j608j305m66j67q6L53P33P06Q96J588J893J336R00J295J594Q14l74
$$ 53407 51799 50494 50028 49861 49775 50128 50861 51567 52463 54051 55944 57280 58180 59475 61069 61883 61509
54967F1509p70l60K42R50J709J903J328Q84J331K256L048L859M847N519N661N980
$$ 61509 60739 60379 60621 61571 63280 65183 66511 67395 68726 70982 74030 77889 82736 88255 93916 99896
54951I9896P066Q559R933J1046J1530J0690Q507N724K654q80m278o352p127p932
$$ 99896 106962 115521 125454 136500 148030 158720 167227 172951 175605 174725 170447 164095 156968 149036
54937A49036r300j0279j0207r579q788p655o557o229o155m996l018j994k289k252
$$ 149036 139736 129457 119250 109671 100883 93228 86671 80442 74287 69291 66273 64279 61990 59738
54923E9738j094mL30Q03J569J259k33o95J029L048L519L446M483O008O592O606
$$ 59738 58644 58640 58970 59773 61342 62601 62368 61673 62702 65750 69269 72715 77198 83206 89798 96404
54907I6404P214Q216Q854R363R915R337O828L571R70j424m420p147q464q998r777
$$ 96404 103618 111834 120688 130051 139966 149303 156131 159702 160672 159248 154828 147681 139217 130219 120442
54892A20442j0066q733o702n753n825n550m779m405m309l564k309j565j439j195
$$ 120442 110376 101643 94941 89188 83363 77813 73034 68629 64320 60756 58447 56882 55443 54248
54878E4248p46n44m14P5M63J39k72J86J053J115M50K26O49P29Nq54j261j409j555
$$ 54248 53502 52958 52544 52619 53082 53221 52949 53135 54188 55303 55753 55979 56628 57357 57362 56508 55247 53838 52283
54859E2283j569j346j013o90m60m06l72j51%m07j115j265p73n15q45j078q50p27
$$ 52283 50714 49368 48355 47665 47205 46799 46427 46276 46276 45869 44754 43489 42716 42201 41356 40278 39428 38701
54841C8701r11p17Q1O93P57Q97J256J061L78M75J555J985R71J6M30J230J172R16
$$ 38701 37790 37073 37154 37847 38604 39501 40757 41818 42196 42671 44226 46211 47182 47198 47628 48858 50030 50946
54823E0946J360J610O59m30k23N98O01K39P77J669J428L62Q3Q00J330J403J856
$$ 50946 52306 53916 54575 54145 53922 54520 55121 55360 56137 57806 59234 59596 59679 60479 61809 63212 65068
54806F5068K726L091K792K611K902L434M333N749P041P636Q189R476J0808J1036
$$ 65068 67794 70885 73677 76288 79190 82624 86957 92706 99747 107383 115572 125048 135856 146892
54792A46892J0436R934R142O907L380j95l259n948p819q312q036p960p759o598
$$ 146892 157328 167262 176404 183311 186691 186496 183237 177289 169470 161158 153122 145162 137403 130805
54778A30805n025m278m142l435k276j903k332k172r54J90L73Lk96m16j95O61J865
$$ 130805 125780 121502 117360 113925 111649 109746 107414 105242 104288 104478 104851 104854 104558 104142 103947 104608 106473
54761A06473K830L589M529N455N957O343P085P873Q391R473J1870J4455J5268
$$ 106473 109303 112892 117421 122876 128833 135176 142261 150134 158525 167998 179868 194323 209591
54748B09591J4097J2355J0646Q194M722J202j581l833n949p940r751j1152j1544
$$ 209591 223688 236043 246689 254883 259605 260807 259226 255393 249444 241504 231753 220601 209057
54735B09057j0892j0380j0905j1402j0222p833o419o816p532o992n273l356j934
$$ 209057 198165 187785 176880 165478 155256 147423 141004 134188 126656 119664 114391 111035 109101
54722A09101j372j681k232k239j722j299j234j340j530j698j470q55n39p21n33
$$ 109101 107729 106048 103816 101577 99855 98556 97322 95982 94452 92754 91284 90429 89890 89169 88636
54707H8636M23R93K25q37p15J38L50J12N99J582J796J299J277J672J263M0o33
$$ 88636 89059 90052 90277 89440 88725 88863 89213 89325 89924 91506 93302 94601 95878 97550 98813 98853 98220
54690I8220m09l85r24j020k63M37N79P75J270J386R74Q50J281J531J346J468K199
$$ 98220 97811 97426 96502 95482 95219 95656 96235 97010 98280 99666 100640 101490 102771 104302 105648 107116 109315
54673A09315K833K960L011L193L154L122L874N190N708M846L563K801K380K010
$$ 109315 112148 115108 118119 121312 124466 127588 131462 136652 142360 147206 150769 153570 155950 157960
54659A57960K079K756L344L141K214J080K96M61J632K801K918K375K363K999L438
$$ 157960 160039 162795 166139 169280 171494 172574 172870 173331 174963 177764 180682 183057 185420 188419 191857
54644A91857L646M487O019P301Q048Q927R993J0448J0262J0346J0710J0010P614
$$ 191857 195503 199990 206009 213310 221358 230285 240278 250726 260988 271334 282044 292054 299668
54631B99668M582J933p19m085p930j1585j4598j6362j6241j4660j2982j1850j0620
$$ 299668 304250 306183 305464 301379 293449 281864 267266 250904 234663 220003 207021 195171 184551
54618A84551q793o889n414m132k897k068j586p03P55J815J679P41j39n70n23j20
$$ 184551 175758 168869 163455 159323 156426 154358 152772 152069 152824 154639 156318 157059 156920 156350 155827 155707
54602A55707P6n70j846k886l324l499l491l037k395k246k596k896l145l786m565
$$ 155707 155783 155213 153367 150481 147157 143658 140167 137130 134735 132489 129893 126997 123852 120066 115501
54587A15501m779m569m603m593l636k027j069j013q76m71p42j754k271j871j637
$$ 115501 110722 106153 101550 96957 93321 91294 90225 89212 88336 87865 87123 85369 83098 81227 79590
54572G9590k126k423j941j387j162n89L89O06k68q35l33K6o45j015K71K081K396
$$ 79590 77464 75041 73100 71713 70551 69962 70351 70957 70689 69854 69521 69547 68902 67887 68158 70239 72635
54555G2635J335O32Q62J040O06J18J2N9P8K23N30Q44J117J301J288J270J643K240
$$ 72635 73970 74602 75464 76504 77110 77228 77240 77299 77377 77600 78130 78974 80091 81392 82680 83950 85593 87833
54537H7833K384K058K156L117M157M510M488M661M936N123N516O085O017M868
$$ 87833 90217 92275 94431 97548 101705 106215 110703 115364 120300 125423 130939 137024 143041 147909
54523A47909L416K475J670K77j525l130m565o049p150p353o987o678o293n344
$$ 147909 151325 153800 155470 155747 154222 151092 146527 140478 133328 125975 118988 112310 106017 100673
54509A00673m036l066k614k318j998j797j771j849k061k333k344j895j183m71
$$ 100673 96637 93571 90957 88639 86641 84844 83073 81224 79163 76830 74486 72591 71408 70937
54495G0937J49N45N51L04M4l67j100j551q56O67J632J441R51J004J361J630K057
$$ 70937 71086 71631 72182 72486 72530 72163 71063 69512 68656 69323 70955 72396 73347 74351 75712 77342 79399
54478G9399K716K870K008P89J78L27Q73J623K320K410J746R32N24M20M46P87J332
$$ 79399 82115 84985 86993 87782 87960 88287 89160 90783 93103 95513 97259 98191 98715 99135 99581 100368 101700
54461A01700J386O01m48j115j394j424j113p05q54j594k010j513o95l34l75m53
$$ 101700 103086 103687 103239 102124 100730 99306 98193 97488 96634 95040 93030 91517 90822 90488 90113 89660
54445H9660o63j145j541j463j011m24J60L80j44j015j257o28J46O05R90J236Q02
$$ 89660 88997 87852 86311 84848 83837 83413 83573 83953 83809 82794 81537 80909 81055 81660 82650 83886 84688
54428H4688j43n94l08j82n38l99P21J705J513P62N80R47J241J474J883K123J870
$$ 84688 84545 83951 83643 83461 82923 82524 83245 84950 86463 87225 87805 88752 89993 91467 93350 95473 97343
54411I7343J551J605J792J964K568L609M136L648L086L419M197M488M394M482
$$ 97343 98894 100499 102291 104255 106823 110432 114568 118216 121302 124721 128918 133406 137800 142282
54397A42282M545M064L283K764K405J799J055M76M0k30j74l18j678l990n374m761
$$ 142282 146827 150891 154174 156938 159343 161142 162197 162673 162713 162483 162309 161991 160313 156323 150949 146188
54381A46188l454l139l572l552l118l083l264k850k083j962k618l211l289l037
$$ 146188 142734 139595 136023 132471 129353 126270 123006 120156 118073 116111 113493 110282 106993 103956
54367A03956k557j886j458j502j375m40Q07J381J117N25j00n50l24O21J361J260
$$ 103956 101399 99513 98055 96553 95178 94738 95545 96926 98043 98568 98468 97918 97594 98215 99576 100836
54351A00836J019J498K249K364K040K090K503K759K997L570M052L934L769M260
$$ 100836 101855 103353 105602 107966 110006 112096 114599 117358 120355 123925 127977 131911 135680 139940
54337A39940M737M042K481J399J010K38j322k758l350l409l425l382l258l360
$$ 139940 144677 148719 151200 152599 153609 153847 152525 149767 146417 143008 139583 136201 132943 129583
54323A29583l881m681n463n760n045l455j987j502j922k826m062n144n025l440
$$ 129583 125702 121021 115558 109798 104753 101298 99311 97809 95887 93061 88999 83855 78830 75390
54309G5390j680r37p82l53o0o90j587j451m74l5n61j161j206q98m31R4J48n90
$$ 75390 73710 72773 71991 71638 71578 70888 69301 67850 67376 67341 66780 65619 64413 63515 63084 63178 63326 62736
54291F2736j283r74j41K5m36n32k04k75p46p63l35l29o72k71R90J826J610J303
$$ 62736 61453 60479 60338 60363 59927 59395 59191 58916 58170 57407 57072 56743 56071 55800 56790 58616 60226 61529
54273F1529J709K176J851J067O84Q76J233J413J196M59m39q47n90r0L83Q68J142
$$ 61529 63238 65414 67265 68332 69016 69892 71125 72538 73734 74193 73754 72907 72317 72227 72610 73478 74620
54256G4620P30k61j060j116n67J96Q26R19K84o34j185j287j219r41l68Kl98j180
$$ 74620 75350 75089 74029 72913 72346 72542 73368 74287 74571 73937 72752 71465 70246 69305 68937 68939 68541 67361
54238F7361j410r58n35m68l83r9O4MP7M68R41J277J362J007K60k29Q7P51P96N7
$$ 67361 65951 64993 64458 63990 63607 63508 63572 63576 63653 64121 65062 66339 67701 68708 68968 68739 68826 69577 70373 70430
54218G0430o97p85j73P26J235P44m80j212p05L37Q76R54J054R00J06n97k37P02
$$ 70430 69733 68948 68775 69501 70736 71480 71000 69788 69083 69420 70296 71250 72304 73204 73310 72713 72476 73178
54200G3178Q44o1j100j870k625k956k003k06O91j34j574k165j668o88K28P32O84
$$ 73178 74022 73961 72861 70991 68366 65410 63407 63201 63892 63758 62184 60019 58351 57663 57891 58623 59307
54183E9307L37K5l15p88j081r63q33r54p07L09J132P00l18m85J04K00l04k70N07
$$ 59307 59644 59669 59354 58566 57485 56522 55689 54735 54028 54337 55469 56169 55851 55366 55470 55670 55366 55096 55603
54164E5603R48O62M13L95j34j101j278l34M65K50k77l82m58q01o89L34J407J588
$$ 55603 56551 57213 57626 58021 57887 56786 55508 55174 55639 55889 55612 55230 54772 53971 53282 53616 55023 56611
54146E6611J150P98N37J38j33r0j88p41j252j185p50l99j97j32l47o57n76j80
$$ 56611 57761 58559 59096 59234 59101 59011 58823 58082 56830 55645 54895 54496 54299 54167 53820 53163 52587 52407
54128E2407k01q10j162n95M21J009R38N74L59N52R88R56J4j145j425q77n24p05
$$ 52407 52206 51396 50234 49639 50060 51069 52007 52581 52940 53492 54480 55436 55450 54305 52880 52003 51479 50774
54110E0774p67m46l15n64n78j12K43K14K98O51O46K0n91p16o58n91j51N93Q41
$$ 50774 50007 49561 49246 48682 48104 47992 48235 48449 48747 49398 50044 50064 49473 48757 48099 47508 47357 47950 48791
54091D8791L27j72q9J70J73J98M43N24L36L76P14O65J7m39k55j9j36k6O89J282
$$ 48791 49118 48946 48857 49027 49200 49398 49841 50365 50701 51077 51791 52456 52473 52034 51779 51760 51624 51598 52287 53569
54071E3569J105P02P80R39M16o09j326j364p86L42J600K108J542Q12R87J982K867
$$ 53569 54674 55376 56156 57095 57511 56902 55576 54212 53426 53768 55368 57476 59018 59830 60817 62799 65666
54054F5666L035K525J662Q79N09M33L16K45N42R72R96Q30J202J912J901J023M84
$$ 65666 68701 71226 72888 73767 74276 74709 75025 75270 75812 76784 77780 78610 79812 81724 83625 84648 85132
54037H5132R50J597J738K067L311M791N381N142M896M887M810M692M824N190N562
$$ 85132 86082 87679 89417 91484 94795 99586 104967 110109 115005 119892 124702 129394 134218 139408 144970
54022A44970N788N648M951M089L769L963L850L064K074J185K90j72N63J932K106
$$ 144970 150758 156406 161357 165446 169215 173178 177028 180092 182166 183351 183641 183469 184032 185964 188070
54007A88070M22j574k372k365k569k874k813k850l484m078l849l267l225l634
$$ 188070 188492 186918 184546 182181 179612 176738 173925 171075 167591 163513 159664 156397 153172 149538
53993A49538l963m305m730m454l011j491j169j593j423o44m21j098j767j802j551
$$ 149538 145575 141270 136540 132086 129075 127584 126415 124822 123399 122755 122334 121236 119469 117667 116116
53978A16116j458j472j405j144n95K6J62l01o86m98j17M9L49J053J479R33j15
$$ 116116 114658 113186 111781 110637 110042 110068 110230 109929 109243 108745 108628 108677 109026 110079 111558 112491 112376
53961A12376p57r13r36o50J83R97J137R18R78J109Q13M78P97J418J372O17PJ9
$$ 112376 111619 110706 109770 109120 109303 110300 111437 112355 113333 114442 115255 115733 116530 117948 119320 119937 119944 119963
53943A19963M60J185K134K911L254L670M640N556N449M444L502K971K379J488
$$ 119963 120423 121608 123742 126653 129907 133577 138217 143773 149222 153666 157168 160139 162518 164006
53929A64006N26m30j371j877j543p44j56K10O71J013R07Q34J549K855L876M362
$$ 164006 164532 164102 162731 160854 159311 158567 158411 158621 159292 160305 161212 162046 163595 166450 170326 174688
53913A74688M740N120N243N297N782O610P182P315P303P216O899O505O226N666
$$ 174688 179428 184548 189791 195088 200870 207480 214662 221977 229280 236496 243395 249900 256126 261792
53899B61792M272K233K71j211k124k321j983j928k618l359l391l266l987n278
$$ 261792 266064 268297 268568 267357 265233 262912 260929 259001 256383 253024 249633 246367 242380 237102
53885B37102n956n739n418n364n226m972n061n476n741n894o303o624o097m956
$$ 237102 231146 225407 219989 214625 209399 204427 199366 193890 188149 182255 175952 169328 163231 158275
53871A58275m331m529m641m034l184k654k361k183k346k748k795k352k051k302
$$ 158275 153944 149415 144774 140740 137556 134902 132541 130358 128012 125264 122469 120117 118066 115764
53857A15764k684k708k409j891j022q3K5j157k823l684l321k338j395n68L05J009
$$ 115764 113080 110372 107963 106072 105050 104967 104992 103835 101012 97328 94007 91669 90274 89706 90011 91020
53841I1020R75Q4q90j033m63j37m44p36n13j93j34J33R15J393P46m55r98p36m13
$$ 91020 91995 92079 91189 90156 89693 89556 89112 88376 87863 87670 87536 87669 88584 89977 90723 90268 89270 88534 88121
53822H8121k47J08N23N48M02O79J122Q31k73j260j442q35M57K203L422L077J590
$$ 88121 87874 87982 88505 89053 89455 90134 91256 92087 91814 90554 89112 88277 88734 90937 94359 97436 99026
53805I9026N56P42J431J951K608L654M430M247L503L144L593M539N417N823N700
$$ 99026 99582 100324 101755 103706 106314 109968 114398 118645 122148 125292 128885 133424 138841 144664 150364
53790A50364N291M669L572K152J430K183L547L793K474Q70J94L05M15J51m14j079
$$ 150364 155655 160324 163896 166048 167478 169661 173208 177001 179475 180345 180539 180844 181259 181410 180996 179917
53774A79917j490j406j191j481k293l028l365l439l176k337j310r61j405j765
$$ 179917 178427 177021 175830 174349 172056 169028 165663 162224 159048 156711 155401 154440 153035 151270
53760A51270j456r46q73j143j382j624k005k239j958j351j023j309j974k520k679
$$ 151270 149814 148868 147995 146852 145470 143846 141841 139602 137644 136293 135270 133961 131987 129467 126788
53745A26788k581k405j998j184m49n61j309j416k48J112J358P42L97N07M13Q7
$$ 126788 124207 121802 119804 118620 118171 117610 116301 114885 114637 115749 117107 117849 118246 118753 119166 119253
53729A19253J56O09P56M59K42K01l6k85P0P79Q55J61l39j59J03Q8K78Q05Q99K52
$$ 119253 119409 120018 120774 121233 121475 121676 121640 121355 121425 122204 123059 123220 122881 122722 122825 122913 123191 123996 124895 125147
53709A25147j50N72J779K179J506O09K79O45J370J889J745J071N25N05P89J136
$$ 125147 124997 125569 127348 129527 131033 131642 131921 132566 133936 135825 137570 138641 139166 139671 140460 141596
53693A41596J704K598L440L715L297K441J560J078J143J454J659J842K241K684
$$ 141596 143300 145898 149338 153053 156350 158791 160351 161429 162572 164026 165685 167527 169768 172452
53679A72452K817K749K822K831K247J148K80J02M17Q07R36M83m82j273j350j152
$$ 172452 175269 178018 180840 183671 185918 187066 187346 187448 187865 188672 189608 190091 189609 188336 186986 185834
53663A85834j333j572j161m91o88j763k409j884r65n90o95p95q44r86j173j403
$$ 185834 184501 182929 181768 181277 180589 178826 176417 174533 173568 172978 172283 171488 170644 169658 168485 167082
53647A67082j713j748j078r5K35k61o91l68L96R86J173Q69J11n50m18L24P72O35
$$ 167082 165369 163621 162543 162448 162683 162422 161731 161363 161759 162745 163918 164787 164898 164348 163930 164254 165026 165661
53629A65661N44R10J417J805K176K342J936J382J577K330K361J307M80Q91J755
$$ 165661 166205 167115 168532 170337 172513 174855 176791 178173 179750 182080 184441 185748 186228 187119 188874
53614A88874J854J398J507K502L706M447M569M242L839L701L628L069K077J499
$$ 188874 190728 192126 193633 196135 199841 204288 208857 213099 216938 220639 224267 227336 229413 230912
53600B30912J928L075M396N629O491O570N941N207M665M059L355K943K855K574
$$ 230912 232840 235915 240311 245940 252431 259001 264942 270149 274814 278873 282228 285171 288026 290600
53586B90600J992J636J725J866J931K268K722K503J462M99K41L12L25M96Q14O93
$$ 290600 292592 294228 295953 297819 299750 302018 304740 307243 308705 309204 309445 309757 310082 310578 311392 312085
53570C12085P0k51k6j22j049j996k130j788j523j091l50p0p11j337r09R3M81J64
$$ 312085 312155 311904 311878 311756 310707 308711 306581 304793 303270 302179 301829 301759 301048 299711 298802 298895 299376 299540
53552B99540n1J00K17J76J77K21K92O71J384J841J740J669K112K537K335J944
$$ 299540 299489 299589 299806 299982 300159 300380 300672 301343 302727 304568 306308 307977 310089 312626 314961 316905
53536C16905K029K226J811J080R11J398J987K586L450M238M372M147M458N422
$$ 316905 318934 321160 322971 324051 324962 326360 328347 330933 334383 338621 342993 347140 351598 357020
53522C57020O258O544O705P159P743Q164Q386Q484Q530Q752R439J0659J2236J3825
$$ 357020 363278 369822 376527 383686 391429 399593 407979 416463 424993 433745 443184 453843 466079 479904
53508D79904J4886J5028J4583J4440J4971J5672J6093J6560J7535J8910K0352
$$ 479904 494790 509818 524401 538841 553812 569484 585577 602137 619672 638582 658934
53497F58934K1775K2994K3542K3372K3208K3602K4185K4362K4173K4002K3918
$$ 658934 680709 703703 727245 750617 773825 797427 821612 845974 870147 894149 918067
53486I18067K3780K3479K2741K1403K0129J9954K0771K1263K0853K0539K1106
$$ 918067 941847 965326 988067 1009470 1029599 1049553 1070324 1091587 1112440 1132979 1154085
53475A154085K1761K1482K0597J9976J9629J9216J8922J8704J7722J5778J4270
$$ 1154085 1175846 1197328 1217925 1237901 1257530 1276746 1295668 1314372 1332094 1347872 1362142
53464A362142J4288J4718J3781J1610R562P827N588L092J514Q91J8j642l603n803
$$ 1362142 1376430 1391148 1404929 1416539 1426101 1433928 1439516 1442608 1444122 1445013 1445031 1443389 1439786 1433983
53450A433983q677j1694j3607j4397j5366j7017j8421j9076j9692k0693k1417
$$ 1433983 1425306 1413612 1400005 1385608 1370242 1353225 1334804 1315728 1296036 1275343 1253926
53439A253926k1565k1952k3032k3931k3814k3146k2744k2524k2020k1279k0438
$$ 1253926 1232361 1210409 1187377 1163446 1139632 1116486 1093742 1071218 1049198 1027919 1007481
53428A007481j9197j7562j6305j5751j4879j2538r208o448m971m123l181k203
$$ 1007481 988284 970722 954417 938666 923787 911249 902041 895593 890622 886499 883318 881115
53416H81115j507j012m31L84J455K799M312N792P227Q877J0868J2804J4143J4979
$$ 881115 879608 878596 878165 878549 880004 882803 887115 892907 900134 909011 919879 932683 946826 961805
53402I61805J6141J8156K0411K1857K2426K3183K4848K6910K8476K9479L0507
$$ 961805 977946 996102 1016513 1038370 1060796 1083979 1108827 1135737 1164213 1193692 1224199
53391A224199L1932L3752L5903L8277M0593M2707M4692M6373M7296M7616M8372
$$ 1224199 1256131 1289883 1325786 1364063 1404656 1447363 1492055 1538428 1585724 1633340 1681712
53380A681712N0239N2544N4146N4801N4915N4551N3625N2609N2004N1389N0098
$$ 1681712 1731951 1784495 1838641 1893442 1948357 2002908 2056533 2109142 2161146 2212535 2262633
53369B262633M8499M7434M6496M4277M0432L6208L2465K8490K3469J8009J3214
$$ 2262633 2311132 2358566 2405062 2449339 2489771 2525979 2558444 2586934 2610403 2628412 2641626
53358B641626Q973M349p74n484r419j3498j8645k4366k9281l2841l5800l8844
$$ 2641626 2650599 2654948 2654174 2648690 2639271 2625773 2607128 2582762 2553481 2520640 2484840 2445996
53346B445996m1541m3250m4544m6717m9880n2634n3900n4123n4198n4035n3113
$$ 2445996 2404455 2361205 2316661 2269944 2220064 2167430 2113530 2059407 2005209 1951174 1898061
53335A898061n1711n0532m9469m7725m5124m2493m0660l9698l9120l8338l6913
$$ 1898061 1846350 1795818 1746349 1698624 1653500 1611007 1570347 1530649 1491529 1453191 1416278
53324A416278l4901l2921l1459l0138k8118k5103k1659j8664j6680j5678j5004
$$ 1416278 1381377 1348456 1316997 1286859 1258741 1233638 1211979 1193315 1176635 1160957 1145953
53313A145953j3877j2168j0499r395q799q632r099r968j0227r211p526o186n264
$$ 1145953 1132076 1119908 1109409 1100014 1091215 1082583 1073484 1063516 1053289 1044078 1036552 1030366 1025102
53300A025102m197k903j717n80Q41K384L616M627N822P089P959Q458R108J0099
$$ 1025102 1020905 1018002 1016285 1015705 1016546 1018930 1022546 1027173 1032995 1040084 1048043 1056501 1065609 1075708
53286A075708J1210J2526J4490J7109J9669K1387K2117K2412K3086K4510K6172
$$ 1075708 1086918 1099444 1113934 1131043 1150712 1172099 1194216 1216628 1239714 1264224 1290396
53275A290396K7195K7362K7169K6771K5674K3756K1733K0088J8442J6512J4752
$$ 1290396 1317591 1344953 1372122 1398893 1424567 1448323 1470056 1490144 1508586 1525098 1539850
53264A539850J3221J0929P324L566J067m13k022l979n811p786j0480j3292j5028
$$ 1539850 1553071 1564000 1571324 1574890 1575957 1575544 1573522 1569543 1563732 1555946 1545466 1532174 1517146
53251A517146j5788j6853j8713k0651k2248k3870k5571k6771k7407k8161k9293
$$ 1517146 1501358 1484505 1465792 1445141 1422893 1399023 1373452 1346681 1319274 1291113 1261820
53240A261820l0146l0184k9598k8776k7900k7178k6733k6283k5536k4719k4111
$$ 1261820 1231674 1201490 1171892 1143116 1115216 1088038 1061305 1035022 1009486 984767 960656
53229I60656k3365k2113k0786j9909j9060j7658j6256j5764j5837j5397j4386
$$ 960656 937291 915178 894392 874483 855423 837765 821509 805745 789908 774511 760125
53218G60125j3528j2724j1326r770r154r214q578p170o449o900p198o572o143
$$ 760125 746597 733873 722547 712777 703623 694409 685831 678661 672212 665312 658114 651542 645399
53205F45399o996q487r538j0297j1345j2245j2116j0961r534q379p722p781q465
$$ 645399 638403 629916 620378 610081 598736 586491 574375 563414 553880 545501 537779 529998 521533
53192E21533r183r416r211q895q687q696q834q712q266q197r097j0348j0866j0673
$$ 521533 512350 502934 493723 484828 476141 467445 458611 449899 441633 433436 424339 413991 403125 392452
53178C92452j0602j0670j0078q818p839p465p061o418o075n968n266l935l056
$$ 392452 381850 371180 361102 352284 344445 336980 329919 323501 317426 311458 306192 302257 299201
53165B99201l082l211k993l117l946m695m818m838n069m818l782k930l023l382
$$ 299201 296119 292908 289915 286798 282852 278157 273339 268501 263432 258614 254832 251902 248879 245497
53151B45497l115k528k343k436k321k104j997j668r27l29l95q50j268j631j738
$$ 245497 242382 239854 237511 235075 232754 230650 228653 226985 226058 225729 225334 224484 223216 221585 219847
53136B19847j044K58R72M91l03m55k41k44j91L32R16J029R96J331J829K065K144
$$ 219847 218803 219061 220033 220524 220221 219766 219525 219281 219090 219422 220338 221367 222363 223694 225523 227588 229732
53119B29732K146J735J030R57J866K747K670K189K197K355J756M68o77j359j837
$$ 229732 231878 233613 234643 235600 237466 240213 242883 245072 247269 249624 251380 251848 251171 249812 247975
53104B47975k221k559l104l782l953l446l081l439m005m216m488n177n540m906
$$ 247975 245754 243195 240091 236309 232356 228910 225829 222390 218385 214169 209681 204504 198964 194058
53090A94058l998l853m120l790k952k475k420k165j797k026k839l425l426l190
$$ 194058 190060 186207 182087 178297 175345 172870 170450 168285 166488 164462 161623 158198 154772 151582
53076A51582k939k534k036j648j201m81J59J88k99q08j131j247j006n33m35r20
$$ 151582 148643 146109 144073 142425 141224 140743 140902 141090 140791 139983 138852 137605 136599 136066 135631 134711
53060A34711j284j022p12q77q51J23J325J409L95n18q32j164j912k725l260l408
$$ 134711 133427 132405 131693 130816 129965 130088 131413 132822 133217 132699 131867 130703 128791 126066 122806 119398
53044A19398k816j267M64J133M79o05j348j725j920j941j825j546q54J69P53L24
$$ 119398 116582 115315 115779 116912 117391 116786 115438 113713 111793 109852 108027 106481 105627 105796 106549 106873
53028A06873n62r63q63q48q90n43l6o1n24o69l43j26j72q7N2l35j091j197k83
$$ 106873 106311 105348 104485 103637 102747 102204 102168 102107 101583 100914 100571 100445 100273 100186 100238 99903 98812 97615 97332
53009I7332P17R03O26P55J378J759J274j3j459k302k173j328l38L76O27M20R3
$$ 97332 98049 98952 99578 100333 101711 103470 104744 104731 103272 100970 98797 97469 97131 97507 98134 98554 98647
52992I8647J75P25J125R74P80J210K039K484K320J962J652J263P98N02M56N81
$$ 98647 98822 99547 100672 101646 102426 103636 105675 108159 110479 112441 114093 115356 116154 116656 117112 117693
52976A17693R47J613K331K856L325L954M574M888M864M534L819K987K696L083
$$ 117693 118640 120253 122584 125440 128765 132719 137293 142181 147045 151579 155398 158385 161081 164164
52962A64164L328K738J756J139P96K26m30p40q93j283j618j473j303j768k402
$$ 164164 167492 170230 171986 173125 173921 174147 173717 172977 172084 170801 169183 167710 166407 164639 162237
52947A62237k199j400j346k452l597l757l181k553k006j462j205j452j890k035
$$ 162237 160038 158638 157292 154840 151243 147486 144305 141752 139746 138284 137079 135627 133737 131702
52933A31702j772j252o36p3K75L74L51L69N51Q78J067Q26L66J87K32o5o62o55
$$ 131702 129930 128678 128042 127969 128244 128618 128969 129338 129889 130767 131834 132660 133026 133213 133445 133380 132718 132063
52915A32063L22J276J206N18J56P4l45q99q42k53L3l09q23j128j103n05O08J327
$$ 132063 132385 133661 134867 135385 135541 135615 135270 134371 133529 133276 133309 133000 132177 131049 129946 129441 130049 131376
52897A31376Q48j73l19O51J591J653J122N17k8l60k06K52N14N53Q34J434J917
$$ 131376 132224 132051 131732 132383 133974 135627 136749 137266 137238 136878 136672 136924 137438 137991 138825 140259 142176
52880A42176K020J791J157J20p34p57k03J61K83P13J429J773J605J533J821J946
$$ 142176 144196 145987 147144 147264 146530 145773 145570 145731 146014 146727 148156 149929 151534 153067 154888 156834
52864A56834J464N78k79p73o13J38P55O10J40L69J490K752L539L803L610L180
$$ 156834 158298 158876 158597 157824 157211 157349 158104 158714 158854 159223 160713 163465 167004 170807 174417 177597
52848A77597L124L754M351M093L463L556M233M304L486K782K644K209P66j131
$$ 177597 180721 184475 188826 192919 196382 199938 204171 208475 211961 214743 217387 219596 220362 219231
52834B19231k576l348l623l476l129k981l046k999k945l306l908m015l429k730
$$ 219231 216655 213307 209684 206208 203079 200098 197052 194053 191108 187802 183894 179879 176450 173720
52820A73720k302j976j745j863k125j961j461j366j772j924j499j119j241j480
$$ 173720 171418 169442 167697 165834 163709 161748 160287 158921 157149 155225 153726 152607 151366 149886
52806A49886j493j573j918k071j596p08P5L92M3q10j362q96J11M45k38j092j448
$$ 149886 148393 146820 144902 142831 141235 140527 140602 140994 141037 140227 138865 137969 138080 138525 138287 137195 135747
52789A35747j522j608j580j405j310j197p42j54k5l42o34j025j996l031k880j449
$$ 135747 134225 132617 131037 129632 128322 127125 126383 126229 126204 125862 125228 124203 122207 119176 116296 114847
52773A14847r8K59J27Q7j31o48p57k7Q74J184R68M75m12j514k070j803j401j449
$$ 114847 114749 115008 115135 115222 115091 114443 113686 113659 114533 115717 116685 117160 116748 115234 113164 111361 109960 108511
52755A08511j700j868k133k391k017r93j71Q6M60J183J190k72k178k905k106o35
$$ 108511 106811 104943 102810 100419 98402 97409 97238 97324 97784 98967 100157 99885 97707 94802 92696 92061
52739I2061O76J327J015Q6m76k19K37K54%k79q18j452j312k01O76L65m11n03j18
$$ 92061 92737 94064 95079 95165 94689 94470 94707 94961 94961 94682 93864 92412 91100 90899 91575 91940 91529 91026 90908
52720I0908j37m23j68N67R19N97R5k74n97p50m30K70R86J547J863J700J177J007
$$ 90908 90771 90348 90180 90747 91666 92263 92358 92084 91487 90737 90307 90577 91563 93110 94973 96673 97850 98857
52702I8857J602K359K512K252K223K392K249J878J898K461K984K938K321J459
$$ 98857 100459 102818 105330 107582 109805 112197 114446 116324 118222 120683 123667 126605 128926 130385
52688A30385O41p2r09j992k825k709j816j182j341j721j783j905k491l041k908
$$ 130385 131026 130954 130045 128053 125228 122519 120703 119521 118180 116459 114676 112771 110280 107239 104331
52673A04331k375k145k237k194j954j848j987k234k469k499k102j530j338j403
$$ 104331 101956 99811 97574 95380 93426 91578 89591 87357 84888 82389 80287 78757 77419 76016
52659G6016q78L29R92K36j053j414p18P5M76O38M92j44q00p51r5L72L21R9o6l56
$$ 76016 75138 75467 76459 76695 75642 74228 73510 73585 74061 74699 75191 75047 74247 73496 73401 73773 74094 74193 74127 73771
52639G3771p93j056r40n40o7K43K17j7r9j8j32l89j50O93J150L58j068j703j036
$$ 73771 72978 71922 70982 70442 70375 70618 70835 70818 70719 70701 70569 70180 70030 70723 71873 72231 71163 69460 68424
52620F8424J55R30J056Q54O81N84L33j14k62K97J032J009L66K60J029J494O79
$$ 68424 68579 69509 70565 71419 72100 72684 73017 72903 72641 72938 73970 74979 75345 75605 76634 78128 78807
52603G8807o95j237o15M76J401J896J886J658J698J876J463L43n80o29k21M7J65
$$ 78807 78112 76875 76260 76736 78137 80033 81919 83577 85275 87151 88614 88957 88377 87748 87527 87574 87739
52586H7739O0o52j586j483q0J122R92M51P39J341J083L19K39P46P81K49MK05L20
$$ 87739 87799 87147 85561 84078 83998 85120 86112 86563 87302 88643 89726 90045 90284 91030 91811 92060 92064 92269 92589
52567I2589M47J142K086K359J972J770J859J479M54m14n65k16L06Q15R55N57J71
$$ 92589 93036 94178 96264 98623 100595 102365 104224 105703 106157 105743 105178 104962 105268 106083 107038 107595 107766
52550A07766L73P49N22j44m21j27K75O79J262J684J473J001J013J429J590J344
$$ 107766 108139 108888 109410 109266 108845 108718 108993 109672 110934 112618 114091 115092 116105 117534 119124 120468
52534A20468R01J66p31q22L75J528J085l01o38M33J417J560J583J755J201k16
$$ 120468 121369 121535 120804 119982 120357 121885 122970 122669 122031 122464 123881 125441 127024 128779 129980 129764
52518A29764j172q01J11N73O72P05L43n42j255j275j016j019j141j068p59k07
$$ 129764 128592 127791 127902 128475 129147 129852 130195 129653 128398 127123 126107 125088 123947 122879 122120 121913
52502A21913N20P94L4j087j234m57j86q80j202k11J047J229O77O07J202J727J882
$$ 121913 122433 123227 123261 122174 120940 120483 120297 119417 118215 118004 119051 120280 120957 121564 122766 124493 126375
52485A26375J929J931J776J658J741J704J245P06N74P33P85P64R59J272J319J001
$$ 126375 128304 130235 132011 133669 135410 137114 138359 139065 139639 140372 141157 141921 142880 144152 145471 146472
52469A46472N53J44j88l41k34K3K01K19K44O01J363K022J857Q94O2QK58J52K0
$$ 146472 147025 147169 146981 146640 146406 146429 146630 146849 147093 147694 149057 151079 152936 153830 153892 153900 154158 154310 154330
52450A54330N26J352J622J321J165J229R64M79M82Q78P52j8m23M9P09J003J277
$$ 154330 154856 156208 157830 159151 160316 161545 162509 162988 163470 164348 165100 165082 164659 164708 165417 166420 167697
52433A67697J637J356R0j302j984k174k259j935r86q5J50N7J62K24j09m54m43
$$ 167697 169334 170690 170780 169478 167494 165320 163061 161126 160140 160055 160205 160262 160424 160648 160539 160085 159642
52416A59642n38j116j485q87J0l9q46r59J66J361J402N23k74o05q52j247j508
$$ 159642 159104 157988 156503 155616 155626 155587 154741 153782 153948 155309 156711 157234 156960 156355 155503 154256 152748
52399A52748j315q13m27l67m80n81o40n34M4J110K056K235J746J215R40P71P23
$$ 152748 151433 150620 150193 149826 149346 148765 148125 147591 147635 148745 150801 153036 154782 155997 156937 157708 158431
52382A58431J051J631J878J483P48O8m46o60l65K94P33N98J79l7M9J73J77K54
$$ 158431 159482 161113 162991 164474 165222 165290 164844 164184 163819 164113 164846 165444 165623 165586 165635 165808 165985 166239
52364A66239Q05J908K913K940K014J190J149J290Q59K62M07J174J680J705J735
$$ 166239 167044 168952 171865 174805 176819 178009 179158 180448 181307 181569 181976 183150 184830 186535 188270
52349A88270J850J681J396J473J617J134L61L82J164J480R58P03J368K047J856
$$ 188270 190120 191801 193197 194670 196287 197421 197782 198164 199328 200808 201766 202469 203837 205884 207740
52334B07740J323J293J527J361Q74M98J98j25o7N44J038Q57O17J251K543L317
$$ 207740 209063 210356 211883 213244 214118 214616 214814 214689 214622 215166 216204 217061 217678 218929 221472 224789
52318B24789K949J962J249J228J709K256K684L227M077M848N027M828M936N453
$$ 224789 227738 229700 230949 232177 233886 236142 238826 242053 246130 250978 256005 260833 265769 271222
52304B71222N845O018O518P557Q648R450J0068J0343R888R114R186J0445J1848
$$ 271222 277067 283085 289603 297160 305808 315258 325326 335669 345557 354671 363857 374302 386150
52291C86150J2483J2628J2848J3046J3096J3459J4397J5275J5426J5027J4635
$$ 386150 398633 411261 424109 437155 450251 463710 478107 493382 508808 523835 538470
52280E38470J4400J4293J4337J4223J3469J2332J1655J1422J0570Q755P110O532
$$ 538470 552870 567163 581500 595723 609192 621524 633179 644601 655171 663926 671036 677568
52268F77568O337N577M467L533K428P62p93j517j954k968m231m844m876m999n160
$$ 677568 683905 689482 693949 697482 699910 700672 699879 698362 696408 693440 689209 684365 679489 674490 669330
52253F69330m946m688m952n266m744l623k865k461j417N53K544L785M384M708
$$ 669330 664384 659696 654744 649478 644734 641111 638246 635785 634368 634921 637465 641250 645634 650342
52239F50342M999N653O992Q568R591J0029J0565J1363J1777J1405J0676J0165
$$ 650342 655341 660994 667986 676554 686145 696174 706739 718102 729879 741284 751960 762125
52227G62125R962R912R840R358Q038O066M340L577L509L153J814k57k183l474
$$ 762125 772087 781999 791839 801197 809235 815301 819641 823218 826727 829880 831694 831437 829254 825780
52213H25780m539n947p476q520r224j0319j1798j2767j2914j3007j3453j3511
$$ 825780 821241 815294 807818 799298 790074 779755 767957 755190 742276 729269 715816 702305
52201G02305j2652j1690j1533j1727j1353j0504r804r122q037p021o795o937o450
$$ 702305 689653 677963 666430 654703 643350 632846 623042 613920 605883 598862 592067 585130 578680
52188E78680n473n065n323n124l903k587k314l074l947m096l315k133j451j644
$$ 578680 573207 568142 562819 557695 553792 551205 548891 545817 541870 537774 534459 532326 530875 529231
52174E29231k075j970j543j554j988k019j307n70o16j363k081k248k017j897k046
$$ 529231 527156 525186 523643 522089 520101 518082 516775 516205 515589 514226 512145 509897 507880 505983 503937
52159E03937j991j366p18q88j641j870j412j396k280k849k121j080j194k199k743
$$ 503937 501946 500580 499862 498974 497333 495463 494051 492655 490375 487526 485405 484325 483131 480932 478189
52144D78189k575k514k797k907k790k834k865k451j949j968k137j729j204j562
$$ 478189 475614 473100 470303 467396 464606 461772 458907 456456 454507 452539 450402 448673 447469 445907
52130D45907k391k290j209n46p97r13m50m65j468k217j616m68p1k39M4P84J105
$$ 445907 443516 441226 440017 439471 438674 437761 437311 436846 435378 433161 431545 431077 431006 430767 430811 431595 432700
52113D32700P38K49M8P9L89J225K550M019N383O544P350P756Q060Q693R807J1142
$$ 432700 433438 433687 433735 433814 434203 435428 437978 441997 447380 453924 461274 469030 477090 485783 495590 506732
52097E06732J2341J3210J3865J4621J5636J6698J7517J8057J8437J8673J8850
$$ 506732 519073 532283 546148 560769 576405 593103 610620 628677 647114 665787 684637
52086F84637J9211J9657J9500J8306J6718J5765J5454J4793J3197J1150R409Q185
$$ 684637 703848 723505 743005 761311 778029 793794 809248 824041 837238 848388 857797 865982
52074H65982P264O354N188L693K158Q74l27j775l382m835o190p709r234j0326
$$ 865982 873246 879600 884788 888481 890639 891513 891186 889411 886029 881194 875004 867295 858061 847735
52060H47735j0904j1152j1094j0798j0743j1203j1479j0649q935p392o452n645
$$ 847735 836831 825679 814585 803787 793044 781841 770362 759713 750778 743386 736934 731289
52048G31289m727l947l187j873n0J419K082K444K995L580M015M606N560O604P439
$$ 731289 726562 722615 719428 717555 717505 718924 721006 723450 726445 730025 734040 738646 744206 750810 758249
52033G58249Q005Q136P635O960O986P757Q231P678O572N671M949L960K729J603
$$ 758249 766254 774390 782025 788985 795971 803728 811959 819637 826209 831880 836829 840789 843518 845121
52019H45121O22m91j901l495m985n988o429o820p772r156j0280j0914j1523j2459
$$ 845121 845743 845252 843351 839856 834871 828883 822454 815634 807862 798706 788426 777512 765989 753530
$$ [...]
##END NTUPLES=NMR SPECTRUM
##END=
