
##TITLE=AC1353_CTIAH12172_6945509_mS8UyP9kWO
##JCAMPDX= 6.0         $$ Bruker NMR JCAMP-DX V2.0
##DATA TYPE= NMR SPECTRUM
##DATA CLASS= NTUPLES
##ORIGIN= BRUKER
##OWNER= Administrator
$$ 1.72 TOPSPIN		Version 2.1
$$ 2012-10-18 13:46:29.100 -0700  Administrator@X
$$ Compression mode = diff/dup
##.OBSERVE FREQUENCY= 400.02188249412
##.OBSERVE NUCLEUS= ^1H
##.ACQUISITION MODE= SIMULTANEOUS (DQD)
##.ACQUISITION SCHEME= undefined
##.AVERAGES= 64
##.DIGITISER RES= 22
##SPECTROMETER/DATA SYSTEM= spect
##.PULSE SEQUENCE= noesygpps1d.comp
##.SOLVENT NAME= COFFEE_meoh
##.SHIFT REFERENCE= INTERNAL, COFFEE_meoh, 1, 14.96083
##AUDIT TRAIL= $$ (NUMBER, WHEN, WHO, WHERE, PROCESS, VERSION, WHAT)
$$ ##TITLE= Audit trail, TOPSPIN		Version 2.1
$$ ##JCAMPDX= 5.01
$$ ##ORIGIN= Bruker BioSpin GmbH
$$ ##OWNER= Administrator
$$ $$ C:\Bruker\TOPSPIN/data/COFFEE/nmr/AC1353_CTIAH12172_6945509_mS8UyP9kWO/12/pdata/1/auditp.txt
$$ ##AUDIT TRAIL=  $$ (NUMBER, WHEN, WHO, WHERE, PROCESS, VERSION, WHAT)
(   1,<2012-10-13 21:15:56.312 -0500>,<Administrator>,<TOPSPIN>,<go>,<TOPSPIN 2.1>,
      <created by zg
	started at 2012-10-13 21:04:25.984 -0500,
	POWCHK enabled, PULCHK disabled,
       configuration hash MD5:
       6B 1B 68 BB D9 2E 58 E2 7F 35 AD 54 07 DF 0E 41
       data hash MD5: 64K
       62 05 DA 07 77 5D A3 8A 2B EC B5 97 B7 2A DC 79>)
(   2,<2012-10-13 21:15:59.109 -0500>,<Administrator>,<TOPSPIN>,<proc1d>,<TOPSPIN 2.1>,
      <Start of raw data processing
       efp LB = 0.3 FT_mod = 6 PKNL = 1 PHC0 = 0 PHC1 = 0 SI = 128K 
       data hash MD5: 128K
       EA 8E 29 87 B1 02 86 A5 A9 42 F8 35 31 71 F8 5E>)
(   3,<2012-10-13 21:16:00.265 -0500>,<Administrator>,<TOPSPIN>,<proc1d>,<TOPSPIN 2.1>,
      <pk PHC0 = 4.031982 PHC1 = 0 
       data hash MD5: 128K
       9A 9B 6A F1 25 27 06 A0 A4 04 B2 6C 7A D0 C5 DC>)
(   4,<2012-10-13 21:16:00.687 -0500>,<Administrator>,<TOPSPIN>,<proc1d>,<TOPSPIN 2.1>,
      <abs ABSG = 1 
       data hash MD5: 128K
       40 79 AD 0D 8C 49 28 B3 09 9B A1 B4 1D D2 73 0D>)
(   5,<2012-10-13 21:16:00.796 -0500>,<Administrator>,<TOPSPIN>,<proc1d>,<TOPSPIN 2.1>,
      <abs ABSG = 2 
       data hash MD5: 128K
       C5 87 C2 EA CC 54 1D 27 11 CE CF 9F 47 04 4D CB>)
(   6,<2012-10-13 21:16:00.859 -0500>,<Administrator>,<TOPSPIN>,<proc1d>,<TOPSPIN 2.1>,
      <abs ABSG = 3 
       data hash MD5: 128K
       ED 3E 72 A0 8E 39 72 E1 69 DE B5 95 3B 84 F7 8E>)
(   7,<2012-10-13 21:16:00.906 -0500>,<Administrator>,<TOPSPIN>,<proc1d>,<TOPSPIN 2.1>,
      <abs ABSG = 4 
       data hash MD5: 128K
       58 AF 47 64 C6 27 69 7B 41 62 D8 BC 79 D2 59 AE>)
(   8,<2012-10-13 21:16:00.953 -0500>,<Administrator>,<TOPSPIN>,<proc1d>,<TOPSPIN 2.1>,
      <abs ABSG = 5 
       data hash MD5: 128K
       2B 40 F9 D9 C3 7E 86 A1 0C 3C 01 E4 BD D3 A4 B0>)
(   9,<2012-10-13 21:16:01.187 -0500>,<Administrator>,<TOPSPIN>,<audit>,<TOPSPIN 2.1>,
      <user comment:
       ICON-NMR User ID: COFFEE
       data hash MD5: 128K
$$ [...]
##$TP07= 0
##$TPNAME0= <>
##$TPNAME1= <>
##$TPNAME2= <>
##$TPNAME3= <>
##$TPNAME4= <>
##$TPNAME5= <>
##$TPNAME6= <>
##$TPNAME7= <>
##$TPOAL= (0..7)
0.5 0.5 0.5 0.5 0.5 0.5 0.5 0.5
##$TPOFFS= (0..7)
0 0 0 0 0 0 0 0
##$TUNHIN= 0
##$TUNHOUT= 0
##$TUNXOUT= 0
##$USERA1= <user>
##$USERA2= <user>
##$USERA3= <user>
##$USERA4= <user>
##$USERA5= <user>
##$V9= 5
##$VALIST= <valist>
##$VCLIST= <CCCCCCCCCCCCCCC>
##$VD= 0
##$VDLIST= <DDDDDDDDDDDDDDD>
##$VPLIST= <PPPPPPPPPPPPPPP>
##$VTLIST= <TTTTTTTTTTTTTTT>
##$WBST= 2048
##$WBSW= 25
##$XGAIN= (0..3)
0 0 0 0
##$XL= 0
##$YL= 0
##$YMAX_a= 12015406
##$YMIN_a= -8592602
##$ZGOPTNS= <>
##$ZL1= 120
##$ZL2= 120
##$ZL3= 120
##$ZL4= 120
##$ABSF1= 14.96083
##$ABSF2= -5.597352
##$ABSG= 5
##$ABSL= 3
##$ALPHA= 0
##$AQORDER= 0
##$ASSFAC= 0
##$ASSFACI= 0
##$ASSFACX= 0
##$ASSWID= 0
##$AUNMP= <proc_prof1d_extract.lims>
##$AXLEFT= 0
##$AXNAME= <>
##$AXNUC= <1H>
##$AXRIGHT= 0
##$AXTYPE= 0
##$AXUNIT= <>
##$AZFE= 0.1
##$AZFW= 0.1
##$BCFW= 0
##$BC_mod= 0
##$BYTORDP= 0
##$COROFFS= 0
##$CY= 15
##$DATMOD= 1
##$DC= 0
##$DFILT= <>
##$DTYPP= 0
##$F1P= 0
##$F2P= 0
##$FCOR= 0.5
##$FTSIZE= 131072
##$FT_mod= 6
##$GAMMA= 0
##$GB= 0
##$INTBC= 1
##$INTSCL= 1
##$ISEN= 128
##$LB= 0.3
##$LEV0= 0
##$LPBIN= 0
##$MAXI= 10000
##$MC2= 0
##$MEAN= 0
##$ME_mod= 0
##$MI= 0
##$NCOEF= 0
##$NC_proc= -2
##$NLEV= 6
##$NOISF1= 0
##$NOISF2= 0
##$NSP= 0
##$NTH_PI= 0
##$NZP= 0
##$OFFSET= 14.96083
##$PC= 1
##$PHC0= 4.031982
##$PHC1= 0
##$PH_mod= 1
##$PKNL= yes
##$PPARMOD= 0
##$PPDIAG= 0
##$PPIPTYP= 0
##$PPMPNUM= 2147483647
##$PPRESOL= 1
##$PSCAL= 4
##$PSIGN= 0
##$PYNMP= <proc.py>
##$REVERSE= no
##$SF= 400.020009703887
##$SI= 131072
##$SIGF1= 0
##$SIGF2= 0
##$SINO= 400
##$SIOLD= 131072
##$SPECTYP= <>
##$SREGLST= <1H.CDCl3>
##$SSB= 0
##$STSI= 131072
##$STSR= 0
##$SW_p= 8223.68421052631
##$SYMM= 0
##$S_DEV= 0
##$TDeff= 65536
##$TDoff= 0
##$TI= <>
##$TILT= no
##$TM1= 0
##$TM2= 0
##$TOPLEV= 0
##$USERP1= <user>
##$USERP2= <user>
##$USERP3= <user>
##$USERP4= <user>
##$USERP5= <user>
##$WDW= 1
##$XDIM= 131072
##$YMAX_p= 331435577
##$YMIN_p= -12627
##$CURPLOT= <Network HP LaserJet P1505>
##$CURPRIN= <$Network HP LaserJet P1505>
##$DFORMAT= <normdp>
##$LAYOUT= <+/1D_H.xwp>
##$LFORMAT= <normlp>
##$PFORMAT= <normpl>
##$SURQMSG= 1
$$ End of Bruker specific parameters
$$ ---------------------------------
##NTUPLES= NMR SPECTRUM
##VAR_NAME=  FREQUENCY,     SPECTRUM/REAL,   SPECTRUM/IMAG
##SYMBOL=    X,             R,               I
##VAR_TYPE=  INDEPENDENT,   DEPENDENT,       DEPENDENT
##VAR_FORM=  AFFN,          ASDF,            ASDF
##VAR_DIM=   131072,        131072,          131072
##UNITS=     HZ,            ARBITRARY UNITS, ARBITRARY UNITS
##FACTOR=    0.0627417313425164, 1,          1
##FIRST=     8223.62146879497, -2825,        -56316
##LAST=      0,             -1600,           -57441
##MIN=       0,             -12627,          0
##MAX=       8223.62146879497, 331435577,    0
$$ Real data points
##PAGE= N=1
##DATA TABLE= (X++(R..R)), XYDATA
$$ [...]
64054C09876J384J811K360K683K789L033L698M716N752O437O657O750P214Q034
64040C73194Q498Q035P053O503O669O788N978M178K166Q26M37M58J16o33r96m58
64024D28812L33M45M9N8N75O42k75j598k628l387l982m042l343k345j511p54p4
64007D06975K1o13j075n55M01O01j01p36o23K5P52J355J661J609J605K203L271
63990D16776M023M049L843M139N070O183P033P610Q208Q926R437R472R477J0223
63976E14469J1693J2928J3344J3474J3966J4580J4961J5763J7877K0747K2653
63965F86455K2772K2172K2467K4246K6991K9926L2576L4975L7624M1054M5316
63954A026574N0162N5668O2227O9967P8603Q7939R8020J08649J19172J28937J37692
$$ y = [309876, 311260, 313071, 315431, 318114, 320903, 323936, 327634, 332350, 338102, 344539, 351196, 357946, 365160, 373194, 381692, 389727, 396780, 403283, 409952, 416740, 422718, 426896, 429062, 429888, 430325, 430783, 430899, 430266, 429270, 428812, 429145, 429590, 429639, 429697, 430272, 430914, 430639, 429041, 426413, 423026, 419044, 415002, 411659, 409314, 407803, 407049, 406975, 406996, 406383, 405308, 404753, 405154, 405755, 405654, 404918, 404295, 404320, 405072, 406427, 408088, 409697, 411302, 413505, 416776, 420799, 424848, 428691, 432830, 437900, 444083, 451116, 458726, 466934, 475860, 485297, 494769, 504246, 514469, 526162, 539090, 552434, 565908, 579874, 594454, 609415, 625178, 643055, 663802, 686455, 709227, 731399, 753866, 778112, 805103, 835029, 867605, 902580, 940204, 981258, 1026574, 1076736, 1132404, 1194631, 1264598, 1343201, 1431140, 1529160, 1637809, 1756981, 1885918, 2023610]
63943B023610J45463J52276J58034J62346J64504J63860J60236J53618J43663
63934C427610J29923J12613R2677P1021M8012K3818j090k5922m9861p2347r3212
63923C663242j12394j29336j42926j52390j58026j60676j60766j58393j54064
63914B334271j48487j41640j32858j22144j10759j00128r0614q1721p3161o5241
63904A267518n8271n2004m5904l9920l4764l1121k8645k6238k3469k1128j9969
63893H86085j9533j8957j8380j8531j9175j9141j8012j6653j5755j4785j3042
63882F94121j0937r463q786q107o748m828k900j304R5J654L448N049O015O495
63868F63804P006P617P832P454P054P259P875Q024P110N426L893L145K746J512
$$ y = [2023610, 2169073, 2321349, 2479383, 2641729, 2806233, 2970093, 3130329, 3283947, 3427610, 3557533, 3670146, 3762823, 3833844, 3881856, 3905674, 3904584, 3878662, 3828801, 3756454, 3663242, 3550848, 3421512, 3278586, 3126196, 2968170, 2807494, 2646728, 2488335, 2334271, 2185784, 2044144, 1911286, 1789142, 1678383, 1578255, 1487641, 1405920, 1332759, 1267518, 1209247, 1157243, 1111339, 1071419, 1036655, 1005534, 976889, 950651, 927182, 906054, 886085, 866552, 847595, 829215, 810684, 791509, 772368, 754356, 737703, 721948, 707163, 694121, 683184, 673721, 664935, 656828, 650080, 645252, 642352, 641048, 641143, 642797, 646245, 651294, 657309, 663804, 670810, 678427, 686259, 693713, 700767, 708026, 715901, 723925, 731035, 736461, 740354, 743499, 746245, 747757]
63854G47757j001l606m691m248l945n042p083q920j0240j1413j2482j3161j3564
63841F48361j4220j5360j6658j7613j7868j7303j6247j5439j5350j5618j5475
63830D71210j4698j3747j3085j2736j2463j1991j1074r717q353p478p128o931
63818C41809o642o262n669m732l790l494l823l829k837j463q65j201j587j507
63804B94108j446j881k417k469k250k395k949l381l433l292l002k477k026k117
63790B58573k495k374j718j497k227l069l034k373j963j901j635j110q07p89o57
63775B30924m11m39n69p5J066J778J232n7r73j125r05o24k46J58K68r6o83j081
63757B28142j101q59n60k32K23P47J020Q38M56L70O95J024R02L54j45j09M92J181
$$ y = [747757, 746756, 743150, 738459, 734211, 730266, 725224, 718141, 709221, 698981, 687568, 675086, 661925, 648361, 634141, 618781, 602123, 584510, 566642, 549339, 533092, 517653, 502303, 486685, 471210, 456512, 442765, 429680, 416944, 404481, 392490, 381416, 371699, 363346, 355868, 348740, 341809, 335167, 328905, 323236, 318504, 314714, 311220, 307397, 303568, 300731, 299268, 298403, 297202, 295615, 294108, 292662, 290781, 288364, 285895, 283645, 281250, 278301, 274920, 271487, 268195, 265193, 262716, 260690, 258573, 256078, 253704, 251986, 250489, 248262, 245193, 242159, 239786, 237823, 235922, 234287, 233177, 232370, 231581, 230924, 230513, 230074, 229505, 229430, 230496, 232274, 233506, 233449, 232476, 231351, 230446, 229822, 229576, 229734, 230002, 229906, 229223, 228142, 227041, 226182, 225622, 225390, 225613, 226360, 227380, 228218, 228674, 229044, 229739, 230763, 231665, 232019, 231874, 231765, 232257, 233438]
63739B33438J475J446J535J832J836J211L37j38k7M80J271K189K759K596K005
63724B54245J674J872K349K864L288L331K793K063J737J723J325L43n57q07p55
63709B77488j078j774k149j753r87o59j023j440j183l59L04N87J053J967K642
63694B71636K411J682J334J542J872K171K481K420J602N11lP7P4j17Q1P03R76
63677B91453N40j6q7K42O85J171J464J145L13l34l85j36M0R6m0m46p39m75j12
63658B94379n87j755k367j925j440j726k124j768j067q96j066p39J68J012J516
63643B79615J875K054J825J414J366J811K417K882L114L131L215L765M642N061
63629C18187M628L985L932M432N067N921P248Q685R655J0222J0819J1388J1657
$$ y = [233438, 234913, 236359, 237894, 239726, 241562, 242773, 243110, 242972, 242945, 243425, 244696, 246885, 249644, 252240, 254245, 255919, 257791, 260140, 263004, 266292, 269623, 272416, 274479, 276216, 277939, 279264, 279607, 279050, 278243, 277488, 276410, 274636, 272487, 270734, 269747, 269088, 268065, 266625, 265442, 265083, 265387, 265974, 267027, 268994, 271636, 274047, 275729, 277063, 278605, 280477, 282648, 285129, 287549, 289151, 289662, 289659, 289736, 289810, 289693, 289774, 290477, 291453, 291993, 291977, 291890, 292132, 292817, 293988, 295452, 296597, 296910, 296576, 296191, 296055, 296095, 296191, 296151, 295705, 294966, 294491, 294379, 293792, 292037, 289670, 287745, 286305, 284579, 282455, 280687, 279620, 278724, 277658, 276919, 277087, 278099, 279615, 281490, 283544, 285369, 286783, 288149, 289960, 292377, 295259, 298373, 301504, 304719, 308484, 313126, 318187, 322815, 326800, 330732, 335164, 340231, 346152, 353400, 362085, 371740, 381962, 392781, 404169, 415826]
63616D15826J1924J2731J3871J4677J5187J6154J7770J9229J9781J9568J9072
63605E95790J8317J6901J4488J1118P261L693J005q10k054k789k974k976l438
63592F53532m536n853p077q412j0124j1998j3479j4238j4441j4456j4313j3553
63580E21052j1865r833q611q592q769p815n567l045j277m72k38n6M73J490K786
63565D59661M015M940N445N545N532N893O805P929Q864R618J0396J1289J2401
63552E58333J3979J6076J8320K0364K2257K3998K5015K4489K2121J8152J2945
63541G76049O976J132l508o320p448p521p203o834o379n833n650o418q056r825
63527G03162j1341j3033j5319j7829j9832k0984k1259k0636j9339j8002j7049
$$ y = [415826, 427750, 440481, 454352, 469029, 484216, 500370, 518140, 537369, 557150, 576718, 595790, 614107, 631008, 645496, 656614, 663875, 667568, 668573, 667763, 665709, 662920, 659946, 656970, 653532, 648996, 643143, 636066, 627654, 617530, 605532, 592053, 577815, 563374, 548918, 534605, 521052, 509187, 499354, 490743, 482151, 473382, 465567, 460000, 456955, 455678, 455206, 454968, 454912, 455385, 456875, 459661, 463676, 468616, 474061, 479606, 485138, 491031, 497836, 505765, 514629, 524247, 534643, 545932, 558333, 572312, 588388, 606708, 627072, 649329, 673327, 698342, 722831, 744952, 763104, 776049, 783025, 784157, 780649, 774329, 766881, 759360, 752157, 745323, 738944, 733111, 727461, 721043, 712987, 703162, 691821, 678788, 663469, 645640, 625808, 604824, 583565, 562929, 543590, 525588, 508539]
63516E08539j6245j5241j4170j3252j2269j0962r599q555p682o692n774n270n072
63503C77756m875m660m366l551k132r79r95j787k183j789j267j143j189j005n25
63488C45310R8N57M24l41j062j010k65O09J327J807J812J416J387K205L019K645
63472C59938J277J17m47j003j549j319m02j24j127k246k081q22K82N74L68J52
63456C51588J70M46P66Q61R45J602K929M227M993N594O585P749Q364Q215P917
63441D12951Q334R872J2102J4027J5039J5653J6871J8658J9692J8785J6064J2499
63429E90547Q964O196N019N739P600R408J0642J1585J2627J3917J5566J7565J9481
63416G34856K0668K0941K0661J9905J7926J3921Q354L031m91k300l549m751n438
$$ y = [508539, 492294, 477053, 462883, 449631, 437362, 426400, 416801, 408246, 400564, 393872, 388098, 382828, 377756, 372881, 368221, 363855, 360304, 358172, 357193, 356198, 354411, 352228, 350439, 349172, 348029, 346840, 345835, 345310, 345408, 345965, 346389, 346048, 344986, 343976, 343711, 344320, 345647, 347454, 349266, 350682, 352069, 354274, 357293, 359938, 361215, 361332, 360885, 359882, 358333, 357014, 356612, 356488, 355361, 353115, 351034, 350212, 350494, 351068, 351436, 351588, 351758, 352204, 352970, 353831, 354776, 356378, 359307, 363534, 368527, 374121, 380706, 388455, 396819, 405034, 412951, 421285, 431157, 443259, 457286, 472325, 487978, 504849, 523507, 543199, 561984, 578048, 590547, 599511, 605707, 610726, 616465, 624065, 633473, 644115, 655700, 668327, 682244, 697810, 715375, 734856, 755524, 776465, 797126, 817031, 834957, 848878, 857232, 860263, 859772, 857472, 853923, 849172, 843734]
63403H43734n476n773p142r184j1048j2684j4573j6693j8616k0258k1568k1864
63391F78855k0639j8822j7953j8070j7694j6096j4189j2753j1220q971o668n163
63379E10617m067k519p73K33N09J111K634M547O110P227Q211R300J0536J1747
63365E65423J2608J3002J3324J4173J5734J7696J9624K1214K2254K2606K2140
63354G59798K0648J8032J4681J1320Q258N136J664j683m070n174n322n103n103
63341H13082n756p038q492r911j1677j4091j6667j8607j9782k0583k0963k0316
63329F39199j8454j6130j4322j3313j2706j1967j0705q749o353m322l514m158
63317E14506n791p846j0000j1817j2543j1707r916q436p899p787p357o583n822
$$ y = [843734, 838258, 832485, 825343, 816159, 805111, 792427, 777854, 761161, 742545, 722287, 700719, 678855, 658216, 639394, 621441, 603371, 585677, 569581, 555392, 542639, 531419, 522448, 515780, 510617, 506550, 504031, 503258, 503491, 504000, 505111, 507745, 512292, 518402, 525629, 533840, 543140, 553676, 565423, 578031, 591033, 604357, 618530, 634264, 651960, 671584, 692798, 715052, 737658, 759798, 780446, 798478, 813159, 824479, 832737, 837873, 839537, 837854, 833784, 828610, 823288, 818185, 813082, 807326, 800288, 791796, 781885, 770208, 756117, 739450, 720843, 701061, 680478, 659515, 639199, 620745, 604615, 590293, 576980, 564274, 552307, 541602, 532853, 526500, 522178, 518664, 514506, 508715, 500869, 490869, 479052, 466509, 454802, 444886, 436450, 428551, 420764, 413407, 406824, 401002]
63304D01002n130m428l981m013m035l363k257j728k080k391j875j067j067k005
63290C61582k906k946k329j781j590j419r75n42n99j064j307j042p14p31p88m37
63274C40412J00L35M00P32J061O75k55n54M15J864K622K492K147K119K310K220
63258C59095J497M45M4R55K589L711L999M259N029N849O215O381O674O836O633
63243D20211O546P124Q170R202J0238J1450J2553J3219J3802J4812J5981J6603
63231E59911J6665J6836J7348J7625J7177J6288J5577J5314J5408J5699J6046
63220G39894J6234J6087J5623J5060J4618J4286J3750J2616J0714Q088M862J282
63208H83114k222n374q338j1400j4403j6910j8779k0071k0498j9706j8127j6758
$$ y = [401002, 395872, 391444, 387463, 383450, 379415, 376052, 373795, 372067, 369987, 367596, 365721, 364654, 363587, 361582, 358676, 355730, 353401, 351620, 350030, 348611, 347636, 347094, 346495, 345431, 344124, 343082, 342368, 341637, 340849, 340412, 340512, 340847, 341247, 341979, 343040, 343715, 343460, 342906, 343321, 345185, 347807, 350299, 352446, 354565, 356875, 359095, 360592, 361037, 361081, 362036, 364625, 368336, 372335, 376594, 381623, 387472, 393687, 400068, 406742, 413578, 420211, 426757, 433881, 442051, 451253, 461491, 472941, 485494, 498713, 512515, 527327, 543308, 559911, 576576, 593412, 610760, 628385, 645562, 661850, 677427, 692741, 708149, 723848, 739894, 756128, 772215, 787838, 802898, 817516, 831802, 845552, 858168, 868882, 876970, 881832, 883114, 880892, 875518, 867180, 855780, 841377, 824467, 805688, 785617, 765119, 745413, 727286, 710528]
63196G10528j5885j4789j2987j1019r544q388p118n828m670l200j012J299K727
63183F20114L215L688M727N913O607O851P180P869Q577Q782Q433P983P636O877
63169G14452N253L398K447K453K215R71o92k089l597n859q533j0775j2446j3930
63155F73268j5181j5768j5615j5004j4062j2922j2009j1409j0393q431o403n733
63143E30338o447p073o540n256m145l510l122k771k334j777j296j058p89j03Q02
63128D84919J385J674K282L353M217M368M108L926L801L541L304L266L153K602
63114E29899J802J327J429J826K117K174K144K270K675L135L152K382J054j46
63100E57240o54m57K2M63R05J499K095K284J871J066K55k62k16N82J931L176L700
$$ y = [710528, 694643, 679854, 666867, 655848, 646304, 637916, 630798, 624970, 620300, 617100, 616088, 617387, 620114, 623329, 627017, 631744, 637657, 644264, 651115, 658295, 666164, 674741, 683523, 691956, 699939, 707575, 714452, 719705, 723103, 725550, 728003, 730218, 731189, 730497, 728408, 724811, 718952, 710419, 699644, 687198, 673268, 658087, 642319, 626704, 611700, 597638, 584716, 572707, 561298, 550905, 542474, 536071, 530338, 523891, 516818, 510278, 505022, 500877, 497367, 494245, 491474, 489140, 487363, 486067, 485009, 484220, 484117, 484919, 486304, 487978, 490260, 493613, 497830, 502198, 506306, 510232, 514033, 517574, 520878, 524144, 527297, 529899, 531701, 533028, 534457, 536283, 538400, 540574, 542718, 544988, 547663, 550798, 553950, 556332, 557386, 557240, 556586, 556129, 556151, 556614, 557519, 559018, 561113, 563397, 565268, 566334, 566589, 566327, 566111, 566693, 568624, 571800, 575500]
63083E75500L476L071L111L786M710N273N310N364O064P330Q507R187R527R781
63069F59997J0024J0385J1037J1853J2539J3198J4183J5341J6117J6648J7913
63058H09235K0365K3149K5198K6604K8188L0248L2342L4029L5249L6179L7150
63047A137936L8409L9701M0403M0377M0156M0044L9662L8753L7789L7213L6774
63036A567217L6184L5650L5131L3772L0986K7438K4014K0350J5350Q757J274o470
63024A829653j4146k1354k7922l4187m0054m4348m6180m6424m6571m6531m5037
63013A416899m1959l8620l5729l2542k8448k3996j9908j6112j2352q776n490k311
63001A150656O55K934M410N447O224O752P514Q997J0510J0771R899R551J0490
$$ y = [575500, 578976, 582047, 585158, 588944, 593654, 598927, 604237, 609601, 615665, 622995, 631502, 640689, 650216, 659997, 670021, 680406, 691443, 703296, 715835, 729033, 743216, 758557, 774674, 791322, 809235, 829600, 852749, 877947, 904551, 932739, 962987, 995329, 1029358, 1064607, 1100786, 1137936, 1176345, 1216046, 1256449, 1296826, 1336982, 1377026, 1416688, 1455441, 1493230, 1530443, 1567217, 1603401, 1639051, 1674182, 1707954, 1738940, 1766378, 1790392, 1810742, 1826092, 1834849, 1836123, 1829653, 1815507, 1794153, 1766231, 1732044, 1691990, 1647642, 1601462, 1555038, 1508467, 1461936, 1416899, 1374940, 1336320, 1300591, 1268049, 1239601, 1215605, 1195697, 1179585, 1167233, 1158457, 1152967, 1150656, 1151311, 1154245, 1158655, 1164102, 1170326, 1177078, 1184592, 1193589, 1204099, 1214870, 1224769, 1234320, 1244810]
62988A244810J1390J0800R085P431N885L566K52l361o750r989j3243j6455j9534
62975A223887k2353k4692k6447k7710k8454k8483k7842k6929k5981k4917k3712
62964I36367k2505k1185j9534j7885j6935j6731j6525j5840j4907j3885j2622
62953G47813j1509j1449j2424j3085j2551j1645j1442j1530j0843r536q693q557
62941F14549q374p803p329p154o756n818m777m135l889l859m003m151l899l089
62927E39513k066j232o52l07l92j098k201l100l356l051k607k235j769j104o17
62912E13726p97j581k403k878l036k918k495k092k261k976l450l116k312j619
62898D79792j047l43K32J81m31r51r36n91l81n17p54o60j18L56J78m43o30r6K72
$$ y = [1244810, 1256200, 1267000, 1276085, 1283516, 1289401, 1292967, 1293219, 1289858, 1283108, 1273119, 1259876, 1243421, 1223887, 1201534, 1176842, 1150395, 1122685, 1094231, 1065748, 1037906, 1010977, 984996, 960079, 936367, 913862, 892677, 873143, 855258, 838323, 821592, 805067, 789227, 774320, 760435, 747813, 736304, 724855, 712431, 699346, 686795, 675150, 663708, 652178, 641335, 631799, 623106, 614549, 606175, 598372, 591043, 583889, 577133, 571315, 566538, 562403, 558514, 554655, 550652, 546501, 542602, 539513, 537447, 536215, 535563, 535256, 534864, 533766, 531565, 528465, 525109, 522058, 519451, 517216, 515447, 514343, 513726, 512929, 511348, 508945, 506067, 503031, 500113, 497618, 495526, 493265, 490289, 486839, 483723, 481411, 479792, 478745, 478402, 478634, 478815, 478384, 477433, 476497, 475906, 475525, 475008, 474254, 473594, 473476, 473832, 474010, 473567, 472937, 472841, 473113]
62879D73113l97j603j927p64R55J827J351J28r80j604j901k035j934j599j302
62864D61328j221j097o60k57m18r03q30J22J226J637J262M81l31o81o9J303K403
62847D63295K397J487L93m85j009r42k45N04N96o4r61j480j250l61N48Q04N31
62830D63758M95R04J120Q64Q56J675K701L034K792K628K511J985J351J437K396
62815D90507L591M633N606O365O469N975N509N412N481N608N979O571P137P781
62801E72624Q898J0376J1530J1982J2045J2061J2036J2092J2681J4024J5888J8041
62789G24278K0443K2859K4947K7014K9942L3983L8253M1863M4985M8215N1443
62778A108225N4093N6143N8004N9544N9960N8743N6164N2609M7949M1815L4131
$$ y = [473113, 472716, 471113, 469186, 468422, 469377, 471204, 472555, 472683, 471703, 470099, 468198, 466163, 464229, 462630, 461328, 460107, 459010, 458350, 458093, 457675, 456772, 455942, 456064, 457290, 458927, 460189, 460670, 460339, 459658, 459589, 460892, 463295, 465692, 467179, 467572, 467087, 466078, 465136, 464891, 465395, 465991, 465927, 464966, 463486, 462236, 461875, 462423, 463227, 463758, 464253, 465157, 466277, 467141, 467997, 469672, 472373, 475407, 478199, 480827, 483338, 485323, 486674, 488111, 490507, 494098, 498731, 504337, 510702, 517171, 523146, 528655, 534067, 539548, 545156, 551135, 557706, 564843, 572624, 581522, 591898, 603428, 615410, 627455, 639516, 651552, 663644, 676325, 690349, 706237, 724278, 744721, 767580, 792527, 819541, 849483, 883466, 921719, 963582, 1008567, 1056782, 1108225, 1162318, 1218461, 1276465, 1336009, 1395969, 1454712, 1510876, 1563485, 1611434, 1653249, 1687380]
62767A687380K5125J5167M810n279j4705k3481l1556l8461m3775m7727n0934n3562
62755A423002n5206n5647n5250n4423n3055n0915m8254m5628m3237m0850l8285
62744H82252l5633l3022l0477k7982k5424k2567j9430j6610j4729j3646j2586
62733F30146j1155r717q651p760o625n199l762k598j911j833k188k509k395j790
62719E62053q56J71J035J698K560L993N621O659P011P477Q613J0057J1332J2705
62705F40129J4655J6926J8834K0286K1793K3562K5152K6169K6901K8020K9718
62694H92145L1341L1964L1385L0217K8802K6443K2431J7478J3082R374M762j781
62682A137643r045j5098j9579k3490k7251l0170l1719l2303l2572l2693l2481
$$ y = [1687380, 1712505, 1727672, 1732482, 1727203, 1712498, 1689017, 1657461, 1619000, 1575225, 1527498, 1476564, 1423002, 1367796, 1312149, 1256899, 1202476, 1149421, 1098506, 1050252, 1004624, 961387, 920537, 882252, 846619, 813597, 783120, 755138, 729714, 707147, 687717, 671107, 656378, 642732, 630146, 618991, 609274, 600623, 592863, 586238, 581039, 577277, 574679, 572768, 570935, 568747, 566238, 563843, 562053, 561197, 561368, 562403, 564101, 566661, 570654, 576275, 582934, 589945, 597422, 606035, 616092, 627424, 640129, 654784, 671710, 690544, 710830, 732623, 756185, 781337, 807506, 834407, 862427, 892145, 923486, 955450, 986835, 1017052, 1045854, 1072297, 1094728, 1112206, 1125288, 1134662, 1139424, 1137643, 1128598, 1113500, 1093921, 1070431, 1043180, 1013010, 981291, 948988, 916416, 883723, 851242]
62671H51242l1734l0340k8428k6430k4677k3112k1654k0470j9461j7931j5515
62660E91490j3131j2094j2340j2384j1203r359q003p472p271o939o454o027n826
62647D72987n787n593m960l993l054k309j685j250j210j487j652j465j162j104
62633D36276j314j576j722j673j296n30L88R80R11L31k16k50L09J282K437L447
62617D37784L917L832L825M485N460N851N506N317N964P061P827Q062Q088Q246
62603E21225Q859J0194J1981J3486J4540J5951J8372K1262K3638K5352K6881K8251
62591G39992K8985K8917K8249K6976K4897K2056J8542J4125Q811L479r12m620
62579I39497q678j3185j7054j9611k1497k3516k5375k6210k5886k5137k4571k4016
$$ y = [851242, 819508, 789168, 760740, 734310, 709633, 686521, 664867, 644397, 624936, 607005, 591490, 578359, 566265, 553925, 541541, 530338, 520979, 512976, 505504, 498233, 491294, 484840, 478813, 472987, 467200, 461607, 456647, 452654, 449600, 447291, 445606, 444356, 443146, 441659, 440007, 438542, 437380, 436276, 434962, 433386, 431664, 429991, 428695, 428165, 428553, 429533, 430444, 430775, 430559, 430309, 430618, 431900, 434337, 437784, 441701, 445533, 449358, 453843, 459303, 465154, 470660, 475977, 481941, 489002, 496829, 504891, 512979, 521225, 530084, 540278, 552259, 565745, 580285, 596236, 614608, 635870, 659508, 684860, 711741, 739992, 768977, 797894, 826143, 853119, 878016, 900072, 918614, 932739, 941550, 945029, 944117, 939497, 930819, 917634, 900580, 880969, 859472, 835956, 810581, 784371, 758485, 733348, 708777, 684761]
62567F84761k2895k1035j8983j7453j6504j5494j3926j1981j0086q437p249o939
62555E13779p410p561o387m346k886k614k749k388j596r43o43m90l36k46l04m13
62539D72467k80K49Q08P96K59K0N87J349J488J216J415K323L397M275N127O112
62523E01608P206Q488R927J1036J1476J1919J3422J5924J8135J9151J9356J9578
62511F67226K0105K0787K1471K1929K1812K0950J9473J7550J5365J3242J1331
62500H71241R287O769M162K185R16m4n88r7J510L562N663Q104J1090J4202J7033
62485I54995J9714K2530K5443K8191L0511L2152L3055L3333L2603K9712K3935
62474A266174J6388R248L568j386o740j2913j9839k7053l3290l7223l9047m0379
$$ y = [684761, 661866, 640831, 621848, 604395, 587891, 572397, 558471, 546490, 536404, 527967, 520718, 513779, 506369, 498808, 492421, 488075, 485189, 482575, 479826, 477438, 475842, 474899, 474256, 473766, 473430, 473184, 472880, 472467, 472187, 472436, 473244, 474040, 474299, 474319, 474906, 476255, 477743, 478959, 480374, 482697, 486094, 490369, 495496, 501608, 508814, 517302, 527229, 538265, 549741, 561660, 575082, 591006, 609141, 628292, 647648, 667226, 687331, 708118, 729589, 751518, 773330, 794280, 813753, 831303, 846668, 859910, 871241, 880528, 887297, 891459, 893644, 894560, 894516, 893928, 893831, 895341, 898903, 904566, 912670, 923760, 937962, 954995, 974709, 997239, 1022682, 1050873, 1081384, 1113536, 1146591, 1179924, 1212527, 1242239, 1266174, 1282562, 1291810, 1295378, 1293992, 1287252, 1274339, 1254500, 1227447, 1194157, 1156934, 1117887, 1077508]
62462A077508m2120m3421m3238m1798l9891l7677l4975l2033k9092k5866k2190
62451F85207j8678j6059j4263j2742j1228r601p550n009k545p30M87J426K095
62438E90810K467K785L119L106K624K187K130J856N56j710m172o254p777q635
62424E83092q871q824q736q423p670o648n700n021m823n271n967o012n060l796
62410D92270l081l049l375l779l873l222k112j575k081k777k656j830r92k44O87
62395D58311J620K125K241K217J991J563J451J962K503K441K234K790M003M937
62381D92389N258N469N854O151O237O329O378O210O206P045Q564R702R891R814
62367E91497J0481J2064J3944J5507J6726J8177K0561K3879K7139K9308L0456
$$ y = [1077508, 1035388, 991967, 948729, 906931, 867040, 829363, 794388, 762355, 733263, 707397, 685207, 666529, 650470, 636207, 623465, 612237, 602636, 595086, 590077, 587532, 586802, 587289, 588715, 590810, 593277, 596062, 599181, 602287, 604911, 607098, 609228, 611084, 611640, 609930, 605758, 599504, 591727, 583092, 574221, 565397, 556661, 548238, 540568, 533920, 528220, 523199, 518376, 513105, 507138, 501126, 496066, 492270, 489189, 486140, 482765, 478986, 475113, 471891, 469779, 468204, 466123, 463346, 460690, 458860, 457868, 457624, 458311, 459931, 462056, 464297, 466514, 468505, 470068, 471519, 473481, 475984, 478425, 480659, 483449, 487452, 492389, 497647, 503116, 508970, 515121, 521358, 527687, 534065, 540275, 546481, 553526, 562090, 571792, 581683, 591497, 601978, 614042, 627986, 643493, 660219, 678396, 698957, 722836, 749975, 779283, 809739]
62356H09739L1535L3110L4775L5795L5678L4062L0748K6166K1379J7184J3404
62345A123575R319M641j62m449q116j1575j5092j8337k0759k2228k2947k2848
62333I91022k1705j9847j8147j7019j6023j4744j3465j2535j1738j0889j0503
62322H24407j1157j2557j3898j4885j5754j6594j7272j7764j7944j7386j5974
62311F53222j4375j3289j2511j1483j0359r643r086p943o238m838m180l819l307
62298E42151k703k051j164j66M45M86L21K35J97K97P58J379J663J669K062L107
62282E48686M213M760M824M792M859N137N739O465O884P015P427Q346R240R615
62268F38002R798J0441J1660J3051J4331J5571J7034J9052K1768K4775K7342K9245
$$ y = [809739, 841274, 874384, 909159, 944954, 980632, 1014694, 1045442, 1071608, 1092987, 1110171, 1123575, 1132894, 1137535, 1137373, 1132924, 1124808, 1113233, 1098141, 1079804, 1059045, 1036817, 1013870, 991022, 969317, 949470, 931323, 914304, 898281, 883537, 870072, 857537, 845799, 834910, 824407, 813250, 800693, 786795, 771910, 756156, 739562, 722290, 704526, 686582, 669196, 653222, 638847, 625558, 613047, 601564, 591205, 581562, 572476, 564533, 558295, 553457, 549277, 545458, 542151, 539448, 537397, 536233, 536067, 536512, 536998, 537319, 537554, 537751, 538048, 538806, 540185, 541848, 543517, 545579, 548686, 552899, 557659, 562483, 567275, 572134, 577271, 583010, 589475, 596359, 603374, 610801, 619147, 628387, 638002, 647800, 658241, 669901, 682952, 697283, 712854, 729888, 748940, 770708, 795483, 822825, 852070]
62256H52070L1059L3270L5485L6885L7167L6494L4770L1616K7110K1996J6971
62245A194893J2114P226K403k062o204j0479j5221k0226k4900k8705l1359l2846
62233A044634l3448l3567l3260l2075k9734k6803k4215k2121j9900j7384j5351
62222G56776j4307j3505j1902r677p977p312p076o625o106n925n969n715m888
62209F49792l731k790k391k315j998j240m63l4L38J120K080K475K098J578J626
62194F46145K354L374M216M596M661M918N618O287O344O032O107O621O731N991
62180G19995N124N089N743O094N676N150N453O675Q035Q892R472J0484J2200J4283
62166H28365J6458J8789K1121K2824K3488K3417K2843K1192J7919J3714R945O916
$$ y = [852070, 883129, 916399, 951884, 988769, 1025936, 1062430, 1097200, 1128816, 1155926, 1177922, 1194893, 1207007, 1214233, 1216636, 1214574, 1208370, 1197891, 1182670, 1162444, 1137544, 1108839, 1077480, 1044634, 1011186, 977619, 944359, 912284, 882550, 855747, 831532, 809411, 789511, 772127, 756776, 742469, 728964, 717062, 707385, 699408, 692096, 685020, 678395, 672289, 666364, 660395, 654680, 649792, 646061, 643271, 640880, 638565, 636567, 635327, 634864, 634830, 635168, 636288, 638368, 640843, 642941, 644519, 646145, 648499, 651873, 656089, 660685, 665346, 670264, 675882, 682169, 688513, 694545, 700652, 707273, 714004, 719995, 725119, 730208, 735951, 742045, 747721, 752871, 758324, 764999, 773034, 781926, 791398, 801882, 814082, 828365, 844823, 863612, 884733, 907557, 931045, 954462, 977305, 998497, 1016416, 1030130, 1040075, 1046991]
62154A046991L697j53l707o030p550r429j2060j4887j7359j9355k0817k1617k1783
62141H95941k1427k0389j8384j5573j2669j0333q694p588o877o349n583m395l349
62128G54331l336m463n712o030n426m655m036l160j761l63J89n42k326m332n447
62113G02931n042l675k618k516k992l633m634o102p429p990p966p823p388o219
62099F26904m552l208k523k039j206%J193J954K170K230K656L376L738L542L471
62084F37706M110N043N594N856O276O705O785O956Q023R876J1531J2464J2955
62071G39880J3194J2976J2534J2695J3850J5404J6600J7350J7909J8226J7983
62060I08601J6974J5265J3079J0586P656M033j4l625o377q944j2080j5373j7825
$$ y = [1046991, 1050688, 1050535, 1046828, 1040798, 1033248, 1023819, 1011759, 996872, 979513, 960158, 939341, 917724, 895941, 874514, 854125, 835741, 820168, 807499, 797166, 788472, 780884, 774007, 767658, 762075, 757680, 754331, 750995, 746532, 740820, 734790, 729364, 724709, 720673, 717513, 715752, 715389, 715578, 715036, 712710, 708378, 702931, 697889, 694214, 691596, 689080, 686088, 682455, 677821, 671719, 664290, 656300, 648334, 640511, 633123, 626904, 622352, 619144, 616621, 614582, 613376, 613376, 614569, 616523, 618693, 620923, 623579, 626955, 630693, 634235, 637706, 641816, 646859, 652453, 658309, 664585, 671290, 678075, 685031, 693054, 702930, 714461, 726925, 739880, 753074, 766050, 778584, 791279, 805129, 820533, 837133, 854483, 872392, 890618, 908601, 925575, 940840, 953919, 964505, 972161, 976194, 976180, 972555, 966178, 957234, 945154, 929781, 911956]
62047I11956j9411k1067k3146k4950k5854k6037k5823k5186k4173k3137k2223
62036F50949k1208j9976j8678j7257j5501j3588j2005j0839r840r111q883q631
62024D85432p435n463m064l994m517m715m660m631m170k895j588j383k239l040
62010D30638l050k492j804j045j74N98J005J070J120J516K304L172L769L982L801
61995D44410L167K233J511J276J064L24o23j057j114j742l239m736n396n364n169
61980D25545m907m538m361m658n131n154m426l225k185j833k042k025j339o61
61966C79060r23j852k269j813j383j585j803j255j53P35J044Q94N71N74J314K431
61950C73587K975K682K400K880L850M692N364O075O667O920P020P196P356P451
$$ y = [911956, 892545, 871478, 848332, 823382, 797528, 771491, 745668, 720482, 696309, 673172, 650949, 629741, 609765, 591087, 573830, 558329, 544741, 532736, 521897, 512057, 502946, 494063, 485432, 477997, 472534, 468470, 464476, 459959, 455244, 450584, 445953, 441783, 438888, 437300, 435917, 433678, 430638, 427588, 425096, 423292, 422247, 422073, 422671, 423676, 424746, 425866, 427382, 429686, 432858, 436627, 440609, 444410, 447577, 449810, 451321, 452597, 453661, 453985, 453362, 452305, 451191, 449449, 446210, 441474, 436078, 430714, 425545, 420638, 416100, 411739, 407081, 401950, 396796, 392370, 389145, 386960, 385127, 383085, 381060, 379721, 379060, 378137, 376285, 374016, 372203, 370820, 369235, 367432, 366177, 366024, 366759, 367803, 368697, 369268, 369842, 371156, 373587, 376562, 379244, 381644, 384524, 388374, 393066, 398430, 404505, 411172, 418092, 425112, 432308, 439664, 447115]
61936D47115P683Q008P922P284O681O583O675O528O291O129N608M324K716J562
61922E31109R60M08m15j375k180k561k448k129j900j443j71J680L114L851M781
61907E31281O460Q027Q343P490O414N694N319N091M536L034P16j381k629l608
61893E84787m885n868n821n313n436o049o039n046l878l311l391l898m594n081
61879E16177n081m888m902m913m474l706l100k711k239j677j168m98N71J704K408
61864D81503K800L261L655L706L836M714O086P011P206P325P900Q816R921J1281
61850E69021J2708J3737J4226J4470J4570J4245J3352J2100J0694R161P539N857
61838G11680M027K132N78m09j195k115k804k724k090j520j024r6J295K610L574
$$ y = [447115, 454798, 462806, 470728, 478012, 484693, 491276, 497951, 504479, 510770, 516899, 522507, 526831, 529547, 531109, 532069, 532477, 532062, 530687, 528507, 525946, 523498, 521369, 519469, 518026, 517855, 519535, 522649, 526500, 531281, 537741, 545768, 554111, 561601, 568015, 573709, 579028, 584119, 588655, 591689, 592405, 591024, 588395, 584787, 579902, 574034, 568213, 562900, 557464, 551415, 545376, 540330, 536452, 533141, 529750, 525852, 521258, 516177, 511096, 506208, 501306, 496393, 491919, 488213, 485113, 482402, 480163, 478486, 477318, 476820, 477391, 479095, 481503, 484303, 487564, 491219, 494925, 498761, 503475, 509561, 516572, 523778, 531103, 539003, 547819, 557740, 569021, 581729, 595466, 609692, 624162, 638732, 652977, 666329, 678429, 689123, 698284, 705823, 711680, 715707, 717839, 718417, 718008, 716813, 714698, 711894, 709170, 707080, 705560, 704536, 704440, 705735, 708345, 711919]
61823G11919M426N280N833N779M984L341J009j416l483n476p788r954j1118j1299
61809F92037j1340j1646j1845j1727j1621j1635j1322j0450r501r008q890q690
61797E64362q131p270o366n725n396n036m358l576l062k833k700k717k950l089
61783E01153k857k569k648k752k219j160m36n00j014j553k002k198j920j378j072
61768D74875j087j046q04n55l10J24N72O13L50L50P81J256J639K227K928L038
61752D84951K224J096L48j33q45j761k347k363k209k440l072l532l319k634k130
61737D61834k028j916j531j150r37n82m1O5n52j105q67m03o46j244j081j64L91
61720D48043K13J17M87N67j53r35q64j45L62K53k77r39j542j982k366k847l225
$$ y = [711919, 716345, 721625, 727458, 733237, 738221, 741562, 742571, 741155, 737672, 732196, 724408, 714454, 703336, 692037, 680697, 669051, 657206, 645479, 633858, 622223, 610901, 600451, 590950, 581942, 573052, 564362, 556231, 548961, 542595, 536870, 531474, 526438, 522080, 518504, 515442, 512609, 509909, 507192, 504242, 501153, 498296, 495727, 493079, 490327, 488108, 486948, 486512, 486012, 484998, 483445, 481443, 479245, 477325, 475947, 474875, 473788, 472742, 471938, 471383, 471073, 471197, 471769, 472382, 472732, 473082, 473863, 475119, 476758, 478985, 481913, 484951, 487175, 488271, 488619, 488486, 487641, 485880, 483533, 481170, 478961, 476521, 473449, 469917, 466598, 463964, 461834, 459806, 457890, 456359, 455209, 454272, 453690, 453649, 453714, 453162, 452057, 451190, 450787, 450141, 448897, 447816, 447652, 448043, 448256, 448373, 448860, 449427, 449274, 448339, 447475, 447330, 447692, 447945, 447668, 446729, 445187, 443205, 440839, 437992, 434767]
61703D34767l133k645k282k307k525k744k958l034k789k407k246k298k371k640
61689C98388l303l818l322j870m29L39N01P2j165k796l705l258j981q29l57p25
61673C71742j672k357k002r08j26j2M2L48M42R7k08k16l35o60m87N71J744K073
61655C68076J576R00L97J12J29L91N70M97L86M39O55J138J947K569K333J473R13
61638C84501Q99P96M48N58J213J375N07m09m35k52r96k332k916k406j783j872
61622C76896k470k931k902k375j622j097j102j558k206k787k953k491j779j490
61608C47133j704j886j859j978k155j809j135j304k643l701l092j432l97m76q45
61593C20717r18r04r96j086j149j240j204j054j261k002k528k074j056m76m35
$$ y = [434767, 431634, 428989, 426707, 424400, 421875, 419131, 416173, 413139, 410350, 407943, 405697, 403399, 401028, 398388, 395085, 391267, 387945, 386075, 385646, 385985, 386486, 386558, 385393, 382597, 378892, 375634, 373653, 372824, 372467, 371742, 370070, 367713, 365711, 364803, 364677, 364665, 364707, 365055, 365497, 365594, 365386, 365170, 364835, 364175, 363688, 364259, 366003, 368076, 369652, 370552, 370949, 371061, 371190, 371581, 372151, 372648, 373034, 373473, 374128, 375266, 377213, 379782, 382115, 383588, 384501, 385400, 386196, 386644, 387202, 388415, 389790, 390297, 389888, 389453, 389201, 388205, 385873, 382957, 380551, 378768, 376896, 374426, 371495, 368593, 366218, 364596, 363499, 362397, 360839, 358633, 355846, 352893, 350402, 348623, 347133, 345429, 343543, 341684, 339706, 337551, 335742, 334607, 333303, 330660, 326959, 323867, 322435, 322038, 321562, 320717, 319799, 318895, 317899, 316813, 315664, 314424, 313220, 312166, 310905, 308903, 306375, 304301, 303245, 302769, 302334]
61578C02334k16L35N24k9p83j064p53j27M57O32K89j45j33K14L22J3k69j53J85
61559C01633L26Q5l71o82n62l2O62J379K067K397J904P36k71n54l90k01O1M45
61541C08632N52K52K40J066K020J863N05q59j181m60O74J543J629Q61j00l75K24
61524C17086J090J569J525J164O80J13n83j299j661j442j112j341j864j564j38
61509C12223J133R78j45p69m18J10J80J1m4j2O0K96O33P89P10O62P52Q14P69P80
61489C19512R59J217J369J205N77l55j097j232p46J49J211J987J951J145L08M3
61473C28203J26J0m10q30r21m10P26J793J784P04k32k18M8l41r86r45l66j08j95
61454C27432J20Q59J163O81R3J4L11O96J199J745J980J756J373J172J242J553
$$ y = [302334, 302118, 302453, 302977, 302948, 302165, 301101, 300348, 300221, 300678, 301310, 301599, 301454, 301321, 301535, 301857, 301870, 301601, 301448, 301633, 301959, 302044, 301673, 300991, 300429, 300397, 301059, 302438, 304505, 306902, 308806, 309542, 309271, 308717, 308327, 308126, 308187, 308632, 309184, 309436, 309676, 310742, 312762, 314625, 315130, 314271, 313090, 312630, 313304, 314847, 316476, 317337, 317237, 316862, 317086, 318176, 319745, 321270, 322434, 323114, 323227, 322644, 321345, 319684, 318242, 317130, 315789, 313925, 312361, 312223, 313356, 314334, 314189, 313420, 313002, 313112, 313292, 313303, 313259, 313247, 313307, 313603, 314236, 315025, 315735, 316397, 317149, 317963, 318732, 319512, 320471, 321688, 323057, 324262, 324839, 324484, 323387, 322155, 321409, 321558, 322769, 324756, 326707, 327852, 328160, 328203, 328329, 328339, 327929, 327099, 326178, 325768, 326494, 328287, 330071, 330775, 330543, 330325, 330373, 330032, 329046, 328101, 327735, 327627, 327432, 327552, 328411, 329574, 330255, 330348, 330362, 330673, 331369, 332568, 334313, 336293, 338049, 339422, 340594, 341836, 343389]
61438C43389J893J841J253O90P54J265J606J711J949K283K301K018J849J833J643
61423C68278J335J312J525J521J359J589K241K595K259J674J305J034O41K86M3
61408C88997m21j344k379k934k765k041j147n12l43m25l76j07K01M01L61j23r49
61391C74094j539j489j240j443j905j817r64O1P23R47P56K33j31J65Q44J154J003
61374C69452J010J349J423R08L92N44J221J777J832J473J060R51J165J318J244
61359C87119J417K206L034L068K598K721L695M604M787M579M388M085L687L640
61345D35628L898L688K813K266K810L701L728K912K217K022J809J203N39K66M78
61330D69978J002J523J637J127K68m35p41p21m12K40J137J999K584K869L035L284
$$ y = [343389, 345282, 347123, 348376, 349066, 349820, 351085, 352691, 354402, 356351, 358634, 360935, 362953, 364802, 366635, 368278, 369613, 370925, 372450, 373971, 375330, 376919, 379160, 381755, 384014, 385688, 386993, 388027, 388668, 388954, 388997, 388576, 387232, 384853, 381919, 379154, 377113, 375966, 375454, 375111, 374686, 374310, 374203, 374404, 374805, 375166, 375043, 374094, 372555, 371066, 369826, 368383, 366478, 364661, 363697, 363758, 364481, 365428, 366184, 366417, 366286, 366451, 367295, 368449, 369452, 370462, 371811, 373234, 374142, 374534, 375078, 376299, 378076, 379908, 381381, 382441, 383392, 384557, 385875, 387119, 388536, 390742, 393776, 396844, 399442, 402163, 405858, 410462, 415249, 419828, 424216, 428301, 431988, 435628, 439526, 443214, 446027, 448293, 451103, 454804, 458532, 461444, 463661, 465683, 467492, 468695, 469234, 469500, 469978, 470980, 472503, 474140, 475267, 475535, 475100, 474359, 473638, 473226, 473466, 474603, 476602, 479186, 482055, 485090, 488374]
61314D88374L638L919M077M382N073N967O756P533Q591R722J0317J0178R699R092
61300E87318Q003O152L934K041Q38K43m8m83j401k624l604m126m569n251n919
61285E80504o146n964n742n623n431n029m544m167l850l255k085n38P59J365J383
61270E31637J104N89k5k24L98J492K330K731L099L641M077M164L966L633L279
61255E65891L128L298L502L343K866K394K023J722J659J876J870J195L45J94P40
61240E96046J190J257J397J776J896J545J174J130J262J524K167L052L653L977
61226F23046M616N552N836N052M234M596O006P353P941P870P448O944O721P006
61212G10221P573P948P847P260O364N481M844M373L963L928M613N729O636P302
$$ y = [488374, 492012, 495931, 500008, 504390, 509463, 515430, 522186, 529719, 538310, 548032, 558349, 568527, 578226, 587318, 595321, 601473, 605407, 607448, 608286, 608529, 608481, 607998, 606597, 603973, 600369, 596243, 591674, 586423, 580504, 574358, 568394, 562652, 557029, 551598, 546569, 542025, 537858, 534008, 530753, 528668, 528130, 528889, 530254, 531637, 532741, 533330, 533305, 533081, 533479, 534971, 537301, 540032, 543131, 546772, 550849, 555013, 558979, 562612, 565891, 569019, 572317, 575819, 579162, 582028, 584422, 586445, 588167, 589826, 591702, 593572, 594767, 595112, 595306, 596046, 597236, 598493, 599890, 601666, 603562, 605107, 606281, 607411, 608673, 610197, 612364, 615416, 619069, 623046, 627662, 633214, 639050, 644102, 648336, 652932, 658938, 666291, 674232, 682102, 689550, 696494, 703215, 710221, 717794, 725742, 733589, 740849, 747213, 752694, 757538, 761911, 765874, 769802, 774415, 780144, 786780, 794082]
61198G94082Q205R303R975J0138J0487J1295J1825J1376J0172Q803P503O410N772
61185I15346N464M869L717K438J406N65k3j17j17r34k526l554l200k318k050k248
61169I16718k226k199k771l645m004l802l635l630l447l040k556j756m44Q55J537
61154H81955J993L097M827O327P201P844Q448Q618Q073P048N842M578L499K916
61140I62266K812K941L302M009M800N194N156N119N315N615N949O463P176P894
61126A034011Q503R029R399R432R063Q457P973Q106R093J0447J1277J1325J1250
61113A157365J1579J1910J1622J0837J0097R479Q681P621O394M914L195J605K10
61100A255509j751m890q491j1110j2272j2784j3432j4182j4804j5498j6568j7873
$$ y = [794082, 802287, 811590, 821565, 831703, 842190, 853485, 865310, 876686, 886858, 895661, 903164, 909574, 915346, 920810, 925679, 929396, 931834, 933240, 933805, 933782, 933665, 933548, 932614, 930088, 926534, 923334, 921016, 918966, 916718, 914492, 912293, 909522, 905877, 901873, 898071, 894436, 890806, 887359, 884319, 881763, 880007, 879563, 880418, 881955, 883948, 887045, 891872, 898199, 905400, 913244, 921692, 930310, 938383, 945431, 951273, 955851, 959350, 962266, 965078, 968019, 971321, 975330, 980130, 985324, 990480, 995599, 1000914, 1006529, 1012478, 1018941, 1026117, 1034011, 1042514, 1051543, 1060942, 1070374, 1079437, 1087894, 1095867, 1103973, 1113066, 1123513, 1134790, 1146115, 1157365, 1168944, 1180854, 1192476, 1203313, 1213410, 1222889, 1231570, 1239191, 1245585, 1250499, 1253694, 1255299, 1255509, 1253758, 1248868, 1240377, 1229267, 1216995, 1204211, 1190779, 1176597, 1161793, 1146295, 1129727, 1111854]
61088A111854j8885j9173j8756j8147j7844j7638j6778j5014j3066j1661j0583
61077I34309r240p727o656o124n594m698l601k595j782j038%J657L652N192N985
61062I01740O630P551Q252Q273Q225Q939J0182J1238J2241J3834J5780J7202J8059
61049A048146J9205K0932K2634K4006K5498K7331K9051L0351L1551L3008L4834
61038A346547L7209M0160M3013M4989M6449M8567N1601N4585N6808N8538N9974
61027A888440O0851O1569O3528O7606P3162P9245Q5771R2897J00298J07881J16339
61016B797587J26234J37597J51212J69146J92973K22932K60054L07344L66673
61007D731752M36136N13203N98474O92085P88371Q81582R76658J080468J170335
$$ y = [1111854, 1092969, 1073796, 1055040, 1036893, 1019049, 1001411, 984633, 969619, 956553, 944892, 934309, 925069, 917342, 910686, 904562, 898968, 894270, 890669, 888074, 886292, 885254, 885254, 886911, 890563, 895755, 901740, 908370, 915921, 924173, 932446, 940671, 949610, 959792, 971030, 983271, 997105, 1012885, 1030087, 1048146, 1067351, 1088283, 1110917, 1134923, 1160421, 1187752, 1216803, 1247154, 1278705, 1311713, 1346547, 1383756, 1423916, 1466929, 1511918, 1558367, 1606934, 1658535, 1713120, 1769928, 1828466, 1888440, 1949291, 2010860, 2074388, 2141994, 2215156, 2294401, 2380172, 2473069, 2573367, 2681248, 2797587, 2923821, 3061418, 3212630, 3381776, 3574749, 3797681, 4057735, 4365079, 4731752, 5167888, 5681091, 6279565, 6971650, 7760021, 8641603, 9618261, 10698729, 11869064]
60998A1869064J180218J042631P58613M18321J39021j7573o3243l4210M7043J50783
60988A5490668K06179J25304j23905m77486q17082j050303j153204j152679j087916
60979I959576r90286q82732p81282o93251o18151n52467m93137m37741l84548
60970D125981l33663k87112k46965k13688j86399j63981j45519j30089j16782
60961B301783j04958r4328q4825p6449o9152o2779n7152n2227m8125m4966m2754
60950A564068m1264l9975l8220l5723l2979l0753k9199k7825k6419k5510k5462
60939A210739k5632k4988k3401k1733k0696k0302k0380k0889k1482k1463k0566
60928I69207j9313j8218j7208j6189j5582j5635j5627j4602j2725j1156j0606
$$ y = [11869064, 13049282, 14091913, 14850526, 15268847, 15407868, 15390295, 15327052, 15292842, 15339885, 15490668, 15696847, 15822151, 15698246, 15220760, 14403678, 13353375, 12200171, 11047492, 9959576, 8969290, 8086558, 7305276, 6612025, 5993874, 5441407, 4948270, 4510529, 4125981, 3792318, 3505206, 3258241, 3044553, 2858154, 2694173, 2548654, 2418565, 2301783, 2196825, 2102497, 2017672, 1941223, 1872071, 1809292, 1752140, 1699913, 1651788, 1606822, 1564068, 1522804, 1482829, 1444609, 1408886, 1375907, 1345154, 1315955, 1288130, 1261711, 1236201, 1210739, 1185107, 1160119, 1136718, 1114985, 1094289, 1073987, 1053607, 1032718, 1011236, 989773, 969207, 949894, 931676, 914468, 898279, 882697, 867062, 851435, 836833, 824108, 812952, 802346]
60917H02346j0661j0608j0312j0028r859r663r238q422p254o120n486n401n448
60904F93846n309n026m709m296l798l565l992n009o022o419o095n481n048m815
60890F24262m503m081l925m315m985n448n612n785o080o165n677m765m007l832
60876E55082m071m137l713l085k714k661k629k471k280k002j430o32OK75L60L60
60860E24258R5m35q25q47q62j263j802j888j409q88r38j774l063m082m230l668
60844D96379l212l426m005m280m013l510l260l640m662n692n855n015m056l834
60830D37919m203m399m051l387k781k518k791l478m097m262m015l526k759j768
60816C89884r65o84p56p85o97p07j002j587k197k268j441k29L63J04k36r8J17
$$ y = [802346, 791685, 781077, 770765, 760737, 750878, 741215, 731977, 723555, 716301, 710181, 704695, 699294, 693846, 688537, 683511, 678802, 674506, 670708, 667143, 663151, 658142, 652120, 645701, 639606, 634125, 629077, 624262, 619759, 615678, 611753, 607438, 602453, 597005, 591393, 585608, 579528, 573363, 567686, 562921, 558914, 555082, 551011, 546874, 543161, 540076, 537362, 534701, 532072, 529601, 527321, 525319, 523889, 523257, 523263, 523538, 523898, 524258, 524353, 523918, 523093, 522246, 521384, 520121, 518319, 516431, 515022, 514134, 513196, 511422, 508359, 504277, 500047, 496379, 493167, 489741, 485736, 481456, 477443, 473933, 470673, 467033, 462371, 456679, 450824, 445809, 441753, 437919, 433716, 429317, 425266, 421879, 419098, 416580, 413789, 410311, 406214, 401952, 397937, 394411, 391652, 389884, 388919, 388235, 387479, 386694, 385997, 385290, 384288, 382701, 380504, 378236, 376795, 376566, 376929, 377033, 376797, 376699, 376816]
60799C76816p1l74l29j05j15k82l04j61J7R8l04j536l010l500k792k064j998j736
60781C58250n83M66K02p70j038n89n07j009j362j410j578j549n67J016J916J766
60765C52654J358J051L48p75j465j301p99l19L20R44R18L46J69O43Q25J30o43
60748C54404m59O18J717K177J774O86m31q50o44n33p67q48n06j68k09m01l77o1
60730C55122M52Q53N42o58j829j886j061m95n01l65Q9J17n06j002r78j091j737
60713C45066k216j882j193r02r79r91r00q24o70m16l16m46n77o42p33n97J6N28
60695C31326Q5r69j328p05k58o59j038n54K73O32P35J136J603J667J540J622J684
60678C36792J341Q58P66J113J648K225K593K327J425M28l43r90j343r86k61k32
$$ y = [376816, 376745, 376371, 376042, 375937, 375822, 375540, 375236, 375075, 375092, 375190, 374886, 373350, 370340, 366840, 364048, 361984, 359986, 358250, 357667, 358133, 358335, 357565, 356527, 355938, 355431, 354422, 353060, 351650, 350072, 348523, 347956, 348972, 350888, 352654, 354012, 355063, 355411, 354636, 353171, 351870, 351071, 350752, 351072, 352016, 352934, 353280, 353449, 354092, 354917, 355047, 354404, 353945, 354563, 356280, 358457, 360231, 360917, 360486, 359636, 358992, 358459, 357692, 356844, 356338, 356170, 355961, 355560, 355183, 355122, 355574, 356427, 356969, 356311, 354482, 352596, 351535, 351040, 350539, 350174, 350263, 350380, 349874, 348872, 347894, 346803, 345066, 342850, 340968, 339775, 338873, 337894, 336903, 336003, 335179, 334509, 334093, 333777, 333331, 332754, 332112, 331379, 330782, 330798, 331326, 331411, 330442, 329114, 328409, 328151, 327492, 326454, 325900, 326173, 326805, 327540, 328676, 330279, 331946, 333486, 335108, 336792, 338133, 338991, 339757, 340870, 342518, 344743, 347336, 349663, 351088, 351516, 351173, 350183, 348840, 347854, 347593, 347361]
60662C47361j111j766j291j10R66J695J844R83l96p63M74J986K413K131K091K074
60646C58581J460P45P74J153Q44j69j086j673k193k369j782r79r29j572j982j837
60630C46986j599j469j182p80o29o98o59n29m40r7P26J428J337R01J162K127K702
60613C49287K206J053m4p36q28k62N55R86Q71N55L21K15K06J40k25o38l52Q20
60595C54130J862J746Q11J97K98O10P72Q83R83J017J180J621J959J780J377J323
60579C72549J612J919K287K792K946K380J822K369L890N152N482N399N600O145
60565D22344O739P121P038O406N476M388K770M24j904l151l210k819k370j633
60551D47619n68L86R65J365J808K412L377M752O085O815O938O873O845O934P439
$$ y = [347361, 346250, 344484, 343193, 343083, 344049, 345744, 347588, 348571, 348175, 347412, 347886, 349872, 352285, 354416, 356507, 358581, 360041, 360786, 361560, 362713, 363557, 363388, 362302, 360629, 358436, 356067, 354285, 353306, 352377, 350805, 348823, 346986, 345387, 343918, 342736, 341956, 341327, 340629, 339970, 339441, 339001, 338904, 339630, 341058, 342395, 343296, 344458, 346585, 349287, 351493, 352546, 352502, 351766, 350938, 350676, 351231, 352217, 353088, 353643, 353964, 354179, 354385, 354525, 354300, 353662, 353310, 354130, 355992, 357738, 358549, 358746, 359044, 359654, 360426, 361309, 362292, 363309, 364489, 366110, 368069, 369849, 371226, 372549, 374161, 376080, 378367, 381159, 384105, 386485, 388307, 390676, 394566, 399718, 405200, 410599, 416199, 422344, 429083, 436204, 443242, 449648, 455124, 459512, 462282, 462706, 460802, 457651, 454441, 451622, 449252, 447619, 447051, 447437, 448402, 449767, 451575, 453987, 457364, 462116, 468201, 475016, 481954, 488827, 495672, 502606, 510045]
60536E10045Q578R993J1111J1720J1732J0830Q983O831M871K643l67l415n092
60523E88463n025m152l469l342l773m430m513l559k266j718j856j619m92R35K031
60508E51215K860L806N071O648Q219R344J0236J1954J5142J8922K1846K3523K4511
60495G13297K5096K5250K5298K5436K4872K2700J9355J5898J2173P169J097m574
60483I13067r353j4248j9631k4213k6914k8344k9527l0274k9873k8499k6873k5171
60471F20147k3142k0929j8944j7257j5669j4148j2666j0944q839o825n616n387
60459D59781n577n454m798m094l975m417m719m473m047l798l364k396j422j118
60445D06129j204j027q46j367k264k450j785j279j463j820k000k335k778k529
$$ y = [510045, 518623, 528616, 539727, 551447, 563179, 574009, 582992, 589823, 594694, 597337, 596970, 593555, 588463, 583438, 579286, 575817, 572475, 568702, 564272, 559759, 556200, 553934, 552216, 550360, 548741, 548249, 549184, 551215, 554075, 557881, 562952, 569600, 577819, 587163, 597399, 609353, 624495, 643417, 665263, 688786, 713297, 738393, 763643, 788941, 814377, 839249, 861949, 881304, 897202, 909375, 916544, 917641, 913067, 903714, 889466, 869835, 845622, 818708, 790364, 760837, 730563, 700690, 672191, 645318, 620147, 597005, 576076, 557132, 539875, 524206, 510058, 497392, 486448, 477609, 470784, 465168, 459781, 454204, 448750, 443952, 439858, 435883, 431466, 426747, 422274, 418227, 414429, 411065, 408669, 407247, 406129, 404925, 403898, 403052, 401685, 399421, 396971, 395186, 393907, 392444, 390624, 388624, 386289, 383511, 380982]
60431C80982j321k2O02Q38J157J298Q46Kq36j541j854j244J68J214R33k31j080
60414C79911j076n02L27J295K108K357J998J452J122J021R10P63R52J700K419
60399C96757K128Q47q2L35J352J587J024Q44J528K298K449K175J861J526J179
60384D17808R77Q39O30O71J282J952J896J361J253J545J314N29L78J403K528K652
60368D39018K083J771J957K304K535K381J624P49P86J961L188L393K722K013J814
60353D70299K244L122L741L306K051J140J051R35M8j109j702j758j659j248l06
60338D80155O39Q02J54p16j349j553j272q26q78j654k566k976k918k653k038q53
60322D59498N63J475J400M81m85m55R34K773L808L852L628L456L114K872L383
$$ y = [380982, 379661, 379639, 380241, 381079, 382236, 383534, 384380, 384382, 383546, 382005, 380151, 378907, 379075, 380289, 381222, 380991, 379911, 378835, 378333, 378660, 379955, 382063, 384420, 386418, 387870, 388992, 390013, 390923, 391686, 392638, 394338, 396757, 398885, 399732, 399650, 399985, 401337, 402924, 403948, 404792, 406320, 408618, 411067, 413242, 415103, 416629, 417808, 418785, 419624, 420254, 420925, 422207, 424159, 426055, 427416, 428669, 430214, 431528, 432057, 432435, 433838, 436366, 439018, 441101, 442872, 444829, 447133, 449668, 452049, 453673, 454422, 455208, 457169, 460357, 463750, 466472, 468485, 470299, 472543, 475665, 479406, 482712, 484763, 485903, 486954, 487889, 487937, 486828, 485126, 483368, 481709, 480461, 480155, 480794, 481596, 481750, 481034, 479685, 478132, 476860, 476034, 475156, 473502, 470936, 467960, 465042, 462389, 460351, 459498, 460061, 461536, 462936, 463417, 462932, 462477, 463411, 466184, 469992, 473844, 477472, 480928, 484042, 486914, 490297]
60307D90297M311M431L493K749L097L867M116L850L324K219M81j206k555m242
60293E18232o343p467o624m929m061l930l376k454k288k968l277k558j471o98
60279D65788j22L35J93p45j793k165j906j610j582j662j738k022k663l258l146
60264D41904k349j767k008k448k120j212o79o39k92N23J038J036J275J942K029
60249D36233J040P2K24J031J473J591J990K502K518J999J237K15q47j042L4J283
60233D51553J391O13J63L72O38P07Q19Q64O15N96J488K836L444L026K480K473
60217D74078K814L261M035N236O445P090O841N775M632M498N569O575O245N033
60203E48127M416M758M978M371L587L467L774L655K771J538N05j35n56r62j304
$$ y = [490297, 494608, 499039, 502532, 505281, 508378, 512245, 516361, 520211, 523535, 525754, 526235, 525029, 522474, 518232, 511889, 504422, 497798, 492869, 488808, 484878, 481502, 479048, 476760, 473792, 470515, 467957, 466486, 465788, 465666, 466001, 466194, 465449, 463656, 461491, 459585, 457975, 456393, 454731, 452993, 450971, 448308, 445050, 441904, 439555, 437788, 435780, 433332, 431212, 430000, 429321, 428682, 428390, 428913, 429951, 430987, 432262, 434204, 436233, 437273, 437345, 437569, 438600, 440073, 441664, 443654, 446156, 448674, 450673, 451910, 452125, 451278, 450236, 450270, 451553, 452944, 453557, 453720, 454092, 454730, 455437, 456256, 457120, 457735, 458331, 459819, 462655, 466099, 469125, 471605, 474078, 476892, 480153, 484188, 489424, 495869, 502959, 509800, 515575, 520207, 524705, 530274, 536849, 543094, 548127, 552543, 557301, 562279, 566650, 570237, 573704, 577478, 581133, 583904, 585442, 585947, 585812, 585256, 584294, 582990]
60188E82990j473j714k426l409l882l630l482m149n101n327m767m200l990l753
60174E31687l173k430j815j470j535k018k547k575j951r95k16Ql18o59m23K96
60158E09866Q01P56M88K59m4k68R7R47J387J097R59J622K337K128J348J050J383
60141E26213J666J670J839K494L581M968O292O904O621O135O032N948N310M331
60127E90004L470K607J616J133J677K570K810K531K537K789K514J577O20N1j65
60112F18341P2P95J394J231O27L42L03j88j178k000k384k695l127l506l801m099
60096F00127m220l990l682l529l156k274j406j144j134p76l61n56j175j553j743
60081E69428k148k427j942j022n52o09o78r29j928l275l919l734l515l518l307
$$ y = [582990, 581517, 579803, 577377, 573968, 570086, 566456, 562974, 558825, 553724, 548397, 543630, 539430, 535440, 531687, 528514, 526084, 524269, 522799, 521264, 519246, 516699, 514124, 512173, 511178, 510962, 510970, 510652, 509993, 509570, 509866, 510667, 511423, 511911, 512170, 512126, 511858, 511955, 512902, 514289, 515386, 516345, 517967, 520304, 522432, 523780, 524830, 526213, 527879, 529549, 531388, 533882, 537463, 542431, 548723, 555627, 562248, 568383, 574415, 580363, 585673, 590004, 593474, 596081, 597697, 598830, 600507, 603077, 605887, 608418, 610955, 613744, 616258, 617835, 618455, 618506, 618341, 618413, 619208, 620602, 621833, 622460, 622802, 623105, 622917, 621739, 619739, 617355, 614660, 611533, 608027, 604226, 600127, 595907, 591917, 588235, 584706, 581550, 579276, 577870, 576726, 575592, 574816, 574455, 573899, 572724, 571171, 569428, 567280, 564853, 562911, 561889, 561337, 560728, 560050, 559121, 557193, 553918, 549999, 546265, 542750, 539232, 535925]
60066E35925l009l314m109m457m061l529l111k429j629j459j920k105j656j220
60052D97917j113p74J10R89J462J871K435K786K783K901L333L603L447L295L418
60037E28463L390K859K177J865J951K161K223J808O84r05k459l809n024n937o385
60022E23062o706p255p665p399o759o485o554o345n782n295m853m102l310l055
60008D41497l082k622j777j353j443j384j111j205j525j180o5Q35R27N70N7o39
59992D26500r74jK081L793M183L701L076K527K252K459K566J644o1j268j503j460
59976D49515j412q58q5k83j498k129j312k69k94q70q97m49j28K23R31J513J465
59959D43163J283J651K270K378J884J200N78K66O22J396J665J077L99K51K01j62
$$ y = [535925, 532916, 529602, 525493, 521036, 516975, 513446, 510335, 507906, 506277, 504818, 502898, 500793, 499137, 497917, 496804, 496030, 496140, 497129, 498591, 500462, 502897, 505683, 508466, 511367, 514700, 518303, 521750, 525045, 528463, 531853, 534712, 536889, 538754, 540705, 542866, 545089, 546897, 547581, 546676, 544217, 540408, 535384, 529447, 523062, 516356, 509101, 501436, 494037, 487278, 480793, 474239, 467894, 462112, 456817, 451964, 447862, 444552, 441497, 438415, 435793, 434016, 432663, 431220, 429836, 428725, 427520, 425995, 424815, 424750, 425585, 426512, 427082, 427139, 426500, 425526, 425525, 427606, 431399, 435582, 439283, 442359, 444886, 447138, 449597, 452163, 453807, 453746, 452478, 450975, 449515, 448103, 447245, 447160, 446877, 445379, 443250, 441938, 441669, 441375, 440505, 439608, 439159, 439031, 439254, 440185, 441698, 443163, 444446, 446097, 448367, 450745, 452629, 453829, 454407, 454673, 455295, 456691, 458356, 459433, 459832, 460083, 460284, 460122]
59943D60122l25J42N67J52o39o98K06J305J819J532Q31O04J507K937L505K840
59927D76407J982J630J098k50j718k300k090j766j501j233j188j280p93M37J381
59912D68816J260Q39J221K104K412J984J545J387J258J212J477J742J480Q37L71
59897D89945J27j91l45K93J710L058L584L305K807K635K896L228L258L091L051
59882E22452L141L196L398L905M130L379K144J645J923J752O93j30R5N62K50n77
59866E51958j208j677k133k025j027Q7N30O97J264J853J725J137R53J404K192
59851E55730L278M555N329N074M243L485K563J025n97j263p67K72J315K019J888
59836E88149P64o05j289j233r69o71j99K97M90K79l47j408k519l015k970l264
$$ y = [460122, 459797, 459939, 460506, 460658, 460019, 459321, 459527, 460832, 462651, 464183, 465014, 465618, 467125, 470062, 473567, 476407, 478389, 480019, 481117, 480867, 479149, 476849, 474759, 472993, 471492, 470259, 469071, 467791, 466998, 467435, 468816, 470076, 470915, 472136, 474240, 476652, 478636, 480181, 481568, 482826, 484038, 485515, 487257, 488737, 489574, 489945, 490072, 489881, 489536, 489829, 491539, 494597, 498181, 501486, 504293, 506928, 509824, 513052, 516310, 519401, 522452, 525593, 528789, 532187, 536092, 540222, 543601, 545745, 547390, 549313, 551065, 551758, 551628, 551723, 552285, 552535, 551958, 550750, 549073, 546940, 544915, 543888, 543975, 544505, 545202, 546466, 548319, 550044, 551181, 552134, 553538, 555730, 559008, 563563, 568892, 573966, 578209, 581694, 584257, 585282, 584685, 583422, 582655, 582927, 584242, 586261, 588149, 588913, 588308, 587019, 585786, 584817, 584146, 583947, 584244, 584734, 585013, 584666, 583258, 580739, 577724, 574754, 571490]
59820E71490m169m716m231l463l377l653l459k896k616k600k443k315k549k705
59806E26298k134j135o11q11j222j413j305r47n85n81p82n94n3J7n69p88q0N70
59788E13275J28q65j280j012n21K85J354J654M23j357k144j834j233l58J167K542
59772E10224K455J081p8k29J04L89O48Q30Q19J033J885K832K981K430J974J798
59756E31176J581J524K070K898L387L781M682N690N839N147M511M200L728L126
59742E83340L010L445L898M218M550M452L397J980J368J498J146j06j238j330
59728F13628o61QL35L40K18K51L85P6q48j596j459r40r20j298j441j397j453j161
59710F02067j50O08j9j305j455j47J257J885K096K153J820J355J332J421Q64J67
$$ y = [571490, 567321, 562605, 558374, 554911, 551534, 547881, 544422, 541526, 538910, 536310, 533867, 531552, 529003, 526298, 524164, 523029, 522418, 521607, 520385, 518972, 517667, 516720, 516135, 515554, 514772, 514178, 514125, 514142, 513573, 512785, 512705, 513275, 513403, 512538, 511258, 510246, 509725, 510010, 511364, 513018, 513441, 512084, 509940, 508106, 506873, 506515, 507682, 510224, 512679, 513760, 513682, 513453, 513557, 513946, 514594, 515424, 516243, 517276, 519161, 521993, 524974, 527404, 529378, 531176, 532757, 534281, 536351, 539249, 542636, 546417, 551099, 556789, 562628, 567775, 572286, 576486, 580214, 583340, 586350, 589795, 593693, 597911, 602461, 606913, 610310, 612290, 613658, 615156, 616302, 616196, 614958, 613628, 612967, 612975, 613310, 613650, 613868, 614119, 614504, 614580, 613732, 612136, 610677, 609737, 608817, 607519, 606078, 604681, 603228, 602067, 601917, 602525, 602506, 601201, 599746, 599599, 600856, 602741, 604837, 606990, 608810, 610165, 611497, 612918, 613782, 613949]
59694F13949O38K123K997K580J933J783J478N84n9K87J128J735K091K249J836
59679F37332Q26j29o97j301k158k853l203l539l839l610k943k616k838k953k608
59664F02871k246k142k122k351l188m020l618j980m69K31Q99K013K772K535J926
59649E91111J658J477J068Q29Q81M62q65k346l259m015n130o040n927m981l988
59634E60935l262k738k496k446k137j549j386k012k719k699k141j767j875k405
59620E29303l331m419n135n250n017m510l512k296j606j499j097l7Q43Q29L65
59605D93631J81K54M02R49J978K708K496J801J301Q11m3p16l84P21J574J690J436
59588E10790J239J169J135Q98J20j069j872j673q53k84l31p82j361j843j942j628
$$ y = [613949, 614587, 616710, 619707, 622287, 624220, 626003, 627481, 628065, 628006, 628293, 629421, 631156, 633247, 635496, 637332, 638158, 638029, 637332, 636031, 633873, 631020, 627817, 624278, 620439, 616829, 613886, 611270, 608432, 605479, 602871, 600625, 598483, 596361, 594010, 590822, 586802, 583184, 581204, 580735, 580966, 581865, 583878, 586650, 589185, 591111, 592769, 594246, 595314, 596143, 597024, 597486, 596621, 594275, 591016, 587001, 581871, 575831, 569904, 564923, 560935, 557673, 554935, 552439, 549993, 547856, 546307, 544921, 542909, 540190, 537491, 535350, 533583, 531708, 529303, 525972, 521553, 516418, 511168, 506151, 501641, 498129, 495833, 494227, 492728, 491631, 491594, 492437, 493266, 493631, 493812, 494066, 494468, 495417, 497395, 500103, 502599, 504400, 505701, 506512, 506469, 505753, 505369, 506090, 507664, 509354, 510790, 512029, 513198, 514333, 515231, 515351, 514282, 512410, 510737, 509884, 509600, 509269, 508487, 507126, 505283, 503341, 501713]
59572E01713j316j333j404j062l29L37N65L66O3Q2N15R28R14P35Q44R49M16m06
59554E02577l52P70J676J369M87J42L71O14R73J967L420M702N771P022Q242Q817
59538E48568R070J0291J2791J4638J3213P990J210m252p141p891p192n416l230
59525E82649j665j118q84j98P43J260J185Q07K71m19j133j903l015m284m795m062
59509E63439k944k599k988l297l359l642m167m440m321m091l772l187k438j600
59495E16594m09J043J859J534R30J015J337J008M88Q65J877K318K018J795J766
59480E36038J407J090J733K979L476K943K322J976J565J493K488L683L342J690
59466E68225Q70J650K439K109J527J443J196N22O18K076L664M342M846N975O941
$$ y = [501713, 500397, 499064, 497660, 496598, 496269, 496606, 497171, 497537, 497600, 497682, 498197, 499125, 500039, 500774, 501618, 502567, 502983, 502577, 502225, 502995, 504671, 506040, 506527, 506669, 507040, 507654, 508627, 510594, 514014, 518716, 524487, 531509, 539751, 548568, 557638, 567929, 580720, 595358, 608571, 616561, 617771, 613519, 606378, 598487, 591295, 585879, 582649, 580984, 579866, 578982, 578784, 579527, 580787, 581972, 582779, 583050, 582631, 581498, 579595, 576580, 572296, 567501, 563439, 560495, 557896, 554908, 551611, 548252, 544610, 540443, 536003, 531682, 527591, 523819, 520632, 518194, 516594, 516185, 517228, 519087, 520621, 521551, 522566, 523903, 524911, 525399, 526264, 528141, 530459, 532477, 534272, 536038, 537445, 538535, 540268, 543247, 546723, 549666, 551988, 553964, 555529, 557022, 559510, 563193, 566535, 568225, 569095, 570745, 573184, 575293, 576820, 578263, 579459, 579981, 580599, 582675, 586339, 590681, 595527, 601502, 608443]
59451F08443O772N913N157M367L407K950L138K793J228m86j267j690k614l467
59437F34644l374k794k641k687k236j444p42J54J461K474K714K935L827M702M769
59422F41762M780O010Q366J0809J2948J4955J6485J7044J7087J7712J9298K0934
59410H08190K0807J7102R591P73n668q167q051o977n186k744m23J543L675N041
59396H29506K981l238j0330j4607j6069j6934j7586j6624j3998j1450r989q999
59384F92663p835o610n431m259l397l011k502j429m72m21q41q97p20p41n18M63
59368F54042J561J996K239K944L404K649J397J146J929K639L054L800M705M911
59354F92416M501M433M940N394N610N992O534O874P097P489P748P564P363P498
$$ y = [608443, 615215, 621128, 626285, 630652, 634059, 637009, 640147, 642940, 644168, 643682, 642415, 640725, 638111, 634644, 631270, 628476, 625835, 623148, 620912, 619468, 618726, 618880, 620341, 622815, 625529, 628464, 632291, 636993, 641762, 646542, 652552, 660918, 671727, 684675, 699630, 716115, 733159, 750246, 767958, 787256, 808190, 828997, 846099, 855690, 856463, 850795, 842628, 834577, 827600, 822414, 819670, 819247, 820790, 824465, 829506, 832487, 829249, 818919, 804312, 788243, 771309, 753723, 737099, 723101, 711651, 701662, 692663, 684828, 678218, 672787, 668528, 665131, 662120, 659618, 658189, 657717, 657296, 656455, 655558, 654838, 654097, 653579, 654042, 655603, 657599, 659838, 662782, 666186, 668835, 670232, 671378, 673307, 675946, 679000, 682800, 687505, 692416, 696917, 701350, 706290, 711684, 717294, 723286, 729820, 736694, 743791, 751280, 759028, 766592, 773955, 781453]
59340G81453P261N918M081K748J659q5k329m177n463o614p615q402r520j1067
59326G47848j1750j0594q802q203q577q383p511p201p542p198n750m360l867l766
59312F44344l418k827k028q97K32Q31J081J670K824M337O028P190O375K987j447
59297F67282m895p045q653r586r182p911o835n862m265k449j485j287r35m15k63
59282E96214PJ237K710K945K197K184L460M948N979O865P493P326O899P387Q580
59267F66431R073Q520P874P414O472N220M657M551L379Q23j587k744l192l580
59253G13311l671l391l324l578l574l293l374l768l800l632m035m582l965k334
59239F62990j415j817k171j595j123j722k592k479j438l45K39N6r93k380l285
$$ y = [781453, 788714, 794632, 798713, 801461, 803120, 803035, 800706, 796529, 791066, 784452, 776837, 768435, 758915, 747848, 736098, 725504, 716702, 708499, 699922, 691539, 684028, 676827, 669285, 662087, 656337, 651977, 648110, 644344, 640926, 638099, 636071, 635174, 635406, 636237, 637318, 638988, 641812, 646149, 652177, 659367, 665742, 668729, 667282, 662387, 655342, 646689, 637103, 627921, 620010, 613175, 607313, 603048, 600599, 599114, 597827, 596892, 596477, 596214, 596221, 597458, 600168, 603113, 605310, 607494, 610954, 615902, 621881, 628746, 636239, 643565, 650464, 657851, 666431, 675504, 684024, 691898, 699312, 705784, 711004, 715661, 720212, 723591, 724414, 722827, 720083, 716891, 713311, 709640, 706249, 702925, 699347, 695773, 692480, 689106, 685338, 681538, 677906, 673871, 669289, 665324, 662990, 661575, 659758, 657587, 655992, 654869, 653147, 650555, 648076, 646638, 646293, 646532, 646588, 645595, 643215, 639930]
59224F39930l784m670n885o385n807n010m665m501m219l903l355k267j216j151
59210E83112j798j940j396j259j990k814l186l314l108k183j130j080j785j835
59196E54294r56l69n31n63k48o27j869k543j853q54n36m34K0L60K46K68O76P57
59178E45238L04K50R81J490J071M76M97P86R11J227J841K061J763J864K625K889
59162E66274K001J045J056J350Q35k26r91j579k549l649m190m146l961l781l585
59147E43904l482l446l307l299l812m478m401l544k785k480k179j923k368l310
59133D99090l567k736j681q86J45J386J852J314R55J533K307K570K820L602M431
59118E13135M758M840N021N184N391N936O416O019N005M503M626M465M083M559
$$ y = [639930, 636146, 631476, 625591, 619206, 613399, 608389, 603724, 599223, 595004, 591101, 587746, 585479, 584263, 583112, 581314, 579374, 577978, 576719, 574729, 571915, 568729, 565415, 562307, 560124, 558994, 557914, 556129, 554294, 553338, 552969, 552438, 551875, 551627, 551000, 549131, 546588, 544735, 543881, 543345, 542911, 542931, 543291, 543537, 543805, 544481, 545238, 545542, 545792, 546773, 548263, 549334, 549810, 550307, 551093, 552004, 553231, 555072, 557133, 558896, 560760, 563385, 566274, 568275, 569320, 570376, 571726, 572561, 572335, 571344, 569765, 567216, 563567, 559377, 555231, 551270, 547489, 543904, 540422, 536976, 533669, 530370, 526558, 522080, 517679, 514135, 511350, 508870, 506691, 504768, 502400, 499090, 495523, 492787, 491106, 490220, 490365, 491751, 493603, 494917, 495872, 497405, 499712, 502282, 505102, 508704, 513135, 517893, 522733, 527754, 532938, 538329, 544265, 550681, 556700, 561705, 566208, 570834, 575299, 579382, 583941]
59104E83941N646N572L883K315J964J652L05j130j456j141j060j031q84j313k330
59089E94933k494j144J72n0j071j451j375j858k783l305l295l098k756k508k983
59074E64934l939m097l150k475k824k954j775l34j20q18j212j082q24m09q0p76
59058E38065k434l258k153n72l04q25n96J74P7r81j723j459o14L62J282J806J790
59041E28637J588J411J004N21O16J113R53J12k4R96J726J296J017K127L658M170
59025E50921M047M422N241N995P033Q451R139Q504P801Q027P965O171L460J430
59011F38607r8k070l834m072l163k480k088j207j64K00M02J614L505M635M566
58996F34353L929L047K104J938K970L976L624K522K173K543K469J800J340J217
$$ y = [583941, 589587, 595159, 599042, 601357, 603321, 604973, 605278, 604148, 602692, 601551, 600491, 599460, 598576, 597263, 594933, 592439, 591295, 591467, 591417, 590346, 588895, 587520, 585662, 582879, 579574, 576279, 573181, 570425, 567917, 564934, 560995, 556898, 553748, 551273, 548449, 545495, 543720, 543386, 543266, 542448, 541236, 540154, 539330, 538921, 538841, 538065, 535631, 532373, 530220, 529648, 529344, 528519, 527923, 528097, 528174, 527193, 525470, 524011, 523397, 523759, 525041, 526847, 528637, 530225, 531636, 532640, 533161, 533777, 534890, 535843, 535955, 535931, 536927, 538653, 539949, 540966, 543093, 546751, 550921, 554968, 559390, 564631, 570626, 577659, 586110, 595249, 603753, 611554, 619581, 627546, 633717, 637177, 638607, 638509, 636439, 632605, 628533, 625370, 622890, 620802, 619595, 619431, 619631, 620033, 621647, 625152, 629787, 634353, 638282, 641329, 643433, 645371, 648341, 652317, 655941, 658463, 660636, 663179, 665648, 667448, 668788, 670005]
58982F70005R86Q60J263J677J536J586K859M808O111O675P310Q039Q292Q241Q373
58967G38621Q392P942P733Q392Q956Q115O342N140M794M404L534K304M62k133
58953H12998m635o183p092p971q507q446q620r556j0203r580q510q108p740o395
58939G01452m800m176l981l054j985k114k938k801j551m08K50R04J307Q85K46
58924F77236L80R04Q37M64O21R43O35J47J98J06q67j575o40R94J498J238J845
58907F84964L115L525L258L913N553O700P091P862R059R454Q899Q583Q900R087
58893G79963Q990R229R799J0320J1225J2866J4045J3553J2423J2378J2770J1552
58881I19113Q734O200M575K955J325N02j30k034m755o473p089p999q965q269o106
$$ y = [670005, 670991, 671851, 673114, 674791, 676327, 677913, 680772, 685580, 691691, 698366, 705676, 713715, 722007, 730248, 738621, 747013, 754955, 762688, 771080, 780036, 788151, 794493, 799633, 804427, 808831, 812365, 814669, 815131, 812998, 808363, 802180, 795088, 787117, 778610, 770164, 761544, 751988, 741785, 732205, 723695, 715587, 707847, 701452, 696652, 692476, 688495, 685441, 683456, 681342, 678404, 675603, 674052, 673644, 673894, 674798, 676105, 676990, 677236, 677616, 678520, 679357, 679821, 680442, 681385, 682020, 682167, 682365, 682471, 681604, 680029, 679389, 680383, 681881, 683119, 684964, 688079, 691604, 694862, 698775, 704328, 711028, 718119, 725981, 735040, 744494, 753393, 761976, 770876, 779963, 788953, 798182, 807981, 818301, 829526, 842392, 856437, 869990, 882413, 894791, 907561, 919113, 927847, 934047, 938622, 941577, 942902, 943404, 943274, 941240, 936485, 930012, 922923, 914924, 905959, 897690, 891584]
58866H91584m786n066n203m277l664m369n406n764n839o111o271o298o613o887
58852H15030o457o015o830q305q563p456o701o920o994o607o898q098q866q586
58838G11734q193q238q165p878p934p922o715m624l164k544j558o3O74L47L9J39
58822F45935K8m4P95J961J990J343J900L599M276L270K311K321K124J044J03j53
58806F72803n44j233j302r83j749l525m354l652l223m204n465n979o343o966p028
58791F16253o185n288m648l619k374j912j944j159J49L05n57m99O39Q08l59n51
58775E89059J180K584J918M99n2m39j747l269m045m492n037n007m197l601l519
58760E59835k949j740j123j370j205m23m46j383j309L44J541J100O45J515K462
$$ y = [891584, 886798, 881732, 876529, 872252, 868588, 864219, 858813, 853049, 847210, 841099, 834828, 828530, 821917, 815030, 808573, 802558, 795728, 787423, 778860, 771404, 764703, 757783, 750789, 744182, 737284, 729186, 720320, 711734, 703541, 695303, 687138, 679260, 671326, 663404, 656689, 652065, 648901, 646357, 644799, 644736, 645410, 645757, 645796, 645935, 645963, 645919, 646714, 648675, 650665, 652008, 653908, 657507, 661783, 665053, 667364, 669685, 671809, 672853, 672956, 672803, 672259, 671026, 669724, 668741, 666992, 663467, 659113, 655461, 652238, 648034, 642569, 636590, 630247, 623281, 616253, 610068, 604780, 600132, 596513, 594139, 592227, 590283, 589124, 589273, 589578, 589021, 588522, 589161, 589969, 589610, 589059, 590239, 592823, 594741, 595240, 595188, 594749, 593002, 589733, 585688, 581196, 576159, 571152, 566955, 563354, 559835, 556886, 555146, 554023, 552653, 551448, 551025, 550579, 549196, 547887, 548231, 549772, 550872, 551517, 553032, 555494]
58745E55494K183J635J912K134J349N50R70K109K998L667M121L696K634K399L345
58730E91196M020L709L499L925M014L596M017N410N863M638L569M017M956N461
58716F51890O310P682Q008O809N951O428O551M982K956J726M26j673l420m198
58702G00428n463p975j0000j0268j0163j1027j1846j1592j1296j1684j1339r408
58690E78367p619p434p610o772n864n784n238l419k230l136m268l417j716j393
58676E12467j959j552l36K82L36O41R04P72J305L205N133N823O192P341Q346Q038
58660E56938P083O298M865K230k39j521k722m609n752n251m835n815o520n315
58646E34835l744l769m292l398j969j885k519k080q67k66q4M42N50m88j376q62
$$ y = [555494, 557677, 559312, 561224, 563358, 564707, 565257, 566227, 568336, 571334, 575001, 579122, 582818, 585452, 587851, 591196, 595216, 598925, 602424, 606349, 610363, 613959, 617976, 623386, 629249, 633887, 637456, 641473, 646429, 651890, 658200, 665882, 673890, 680699, 686650, 693078, 699629, 704611, 707567, 709293, 709719, 708046, 704626, 700428, 694965, 686990, 676990, 666722, 656559, 645532, 633686, 622094, 610798, 599114, 587775, 578367, 570748, 563314, 555704, 548932, 543068, 537284, 532046, 528627, 526397, 523261, 518993, 515576, 513860, 512467, 510508, 508956, 508620, 508902, 509238, 509879, 510783, 511555, 512860, 516065, 521198, 527021, 533213, 540554, 548900, 556938, 564021, 570319, 575184, 577414, 577175, 575654, 572932, 568323, 562571, 557320, 552485, 546670, 540150, 534835, 531091, 527322, 523030, 519632, 517663, 515778, 513259, 511179, 510312, 510046, 509962, 510404, 510954, 510466, 509090, 508228]
58630E08228q8m27q28Q9J208R30J41M24J134R83P12J526K591K794L123M587N714
58613E32841M917L503L452M087L780L073L159L146J865O47J264K750L124K583
58599E74191K247J641K52m64M99J332M13o15J45J286R51P54K928N845O520N676
58583F03601O105P620P884O987O932P614P251O009N491N423M440L252L625N055
58569F87289N820O303Q055J0632J2511J4072J6476J8867J9767J9922K0688K1099
58557H61501J9700J7547J6099J4016R612M573J582Rk223m354m438l518m015n441
58543I20650n807n690o826q328q569r062j2032j5741j6850j5962j6034j6764j5536
58530G67449j2799j1361j1191r928p821p206p634o489m047l152m064m352l579
$$ y = [508228, 508140, 507713, 506885, 506974, 508182, 509112, 509253, 509677, 510811, 511794, 512506, 514032, 516623, 519417, 522540, 527127, 532841, 537758, 541261, 544713, 548800, 552580, 555653, 558812, 561958, 563823, 564470, 565734, 568484, 571608, 574191, 576438, 578079, 578331, 577867, 578366, 579698, 580111, 579496, 579641, 580927, 581878, 582632, 585560, 591405, 597925, 603601, 609706, 617326, 625210, 632197, 639129, 646743, 653994, 660003, 665494, 670917, 675357, 678609, 682234, 687289, 693109, 699412, 707467, 718099, 730610, 744682, 761158, 780025, 799792, 819714, 840402, 861501, 881201, 898748, 914847, 928863, 938475, 943048, 944630, 944639, 942416, 938062, 933624, 930106, 926091, 920650, 914843, 909153, 902327, 893999, 885430, 876368, 864336, 848595, 831745, 815783, 799749, 782985, 767449, 754650, 743289, 732098, 722170, 714349, 707143, 699509, 693020, 688973, 685821, 681757, 677405, 673826]
58517F73826l535m101l403j917j892k953k665j164q44j692j451j59r3j333j665
58502F44959p72l63m46M01J550J228L23J030K504K190P12Q95K697L736M015N370
58486F70029O992O535M976N434P728R072R434J0980J2914J2399J0180R756J1204
58473G87633J1177Q834O407M128J83m419o441n898n678o002m675k420k169l279
58459G77381k356M17J760J782L709P227Q576P434P188Q042O604K852O96P69o26
58444H31455m314o715o637o985q404p860n053l668m669m738k894k183l177k427
58430G61731P20K376J193P88K906M593M320M657O462O641M216K567L172K907O0
58415H09309k567l013l095l902l761k652l106m954m828k397j320k540k813j273
$$ y = [673826, 670291, 666190, 662787, 660870, 658978, 656025, 653360, 652196, 651352, 649660, 648209, 648050, 647957, 646624, 644959, 644187, 643824, 643378, 643779, 645329, 646557, 646880, 647910, 650414, 652604, 653316, 654211, 656908, 660644, 664659, 670029, 677021, 683556, 688532, 693966, 701694, 710766, 720200, 731180, 744094, 756493, 766673, 776429, 787633, 798810, 807644, 814051, 818179, 818362, 813943, 807502, 801604, 795926, 789924, 785249, 782829, 780660, 777381, 775025, 775442, 777202, 778984, 782693, 789920, 798496, 805930, 813118, 821160, 827764, 830616, 831312, 832081, 831455, 827141, 820426, 813789, 806804, 798400, 790540, 785487, 781819, 777150, 772412, 769518, 767335, 764158, 761731, 762451, 764827, 766020, 766808, 769714, 774307, 778627, 783284, 789746, 796387, 800603, 803170, 806342, 809249, 809309, 806742, 803729, 800634, 796732, 792971, 790319, 787213, 782259, 777431, 775034, 773714, 771174, 768361, 767088]
58401G67088r58k281j715J202K539J398J719M541N759L929L016M822N828M331
58387H01218L589M985N201L082K205L740L884J396M31K805M745M420N286Q646
58373H55633J0474R121Q642J0911J1971R923Q724J0369J1069R136Q851J2179J4433
58360I91436J2654J0686J1506J2116J0511R998J1980J2183Q714O201P316Q069
58348A113370O134N597Q553J0320Q254P008R606J1610R891Q789J1635J4439J4025
58335A239231J4188J7588J9791J7803J6256J8650K0626J8556J6511J7884J8395
58324A435479J4611J1178J2311J4047J2236J0315J1877J3447J1918J1254J4480
58313A573153J7097J5596J4407J7149J9509J8137J7776K1863K5114K3449K2191
$$ y = [767088, 766130, 763849, 762134, 763336, 765875, 767273, 768992, 773533, 779292, 783221, 786237, 791059, 796887, 801218, 804807, 809792, 814993, 818075, 820280, 824020, 827904, 829300, 829731, 832536, 837281, 841701, 846987, 855633, 866107, 875228, 883870, 894781, 906752, 916675, 925399, 935768, 946837, 955973, 964824, 977003, 991436, 1004090, 1014776, 1026282, 1038398, 1048909, 1058907, 1070887, 1083070, 1091784, 1097985, 1105301, 1113370, 1119504, 1125101, 1133654, 1143974, 1152228, 1159236, 1168842, 1180452, 1190343, 1199132, 1210767, 1225206, 1239231, 1253419, 1271007, 1290798, 1308601, 1324857, 1343507, 1364133, 1382689, 1399200, 1417084, 1435479, 1450090, 1461268, 1473579, 1487626, 1499862, 1510177, 1522054, 1535501, 1547419, 1558673, 1573153, 1590250, 1605846, 1620253, 1637402, 1656911, 1675048, 1692824, 1714687, 1739801, 1763250, 1785441]
58302A785441K6085L0269K9747K8741L1878L5123L4388L4015L7761M0623L8713
58291B152784L7756M2391M6825M5677M4230M7974N2029N1224N0538N5002N9422
58280B685852N8840N8805O4251O8973O7447O6151P1311P6776P6333P6621Q4704
58269C456064R4274R7620J00045J08631J18127J22170J26941J39095J51625J56496
58259D671088J59509J67712J74477J72790J70611J76598J83555J83043J83071
58250F242454J93351K06586K13145K20532K38451K58312K68223K74791K88874
58241H404719L03470L07885L10002L21639L35675L41118L46624L64800L87809
58232A1423741M03679M21606M54691M93180N22428N51366N94358O41398O76753
$$ y = [1785441, 1811526, 1841795, 1871542, 1900283, 1932161, 1967284, 2001672, 2035687, 2073448, 2114071, 2152784, 2190540, 2232931, 2279756, 2325433, 2369663, 2417637, 2469666, 2520890, 2571428, 2626430, 2685852, 2744692, 2803497, 2867748, 2936721, 3004168, 3070319, 3141630, 3218406, 3294739, 3371360, 3456064, 3550338, 3647958, 3748003, 3856634, 3974761, 4096931, 4223872, 4362967, 4514592, 4671088, 4830597, 4998309, 5172786, 5345576, 5516187, 5692785, 5876340, 6059383, 6242454, 6435805, 6642391, 6855536, 7076068, 7314519, 7572831, 7841054, 8115845, 8404719, 8708189, 9016074, 9326076, 9647715, 9983390, 10324508, 10671132, 11035932, 11423741, 11827420, 12249026, 12703717, 13196897, 13719325, 14270691, 14865049, 15506447, 16183200]
58223A6183200P10086P57222Q07561Q44059Q77230R24236R73681J008786J045412
58214B4131473J107148J183770J256671J342657J466330J612653J756782J916331
58206C5773815K120765K355880K597373K871105L216511L622468M071634M615193
58198F1244744N325469O214328P288032Q632725J0330259J2332022J4533723J6901613
58190A42802915J9364434K1688560K3716726K5593011K7226592K7387534K3948972
58183C11728744J5711158L995675p946196j7181641k2660687k4919976k4958354
58176B33768723k3640366k1681331j9615917j7684570j5916975j4321902j2904697
58169A08002965j1587384j0270774q963801p754829o684012n732514m904877m227750
$$ y = [16183200, 16893286, 17650508, 18458069, 19302128, 20179358, 21103594, 22077275, 23086061, 24131473, 25238621, 26422391, 27679062, 29021719, 30488049, 32100702, 33857484, 35773815, 37894580, 40250460, 42847833, 45718938, 48935449, 52557917, 56629551, 61244744, 66570213, 72784541, 80072573, 88705298, 99035557, 111367579, 125901302, 142802915, 162167349, 183855909, 207572635, 233165646, 260392238, 287779772, 311728744, 327439902, 331435577, 323489381, 306307740, 283647053, 258727077, 233768723, 210128357, 188447026, 168831109, 151146539, 135229564, 120907662, 108002965, 96415581, 86144807, 77181006, 69426177, 62742165, 57009651, 52104774, 47877024]
58161D7877024l681823l214247k809611k484621k226358j997742j792882j630381
58153B8039359j501418j376399j253916j154659j075282r93474r10683q46718
58145A8926810p99027p47684o93940o55259o28418n94358n54025n24194n03119
58136A3226786m74286m39660m16312m03736l85739l61587l45332l37002l23130
58127I740002l03724k91331k85338k73255k55645k44652k39749k29176k13553
58118G403579k04361k00743j91006j75712j66747j64635j58620j48263j43692
58109E849800j45020j42184j34616j31138j30986j24713j13530j08349j09725
58100D709539j07510j00453r7547r9712r8305r2470r0345r2230q9685q2273p8593
$$ y = [47877024, 44195201, 40980954, 38171343, 35686722, 33460364, 31462622, 29669740, 28039359, 26537941, 25161542, 23907626, 22752967, 21677685, 20684211, 19773528, 18926810, 18127783, 17380099, 16686159, 16030900, 15402482, 14808124, 14254099, 13729905, 13226786, 12752500, 12312840, 11896528, 11492792, 11107053, 10745466, 10400134, 10063132, 9740002, 9436278, 9144947, 8859609, 8586354, 8330709, 8086057, 7846308, 7617132, 7403579, 7199218, 6998475, 6807469, 6631757, 6465010, 6300375, 6141755, 5993492, 5849800, 5704780, 5562596, 5427980, 5296842, 5165856, 5041143, 4927613, 4819264, 4709539, 4602029, 4501576, 4404029, 4304317, 4206012, 4113542, 4023197, 3930967, 3841282, 3759009, 3680416]
58089C680416p9645p7371p0795o7694o9056o7425o1929n9829o1837o0729n5887
58078B948219n4556n7332n6868n2518n1821n5737n6473n2038m9273n0206m8805
58067B362592m3669m0946m2160m1542l7827l6580l8479l7408l2513l0385l2822
58056A948261l3946l1785l1354l3801l3818l0359k8991l1070l1253k8219k7193
58045A606472k9357k9328k5791k4229k6337k6902k4050k2653k4621k5437k3270
58034A324497k2214k3697k3707k1213k0443k2303k2430k0019j9659k2107k2340
58023A084365j9096j7265j8376j7936j4770j3757j6347j7459j4969j3448j5106
58012I05836j5756j3306j1820j3464j4393j2421j1031j2197j2567j0327q735r493
$$ y = [3680416, 3600771, 3523400, 3452605, 3384911, 3315855, 3248430, 3186501, 3126672, 3064835, 3004106, 2948219, 2893663, 2836331, 2779463, 2726945, 2675124, 2619387, 2562914, 2510876, 2461603, 2411397, 2362592, 2318923, 2277977, 2235817, 2194275, 2156448, 2119868, 2081389, 2043981, 2011468, 1981083, 1948261, 1914315, 1882530, 1851176, 1817375, 1783557, 1753198, 1724207, 1693137, 1661884, 1633665, 1606472, 1577115, 1547787, 1521996, 1497767, 1471430, 1444528, 1420478, 1397825, 1373204, 1347767, 1324497, 1302283, 1278586, 1254879, 1233666, 1213223, 1190920, 1168490, 1148471, 1128812, 1106705, 1084365, 1065269, 1048004, 1029628, 1011692, 996922, 983165, 966818, 949359, 934390, 920942, 905836, 890080, 876774, 864954, 851490, 837097, 824676, 813645, 801448, 788881, 778554, 769819, 760326]
58000G60326r621p860p286q649q286n400m288o450p711o022m941o406p262o060
57986F64084o024q184q628n913m197n736p129o264n991p602p629m743l032m711
57972E78301o187m995m106n612o628n258m398n753o212m009k459l776n032l951
57958E09925k892l509l360j418r60l312m724l242k495m740o349m526k464l218
57944D62716m212k629p98j275j748K75K474K215J496K768M171L419K225K515K468
57929D76080M28j407j239j348l586n576n416n552p796r124o997m428m947o662
57915D12430o220m796n202o441o050m769m373l784j647J94j40r34k79O1j821l806
57899C62423l201j350q13r29j34L36r58k199j453l39q37j398j33J113L3j649j113
$$ y = [760326, 750705, 742845, 735559, 726910, 718624, 713224, 708936, 702486, 694775, 688753, 683812, 677406, 670144, 664084, 658060, 649876, 641248, 635335, 631138, 625402, 618273, 612009, 606018, 598416, 590787, 586044, 583012, 578301, 572114, 567119, 563013, 557401, 550773, 545515, 541117, 535364, 529152, 525143, 522684, 518908, 513876, 509925, 507033, 503524, 500164, 498746, 497786, 494474, 489750, 486508, 484013, 479273, 472924, 468398, 465934, 462716, 458504, 455875, 455077, 453802, 452054, 452329, 454803, 457018, 458514, 461282, 465453, 468872, 471097, 473612, 476080, 476508, 475101, 473862, 472514, 468928, 463352, 457936, 452384, 444588, 435464, 428467, 424039, 419092, 412430, 406210, 401414, 396212, 389771, 383721, 378952, 374579, 370795, 369148, 369342, 369202, 368268, 367989, 368050, 366229, 362423, 359222, 357872, 357059, 356130, 355996, 356332, 355374, 353175, 351722, 351383, 350546, 349148, 349015, 350128, 350161, 348512, 347399]
57882C47399O57J005K12O4J38o62j110P2J195L63r58n83N04L83n5R29K401K619
57864C54573K233K539K697J833J439K652L704L080K550L863N278M708L468L441
57850C98058L363J590j86J88J354J034J03K92M54j052k685k329j242j636k596
57835C94710k295j833k900l921k735q67r60j932j024J155J938J361J388J800J033
57820C84918j41K73J715K133J709J915K001J44k896m675m721m276l522k128j239
57805C71210j906k729j974n96m08r98j235j929l893n346m528k971k925l580l156
57790C33036k607l552m566l405j135k58m27K34J195Q16q4K07Q31K32k94J112K813
57773C24148K132K23R1J279R97o78j378j124j929l502l785l083l341m019l059
$$ y = [347399, 348056, 349061, 349273, 349337, 349475, 348813, 347703, 347775, 348970, 349333, 348375, 347792, 348296, 348679, 348624, 349553, 351954, 354573, 356806, 359345, 362042, 363875, 365314, 367966, 371670, 374750, 377300, 381163, 386441, 391149, 394617, 398058, 401421, 403011, 402825, 403013, 404367, 405401, 405504, 405796, 406250, 405198, 402513, 400184, 398942, 397306, 394710, 392415, 390582, 387682, 383761, 381026, 380159, 379199, 377267, 376243, 377398, 379336, 380697, 382085, 383885, 384918, 384777, 385050, 386765, 388898, 390607, 392522, 394523, 394667, 391771, 387096, 382375, 378099, 374577, 372449, 371210, 369304, 366575, 364601, 364005, 363597, 362599, 361364, 359435, 355542, 350196, 345668, 342697, 339772, 336192, 333036, 330429, 326877, 322311, 318906, 317771, 317513, 317086, 317320, 318515, 319331, 319247, 319454, 320285, 320517, 320223, 321335, 324148, 326280, 326503, 326594, 327873, 328870, 328192, 326814, 325690, 323761, 320259, 316474, 313391, 310050, 306031, 302972]
57758C02972j283j405l111l447j943r87j252r23M65J398J685K597L748L517K488
57743C04519K771M030L871K191J409K272K982K622K091J655P63R7O79J367M68
57728C33787q82m33J008R44j38L04J890J832J42l15R50J347K01j73R17J167l77
57711C42171j671j525j387k167k739k593k731l105k380r11o31j483j369j57Rj064
57695C16267r90P28J530K59r20m84J55j90l96L08P66N41J168L190M818M929M751
57678C36430N242N593N658O969R889J2382J3270J4110J6414J9296K1479K3239
57666D89971K4787K4720K1537J5175O246m345j4342k1021k3918k4808k4574k2498
57654D46930j9095j6754j6455j6413j5056j3081j1493r965q163o649n511m073
$$ y = [302972, 301689, 300284, 297173, 293726, 291783, 290796, 289544, 288621, 289086, 290484, 292169, 294766, 298514, 302031, 304519, 307290, 311320, 315191, 317382, 318791, 321063, 324045, 326667, 328758, 330413, 331176, 331273, 331952, 333319, 333787, 332905, 332472, 333480, 334424, 334286, 334590, 336480, 338312, 338454, 338139, 339089, 340436, 340637, 340464, 341381, 342548, 342171, 340500, 338975, 337588, 335421, 332682, 330089, 327358, 324253, 321873, 320962, 320331, 318848, 317479, 317322, 317331, 316267, 315277, 316005, 317535, 317794, 316874, 316390, 316545, 316355, 315959, 316267, 317033, 317574, 318742, 321932, 326750, 331679, 336430, 341672, 347265, 352923, 359892, 369781, 382163, 395433, 409543, 425957, 445253, 466732, 489971, 514758, 539478, 561015, 576190, 582436, 578091, 563749, 542728, 518810, 494002, 469428, 446930, 427835, 411081, 394626, 378213, 363157, 350076, 338583, 328618, 320455, 313806, 308295, 304222]
57642C04222k604k207k593k258j228j065j731j367J65N78j004k380j835n98m19
57627B83676j021j453j755k057j951j711k255l199l089k017j605k010j647m45
57613B57461l82j874k739j872r92j407j914j433q63p97q4J641K547J463j86q71
57597B47698j133j675j719q65l71r06j192m55M1n84j084m57Q7o78j842k065j635
57580B31165j240n85L26L89p11j566j402j338k031k152p44Q60J031K8j153k260
57564B18617k926k275o16L74K40L99J322J513M75n2P77J261L68j63J014K156J330
57547B23814k99n45L78Q96Q57J013J189J098J529K796L426K276N04k54j81j52
57531B38345M4O22N77o27j657j299l55k5O3N75R67P92Q89J654J915J083N83J496
$$ y = [304222, 301618, 299411, 296818, 294560, 293332, 292267, 290536, 289169, 289334, 289912, 288908, 286528, 284693, 284095, 283676, 282655, 281202, 279447, 277390, 275439, 273728, 271473, 268274, 265185, 263168, 261563, 259553, 257906, 257461, 257079, 255205, 252466, 250594, 249602, 248195, 246281, 244848, 243985, 243188, 243104, 244745, 247292, 248755, 248569, 247698, 246565, 244890, 243171, 242306, 241935, 241029, 239837, 239382, 239423, 238839, 237755, 237298, 237385, 236707, 234865, 232800, 231165, 229925, 229340, 229666, 230055, 229344, 227778, 226376, 225038, 223007, 220855, 220111, 220971, 222002, 222030, 220877, 218617, 215691, 213416, 212800, 213174, 213414, 213813, 215135, 216648, 217123, 217071, 217848, 219109, 219477, 219314, 220328, 222484, 223814, 223515, 222970, 223348, 224244, 225101, 226114, 227303, 228401, 229930, 232726, 236152, 238428, 238932, 238678, 238497, 238345, 238389, 239011, 239588, 238961, 237304, 236005, 235650, 235625, 235688, 236263, 237230, 238022, 238911, 240565, 242480, 243563, 244146, 245642]
57513B45642K638K675K303K491K508J558N42L18M9q54j027N41K374K669J855J125
57497B67407L24p50r42K07R57P5q95l14P14N17j18K54Q76M74L2J055K594K826
57479B75293K090J734J454N14jR55J794O57j093r43M80N57q62j604j059o36o92
57462B78638k36N37L47o08r07n17n72q74k20J005J233N37N10J348J647J101J008
57445B83977J894K817L178L307L218K633K100K315K690K297J684J882K298J745
57431C18035Q47J161K344K716K131J894K107J679Q50J131K565L406K806J785J285
57416C46742J295J966L542N005M792L183K192K838M117M798M625L735K450J724
57402C93004K314L585M349M555M819M867M177L528M058N274N805N644N784O138
$$ y = [245642, 248280, 250955, 253258, 255749, 258257, 259815, 260357, 260675, 260724, 259870, 258843, 259384, 261758, 264427, 266282, 267407, 267731, 266981, 266039, 266246, 267203, 267278, 266383, 266069, 266783, 267300, 267182, 267436, 268312, 268786, 268818, 269873, 272467, 275293, 277383, 279117, 280571, 281085, 281084, 282039, 283833, 284490, 283397, 282454, 282934, 283491, 282629, 281025, 279966, 279330, 278638, 278402, 278939, 279286, 278678, 277771, 277254, 276682, 275808, 275588, 276593, 277826, 278363, 278873, 280221, 281868, 282969, 283977, 285871, 288688, 291866, 295173, 298391, 301024, 303124, 305439, 308129, 310426, 312110, 313992, 316290, 318035, 318882, 320043, 322387, 325103, 327234, 329128, 331235, 332914, 333764, 334895, 337460, 340866, 343672, 345457, 346742, 348037, 350003, 353545, 358550, 363342, 366525, 368717, 371555, 375672, 380470, 385095, 388830, 391280, 393004, 395318, 398903, 403252, 407807, 412626, 417493, 421670, 425198, 429256, 434530, 440335, 445979, 451763, 457901]
57388D57901N870N346N662O551O788O415O527P103P063O344N951O144O382O730
57374E46777P521Q043P558P050P894R305R432Q494Q359R270R630Q984Q625R015
57360F65957R045Q274P679P787Q061Q423R477J0989J2001J2565J3491J4458J4368
57347H02575J3517J3357J4107J4710J5058J6014J7282J7618J7263J7771J9218
57336I78490J9964J9523J9279J9916K0477K0522K0937K1941K2457K2143K2041
57325A207690K2627K3102K3224K3843K5042K5716K5596K5813K6835K7722K7959
57314A485169K8286K9064K9699L0121L1128L2712L3816L4183L4718L5700L6398
57303A840994L6771L7670L9056L9954M0503M1964M4295M5801M5793M5472M5636
$$ y = [457901, 463771, 469117, 474779, 481330, 488118, 494533, 501060, 508163, 515226, 521570, 527521, 533665, 540047, 546777, 554298, 562341, 569899, 576949, 584843, 594148, 603580, 612074, 620433, 629703, 639333, 648317, 656942, 665957, 675002, 683276, 690955, 698742, 706803, 715226, 724703, 735692, 747693, 760258, 773749, 788207, 802575, 816092, 829449, 843556, 858266, 873324, 889338, 906620, 924238, 941501, 959272, 978490, 998454, 1017977, 1037256, 1057172, 1077649, 1098171, 1119108, 1141049, 1163506, 1185649, 1207690, 1230317, 1253419, 1276643, 1300486, 1325528, 1351244, 1376840, 1402653, 1429488, 1457210, 1485169, 1513455, 1542519, 1572218, 1602339, 1633467, 1666179, 1699995, 1734178, 1768896, 1804596, 1840994, 1877765, 1915435, 1954491, 1994445, 2034948, 2076912, 2121207, 2167008, 2212801, 2258273, 2303909]
57292B303909M5595M5095M5253M6715M8621N0194N1699N3214N4225N4913N6135
57281B855568N7692N8483N8776O0295O3502O6882O9497P2177P5513P8732Q1345
57270C598462Q3845Q6002Q6522Q5346Q4269Q4320Q4333Q2989Q0475P7305P3421
57259D507289O9342O6364O4717O3248O1738O1586O3343O5512O6837O7936O9664
57248E227576P1646P3498P5772P8691Q1442Q3594Q5612Q7341Q7744Q6799Q5763
57237F125478Q4864Q2810P9343P6177P4444P3312P2115P1578P1892P1747P0636
57226F954396P0048P1097P2929P4735P7236Q0736Q3769Q5151Q5467Q5000Q2226
57215G822790P6076O7992O0077N2911M6620M2306M0538L9967L9141L8344L8153
$$ y = [2303909, 2349504, 2394599, 2439852, 2486567, 2535188, 2585382, 2637081, 2690295, 2744520, 2799433, 2855568, 2913260, 2971743, 3030519, 3090814, 3154316, 3221198, 3290695, 3362872, 3438385, 3517117, 3598462, 3682307, 3768309, 3854831, 3940177, 4024446, 4108766, 4193099, 4276088, 4356563, 4433868, 4507289, 4576631, 4642995, 4707712, 4770960, 4832698, 4894284, 4957627, 5023139, 5089976, 5157912, 5227576, 5299222, 5372720, 5448492, 5527183, 5608625, 5692219, 5777831, 5865172, 5952916, 6039715, 6125478, 6210342, 6293152, 6372495, 6448672, 6523116, 6596428, 6668543, 6740121, 6812013, 6883760, 6954396, 7024444, 7095541, 7168470, 7243205, 7320441, 7401177, 7484946, 7570097, 7655564, 7740564, 7822790, 7898866, 7966858, 8026935, 8079846, 8126466, 8168772, 8209310, 8249277, 8288418, 8326762, 8364915]
57204H364915L7796L6561L5429L5644L6918L8446M0354M2818M5270M7838N2021
57193H814010N8436O5477P1584P7278Q3417Q9139R3238R6063R8369R9763R9883
57182I746657R9581R9293R7867R4825R2190R2003R3440R4374R4408R4217R3215
57171A0792070R0280Q5931Q1724P8101P4787P2556P2690P5175P9076Q4153R0700
57160A1677243R8398J06616J15099J23183J29266J32199J32052J28426J19615
57151A2762097J05210Q8119P2124N8355M5909L4716K5821J9718J6317J5813J7705
57140A3261904J9534J8386J3327N076n838j9157l3851m8587o2721p5606q5902
57129A2986565r2906r7775j02096j06037j09058j11207j12272j10809j05893r9086
$$ y = [8364915, 8402711, 8439272, 8474701, 8510345, 8547263, 8585709, 8626063, 8668881, 8714151, 8761989, 8814010, 8872446, 8937923, 9009507, 9086785, 9170202, 9259341, 9352579, 9448642, 9547011, 9646774, 9746657, 9846238, 9945531, 10043398, 10138223, 10230413, 10322416, 10415856, 10510230, 10604638, 10698855, 10792070, 10882350, 10968281, 11050005, 11128106, 11202893, 11275449, 11348139, 11423314, 11502390, 11586543, 11677243, 11775641, 11882257, 11997356, 12120539, 12249805, 12382004, 12514056, 12642482, 12762097, 12867307, 12955426, 13027550, 13085905, 13131814, 13166530, 13192351, 13212069, 13228386, 13244199, 13261904, 13281438, 13299824, 13313151, 13318227, 13312389, 13293232, 13259381, 13210794, 13148073, 13072467, 12986565, 12893659, 12795884, 12693788, 12587751, 12478693, 12367486, 12255214, 12144405, 12038512, 11939426]
57119A1939426r3261r0251r0798r5471j03765j13096j20437j24521j25441j23232
57109A0859153j18275j12078j05975r9643r1870q1628o7185m5513j4149K7294
57099A0150131P8764J41737K18610L11531M22861N54433P04169Q65081J030549
57090A4477866J201029J385266J596007J844457K135444K464244K814577L150970
57082C1069860L401164L446381L153212K451580J406635K17356q69984j674379
57074D2601825k143977k341074k374409k331523k251888k143494k012054j871851
57066B5131555j736810j611464j492725j375564j255280j128593r96037q62368
57058A4672714p33420o13401n04874m08996l25076k51690j88693j36747r4993
$$ y = [11939426, 11846165, 11755914, 11665116, 11569645, 11465880, 11352784, 11232347, 11107826, 10982385, 10859153, 10740878, 10628800, 10522825, 10423182, 10331312, 10249684, 10182499, 10136986, 10122837, 10150131, 10228895, 10370632, 10589242, 10900773, 11323634, 11878067, 12582236, 13447317, 14477866, 15678895, 17064161, 18660168, 20504625, 22640069, 25104313, 27918890, 31069860, 34471024, 37917405, 41070617, 43522197, 44928832, 45146188, 44276204, 42601825, 40457848, 38116774, 35742365, 33410842, 31158954, 29015460, 27003406, 25131555, 23394745, 21783281, 20290556, 18914992, 17659712, 16531119, 15535082, 14672714, 13939294, 13325893, 12821019, 12412023, 12086947, 11835257, 11646564, 11509817, 11414824]
57049A1414824o1133l3780j2742L146J6404K8818M0601N1602O1671O9918P5514
57038A1654843P9177Q2232Q4541Q5232Q5084Q6187Q9483R4481J00675J06800J09273
57027A2658008J04447R2805P8594O5209N3096M2035L2615K4984J8550J3467J0344
57016A3194154Q292N521K265P07J825M603Q591J4573K1880K7769L0508L1104L1030
57003A3382822L0351K9052K8252K8923L0760L3180L6035L8840M0745M1688M2149
56992A3762797M1574L8795L4306L0370K8452K8195K9090L1221L4002L5991L6463
56981A4131256L5648L3332K9058K3913K0247J9181J9952K1586K3368K3825K1548
56970A4402914J7253J2872Q704L705j480m611n357n889p337q346p915p026o401
$$ y = [11414824, 11353691, 11319911, 11307169, 11310315, 11326719, 11355537, 11396138, 11447740, 11509411, 11579329, 11654843, 11734020, 11816252, 11900793, 11986025, 12071109, 12157296, 12246779, 12341260, 12441935, 12548735, 12658008, 12762455, 12855260, 12933854, 12999063, 13052159, 13094194, 13126809, 13151793, 13170343, 13183810, 13194154, 13202446, 13207967, 13210232, 13210939, 13212764, 13217367, 13225958, 13240531, 13262411, 13290180, 13320688, 13351792, 13382822, 13413173, 13442225, 13470477, 13499400, 13530160, 13563340, 13599375, 13638215, 13678960, 13720648, 13762797, 13804371, 13843166, 13877472, 13907842, 13936294, 13964489, 13993579, 14024800, 14058802, 14094793, 14131256, 14166904, 14200236, 14229294, 14253207, 14273454, 14292635, 14312587, 14334173, 14357541, 14381366, 14402914, 14420167, 14433039, 14441743, 14445448, 14443968, 14439357, 14434000, 14428111, 14420774, 14412428, 14404513, 14397487, 14391086]
56957A4391086n388m258n209r549j5879k2259k8214l3547l7338l9612m2058m5781
56945A4101994m9882n3305n6328n9195o1100o1772o2384o3724o5034o5652o6160
56934A3437458o7040o7780o8268o9429p1762p4946p9543q6933r6541j05201j10346
56923A2539669j12064j11210j07782j02477r7617r4786r3254r2008r1733r3424
56913A1543314r6747j00983j05979j10992j14406j15936j17238j19162j20239
56904A0541632j19357j17845j17231j16745j14976j12409j10414j08995j07344
56895I516316j05509j03832j01793r8834r5321r1472q6573q0507p4715p0410o7238
56884H540112o4986o5007o8356p3766p9067q3520q7314r0164r1943r3603r5823
$$ y = [14391086, 14385698, 14381440, 14376231, 14366682, 14350803, 14328544, 14300330, 14266783, 14229445, 14189833, 14147775, 14101994, 14052112, 13998807, 13942479, 13883284, 13822184, 13760412, 13698028, 13634304, 13569270, 13503618, 13437458, 13370418, 13302638, 13234370, 13164941, 13093179, 13018233, 12938690, 12851757, 12755216, 12650015, 12539669, 12427605, 12316395, 12208613, 12106136, 12008519, 11913733, 11820479, 11728471, 11636738, 11543314, 11446567, 11345584, 11239605, 11128613, 11014207, 10898271, 10781033, 10661871, 10541632, 10422275, 10304430, 10187199, 10070454, 9955478, 9843069, 9732655, 9623660, 9516316, 9410807, 9306975, 9205182, 9106348, 9011027, 8919555, 8832982, 8752475, 8677760, 8607350, 8540112, 8475126, 8410119, 8341763, 8267997, 8188930, 8105410, 8018096, 7927932, 7835989, 7742386, 7646563]
56873G646563r7726r8262r7872r7443r6762r5456r4338r4318r4867r4885r4215
56862F590419r3011r0607q6453q1561p7935p7195q0420q8117r9146j10539j19430
56851E586005j24620j26107j24474j21275j18306j15553j11343j05223r8970r3852
56841D446282q8903q3066p7061p1733o6421o0499n4810n0069m5737m2491m4010
56830C761482n3950p1808r3216j13245j28179j35797j36272j32244j26468j19819
56820B650484j12327j04671r7446r0320q3153p6629p0651o3698n5083m6243l8500
56809A811763l1206k3471j6098j0484p648r599j9035l5314n2693o5110p1392p3838
56797A395875p3684p0661o5431n9564n3745m8082m3258l9460l5439l0467k5816
$$ y = [7646563, 7548837, 7450575, 7352703, 7255260, 7158498, 7063042, 6968704, 6874386, 6779519, 6684634, 6590419, 6497408, 6406801, 6320348, 6238787, 6160852, 6083657, 6003237, 5915120, 5815974, 5705435, 5586005, 5461385, 5335278, 5210804, 5089529, 4971223, 4855670, 4744327, 4639104, 4540134, 4446282, 4357379, 4274313, 4197252, 4125519, 4059098, 3998599, 3943789, 3893720, 3847983, 3805492, 3761482, 3707532, 3635724, 3542508, 3429263, 3301084, 3165287, 3029015, 2896771, 2770303, 2650484, 2538157, 2433486, 2336040, 2245720, 2162567, 2085938, 2015287, 1951589, 1896506, 1850263, 1811763, 1780557, 1757086, 1740988, 1730504, 1722856, 1713257, 1694222, 1658908, 1606215, 1541105, 1469713, 1395875, 1322191, 1251530, 1186099, 1126535, 1072790, 1024708, 981450, 941990, 906551, 876084, 850268]
56786H50268k2394j8642j3060p051k696N26L876N715K999m397j3758k3037l1403
56773G26946l7317l9319l8479l7202l5850l3196k9648k7088k5717k3923k1335
56762C77872j9290j8154j6705j4506j2540j1217r923q664q188q271p862p015o760
56749B28777p051o748n667m804m536m366m341m934n603n286m230l601l488l002
56735A61120k162j873k205k382k334k560k768k268j402r71p01m9K12r08k502k805
56719A33442j929j441j687j678j308j441j996j997j440j139r05M1J119R30l39
56704A18232j139j042r98j202q23J43O90N16K96K84L05P17J685K052Q87m83j25
56687A19995J366J778Q45L73J047J689J699J713J751J065P8J19J040J234K54o57
$$ y = [850268, 827874, 809232, 796172, 789121, 786425, 786951, 790827, 796542, 799541, 795144, 781386, 758349, 726946, 689629, 650310, 611831, 574629, 538779, 505583, 475935, 448847, 423130, 399207, 377872, 358582, 340428, 323723, 309217, 296677, 285460, 275537, 266873, 258685, 250414, 242552, 235537, 228777, 221726, 214978, 209311, 204507, 199971, 195605, 191264, 186330, 180727, 175441, 171211, 167610, 164122, 161120, 158958, 157085, 154880, 152498, 150164, 147604, 144836, 142568, 141166, 140195, 139494, 139445, 139657, 138749, 136247, 133442, 131513, 130072, 128385, 126707, 125399, 123958, 121962, 119965, 118525, 117386, 116481, 116522, 117641, 118571, 118232, 117093, 116051, 115053, 113851, 113028, 113171, 113861, 114377, 114673, 114957, 115262, 115979, 117664, 119716, 120603, 120120, 119995, 121361, 123139, 123984, 124357, 125404, 127093, 128792, 130505, 132256, 133321, 133399, 133518, 134558, 135792, 136046, 135389]
56671A35389q75j017j202p83o4k02j156j636j242q16p14o00p53j629k359j744
56655A18597m94k22p06m86K34Qq15m05J158J755Q08J28O80J278J136J052J401
56638A25107J324O84N19R29P34k26p38n13o18j181j090l56l22j035r67J33O18
56621A23002j04n67M2N91K45k55m09p87j352j117j64J30n33r33o69o37q40k17
56603A15426R25R45o1q0J300J970Q52l84k98L20N17P79J335J238L07k68j56m87
56585A24180j422j562n92K5j39L20J748K514K023J753K237J967N75K4J117J888
56569A36656J145O25J641K559J795O84J008K110K753L538N109O072N100L240K011
56554A76046R79o57j911j676r12j025j585j538j215j324j423j153j393k532l174
$$ y = [135389, 134514, 133497, 132295, 131512, 131448, 131246, 130090, 128454, 127212, 126396, 125682, 125082, 124329, 122700, 120341, 118597, 118103, 117881, 117175, 116689, 116923, 116931, 116116, 115711, 116869, 118624, 119432, 119560, 120240, 121518, 122654, 123706, 125107, 126431, 127115, 127634, 128563, 129297, 129071, 128333, 127820, 127202, 126021, 124931, 124575, 124253, 123218, 122251, 122384, 123002, 122898, 122331, 122373, 122964, 123209, 122954, 122545, 121758, 120406, 119289, 119125, 119255, 118722, 117789, 117120, 116483, 115643, 115426, 116351, 117296, 117235, 117155, 118455, 120425, 121277, 120893, 120595, 120915, 121432, 122211, 123546, 124784, 125091, 124823, 124667, 124180, 122758, 121196, 120604, 120629, 120490, 120810, 122558, 125072, 127095, 128848, 131085, 133052, 133627, 133651, 134768, 136656, 137801, 138426, 140067, 142626, 144421, 145105, 146113, 148223, 150976, 154514, 159623, 165695, 170795, 174035, 176046, 177025, 176368, 174457, 172781, 171869, 170844, 169259, 167721, 166506, 165182, 163759, 162606, 161213, 158681, 155507]
56539A55507k341j310j508k179j907r44k96Q2N22N66J42L34J505K242J542M37
56523A52394P2m2m48l66N54J049L95j09N03J030L16o04m52L8k79q22o66m38r70
56504A51155j668j805j905k242j774k26P00m3r46m61M51K64m93n63j97j16J32
56487A40263R10J230N12j51n6l28j525k008o48R11Q59O0R0N11K88J04Q42J559
56469A43423J221P32J091J313M10m22J07R86Q61M88R01J077m3j085l88J150J849
56452A53671K049K614K542R06o63l13Q20N23q57j471j167q84l31R35J619O36n38
56435A60091j41P68L20o79k69J096J538J096J102J420J134P96J232J419K86q00
56419A70409j41J168J181N47R82J806J351M16Q37J912J671N42L43O10m08k053
$$ y = [155507, 153166, 151856, 150348, 148169, 146262, 145318, 145022, 145104, 145626, 146192, 146334, 146668, 148173, 150415, 151957, 152394, 152466, 152424, 151976, 151610, 152164, 153213, 153608, 153499, 154002, 155032, 155348, 154744, 154292, 154330, 154051, 153229, 152563, 152125, 151155, 149487, 147682, 145777, 143535, 141761, 141535, 142235, 142192, 141246, 140785, 141236, 141500, 141007, 140444, 140247, 140131, 140263, 141173, 142403, 142915, 142764, 142708, 142380, 140855, 138847, 138199, 139110, 139969, 140029, 140119, 140630, 140918, 141022, 141864, 143423, 144644, 145376, 146467, 147780, 148190, 147768, 147875, 148861, 149722, 150210, 151111, 152188, 152145, 151060, 150672, 151822, 153671, 155720, 158334, 160876, 161782, 161119, 160806, 161626, 162149, 161292, 159821, 158654, 157770, 157439, 158374, 159993, 160629, 160091, 159950, 160718, 161038, 160359, 160090, 161186, 162724, 163820, 164922, 166342, 167476, 168272, 169504, 170923, 171209, 170409, 170268, 171436, 172617, 173164, 174146, 175952, 177303, 177719, 178556, 180468, 182139, 182681, 183024, 183634, 183226, 181173]
56403A81173k109p50j74p80r76l74oJ80J041J922J498L86K35Q84J111J233K162
56386A86656L010K496J644K022K589J578J68O72K281K352J057Q09J778J882Q65
56371B11859N11J069J055M93Q61J984K271J801J972K422J641J66j31N05L49l15
56355B28513K00J413J351L14L46J313J240K17K23J283J528R51J343K654L070K596
56339B48555K899L698L088J345O41J065P49k23M9J253J109k96m38J119K223K377
56323B69213L370N178N429L702K410K631K827K409K740L849L847K554K116L160
56309C15435L805L321L304M430N377N681O402P391P155N971N835O892P202O356
56295C94557N941O256O093N833P120R255R795Q855Q928J0318J0842J0245J0672
$$ y = [181173, 179064, 178314, 178140, 177360, 176384, 176010, 176004, 176184, 177225, 179147, 180645, 181031, 181266, 182150, 183261, 184494, 186656, 189666, 192162, 193806, 195828, 198417, 199995, 200163, 200835, 203116, 205468, 206525, 207334, 209112, 210994, 211859, 212370, 213439, 214494, 214987, 215848, 217832, 220103, 221904, 223876, 226298, 227939, 228105, 227974, 228479, 228828, 228513, 228713, 230126, 231477, 231791, 232137, 233450, 234690, 234907, 235130, 236413, 237941, 238892, 240235, 242889, 245959, 248555, 251454, 255152, 258240, 259585, 260226, 261291, 262040, 261817, 261866, 263119, 264228, 263932, 263494, 264613, 266836, 269213, 272583, 277761, 283190, 286892, 289302, 291933, 294760, 297169, 299909, 303758, 307605, 310159, 312275, 315435, 319240, 322561, 325865, 330295, 335672, 341353, 347755, 355146, 362301, 368272, 374107, 380999, 388201, 394557, 400498, 406754, 412847, 418680, 425800, 435055, 444850, 453705, 462633, 472951, 483793, 494038, 504710]
56282E04710J2356J3160J2845J3416J4826J4806J3506J3681J5619J6542J5942
56271F61409J6590J9274K1328K1724K2830K5690K8162K9309L1045L3940L5941
56260I47242L6928L9859M5618N1197N4881N8867O4794P1116P6862Q3639R1897
56249A622900R9409J05391J11936J19374J24689J26559J27593J29226J28699J23558
56239B819334J15022J04561R1121P4265N6093L7677J7405m877k5981m3809n9892
56228C180919p5295q8029r6828j03590j09712j13736j14842j14828j14465j11866
56218B137728j06600j01342r7306r2212q5089p8767p5026p1521o6177o0624n6567
56207A246497n2757m8188m4425m2108l9059l4319l0277k8313k6437k3499k1491
$$ y = [504710, 517066, 530226, 543071, 556487, 571313, 586119, 599625, 613306, 628925, 645467, 661409, 677999, 697273, 718601, 740325, 763155, 788845, 817007, 846316, 877361, 911301, 947242, 984170, 1024029, 1069647, 1120844, 1175725, 1234592, 1299386, 1370502, 1447364, 1531003, 1622900, 1722309, 1827700, 1939636, 2059010, 2183699, 2310258, 2437851, 2567077, 2695776, 2819334, 2934356, 3038917, 3130038, 3204303, 3260396, 3298073, 3315478, 3310601, 3284620, 3240811, 3180919, 3105624, 3017595, 2920767, 2817177, 2707465, 2593729, 2478887, 2364059, 2249594, 2137728, 2031128, 1929786, 1832480, 1740268, 1655179, 1576412, 1501386, 1429865, 1363688, 1303064, 1246497, 1193740, 1145552, 1101127, 1059019, 1019960, 985641, 955364, 927051, 900614, 877115, 855624]
56196H55624k1213k0021j6609j3684j3166j3031j1565j0415j0550r720o922m967
56184G03761n559o210n015m036m815n049l098j327j585j712J6J319K71r89l26
56169F65646P78Q99J734M155N555M505L703N044O189N374M954O708Q294P965Q086
56154G39589J0381J2447J2654J3622J7084K0267K1220K2643K6522L0146L1689
56143I58264L4360M0577M7154N0950N4042N8564O1603O0305N7034N4423N0263
56132A527539M2559L4804L0895K9252K6911K4705K3447K0004J2530M840M67k814
56120A775139p675j1864j3392j5688k1884k9202l4544m0172m7969n3736n3454
56109A445559m9958m7283m3816l7399l1451k9187k7215k1797j6096j4168j3275
$$ y = [855624, 834411, 814390, 797781, 784097, 770931, 757900, 746335, 735920, 725370, 715650, 708728, 703761, 698202, 691992, 686977, 682941, 678126, 673077, 669979, 668652, 667067, 665355, 665371, 666690, 666961, 665972, 665646, 666424, 667323, 669057, 673212, 678767, 683272, 686975, 692019, 698208, 703582, 708536, 715244, 723538, 731503, 739589, 749970, 762417, 775071, 788693, 805777, 826044, 847264, 869907, 896429, 926575, 958264, 992624, 1033201, 1080355, 1131305, 1185347, 1243911, 1305514, 1365819, 1422853, 1477276, 1527539, 1570098, 1604902, 1635797, 1665049, 1691960, 1716665, 1740112, 1760116, 1772646, 1777486, 1777953, 1775139, 1767464, 1755600, 1742208, 1726520, 1704636, 1675434, 1640890, 1600718, 1552749, 1499013, 1445559, 1395601, 1348318, 1304502, 1267103, 1235652, 1206465, 1179250, 1157453, 1141357, 1127189, 1113914]
56098A113914r412n153m354m378j253K427K558J529L404O010N639M805P318J0482
56084A133536J0172Q900J0813J3500J2866J1288J2713J4641J3247J1434J3358
56073A266468J6110J5400J4184J6873K0338J9835J8403K0988K4670K4342K2734
56062A480345K4851K7903K6917K4994K7539L1602L1499K9746L1635L4436L3013
56051A804480L0724L3279L7301L6693L4858L8391M4101M4874M3166M5783N0501
56040B244151N1020N0142N4405O0538O1112N8922O1739O7443O8703O7837P2322
56029B918334P9984Q3435Q4962R1914J01731J06746J09508J17745J28658J34017
56019C957034J36215J43069J51556J53523J52599J57996J66513J68678J67789
$$ y = [1113914, 1104502, 1099349, 1094995, 1090617, 1089364, 1091791, 1094349, 1095878, 1099282, 1105292, 1110931, 1115736, 1123054, 1133536, 1143708, 1152608, 1163421, 1176921, 1189787, 1201075, 1213788, 1228429, 1241676, 1253110, 1266468, 1282578, 1297978, 1312162, 1329035, 1349373, 1369208, 1387611, 1408599, 1433269, 1457611, 1480345, 1505196, 1533099, 1560016, 1585010, 1612549, 1644151, 1675650, 1705396, 1737031, 1771467, 1804480, 1835204, 1868483, 1905784, 1942477, 1977335, 2015726, 2059827, 2104701, 2147867, 2193650, 2244151, 2295171, 2345313, 2399718, 2460256, 2521368, 2580290, 2642029, 2709472, 2778175, 2846012, 2918334, 2998318, 3081753, 3166715, 3258629, 3360360, 3467106, 3576614, 3694359, 3823017, 3957034, 4093249, 4236318, 4387874, 4541397, 4693996, 4851992, 5018505, 5187183, 5354972]
56010E354972J74291J86148J94036K00854K15967K34904K45627K50433K60542
56001G317774K73772K79545K81144K90082L03084L08410L10303L22561L42547
55992A0029222L57182L69824L94420M27674M55075M79796N16303N59990N94038
55983A4183524O21979O61168P08279P45185P74730Q14863Q61569Q95831R23766
55974B1190894R70152J035689J102421J176860J282262J412215J541007J676499
55966C1387999J850528K061157K281478K521759K820411L178190L571929M030970
55958E3704421M624019N375573O282907P407152Q837688J0562871J2490121J4579767
55950A23864519J6802806J8987715K0945072K2735007K4376896K5021123K2827652
$$ y = [5354972, 5529263, 5715411, 5909447, 6110301, 6326268, 6561172, 6806799, 7057232, 7317774, 7591546, 7871091, 8152235, 8442317, 8745401, 9053811, 9364114, 9686675, 10029222, 10386404, 10756228, 11150648, 11578322, 12033397, 12513193, 13029496, 13589486, 14183524, 14805503, 15466671, 16174950, 16920135, 17694865, 18509728, 19371297, 20267128, 21190894, 22161046, 23196735, 24299156, 25476016, 26758278, 28170493, 29711500, 31387999, 33238527, 35299684, 37581162, 40102921, 42923332, 46101522, 49673451, 53704421, 58328440, 63704013, 69986920, 77394072, 86231760, 96794631, 109284752, 123864519, 140667325, 159655040, 180600112, 203335119, 227712015, 252733138, 275560790]
55943B75560790J6356086O250148m780068j3816735j9481778k2044788k2427154
55936B15616501k1469140j9831747j8017905j6284804j4677568j3203116j1886048
55929A00246173j0686880r513025q341007p238056o254873n381342m612295l971528
55921D4247167l454240l015272k630729k314500k064573j848530j652191j491866
55913B5775266j368516j256249j145208j052376r81245r11586q37409p76541p34048
55904A6712088o92134o44208o04789n77813n47645n09435m77637m56696m32561
55895A1769170m00825l75287l60978l45331l23577l07332l00449k90751k73356
55886H791284k59208k53260k46158k34312k26784k25578k19809k06118j94966
$$ y = [275560790, 291916876, 298167024, 293386956, 279570221, 260088443, 238043655, 215616501, 194147361, 174315614, 156297709, 140012905, 125335337, 112132221, 100246173, 89559293, 80046268, 71705261, 64467205, 58212332, 52830990, 48218695, 44247167, 40792927, 37777655, 35146926, 32832426, 30767853, 28919323, 27267132, 25775266, 24406750, 23150501, 22005293, 20952917, 19971672, 19060086, 18222677, 17446136, 16712088, 16019954, 15375746, 14770957, 14193144, 13645499, 13136064, 12658427, 12201731, 11769170, 11368345, 10993058, 10632080, 10286749, 9963172, 9655840, 9355391, 9064640, 8791284, 8532076, 8278816, 8032658, 7798346, 7571562, 7345984, 7126175, 6920057, 6725091]
55877F725091j90383j82990j69364j59115j56274j52077j42763j36657j37075
55868E298393j35440j27887j22009j20911j16944j07586j01390j01804j00671
55859D263751r4175q9864r1366r1236q5797q2421q4975q6109q1200p6597p6805
55848C323206p6355p1638o8355o9928p0260o5290o0522o0171n9514n4898n0964
55837B615311n1275n1589m8810m7091m8928m9564m6102m3137m3731m3683m0138
55826B101263l7079l7127l6625l3775l2865l5480l6457l3430l1538l3663l4944
55815A718280l2185k9835l1149l2000k9117k6312k6830k7344k5021k3060k3821
55804A411606k3883k1058j9044k0015j9981j6533j3909j5158j6583j5129j4137
$$ y = [6725091, 6534708, 6351718, 6182354, 6023239, 5866965, 5714888, 5572125, 5435468, 5298393, 5162953, 5035066, 4913057, 4792146, 4675202, 4567616, 4466226, 4364422, 4263751, 4169576, 4079712, 3988346, 3897110, 3811313, 3728892, 3643917, 3557808, 3476608, 3400011, 3323206, 3246851, 3175213, 3106858, 3036930, 2966670, 2901380, 2840858, 2780687, 2721173, 2666275, 2615311, 2564036, 2512447, 2463637, 2416546, 2367618, 2318054, 2271952, 2228815, 2185084, 2141401, 2101263, 2064184, 2027057, 1990432, 1956657, 1923792, 1888312, 1851855, 1818425, 1786887, 1753224, 1718280, 1686095, 1656260, 1625111, 1593111, 1563994, 1537682, 1510852, 1483508, 1458487, 1435427, 1411606, 1387723, 1366665, 1347621, 1327606, 1307625, 1291092, 1277183, 1262025, 1245442, 1230313, 1216176]
55793A216176j6397j8513j7679j7229j9898k2060k0306j7587j7358j7658j6300
55782A015191j5942j8557k0573j9011j6943j7579j8245j5545j1431r003p122m109
55770H41131k205l606o520r297j3621j9665k3246k2089j9845j9718j9382j6555
55758F65382j4057j4533j5327j3581j1589j2125j3061j1645r688r713j0162r073
55746E20828q284r431r965p756n572o355p998p364n715n656o366o146o079p131
55732D21010p266n381m288n936p610o762n503o285p284o292n112n706o042m177
55718C37366k555l688n284m232j906r55m15J514L107K121K3r80j970m284n839
55703C12023m717l159l836n359n552n711p454q754p509n744n919o368m783k877
$$ y = [1216176, 1199779, 1181266, 1163587, 1146358, 1126460, 1104400, 1084094, 1066507, 1049149, 1031491, 1015191, 999249, 980692, 960119, 941108, 924165, 906586, 888341, 872796, 861365, 852362, 845240, 841131, 838926, 835320, 828800, 819503, 805882, 786217, 762971, 740882, 721037, 701319, 681937, 665382, 651325, 636792, 621465, 607884, 596295, 584170, 571109, 559464, 549776, 540063, 529901, 520828, 512544, 503113, 493148, 485392, 479820, 473465, 465467, 458103, 452388, 446732, 440366, 434220, 428141, 421010, 413744, 408363, 404075, 398139, 390529, 383767, 378264, 371979, 364695, 358403, 353291, 347585, 341543, 337366, 334811, 331123, 325839, 321607, 319701, 318746, 318331, 319845, 322952, 325073, 325096, 324116, 322146, 317862, 312023, 307306, 304147, 300311, 294952, 289400, 283689, 276235, 267481, 259972, 254228, 248309, 241941, 237158, 234281]
55689B34281l051l736k577j113j563k250q65P70R6j141j99J369P26p09j11J116
55673B21043r0k573l023j939k176l418l255k209k496l289k136J33P30j15j9Q96
55657A96064P45MN41J612J168n9P5R23M37n33K40J841J502m97j504j196j496k601
55639A97266l034k935l506m129l565k988m110n552m914l174l011l987l601k084
55625A46676j788k576k145n16j9j034j582j074q26j106r50o52j202j784r48L54
55609A28828J34j071j222n21p31j619j539q11j048j822j434l31k96r14l50J041
55593A16294J315N46M02P43J36r48q52q7m34j334q36M92K89j319j885q72r0l1
55575A11529O79K135K855K705K959L482K910J556J051J261N52j067k011k064k292
$$ y = [234281, 231230, 227494, 224917, 223804, 222241, 219991, 219126, 219896, 219992, 218851, 218652, 220021, 220747, 220038, 219927, 221043, 220953, 218380, 215357, 213418, 211242, 207824, 204569, 202360, 199864, 196575, 194439, 194572, 195302, 195187, 195168, 196064, 196809, 196813, 197354, 198966, 200134, 200075, 200150, 201073, 201510, 200977, 201217, 203058, 204560, 204063, 202559, 201363, 199867, 197266, 194232, 191297, 187791, 183662, 180097, 177109, 172999, 167447, 162533, 159359, 156348, 152361, 148760, 146676, 144888, 142312, 140167, 139651, 139632, 138598, 137016, 135942, 135116, 134010, 133060, 132408, 131206, 129422, 128474, 128828, 128962, 127891, 126669, 126148, 125417, 123798, 122259, 121448, 120400, 118578, 117144, 116813, 116517, 115603, 115253, 116294, 117609, 118155, 118557, 119300, 119436, 118488, 117636, 117549, 117115, 115781, 114945, 115437, 115726, 114407, 112522, 111650, 111560, 111529, 112208, 114343, 117198, 119903, 122862, 126344, 129254, 130810, 131861, 133122, 133674, 132607, 130596, 128532, 126240]
55560A26240k518j903j469k813m797m893l391k853l743m125l495l341l837l476
55546G9586k155j353j175l18R97J324J027J788L162L037J503Q16J407J428M14
55531I1488q0K37p8r97p72N62Q44l97j045j07P57K60p39j348j836k079j356j94
55513H3120n4q62j172q21q86j145l80R19J079L94O69J770J787P14M76J247J160
55496H8015N0j00J006J266Qq70m68l00j151j724j405j389k033j980r02k79n85
55479G7159m77M20Q07M91R26K209K536J453O60P73L92p92j120k74j97j510k186
55462H1270j086J85L05J67L79j58j664k311j306l64o60r45k47K62k72p04k69r7
55444G2485o89m98J193K488J838N36L48Q10P02K63K11K89L13Q58J691J481K07
$$ y = [126240, 123722, 121819, 120350, 117537, 112740, 107847, 104456, 101603, 97860, 93735, 90240, 86899, 83062, 79586, 77431, 76078, 74903, 74585, 75582, 76906, 77933, 79721, 82883, 85920, 87423, 88239, 89646, 91074, 91488, 91408, 91645, 91567, 90570, 89798, 90360, 91204, 90807, 89762, 89655, 90412, 90672, 89933, 88585, 86749, 84670, 83314, 83120, 83066, 82204, 81032, 80211, 79325, 78180, 77800, 78719, 79798, 80192, 80861, 82631, 84418, 85132, 85608, 86855, 88015, 88065, 87965, 88971, 90237, 90245, 89375, 88907, 88607, 87456, 85732, 84327, 82938, 80905, 78925, 78023, 77744, 77159, 76682, 77102, 77909, 78400, 79326, 81535, 84071, 85524, 86184, 86957, 87349, 86557, 85437, 85163, 84966, 83456, 81270, 80184, 80369, 80674, 80841, 81220, 81062, 79398, 77087, 75781, 75417, 74757, 73812, 73565, 73827, 73555, 72851, 72582, 72485, 71796, 71298, 72491, 74979, 76817, 77353, 77701, 78511, 79213, 79476, 79687, 79976, 80289, 81147, 82838, 84319, 84526]
55427H4526l40M22O59o63j864j439m64l86o67l58K1n8J85J027J124j25j126o51
55409G9823J70J22N9Q76J443N68p41j066r27j391j891j436n63j95L9P31J182P47
55391G7550L03P83J532J590J264J012K85j040j624o45O13P00P4k50n30j172j316
55374G9129l16P42P10K73M94Q12K02q28j141q27o56o12m13m65r52j042k71M48
55356G5287L41Q2M16P88O34N84J030R49l43j583j377l73k9l11k18L15N40K46k78
55337G6700r01j324r89r8K99q4l01N0J12m40o06L8M55J43Q7O83P10k42n10Q63
55317G4645K147J573J21l56r7m10j143j299j053j159j278p09J43N70Q39J305J374
55300G5213O67J5K4K3l30m2J228J963J159J29K39O38J46m19O2O96K48m42k9P57
$$ y = [84526, 84186, 84608, 85267, 84604, 82740, 81301, 80837, 80451, 79784, 79426, 79447, 79389, 79574, 80601, 81725, 81600, 80474, 79823, 79993, 80115, 80174, 81050, 82493, 83061, 82320, 81254, 80327, 78936, 77045, 75609, 75046, 74851, 74890, 75621, 76803, 77550, 77853, 78636, 80168, 81758, 83022, 84034, 84319, 83279, 81655, 81010, 81623, 82323, 82397, 82147, 81617, 80445, 79129, 78813, 79555, 80265, 80538, 81032, 81844, 82046, 81218, 80077, 79250, 78594, 77982, 77569, 77104, 76152, 75110, 74839, 75287, 75628, 75710, 76126, 76914, 77548, 78132, 79162, 80111, 79768, 78185, 76808, 76435, 76406, 76095, 75877, 76192, 76732, 76978, 76700, 75799, 74475, 73486, 73388, 73687, 73603, 73302, 73352, 73464, 73024, 72418, 72456, 72911, 73054, 73141, 73824, 74534, 74292, 73782, 74645, 76792, 78365, 78486, 78130, 78033, 77623, 76480, 75181, 74128, 72969, 71691, 70982, 71125, 71695, 72534, 73839, 75213, 75880, 75895, 75919, 75942, 75612, 75570, 76798, 78761, 79920, 80049, 80288, 80926, 81072, 80653, 80715, 81411, 81659, 81217, 81188, 81945]
55280H1945M82l82n70n37j339k178j582j46M29K09M98J176J038K59J02N85O54
55263H0643L03L87O79K39o14o81nL27J29Q5J47k37o45k26O43Q53L57p5l63q58
55243H1088j156p95m30p65j037k88O69L89p84j282p32j3N42J161J478J067N71
55226G9683O88P62mq10n85q3o42j674j548l07O31Q21Q35O46j5l28M88J457J308
55207H1323Q08J322J987J045q20j354n17m09j504j954q93K84N02L03Q9n61j273
55190G8378q12P13J616J178N39N65O92L95Q8l3l60p84p11l71n64j004o57K24K73
55171G9365n91q94k5R14J063Q62P21L52j52j00M91P78N04J81j19o37p91J43J273
55152H3338J002l37p72J56P57Q9o51l22M34N59J32k32k55J98J026J377N37o73
$$ y = [81945, 82427, 82045, 81475, 80938, 79599, 77421, 75839, 75693, 76122, 76331, 76829, 78005, 79043, 79302, 79404, 79989, 80643, 80946, 81333, 82012, 82251, 81637, 80956, 80951, 81278, 81407, 81492, 81639, 81402, 80757, 80531, 81174, 82027, 82384, 82309, 81946, 81088, 79932, 79137, 78707, 77942, 76905, 76617, 77286, 77675, 76891, 75609, 74877, 74864, 75406, 76567, 78045, 79112, 79683, 80371, 81133, 81129, 80319, 79734, 79651, 79009, 77335, 75787, 75480, 76111, 76932, 77767, 78413, 78398, 78070, 78558, 80015, 81323, 82131, 83453, 85440, 86485, 85665, 84311, 83794, 83385, 81881, 79927, 79034, 79318, 79820, 80123, 80212, 79651, 78378, 77566, 78279, 79895, 81073, 81612, 82177, 82869, 83264, 83352, 83319, 82959, 82175, 81464, 81093, 80529, 79525, 78868, 79092, 79365, 78774, 77880, 77855, 78769, 79832, 80694, 81415, 81767, 81615, 81515, 82006, 82784, 83288, 83469, 83350, 82713, 81922, 82065, 83338, 84340, 84003, 83231, 83387, 84144, 84233, 83582, 83260, 83694, 84253, 84385, 84153, 83898, 84096, 85122, 86499, 87036, 86363]
55134H6363q21p5J55l39m22J07K00k41p4P75Q87j33q38l93J99O3k00l8L3j49K03
55113H5262J118J330M35r8P63J914J925J075M32J07k66m51j59J84J16j73m54q18
55095I2242j021n05L65L42q78j972j793p09L62J098J440J353J320J961K716K262
55079I8583O26o05n85j70n1L43J283J738J087L33N34J165J160M88l10j128j904
55062A02587k148j717j249j090p81j50J64n2L3Q89J701J628R69L53k06p16p21
55045I9494k11j1n08r80q53o12p08o11K09J212J545J077J32r95j732j376j53P84
55027I5703Q59O56N64J04q33j337q30r1o3n75r12q19l92K29N77J91m57m39J0l46
55007I1799j576k049p78J156K227K287J900J224M71L13Q59J197P62J63jp2l80
$$ y = [86363, 85542, 85467, 85622, 85283, 84861, 84968, 85168, 84927, 84853, 85628, 86515, 86382, 85544, 85151, 85350, 85413, 85213, 85175, 85208, 85059, 85262, 86380, 87710, 88145, 88047, 88810, 90724, 92649, 93724, 94156, 94263, 93997, 93546, 93387, 93571, 93687, 93514, 93060, 92242, 91221, 90716, 91081, 91423, 90545, 88573, 86780, 86071, 86433, 87531, 88971, 90324, 91644, 93605, 96321, 98583, 99209, 98604, 98019, 97849, 97798, 98141, 99424, 101162, 102249, 102582, 103116, 104281, 105441, 105929, 105619, 104491, 102587, 100439, 98722, 97473, 96383, 95602, 95452, 95616, 95564, 95597, 96486, 98187, 99815, 100784, 101137, 100931, 100215, 99494, 99283, 99272, 98764, 97784, 96931, 96319, 95611, 95000, 95209, 96421, 97966, 99043, 99175, 98180, 96448, 95072, 94919, 95703, 96562, 97218, 97782, 97886, 97053, 95716, 94886, 94795, 94732, 94157, 93245, 92426, 92034, 92263, 92840, 93031, 92574, 92135, 92145, 91799, 90223, 88174, 87396, 88552, 90779, 93066, 94966, 96190, 96661, 96974, 97833, 99030, 99792, 99955, 99954, 99882, 99502]
54990I9502n11k72k74p30q45j98M20K96q2o8Q9j1j44j18j28K4Q91K022K111J057
54970A03031L67P89J190P12J90L81M82k03p55l07K91L0l78R3Q32P59L08M77Q18
54951A09107K99o09n80L54R18O19P4l02n87o12k19L9m46j246j440q82j00N80J000
54932A05967R24N98Q57J764K108J173N7J01R58J432J376J479J880K336L015L912
54916A29937M127K989J287K29k04o99j212j391j608k313k979k911k487k371k292
54901A18102j784j327j411j372n89Q3l20r66n30M50M93r6L06J715K261J140k06
54884A15949k83O85J719K410K687K378J684J251J419J907K333K396J708K73j036
54869A37480j254n56K0j04p09j405j854j729j177r60j417j771j323o31n76r33
$$ y = [99502, 98991, 98719, 98445, 97715, 96870, 96672, 97092, 97388, 97306, 97238, 97327, 97316, 97172, 97054, 96926, 96950, 97841, 99863, 101974, 103031, 103398, 104187, 105377, 106089, 106279, 106660, 107142, 106939, 106184, 105877, 106168, 106198, 105820, 105913, 106745, 107504, 107812, 108289, 109107, 109406, 108797, 108217, 108571, 109489, 110108, 110182, 109880, 109293, 108681, 108462, 108501, 108055, 106809, 105369, 104487, 104387, 104967, 105967, 106891, 107489, 108346, 110110, 112218, 113391, 113448, 113549, 114507, 115939, 117315, 118794, 120674, 123010, 126025, 129937, 134064, 137053, 138340, 138569, 138365, 137666, 136454, 135063, 133455, 131142, 128163, 125252, 122765, 120394, 118102, 116318, 114991, 113580, 112208, 111619, 111702, 111382, 110416, 109886, 110336, 110829, 110733, 111039, 112754, 115015, 116155, 115949, 115666, 116351, 118070, 120480, 123167, 125545, 127229, 128480, 129899, 131806, 134139, 136535, 138243, 138516, 137480, 136226, 135670, 135690, 135586, 134877, 133472, 131618, 129889, 128712, 127752, 126335, 124564, 123241, 122610, 122034, 121101]
54853A21101j011j045j630k259j911p67m1k05o84j054j418j628j326p59n03m80
54837A04380k04K25L07R4Kl2k35k38L46R68Q24J64k01k82o16j021q99m66l87m54
54817A02275k2N82M22l70p17l30l2k48m92m22k14J39Q20J379J077J12n42m95k01
54798A02721P7N10R98J201J196J200Q79jo73l12M52L32n20p03K56J374J915K105
54780A13007K027J252Jo86l54K71M78M20M65O68J066J713K291K456K517K942L383
54763A33917L183K582K311K207J477K03o94j013j423k071k324k072j935k020j733
54748A30595j100r46j496j919j659j114p49m94l25l77l53J77P63M59o73j476j312
54731A18001o33J20J036J900K102J628J217J244J421J649K183K811K988K827K842
$$ y = [121101, 120090, 119045, 117415, 115156, 113245, 112478, 112437, 112232, 111548, 110494, 109076, 107448, 106122, 105363, 104860, 104380, 104176, 104401, 104708, 104802, 104804, 104772, 104537, 104299, 104645, 105613, 106437, 106601, 106400, 106118, 105502, 104481, 103582, 103116, 102729, 102275, 102253, 102835, 103257, 102887, 102170, 101840, 101808, 101560, 101068, 100646, 100432, 100571, 101391, 102770, 103847, 103959, 103417, 102922, 102721, 102798, 103308, 104306, 105507, 106703, 107903, 108782, 108781, 108108, 107796, 108248, 108580, 108060, 107357, 107613, 108987, 110902, 113007, 115034, 116286, 116287, 115601, 115247, 115518, 115996, 116416, 116881, 117549, 118615, 120328, 122619, 125075, 127592, 130534, 133917, 137100, 139682, 141993, 144200, 145677, 145880, 145186, 144173, 142750, 140679, 138355, 136283, 134348, 132328, 130595, 129495, 128549, 127053, 125134, 123475, 122361, 121612, 121118, 120793, 120416, 120063, 120240, 121003, 121462, 120789, 119313, 118001, 117368, 117488, 118524, 120424, 122526, 124154, 125371, 126615, 128036, 129685, 131868, 134679, 137667, 140494, 143336]
54716A43336K685J483n06j904k163k152k503k694k248j617j323j233j145j183
54702A26833j271j122r49j254j812j831j183m40K23J005J464R29j39o23n73r86
54686A18271j784j770q45l48p85j020l38M66P16Q41R57K62j234j985j093K08M21
54669A10940j45k94K38R19J355J190J63r79p79Q26J994J438J07n60o40q59j044
54652A13870q29p64j279j451l18J402K208J846J212P64K80k74o63q57q06k81M14
54635A14474L11q67j992j994j265p17l73Q8K94j71p47o76j95Q1L08Q73J313R28
54617A09673K2n29n75n44m52k3N57Q93J031J123R04K59k42j50J16O2J5L32M78
54598A12950j01r09j165j030j003p61J44J032Q84J4l51P4M53L59K18K30L2m40
$$ y = [143336, 146021, 147504, 146998, 145094, 142931, 140779, 138276, 135582, 133334, 131717, 130394, 129161, 128016, 126833, 125562, 124440, 123491, 122237, 120425, 118594, 117411, 116971, 117194, 118199, 119663, 120592, 120453, 119830, 119257, 118271, 116487, 114717, 113872, 113524, 112739, 111719, 111381, 111847, 112563, 113404, 114361, 114623, 113389, 111404, 110311, 110519, 110940, 110795, 110501, 110739, 111658, 113013, 114203, 114366, 113387, 112608, 113434, 115428, 116866, 116973, 116413, 115773, 114914, 113870, 113041, 112277, 110998, 109547, 109229, 110631, 112839, 114685, 115897, 116661, 116941, 116667, 116004, 115147, 114341, 114060, 114474, 114785, 113918, 111926, 109932, 108667, 107950, 107577, 107665, 107959, 107788, 107041, 106365, 106170, 106251, 106559, 107432, 108745, 109673, 109695, 109166, 108591, 108047, 107595, 107572, 108129, 109022, 110053, 111176, 112080, 112339, 112097, 111947, 112063, 112125, 112140, 112472, 112950, 112849, 111940, 110775, 109745, 108742, 107981, 108125, 109157, 110041, 110055, 109704, 109778, 110231, 110590, 110808, 111038, 111070, 110630]
54580A10630o95m88q8K48M54L44j35m96k03M86Q46O91M32K91J69J45M36R00J211
54561A15178J327J317R84K80k45n9M95O46L05Nm4j28l52l91oO77J386J843J837
54542A25055J449J013O28Rq83j552j579j123n42k8J10m04j069q27L90J233P33
54525A22613l37p12m19l02m59l33J16M37N73P34P13K32k91k57O8k5m80n89j86
54506A21096J68J45l2j20k6M08J102J402P34n15j383j473j096n69%L97M63L85
54488A21086L73K73l9k14KK49J49J2L05Q33J171J430J877K200J875R87N0o44r07
54469A31068m52N13J065P01J46K62P19P28M01L53N07L87J28N6k20j077j739j253
54451A32293k54j97r87j035J31J002L73q91j203l91M22M46o1m36m15k24j57j31
$$ y = [110630, 109935, 109447, 109359, 109607, 110061, 110405, 110270, 109774, 109571, 110057, 110903, 111594, 112026, 112317, 112486, 112631, 113067, 113967, 115178, 116505, 117822, 118806, 119086, 118841, 118782, 119277, 119923, 120228, 120233, 120189, 120061, 119709, 119318, 119312, 119989, 121375, 123218, 125055, 126504, 127517, 128145, 128154, 127271, 125719, 124140, 123017, 122475, 122447, 122557, 122153, 121084, 120257, 120647, 121880, 122613, 122276, 121564, 121145, 120843, 120384, 120051, 120167, 120604, 121177, 121911, 122624, 122856, 122565, 122308, 122376, 122351, 121871, 121282, 121096, 121264, 121409, 121377, 121257, 121231, 121639, 122741, 124143, 124877, 124362, 122979, 121506, 120410, 119841, 119841, 120238, 120701, 121086, 121459, 121732, 121693, 121479, 121481, 121730, 121879, 121891, 122196, 123029, 124200, 125630, 127507, 129707, 131582, 132569, 132619, 131975, 131068, 130616, 131129, 132194, 132895, 133041, 133303, 134022, 134750, 135151, 135504, 136011, 136398, 136526, 136582, 136362, 135285, 133546, 132293, 132039, 131842, 130855, 129820, 129951, 130953, 131326, 130435, 129232, 128841, 129263, 129709, 129648, 129212, 128797, 128573, 128416, 128285]
54433A28285J56O54R19Q21P83R58Q19L0q35j157j106j014n52M75J203P07m69r20
54415A29757k75N41P30L45k64p40o86j10L44K89L12R47J568J313N33J53J49m0
54397A34866j04O27J646J803J162P96Q31L83n90j019n34K2J77M27R29J058P14
54380A43194O97J296J835K046K526L289L332K335J491J688K087J519L55j32L11
54365A67869P62M88k62p68o01qK78j56q54j068p72n50o36p91r10j030r07m98n55
54346A59031j639k831k717j500p05p72o16K30P35K23m77n35l78o07q77p96p81
54329A44988j158j394j109r14j301j641j205l63J37L12M92M87J35n2L18O87M36
54312A38855KJ47O31N33m09j567k268k206j366j93N31N41M47Q04J283J294R50
$$ y = [128285, 128441, 129095, 130014, 130835, 131618, 132576, 133395, 133425, 132590, 131433, 130327, 129313, 128761, 129236, 130439, 131146, 130677, 129757, 129482, 130023, 130753, 131098, 130834, 130094, 129408, 129298, 129642, 129931, 130243, 131190, 132758, 134071, 134604, 134757, 134906, 134866, 134762, 135389, 137035, 138838, 140000, 140796, 141627, 142010, 141420, 140401, 139867, 139889, 140066, 140493, 141422, 142480, 143194, 143891, 145187, 147022, 149068, 151594, 154883, 158215, 160550, 162041, 163729, 165816, 167335, 167690, 167558, 167869, 168631, 169119, 168857, 168089, 167488, 167480, 167758, 167602, 166748, 165680, 164908, 164358, 163722, 162931, 162021, 160991, 160084, 159586, 159031, 157392, 154561, 151844, 150344, 149639, 148867, 148251, 148481, 149216, 149439, 148962, 148427, 148049, 147442, 146565, 145769, 144988, 143830, 142436, 141327, 140413, 139112, 137471, 136266, 135903, 136040, 136352, 136844, 137331, 137466, 137414, 137732, 138419, 138855, 138857, 139004, 139635, 140168, 139759, 138192, 135924, 133718, 132352, 132159, 132690, 133231, 133678, 134482, 135765, 137059, 138009]
54295A38009P55P14M33j85q17j074p19Q4O20K86m56n02L22J026J099J243J947
54278A42785K443J949R77M02P4n61j223j307j030r54p84J25J381J898J508J158
54262A48841J395J644J229L21l94n23k74k10p27j489j633p95L50R18Q08M78J77
54245A50116p5q2L57R91J355J252P50l9q15j058n96Q6L96K37j91o90r42o74k70
54226A50108n64j583k222j696o09J12N28J054J270M65r93j917j779j071l65K04
54210A40942O21Q96J191J411R71l41j574j566m76M13L73j37l98k32J94O58Q65
54193A43811O87M24L54K90M9%M49P82J90r19j279n86O3j91p82o61L32J480K090
54174A46583J967J332O45K61R1j34l10o4M89O91J97n31q62p33m47j51J26J69k84
$$ y = [138009, 138764, 139478, 139911, 139726, 138909, 137835, 137116, 137200, 137820, 138106, 137650, 137148, 137470, 138496, 139595, 140838, 142785, 145228, 147177, 148154, 148556, 148630, 148069, 146846, 145539, 144509, 143555, 142771, 142896, 144277, 146175, 147683, 148841, 150236, 151880, 153109, 153430, 153036, 152513, 152239, 152029, 151302, 149813, 148180, 147385, 147735, 148653, 149461, 149939, 150116, 150041, 149959, 150316, 151307, 152662, 153914, 154664, 154625, 153810, 152752, 152156, 152242, 152638, 152875, 152684, 151994, 151052, 150378, 150108, 149544, 147961, 145739, 144043, 143434, 143546, 144074, 145128, 146398, 146863, 145870, 143953, 142174, 141103, 140738, 140942, 141563, 142459, 143650, 145061, 146032, 145691, 144117, 142551, 142075, 142488, 142861, 142724, 142326, 142094, 142288, 142946, 143811, 144498, 144922, 145276, 145566, 145615, 145615, 146064, 146846, 147036, 146117, 144838, 144252, 144315, 144124, 143342, 142681, 143013, 144493, 146583, 148550, 149882, 150527, 150788, 150879, 150745, 150435, 150371, 150860, 151551, 151748, 151217, 150355, 149622, 149175, 149024, 149150, 149319, 149035]
54155A49035j087j664j505o65K85Q12R49J160J633J959J648Q52J74o5q0j14l2
54138A53295M00J056J471J303P05J75K6J20J88L32Q92J841K665K986K969K874
54122A73298K593J936J178Q86J239J757J792J162K59m36r27j618k604l243k857
54107A74415j668o74n53j097j659j766j295n50j79n29j066j041o89j018k258l298
54091A55075l018j554J16J231J511J047M08L65J019J660J746J548J474J391J087
54076A65106Q45R80J270J355J291J245J136R10P52N97N6q21j296r54l13O1L52
54059A72572Q54J208J002N17J99l9l29k82L49J063J409J699K206K422K080K050
54043A88980L057M161L922K592J698J781K045K139K696L889M856N009M773M608
$$ y = [149035, 147948, 146284, 144779, 144114, 144399, 145211, 146160, 147320, 148953, 150912, 152560, 153412, 153586, 153521, 153441, 153327, 153295, 153695, 154751, 156222, 157525, 158230, 158405, 158431, 158551, 158739, 159071, 159963, 161804, 164469, 167455, 170424, 173298, 175891, 177827, 179005, 179891, 181130, 182887, 184679, 185841, 186100, 185664, 184737, 183119, 180515, 177272, 174415, 172747, 172073, 171520, 170423, 168764, 166998, 165703, 165153, 164974, 164445, 163379, 162338, 161649, 160631, 158373, 155075, 152057, 150503, 150619, 151850, 153361, 154408, 154816, 155181, 156200, 157860, 159606, 161154, 162628, 164019, 165106, 165951, 166931, 168201, 169556, 170847, 172092, 173228, 174138, 174890, 175487, 175543, 174722, 173426, 172472, 172159, 172220, 172572, 173426, 174634, 175636, 176153, 176352, 176313, 175984, 175702, 176051, 177114, 178523, 180222, 182428, 184850, 186930, 188980, 192037, 196198, 200120, 202712, 204410, 206191, 208236, 210375, 213071, 216960, 221816, 226825, 231598, 236206]
54029B36206M253L436K452J579O65k83q28p79n51n32n74m36k08o0m8l64j306k721
54011B39901l929m395m149l463k586j881j739k064k247j851j133p23r25j394j474
53996B05948r05k04j10n68p37j35P56J361J774K208K381K175K235L063L953L777
53980B26972K422O37j155k912m199m444l849l095k368j546j015j209j590j257
53966B01392m63l17j017j622j631j459j264n35P48J759J986J772J420Q51M07P77
53950B02804J673J854J043O22J604L031L295K306J319J174J617K079K336K534
53936B29291K910L387L412K596J495J100J496J901K060K592L587M127L772L418
53922B67144L910M637M504L570K746K419K321K388K872L777M751N385N241L985
$$ y = [236206, 240459, 243895, 246347, 247926, 248591, 248308, 247480, 246701, 246150, 245618, 245044, 244608, 244400, 244340, 244292, 243928, 242622, 239901, 235972, 231577, 227428, 223965, 221379, 219498, 217759, 215695, 213448, 211597, 210464, 209741, 208816, 207422, 205948, 205043, 204839, 204729, 204161, 203424, 203289, 204045, 205406, 207180, 209388, 211769, 213944, 216179, 219242, 223195, 226972, 229394, 230031, 228876, 225964, 221765, 217321, 213472, 210377, 208009, 206463, 205448, 204239, 202649, 201392, 200929, 200612, 199595, 197973, 196342, 194883, 193619, 193084, 193832, 195591, 197577, 199349, 200769, 201620, 202027, 202804, 204477, 206331, 207374, 207996, 209600, 212631, 215926, 218232, 219551, 220725, 222342, 224421, 226757, 229291, 232201, 235588, 239000, 241596, 243091, 244191, 245687, 247588, 249648, 252240, 255827, 259954, 263726, 267144, 271054, 275691, 280195, 283765, 286511, 288930, 291251, 293639, 296511, 300288, 305039, 310424, 315665, 319650]
53908C19650K034N13K2j09p06j462j570j119r67j429j986k250k446k804l161l332
53892B98878l489l953m798n699o071n573m554l792l627l633l316k773k422k411
53878B42767k594k763k696k338k039k227k666k638k021j589j850k349k499k390
53864B10108k249j812r52k64k13k88J37O04K66o17r18l16L62M77K38q4o77j536
53846B02266k109k018j616j362j146o02K44J017J470J610J522J319J092P61J41
53831B02589o61j151r36k05M88Q08Q31P11N06L56M82Q32R58N86J37K74R56J476
53813B09037J513J554J978K403K415K363K673K906K489K031K679M195M919M094
53799B47249K976L008L808L963L068K002J446J143O88K63K88P05R41N50k74r00
$$ y = [319650, 321684, 322197, 322219, 322110, 321404, 319942, 318372, 317253, 316286, 314857, 312871, 310621, 308175, 305371, 302210, 298878, 295389, 291436, 286638, 280939, 274868, 269295, 264741, 260949, 257322, 253689, 250373, 247600, 245178, 242767, 240173, 237410, 234714, 232376, 230337, 228110, 225444, 222806, 220785, 219196, 217346, 214997, 212498, 210108, 207859, 206047, 205095, 204831, 204618, 204330, 204467, 205071, 205337, 204720, 203802, 203486, 203848, 204325, 204563, 204479, 203802, 202266, 200157, 198139, 196523, 195161, 194015, 193413, 193657, 194674, 196144, 197754, 199276, 200595, 201687, 202448, 202589, 201928, 200777, 199841, 199636, 200124, 200932, 201763, 202474, 202980, 203336, 203818, 204650, 205608, 206194, 206331, 206605, 207561, 209037, 210550, 212104, 214082, 216485, 218900, 221263, 223936, 226842, 229331, 231362, 234041, 238236, 243155, 247249, 250225, 253233, 257041, 261004, 264072, 266074, 267520, 268663, 269351, 269614, 269902, 270607, 271548, 272098, 271824, 270924]
53783B70924j077j285j948k656k745k476k812l893m640m227l151k401k281k521
53769B32811k875l007k449j341p09j184j962j815p45J69L36J28l8l07q83j615
53753B14514k195k431k239j721j198q67n32l0L53K79k7q3O5j4k73l6J090K513
53735B07168L162K498J021j81l98J11N15L99J03J30N32J055J481J661J541J358
53719B22156J449J699J625J177R22J165J452J335J047J009J179J423J898K525
53705B42061K639J863Q49M37N91Q67J370K334L238L421L267L673M453M483L419
53690B78965K147J322O22k32p26m77k0n6m29n26k55n5j87n58j074j715k270k331
53672B72145j637l90P40J019K71r11j718j838j490r30k69L39P28R55J142J125
$$ y = [270924, 269847, 268562, 266614, 263958, 261213, 258737, 255925, 252032, 247392, 243165, 240014, 237613, 235332, 232811, 229936, 226929, 224480, 223139, 222430, 221246, 219284, 217469, 216724, 216893, 217229, 217357, 217319, 217012, 216129, 214514, 212319, 209888, 207649, 205928, 204730, 203863, 203331, 203301, 203654, 203933, 203906, 203823, 203888, 203874, 203601, 203565, 204655, 207168, 210330, 212828, 213849, 213668, 213270, 213381, 213896, 214295, 214398, 214528, 215060, 216115, 217596, 219257, 220798, 222156, 223605, 225304, 226929, 228106, 229028, 230193, 231645, 232980, 234027, 235036, 236215, 237638, 239536, 242061, 244700, 246563, 247412, 247849, 248440, 249307, 250677, 253011, 256249, 259670, 262937, 266610, 271063, 275546, 278965, 281112, 282434, 283056, 282824, 282098, 281621, 281601, 281545, 281116, 280590, 280335, 280280, 280093, 279535, 278461, 276746, 274476, 272145, 270508, 270118, 270858, 271877, 272148, 271237, 269519, 267681, 266191, 265261, 264992, 265331, 266059, 267014, 268156, 269281]
53656B69281O43o9l46J58J051J674J710J298Q22O44Q12R88Q68O97J072K195L473
53639B86971L996L322J880O25J72K25Q3k92j93O06J230Q31j37m97P4Q51J266J467
53621C02480J675J798J863K119K532K708K539K423K598K783K686K425K238K202
53607C35069K441L122L961M235L564K415J506J067R14R37J105J218J022N32J4
53592C63122k33j02K44M22J72l09n81n35n05p75j264j754k072k007j414n57OP3
53574C51931RJ42K54m9p42j448j864j852j323l36P53J530J830J696J208N45N3
53557C52337n5J8lM0N50J437K022J908J600J884K768L443L321K668K066J726J613
53540C79343J866K663L783M777N461N882O006N869N909O520P327P609P450P731
$$ y = [269281, 269924, 269855, 269509, 269667, 270718, 272392, 274102, 275400, 276222, 276866, 277678, 278666, 279534, 280231, 281303, 283498, 286971, 290967, 294289, 296169, 296794, 296966, 297191, 297274, 296982, 296789, 297395, 298625, 299456, 299319, 298822, 298896, 299747, 301013, 302480, 304155, 305953, 307816, 309935, 312467, 315175, 317714, 320137, 322735, 325518, 328204, 330629, 332867, 335069, 337510, 340632, 344593, 348828, 352392, 354807, 356313, 357380, 358294, 359231, 360336, 361554, 362576, 363108, 363122, 362889, 362787, 363031, 363453, 363625, 363316, 362735, 362200, 361695, 360920, 359656, 357902, 355830, 353823, 352409, 351852, 351858, 351931, 351940, 352082, 352336, 352287, 351545, 350097, 348233, 346381, 345058, 344722, 345475, 347005, 348835, 350531, 351739, 352284, 352337, 352282, 352300, 352297, 352337, 352887, 354324, 356346, 358254, 359854, 361738, 364506, 367949, 371270, 373938, 376004, 377730, 379343, 381209, 383872, 387655, 392432, 397893, 403775, 409781, 415650, 421559, 428079, 435406, 443015, 450465, 458196]
53526D58196Q779R842J0256J0363J0699J1041J1022J1094J1973J3397J4370J4525
53514E95557J4467J4809J5492J6165J6660J6970J7172J7444J7861J8178J8140
53503G78915J7830J7447J6949J6298J5766J5519J5239J4645J4103J4048J4107
53492I50866J3621J2851J2697J3222J3382J2533J1407J1135J1846J2664J2754
53481A088978J2005J0955J0291J0195J0179R702Q818P827O478M208J263j187k362
53468A177350k763l417m605n794o546p062p805q831r638r763r468r541j0283j1086
53454A070748j1321j1295j1693j2427j2741j2354j1758j1327j0879j0259r732
53443I44962r458r100q252o927n413l968k752j829j072l77J98P45J758L504N371
$$ y = [458196, 466975, 476817, 487073, 497436, 508135, 519176, 530198, 541292, 553265, 566662, 581032, 595557, 610024, 624833, 640325, 656490, 673150, 690120, 707292, 724736, 742597, 760775, 778915, 796745, 814192, 831141, 847439, 863205, 878724, 893963, 908608, 922711, 936759, 950866, 964487, 977338, 990035, 1003257, 1016639, 1029172, 1040579, 1051714, 1063560, 1076224, 1088978, 1100983, 1111938, 1122229, 1132424, 1142603, 1152305, 1161123, 1168950, 1175428, 1179636, 1180899, 1179712, 1177350, 1174587, 1171170, 1166565, 1160771, 1154225, 1147163, 1139358, 1130527, 1120889, 1111126, 1101658, 1092117, 1081834, 1070748, 1059427, 1048132, 1036439, 1024012, 1011271, 998917, 987159, 975832, 964953, 954694, 944962, 935504, 926404, 918152, 911225, 905812, 901844, 899092, 897263, 896191, 895814, 896012, 896757, 898515, 902019, 907390]
53428I07390O454O745P025P650Q275Q824R779J1240J2529J3233J3907J5216J6940
53415A045207J8387J9298J9811J9959J9813J9883K0720K2260K3875K5036K5656
53404A279905K5968K6383K7312K8910L0937L2963L4594L5565L5885L5929L6128
53393A630479L6539L6976L7388L7761L7736L6919L5582L4451L3719L2789L1219
53382B021558K9334K7633K6013K3964K1233J8100J5122J2684J0525P795L989l05
53370B217645m082p277j0750j4930j9233k3000k6233k9061l1253l2660l3685l4771
53358A950710l5845l6603l6966l6991l6662l5991l5002l3589l1870l0604l0523
53347A570064l1117l0961k9551k7939k7155k6801k5929k4503k3188k2131k0894
$$ y = [907390, 913844, 920589, 927614, 935264, 943539, 952363, 962142, 973382, 985911, 999144, 1013051, 1028267, 1045207, 1063594, 1082892, 1102703, 1122662, 1142475, 1162358, 1183078, 1205338, 1229213, 1254249, 1279905, 1305873, 1332256, 1359568, 1388478, 1419415, 1452378, 1486972, 1522537, 1558422, 1594351, 1630479, 1667018, 1703994, 1741382, 1779143, 1816879, 1853798, 1889380, 1923831, 1957550, 1990339, 2021558, 2050892, 2078525, 2104538, 2128502, 2149735, 2167835, 2182957, 2195641, 2206166, 2213961, 2217950, 2217645, 2213563, 2206286, 2195536, 2180606, 2161373, 2138373, 2112140, 2083079, 2051826, 2019166, 1985481, 1950710, 1914865, 1878262, 1841296, 1804305, 1767643, 1731652, 1696650, 1663061, 1631191, 1600587, 1570064, 1538947, 1507986, 1478435, 1450496, 1423341, 1396540, 1370611, 1346108, 1322920, 1300789, 1279895]
53336A279895j9365j7997j7120j6475j5528j3954j1942j0110q966q460q296q525
53324A123157r212r742r251p945p044p158p559p421o857o190n161l635k300j800
53310A031882j678j020L10J737K828L422L454L290L801N361P191Q432R300J0464
53296A088774J1738J2424J2577J2989J4026J5241J6066J6194J5535J4395J3533
53285A243492J3330J3148J2162J0568R173Q114O790M890K632J09k742n508p471
53272A308687q507r147r813j0628j1890j3917j6325j8198j9200j9788k0279k0377
53260A130618j9961j9631k0041k1023k1765k1699k0961k0132j9663j9485j9201
53249I07056j8660j8214j8242j8656j9043j9104j8758j8040j7148j6287j5362
$$ y = [1279895, 1260530, 1242533, 1225413, 1208938, 1193410, 1179456, 1167514, 1157404, 1148438, 1139978, 1131682, 1123157, 1113945, 1104203, 1094952, 1087007, 1079963, 1072805, 1065246, 1057825, 1050968, 1044778, 1039617, 1035982, 1033682, 1031882, 1030204, 1029184, 1029494, 1031231, 1034059, 1037481, 1040935, 1044225, 1048026, 1053387, 1060578, 1069010, 1078310, 1088774, 1100512, 1112936, 1125513, 1138502, 1152528, 1167769, 1183835, 1200029, 1215564, 1229959, 1243492, 1256822, 1269970, 1282132, 1292700, 1301873, 1309987, 1316777, 1321667, 1324299, 1324408, 1321666, 1316158, 1308687, 1300180, 1291033, 1281220, 1270592, 1258702, 1244785, 1228460, 1210262, 1191062, 1171274, 1150995, 1130618, 1110657, 1091026, 1070985, 1049962, 1028197, 1006498, 985537, 965405, 945742, 926257, 907056, 888396, 870182, 851940, 833284, 814241, 795137, 776379, 758339, 741191, 724904, 709542]
53238G09542j4138j2867j2202j2217j2099j1249j0101r364r049q790q545q304
53226E80617p754o906o544p212q258q750q761q844q773p987o874o409o707p095
53212D73743p402p958q401p823o309n082m941n511o233p019p656p652p078o618
53198C78060o502o243n765n708o260o623o174n359m867m738m731m868n056m823
53184C00343m042l321l167l264l008k301j454p92o59j259k164k556k260j945j982
53169B66169j843j073j33K50On08j135j768k105k033j875j845j722j427j329j537
53153B46092j506r09k87k15m38n06o73j314j874j417j06Q35O60o7l86n7M69P66
53135B39067Q30Q96J050J049O69J55K9L37N44L63K50P14J555K200K453K433K079
$$ y = [709542, 695404, 682537, 670335, 658118, 646019, 634770, 624669, 615305, 606256, 597466, 588921, 580617, 572863, 565957, 559413, 552201, 543943, 535193, 526432, 517588, 508815, 500828, 493954, 487545, 480838, 473743, 466341, 458383, 449982, 442159, 435850, 430768, 425827, 420316, 414083, 407064, 399408, 391756, 384678, 378060, 371558, 365315, 359550, 353842, 347582, 340959, 334785, 329426, 324559, 319821, 315090, 310222, 305166, 300343, 296301, 292980, 289813, 286549, 283541, 281240, 279786, 278994, 278335, 277076, 274912, 272356, 270096, 268151, 266169, 264326, 263253, 263120, 263370, 263376, 262868, 261733, 259965, 257860, 255827, 253952, 252107, 250385, 248958, 247629, 246092, 244586, 243677, 243390, 243175, 242737, 242231, 241558, 240244, 238370, 236953, 236847, 237682, 238342, 238275, 237889, 237832, 238301, 239067, 239897, 240793, 241843, 242892, 243561, 243716, 243745, 244082, 244626, 244989, 245239, 245953, 247508, 249708, 252161, 254594, 256673]
53118B56673J276L05l36m92l66n3M79J026J129N98k67r94j342j355j196r93p86
53101B53306n95m58l94m15o83j402k311k599j848q23o53j275j558j010n22r65
53085B35795j885k198j654q95m86m41m83k60M27J197J246L48o79r11m20J42N43
53068B29386Q83Q33j18j589k363j822p69m35r94j504j175l39M7l38p85n76K3K35
53050B18600k9j24K11M58K57l9n2K3m2j7K33L01m9l13l0L66K63q9m3K97L16j2
53028B20486j06J65L39K12M4r0l52m86P1J184J920J690R47M37L17L36L81M59M34
53009B28388J16m82j043j097m01N90R43L34l73k18M76O38K01K66J287K137J575
52992B33337r4j497j802j237l89L62Q93J319J802K137J755N18q06j328j004m52
$$ y = [256673, 257949, 258254, 257918, 257426, 257060, 257007, 257486, 258512, 259641, 260239, 259972, 258978, 257636, 256281, 255085, 254092, 253306, 252711, 252253, 251859, 251444, 250761, 249359, 247048, 244449, 242601, 241778, 241125, 239850, 238292, 237282, 236760, 235795, 233910, 231712, 230058, 229163, 228677, 228236, 227753, 227493, 227920, 229117, 230363, 230711, 230032, 229121, 228701, 228843, 229386, 230269, 231102, 230984, 229395, 227032, 225210, 224441, 224006, 223012, 221508, 220333, 219994, 220041, 219703, 218918, 218342, 218365, 218600, 218571, 218447, 218658, 219116, 219373, 219334, 219282, 219305, 219263, 219246, 219479, 219780, 219731, 219418, 219388, 219754, 220017, 219928, 219885, 220182, 220498, 220486, 220380, 220545, 220884, 221096, 221140, 221050, 220698, 220212, 220283, 221467, 223387, 225077, 226024, 226461, 226778, 227114, 227495, 227954, 228388, 228504, 228022, 226979, 225882, 225481, 226071, 227014, 227348, 226975, 226757, 227233, 227871, 228072, 228338, 229625, 231762, 233337, 233243, 231746, 229944, 228707, 228318, 228680, 229573, 230892, 232694, 234831, 236586, 237104, 236298, 234970, 233966, 233514]
52976B33514m8K42M05L63L51P01J211J235N98p4j58K20N26N85O48Q36Q57L86m42
52957B41956j062r96l69J87K20r7l01l27m83q27r53n86n2J42p3m19p33j016j156
52938B33055j009p27o10o31m94j84m7k70o39r03j025r00k84P32J539J635J095
52921B30333K51o71j273q96N42J977K195J230J83k88n70j120j654j530o41M44
52905B28512R84P59L58O20J542K060J384J02o71q97j320j889j695n86M44Q62J338
52888B31907K221K519J348m34j251q23j07L50P94J203J046K53m58n02n5M57Q92
52871B39360J258J458J444J341J296J303J206P40j65j070j364j084r84j440j873
52856B41426j709j344j506k094k470k495k443k192j403l61K71M86P70R89N02n39
$$ y = [233514, 233466, 233708, 234113, 234476, 234827, 235528, 236739, 237974, 238572, 238498, 238340, 238560, 239086, 239671, 240319, 241155, 242012, 242398, 241956, 240894, 239898, 239529, 239716, 239936, 239839, 239538, 239211, 238728, 237901, 236948, 236362, 236310, 236452, 236379, 235960, 235227, 234211, 233055, 232046, 231319, 230709, 230078, 229584, 229400, 229353, 229083, 228444, 227541, 226516, 225616, 225332, 226064, 227603, 229238, 230333, 230584, 229913, 228640, 227744, 228286, 230263, 232458, 233688, 233871, 233583, 233013, 231893, 230239, 228709, 228068, 228512, 229496, 230255, 230613, 231233, 232775, 234835, 236219, 236321, 235650, 234753, 233433, 231544, 229849, 229263, 229707, 230569, 231907, 234128, 236647, 237995, 237561, 236310, 235487, 235380, 235730, 236524, 237727, 238773, 239026, 238568, 238066, 238011, 238468, 239360, 240618, 242076, 243520, 244861, 246157, 247460, 248666, 249406, 249241, 248171, 246807, 245723, 244739, 243299, 241426, 239717, 238373, 236867, 234773, 232303, 229808, 227365, 225173, 223770, 223409, 223680, 224166, 224936, 225925, 226427, 225888]
52840B25888j118q54n86r85j526j475j031p85o54j77N35R17Q16O12N68N35K93
52823B20973j44n05l90L09J060J049J71p48r52o37m58n61n95l53M7N01Q97R38
52805B20602M77p7j76P0K2m88q22m79R0M1o68j144o69L61Q83M44l13m67J27Q20
52785B18634J039Q37N98M78K76k49r85j393r38K45J207J031k75j870k916k961
52769B12758j842J01J697J660L6j593j838r31j6M16O74Q22N48K8QP17J447J599
52751B16291J547J880K286J944Q13k24n11k63N5L87Q12J104J068R48J052J197
52735B30386J044P62Q04J071R76M05l8M7K63O2m67q70r66p95l43K57N67L48o0
52716B33453k77m82r04j157p68j56j38o11o19J18P33N33np7K94N25M22K21j2m04
$$ y = [225888, 224770, 223916, 223330, 222345, 220819, 219344, 218313, 217528, 216874, 216697, 217232, 218149, 218965, 219577, 220145, 220680, 220973, 220829, 220324, 219934, 220243, 221303, 222352, 222523, 221775, 220823, 220186, 219728, 219167, 218572, 218219, 218266, 218767, 219664, 220602, 221079, 221002, 220826, 220896, 220918, 220430, 219608, 219129, 219219, 219260, 218592, 217448, 216779, 217140, 218023, 218467, 218154, 217687, 217814, 218634, 219673, 220510, 221108, 221586, 221862, 221613, 220628, 219235, 218297, 218542, 219749, 220780, 220505, 218635, 215719, 212758, 210916, 211017, 212714, 214374, 214410, 212817, 210979, 210048, 210032, 210448, 211122, 211944, 212492, 212520, 212528, 213245, 214692, 216291, 217838, 219718, 222004, 223948, 224761, 224537, 224026, 223763, 223818, 224205, 225017, 226121, 227189, 228137, 229189, 230386, 231430, 232192, 232996, 234067, 235043, 235448, 235410, 235457, 235720, 235782, 235315, 234445, 233479, 232684, 232341, 232598, 233165, 233513, 233453, 233176, 232694, 231790, 230633, 229865, 229709, 229571, 228960, 228341, 228459, 229192, 229725, 229720, 229643, 229937, 230462, 230884, 231105, 231093, 230689]
52696B30689q96j254j351j099l51P32J480J340N63j51n61r34j286j177m60L17
52680B25601N16J42k15r5M01P99P29L42K31Q05J733K223J900J209Q17Q44R47R21
52662B39850Q80R00Q62Q06J021J545J859J487O98K15K52L36J05j87k08j24k64
52645B50033n59o99o77p83j143j596j926j924j396m56L28M39N9j70N9N31J002
52628B41122J424J697J656J414J253J113O50o7m50k43ll81j232j831j779j310
52612B43033q01l23L11J157J856J879J185N34O64J250J183R2j007j010j56L95
52596B50242J72j34J44P23Q64M10j54m21m93n76n47j72L95P23P54R76J608K006
52578B56520J331k77j703k089j594q67k79O1P7j07m7M61Q92M70q60k229k645j844
$$ y = [230689, 229793, 228539, 227188, 226089, 225738, 226470, 227950, 229290, 229853, 229702, 229141, 228207, 226921, 225744, 225284, 225601, 226117, 226259, 226044, 225949, 226350, 227149, 227878, 228220, 228451, 229256, 230989, 233212, 235112, 236321, 237138, 237982, 238929, 239850, 240730, 241630, 242492, 243298, 244319, 245864, 247723, 249210, 249908, 250123, 250375, 250711, 250816, 250629, 250421, 250297, 250033, 249474, 248775, 248098, 247315, 246172, 244576, 242650, 240726, 239330, 238874, 239202, 239641, 239700, 239530, 239589, 240120, 241122, 242546, 244243, 245899, 247313, 248566, 249679, 250329, 250262, 249812, 249569, 249566, 249185, 247953, 246122, 244343, 243033, 242232, 241909, 242220, 243377, 245233, 247112, 248297, 248831, 249495, 250745, 251928, 252020, 251013, 250003, 249847, 250242, 250414, 250280, 250424, 251147, 252011, 252421, 252267, 251846, 251353, 250777, 250230, 250058, 250453, 251176, 251930, 252906, 254514, 256520, 257851, 257574, 255871, 253782, 252188, 251321, 251042, 251103, 251180, 251073, 251026, 251487, 252379, 252849, 251989, 249760, 247115, 245271]
52560B45271l99Q10J296J223R77O14p8r31j274o87L86J087R88K81n94j190j125
52543B46655l96M30P04L97J0j62l21o61r64q70l45L18P99R53Q08N44M29O21R66
52524B49915J117R17O16N48O16L78k19m29N06K182L209K748J454N83N57Q39J016
52507B66553J258J673J819J241J73o87j011j085j223j351j313j292j541j861j732
52492B59621j038k85P3J69K74K06l50j127j394q60P3R46J632J950J501L19p39
52475B60971p46K52J300J583J067K67l06l37K38J126J712J468N68kP23K509L888
52458B76281L598J918J99p37j166j549j865k063k395k892l060k627k083j940j895
52443B57724j366n39r0p7O4M66N27p7p98r59o19k98j75kM39J049J575J822J761
$$ y = [245271, 244872, 245682, 246978, 248201, 249178, 249792, 249714, 248783, 247509, 246822, 247208, 248295, 249283, 249564, 248970, 247780, 246655, 246259, 246689, 247393, 247790, 247800, 247638, 247317, 246656, 245692, 244822, 244477, 244795, 245594, 246547, 247355, 247899, 248328, 248949, 249915, 251032, 251949, 252565, 253113, 253729, 254107, 253888, 253459, 253965, 256147, 259356, 262104, 263558, 264141, 264698, 265537, 266553, 267811, 269484, 271303, 272544, 272717, 272030, 271019, 269934, 268711, 267360, 266047, 264755, 263214, 261353, 259621, 258583, 258298, 258371, 258540, 258814, 259020, 258670, 257543, 256149, 255289, 255362, 256308, 257940, 259890, 261391, 261710, 260971, 260225, 260477, 261777, 263360, 264427, 264694, 264388, 264051, 264289, 265415, 267127, 268595, 269163, 269161, 269884, 272393, 276281, 279879, 281797, 281996, 281259, 280093, 278544, 276679, 274616, 272221, 269329, 266269, 263642, 261559, 259619, 257724, 256358, 255819, 255729, 255652, 255716, 256182, 256709, 256632, 255834, 254875, 254256, 253958, 253783, 253781, 254220, 255269, 256844, 258666, 260427]
52424B60427J534J293J015O10K45L21R43J612J688J156P34J118K213L262L718
52409B81889L883M476N713O936P254O313M423K141p3j928l331m272m668m419l736
52394C00601l166k966k672j690k90M77J9r90j307m49R12J720J534P51J54K54R20
52377B93812J556J685J444J435K049L042L827M115M055L827L422K895K493K280
52363C31937J861Q96k56q10m94J77O31Q55J107J380J497J494J580J815K062K213
52347C47945K285K350K530K981L697M372M600M256L667L372L722M657N808O865
52333D03107P748Q464Q920R079R081R071R084R356J0418J2385J4339J5075J4538
52320E40665J3821J3632J3498J2802J1940J1745J2256J2644J2301J1445J0745
$$ y = [260427, 261961, 263254, 264269, 264879, 265124, 265445, 266388, 268000, 269688, 270844, 271578, 272696, 274909, 278171, 281889, 285772, 290248, 295961, 302897, 310151, 316464, 320887, 323028, 322955, 321027, 317696, 313424, 308756, 304337, 300601, 297435, 294469, 291797, 290107, 289817, 290294, 290313, 289323, 288016, 287567, 288479, 290199, 291733, 292484, 292638, 292892, 293812, 295368, 297053, 298497, 299932, 301981, 305023, 308850, 312965, 317020, 320847, 324269, 327164, 329657, 331937, 333798, 334694, 334438, 333628, 333134, 333311, 333942, 334797, 335904, 337284, 338781, 340275, 341855, 343670, 345732, 347945, 350230, 352580, 355110, 358091, 361788, 366160, 370760, 375016, 378683, 382055, 385777, 390434, 396242, 403107, 410855, 419319, 428239, 437318, 446399, 455470, 464554, 473910, 484328, 496713, 511052, 526127, 540665, 554486, 568118, 581616, 594418, 606358, 618103, 630359, 643003, 655304, 666749, 677494]
52309F77494J0648J1020J1151J0360Q857P721P714Q335Q461P692O551N582M761
52296G86347L843K773J658O12k52r33j654k586l553m188m408m460m500m336l690
52281G60673k583j406n52N1R74K610M515N771O087O089O344O669O706O678O991
52266H15617P490P727P726P820P921P660P211P232P843Q268P816O784N972N617
52252I18704N197M207K808J506M37p95k471m250n567o375p093p861q413q777r461
52237H71796j0606j1535j1595j1002j0389r941r455q915q435p879p083o244n600
52224G53117n021m341l746l398k971k187j451j246j266q55m9N81R24J334J777
52209G31202J891J808K018K409K323J665J148J169J291J084Q11R83J755K962M158
$$ y = [677494, 688142, 699162, 710313, 720673, 729530, 737251, 744965, 753300, 761761, 769453, 776004, 781586, 786347, 790190, 792963, 794621, 795233, 794981, 794048, 792394, 789808, 786255, 782067, 777659, 773199, 768699, 764363, 760673, 758090, 756684, 756132, 756183, 757157, 759767, 764282, 770053, 776140, 782229, 788573, 795242, 801948, 808626, 815617, 823107, 830834, 838560, 846380, 854301, 861961, 869172, 876404, 884247, 892515, 900331, 907115, 913087, 918704, 923901, 928108, 930916, 932422, 932859, 932064, 929593, 925343, 919776, 913401, 906308, 898447, 890034, 881257, 871796, 861190, 849655, 838060, 827058, 816669, 806728, 797273, 788358, 779923, 772044, 764961, 758717, 753117, 748096, 743755, 740009, 736611, 733640, 731453, 730002, 728756, 727490, 726635, 726586, 727167, 728091, 729425, 731202, 733093, 734901, 736919, 739328, 741651, 743316, 744464, 745633, 746924, 748008, 748819, 749802, 751557, 754519, 758677]
52194G58677M606L871K546J735J710J791J592J490J702J751J229K89q94k314l522
52179G76259l776l287l321m432n427m883l021j234l53j56k18l38l26r6J38K35
52163G45764M29R08J437J840K394L239L837L657L019K668K774K905K761K366J882
$$ y = [758677, 763283, 767154, 769700, 771435, 773145, 774936, 776528, 778018, 779720, 781471, 782700, 782989, 782095, 779781, 776259, 772483, 769196, 765875, 761443, 756016, 751133, 748112, 746878, 746525, 746369, 746151, 745813, 745487, 745391, 745529, 745764, 746193, 747101, 748538, 750378, 752772, 756011, 759848, 763505, 766524, 769192, 771966, 774871, 777632, 779998, 781880]
$$ [...]
##END NTUPLES=NMR SPECTRUM
##END=
