
##TITLE=AC1353_CTIAH12172_6945509_mS8UyP9kWO
##JCAMPDX= 6.0         $$ Bruker NMR JCAMP-DX V2.0
##DATA TYPE= NMR SPECTRUM
##DATA CLASS= NTUPLES
##ORIGIN= BRUKER
##OWNER= Administrator
$$ 1.72 TOPSPIN		Version 2.1
$$ 2012-10-18 13:46:08.126 -0700  Administrator@X
$$ Compression mode = diff/dup
##.OBSERVE FREQUENCY= 400.02188249412
##.OBSERVE NUCLEUS= ^1H
##.ACQUISITION MODE= SIMULTANEOUS (DQD)
##.ACQUISITION SCHEME= undefined
##.AVERAGES= 8
##.DIGITISER RES= 22
##SPECTROMETER/DATA SYSTEM= spect
##.PULSE SEQUENCE= zg30
##.SOLVENT NAME= COFFEE_meoh
##.SHIFT REFERENCE= INTERNAL, COFFEE_meoh, 1, 14.98509
##AUDIT TRAIL= $$ (NUMBER, WHEN, WHO, WHERE, PROCESS, VERSION, WHAT)
$$ ##TITLE= Audit trail, TOPSPIN		Version 2.1
$$ ##JCAMPDX= 5.01
$$ ##ORIGIN= Bruker BioSpin GmbH
$$ ##OWNER= Administrator
$$ $$ C:\Bruker\TOPSPIN/data/COFFEE/nmr/AC1353_CTIAH12172_6945509_mS8UyP9kWO/10/pdata/1/auditp.txt
$$ ##AUDIT TRAIL=  $$ (NUMBER, WHEN, WHO, WHERE, PROCESS, VERSION, WHAT)
(   1,<2012-10-13 21:02:49.421 -0500>,<Administrator>,<TOPSPIN>,<go>,<TOPSPIN 2.1>,
      <created by zg
	started at 2012-10-13 21:01:42.796 -0500,
	POWCHK enabled, PULCHK disabled,
       configuration hash MD5:
       6B 1B 68 BB D9 2E 58 E2 7F 35 AD 54 07 DF 0E 41
       data hash MD5: 64K
       E6 CE 9E 4F 18 13 0B 5F 60 C4 AA 79 62 0B DD 32>)
(   2,<2012-10-13 21:02:52.000 -0500>,<Administrator>,<TOPSPIN>,<proc1d>,<TOPSPIN 2.1>,
      <Start of raw data processing
       efp LB = 0 FT_mod = 6 PKNL = 1 PHC0 = 0 PHC1 = 0 SI = 32K 
       data hash MD5: 32K
       B0 D7 7E 24 53 FC 7D 7F 63 2C 5B D7 C1 E4 D4 A6>)
(   3,<2012-10-13 21:02:52.390 -0500>,<Administrator>,<TOPSPIN>,<proc1d>,<TOPSPIN 2.1>,
      <pk PHC0 = 181.4557 PHC1 = 0 
       data hash MD5: 32K
       38 18 0D 23 1C 3E 48 A5 32 A8 02 CA 0E 7E 78 95>)
(   4,<2012-10-13 21:02:52.515 -0500>,<Administrator>,<TOPSPIN>,<proc1d>,<TOPSPIN 2.1>,
      <abs ABSG = 1 
       data hash MD5: 32K
       44 E1 E2 0B B6 3B FE C0 32 C9 DB DB 54 72 A7 49>)
(   5,<2012-10-13 21:02:52.546 -0500>,<Administrator>,<TOPSPIN>,<proc1d>,<TOPSPIN 2.1>,
      <abs ABSG = 2 
       data hash MD5: 32K
       FE EC 3E 9D EA 59 62 93 2E 69 D9 FA F7 A1 65 B4>)
(   6,<2012-10-13 21:02:52.578 -0500>,<Administrator>,<TOPSPIN>,<proc1d>,<TOPSPIN 2.1>,
      <abs ABSG = 3 
       data hash MD5: 32K
       3B F9 1F 41 40 2D 93 2F 16 B8 C4 6F 40 A9 26 7B>)
(   7,<2012-10-13 21:02:52.609 -0500>,<Administrator>,<TOPSPIN>,<proc1d>,<TOPSPIN 2.1>,
      <abs ABSG = 4 
       data hash MD5: 32K
       F4 96 B4 73 49 DF FF EF 91 F0 F4 2B EF BB 02 D4>)
(   8,<2012-10-13 21:02:52.640 -0500>,<Administrator>,<TOPSPIN>,<proc1d>,<TOPSPIN 2.1>,
      <abs ABSG = 5 
       data hash MD5: 32K
       1E 46 2A 6E ED 1F 30 10 82 CA 57 47 DB 56 0C 32>)
(   9,<2012-10-13 21:02:56.265 -0500>,<Administrator>,<TOPSPIN>,<audit>,<TOPSPIN 2.1>,
      <user comment:
       ICON-NMR User ID: COFFEE
       data hash MD5: 32K
       1E 46 2A 6E ED 1F 30 10 82 CA 57 47 DB 56 0C 32>)
$$ ##END=
$$ [...]
##$TP= (0..7)
150 150 150 150 150 150 150 150
##$TP07= 0
##$TPNAME0= <>
##$TPNAME1= <>
##$TPNAME2= <>
##$TPNAME3= <>
##$TPNAME4= <>
##$TPNAME5= <>
##$TPNAME6= <>
##$TPNAME7= <>
##$TPOAL= (0..7)
0.5 0.5 0.5 0.5 0.5 0.5 0.5 0.5
##$TPOFFS= (0..7)
0 0 0 0 0 0 0 0
##$TUNHIN= 0
##$TUNHOUT= 0
##$TUNXOUT= 0
##$USERA1= <user>
##$USERA2= <user>
##$USERA3= <user>
##$USERA4= <user>
##$USERA5= <user>
##$V9= 5
##$VALIST= <valist>
##$VCLIST= <CCCCCCCCCCCCCCC>
##$VD= 0
##$VDLIST= <DDDDDDDDDDDDDDD>
##$VPLIST= <PPPPPPPPPPPPPPP>
##$VTLIST= <TTTTTTTTTTTTTTT>
##$WBST= 2048
##$WBSW= 25
##$XGAIN= (0..3)
0 0 0 0
##$XL= 0
##$YL= 0
##$YMAX_a= 500899
##$YMIN_a= -641088
##$ZGOPTNS= <>
##$ZL1= 120
##$ZL2= 120
##$ZL3= 120
##$ZL4= 120
##$ABSF1= 14.98509
##$ABSF2= -5.573092
##$ABSG= 5
##$ABSL= 3
##$ALPHA= 0
##$AQORDER= 0
##$ASSFAC= 0
##$ASSFACI= 0
##$ASSFACX= 0
##$ASSWID= 0
##$AUNMP= <proc_prof1d_extract_pilot.lims>
##$AXLEFT= 0
##$AXNAME= <>
##$AXNUC= <1H>
##$AXRIGHT= 0
##$AXTYPE= 0
##$AXUNIT= <>
##$AZFE= 0.1
##$AZFW= 0.1
##$BCFW= 0
##$BC_mod= 0
##$BYTORDP= 0
##$COROFFS= 0
##$CY= 15
##$DATMOD= 1
##$DC= 0
##$DFILT= <>
##$DTYPP= 0
##$F1P= 0
##$F2P= 0
##$FCOR= 0.5
##$FTSIZE= 32768
##$FT_mod= 6
##$GAMMA= 0
##$GB= 0
##$INTBC= 1
##$INTSCL= 1
##$ISEN= 128
##$LB= 0
##$LEV0= 0
##$LPBIN= 0
##$MAXI= 10000
##$MC2= 0
##$MEAN= 0
##$ME_mod= 0
##$MI= 0
##$NCOEF= 0
##$NC_proc= -8
##$NLEV= 6
##$NOISF1= 0
##$NOISF2= 0
##$NSP= 0
##$NTH_PI= 0
##$NZP= 0
##$OFFSET= 14.98509
##$PC= 1
##$PHC0= 181.4557
##$PHC1= 0
##$PH_mod= 1
##$PKNL= yes
##$PPARMOD= 0
##$PPDIAG= 0
##$PPIPTYP= 0
##$PPMPNUM= 2147483647
##$PPRESOL= 1
##$PSCAL= 4
##$PSIGN= 0
##$PYNMP= <proc.py>
##$REVERSE= no
##$SF= 400.02
##$SI= 32768
##$SIGF1= 0
##$SIGF2= 0
##$SINO= 400
##$SIOLD= 32768
##$SPECTYP= <>
##$SREGLST= <1H.CDCl3>
##$SSB= 0
##$STSI= 32768
##$STSR= 0
##$SW_p= 8223.68421052631
##$SYMM= 0
##$S_DEV= 0
##$TDeff= 65536
##$TDoff= 0
##$TI= <>
##$TILT= no
##$TM1= 0
##$TM2= 0
##$TOPLEV= 0
##$USERP1= <user>
##$USERP2= <user>
##$USERP3= <user>
##$USERP4= <user>
##$USERP5= <user>
##$WDW= 1
##$XDIM= 32768
##$YMAX_p= 451811509
##$YMIN_p= -684237
##$CURPLOT= <Network HP LaserJet P1505>
##$CURPRIN= <$Network HP LaserJet P1505>
##$DFORMAT= <normdp>
##$LAYOUT= <+/1D_H.xwp>
##$LFORMAT= <normlp>
##$PFORMAT= <normpl>
##$SURQMSG= 1
$$ End of Bruker specific parameters
$$ ---------------------------------
##NTUPLES= NMR SPECTRUM
##VAR_NAME=  FREQUENCY,     SPECTRUM/REAL,   SPECTRUM/IMAG
##SYMBOL=    X,             R,               I
##VAR_TYPE=  INDEPENDENT,   DEPENDENT,       DEPENDENT
##VAR_FORM=  AFFN,          ASDF,            ASDF
##VAR_DIM=   32768,         32768,           32768
##UNITS=     HZ,            ARBITRARY UNITS, ARBITRARY UNITS
##FACTOR=    0.250966925370066, 1,           1
##FIRST=     8223.43324360094, -115231,      -740
##LAST=      0,             47654,           -167600
##MIN=       0,             -684237,         0
##MAX=       8223.43324360094, 451811509,    0
$$ Real data points
##PAGE= N=1
##DATA TABLE= (X++(R..R)), XYDATA
$$ [...]
19557b60877R5735A08258K415a32535C63953h6846j56424c2060A27718o591e3043
19545a48368j38157J18772A89712R813a11521F8461d31702g0939j06253k14504
19535c91696a85886Q2809E1558a38480A1071b31188H2771a97850j44091d8774
19524a26098K2753j06788C32665b5888l3308k6214n0677A01251a42768n3602G3877
19512a22991B1073a53152O3325H7757A221K22560a76151j81833N9167C2899J10153
19501A43052K9023G6364J82709a89246A87145b83547K8082A50200a834C6940d25365
19489c72784d4980l08488A47762a14467B7424c10856J09482f0599m0721A9474
19478A22576a87699f9353A47159N087a88115B80266G2212J35118r8809a39238
$$ plain form
19557 -260877 -165142 108258 110673 -132535 363953 -86846 -243270 -32060 127718 121127 -53043
19545 -148368 -286525 -167753 189712 199525 -111521 68461 -431702 -70939 -177192 -391696
19535 -391696 -185886 -103077 51558 -138480 11071 -231188 82771 -197850 -341941 -48774
19524 -126098 -103345 -210133 332665 -25888 -59196 -85410 -136087 101251 -142768 -196370 73877
19512 -122991 21073 -153152 -89827 87757 1221 223781 -176151 -357984 -298817 32899 143052
19501 143052 172075 76364 259073 -189246 187145 -283547 -255465 150200 -1834 36940 -425365
19489 -372784 -44980 -353468 147762 -114467 27424 -310856 -201374 -60599 -101320 19474
19478 122576 -187699 -69353 147159 152246 -188115 280266 72212 207330 108521 -139238
19467D88067A85732j4029k3629a40560e1122p4286N421A2017i0329A25625a78271
19455f047A82586b46337I1083f3187E3375h2669q0052A5141c32694C4388h6987
19443d6302E352J93584d85985i6387j06230N4613N5648j9705j13872M6757D5372
19431b23622A79712c94004E7963a81588N2546a4084q6762G3199d44046A03980
19420f7869j20045A27078a05894A60474J67611D8347O4714L88618C9215J93503
19410B32718b71665N21C6390a03941B6467b56296I9486M0834d0274p6594a4874
19398E790O2872J00380p0036k0227d04169J68503N0861a3108k5338j767C66130
19386c95588J10184J36280B44283D4493b3716C818a08824j7191J6417A62052M2074
$$ plain form
19467 488067 185732 171703 148074 -140560 -51122 -125408 -119987 12017 -90329 125625 -178271
19455 -6047 182586 -246337 91083 -63187 53375 -82669 -162721 15141 -332694 34388 -86987
19443 -46302 5352 198936 -485985 -96387 -202617 -148004 -92356 -112061 -225933 -179176 45372
19431 -223622 179712 -394004 57963 -181588 -129042 -14084 -100846 73199 -444046 103980
19420 -67869 -187914 127078 -105894 160474 328085 48347 113061 501679 39215 232718
19410 232718 -271665 -271144 36390 -103941 26467 -256296 99486 140320 -40274 -116868 -14874
19398 5790 68662 169042 99006 78779 -404169 -235666 -184805 -13108 -38446 -40213 366130
19386 -395588 -285404 -149124 244283 44493 -23716 3818 -108824 -126015 -109598 162052 204126
19375B04126E7331R6106n6440e4212k82825a5736k98699A27053j8687B4078b74987
19363D4002J8318c70811R0643B79297b20478E7589a24525A21170P2328a33449
19352d6790k10588A40788b14024B73112B1704K32544k6475d0015j52483b8583
19341d7702j13845A54377l812a40327A20098A7613J02036a53169A36137b36523
19330a81737m2794L609A91200a66270b9349A26313a07678K5208l7934d6344k26154
19319b72498A37487a30991k52575J51626A75296a2789A83263h9751k80144a50022
19308C76242a72432q766r3468j58795H0388b9366l314p6371j03188j66030a0593
19296a59218O4144A03740Q7026b64096m4471A16751a88626A91444d5202B31352
$$ plain form
19375 204126 57331 153437 96997 -54212 -337037 -15736 -314435 127053 108366 24078 -274987
19363 44002 62320 -370811 -280168 279297 -220478 57589 -124525 121170 193498 -133449
19352 -46790 -257378 140788 -214024 273112 21704 254248 227773 -40015 -192498 -28583
19341 -47702 -161547 154377 150565 -140327 120098 17613 119649 -153169 136137 -236523
19330 -181737 -224531 -220922 191200 -166270 -29349 126313 -107678 -82470 -120404 -46344 -272498
19319 -272498 137487 -130991 -383566 -231940 175296 -12789 183263 -89751 -369895 -150022
19308 376242 -172432 -181198 -274666 -433461 80388 -29366 -32680 -109051 -212239 -378269 -10593
19296 -159218 -95074 103740 190766 -264096 -308567 116751 -188626 191444 -45202 231352
19285a08387J8668K6523d756k87751G8083B9238g6398A28712a48080l3784k2172
19274b04036j08821a00287o5948G5338A5537b1029C2382M5845C3681a55222c8183
19262a3231A1786a0275k67839p5037a74707A29987C4934b7757q6539N5367I8555
19250H9376a89234j03398a05264r6522D7242j9305c8293F893J65069b07994N1112
19239a56882C4328J73333c88639a91687Q2157C9647J15439a59946g3908l3583
19229a07491B0035a28835d4006o916A36462a32386j42551l1998k831Q2531d7029
19217h5631A41955a96141f6834j94858b7808j55343A56938a31120D4743a46830
19206b8159m6196C7579i5548k27412C2783c76424d677B08658b30374J6681a8577
$$ plain form
19285 -108387 -89719 -63196 -4756 -292507 78083 29238 -76398 128712 -148080 -181864 -204036
19274 -204036 -312857 -100287 -166235 75338 15537 -21029 32382 78227 33681 -155222 -38183
19262 -13231 11786 -10275 -278114 -353151 -174707 129987 34934 -27757 -114296 -58929 98555
19250 89376 -189234 -292632 -105264 -201786 47242 27937 -38293 6893 171962 -207994 -156882
19239 -156882 34328 207661 -388639 -191687 -109530 39647 155086 -159946 -73908 -107491
19229 -107491 20035 -128835 -44006 -50922 136462 -132386 -274937 -306935 -309766 -227235 -47029
19217 -85631 141955 -196141 -66834 -261692 -27808 -183151 156938 -131120 44743 -146830
19206 -28159 -74355 37579 -95548 -322960 32783 -376424 -4677 208658 -230374 -213693 -18577
19194a15999A50951g5062j97699g522B72917j5226b93046a39592C48008c86420
19183a83189O4900C72956c9104B56165a97442b5799A7740K06552R6485e1922B93329
19171d516H0101j3497b84117A3360e3455k10356D6087j9463R1039A4309J25470
19160A39779D1823b36129a5371D7068d9235l989j8894q7955j3860A45642e6646
19148a07485A06356c65088L8419I0933b62492p893B98635a55156A42710C4020
19137b16373J05672M2159A57770i8992n0212k47495a02539k8695o842F1074d3266
19125c77025a57339A0208d9351k27750A28403a2979j80417e1471B56102n5173
19115B00929q9422b69354f4876j6294D0050c06837J50112j89048a0405H6424a19694
$$ plain form
19194 -115999 150951 -75062 -272761 -7522 272917 257691 -293046 -139592 348008 -386420
19183 -183189 -118289 372956 -39104 256165 -197442 -25799 17740 224292 320777 -51922 293329
19171 -4516 80101 66604 -284117 13360 -53455 -263811 46087 26624 117663 14309 139779
19160 139779 41823 -236129 -15371 47068 -49235 -53224 -72118 -160073 -173933 145642 -56646
19148 -107485 106356 -365088 -326669 90933 -262492 -270385 298635 -155156 142710 34020
19137 -216373 -110701 -68542 157770 -98992 -149204 -396699 -102539 -131234 -138076 61074 -43266
19125 -377025 -157339 10208 -49351 -277101 128403 -12979 -193396 -51471 256102 200929
19115 200929 111507 -269354 -64876 -81170 40050 -306837 -156725 -345773 -10405 86424 -119694
19103f7709B9968a51386d8394F0049f7423k7694j07165C7327D437K47184n8138
19092A93483E4867c06537j546J46389k85266G0827b10589f8785F5834R6427b0103
19080A3782b6334B41154a54180j633A05682i2548C0204b97450A91681b91008c9124
19068G0472J37148a91849b9603A08744d9113D081a23614n4654k58256b1931J0160
19057a1771A0844e5727B29445r2826c89000a7243A29241m3802c4064A09594K20663
19046C30257b06064g4813A28701a47282F0387a44575K0195Q303r2113P4804K0858
19035a12528C33857j40702C6886J49152J12776a42311G119a04813E8711b22965
19024I933J07661l2009J52854a81830E6059K95906F2603c9075j07652B9156J60250
$$ plain form
19103 -67709 29968 -151386 -48394 60049 -67423 -95117 -202282 37327 4437 251621 193483
19092 193483 54867 -306537 -308083 -161694 -446960 70827 -210589 -68785 65834 162261 -20103
19080 13782 -26334 241154 -154180 -155813 105682 -92548 30204 -297450 191681 -291008 -39124
19068 70472 207620 -191849 -29603 108744 -49113 4081 -123614 -178268 -436524 -21931 -11771
19057 -11771 10844 -55727 229445 136619 -389000 -17243 129241 85439 -34064 109594 330257
19046 330257 -206064 -74813 128701 -147282 60387 -144575 -124380 -116077 -208190 -133386 -112528
19035 -112528 333857 193155 36886 186038 298814 -142311 7119 -104813 58711 -222965
19024 9933 117594 85585 238439 -181830 56059 351965 62603 -39075 -146727 29156 189406
19013A89406f5652B2989L7246J5012b48060j07296a42298g432q7390p5629L3357
19002a37094B0754b54081A33046A7446c2416k87184G172O1064a65382K1124A41858
18990a9050j00974q4782H6019f022C9093g6769p9278A4258d29755A74812F8687
18978b38318K2489A1042c6700j8324j75273e8356n4540k30528B10077a09719l97200
18967e06919a23059o4166j31580d9831E6484r45c4558A98645G5305h7931A45975
18955F8619i482q6748D34320a98636F3799J84927e2051a1739A10195b39641i2346
18943A24253b16277L6158A44033d71296B7789Q8633b78364J37635M0947A08999
18932B29196b3147j51017B23865a92306F0009K8804c45169A01859e9172F6062
$$ plain form
19013 189406 -65652 22989 60235 75247 -248060 -355356 -142298 -7432 -94822 -170451 -137094
19002 -137094 20754 -254081 133046 17446 -32416 -319600 7172 68236 -165382 -144258 141858
18990 -19050 -120024 -204806 86019 -6022 39093 -76769 -156047 14258 -429755 174812 68687
18978 -238318 -215829 11042 -36700 -55024 -230297 -58356 -112896 -343424 210077 -109719 -506919
18967 -506919 -123059 -187225 -318805 -49831 56484 55539 -34558 198645 75305 -87931 145975
18955 68619 -9482 -96230 434320 -198636 63799 248726 -52051 -11739 110195 -239641 -92346
18943 124253 -216277 -180119 144033 -471296 27789 116422 -278364 -140729 -99782 108999
18932 229196 -23147 -174164 223865 -192306 60009 88813 -345169 101859 -59172 66062
18921i6627c6546A6991O2759d16892a97501j87929B14749E2936b30933B80239
18910H9882b9346j1490B42771D2855c8938E407a92824c9012F6356g9971J2150
18899f7821k94734J22605D362b8991A23374C3837a19036N5922b6285B7604b35038
18887a02778q4970Q2300K5243o0488f3233m1592a0495A18447B6298J36446a20055
18875A4589i5106A31850h3232l68547A48018h7342K7649A55249J01218A17721
18864C58353I5127a66204A21863l9189c26945e4553q1595g133A81873c4880A89679
18852e6530b6138k26009f8421j12333P6894E4103a22196n6337A25299k5062b94615
18840c05338b0046j10881m03922a86149C36321b50487A1006K2907J45780b37592
$$ plain form
18921 -96627 -36546 16991 79750 -416892 -197501 -385430 214749 52936 -230933 280239
18910 89882 -29346 -40836 242771 42855 -38938 5407 -192824 -39012 66356 -79971 -67821
18899 -67821 -362555 -239950 4362 -28991 123374 33837 -119036 -63114 -26285 27604 -235038
18887 -102778 -187748 -105448 -80205 -140693 -63233 -104825 -10495 118447 26298 162744 -120055
18875 14589 -95106 131850 -83232 -451779 148018 -87342 -59693 155249 256467 117721
18864 358353 95127 -166204 121863 82674 -326945 -54553 -136148 -7133 181873 -34880 189679
18852 -56530 -26138 -252147 -68421 -180754 -103860 54103 -122196 -178533 125299 100237 -294615
18840 -305338 -20046 -130927 -534849 -186149 336321 -250487 11006 33913 179693 -237592
18829C8307J04736o5266j0277d5408A05157a81047b6640k1157o1139A2582b13274
18817C31142e9554B3456a33673b6424l14749J46015a3679A48417b2031E5272a74707
18805F0609b09501C795c8817J8397p9543m43123A30718b75140K2601A73358a98111
18793A29063E6232a77533N143P5525I5164O3905d6172A34538E6815c6162J6731
18782a9431j28683C2035L9029K80856c5156l10015N6623O8181D3114a03408j41343
18771b44751R6332f5395j02765N1412B09949h7684B8103b50553I5659a6593O429
18760a0164k03363o4915d7730H8858a09479q5852B95082b41806B14323B0599l07
18749B0292a33557B4459a18949c0030k08370a0167k17974b2320A75221a60059
$$ plain form
18829 38307 143043 77777 67500 -45408 105157 -181047 -26640 -47797 -108936 12582 -213274
18817 331142 -59554 23456 -133673 -26424 -341173 -195158 -13679 148417 -22031 55272 -174707
18805 60609 -209501 3795 -38817 -20420 -99963 -543086 130718 -275140 -252539 173358 -198111
18793 129063 56232 -177533 -172390 -96865 95164 159069 -46172 134538 56815 -36162 -19431
18782 -19431 -148114 32035 71064 351920 -35156 -345171 -288548 -220367 43114 -103408 -244751
18771 -244751 -148419 -65395 -168160 -116748 209949 -87684 28103 -250553 95659 -16593 -10164
18760 -10164 -213527 -278442 -47730 88858 -109479 -195331 295082 -241806 214323 20599 20292
18749 20292 -133557 24459 -118949 -30030 -238400 -10167 -228141 -22320 175221 -160059
18738E6156d9338k27431k3346k45698a40598j77143j50053b07975G8430M548g8508
18726b31580A60499g0849A36414a50161b4832A4281b1187H5550m1965f8356j20829
18715a89185C1709N884O8122b28411B5882a76835p2475E6199a29245A06387A2785
18703A66097e2904I6336a26825j69852A08773k4266f4358q9469o7162A06969b18335
18691I8427J68537I8494M538b44641C5090h2568B0566K61664j27646C9285a73172
18679F8183a20340b7273D1769a55952j41447a24785n0602k28642A56335J11865
18669B68200E0956a52418A59254E9971M7290a97301A11862b72485A54017F0529
18658h8019K1421j6771A90499B7662g907j47053D4725d065k76363k54727a78329
$$ plain form
18738 56156 -49338 -276769 -300115 -545813 -140598 -317741 -467794 -207975 78430 82978 -78508
18726 -231580 160499 -70849 136414 -150161 -24832 14281 -21187 85550 43585 -68356 -189185
18715 -189185 31709 37593 105715 -228411 25882 -176835 -249310 56199 -129245 106387 12785
18703 166097 -52904 96336 -126825 -296677 108773 84507 -64358 -153827 -220989 106969 -218335
18691 98427 266964 98494 103032 -244641 35090 -82568 20566 282230 154584 39285 -173172
18679 68183 -120340 -27273 41769 -155952 -297399 -124785 -175387 -404029 156335 268200
18669 268200 50956 -152418 159254 59971 107261 -197301 111862 -272485 154017 60529
18658 -88019 -66598 -83369 190499 27662 -7907 -154960 44725 -4065 -280428 -535155 -178329
18646a57519C0581a75177A85726L2142l6368c29022p4046f0775M370I8309K9424
18635A27733a19874A26798c9922B49766n3116J20654e5605r0206I2130a63069
18624b24482p6567l58348E9379Q4729b03310d1547i998A071b98384F6864a15406
18612c04027h6982j91321j94942D7949Q0814a02217j37029A12471A3726c0165
18601b1578j36907k4883A49952c98679C6412c6296j64281R9707q7553E6087c6147
18589A15599q839l9351K02829A00332a49947A22638a31467q5509N4382B811R7084
18578I9895a51773e8367J6125j01463k7952f57k063m4284j36083B22222a01016
18566F0534e3323A58267a42848B60796L6688a20714q675A260R1707a0106p3394
$$ plain form
18646 -157519 30581 -175177 185726 217868 181500 -329022 -403068 -60775 -56405 98309 127733
18635 127733 -119874 126798 -39922 249766 196650 317304 -55605 -145811 92130 -163069
18624 -224482 -301049 -659397 59379 144108 -203310 -41547 -9998 1071 -298384 66864 -115406
18612 -304027 -86982 -278303 -473245 47949 128763 -102217 -239246 112471 13726 -30165
18601 -21578 -158485 -183368 149952 -398679 36412 -36296 -200577 -100870 -188423 56087 -36147
18589 115599 106760 67409 270238 100332 -149947 122638 -131467 -216976 -162594 2811 99895
18578 99895 -151773 -58367 -42242 -143705 -171657 -657 -2720 -47004 -183087 222222 -101016
18566 60534 -53323 158267 -142848 260796 297484 -120714 -129389 1260 92967 -10106 -83500
18555h3500j76992C47788a80244L1425d1124C8452J05144d6885F7515K63120a80625
18543C4322b11907b4266l30461A42323a84603d740G5501L6003d5182i015k70061
18532b79076A24264g2010D0481J00207O2220i977k4175q3555j7376d3052n8297
18521a01349A10560c165G4613f6547c983o7191A8763b61879B49018a05231B1141
18509C8550b74336l41g7300k36441E6052g9228H6756l2469k0949K66072b8115
18497g0898j54915e2404k79722J44952A71475b95165C7414R3769c0937D6825b8385
18485A23335o1034h2101k57096c8879B9950i6308j28719r5362A12025E4848b14623
18473A3216a85122c2658p1837A05467b1163q2372j11768g1174B27743A3441a86301
$$ plain form
18555 -83500 -260492 347788 -180244 -148819 -41124 38452 143596 -46885 67515 330635 -180625
18543 34322 -211907 -24266 -354727 142323 -184603 -4740 75501 111504 -45182 -9015 -279076
18532 -279076 124264 -72010 40481 140688 202908 -9977 -34152 -117707 -135083 -43052 -101349
18521 -101349 110560 -3165 74613 -66547 -3983 -71174 18763 -261879 249018 -105231 21141
18509 38550 -274336 -274677 -77300 -313741 56052 -79228 86756 54287 33338 299410 -28115
18497 -70898 -225813 -52404 -332126 -187174 171475 -295165 37414 131183 -30937 46825 -28385
18485 123335 62301 -82101 -339197 -38879 29950 -96308 -225027 -320389 112025 54848 -214623
18473 13216 -185122 -32658 -104495 105467 -21163 -103535 -215303 -71174 227743 13441 -186301
18461f3873m37707a10932A36028a94972M1847A64014b12477H9264O8266Q2015
18451B39545b34370J07683j63666B17923g5081B59776b06341o6363B1701a40453
18440a06474o3363r932a3821j57958F0650R7600c30498K2919A06308o584R2193
18429A91917a42989j6706K3693k0846f9998B71083h5030b8011p6803I2101a72582
18417c69815a62493k30072d9784G852J7481e5853l08824J31115B1858P7877B8627
18405d5483f275l67566G0769P832f1815j8153A13803a3496m9326G7643b04008
18393E1255a0774E5167c3113A25390J64975A7587N4830c10004A2337c30842a34803
18381C06208C3736f0758k3186k17276e8306A82063k8540a39016p4126L2445L4342
$$ plain form
18461 -63873 -501580 -110932 136028 -194972 -153125 164014 -212477 89264 157530 239545
18451 239545 -234370 -126687 -290353 217923 -75081 259776 -206341 -272704 21701 -140453
18440 -106474 -169837 -179769 -13821 -171779 60650 158250 -330498 -307579 106308 99724 191917
18429 191917 -142989 -159695 -136002 -156848 -69998 271083 -85030 -28011 -104814 92101 -172582
18417 -369815 -162493 -392565 -49784 7852 25333 -55853 -364677 -233562 21858 99735 28627
18405 -45483 -6275 -373841 70769 78601 -61815 -79968 113803 -13496 -62822 77643 -204008
18393 51255 -10774 55167 -33113 125390 290365 17587 72417 -310004 12337 -330842 -134803
18381 306208 33736 -60758 -83944 -301220 -58306 182063 153523 -139016 -213142 -180697 -146355
18370a46355E5167b0899B8382a6222m4761A58063B3665b2925B5125b74018C00111
18358a53663A07391G915K15782f2178j31419j98181J05513K7938R6153d5120A28851
18346I1956a83272E6543j6017J90472G4210J16941a03253I4825b88795e7043A16550
18334A27776a19797J8255m7517p2677j80008a77870l6261n6956D9164A8807a13926
18322a03595A37266N9123a29646c2651B81146f18k18871J03465q3151B12026d2316
18310A70778g1791a573j76757G6900M21969B4790a7345A56413a34951A46645G0244
18298B8479a05172l9150G0450J9383e5350A58924R446b51810L7837H8011b63173
18286b12801a9328j29079b536j04403k11310G4414b84826A26586j13a41025k1958
$$ plain form
18370 -146355 55167 -20899 28382 -16222 -60983 158063 23665 -22925 25125 -274018 300111
18358 -153663 107391 7915 223697 -62178 -193597 -391778 -286265 -258327 -162174 -45120 128851
18346 91956 -183272 56543 40526 230998 74210 191151 -103253 94825 -288795 -57043 116550
18334 127776 -119797 -101542 -149059 -221736 -401744 -177870 -214131 -271087 49164 18807 -113926
18322 -103595 137266 196389 -129646 -32651 281146 -618 -219489 -116024 -199175 212026 -42316
18310 170778 -71791 -1573 -178330 76900 498869 24790 -17345 156413 -134951 146645 70244
18298 28479 -105172 -144322 70450 89833 -55350 158924 168370 -251810 -213973 88011 -263173
18286 -212801 -19328 -148407 -2536 -106939 -318249 74414 -284826 126586 126473 -141025 -162983
18275a62983F6689a09215M6355C19449c3110k85604J07653D1444d9471q5506C0838
18263a90476A91329b77414b3018B50283i2609G8318J07133a21493k959a4062H9444
18251a97903E6561K366a8409m31754a41000F1121b09269Q1510f2543m0636D398
18239A1265g6171m8933O0893n5327F1428e46373g3705o4880k62736A64267A0688
18227b87737p5492B39905c04455j4698d9661a9993G0983a89066E88J61224a89845
18215F611e4812k00588B29053h1918F5773i9542B25375j00490c9347J8913a056
18203i1113B772K95515o5546C1694d9204D00836h3173q3401O8810A32921c1150
18191g9351B03682A00851h1922j49644F1105P8639a11902A9059N4435A0705P4318
$$ plain form
18275 -162983 66689 -109215 -62860 319449 -33110 -318714 -211061 41444 -49471 -134977 30838
18263 -190476 191329 -277414 -23018 250283 -92609 78318 185451 -121493 -124452 -14062 89444
18251 -197903 56561 58927 -18409 -450163 -141000 61121 -209269 -127759 -62543 -103179 4398
18239 11265 -76171 -125104 -64211 -119538 61428 -546373 -73705 -138585 -401321 164267 10688
18227 -287737 -363229 239905 -304455 -319153 -49661 -19993 70983 -189066 588 161812 -189845
18215 6611 -54812 -255400 229053 -81918 65773 -99542 225375 124885 -39347 -20434 -1056
18203 -91113 2772 298287 232741 31694 -49204 400836 -83173 -166574 -97764 132921 -31150
18191 -79351 203682 100851 -81922 -231566 61105 139744 -111902 19059 73494 10705 85023
18180H5023j1115c0564j5461H2988R919K8414C3163h4338n2173G1087C0973b6158
18167b59729f1205A39563m8016A4798c93152C03041c34220A22607c13199B52669
18156A35216b09623B11723a5713j60520A73497L2302a89587Q6516j08157B87384
18145i2473A20842d37486I1114A8379q962a34894H9760J61829c27605c5595k74995
18134c10590d2011o918p3035D6736p116J5798b37984A56275J8314O2925c76814
18122e7186I3836b43391D4536a43867j1296j63163J05996j1254A72933a60950
18111B50842A14464b61365e7693n2772H405J28615b07891K5765N9573D2843a76329
18099A73225c3943j8476j7769B9780N2011B469O2128K18304b08294J01025B5409
$$ plain form
18180 85023 73908 -30564 -46025 82988 92907 121321 33163 -84338 -136511 71087 30973 -26158
18167 -259729 -61205 139563 91547 14798 -393152 303041 -334220 122607 -313199 252669
18156 135216 -209623 211723 -15713 -176233 173497 205799 -189587 -103071 -211228 287384
18145 -92473 120842 -437486 91114 18379 9417 -134894 89760 251589 -327605 -35595 -310590
18134 -310590 -42011 -48929 -121964 46736 39620 55418 -237984 156275 174589 237514 -376814
18122 -57186 93836 -243391 44536 -143867 -155163 -318326 -212330 -223584 172933 -160950
18111 250842 114464 -261365 -57693 -110465 8405 137020 -207891 -182126 -122553 42843 -176329
18099 173225 -33943 -52419 -70188 29780 81791 2469 64597 282901 -208294 -107269 25409
18087B7511b52634D2637c64610e8619k12638I0077c01782Q6438A35641A1427h4141
18075d0752k46754a16542l11824a46973A6140d0773j50460b9333m8106j50970
18065b28409B54833l2937q9940d5256o2618A21320a28080j39591R4300B56273
18054D9677g3422D4738b87420K9267A93871G6202k0871b20075D5203J74956l6066
18043A84093o6841c54462A47571a63059A2061N943b78899a05944I352f0771i569
18031c03992A6923b2479r1655E5943b65284j09375A7550a83043B14591m6482n4818
18020A13291n2191A8427c4795A4451d3093A72312l2953n3928J89164b15476M9672
18009a65804B15635b87783a21206A82038h1854D6552A5964a25144A09413a56502
$$ plain form
18087 27511 -252634 42637 -364610 -58619 -271257 90077 -301782 -215344 135641 11427 -84141
18075 -40752 -287506 -116542 -428366 -146973 16140 -40773 -191233 -29333 -77439 -228409
18065 -228409 254833 221896 131956 -45256 -107874 121320 -128080 -267671 -173371 256273
18054 49677 -73422 44738 -287420 -258153 193871 76202 55331 -220075 45203 220159 184093
18043 184093 117252 -354462 147571 -163059 12061 18004 -278899 -105944 9352 -60771 -9569
18031 -303992 16923 -22479 -114134 55943 -265284 -374659 17550 -183043 214591 168109 113291
18020 113291 61100 18427 -34795 14451 -43093 172312 139359 85431 274595 -215476 -165804
18009 -165804 215635 -287783 -121206 182038 -81854 46552 15964 -125144 109413 -156502
17998g1403K9806A36654J55315d78923A42153E3243a55717A3562K64664a83983
17987f8443D7273B3209d5951H1868a88120P7677j40891B55473a97112i2914A01609
17975b46156A20162E7954J32345D1155N3196a35153m0262A39405b01132e836m5309
17964e1145j73962J07471E28708a58932A8645a69785j05157E2758g1369F406j756
17953D650b99433a06005F4845a39203D6195g449C7924J01953a5798A74126o9693
17942A04433b79148R7842j34308J15047m46819C87962q4427f1786A8141L0562
17932D8703A5446N5331J33666b61751A06712A4827J56730b55054a6399A03189
17921c2541C60154a1909d198B46115a71291L0529j5000e7552A24623Q8844q9093
$$ plain form
17998 -71403 -41597 136654 291969 -478923 142153 53243 -155717 13562 278226 -183983
17987 -68443 47273 23209 -45951 81868 -188120 -110443 -251334 255473 -197112 -92914 101609
17975 -246156 120162 57954 190299 41155 94351 -135153 -175415 139405 -201132 -5836 -51145
17964 -51145 -225107 -117636 528708 -158932 18645 -169785 -274942 52758 -71369 6406 4650
17953 4650 -299433 -106005 64845 -139203 46195 -7449 37924 139877 -15798 174126 104433
17942 104433 -279148 -181306 -315614 -200567 -647386 387962 303535 -61786 18141 48703
17932 48703 15446 70777 204443 -261751 106712 14827 171557 -255054 -16399 103189
17921 -32541 360154 -11909 -4198 246115 -171291 -140762 -155762 -57552 124623 213467 124374
17910A24374D4629h3131H1323d6073M88m30024a21792m4897I5707B4542g2129
17898A56321k3341p311K84867b7419j01255I6468a20273J8253G6716o749b44337
17886e2872j83368K8500j02644J14519b5325A95355c52847Q5841E1121a87174
17875A55574g7532B50645a60956B31766b70159c0572A126K93688r0248c69999
17864H5800N6587P1127l1497J5358M7981I4796G673f1095A39788h9393b2861A55262
17851b28513A64156f127F5332i9388j45624I0492C5714a13864a6675q7333m9571
17840a53579j29764F4848d6249C30731D9168P0947b71393J8534K4591D8687l655
17829D5032K7483a56873k35483a34680r6966I8754c27516I598a26525C9913b80947
$$ plain form
17910 124374 44629 -83131 81323 -46073 -45585 -475609 -121792 -166689 95707 24542 -72129
17898 156321 132980 125669 410536 -27419 -128674 96468 -120273 -102020 76716 69967 -244337
17886 -52872 -236240 -207740 -310384 -195865 -25325 195355 -352847 -267006 51121 -187174
17875 155574 -77532 250645 -160956 231766 -270159 -30572 1126 294814 204566 -369999
17864 85800 142387 213514 182017 197375 245356 94796 7673 -61095 139788 -89393 -22861 155262
17851 -228513 164156 -6127 65332 -99388 -245012 90492 35714 -113864 -16675 -104008 -153579
17840 -153579 -283343 64848 -46249 330731 49168 120115 -271393 -252859 -228268 48687 45032
17829 45032 72515 -156873 -392356 -134680 -231646 98754 -327516 9598 -126525 39913 -280947
17817A84942D8789b29656M2294j40393f5266A4457a72388F7439p502J252N2436
17806A13625K4026A300M3548J40241b15839A4638g7025o2262k00213M8602b3087
17794b4860L999A75090A7658a13162L3853B6844a41573a7235E5537b14625b5408
17782F1716b03696C0617a31801o6574A20593l5706E023a25406J873I299b73123
17770A9374N3235j938b7479j15038A62823D2996a67831A72281k8944O178E3661
17758B0371e9285a785A1030b60410A55584e4423F6797K11137a17227r3819A41977
17746c29632I2070J03541G4604e275n3074P872m9046a795j27762d2194A81426
17734a78916B12793G2628O0286C7734N5321l285e8343E4215J54487b78077A60230
$$ plain form
17817 184942 48789 -229656 -187362 -327755 -65266 14457 -172388 67439 59937 61189 113625
17806 113625 137651 1300 44848 185089 -215839 14638 -77025 -139287 -339500 -290898 -23087
17794 -24860 -20861 175090 17658 -113162 -79309 26844 -141573 -17235 55537 -214625 -25408
17782 61716 -203696 30617 -131801 -198375 120593 84887 5023 -125406 -123533 9299 -273123
17770 19374 72609 70671 -27479 -142517 162823 42996 -167831 172281 143337 149515 53661
17758 20371 -59285 -1785 11030 -260410 155584 -54423 66797 277934 -117227 -211046 141977
17746 -329632 92070 195611 74604 -5275 -58349 -50477 -99523 -1795 -129557 -42194 181426
17734 -178916 212793 72628 132914 37734 93055 89770 -58343 54215 208702 -278077 160230
17722A7697a77256F6769a15764A61848n4745h9278J5542B08337I19J24517c4120
17710b76790g2123B98710i1343J1132D05810A89828C812f3978j79488b7286A13614
17698A3240M1577J37046n7014b42179a04949o9261I1652j1518B6425L69014B5781
17686H1461C3959J28281C3470a84279k1777M74B699g1097m3888d8466j35607q051
17674a92124F3689K2316a31037C07437f8998A30509b74339A15189b43565Q2350
17664a61215A14362k581c19010D04704f7143E465b67445a26152B2199c2274k29381
17653b61655B81242A10912a2687B05457F7739L3656K14901i0094B77426m4940
17643B32486h5117j6537n9226d4661j36821A65604p5258a50126L9198k50457i2587
$$ plain form
17722 17697 -177256 66769 -115764 161848 107103 -89278 -73736 208337 919 125436 -34120
17710 -276790 -72123 298710 -91343 -80211 405810 189828 3812 -63978 -243466 -27286 113614
17698 13240 54817 191863 134849 -242179 -104949 -174210 91652 80134 26425 395439 25781
17686 81461 33959 162240 33470 -184279 -206056 -205582 2699 -71097 -114985 -48466 -184073 -192124
17674 -192124 63689 86005 -131037 307437 -68998 130509 -274339 115189 -243565 -161215
17664 -161215 114362 111781 -319010 404704 -67143 5465 -267445 -126152 22199 -32274 -261655
17653 -261655 281242 110912 -12687 205457 67739 101395 316296 -90094 277426 232486
17643 232486 -85117 -101654 -160880 -44661 -181482 165604 90346 -150126 -110928 -361385 -92587
17631A28716a18493M4667k021r2300a1463p2853A85257M06581a80474a0390A70069
17619D1509a7451k43369h3085E6629L87081A7484O0662b7110B3302J42819a46679
17607b74283i9517C858d0637A40679B8251C552a09256A35830a51780A19944Q8189
17596B08133H7808d709C02702J62317k09233N0284B566M2170d07300A52745B5233
17584I1531D0392J76891B7868J01782b052A57683m9789f4721b9896B72805O3214
17573C36019I7480m6974K57215a17047B35156D9283j9029N6151a70529A76540
17562f8587A70925h6396E2705J11179p7490c2911A10680L53490b37706A3172c32843
17550i4024j18656R7365L6447H0329N1649d7804k04148J08868H9650a53990I6382
$$ plain form
17631 128716 -118493 -73826 -75847 -168147 -11463 -84316 185257 591838 -180474 -10390 170069
17619 41509 -17451 -260820 -83085 56629 443710 17484 78146 -27110 23302 166121 -146679
17607 -274283 -99517 3858 -40637 140679 28251 3552 -109256 135830 -151780 119944 208133
17596 208133 87808 -4709 302702 465019 255786 306070 2566 44736 -407300 152745 25233
17584 91531 40392 217283 27868 129650 -2052 157683 107894 -64721 -29896 272805 336019
17573 336019 97480 50506 307721 -117047 235156 49283 30254 86405 -170529 176540
17562 -68587 170925 -86396 52705 163884 86394 -32911 110680 464170 -237706 13172 -332843
17550 -94024 -212680 -115315 -78868 80329 131978 -47804 -251952 -143084 89650 -153990 96382
17538f3953D44528A57314h3237K9322j72514C00245D6386h2574B2631k641P6935
17527I6925d7104B49244M2554c553B03075b34560i939B5176a1693A59080c1875
17515E7381e8905F9315P7801j4745K72168A71014B9022K66465b29788B74522a2516
17503b5332C9708K5725K49208H7725J54936a9694B69743A1966a54247C30690A60510
17491A98495G4432J79121F7039d3567j0649C78450A381b18233A19110P9410b30708
17479a8810b288A61300J81957A47115g389A72478R2512m7443J9707r7293a26653
17467B53447j05688J91929a52998B23172H9624i7532j5781H5597d106D85569A98059
17455A1294J25530N932a176B60499j4552J2412J93457A75185J15243H6394N4308
$$ plain form
17538 -63953 444528 157314 -83237 -53915 -226429 300245 46386 -82574 22631 19990 96925
17527 96925 -47104 249244 291798 -3553 203075 -234560 -9939 25176 -11693 159080 -31875
17515 57381 -58905 69315 147116 132371 404539 171014 29022 295487 -229788 274522 -12516
17503 -25332 39708 65433 314641 87725 242661 -19694 269743 11966 -154247 330690 160510
17491 198495 74432 253553 67039 -43567 -54216 378450 1381 -218233 119110 198520 -230708
17479 -18810 -2288 161300 343257 147115 -7389 172478 264990 217547 237254 139961 -126653
17467 253447 147759 339688 -152998 223172 89624 -97532 -113313 85597 -4106 485569 198059
17455 11294 136824 142756 -1176 260499 245947 258359 451816 175185 290428 86394 140702
17444A40702M33183A67075J56447r5475M687d326B99540o5800J6936Q5938R3868
17433D30482j65143l9341M4690K81222j3794B41446F7785J17284N2696D0776N2979
17422I3755J02585C8734J26310P9080n1753K14603j80809K21844H9958R1865a39195
17410F07063k74508j32951F0254J586h255A21027n2137i3374K9029B52078A00912
17398g8876E625L58548A20494J09080D5450e8903F5513a6221A56511J62879A05606
17386B12000L6612A18243D5858J43699b5399o3861B1059G221K73217p0548F1038
17374C87228E9259J57524K8109k9425H2185e6049A80249L4351J10691q8037k9067
17363B08187k4688c6663A55564J59933K7617F11d4777A86167J15578A5169K47734
$$ plain form
17444 140702 573885 167075 323522 228047 232734 -4326 299540 233740 250676 336614 430482
17433 430482 265339 225998 270688 551910 538116 241446 67785 185069 237765 40776 93755
17422 93755 196340 38734 165044 244124 192371 406974 226165 448009 89958 181823 -139195
17410 607063 332555 199604 60254 61840 -8255 121027 68890 -93374 -64345 252078 100912
17398 -78876 5625 364173 120494 229574 45450 -58903 65513 -16221 156511 319390 105606
17386 212000 248612 118243 45858 189557 -25399 -89260 21059 7221 280438 209890 61038
17374 387228 59259 216783 244892 215467 82185 -56049 180249 214600 325291 237254 208187
17363 208187 183499 -36663 155564 315497 343114 611 -44777 186167 301745 15169 262903
17352B62903j08039f3723D8041P3681a54787D55460k05938J27525D6298L14076
17342C60374A74568m6743K70146n5490l6248g7419A60997k0743r928l6277J25383
17331B19432M7686n1811a45708B81231J56326A10564N6709B541K13431J64285
17321C80257j54516B3108J73966d1516B16291R9205J88175H0885M5538b17733
17310A73334L50914A69480b0759C09871a2992B03889a74721B40908C8299J14765
17300A53064j7222p306J07581o9085J64405g8981G6858a6284e764E06117n957
17289E00160b5022C38918I4032K13588A5989J92040k0855B1829O0179i8573B88025
17277E01910A06155O1698a00507d0406E9936N7829b77520C78741A26563K458l9081
$$ plain form
17352 262903 154864 -63723 48041 121722 -154787 455460 249522 377047 46298 360374
17342 360374 174568 127825 397971 342481 306233 -77419 160997 140254 130326 94049 219432
17331 219432 267118 215307 -145708 281231 437557 110564 167273 2541 215972 380257
17321 380257 225741 23108 197074 -41516 216291 315496 503671 80885 126423 -217733
17310 173334 524248 169480 -20759 309871 -12992 203889 -174721 240908 38299 153064
17300 153064 135842 128536 236117 167032 331437 -78981 76858 -16284 -5764 506117 500160
17289 500160 -25022 338918 94032 307620 15989 208029 187174 21829 82008 -98573 288025
17277 501910 106155 167853 -100507 -40406 59936 117765 -277520 378741 126563 129021 89940
17266H9940K03537D8926K37348C1362J12764A8970L69807a23518B266J05829A2436
17254g4116B69884j4712N7209C9250K49235J13201i405A0865J23262J65556b3285
17242F7418J03887Q2412j3292J58152n2092I2279L84736A08620J28381N9944E0501
17230H5382Q6608Q2801k6652J99209k10214J23938j04788F3909j1722L46877J16992
17219E16056m6092B12897j4233K66173r3435D5818J91389R333l5360j9222K81783
17208D73741k09904J72833A86959J31459e5856C13217o4539r9451k4856K69437
17198C93808n5948A19742L9090l5497K15611j32835J51747K4122j17626n7286
17188B07068K25966j33933q30o3875a25212D9802K41034p1967K72762A53935P621
$$ plain form
17266 89940 293477 48926 286274 31362 144126 18970 388777 -123518 2266 108095 12436
17254 -74116 269884 255172 312381 39250 288485 401686 -9405 10865 134127 299683 -23285
17242 67418 171305 253717 240425 398577 346485 92279 477015 108620 237001 296945 50501
17230 85382 171990 254791 228139 427348 217134 341072 236284 63909 52187 399064 516056
17219 516056 469964 212897 198664 464837 371402 45818 237207 246540 211180 191958 473741
17208 473741 263837 436670 186959 318418 -55856 313217 248678 149227 124371 393808
17198 393808 337860 119742 158832 123335 338946 206111 357858 381980 264354 207068
17188 207068 433034 299101 298271 234396 -125212 49802 290836 218869 491631 153935 161556
17177A61556R9732M1279L06188J7620k36159A29478J2721a43027B83392A40494
17166C99389j2851P2758G1712J64813L12077j50419R1090k10833P5021J37034
17156D90495l2951B15108g5527C60965J39573J16358l06028j31002F9340K89850
17146C59190K70179B55992J83757p3023J27385o7809m0690m0988a19510B40121
17135A73220L49939p3593k15482J18994q1620B8809J09576K21775j06355R6715
17125C50520p4364K72083q2505j92669K43800p4491j77584A19731M05051R3369
17115F18151k67627K1126K42868j29134r8028p8382J43304J38419A37668K09652
17105C47320Q6714A20474K51081L5886J44361d9985G45739j88658A42168K34095
$$ plain form
17177 161556 261288 302567 608755 626375 390216 129478 142199 -143027 283392 140494
17166 399389 386538 459296 71712 236525 548602 398183 489273 278440 353461 490495
17156 490495 457544 215108 -75527 360965 500538 616896 310868 179866 69340 359190
17146 359190 629369 255992 439749 366726 494111 426302 385612 344624 -119510 240121
17135 173220 523159 449566 234084 353078 271458 28809 138385 360160 253805 350520
17125 350520 276156 548239 465734 273065 516865 442374 264790 119731 524782 618151
17115 618151 350524 371650 614518 485384 387356 308974 452278 590697 137668 347320
17105 347320 434034 120474 371555 407441 551802 -49985 745739 557081 142168 376263
17095C76263J86742A85085K30973j79646N9493L59850B46475L6161j518J67267
17085D48385O4739G8738J58277N22106D7277K87016L46067k82790K72877j04111
17075E66336r0353M4149j14599k8550J94368j31125j39471J62812N2484Q0469
17065E96520K8181B01495N48176l54050L02257R8534k97371p8385j22431O1495
17055C59720J60858J64890k76258Q2333J61567k7330r7120K94272j53473p7348
17045E92111K32908k57691p4981J57757l03572K85280N6065R6482k66039L49264
17035H67584l51118J06358j09166R1524Q8367k06771K43296J6817k87375J60826
17025F20342j28031j23649L90586r1144m5705K06777j39107q453C04877M69044
$$ plain form
17095 376263 563005 185085 416058 236412 295905 655755 246475 282636 281118 448385
17085 448385 513124 78738 237015 759121 47277 334293 680360 397570 670447 566336
17075 566336 475983 520132 405533 376983 571351 440226 300755 463567 516051 596520
17065 596520 624701 201495 749671 395621 697878 796412 499041 420656 298225 359720
17055 359720 520578 685468 409210 491543 653110 625780 528660 822932 669459 592111
17045 592111 825019 567328 492347 650104 346532 631812 687877 784359 518320 867584
17035 867584 516466 622824 513658 605182 693549 486778 730074 746891 459516 620342
17025 620342 492311 368662 759248 668104 622399 829176 690069 681616 304877 773921
17015G73921J5906k4319j89680P6019J0685R5810l09997M87140D11836O47457
17005A059293D46080J21302L42649q8882J48447m33341N0462B55344O74382k75516
16995F54210K92068k51305k0957P6449r7245K62007j41349O3144j09035Q4541
16985H12528N1065M7789j08546N9149N6772l67879L87014L57270l42266J60456
16975A113352j64017L6944k4223K56233l99135l20225L68027J52725q8197N7364
16965I88848J43656j35292J81560n2341m33863L65905l3977k66050J47323J19213
16955A024982j01512L05211q4684n1761l59728L96663L5803l66734K58742L60139
16945A417121k69252j24887K21106p8394O4591J41964k41452J39279p1016O4397
$$ plain form
17015 773921 789827 765508 575828 651847 662532 758342 448345 935485 411836 1059293
17005 1059293 446080 567382 910031 821149 969596 536255 586717 255344 929726 654210
16995 654210 946278 694973 674016 750465 653220 915227 773878 837022 727987 812528
16985 812528 863593 911382 802836 861985 918757 550878 937892 1295162 952896 1113352
16975 1113352 949335 986279 962056 1218289 819154 498929 866956 1019681 931484 988848
16965 988848 1132504 997212 1178772 1126431 692568 1058473 1024496 758446 905769 1024982
16955 1024982 923470 1228681 1143997 1092236 732508 1129171 1164974 798240 1056982 1417121
16945 1417121 1147869 1022982 1244088 1165694 1230285 1372249 1130797 1270076 1199060 1263457
16935A263457J09024n9044o453j18091K26623K57599k42406o7058r9239Q4890
16925A349302Q3966J65470N0431m1241l06632P1253L14576k13887j0117J58598
16915A621719m6527j49293J12863J7984n1063J29464k25257M85092m9132k3960
16905A821890Q9244k54729R1777k00564K77723j45679K92497k90593O38595j51251
16895B168910l95303L26394n40010O07413j86426o428l9893j20609M03237j18306
16885B098979K7353m4477M01653n96989J13234K36854k6886L6454k11561K96705
16875B331319R9281K12985r5461K7168J65376j79286P7559j07947J07185J11530
16865B749709l3108J52631l5568j5112j43339L74632Q6703k56286O109O61695
$$ plain form
16935 1263457 1372481 1313437 1306984 1188893 1415516 1673115 1430709 1363651 1264412 1349302
16925 1349302 1433268 1598738 1649169 1607928 1301296 1372549 1687125 1473238 1463121 1621719
16915 1621719 1575192 1425899 1538762 1556746 1505683 1635147 1409890 1894982 1845850 1821890
16905 1821890 1911134 1656405 1748182 1547618 1825341 1679662 1972159 1681566 2320161 2168910
16895 2168910 1773607 2100001 1559991 2167404 1980978 1974550 1934657 1814048 2217285 2098979
16885 2098979 2126332 2081855 2483508 1886519 1999753 2236607 2209721 2246175 2034614 2331319
16875 2331319 2430600 2643585 2548124 2575292 2740668 2561382 2638941 2530994 2638179 2749709
16865 2749709 2716601 2869232 2833664 2818552 2675213 3049845 3136548 2880262 2886371 3548066
16855C548066j11953j30686J89015n9471j29499M73489j44041k15284O4042k0651
16845C463027K25393Q5371Q3436Q8434L55142n38789M4986j15716K51408N03910
16835D446602k25157l2647M42640j14391n9817N25386q7130O9634K6434J52423
16825E143977j16070R9348J40020J66246o3228J05367K20124J29446j9026K57814
16815F064018K27263J15603J31254j49240N51918K9295Q8080l23227O69443j28886
16805G275521M44807J64422P9549j3569M82337L21954J58591J64116M10822K06110
16795I694660J29901J62987M43693M0552p4253O02838N88892K98759M41632k69061
16785A2060600O58658J76318P53978L77907L74200J86536K83369Q38039N72259
$$ plain form
16855 3548066 3436113 3305427 3494442 3434971 3305472 3778961 3634920 3419636 3483678 3463027
16845 3463027 3688420 3773791 3857227 3945661 4300803 3762014 3807000 3691284 3942692 4446602
16835 4446602 4221445 4188798 4631438 4517047 4457230 4982616 4895486 4965120 4991554 5143977
16825 5143977 5027907 5127255 5267275 5433521 5370293 5475660 5695784 5825230 5806204 6064018
16815 6064018 6291281 6406884 6538138 6388898 6940816 6970111 7058191 6734964 7404407 7275521
16805 7275521 7720328 7884750 7964299 7950730 8433067 8755021 8913612 9077728 9488550 9694660
16795 9694660 9824561 9987548 10431241 10471793 10397540 11000378 11589270 11888029 12329661 12060600
16785 12060600 12719258 12895576 13649554 14027461 14401661 14588197 14871566 15709605 16281864
16776A6281864L59390N78282N35312Q47061J42372O86546Q31089Q79633N01044
16767B1642593O42694R45712R34410J096471R34588R05186J513970P85450J038976
16758C0440050J580630J382721J295250J660239J641696J954968J790080J750196
16750D3495830K777096J432312K962228K166804K448744K971430L197044L672594
16742F5124082L112652L576292L890175M350283M327272M542456N124818M664248
16734I8712278N692272N477532N672283O122121N984594O162910O253015O145863
16726A46222868O077528N746578N314125M972192M480783L235609K963675J911221
16718A80924579N54199n97266j102488k420486l626905l974357n062255n263148
$$ plain form
16776 16281864 16641254 17219536 17754848 18601909 18744281 19430827 20261916 21141549 21642593
16767 21642593 22285287 23230999 24165409 25261880 26196468 27101654 28615624 29401074 30440050
16758 30440050 32020680 33403401 34698651 36358890 38000586 39955554 41745634 43495830
16750 43495830 46272926 47705238 50667466 52834270 55283014 58254444 61451488 65124082
16742 65124082 68236734 71813026 75703201 80053484 84380756 88923212 94048030 98712278
16734 98712278 104404550 109882082 115554365 121676486 127661080 133823990 140077005 146222868
16726 146222868 152300396 158046974 163361099 168333291 172814074 176049683 179013358 180924579
16718 180924579 181478778 180881512 179779024 177358538 173731633 169757276 164695021 159431873
16710A59431873n838198o203457o029580o079331o753168n951627o042491o111639
16702A10422382n373740n412328n396224m786021m586969m637342l798539l930910
16694G2500309l561212l430797l251285l472201k471184l086235k236564k581457
16686D8409374k055423k021248k348136j898412j410286k072827j511636j502934
16678C3588472j520028j383111r83505j100340j398235j125187j083590o92830
16670B4301646j217784p87033j074335o08959m58248j246602n36426p25724n56642
16661A7089893m02208o77589m10001l62155q15846j59038o95329j84477n76159
16652A2807091p23556l7638p06674k82125k57634l43510m24367J5487l41475p4594
$$ plain form
16710 159431873 153593675 147390218 141360638 135281307 128528139 122576512 116534021 110422382
16702 110422382 105048642 99636314 94240090 89454069 84867100 80229758 76431219 72500309
16694 72500309 68939097 65508300 62257015 58784814 56313630 53227395 50990831 48409374
16686 48409374 46353951 44332703 41984567 40086155 38675869 36603042 35091406 33588472
16678 33588472 32068444 30685333 29701828 28601488 27203253 26078066 24994476 24301646
16670 24301646 23083862 22296829 21222494 20613535 20155287 18908685 18372259 17646535 17089893
16661 17089893 16687685 16010096 15600095 15237940 14422094 14263056 13567727 13383250 12807091
16652 12807091 12083535 12045897 11339223 11057098 10799464 10455954 10031587 10047074 9705599 9631005
16642I631005n79372j53260j99566j95594k80703J62751m81984J60848o77488
16633G386637N7487k89858n74736k36566L28602m6002l92156N4527m60921o8702
16623E758312J36900q10642L93036j95956j80327k38887M17140m08100J00310
16614D971786k83628Q1263m22228n7694J24168n3453m06413K60003k48239L46999
16604D312564m90023J8326N6409l97875K97578R304k78829j4824l37066j2871
16594C162693L6679L5713j14540j75856K05664R5571m00461k33454L41082o21112
16584B331979K88300K94610n20421L94139j07615k14471O2720m1841k62321M04605
16574B629684l46937J89978m7496k71272k88404L23265J7872j99663o0018O5515
$$ plain form
16642 9631005 9051633 8898373 8698807 8503213 8222510 8385261 7903277 8064125 7386637
16633 7386637 7444124 7154266 6579530 6342964 6671566 6625564 6233408 6287935 5827014 5758312
16623 5758312 5895212 5084570 5477606 5281650 5101323 4862436 5279576 4871476 4971786
16614 4971786 4688158 4769421 4347193 4289499 4413667 4360214 3953801 4213804 3965565 4312564
16604 4312564 3822541 3840867 3897276 3499401 3796979 3806283 3527454 3512630 3175564 3162693
16594 3162693 3199372 3235085 3120545 2944689 3150353 3245924 2845463 2612009 2953091 2331979
16584 2331979 2620279 2914889 2394468 2788607 2680992 2466521 2529241 2487400 2225079 2629684
16574 2629684 2282747 2472725 2425229 2153957 1865553 2188818 2206690 2007027 1947009 2012524
16564B012524J18051m95926K86723J18241K0896q3081L8777k83298J40712l9808
16554A833811J13676k35361J38331k85152K39347k17898L155p116j14798l5901
16544A432094K39205m565j88869P0128k43013P021P7788k65630K67779j27501
16534A264437J0545O5717P4858j02216M4779J73820l60303R4436Q4076l41465
16524A008684J78956j07337J06207p7809P0343Q0387l14947M7493n558p0534q5594
16513H30291K83281n4545L3130K18369k14255J78280j96076k4307K2269m23091
16503F53346M0743k0882K28659J80302m17203K77786Q5151k45955m4219J01400
16493H39128p6610J24387L3604k43517J97805K2316o091j32104O2373r3914L07533
$$ plain form
16564 2012524 2130575 1634649 1921372 2039613 2060509 1977428 2016205 1732907 1873619 1833811
16554 1833811 1947487 1712126 1850457 1565305 1804652 1586754 1589909 1582793 1467995 1432094
16544 1432094 1671299 1666734 1477865 1547993 1304980 1312001 1389789 1124159 1391938 1264437
16534 1264437 1274982 1340699 1415557 1313341 1358120 1531940 1171637 1266073 1350149 1008684
16524 1008684 1187640 1080303 1186510 1108701 1179044 1259431 944484 991977 986419 915885 830291
16513 830291 1113572 1059027 1092157 1310526 1096271 1274551 1078475 1054168 1076437 653346
16503 653346 694089 673207 901866 1082168 664965 942751 1027902 781947 737728 839128
16493 839128 762518 886905 920509 676992 874797 897113 891022 758918 821291 727377 1034910
16482A034910m62511j09075L45357P7605j8269l54729L25689J8458k93068J14692
16472F79059K2237j62571K76236C97305P34473C65032N1839L68020M4998k24782
16462F05107R1248j83117N78588l65566k60355J72263P9177l09288K57865B89414
16451G33711C65488K34929k99669O60890k54668r0414C06070N26510l37928p3102
16441D21550K99073j94759O9614p8333k58005J06742K5210k5025L2931R3856j47844
16430C45010m0436J32258L6545K14569C28455J97740j30344L75307B36771P1106
16420C07877L45718C01198L6488L14953A55210M22990j41157R9450A18418K98266
16410D16684K61571k44636l4266k8135a47154C69209m0382L7842J44459k02752
$$ plain form
16482 1034910 572399 463324 808681 886286 868017 513288 838977 857435 564367 679059
16472 679059 701296 538725 814961 397305 1131778 365032 416871 784891 829889 605107
16462 605107 696355 513238 1091826 726260 465905 638168 717345 408057 665922 289414
16451 733711 365488 600417 300748 961638 706970 616556 306070 832580 494652 421550
16441 421550 720623 525864 595478 517145 259140 365882 391092 366067 398998 492854 345010
16430 345010 304574 436832 473377 687946 328455 526195 395851 771158 236771 307877
16420 307877 653595 301198 337686 652639 155210 578200 437043 536493 118418 416684
16410 416684 678255 433619 399353 371218 -147154 369209 328827 366669 511128 308376
16400C08376M40772k26183j20444m610K01832B09192J87892L7094K11014A18711
16389D76146k8425j06294l7288L7376j06459R2980r9463L09199r6745j16445J32942
16378D57524j00555K1261J48j74817J76822g2539C37055B5229K86752m5451J03653
16367C70183N8609p7842j45518n0085J28231L53916A72312K21323C9635N61406
16357F01041A68920Q5039o8267J83205P9555a17630C02457j12892J22268j20169
16347A91664J26916A11950K6046O6406I793J60269G2301N06963k86067C4625L28679
16336C63304D117L42128a29316D8031J7470c0008A44609R3170J46721j85132M6791
16325B46159k7059a77087f149E5515M39589c373A66562j0508J85004j56839R1185
$$ plain form
16400 308376 749148 522965 402521 397911 599743 209192 397084 434178 645192 118711
16389 476146 447721 341427 304139 341515 235056 328036 228573 537772 441027 324582 457524
16378 457524 356969 378230 378378 203561 380383 -72539 337055 25229 311981 266530 370183
16367 370183 428792 350950 205432 155347 283578 637494 172312 393635 39635 601041
16357 601041 168920 253959 185692 368897 448452 -117630 302457 189565 311833 191664
16347 191664 318580 111950 137996 204402 9793 170062 72301 579264 293197 34625 363304
16336 363304 4117 346245 -129316 48031 65501 -30008 144609 237779 384500 199368 246159
16325 246159 219100 -177087 -6149 55515 495104 -3373 166562 156054 341058 184219 275404
16314B75404L1521J63853G9144R3174F9602J16284N7283K84700E7193a3981j61966
16303a75947G41869A26991Q4287Q1313f0724h913E7651M0501Q1094J81246J01649
16292D62141A71551j0190j5097g3129A11142K37988F5555a7302C77460a7788A75958
16280a02709C11591I2218Q0045i9313A16703J87654a0711C22729I4236K266k1266
16269G5236L321O3297O805J8309q1316B3273f8291C79058a77299D4884O2295k6380
16257H0799P0663K09528A28448m7354J45406Q8543j47883H1261a36824A84462
16246A16582K7313K63573q6732d104j78967A52481p5927f2592k8017F0731H472
16234e9060o8550F7090K26067H7473K20590B260f0227E0397K16277F2742K50541
$$ plain form
16314 275404 306925 470778 79144 172318 69602 185886 243169 527869 57193 -13981 -175947
16303 -175947 741869 126991 211278 292591 -60724 -8913 57651 98152 179246 360492 462141
16292 462141 171551 161361 146264 -73129 111142 349130 65555 -17302 377460 -17788 175958
16280 -102709 311591 92218 172263 -99313 116703 304357 -10711 322729 94236 96502 75236
16269 75236 78557 141854 148659 166968 85652 23273 -68291 379058 -177299 44884 107179 80799
16257 80799 151462 360990 128448 81094 226500 315043 167160 81261 -136824 184462
16246 116582 143895 407468 320736 -4104 -183071 152481 76554 -62592 -90609 60731 8472
16234 -59060 -127610 67090 293157 87473 308063 2260 -60227 50397 266674 62742 313283
16223C13283A31917a40749G2968Q2032d54873B12149I136J14291O4388K11220
16213C99035A14989E2446O0971C4824J01534a61884f2465A04613e7871o990j64301
16202b29162D7953J02550D4672b597j22180B85245p5393f1953A33471n6188f3264
16190F80502i9529C9076K58126K6480j35850B6729a39627D6873K69609a92975
16179F4376b5157B78780j12389F1495J55439r1920C2808b74284A17939i8411H2348
16167d5105A87656f38k1032j49308B17220A08003J3445E7543P1148k0900e798
16155d1249A4061d5872j13251f738k95139f5650F2336a17292A73146a09201D4629
16143H0573a96027H8181F763J51742e10753b48128B35938H2212B5855P763R0729
$$ plain form
16223 313283 131917 -140749 72968 155000 -454873 212149 9136 123427 187815 399035
16213 399035 114989 52446 113417 34824 136358 -161884 -62465 104613 -57871 -64861 -229162
16202 -229162 47953 150503 44672 -2597 -124777 285245 209852 -61953 133471 77283 -63264
16190 680502 -99529 39076 297202 323682 187832 26729 -139627 46873 316482 -192975
16179 64376 -25157 278780 166391 61495 216934 125014 32808 -274284 117939 -98411 82348
16167 -45105 187656 -638 -21670 -170978 217220 108003 121448 57543 128691 107791 -5798
16155 -41249 14061 -45872 -159123 -6738 -301877 -65650 62336 -117292 173146 -109201 44629
16143 80573 -196027 88181 6763 158505 -510753 -248128 235938 82212 25855 33618 124347
16132A24347A938Q8785J56506A12119R0722D0817E518J10174b7701j02708j85438
16121c15847B43425i071A54746a92245A54911C6890G086c2515e454k8043D504
16109b09684i8120A06147h085m36716b21735B62775A6368i4342A34172a76278
16098a44090f2075j21752j02318R8284A80633B8610J41217M3816q5212a44015
16087a29174A74652a75401d3795j81372g0638J1819B07388O4281c13103J04479
16077b08624p0790A17040p609j007C3219c42351d6463i240B167a71926B46897
16065C6706A0342a35872C7662a8781A0260a14185H7982J5987j8654a52883A09200
16053a81918O0434d4479H3134j5685k3437A9755J2332J93494G8627a06426H0182
$$ plain form
16132 124347 1938 90723 247229 112119 202841 40817 5518 115692 -27701 -130409 -315847
16121 -315847 243425 -9071 154746 -192245 154911 36890 7086 -32515 -5454 -33497 4504
16109 -209684 -98120 106147 -8085 -444801 -221735 262775 16368 -94342 134172 -176278
16098 -144090 -62075 -183827 -286145 -187861 180633 28610 169827 213643 128431 -144015
16087 -129174 174652 -175401 -43795 -225167 -70638 -58819 207388 271669 -313103 -208624
16077 -208624 -279414 117040 109431 108424 33219 -342351 -46463 -9240 2167 -171926 246897
16065 36706 10342 -135872 37662 -18781 10260 -114185 87982 103969 85315 -152883 109200
16053 -181918 -121484 -44479 83134 67449 44012 19755 32087 225581 78627 -106426 80182
16041B92950p2828r9168b18008A06822m7252P2563a52199B30221a12231A21003
16030G7273c9905j47205l04142a3833A23626B5156c0133B73237L2079F8500b587
16018F0643A8659J18635D8890b79410h7074k34968Q2041Q3590d0997F9293N3162
16007A22455a78269p1196A95238d0466k43438g3022B9137O3541C4736e28384C21150
15995B23631F3056d2098k28744A37606J49478a29789J1266N8140B25743g7820
15984A2024K81717F9268A3625J34908P1077a18457L8916c3542A6155L17776F8265
15972G0291a76324M1423A25416A3808K51531H9828j2741K15137H2493b11290i2076
15960C071a17544D4940O7796K9313n1865c35020H4512J10667b45519N718Q815
$$ plain form
16041 292950 220122 120954 -218008 106822 59570 132133 -152199 230221 -112231 121003
16030 77273 -39905 -187110 -491252 -13833 123626 25156 -30133 273237 305316 68500 -2587
16018 60643 18659 137294 48890 -279410 -87074 -322042 -240001 -156411 -40997 69293 122455
16007 122455 -178269 -249465 195238 -40466 -283904 -73022 29137 92678 34736 -528384 321150
15995 223631 63056 -42098 -270842 137606 287084 -129789 -118523 -60383 225743 -77820
15984 12024 293741 69268 13625 148533 219610 -118457 -79541 -33542 16155 333931 68265
15972 70291 -176324 -134901 125416 13808 265339 89828 77087 292224 82493 -211290 -92076
15960 3071 -117544 44940 112736 142049 90184 -335020 84512 195179 -245519 -239801 -230986
15949b30986A09488a41907k82701M9110H360R3800e0585j79625P6081k54926a80532
15937b9867l17794a46488p0703A73803b58486A72329b1402l389q0404A44912e8712
15925d319J24l39007i1209p8420B24336j10170B6069i6048J5978G496i3481c3130
15912a30861k83439A3943a07489A8586L02471a88859A4072J30835J63945a30296
15901a22629J1741G274J14227I085f7804A17784h8002J7048A49789c28289J48026
15890a80263Q7451k69680B24026N0756N663d306B59797a74876E8229J38056F9812
15878a00203B73390i9173m3498e1486p6010C47716A16227b33026j15525a10002
15867e241A05149J26926a31341b3617F4340L7600a29288A14391m3411b78943F760
$$ plain form
15949 -230986 109488 -141907 -424608 -375498 8360 102160 -50585 -230210 -154129 -409055 -180532
15937 -29867 -347661 -146488 -217191 173803 -258486 172329 -21402 -24791 -105195 144912 -58712
15925 -4319 -4195 -343202 -91209 -169629 224336 114166 26069 -96048 -80070 7496 -93481 -33130
15912 -130861 -414300 13943 -107489 18586 321057 -188859 14072 144907 308852 -130296
15901 -122629 -110888 7274 121501 9085 -67804 117784 -88002 -70954 149789 -328289 -180263
15890 -180263 -92812 -362492 224026 274782 280445 -4306 259797 -174876 58229 196285 69812
15878 -100203 273390 -99173 -142671 -51486 -127496 347716 116227 -233026 -348551 -110002
15867 -5241 105149 232075 -131341 -23617 64340 101940 -129288 114391 70980 -278943 6760
15855f7447j58235e5488G1650C5065P6698j7707L9590c13018B881b47833A76834
15843A05216g9460r2146A29644e9511A77944J24897h2417q7181A33395A5241a84703
15831C58093A18599c13401H452J88376e9728k02193K3364K690k27662A44810a67712
15819a57102j9038H3335j4256a12892o8718j2532b8896G4131J7745a72850K6091
15808a46759B9269b44231d5043m8086p3026O488N24A5623b22402A12067a41814
15796A52133D7081i5044a5676p5385j03046A04242B4822f4815k08981A93552i5605
15784b18089k3694C43911D7146b91139i3046L9383j04519b2443E7011R3493b1919
15772c17613k22308K28689c3064m1492a0411A14621a50452E8253e0601l6349E0473
$$ plain form
15855 -67447 -225682 -55488 71650 35065 111763 94056 133646 -313018 2881 -247833 176834
15843 105216 -79460 -171606 129644 -59511 177944 302841 -82417 -169598 133395 15241 -184703
15831 358093 118599 -313401 8452 196828 -59728 -261921 -238557 -235867 -463529 144810 -167712
15819 -157102 -176140 83335 69079 -112892 -181610 -194142 -28896 74131 91876 -172850 -146759
15808 -146759 29269 -244231 -45043 -93129 -166155 -159667 -159143 15623 -222402 112067 -141814
15796 152133 47081 -95044 -15676 -91061 -194107 104242 24822 -64815 -273796 193552 -95605
15784 -218089 -241783 343911 47146 -291139 -93046 -53663 -158182 -22443 57011 150504 -21919
15772 -317613 -539921 -311232 -33064 -74556 -10411 114621 -150452 58253 -50601 -86950 50473
15760d31648i7568n559c9307H7820J92336j22660J33852A18964m3394h877D9334
15748e6576j36638H8032A1955L55585A59444D6219c10210a18564Q423p8318j88197
15737c76656J44579B79777j09836a1949E8668a3517G249M5999B1626c21432g4252
15725I184c47307J46478O2918A36545O8464b55536a01173m905B44651a78950K8117
15714a50833k09591M1047g1071C77892h8223B46927E4555d7860B9997a56154q8688
15703b44842Q3946B3277J88468B7169J606A3045K28191a64360c5630j1048N733
15692d0945a5003D9708L99675f0277C13785a06443F13617B13339b09677j7897
15682b27574j58046a80002E056a00327k45582l1197G6406b27396k5276b6281k08126
$$ plain form
15760 -431648 -97568 -103127 -39307 87820 280156 157496 291348 118964 75570 -8877 49334
15748 -56576 -193214 88032 11955 367540 159444 46219 -310210 -118564 -110141 -188459 -376656
15737 -376656 -232077 279777 169941 -11949 58668 -13517 7249 53248 21626 -321432 -74252
15725 9184 -347307 -200829 -137911 136545 205009 -255536 -101173 -106078 244651 -178950 -150833
15714 -150833 -360424 -319377 -71071 377892 -88223 246927 54555 -47860 29997 -156154 -244842
15703 -244842 -160896 23277 211745 27169 28775 13045 241236 -164360 -35630 -46678 -40945
15692 -40945 -15003 49708 449383 -60277 313785 -106443 613617 213339 -209677 -227574
15682 -227574 -385620 -180002 5056 -100327 -345909 -377106 76406 -227396 -252672 -26281 -234407
15671b34407B14249G9124h4001J2125r7675f2740b2406D7452K34554a51300R920
15660a41380A95260c23058E1192c35389F5261a75400A88545p9077J5909a03573
15649A07765B8583L31621a09907A66926i3853E7158J39304b38759H0018i0732
15638A65816Q9948A5740b9277A88053a27232K5564B21599I6319A3522J01319R1104
15627B05945a15706O356l24852a98011e8276A28273c5170h211I1442J76365D5320
15615c73822e6139m0100A14426c39693B70774E9365b89068A36450a02280E1980
15604a02093m40607A99147e9063C49122B2270a3331j07373B57832C2982L9377
15594G2359a41052d434l82887H1070J91510a9174j76419A87624B3023a3431g22
$$ plain form
15671 -234407 214249 79124 -84001 -71876 -169551 -62740 -22406 47452 282006 -151300 -141380
15660 -141380 195260 -323058 51192 -335389 65261 -175400 188545 109468 125377 -103573
15649 107765 28583 360204 -109907 166926 -93853 57158 196462 -238759 80018 -90732
15638 165816 255764 15740 -29277 188053 -127232 -101668 221599 96319 13522 114841 205945
15627 205945 -115706 -109350 -434202 -198011 -58276 128273 -35170 -8211 91442 267807 45320
15615 -373822 -56139 -96239 114426 -339693 270774 59365 -289068 136450 -102280 51980
15604 -102093 -542700 199147 -59063 349122 22270 -13331 -120704 257832 32982 72359
15594 72359 -141052 -4434 -387321 81070 272580 -19174 -195593 187624 23023 -13431 -722
15582b63588F4207J89803d9402k1533j16305c5641j81759H3818e6119H1600a37027
15570b52438B18538o9157e7747k06283R8853A43271b2619B01789J1023J62723
15560C75535D4314M0029k0071A57J54033a60011A39738a53918e6519o018K3699
15549c8838m2740O643k4272J2262C3292c24089L2831J3451I0145a77432o3303
15538b40735k4582B33557A13648Q7802P1981a8890k2648j07291G0219c46371J24159
15527b22212C67909A62159a45418B9593b7584m0646D2851K22721a781j10120A59539
15515a38427d0689q4116A59995a33164c0789A34310J28669A2529c41387e0758
15504G4286d1945j93515e8965D5684K7562N8615d8373A72560F435J77704c14666
$$ plain form
15582 -263588 64207 254010 -49402 -70935 -187240 -35641 -217400 83818 -56119 81600 -137027
15570 -252438 218538 149381 -57747 -264030 -165177 143271 -22619 201789 212812 375535
15560 375535 44314 84343 64272 157 154190 -160011 139738 -153918 -56519 -62537 -38838
15549 -38838 -81578 -74935 -99207 -86945 33292 -324089 -291258 -277807 90145 -177432 -240735
15538 -240735 -265317 233557 113648 201450 273431 -18890 -41538 -148829 70219 -346371 -222212
15527 -222212 367909 162159 -145418 29593 -27584 -68230 42851 265572 -1781 -111901 159539
15515 -138427 -40689 -124805 159995 -133164 -30789 134310 262979 12529 -341387 -50758
15504 74286 -41945 -235460 -58965 45684 73246 131861 -48373 172560 6435 184139 -314666
15492D5210a33802m7409D13184A72710a09457I0697O6498i7532c6152a6852k73836
15481b90688B40528q9097h8926A03051L12a25536G6725o128h5089B3689g0223
15469A64831r860J08733q5636J26469q7049H3748c68119H5516R1662b69361c1764
15457E7014j8613J08477e4669f892B76715a72491g1684j40691B19426J26900n0197
15446B96129a39382e6373B95845M515e23n6315j67213E3582K4664g305D5216a20782
15433a93777f7492k33704A83286q5572j1871b16769I7711b43252n2134a17850
15422B25065b75857A33748d15910e1107q0075l19196B03866b17665D68440A40554
15411A03195J91i1735A46129h38k54A36945h0812C5019a53754C58336i1300d5329
$$ plain form
15492 45210 -133802 -181211 413184 172710 -109457 90697 157195 -97532 -36152 -16852 -290688
15481 -290688 240528 151431 -88926 103051 103363 -125536 76725 70597 -85089 23689 -70223
15469 164831 154971 263704 178068 304537 217488 83748 -368119 85516 177178 -269361 -31764
15457 57014 38401 146878 -54669 -6892 276715 -172491 -71684 -212375 219426 346326 296129
15446 296129 -139382 -56373 295845 300360 -523 -56838 -224051 53582 78246 -7305 45216 -120782
15433 -193777 -67492 -301196 183286 97714 85843 -216769 97711 -243252 -295386 -117850
15422 225065 -275857 133748 -415910 -51107 -131182 -450378 203866 -217665 468440 140554
15411 103195 103386 -91735 146129 -838 -1092 136945 -80812 35019 -153754 358336 -91300 -45329
15398g3804k09105B39157b61890H1721b03560E8668a99156F6718a43063k76097
15388d19160a44854n7120J3266I5215a96248B7754M0811P0973O7791g3724j92334
15377b66058R405C816a73226j26228a7050j9633b428B2354a40799K2275q1222
15366a99746E4604l364g7965q0749E4134J2170J97601p2559a19842b5637A65987
15354c41j08877b633l66629a24706E0934a63083A53205d7599A83518g0694H6448
15342a0494o6160e458F9539b16865G4726J31580J48482m842d45179a06204I4922
15330C5136J38179Q9620a95799h1738n372A18676a12315D04606A89627m3981a57897
15318A05349a87965A09603l166C0180J30689E5157K67466A10008D8463O5070a29711
$$ plain form
15398 -73804 -282909 239157 -261890 81721 -203560 58668 -199156 66718 -143063 -419160
15388 -419160 -144854 -201974 -188708 95215 -196248 27754 68565 139538 207329 -73724 -266058
15377 -266058 -256653 3816 -173226 -299454 -17050 -36683 -2428 22354 -140799 -118524 -199746
15366 -199746 54604 51240 -77965 -158714 54134 66304 263905 191346 -119842 -25637 165987
15354 -341 -109218 -2633 -369262 -124706 50934 -163083 153205 -47599 183518 -70694 86448
15342 -10494 -76654 -5458 69539 -216865 74726 206306 354788 349946 -445179 -106204 94922
15330 35136 173315 262935 -195799 -81738 -87110 118676 -112315 404606 189627 145646 -157897
15318 105349 -187965 109603 106437 30180 160869 55157 322623 110008 48463 113533 -129711
15306E1650b60789A46418b0274A63309l3490a9929C8263J2585J71435a64102J3619
15295a50483C2934Q9835l5352A3764e312E2882R7131D9412b2939q4377C43140
15283F06806A09757L57613a32345E0018J62972L4526j3394a20789a4649k6901
15273d1550A68900e7328D0521a58751B96998a68659k04734I20a14685K7619K1061
15262f6005B37171O6961j22657L8919b92218B53682A18431a28729C62670J9733
15252C82403j40051K93841J70339J59116l50535P00472j2554E53562P9601f8529
15241A59960k4281a1809q3107H722f3433A41436J88583j64841M8997J12526r2384
15230B34317c06110B92881A15385a54720g3542C09596c22772A12755h9735B09738
$$ plain form
15306 51650 -260789 146418 -20274 163309 129819 -19929 38263 50848 222283 -164102 -150483
15295 -150483 32934 122769 87417 13764 -5312 52882 150013 49412 -22939 -107316 343140
15283 606806 109757 467370 -132345 50018 212990 247516 234122 -120789 -14649 -41550
15273 -41550 168900 -57328 40521 -158751 296998 -168659 -373393 920 -114685 -87066 -66005
15262 -66005 237171 304132 181475 220394 -292218 253682 118431 -128729 362670 382403
15252 382403 242352 536193 706532 865648 515113 1215585 1203031 553562 633163 -68529
15241 159960 135679 -11809 -94916 8722 -63433 141436 330019 165178 214175 326701 234317
15230 234317 -306110 292881 115385 -154720 -73542 309596 -322772 112755 -89735 209738
15219f7833a8581A92805i0097A16364J83766A09911q084A3868d544k55303A35091
15207C6377Q5928a18815a7203A55008J60431r4785i6509A76202a01559f859m1920
15196d8779E6955K66218D7871J66262Q2514H2030J01752J26330a69305j89313
15186c58618B58663n1745E2521a83832C81925i8938c1924A21063b2586B16310
15175A91927Q8563H9911k6133K79357K6584A5566a62621l12077a11905I7219a03991
15163C83854A23734n5394N7385e845j23258A4011f2215A96683a57393A79207H7600
15151B50774a06244e16B37979b02049D9578K49232N119b10791B95984g2027g075
15139d638l10968b4990B36474b39485A89734b39810B86284p9399f292C26190g6749
$$ plain form
15219 -67833 -18581 192805 -90097 116364 300130 109911 101827 13868 -4544 -259847 135091
15207 36377 122305 -118815 -17203 155008 315439 220654 -96509 176202 -101559 -6859 -48779
15196 -48779 56955 323173 47871 214133 296647 82030 183782 310112 -169305 -358618
15186 -358618 258663 206918 52521 -183832 381925 -98938 -31924 121063 -22586 216310
15175 191927 280490 89911 63778 343135 369719 15566 -162621 -474698 -111905 97219 -103991
15163 383854 123734 68340 125725 -5845 -129103 14011 -62215 196683 -157393 179207 87600
15151 250774 -106244 -516 237979 -202049 49578 298810 303929 -210791 295984 -72027 -7075
15139 -4638 -315606 -24990 236474 -239485 189734 -239810 286284 206885 -6292 326190 -76749
15127a03672j70906E8883n425L61538g1744B14397O9390I2065L53379A11431m0219
15116G1212M6147a38623A68846J23635g9290A21887A862b64481B7605i9903C26924
15104B42034J14231A72804l9603J43021j14148m5192J72253A43000J4365e6913
15093B65045I4895J92931A07863j4302K52922J04287g3415B60625F9510l2433
15083C7077J02958N8686K22692e5010A85215i155C4374J41541g4779B33244A6662
15071E2986M79348E9074L84014k18010P5149D2205J20730l3558b47877B76488
15060A77630N9479m2920f9881A73825b70843B90262a28166H5341K019C2826A0932
15048B39645M5397k9874H8751J90482c08316B35333R4290N9239A64484o3312J47386
$$ plain form
15127 -103672 -274578 58883 53458 414996 -71744 214397 283787 92065 445444 111431 71212
15116 71212 117359 -138623 168846 292481 -79290 121887 1862 -264481 27605 -99903 326924
15104 242034 356265 172804 133201 276222 162074 116882 289135 143000 157365 -56913
15093 265045 94895 287826 107863 93561 346483 450770 -73415 260625 69510 37077
15083 37077 140035 198721 421413 -55010 185215 -9155 34374 175915 -74779 233244 16662
15071 52986 532334 59074 443088 225078 300227 42205 162935 129377 -247877 276488
15060 177630 237109 194189 -69881 173825 -270843 290262 -128166 85341 87360 32826 10932
15048 239645 285042 255168 88751 279233 -308316 235333 329623 388862 164484 101172 248558
15037B48558A5903K10802f5808H4829O9128J10497I7947J02439K6256C1442J39228
15026A70670C9001c7971E14446k33398j3316A09687J23702c126A53491a21109
15015C63896F6751r677R3637F4881a7523C50964j47354F8368a72679A47932J32311
15004B80243r0804R034C5577K09603A4572a02467B8450J42625N686J08727j28815
14993A56673K54584b5413B06452K08744A87505n6440f8201B52536J35572j28010
14983B60098a21638A93743K62104A66469J06648r2662m6468K72016j69410K0387
14973B56980q9116D1940N01284c9471B95326K68998j41764A79786J9738J5404
14963B14928k4563a83081C26527K44988A63823N3024R1421j0903l8592J37180
$$ plain form
15037 248558 15903 226705 -65808 84829 153957 264454 97947 200386 226642 31442 170670
15026 170670 39001 -37971 514446 281048 267732 109687 233389 -3126 153491 -121109
15015 363896 66751 57074 150711 64881 -17523 350964 203610 68368 -172679 147932 280243
15004 280243 189439 198473 35577 245180 14572 -102467 28450 171075 176761 285488 156673
14993 156673 411257 -25413 206452 415196 187505 131065 -68201 252536 388108 260098
14983 260098 -121638 193743 455847 166469 273117 180455 133987 406003 236593 256980
14973 256980 167864 41940 543224 -39471 295326 564324 422560 179786 199524 214928
14963 214928 190365 -183081 326527 571515 163823 216847 308268 297365 258773 395953
14953C95953r5918m4999I6865J84324E5910R4577K51490k2949l6241A45263m6864
14942I8399J51190J69903A25410J70966j10381J02204m5640L06953B58099K09959
14932D68058j1201m0005j146A45681K24284A51217A8049R388F552L11846A47792
14920B15810J29820A2079M61473p8727o4956B1893K26738J03812p7102D6463K58237
14909C04700j48010J77301q5773N45527B50129M80386l60834A44598J59189J46951
14899D50738A83163l4042K31384J97098j97787m9593K82269E2323J19616q3317
14889H8622J41718J61254j01181J00485r6056J16813L1490k01491K63525k31384
14879B73795O2145p5355J98999o6434j05357J84522j34562L20788k77327q7636
$$ plain form
14953 395953 300035 255036 96865 281189 55910 150487 401977 379028 342787 145263 98399
14942 98399 249589 419492 125410 296376 185995 288199 242559 549512 258099 468058
14932 468058 456857 416852 415706 145681 369965 151217 18049 27437 6552 318398 147792
14920 215810 345630 12079 473552 394825 329869 21893 248631 352443 275341 46463 304700
14909 304700 156690 333991 248218 793745 250129 730515 369681 144598 303787 450738
14899 450738 183163 149121 380505 577603 379816 330223 612492 52323 171939 88622
14889 88622 230340 391594 290413 390898 294842 411655 443145 241654 505179 273795
14879 273795 335940 260585 459584 393150 287793 472315 337753 658541 381214 293578
14869B93578R054j31937L6789N40286l61229m7203N8849l5012D8870J59680O0063
14858B68613O7050l4209J35721M20834l05190J02360B97980K28589k50740K24834
14848E00663m4967A72696J63348M3093r0630O980j03581M8205L83345j33200J5310
14837E05566j57926q8726K48594r1278J37330B60448O2353K7777K71798P1592
14827F93968j95372J27653j05989n7237M9536m1786A84158J54752N648K26827
14817E71385N3807Q7418j89757L596j47711K92545j37490K821j79096A60689M91607
14806F52296q7943N8392r4577f0183E89745K8175M3982O2148k33309j76597n186
14795C08958K76957q1368K04892j54800k7553o6507J66604k6793N7036J34K02300
$$ plain form
14869 293578 302632 170695 207484 747770 386541 339338 398187 363175 48870 208550 268613
14858 268613 335663 301454 437175 858009 552819 655179 297980 526569 275829 500663
14848 500663 455696 172696 336044 379137 288507 295487 191906 240111 623456 490256 505566
14837 505566 347640 258914 507508 416230 553560 260448 322801 350578 622376 693968
14827 693968 498596 626249 520260 463023 512559 470773 184158 338910 344558 571385
14817 571385 625192 712610 522853 526449 378738 671283 533793 536614 357518 160689 652296
14806 652296 564353 622745 528168 -60183 589745 617920 661902 724050 490741 314144 308958
14795 308958 585915 504547 709439 554639 527086 460579 627183 600390 657426 657560 859860
14784H59860B98784M44324k13463j68980K39888L3794q428N4200j05689A34509
14773F24418p5741j00185N763K22435j86843j17732L61532r3445K30290l25230
14763E45262L3832k1718r4942N12779r0412J42212k07901k14408J14991l41569
14753C78126L62968j79694J35515k4206k13794J55359k4254P6358j19460Q9540
14743F36458J4519K39434j11440B76496N07482m5509L148J09403j08138R4864
14733H37746P3970j30513J06638k827k32630J54257j55377J38496j5062k54200
14723E20498J13159M48637k31483k47126n4624M68659j74260Q5484k61651J98796
14713H66089n5033l48228K26210J87309N1837l51859K68494R9622j96073R3498
$$ plain form
14784 859860 298784 743108 529645 360665 600553 634347 625919 680119 574430 134509
14773 624418 548677 448492 454255 676690 489847 372115 733647 640202 870492 545262
14763 545262 579094 557376 462434 975213 884801 1027013 819112 604704 719695 378126
14753 378126 741094 561400 696915 672709 458915 614274 590020 666378 546918 636458
14743 636458 650977 890411 778971 276496 783978 738469 741617 851020 742882 837746
14733 837746 911716 781203 887841 885014 652384 806641 651264 789760 774698 520498
14723 520498 633657 1082294 850811 603685 549061 1017720 843460 928944 667293 866089
14713 866089 811056 462828 689038 876347 928184 576325 844819 944441 748368 841866
14703H41866j84325L56789r8836J58680k86975j44543M59385k10067o5911k40311
14693E85752K08456K40874l9524j53120L99409m81717J62524j33630L04331O0329
14683A153684j47678J84378r9792P7948m30921N08520k71929K74703j95734J59472
14673A212651k29095p3043O6944Q6094q8300j96835L26077j69307J09500J3188
14663A057874k08002J52110j02487P769m4442n3113L14289L31789k13663k63437
14653I78687J72858N6159k57587J40059p1183p3225l5456L34298k62501K81471
14643A263580q4249J32592k55192L57380J65732l41354M8951o2858M52508m95680
14633A181410J9242J69187J10075k23078J20231k62284K95200j10039J49507k53052
$$ plain form
14703 841866 657541 1014330 915494 1074174 787199 642656 1102041 891974 826063 585752
14693 585752 794208 1035082 995558 842438 1241847 760130 922654 789024 1093355 1153684
14683 1153684 1006006 1190384 1090592 1168540 737619 1246139 974210 1248913 1053179 1212651
14673 1212651 983556 910513 977457 1063551 975251 778416 1104493 935186 1044686 1057874
14663 1057874 849872 1001982 899495 907264 862822 809709 1123998 1455787 1242124 978687
14653 978687 1151545 1207704 950117 1090176 1018993 945768 910312 1244610 982109 1263580
14643 1263580 1179331 1311923 1056731 1414111 1579843 1238489 1287440 1224582 1677090 1181410
14633 1181410 1200652 1369839 1479914 1256836 1377067 1114783 1409983 1299944 1449451 1196399
14623A196399M37952j11059K27466m75236K67313j630l2679j23902j3046J40178
14613A511756k41171N90352k37088j64343R689L1924n8525K05721j48501L14207
14603A814021m55744J49263q1755J40672Q2965l2789o3437K67326j48333P786
14593A679975k23147N43345k54361Q0851J2135k10024K01561K41740j30080J61160
14583B103155q646k90928K04487L96594o79470K21546j50048J73158J31549J40766
14573B242163j20206j57895L96775k15465L8168J106J72748j02552M68669N844
14563B729355j51457K89505J70188K10585n9417J99160K46483r7756L60080N64452
14553D461178n749P10534R33047J045849J901446L678315P116244J0211761K092319
$$ plain form
14623 1196399 1634351 1523292 1750758 1275522 1542835 1541205 1508526 1384624 1371578 1511756
14613 1511756 1270585 1860937 1623849 1459506 1469195 1501119 1442594 1648315 1499814 1814021
14603 1814021 1358277 1507540 1425785 1566457 1649422 1616633 1553196 1820522 1672189 1679975
14593 1679975 1456828 2000173 1745812 1826663 1838798 1628774 1830335 2072075 1941995 2103155
14583 2103155 2094509 1803581 2008068 2404662 1725192 1946738 1796690 1969848 2101397 2242163
14573 2242163 2121957 1964062 2360837 2145372 2183540 2184646 2357394 2254842 2723511 2729355
14563 2729355 2577898 2867403 3037591 3248176 3188759 3387919 3634402 3536646 3896726 4461178
14553 4461178 4455429 5165963 6099010 7144859 9046305 12724620 19840864 30052625 32144944
14544C2144944j5494419o323495m052254j822208r22185n69616K06560j91476
14536B975851l11820l3748k71050J43426l02917L77765J96393j98341j5981L449
14526B563027j95642P4772J73977P8871m6044j63089J15922o095L2184P9671n2345
14515B655209J81124J70296l49206j30649N30589R4608j89334N157J00661j2424
14505C056031l12689K21074L29379l36262J63482j60973J60248m9353j7746K33866
14495C287057J8920j42715j2070K39007l222j470M18130j56487m11953O55632
14485C890829j08191j60842J51614j00167M45094k15656J139O7978J27638o1440
14475D037996P6321l60554M39909L61713j64730j48848p8135J82217p1624K88760
$$ plain form
14544 32144944 16650525 10327030 6274776 4452568 3530383 2960767 3167327 2975851
14536 2975851 2664031 2630283 2359233 2502659 2199742 2577507 2773900 2575559 2559578 2563027
14526 2563027 2367385 2442157 2616134 2695005 2648961 2485872 2601794 2595699 2627883 2707554 2655209
14515 2655209 2836333 3006629 2657423 2526774 3057363 3151971 2962637 2967794 3068455 3056031
14505 3056031 2743342 2964416 3293795 2957533 3121015 2960042 3120290 3070937 3053191 3287057
14495 3287057 3305977 3163262 3151192 3390199 3386977 3385507 3803637 3647150 3235197 3890829
14485 3890829 3782638 3621796 3773410 3673243 4118337 3902681 3903820 3971798 4099436 4037996
14475 4037996 4114317 3753763 4193672 4555385 4390655 4241807 4163672 4345889 4274265 4563025
14465D563025K9473j05495L73575j78713q6294J95938M79948l02830J23186M7312
14455E139125R1652P9963M2957K09472l83334M0555N04343m07995J5162N04885
14445E836785k50864j31250M06140J12044K8245N1688n0729K79189K17900k49559
14435F249589J15357M14138J01371J13949J6850j84200M5192R1477J1506J72767
14425G147996M45684j24210L57552j37062K75662l19502P26863o7156l39153N89731
14415H556405k0559J26554J68996K7408J47756j05403N54422J68715J55542j07330
14405I672506J82994j54474M69502J77449m317M05832j28615N89904R4802l7050
14395A1268533L23537K55736k4184M18732l03711N07975K94830K97929L09608
$$ plain form
14465 4563025 4592498 4487003 4860578 4681865 4595571 4791509 5271457 4968627 5091813 5139125
14455 5139125 5230777 5310740 5353697 5563169 5179835 5220390 5724733 5316738 5331900 5836785
14445 5836785 5585921 5454671 5860811 5972855 6001100 6052788 6002059 6281248 6499148 6249589
14435 6249589 6364946 6779084 6880455 6994404 7011254 6827054 6872246 6963723 6975229 7147996
14425 7147996 7593680 7469470 7827022 7689960 7965622 7646120 8372983 8305827 7966674 8556405
14415 8556405 8535846 8662400 8831396 8858804 9006560 8901157 9455579 9624294 9779836 9672506
14405 9672506 9855500 9701026 10170528 10347977 10343660 10749492 10620877 11210781 11305583 11268533
14395 11268533 11592070 11847806 11823622 12242354 11938643 12446618 12741448 13039377 13348985
14386A3348985k68653L99936M16743J60510L26566K19021J91600N26228K6013
14377A5346949M94257K16722K28514L89102M35376L91863L71924N75476l4940
14368A8415243M04705K19678N47873L68761N86568M79229L08092M57968N67143
14359B2355260N99045K75531P21702O07356M91062O12178N78773O21798L39110
14350B7201815J098212K91539Q78225J019890P70738Q17941Q78456O00115J040314
14341C4597245Q83558R01217J369921J024380J219479Q20909J325857J415504
14333D3558070J458197J053523J527656J447910J312084J926477J849868J509435
14325E5643220J860463J985482K412638K095920K113845K465798K236418K965673
$$ plain form
14386 13348985 13080332 13480268 13897011 14057521 14384087 14603108 14794708 15320936 15346949
14377 15346949 15841206 16057928 16286442 16675544 17110920 17502783 17874707 18450183 18415243
14368 18415243 18819948 19039626 19587499 19956260 20542828 21022057 21330149 21788117 22355260
14359 22355260 22954305 23229836 23951538 24558894 25049956 25662134 26240907 26862705 27201815
14350 27201815 28300027 28591566 29469791 30489681 31260419 32078360 32956816 33556931 34597245
14341 34597245 35480803 36382020 37751941 38776321 39995800 40816709 42142566 43558070
14333 43558070 45016267 46069790 47597446 49045356 50357440 52283917 54133785 55643220
14325 55643220 57503683 59489165 61901803 63997723 66111568 68577366 70813784 73779457
14317G3779457K715350L202965K720718L621668L230903L741594L529685M117801
14309A00660141L972010M432527M873095M789588N655533N523859N307548O233293
14301A41447594O563107P095402P194958P658884Q510187Q503510R444181R386197
14293B05804020J0674120J0167910J1203096J1201407J1964733J1669680J1532770
14286B84217736J2035390J1908431J2471950J1300715J2304312J2564680J2161802
14279C68965016J0685585J0600801J0917662J0720838R659969Q853971Q861360
14272D39265202O684586L556795K11584K093342p990539p967236m257181j0119023
14264D21477530j3475883j3778611j3991584j2806493j3620402j3000172j2789295
$$ plain form
14317 73779457 76494807 79697772 82418490 86040158 89271061 93012655 96542340 100660141
14309 100660141 104632151 109064678 113937773 118727361 124382894 129906753 135214301 141447594
14301 141447594 148010701 155106103 162301061 169959945 178470132 186973642 196417823 205804020
14293 205804020 216478140 226646050 237849146 249050553 261015286 272684966 284217736
14286 284217736 296253126 308161557 320633507 331934222 344238534 356803214 368965016
14279 368965016 379650601 390251402 401169064 411889902 421549871 430403842 439265202
14272 439265202 445949788 449506583 449718167 451811509 443820970 435853734 431596553 421477530
14264 421477530 408001647 394223036 380231452 367424959 353804557 340804385 328015090
14257C28015090j2865917j2018744j1774014j1766874j1649755j1737143j1029562
14250B45173081j0294478j0604254r522045r055114r242498p955863q218611p613375
14242A72666843o762874p274479o827397o173530n726562n855471n232452n476034
14234A23338044m760727m448579m662773l702755m840297l243540l939807l864354
14226H9875212l218640l374027l242462k755879k816691k597625k535031k422468
14218F6912389k348766k236134k045988j960786j781125j757935j664513j898010
14210E1219132j702550j387539j465063j367261j045307j581311j499265j512227
14202C9658609r00031j013532q08937j348972o74791q42292j389815p84449o35293
$$ plain form
14257 328015090 315149173 303130429 291356415 279589541 267939786 256202643 245173081
14250 245173081 234878603 224274349 214752304 205697190 196454692 188498829 180280218 172666843
14242 172666843 165903969 158629490 151802093 145628563 139902001 134046530 128814078 123338044
14234 123338044 118577317 114128738 109465965 105763210 100922913 97679373 93739566 89875212
14226 89875212 86656572 83282545 80040083 77284204 74467513 71869888 69334857 66912389
14218 66912389 64563623 62327489 60281501 58320715 56539590 54781655 53117142 51219132
14210 51219132 49516582 48129043 46663980 45296719 44251412 42670101 41170836 39658609
14202 39658609 38758578 37745046 36936109 35587137 34912346 34070054 32680239 31895790 31260497
14193C1260497r25164n82369q38205q80313m89195j083072J83622j080671o17461
14184B4947669n45648n89402j18286r08295o68326n18309k95370m92218m23501
14175B0388314j19454p12931k66789m09405k10227m29664l89345n84214j10344
14166A7155941m97931j06066l47425m37812j02646m04386j39964m46372j75409
14157A4497930l33233p4771m02020m24807J88146j59266l19253l13858l56698
14148A2302170j52804p4527j59704l29645k26918N1399j83501j59363k31300m25941
14138A0409866l00703L95357r5319k09387k32428k69623j11472k43772R6166k75426
14128I163259k53592o878J63898j49207n08548J4426J34662l77622j9613j53057
$$ plain form
14193 31260497 30335333 29752964 28914759 28034446 27545251 26462179 26645801 25565130 24947669
14184 24947669 24402021 23812619 23694333 22786038 22117712 21599403 21304033 20811815 20388314
14175 20388314 20268860 19555929 19289140 18879735 18669508 18239844 17850499 17266285 17155941
14166 17155941 16658010 16551944 16204519 15766707 15664061 15259675 15119711 14673339 14497930
14157 14497930 14164697 14089926 13687906 13263099 13451245 13291979 12972726 12658868 12302170
14148 12302170 12149366 12074839 11915135 11585490 11358572 11409971 11226470 11067107 10835807 10409866
14138 10409866 10109163 10504520 10409201 10199814 9967386 9697763 9586291 9342519 9438685 9163259
14128 9163259 8909667 8902789 9066687 8917480 8408932 8423358 8558020 8180398 8160785 8007728
14118H007728K4768l10833m1462p9841o0457j56073K21812m15254k19381K50016
14108G221023l28433l82084L99780q4649k19320n5418L198j1666j43099m55939
14098E943393R7090J66043L46915l93220n76099J62878r5638M72798m61007J9827
14088E682980k35439J49910m4461k75164R2899R1070k58520j1462m9963k13114
14078D928736K0461j75144J73694n56156K68342J57858k20774M650j41742R331
14068D469256K17355m09584K43693Q6765k43538Q1272p6604j56070p8957q6066
14058D047522K57543m0186k572l82261R6810K631k03885j33604L99980l05783
14048C736195k33922L04418k68268j22857P2209q2062K4077j50206J59884j35335
$$ plain form
14118 8007728 8032496 7721663 7680201 7600360 7539903 7383830 7605642 7190388 6971007 7221023
14108 7221023 6892590 6510506 6910286 6825637 6606317 6550899 6554097 6542431 6399332 5943393
14098 5943393 6040483 6206526 6553441 6160221 5584122 5747000 5651362 6124160 5663153 5682980
14088 5682980 5447541 5597451 5552990 5277826 5370725 5461795 5203275 5191813 5141850 4928736
14078 4928736 4949197 4774053 4947747 4391591 4659933 4817791 4597017 4601667 4459925 4469256
14068 4469256 4686611 4277027 4520720 4607485 4363947 4445219 4368615 4212545 4133588 4047522
14058 4047522 4305065 4264879 4262307 3880046 3976856 3979487 3775602 3641998 4041978 3736195
14048 3736195 3502273 3806691 3538423 3415566 3487775 3405713 3429790 3279584 3439468 3304133
14038C304133N5620n759j54837o2044K56117n1134j6453P9236j91679l21289J67400
14027C059311j5735p7578m5730o6325L15023k63770k34833m3781Q8651J77906
14017B893139k5874o99095P18328m34575K47250M488n3100j65740L57560j86051
14007B656330k71884J40396L4172J66671m84532O23897k35050K39552o48048L63671
13997B585175p7723J04159M41191J8103L92576J68216p6786R72473J219972K918429
13987H665785N976510J0127606Q946476j3368452o565589m163374k584371j062056
13979E972535r55772r61900l572Q2430n56476P101j38868m35519K15442n06968
13969B718433K64856j88239J28463n16454J92998M5210n7100k85562L17754l81227
$$ plain form
14038 3304133 3359753 3353994 3199157 3137113 3393230 3342096 3325643 3404879 3213200 2891911 3059311
14027 3059311 3043576 2965998 2920268 2853943 3168966 2905196 2670363 2626582 2715233 2893139
14017 2893139 2867265 2168170 2886498 2451923 2699173 2703661 2650561 2484821 2842381 2656330
14007 2656330 2384446 2524842 2559014 2725685 2241153 2865050 2630000 2869552 2221504 2585175
13997 2585175 2507452 2611611 3052802 3070905 3463481 3631697 3554911 4527384 5747356 8665785
13987 8665785 14642295 24769901 33716377 20347925 13782336 9618962 7034591 5972535
13979 5972535 5016763 4054863 4051291 4133721 3577245 3584346 3445478 3009959 3225401 2718433
13969 2718433 2983289 2795050 2923513 2407059 2600057 2645267 2588167 2302605 2620359 2239132
13959B239132L19024j22658k02938M9942J97054k25086N1340j67576N7625j02079
13949B093780k68648M37481k61669Q1546j09217j1335M16990q08443K35338k23148
13939A582675O74243j62371k53200K7879j02983j39117k19723M07273l8254K1816
13929A798238l79513K40632L48051n66747M71770k63035j09585j29046M84260
13920A895025l22654j7437P4269Q8131q1573k63071L49560l91179J59585p3131
13910A417525N7641Q0331k58418L90733l64172M13896r5629j50650m1837k31240
13900A218180J55811J48282o4950j52698M38633l84580Q7931j40382O2406j62870
13890A205763L3389L79564l66882j23492K9120L66234k25998m0830J84085k28119
$$ plain form
13959 2239132 2558156 2435498 2232560 2282502 2479556 2254470 2305810 2138234 2195859 2093780
13949 2093780 1825132 2262613 2000944 2082490 1973273 1961938 2378928 1570485 1805823 1582675
13939 1582675 2256918 2094547 1841347 1869226 1766243 1627126 1407403 1814676 1776422 1798238
13929 1798238 1418725 1659357 2007408 1440661 1912431 1649396 1539811 1410765 1895025
13920 1895025 1572371 1554934 1629203 1717334 1635761 1372690 1722250 1331071 1490656 1417525
13910 1417525 1475166 1555497 1297079 1687812 1323640 1737536 1641907 1491257 1449420 1218180
13900 1218180 1373991 1522273 1457323 1304625 1743258 1358678 1446609 1306227 1368633 1205763
13890 1205763 1239152 1618716 1251834 1128342 1157462 1523696 1297698 1256868 1440953 1212834
13880A212834K04855r0534N8222j53076k9909J73392m13308L31305j89794J49553
13870A253540k7727N1840k05559r7594K4377J96711m64222M12582L04335k70531
13860A177752J87281j03606K46L4364j53425k76122J23794J34806L3222k35510
13850I22802J93115l03898M34258j55667M6208n8067J27283m05434J03899K2129
13840I26628J86954q4740Q0202J19072k3004k30901J11134j82778k25826J37969
13830H14710M22181j60526k19926K38635k44849M84478l50642p5140K04392K11118
13820A324431k19845k53042q6727N57133k98709n1473k57884J44147j00951M58956
13810A216036k12882j73068O7516j60033J26178p131p4791K58503j03415k43554
$$ plain form
13880 1212834 1417689 1327155 1385377 1232301 1202392 1375784 962476 1293781 1103987 1253540
13870 1253540 1225813 1277653 1072094 974500 998877 1195588 731366 1143948 1448283 1177752
13860 1177752 1365033 1261427 1261673 1296037 1142612 866490 990284 1125090 1158312 922802
13850 922802 1115917 812019 1246277 1090610 1136818 1078751 1206034 800600 904499 926628
13840 926628 1113582 1028842 1109044 1228116 1205112 974211 1085345 902567 676741 814710
13830 814710 1236891 1076365 856439 1095074 850225 1334703 984061 908921 1113313 1324431
13820 1324431 1104586 851544 764817 1321950 1023241 971768 713884 858031 757080 1216036
13810 1216036 1003154 830086 897602 737569 863747 856616 781825 1040328 936913 693359
13800F93359L8286J35758k57610J54900J3880L02332r2412j50755l21383M07845
13790I24200j41610J8919j9371k90384P19002m27562j69585j2259P8146J76240
13780H55736j96969j69448L02219L2552j04520k09893M11138j09559m3308L15965
13770A083913E01254J95473j7899r0272l9822L46939m4243k20380K68254J09273
13760A008577j21583J00629j72765j00005J3267k9441K39312k40455j97552J25871
13750F25855K42172C16189L20366J38674l61944M57151k57126J52719k23506K12183
13740G54706k64547O72054n06504k39256J43151L41751k37141k58065M64634C92972
13729H69992O2220j79605q9395K8699j70318j30950L31963n6662O614M9393k09908
$$ plain form
13800 693359 731645 867403 609793 764693 778573 1080905 988493 837738 516355 924200
13790 924200 782590 801509 782138 491754 1210756 783194 613609 601350 679496 855736
13780 855736 658767 489319 791538 824090 719570 509677 920815 811256 767948 1083913
13770 1083913 501254 696727 678828 588556 548734 895673 851430 631050 899304 1008577
13760 1008577 886994 987623 814858 714853 728120 698679 937991 697536 499984 625855
13750 625855 868027 316189 636555 775229 413285 870436 613310 766029 542523 754706
13740 754706 490159 1162213 655709 416453 559604 901355 664214 406149 870783 392972
13729 869992 932212 752607 663212 691911 521593 390643 722606 665944 672558 721951 512043
13718E12043J07247k60126L21131C32493Q3181Q2901J88253q7187B18824L72103
13708E90927J76405L5145l95367o5137K36588j95599L28374j90717J64269m1849
13698F43039j53906K45679j27074k53290J2459L3695K91561J64768j98349n3070
13688F05512j65465j05898j33644M70813j17648B11994K29778n6147J4542j18450
13678B81717N8303R0318r5747j56781M73022B94619J25734J69891B11623N86838
13668G98461j75618B46111N50499B89126K10364j99373K28781M5618l0575n8981
13658D84960J67121k40070j32523J01832J96556A36593N36090J98003C44543O3955
13648D08498j00253r1242L19708j30538M3144K17337O2215B61467p5120J64109
$$ plain form
13718 512043 619290 359164 680295 332493 415674 498575 686828 599641 218824 590927
13708 590927 767332 802477 407110 341973 578561 382962 711336 520619 684888 643039
13698 643039 489133 734812 607738 354448 366907 400602 692163 856931 658582 605512
13688 605512 440047 334149 200505 671318 553670 211994 441772 385625 400167 281717
13678 281717 340020 430338 334591 177810 650832 294619 420353 590244 211623 798461
13668 798461 622843 246111 796610 289126 499490 300117 528898 574516 543941 484960
13658 484960 652081 412011 279488 381320 577876 136593 672683 870686 344543 408498
13648 408498 308245 217003 536711 406173 449317 666654 728869 261467 186347 350456
13638C50456j42963K79095o4904J11973j54584J54517I6767M47769k7373k01632
13628C15531M56846k44422J06748B88506L72380j21219j17036P5478l0523k21321
13618B46265J94895k3382M1112P758j41766n5684j6947J27898m7491K58151A33729
13606D08269j24439R9913j43248J40901j61756l1626J46964K32789A67587K31458
13596C99045l3961J07260J09023j29979J70753r3567G1528L64914r8341K53156
13586E91257r1367J01779m3169j85874K3875K97136C46673n822J63742a83929
13575f2660E02875j53165J36872j79736n1724K24896k11885m1860L546p180o5124
13564A57515J54879K39740A92462J80962A79307J86601K53092Q3406j73717k49968
$$ plain form
13638 350456 207493 486588 421684 533657 379073 533590 96767 544536 517163 315531
13628 315531 772377 527955 634703 288506 660886 539667 422631 498109 467586 246265
13618 246265 441160 417778 458890 466648 324882 269198 252251 380149 332658 590809 133729
13606 408269 283830 383743 240495 381396 219640 188014 334978 567767 167587 399045
13596 399045 365084 472344 581367 451388 622141 528574 71528 436442 338101 591257
13586 591257 499890 601669 558500 372626 396501 693637 346673 340851 504593 -183929
13575 -62660 502875 349710 486582 306846 255122 480018 268133 226273 229819 222639 157515
13564 157515 312394 552134 192462 373424 179307 365908 619000 702406 528689 278721
13554B78721J35039A76259O0032L40460B16627J44416j61694K08598N9023n5407
13544D11563J27986j27512A68023J38733b9997D04664j84637J71787j71530M6174
13534B66458k897Q4606R8010A43456J42348K9250q6198J0832J84229B10522J00960
13523C11482k459q1792j2094M5562j25537J09209I6253J89615H7080L80350B18636
13511D61618J92993f7487B25904k177O9062k5724R9562j71245J08027J47911k06752
13500B44568K24880k1501k0158k6188H2865J58613E1370J38535J11389K2522A4998
13488A49226K51993j85689r7243L9984J64539e7685H7413J56055o7844J67291
13478C42915L72972A26680n0860a5826B03827E8368L32342J77912H6808J72358
$$ plain form
13554 278721 413760 176259 236291 576751 216627 361043 199349 407947 466970 411563
13544 411563 539549 412037 168023 306756 -29997 404664 220027 391814 220284 266458
13534 266458 263561 348167 446177 143456 285804 315054 228856 239688 423917 210522 311482
13523 311482 309023 227231 215137 260699 135162 244371 96253 285868 87080 467430 218636
13511 461618 654611 -67487 225904 223727 292789 267065 366627 195382 303409 451320 244568
13500 244568 469448 447947 427789 401601 82865 241478 51370 189905 301294 323816 14998
13488 149226 401219 215530 118287 158271 322810 -57685 87413 243468 175624 342915
13478 342915 715887 126680 75820 -15826 203827 58368 390710 568622 86808 259166
13468B59166k726A2110K75766j6178M08216l17237l808A47116M24559B43396J74320
13457D17716A81966J56978a466B96339e4899D45520M827E3196M66371K7846F7864
13445B74215A02455L57249J36236A61201J03459I4772k4825J7262J86498n9206
13435B14501K6585J01692G9289i6434G3045J95016K5091q0804R37K52281B6399
13423A75206H3952L4436L14945A63105L12211k24771L27189a039A82822M7016
13413B29838C9190K98562A40689L64350k39351J12979Q9276A79458a49632D08346
13402A61030C7017K50729o5267L8828D0137J04914D1626J06239O0257I5696K25543
13391C21239A16364B7162L9852l2881J15046j6955L65947a79592A96250l0604
$$ plain form
13468 259166 256440 12110 287876 271698 679914 362677 358869 147116 571675 243396 417716
13457 417716 181966 338944 -1466 296339 -54899 445520 450347 53196 519567 547413 67864
13445 274215 102455 459704 595940 161201 264660 94772 69947 87209 273707 214501
13435 214501 241086 342778 79289 -96434 73045 268061 293152 212348 213285 465566 26399
13423 175206 83952 118388 433333 163105 475316 250545 577734 -1039 182822 229838
13413 229838 39190 337752 140689 505039 265688 378667 467943 179458 -149632 408346
13402 161030 37017 287746 222479 261307 40137 145051 41626 147865 208122 95696 321239
13391 321239 116364 27162 67014 34133 149179 132224 498171 -179592 196250 165646
13381A65646j0113E0535M59982j82167j59593J56096l079j23655L16960A18665
13370D47153d5764D10044H8552K3491K24172L8982A17310M34520A16380O7830
13360A84210Q0899J35324A81457q3601P2559D8657b36672B52841r718p701J1902
13349B47324j524K31329A27375J19680o8383L67329n3340k07888o2100Q2284j32715
13338A72242J16049j1057A19268M87591D6936L44866l1668j01471r7785m5109
13328A15769q229P371J42006J37660j43953l2384J47788J43708p2209j12819m0615
13317B84093k2965j05995M8652p3735J65054r5491J54824q5754C496K16527L9527
13306B59550n0106P1876K06798a1738j1365B51972j12425K23564k2254A61422
$$ plain form
13381 165646 155533 50535 510517 328350 168757 324853 321774 198119 515079 118665
13370 447153 -45764 410044 88552 112043 336215 375197 117310 551830 116380 184210
13360 184210 265109 400433 181457 97856 170415 48657 -236672 252841 243123 235422 247324
13349 247324 245800 477129 127375 247055 178672 546001 492661 284773 222673 304957 172242
13338 172242 288291 277234 119268 606859 46936 391802 360134 258663 160878 115769
13328 115769 107540 114911 256917 394577 250624 218240 366028 509736 437527 324708 284093
13317 284093 261128 155133 203785 130050 295104 199613 354437 268683 3496 220023 259550
13306 259550 209444 281320 488118 -11738 -23103 251972 139547 363111 340857 161422
13295a62314D47750a308j21842C42936j62628d3305B41692a13542L4857B37256
13284B20351a09571r3858C46015A58388j2662K67709H986j532a14099B48271N5116
13273C03387C1481K43935I3913O6024F590J19816N4340k4673L0150l6952B3764
13261A8496B433e668B30102J03124A30524J62313j36451K2335A7606M29885B11775
13249B74097L2508b9555C24459J2731A18442E5011a04020j1550B572K35915N052
13238B43539i7279A35713b4830j64767A18160c5888A17011J65852q490C4603J41399
13227A76002E7503b61731H5922K960K01860m3438j01860j2524O3351c8158A03760
13215C63604h1291C11904b06116b9099A34811Q3926R2335p9609A910J06403a5854
$$ plain form
13295 -162314 447750 -1308 -123150 342936 180308 -43305 241692 -113542 -78685 237256
13284 220351 -109571 -203429 346015 158388 145726 413435 8986 7454 -114099 248271 303387
13273 303387 31481 275416 93913 159937 6590 126406 180746 156073 186223 149271 23764
13261 18496 2433 -5668 230102 333226 130524 292837 156386 178721 17606 447491 211775
13249 274097 306605 -29555 324459 337190 118442 55011 -104020 -115570 2572 238487 243539
13238 243539 -97279 135713 -24830 -189597 118160 -35888 117011 282863 274373 34603 176002
13227 176002 57503 -261731 85922 88882 290742 247304 145444 132920 196271 -38158 103760
13215 363604 -81291 311904 -206116 -29099 134811 218737 311072 231463 1910 108313 -15854
13203B63437K16769B00055r2201K48645n4147A18655b13100A11209c97223A81195
13192c06264a05403F0299P0797e0873m4743H0917l564C0705K11100c0421p7600
13181a08021E29526F085b0661A75099G9965K275J99184j15858e6621A61515J56722
13170C18237k0007l5457J16540j00550h3785A30040E2936J9141g2012l8032A54363
13158F2886a37796D58651g7413H707a45125n3268A47233F6192e1272A22984J44282
13147B67266B5514N6909Q6268j2857k693P527c7009B6432i3561m296l9546M1889
13135i5514C24215a74299A82429k2477Q2511L6150j16235E7245K60705j3462A03106
13123A79681R6594m0887j12763b9375j32479r0781A77428C0021L2673R3822b4838
$$ plain form
13203 263437 480206 200055 107854 356499 302352 118655 -213100 111209 -397223 181195
13192 -306264 -105403 60299 131096 -50873 -95616 80917 77353 30705 241805 -30421 -108021
13181 -108021 529526 6085 -20661 175099 79965 82240 281424 165566 -56621 161515 318237
13170 318237 298230 262773 379313 278763 -83785 130040 52936 72077 -72012 -110044 154363
13158 62886 -137796 458651 -77413 8707 -145125 -198393 147233 66192 -51272 122984 267266
13147 267266 25514 82423 168691 155834 153141 160668 -37009 26432 -93561 -97857 -137403 -95514
13135 -95514 324215 -174299 182429 159952 242463 278613 162378 57245 317950 304488 103106
13123 179681 276275 235388 122625 -29375 -161854 -252635 177428 30021 62694 156516 -24838
13111C32939j18728f5608D35379F3497J67140j00380O2247a86809o0084E4917
13100C44626J05727j28484i7060A98752C7852O497J07962F862K82075C4377R9068
13089A33445b5316C27622I474J75000C4337K54139b1423C14185H1567L47404B04346
13077b96885A48536K58622g7206J1772G6721J33714K9104g0460A44957J84706
13067C29663B6191a84877B50266m6274A4153i6585C49710D1677K10713M6404h651
13055B5492K27999a07193A18393a7684F8247c35879E0954L34922a55489f0778
13044b0504A3788L49163E5993L75715A59619J62482H279c706B68314j17304P2563
13033B23573e9598A40977c0563D96555a87491C85822O8439b6583n8266A77040
$$ plain form
13111 332939 214211 -65608 435379 63497 230637 130257 192504 -186809 -246893 54917
13100 344626 450353 321869 -97060 198752 37852 44349 152311 6862 288937 34377 133445
13089 133445 -25316 327622 9474 184474 34337 288476 -21423 314185 81567 428971 204346
13077 -296885 148536 407158 -77206 -65434 76721 210435 239539 -70460 144957 329663
13067 329663 26191 -184877 250266 203992 14153 -96585 349710 41677 252390 298794 -8651
13055 25492 253491 -107193 118393 -17684 68247 -335879 50954 385876 -155489 -60778
13044 -20504 13788 362951 55993 431708 159619 322101 8279 -3706 268314 151010 223573
13033 223573 -59598 140977 -30563 496555 -187491 385822 454261 -26583 -84849 177040
13022F1900L6496K35709k539k9810H732a83409O3444B17414c8088n3096l6204
13011a27388G8611a44971d3976B23653j0511G9841l521b7322B35500J25600l8050
13000C23050a06548H9411a88627M9636c5705E7041a5887A8456b9096R861m7341
12989f6576A60065R9846R5660J80009b38282A04067J4076C9525J51323a74202
12978I7178B3685h4183A13427n060m9164c08383J25937a4358C72830a91398M6413
12967a44985i706l2590B33997B4660a85896A8410J69979k8284M5772f8776j05713
12956a74489B68667m3836b8259E3020J00348b6614q8551A45123p0549c778B9848
12944a30502B31490D4050i0959C85910D6085d0198A48265D544e9939B08548A01744
$$ plain form
13022 61900 98396 334105 331566 301756 8732 -183409 -119965 217414 -38088 -91184 -127388
13011 -127388 78611 -144971 -43976 223653 213142 79841 76320 -27322 235500 361100 323050
13000 323050 -106548 89411 -188627 -138991 -35705 57041 -15887 18456 -29096 -19235 -66576
12989 -66576 160065 259911 355571 535580 -238282 104067 118143 39525 190848 -174202
12978 97178 23685 -84183 113427 108367 59203 -308383 -182446 -14358 372830 -191398 -144985
12967 -144985 -9706 -42296 233997 24660 -185896 18410 188389 160105 205877 -68776 -174489
12956 -174489 268667 224831 -28259 53020 153368 -26614 -115165 145123 74574 -3778 29848
12944 -130502 231490 44050 -90959 385910 46085 -40198 148265 4544 -59939 208548 101744
12932I759a27930C35068k1005a10600B2748N1393j309Q0373F3441J5071a59216
12920C726K94548A12423b72472A29203A5078f4838n5478B80189e6175q8355A89549
12908C4592K15955j06711K34629j19939o8057C4738f7710A24306b2086k924k82659
12897c07669D7876h5861b2131A41731j2387a85253H3642c0599p3912A55905p1649
12886H4256M6366a50369B11964g0836B14021a8305j22318d5261j76755A75854
12875B14695a72924A89122H7130b55645A5812a40188e807k41441R6472B59640
12864B7065J0800c6380E4088m058A2235M0338Q788f9945m7910r7074j0022B26231
12851F8523J11831B2214h4064A20050a03278A41768o8012K0717b59542A55055
$$ plain form
12932 9759 -127930 335068 314063 -110600 22748 74141 72832 153205 63441 78512 -159216
12920 3726 298274 112423 -272472 129203 15078 -64838 -120316 280189 -56175 -144530 189549
12908 34592 250547 143836 378465 258526 190469 34738 -67710 124306 -22086 -25010 -307669
12897 -307669 47876 -85861 -22131 141731 129344 -185253 83642 -30599 -104511 155905 84256
12886 84256 130622 -150369 211964 -70836 214021 -18305 -140623 -45261 -222016 175854
12875 214695 -172924 189122 87130 -255645 15812 -140188 -5807 -247248 -150776 259640
12864 27065 37865 -36380 54088 50030 12235 52573 61361 -69945 -117855 -214929 -224951 226231
12851 68523 180354 22214 -84064 120050 -103278 141768 73756 94473 -259542 155055
12840h729k12027A9968c01101A88705b54737I8157b03263b7737I0890g7921F3864
12828a1309r7868B37940C2113P8680e9890B19342A08250a80936D8491a8835A31703
12816g8180A31453l1129c38071a3465k50195K0612A87071a31561F2783C0828L49620
12805C80448i4451A46100K86082B401J29523J00930a33450K2014A03477b4676
12794C86609A4118J31121l6191K79263j77763D9648j9499j4284a1676A44127C6109
12782C23152j16201H5853b13838g4288A95562c786F7864K02702j4007d1031A35716
12770A31801a34176A79164P0091i8016B26928a3886o7839K8626k26884C1025h1717
12758c32492a32246A88798j2885b5878B03304n1045B1231a76860L348Q379D7753
$$ plain form
12840 -8729 -220756 19968 -301101 188705 -254737 98157 -203263 -27737 90890 -77921 63864
12828 -11309 -109177 237940 32113 110793 -59890 219342 108250 -180936 48491 -18835 131703
12816 -78180 131453 100324 -338071 -13465 -263660 -243048 187071 -131561 62783 30828 380448
12805 380448 -94451 146100 432182 2401 131924 232854 -133450 -111436 103477 -24676
12794 386609 14118 145239 109048 388311 210548 49648 30149 15865 -11676 144127 36109
12782 323152 206951 85853 -213838 -74288 195562 -3786 67864 270566 256559 -41031 135716
12770 131801 -134176 179164 249255 -98016 226928 -13886 -81725 -53099 -279983 31025 -81717
12758 -332492 -132246 188798 175913 -25878 203304 152259 21231 -176860 -173512 -165133 47753
12746a6743M488k59489B34764r2834B2966K7074J10382B1006L66523A15166N8626
12735A73792a36590B68437E7650K38332A34426J49514H1722B2488b2697A30839
12724c061C41221l3094j37645p8724C6433b29504A10828c1790F2427b3816k81100
12713c04916f0489E1504R8367L61153E2133b9428l0016D36160j52128a850j31297
12702a33147M4881E1714f4322j1713b2747j01929B35573B0821H197n00L7006g2693
12689A9547Q6566B3411L9145Q26K84861a74106F820K08992o8082b2317D12786
12677B2060q484b73041A75949m3379B3610K66628q2354d4410A6436i7580j48894
12666b46474G3249M99438A68219g9239A27128b95317B64684A36R4084J38506l8273
$$ plain form
12746 -16743 -12255 -271744 234764 141930 22966 50040 160422 21006 387529 115166 173792
12735 173792 -136590 268437 57650 295982 134426 283940 81722 22488 -22697 130839
12724 -3061 341221 308127 170482 91758 36433 -229504 110828 -31790 62427 -23816 -304916
12713 -304916 -60489 51504 149871 511024 52133 -29428 -59444 436160 284032 -1850 -133147
12702 -133147 -88266 51714 -64322 -76035 -22747 -124676 235573 20821 8197 7697 44703 -72693
12689 19547 106113 23411 62556 63382 348243 -174106 6820 215812 147730 -22317 412786
12677 22060 13576 -273041 175949 132570 23610 290238 207884 -44410 16436 -97580 -246474
12666 -246474 73249 572687 168219 -79239 127128 -295317 264684 136 94220 232726 194453
12655A94453k3453e427j32290C3788L3253O7667i5852C30977f5216A10844J8233
12644A29077f4876b2653C72519a14552A03264a69095H313J78056F0107j9843a28162
12632B24932J38290b09681D29169j66864m5553k2393P5458E3154O2383L2915R1238
12621B39690I6936M69834f436B73102A01209h8117A51754b18769E92700j99124
12611C93576g3233B58253o1997F0924a77461k3233B48347H4712A9829a04085E67520
12599A07002a70157Q4855B5977L67123C4823K84697a94595o7748A11855K25348
12589C37203J74223B5038a33905j3340e1731p5404b033H0125g8441o0679j5931
12578a55051A43942C3407j980m285a15312E05962A58594d689H0459J18884H1121
$$ plain form
12655 194453 171000 -5427 -137717 33788 67041 134708 -95852 330977 -65216 110844 129077
12644 129077 -64876 -22653 372519 -114552 103264 -169095 8313 186369 60107 40264 -128162
12632 224932 363222 -209681 429169 262305 216752 194359 269817 53154 115537 148452 239690
12621 239690 96936 566770 -6436 273102 101209 -88117 151754 -218769 592700 393576
12611 393576 -73233 258253 196256 60924 -177461 -200694 248347 84712 19829 -104085 567520
12599 107002 -170157 -85302 25977 393100 34823 319520 -194595 -262343 111855 337203
12589 337203 511426 25038 -133905 -147245 -51731 -127135 -2033 80125 -78441 -139120 -155051
12578 -155051 143942 33407 31427 27142 -115312 505962 158594 -4689 80459 199343 81121
12566E69743A013K82717j1833a205D30695a15596j61221D24045A95421L25457
12556E20878H7688P8848c12983B5291k600a35600B68939b6928C8501A7756K6247
12545D4003a61408E3896a26239k3632d448l12656G0359a5257A03322M6235L5490
12534A85047a57976m7297F0766h2789C0009c119E6599g7857p5740E2838i1144
12522H8864A0220J31091J22263J412j32093b30208a721H8794J91269A37721A104
12510A31739i6317I0431f8200j5304k2572E1623M8883a17476A4409f097H0776
12498b30671J04470H2533f7399j83033J22016d8874A38221B2601c28921e8102
12487A31559a27638c4519B22883I8895j5318f2741A14028J43882E201R9372a4779
$$ plain form
12566 569743 1013 283730 271897 -1205 430695 -115596 -276817 424045 195421 520878
12556 520878 87688 166536 -312983 25291 22691 -135600 268939 -26928 38501 17756 44003
12545 44003 -161408 53896 -126239 -149871 -4448 -317104 70359 -15257 103322 149557 185047
12534 185047 -157976 -205273 60766 -82789 30009 -3119 56599 -77857 -153597 52838 -91144
12522 88864 10220 141311 263574 264986 132893 -230208 -1721 88794 280063 137721 1104
12510 131739 -96317 90431 -68200 -83504 -106076 51623 100506 -117476 14409 -6097 80776
12498 -230671 -126201 82533 -67399 -250432 -128416 -48874 138221 22601 -328921 -58102
12487 131559 -127638 -34519 222883 98895 83577 -62741 114028 257910 5201 104573 -14779
12475a21505q1613M8449A38126c7270k3011A78857a5376A09378B6988a9499H8809
12463A14860a57217n9561A85420a76685a6386j95348i0299j18066B73397a42794
12452c41001C104a24596m0737J2679C13707A34823a70626B972J6657J33066n5963
12441I6732i6185a6518j90431k740i9270a9362l7832H014c59820i0700A91599
12429b34722C6146i8675G4558b23227H2588d29581a02686B2052J64772b12077
12418a07845k7845m4579G3843J3696a54993O9003B7209r514A518J22633K9733
12407A53884l0935O8400a0900A8776d7962D7095J945J95046h5376J8309m5326
12396a12393N0960e51j85349C5893a0522m38744a16685A41009i8081j66152A23300
$$ plain form
12475 -121505 -203118 -154669 138126 -37270 -60281 178857 -15376 109378 26988 -19499 88809
12463 114860 -157217 -216778 185420 -176685 -16386 -211734 -90299 -208365 273397 -142794
12452 -341001 3104 -124596 -165333 -152654 313707 134823 -170626 2972 19629 152695 96732
12441 96732 -96185 -16518 -206949 -209689 -99270 -19362 -57194 8014 -359820 -90700 191599
12429 -234722 36146 -98675 74558 -223227 82588 -429581 -102686 22052 186824 -212077
12418 -107845 -135690 -180269 73843 87539 -154993 -85990 27209 17695 1518 124151 153884
12407 153884 122949 191349 -10900 18776 -47962 47095 49040 244086 -85376 -67067 -112393
12396 -112393 -61433 -551 -185900 35893 -10522 -449266 -116685 141009 -98081 -264233 123300
12384a41853a4953l7681E8831f696j16115j43535e8200j98306A75412q4303e6619
12372A4725Q6559a67588m983o0152g5038C35417e8347D9905J20151h7547l68771
12361d56318F6413a01632j79055A73361a86211Q1778K7877C4840B825d595m04079
12350d08674A34633D0811J09227a18026L2389A31463M1449q6335P3505K8166l0384
12339A57864N2301I2174J05951C9893M2957i6908j03648H0252c97250b5132k01486
12328b26618C13196A51264b61129D4655a45440A76445f4899E7627e4264m8427
12318a02691A0701L56532A56861c6796A18798d3434k08611B44211g5739A4917
12307A5042J68124M7775d9538B0739A041M05335b95665M4357F8979J80073A0633
$$ plain form
12384 -141853 -14953 -52634 58831 -6696 -122811 -266346 -58200 -256506 175412 91109 -56619
12372 14725 101284 -167588 -172571 -232723 -75038 335417 -58347 49905 170056 -87547 -456318
12361 -456318 66413 -101632 -280687 173361 -186211 -104433 -76556 34840 2825 -4595 -408674
12350 -408674 134633 40811 150038 -118026 -85637 131463 172912 86577 160082 188248 157864
12339 157864 210165 92174 198125 39893 82850 -96908 -200556 80252 -397250 -25132 -226618
12328 -226618 313196 151264 -261129 44655 -145440 176445 -64899 57627 -54264 -102691
12318 -102691 10701 367233 156861 -36796 118798 -43434 -252045 244211 -75739 14917
12307 15042 183166 230941 -49538 20739 1041 406376 -295665 -251308 68979 249052 10633
12295G4566b64771C3391g896o4998C23705j17440J17112h3231l3180Q244E5285
12283E2084i0191A40415J65605a55878B93717a45587M8672H3885a65902B43797
12272f0667B56299b69146K1459e5442A10779M352O5743n2061c00868J28872A99558
12260F2533K37241J42239G6945k2462K0679b02100C4559J15495D7420J75599N9089
12249B82108p6138H7990l9551g3209J6885j6120k8379C1686h098A43317b50000
12237G8687J37074q5152K61479C5743J72925g059G3304K58624j8098A15315a38715
12225b31212B08163J5174J80349A94981c5841B18682J16279o9534E3928L71482
12215D25410o8725I1253K46760e8758B02020p2469P7386I9069K88911j53054A07742
$$ plain form
12295 74566 -264771 33391 -7896 -72894 323705 206265 323377 -83231 -116411 -108167 55285
12283 52084 -90191 140415 306020 -155878 293717 -145587 -96915 83885 -165902 243797
12272 -60667 256299 -269146 -247687 -55442 110779 115131 180874 128813 -300868 -171996 199558
12260 62533 299774 442013 76945 54483 75162 -202100 34559 150054 47420 223019 282108
12249 282108 205970 87990 48439 -73209 -56324 -72444 -100823 31686 -8098 143317 -250000
12237 78687 215761 130609 392088 35743 208668 -7059 73304 331928 313830 115315 -138715
12225 -231212 208163 223337 403686 194981 -35841 218682 334961 265427 53928 425410
12215 425410 356685 91253 338013 -58758 202020 129551 206937 99069 387980 234926 107742
12203B77960h2132B18888J34773H1793J52591K36570B01848K6491J57806M5628
12193D31773A1510K40831J3128f7360A3763R1386j5940K69346h8599r5753B28193
12181E9577L1506L98416a3148A22105E0746a8463I670P6130J80241G055c605j47161
12169a50766M925F3757P7358m4937K68001G896J65869D4148K42962o1264q6200
12158A39646a30737A63324h7682H271i3442l084B43373H6325k0965L45523A35458
12146A56622C272a33462b9846A19438J18332H082J690L5498b085H66b46478F9740
12133a94664A13826R0612b4442k14979F3251O7293J8479f2524l7877b6405l3206
12122e9611C56019d9475B14521p8053K4084e06913h6890j11927E152M1892F303
$$ plain form
12203 277960 -82132 218888 353661 81793 234384 470954 201848 228339 386145 431773
12193 431773 11510 252341 265469 -67360 13763 105149 89209 358555 -88599 -184352 228193
12181 59577 91083 489499 -13148 122105 50746 -18463 9670 85800 266041 7055 -3605 -150766
12169 -150766 -145841 63757 141115 96178 364179 7896 173765 44148 287110 225846 139646
12158 139646 -130737 163324 -87682 8271 -93442 -96526 243373 86325 65360 410883 135458
12146 156622 3272 -133462 -29846 119438 237770 8082 9772 45270 -2085 866 -246478 69740
12133 -194664 113826 204438 -24442 -239421 63251 130544 149023 -62524 -100401 -26405 -59611
12122 -59611 356019 -49475 214521 136468 160552 -506913 -86890 -198817 5152 47044 6303
12110i7755A64850i8810C0727c1678K432D22240c246I4689a00264F3409e204F3136
12097f5818A14385c9575A73236B9572a01343A83042a72763A80234O3130H7513
12086B05613d08362H7650a00905A60088K10173O7500N13749O04601G21898k63267
12076D58631o3080D9716c9525j07051L8629A67664M9832a06635l9157F659P2723
12065G9382B3349G09a292A18601a889D8715J71382D7148a08762k6658G6337J05231
12053A81568n0327Q4367i7412H1691b0343B34754D4579J34044b01041b3079d236
12041A08161h119n3324Q155A37823C5420i4215M2202j15062j75022h714F529a13090
12028f1969J6919a0962o4122o0647b8898D3978J27569l4986d1246B44080E2383
$$ plain form
12110 -97755 164850 -98810 30727 -31678 -29246 422240 -3246 94689 -100264 63409 -5204 63136
12097 -65818 114385 -39575 173236 29572 -101343 183042 -172763 180234 243364 87513
12086 205613 -408362 87650 -100905 160088 370261 437761 951510 1556111 721898 458631
12076 458631 395551 49716 -39525 -146576 -107947 167664 217496 -106635 -145792 6659 79382
12065 79382 23349 709 -1292 118601 -1889 48715 220097 47148 -108762 -135420 76337 181568
12053 181568 131241 215608 -97412 81691 -20343 234754 44579 178623 -201041 -23079 -4236
12041 108161 -8119 -61443 -53288 137823 35420 -94215 -52013 -167075 -342097 -8714 6529 -113090
12028 -61969 -45050 -10962 -75084 -135731 -28898 43978 171547 136561 -41246 244080 52383
12016I4184j3921a15597I9823a60032k6654B6288b40694n983A08565J43711a16204
12004B4876K0465K65719a71770A23031D0845d190A03635C5158c437B0645a38952
11992B44112a94484A87100C5837b37951Q5747d0772m317D3410d55335a26590o382
11981a32972B81123I4101A6180d4302F0396J5938c36517a03306p9218P2562B96286
11969c4433j84309a3027A46662G3054M3486M1485a4489k35605a8764A6667i5002
11957B0305f5917M015l27099a72877G0064g9805L0691j5020I9795e4337A92093
11945A12280a40489f8472A91296m1838l9986c49274f9118G2779a1753l11842B72127
11933A05380N0216c2429B55340l6107L8792a43504D28839a00920o7252A5362m061
$$ plain form
12016 94184 80263 -115597 99823 -160032 -186686 26288 -240694 -246677 108565 252276 -116204
12004 24876 45341 311060 -171770 123031 40845 -4190 103635 35158 -3437 20645 -138952
11992 244112 -194484 187100 35837 -237951 -152204 -40772 -45089 43410 -455335 -126590 -132972
11981 -132972 281123 94101 16180 -44302 60396 76334 -336517 -103306 -182524 -109962 296286
11969 -34433 -218742 -13027 146662 73054 116540 158025 -14489 -250094 -18764 16667 -95002
11957 20305 -65917 -61902 -389001 -172877 70064 -79805 -49114 -64134 99795 -54337 192093
11945 112280 -140489 -68472 191296 149458 109472 -349274 -69118 72779 -11753 -323595 272127
11933 105380 155596 -32429 255340 219233 258025 -143504 428839 -100920 -168172 15362 11301
11922A1301d0278B3162r225K58722h3452R499A94706r2477b07881A22781a78996
11910A56805c8289q3203n5269e1187I2610a46072B47394A16622Q3931e001l62417
11899c67418a8311j4871j35985A79745a26314a8821n2204Q200j09167c9j66887
11888a66926k22996A6382a18037N0029I8209K6090K55999b28902d6092A61268
11877c40800f2445E0494g1165l0827I1487e586p3082a5962k15988K2069A7700
11865a42794E0592c9955p7901E634a71318b9880j34858A14266a33410o9002H4630
11853g3547I2366A2282b30242A48327D2577f5723J2725A40247d4481l9943C6822
11841b7957B6806N8961a16686A20882g9213B79675g7028B58634b27695C74604
$$ plain form
11922 11301 -40278 23162 13937 272659 -83452 -73953 194706 102229 -207881 122781 -178996
11910 156805 -38289 -121492 -176761 -51187 92610 -146072 247394 116622 200553 -5001 -367418
11899 -367418 -18311 -33182 -169167 179745 -126314 -18821 -71025 -62825 -171992 -39 -166926
11888 -166926 -389922 16382 -118037 -68008 98209 124299 380298 -228902 -46092 161268
11877 -340800 -62445 50494 -71165 -101992 91487 -5586 -78668 -15962 -231950 -209881 17700
11865 -142794 50592 -39955 -117856 5634 -171318 -29880 -164738 114266 -133410 -202412 84630
11853 -73547 92366 12282 -230242 148327 42577 -65723 -52998 140247 -44481 -84424 36822
11841 -27957 26806 85767 -116686 120882 -79213 279675 -77028 258634 -227695 374604
11830h3704k29586I2921J21960a17791E7392a18265M7536A11212d29033i705j2536
11819b2241k39889M7188b6277B22403g4956j43414h5j91118r5501a26087A89029
11807C63928A26315H770c66522a66221f0517B7972Q5304a34370e6457p4690B46679
11795A45252e4566b2843B6358m835J21383a83396G3155K47056e1000k16949A65888
11783C65831c0906A3758r61J89055c13256A38429b09388D3692E905a84376E06609
11771a19961C83391f152B37223a73273M847f3306o2121B24860E1306j3210J64949
11760B03045q6100a6077l35348F5043a57139D4238j594h2822k0111B41782b35925
11748A29218o3293J85603F6366r672c17470J27431B5587f6777A10935O3845B3461
$$ plain form
11830 -83704 -313290 92921 214881 -117791 57392 -118265 -70729 111212 -429033 -9705 -22241
11819 -22241 -262130 -214942 -26277 222403 -74956 -218370 -85 -191203 -286704 -126087 189029
11807 363928 126315 8770 -366522 -166221 -60517 27972 113276 -134370 -56457 -131147 246679
11795 145252 -54566 -22843 26358 21523 142906 -183396 73155 320211 -51000 -267949 165888
11783 365831 -30906 13758 12797 201852 -313256 138429 -209388 43692 5905 -184376 506609
11771 -119961 383391 -6152 237223 -173273 -168426 -63306 -125427 224860 51306 38096 203045
11760 203045 116945 -16077 -351425 65043 -157139 44238 42644 -82822 -102933 241782 -235925
11748 129218 65925 251528 66366 56694 -317470 -190039 25587 -66777 110935 174780 23461
11736b8350j87858G2168c92791a50390c6713E0966A2596K18781R368a32543A14020
11724C5924J09947a2852F0017L00549A69245b2539k24205c9772l4611A40895H49
11712A26669h8602m2549e6573m038j03361J0111C10125R7447a511l1201B32721
11700A62366J56049I2894b0894q5273k92386C61131f5719l93146D05J28693a70358
11688A91424J34901a15071A7209f4820a6653j09844D8120c31797H9840c19603
11677B21360c11387B75949a94251A30680c2298p4335B76820a8314B08550p6082
11667A32468N1220a13434A03481c57920A68781j0814J94328E885a67878A67943
11656f3203j7918q1606I6103K57640a06418j75194J0273R5927C71961E3078J35303
$$ plain form
11736 -28350 -216208 72168 -392791 -150390 -36713 50966 12596 231377 240745 -132543 114020
11724 35924 145871 -12852 60017 360566 169245 -22539 -246744 -39772 -74383 140895 849
11712 126669 -88602 -131151 -56573 -60611 -163972 -153861 310125 407572 -1511 -32712 232721
11700 162366 318415 92894 -20894 -106167 -398553 361131 -65719 -458865 405 129098 -170358
11688 191424 326325 -115071 17209 -64820 -16653 -126497 48120 -331797 89840 -319603
11677 221360 -311387 275949 -194251 130680 -32298 -106633 276820 -18314 208550 132468
11667 132468 183688 -113434 103481 -357920 168781 157967 352295 5885 -167878 167943
11656 -63203 -81121 -162727 96103 353743 -106418 -281612 -271339 -175412 371961 53078 188381
11645A88381J56498j00633a74695o8754C38569A57886d7755F4807b07598H7041
11634c14954A26340b10683K0760f759B73396i7971A70134k7537J27251a03893
11623B48246J57680b37633I6598b6776o5497b739E1385J20201a52458c3425A54728
11611d0106h556I1000K02787J0753a88935K3155C06279A00788K2234b16427J322
11600b15105D52444f3319D4758J23128R0746a95012d8965F8834J9253B3995J36015
11589A60010c4966r7566L8059C96794e0966C47202H6211j1596h1577A9622b41511
11577B52490A21395c3318k8054p6019B4582M2838J11355e9521j07380b1882p0888
11566i2770m7214r0834D3375j7130J57572b8581C26399h2391B76745G0153b23507
$$ plain form
11645 188381 344879 244246 -174695 -243449 338569 157886 -47755 64807 -207598 87041
11634 -314954 126340 -210683 -189923 -6759 273396 -97971 170134 142597 269848 -103893
11623 248246 405926 -237633 96598 -26776 -92273 -2739 51385 171586 -152458 -33425 154728
11611 -40106 -8556 91000 293787 304540 -188935 -165780 306279 100788 123022 -216427 -215105
11600 -215105 452444 -63319 44758 167886 258632 -195012 -48965 68834 88087 23995 160010
11589 160010 -34966 -132532 -94473 396794 -50966 347202 86211 74615 -81577 19622 -241511
11577 252490 121395 -33318 -61372 -137391 24582 67420 178775 -59521 -166901 -21882 -92770
11566 -92770 -139984 -230818 43375 26245 183817 -28581 326399 -82391 276745 70153 -223507
11554B7440J31732k5197J66782j16055o305a01060B46276c34315J58641B50504
11543A97468J67105d1131p4922n3303h431b161B250J49566n5725O6651a95035
11531A33038E4226b07435O376N7635I3478h228D3738O3898j1597a53739B3185
11519e7083B85678j05944q2060O3946k897G8108A5353L00846i755C6734L8904
11508G5638M9600K83692a39743j0185A38172P4391J65201a20685B24459K9325
11498B53784c86812A37522a84092c467C51587a40729A12485j2183L3224i6967
11487A81548b11310H0567J74255f8549B81230j15589Q7611F6351J95665K3263
11477B85279A00913f9749G6432j8302K54919b2908B62534F729L27537J24729k05933
$$ plain form
11554 27440 159172 133975 300757 184702 178397 -101060 246276 -334315 -175674 250504
11543 197468 364573 -41131 -116053 -169356 -8431 -2161 2250 151816 96091 162742 -195035
11531 133038 54226 -207435 -201059 -143424 93478 -8228 43738 107636 96039 -153739 23185
11519 -57083 285678 179734 97674 161620 158723 78108 15353 316199 -9755 36734 75638
11508 75638 125238 408930 -139743 -149928 138172 212563 377764 -120685 224459 253784
11498 253784 -386812 137522 -184092 -3467 351587 -140729 112485 100302 133526 -96967
11487 181548 -211310 80567 254822 -68549 281230 165641 253252 66351 262016 285279
11477 285279 100913 -69749 76432 58130 313049 -22908 262534 6729 334266 458995 253062
11466B53062b24714r581L4796B46700I8296A9199M4296a05787D963L57127I9639
11454D27812r6670j36682i3286j1840E347K570a3952A53677a00307j66652C1633
11442I2242P9926h7513A20972d5611I2589d05149A07380a58899N8723A13717Q1093
11431A94810a69317I0974c08421c5561j34666b9756A69350b1740D7051N5408j2232
11420I0227L05590a64510F2006L16279b18488C62302I7545a31973q5501C8559
11409a39062j01990B00834h4335B28976c0500A08437b9804j55632D1886c48252
11398A36370d2213C4403K6168K41174b95522J9717C26802B017b21178b4269A10208
11386b68239c6715C14852d3610A88388b81079a7438A79403a52987H8465e9396
$$ plain form
11466 253062 -224714 -234295 -199499 246700 98296 19199 63495 -105787 4963 362090 99639
11454 427812 331142 194460 -93286 -105126 5347 7917 -13952 153677 -100307 -266959 31633
11442 92242 172168 -87513 120972 -45611 92589 -405149 107380 -158899 -100176 113717 194810
11431 194810 -169317 90974 -308421 -35561 -170227 -29756 169350 -21740 47051 102459 90227
11420 90227 395817 -164510 62006 378285 -218488 362302 97545 -131973 -217474 38559
11409 -139062 -241052 200834 -84335 228976 -30500 108437 -29804 -185436 41886 -348252
11398 136370 -42213 34403 60571 301745 -295522 -275805 326802 2017 -221178 -24269 110208
11386 -268239 -36715 314852 -43610 188388 -281079 -17438 179403 -152987 88465 -59396
11375A59247b31301C7707g9135K3818A88964a65328B66175C5774g9429C1854J10235
11364A42089a19077k29052A16363a09803k3702k00303b4810j6832p3456l2038
11354a47136L7155A18860n1759J41691K41665b37920O8729D0947L15167A49068
11343H2668C2232c3925C07345a19722k1202l3991q7630A96339D6822a76402j13547
11332b89949i0514H2177K8529k4179b54092c314B1172E510J49896a40897B56890
11320B00953l9583K438g4711k44270K5044d5570B11978i8580q2106B25551B4908
11308I3057A1771K03245a5813j34357A29411N6868k7087n7108D455J79804o7013
11297A17246d9645A29948b87646A91458C3115a65254j54768f8385o0266A11670
$$ plain form
11375 159247 -231301 37707 -79135 -55317 188964 -165328 266175 35774 -79429 31854 142089
11364 142089 -119077 -348129 116363 -109803 -133505 -333808 -24810 -41642 -115098 -147136
11354 -147136 -109981 118860 67101 208792 450457 -237920 -169191 40947 356114 149068
11343 82668 32232 -33925 307345 -119722 -140924 -174915 -262545 196339 46822 -176402 -289949
11332 -289949 -90514 82177 110706 86527 -254092 -3314 21172 5510 155406 -140897 256890
11320 200953 161370 163808 -74711 -318981 -293937 -45570 211978 -98580 -180686 225551 24908
11308 93057 11771 215016 -15813 -150170 129411 186279 159192 102084 4455 184259 117246
11297 117246 -49645 129948 -287646 191458 33115 -165254 -320022 -68385 -128651 111670
11286a33354C4213a51805A2895O2684N311d17875a02589l6225P65B578a66906
11274b26810A30976a72305B53911A00788a08018K0047A10839j6582H857a28919
11263a79280A5776a59564j26097A08449d3945k16830O9224A27630i1412a7720
11252b65506O8630A644c5982j66181B54485K7771A14326b5832k35647CJ30263
11241A30266a34758A3927J29663o7548P2745i4715j31022M8716q7599J24457M2634
11230i7529c6619E2663k3370a07468j74662A31948i3141j30506A5528b02482J686
11219b00796n3848J26855d2928j76786C81106j47831j4652A5789h4678b3652A5732
11207f3835A01237L0022a62153C2900b38306H961N5310b46741h1035I2290B9558
$$ plain form
11286 -133354 34213 -151805 12895 75579 80890 -417875 -102589 -138814 -138049 2578 -166906
11274 -226810 130976 -172305 253911 100788 -108018 -87971 110839 94257 8857 -128919
11263 -179280 15776 -159564 -285661 108449 -43945 -260775 -191551 127630 -91412 -17720
11252 -265506 -196876 1644 -35982 -202163 254485 282256 114326 -25832 -261479 3 130266
11241 130266 -134758 13927 143590 76042 148787 -94715 -225737 -177021 -264620 -140163 -97529
11230 -97529 -36619 52663 29293 -107468 -282130 131948 -93141 -223647 15528 -202482 -200796
11219 -200796 -254644 -127789 -42928 -219714 381106 233275 218623 15789 -84678 -23652 15732
11207 -63835 101237 131259 -162153 32900 -238306 8961 64271 -246741 -81035 92290 29558
11195A7048a28220A44940A4141c34112J36674B05689c61670F2474k4628Q0119
11185A17965a884C20487E7994d4640A94452a14881k13987b1262g722C9260g2656
11173b39313g9425q5874H1656k5687j517N3209a80128B3089e68A6898b06582A21830
11160A03209b73136A25368h3574A8227f9811m0198M0719l267k5780G0232a39156
11148f6626B49306r8817b24484f3536j56781i9009o7329A51043a50713E5077J1300
11137F6377J3237N7020b08034A49513A932J24380O8438H6715b90380e5536B7617
11125C2486e2435A5684F657P49M2476b33361D9512L2940f6568A26064L13171a01312
11112d1463j8747A76189d5512C16161j48424n7212n1169J88631a89180B1492O7018
$$ plain form
11195 17048 -128220 144940 14141 -334112 -197438 205689 -361670 62474 37846 117965
11185 117965 -1884 320487 57994 -44640 194452 -114881 -328868 -21262 -7722 39260 -72656
11173 -239313 -79425 -165299 81656 55969 54452 107661 -180128 23089 -568 16898 -206582 121830
11160 103209 -273136 125368 -83574 18227 -69811 -110009 -69290 -72557 -98337 70232 -139156
11148 -66626 249306 150489 -224484 -63536 -220317 -99009 -166338 151043 -150713 55077 66377
11137 66377 79614 136634 -208034 149513 1932 126312 194750 86715 -290380 -55536 27617
11125 32486 -52435 15684 6657 7406 49882 -233361 49512 82452 -66568 126064 439235 -101312
11112 -41463 -60210 176189 -45512 316161 167737 110525 59356 247987 -189180 21492 88510
11101H8510J01222e9935B38653m5364b1504m8965q9400P220B7622L5766K62773
11090C26161j23431k2862L82143A79140J49945n0265C6046N2039J57006J91049
11080D36140F8460j2459P3521K35075j71836a0445B51513A09038J19165Q086J34997
11069C71286A77412R7700q9514K81535j06303K15770n3357A41937M37820B09413
11058E28832j18296l9975j70844M63467k61044J82228k27978L38252k32571M59340
11048I21411D21962K21530K5360R1004l79893L49857j11709j33860j48551K65579
11038F01279O2933q3197K78031l71788J50436p6586m1831j14414K79138J33676
11028H17677j73184K01126l73503J72292j95107J10175K4439j07696j17318L19632
$$ plain form
11101 88510 189732 -59935 238653 193289 -21504 -70469 -159869 -152649 27622 63388 326161
11090 326161 202730 179868 562011 179140 329085 278820 36046 88085 245091 436140
11080 436140 68460 56001 129522 364597 192761 -10445 251513 109038 228203 236289 371286
11069 371286 177412 275112 185598 467133 360830 576600 523243 141937 579757 209413
11058 528832 410536 370561 199717 663184 402140 584368 356390 694642 462071 921411
11048 921411 421962 643492 668852 759856 379963 729820 618111 484251 335700 601279
11038 601279 664212 581015 859046 487258 637694 561108 519277 404863 684001 817677
11028 817677 644493 845619 472116 644408 449301 559476 583915 476219 358901 678533
11018F78533B89403K18058o2870R7105j23826J6696J67586R4868C01902M97106
11008G99008l29435p6641K65499k80070K26849r1238J62428J5414j26668j51149
10998D13997m4745R3654B28046O29989j66241k41530K18037J38726k24702B77831
10987G48859L9929k5024Q8082l3332o8315O0047K33823J167j15135J60359J58849
10976A249309J23513l9882O06578k20639K09643N11026m92196j85718p9166J9666
10966A702134k5178l33211J15279j48978P9601m8242j67622J00103j0176j91881
10956A071829K68301j70687R5261j08700l81357K48363k30640J27525C01369J17246
10946D18615L29282k29475j63949j35774I5659l0580a52925B55999j02586c8493
$$ plain form
11018 678533 289403 507461 444591 541696 417870 434566 602152 697020 301902 799008
11008 799008 469573 392932 658431 378361 605210 513972 676400 691814 565146 413997
10998 413997 369252 462906 228046 858035 691794 450264 668301 807027 582325 277831
10987 748859 788788 763764 851846 818514 750199 810246 1044069 1045236 930101 1090460 1249309
10976 1249309 1372822 1332940 1939518 1718879 1928522 2439548 1947352 1761634 1682468 1702134
10966 1702134 1676956 1343745 1459024 1310046 1389647 1341405 1173783 1273886 1263710 1071829
10956 1071829 1340130 1169443 1264704 1156004 774647 1023010 792370 919895 301369 418615
10946 418615 747897 518422 354473 218699 95659 65079 -152925 255999 153413 -38493
10935A8193g4342L0179B47585A0765K33305r2162h2167a4334D1859a14090d9239
10923c7710j05870C1219N11J12932a4414I5536a05678j26470C64069E8695G942
10911c32295H6394l9911a09928k233A9663J92141B4362a42721j36742K7286g424
10899A70691B7884b11672P5522B16615b533I2093i5863A02258b6921m3856E1896
10887C0769b16148j1590a05980D9830J3526e9108H5200J95355a41410M1859A7562
10875a81257l4590n4224j92473a40694O5093l8806A418O4261Q0187C0394a31970
10863h1701j48756i5887F9938j8979J1462C910a70922A31361f9369A73477H4756
10851B19289a3263r302n1583F004a01848A85183H7162a64132F6774h693q4324
$$ plain form
10935 18193 -74342 -44163 247585 10765 244070 151908 -82167 -14334 41859 -114090 -49239
10923 -37710 -143580 31219 31730 144662 -14414 95536 -105678 -232148 364069 58695 7942
10911 -332295 86394 46483 -109928 -112161 19663 211804 24362 -142721 -279463 -252177 -7424
10899 170691 27884 -211672 -136150 216615 -2533 92093 -95863 102258 -26921 -70777 51896
10887 30769 -216148 -227738 -105980 49830 63356 -59108 85200 280555 -141410 -99551 17562
10875 -181257 -215847 -270071 -462544 -140694 -75601 -114407 1418 65679 145866 30394 -131970
10863 -81701 -230457 -95887 69938 50959 62421 3910 -170922 131361 -69369 173477 84756
10851 219289 -13263 -22565 -74148 6004 -101848 185183 87162 -164132 66774 -8693 -93017
10840i3017B65547b27682H4341a01578A5982a71149m6502a4847L192A00198M6933
10829A47131C5834Q1839O1890R536b62401a12361B40984e3220A03737G800b39857
10817b4033p4317O845j48414C355N926o43J70928n3890b67193A69170N0278d33637
10804b47186H3571m0261O9574c37842a03354r3427B30346c930k1190E7283b17401
10792A8054a09071A45879c47606Q832i4134K4949A33842D2288N1044J4898b39739
10780b04274O1894e5670G3629k4123i5075c3179k40331E2603a32001m6251r2042
10769b70294F4351k1361a14467j7118d7989l47085B67656C618c35544a06125C9795
10757B64477a16457I679a08152j70772k2097B28065a27827A04206g8688F3274
$$ plain form
10840 -93017 265547 -227682 84341 -101578 15982 -171149 -217651 -14847 -11655 100198 147131
10829 147131 35834 117673 179563 189099 -262401 -112361 240984 -53220 103737 7800 -239857
10817 -24033 -98350 -91505 -239919 3355 9281 8638 179566 125676 -267193 169170 219448 -433637
10804 -247186 83571 43310 112884 -337842 -103354 -196781 230346 -3930 -25120 57283 -217401
10792 18054 -109071 145879 -347606 -338774 -94134 -69185 133842 42288 93332 108230 -239739
10780 -204274 -142380 -55670 73629 49506 -95075 -33179 -273510 52603 -132001 -178252 -270294
10769 -270294 64351 42990 -114467 -131585 -47989 -395074 267656 3618 -335544 -106125 39795
10757 264477 -116457 9679 -108152 -278924 -301021 228065 -127827 104206 -78688 63274
10746b76337B39031a78216I0640a27994r5378J6253D44280j53209a0651H8920
10735b5916C84001b3952A15076e27552a2047A5507a30413B22862A3153c51186
10724d712lr448e53j63995A12378i4282c3465o2540H900c32866b4678r02j48553
10711a74133D22172a16915j26919C9838Q2660a35227m1142k03503F4119b57768
10700a09304A24784R2987g6733l5066a8657A04264b08350D35168b30572c9586
10689h8818j20054N8777f3232n8394k29111A70850f9005l01849J11249B34578
10678B09206I1017b9389f304k41390A21703B483J12740m9003A4569c11073j09334
10667d20407B3027c3896C0203L820a13462r1432d5546I0660a1041j04382L1474
$$ plain form
10746 -276337 239031 -178216 90640 -127994 -223372 -207119 444280 291071 -10651 88920
10735 -25916 384001 -23952 115076 -527552 -12047 15507 -130413 222862 13153 -351186
10724 -4712 -4715 -14163 -553 -164548 112378 -94282 -33465 -96005 8900 -332866 -24678 -25580 -174133
10711 -174133 422172 -116915 -243834 39838 122498 -135227 -176369 -379872 64119 -257768
10700 -109304 124784 217771 -76733 -111799 -18657 104264 -208350 435168 -230572 -39586
10689 -88818 -208872 -150095 -63232 -121626 -350737 170850 -69005 -370854 -259605 234578
10678 209206 91017 -29389 -6304 -247694 121703 2483 115223 66220 14569 -311073 -420407
10667 -420407 23027 -33896 30203 34023 -113462 -204894 -45546 90660 -11041 -115423 -83949
10656h3949A01484l3381N1882a69385g9475K1520K0546j89201c5544o3682C10876
10644E1015a57563f5004B1507j344a02721A0677a2859q1964j07417A9662b02314
10632f7534b2360l30502B19266d5166k4228m8028N5360j15588o0149B02402a01085
10620b59715B70988a88738m8675c5916q829A41192C1655J89140G8186R7438a78615
10608a18092L2168A95133C5043f3002b5871K242B80610a48187c4590B7227h4104
10596A65885a27812L7833p9231e519I3555g2244C4632b75446a17340B75412A08085
10584c71353A15187j3422K5885b73506c2855A02327m5220j9068c00455A07318
10573a81083g5720j37962I9495Q3442N1234h0830m5505b2785m85049c2259F8161
$$ plain form
10656 -83949 101484 68103 119985 -169385 -79475 -57955 -37409 -226610 -35544 -99226 310876
10644 51015 -157563 -65004 21507 20163 -102721 10677 -12859 -94823 -202240 19662 -202314
10632 -67534 -22360 -352862 219266 -45166 -69394 -117422 -62062 -177650 -237799 202402 -101085
10620 -259715 270988 -188738 -237413 -35916 -44745 141192 31655 220795 78186 175624 -178615
10608 -118092 -85924 195133 35043 -63002 -25871 -23629 280610 -148187 -34590 27227 -84104
10596 165885 -127812 -89979 -169210 -5519 93555 -72244 34632 -275446 -117340 275412 108085
10584 -371353 115187 101765 127650 -273506 -32855 102327 57107 38039 -300455 107318
10573 -181083 -75720 -213682 99495 182937 234171 -80830 -126335 -22785 -507834 -32259 68161
10561a3175j51923C4658c292j41644A53753K7076b48527B44151p9710a25863e6500
10549a67781f9109j66952o3661A37713g3921L1695l61010h9134l4118j29481a7342
10537H7580g0263l05016J54112A30780m5529J09850C5345a24079A70059l9151
10527A30908b02428B52676c8529A63546h8759j86888c2610A82535b56927j37871
10517c94798f5062o9865M8279j69963m7875f8049B3494c6353k71972A09869a76062
10505B98020b78463h7728k3222p3611e2475B06254a07229k9311A2259b27352J4859
10494b12493A2821J23302d9585l32993B71634E9162M3222b386l4980A29418J47262
10483B76680A27917J50942J2937N762i2703H4097i1894B38091B756J06673m6033
$$ plain form
10561 -13175 -165098 34658 -3292 -144936 153753 180829 -248527 244151 164441 -125863 -56500
10549 -167781 -69109 -236061 -299722 137713 -73921 -42226 -403236 -89134 -123252 -252733 -17342
10537 87580 -70263 -375279 -221167 130780 85251 195101 35345 -124079 170059 130908
10527 130908 -202428 252676 -38529 163546 -88759 -275647 -32610 182535 -256927 -394798
10517 -394798 -65062 -134927 -86648 -256611 -304486 -68049 23494 -36353 -308325 109869 -176062
10505 298020 -278463 -87728 -110950 -184561 -52475 206254 -107229 -136540 12259 -227352 -212493
10494 -212493 12821 136123 -49585 -382578 271634 59162 102384 -2386 -37366 129418 276680
10483 276680 127917 278859 291796 297558 -92703 84097 -91894 238091 2756 109429 63396
10472F3396N7134a80292H5338K7785N4101b9727I0623a84450r7187J25879B90450
10460a41758l37833O4456A64449a18356j40400J576A3444d0207k15328A00320
10449A49563b889A94660B9637e0090l0816o1717q8857g7026b7695B47439a42416
10437c82621n2819h3888l531N554j50119J7017h3263A21503d41738g2139A97024
10425c04262B24617a85440A19526h7944J572B7476a65473H9958Q3018b92896J35895
10414a57001H0842f1886k17219E1021d0734B90084a04848j15090g8224D6551g5336
10402F9116A4229f9469D41798c1211m0104j88569Q8801C48913j32540f8852E3121
10390A33121a3673B40931K3230k8956k0950j8552n8054n4918K04398D1079J52732
$$ plain form
10472 63396 120530 -180292 85338 113123 167224 -29727 90623 -184450 -281637 -155758 290450
10460 -141758 -479591 -415135 164449 -118356 -258756 -257180 13444 -40207 -255535 100320
10449 149563 -2889 194660 29637 -50090 -80906 -142623 -231480 -77026 -27695 247439 -142416
10437 -382621 -435440 -83888 -87419 -81865 -231984 -214967 -83263 121503 -441738 -72139 197024
10425 -304262 224617 -185440 119526 -87944 -86372 27476 -165473 89958 172976 -292896 -157001
10414 -157001 80842 -61886 -279105 51021 -40734 290084 -104848 -219938 -78224 46551 -75336
10402 69116 14229 -69469 441798 -31211 -71315 -259884 -171083 348913 216373 -68852 53121
10390 133121 -13673 240931 264161 235205 214255 195703 137649 82731 287129 41079 193811
10379A93811g0483B07477r5560K1739k2811b20357i2218A90118L17315j78241
10369C29192J52366A95475A6218K44460M95710A39194k071L0481R5661C1877K34266
10358B66143J93801d5621I7352L82167I3847K86741q5193A07356n0795R3820L02266
10347D52647A26064J25560J42748j43600J34068a22337c7055A27906J03094J22085
10337C53085a66808A46245J44687p8317c4260A84570g6965q8839A17294J23347
10327B40641J43217j49386d0963D71097A01745L11453A25747M0420n617N2411
10317B12961c9990E4048h170p3740B55246J2675E5939L4876m0942M4250P7381
10306A71504a16408q3095m207C24617A15698B8548e0106k1633j3760A90736a39618
$$ plain form
10379 193811 -70483 207477 111917 133656 110845 -220357 -92218 190118 507433 329192
10369 329192 481558 195475 16218 260678 756388 139194 137123 167604 263265 31877 266143
10358 266143 459944 -45621 97352 479519 93847 380588 295395 107356 56561 150381 452647
10347 452647 126064 251624 394372 250772 384840 -122337 -37055 127906 231000 353085
10337 353085 -166808 146245 290932 212615 -34260 184570 -76965 -165804 117294 240641
10327 240641 383858 234472 -40963 471097 101745 413198 125747 166167 160550 212961
10317 212961 -39990 54048 -8170 -81910 255246 267921 55939 90815 49873 94123 171504
10306 171504 -116408 -199503 -203710 324617 115698 28548 -50106 -71739 -85499 190736 -139618
10294F1680B5107a76332j38376c4288B52647I8526d5746A14959D2236j6318a85730
10282B59982p1427d5174k2104k61117P2820r7580J33021O6079d5877m6569j41605
10271b34051f504j96659I7497K46116E0650b9006B35942F4959K68325g2247A60617
10259a62648A84897M4686M9000J07332A19627q693b31398g8173j26100A43973
10248a75738A58788a30146N8237C22583b83870j33296a82858i234k11461h3106
10237b13920a01087M3907r2745C6502b4563I1639B3482b30446D7050h1040G478
10225H2220b1213A42612l4441i0358j62573D8709J21947a42329d9691k0386A0282
10213A73095c5403p0878B9903G216J40922R1477D8343P638J2778K50676a09468
$$ plain form
10294 61680 25107 -176332 -314708 -34288 252647 98526 -45746 114959 42236 25918 -185730
10282 259982 188555 -45174 -67278 -328395 -255575 -353155 -220134 -154055 -45877 -92446 -234051
10271 -234051 -6504 -203163 97497 343613 50650 -29006 235942 64959 333284 -72247 160617
10259 -162648 184897 229583 278583 385915 119627 110934 -231398 -78173 -204273 143973
10248 -175738 158788 -130146 -71909 322583 -283870 -417166 -182858 -9234 -220695 -83106
10237 -213920 -101087 -57180 -149925 36502 -24563 91639 23482 -230446 47050 -81040 7478
10225 82220 -21213 142612 108171 -90358 -252931 48709 170656 -142329 -49691 -70077 10282
10213 173095 -35403 -106281 29903 7216 148138 239615 48343 55981 68759 319435 -109468
10201g4274p2121b4816D237J37047E5159b56304e7805k57197n494d1497j02166
10190a43663f0408P008G1050Q2995e2752k4068k63428Q0415G034K07817D4049
10178f9107F1838K98279a37855q5229A33950c3175G8661d15492B26049F0961b4530
10166c42048A96651b38914B41618b85025J6046E2250J2812J86491B4953P7770
10156A02723c8714k75046I8760K12856b66729j06470J57269A3584P8112d3215
10145c76597a74238p4869e3365j7703l40999a97471A2794M412b52912e7329D9808
10133b9045A24508c15370a03583b4117p3127M3422A12425C2241A5101b49242R204
10122b40038A61820a82964e3639B4217Q8428c4170A30787D2209f41224h7834k3594
$$ plain form
10201 -74274 -146395 -24816 4237 141284 55159 -256304 -57805 -315002 -320496 -41497 -143663
10190 -143663 -60408 -53400 71050 154045 -52752 -76820 -340248 -259833 7034 214851 44049
10178 -69107 61838 360117 -137855 -223084 133950 -33175 78661 -415492 226049 60961 -24530
10166 -342048 196651 -238914 241618 -285025 -268979 52250 65062 251553 24953 102723
10156 102723 -38714 -313760 98760 311616 -266729 -373199 -215930 13584 91696 -43215
10145 -376597 -174238 -249107 -53365 -71068 -412067 -197471 12794 17206 -252912 -57329 49808
10133 -29045 124508 -315370 -103583 -24117 -97244 -53822 112425 32241 15101 -249242 -240038
10122 -240038 161820 -182964 -53639 24217 112645 -34170 130787 42209 -641224 -87834 -111428
10111a11428l3132d2727k74998a26895J9365j5708b8339D7902a91216n31Q4952
10100a06795j36904R1041C3306J13846l2040a99664G1418l1151J67663g9090a3123
10088a03408M4547A3702c2568j5029j88288A87313A5791b37432C08783a59030
10077b64292i0786A2131a78547E281Q4991b72995a04362q394k38948a71727C40365
10065A99246f9682D9253b9941k05415A12848g4376C6142c0882m8201A26596b37560
10053A1380K05336b03570e8079k02050A8114a39054l2582k15781i0947B10760
10042b5012G3813L31289G6409g237n6798G575N5407f0631J6190o8027B735J43967
10030A46702A1560b45586p8803J43678e6911A3008n686O3958b35306g6391j68523
$$ plain form
10111 -111428 -144560 -42727 -317725 -126895 -107530 -123238 -28339 47902 -191216 -191747 -106795
10100 -106795 -243699 -152658 33306 147152 115112 -199664 71418 40267 207930 -79090 -13123
10088 -103408 -58861 13702 -32568 -47597 -235885 187313 15791 -237432 308783 -159030
10077 -264292 -90786 12131 -178547 5281 90272 -272995 -104362 -112756 -351704 -171727 340365
10065 199246 -69682 49253 -29941 -235356 112848 -74376 36142 -30882 -79083 126596 -237560
10053 11380 216716 -203570 -58079 -260129 18114 -139054 -171636 -387417 -90947 210760
10042 -25012 73813 405102 76409 -7237 -64035 7575 62982 -60631 -44441 -112468 2735 146702
10030 146702 11560 -245586 -324389 -180711 -56911 13008 7322 71280 -235306 -76391 -244914
10019b44914P4496P4955m9566m4484E69515B02958E1928A7411a11164d2906n7295
10008a00201A77751a68856P5073j12471O1469A37519F6726c9207A1980a14139
9997F8219b0581k13095B9921a95074B2521c70576b3338n5942A01791b55525F6879
9985E75242f6350R018k27610A25336a56154O1357m2088b6965j03228e6225I4200
9973i0065H9227G00O1794d3392J3997B50165H4920b22524b5732A13853a61629
9961f4587l1124A46820a2722l0368l2169C2201M8524h3405J057K6480n3710B17513
9948a73991L12D6221c01125A81773h0016K0493K7685i510q4701B25979B3941b19639
9935B31066e8183r0226a8813r7260j25362l0874E460a0450o2758A8927A120a32323
$$ plain form
10019 -244914 -170418 -95463 -145029 -189513 569515 202958 51928 17411 -111164 -42906 -100201
10008 -100201 177751 -168856 -93783 -206254 -144785 137519 66726 -39207 11980 -114139
9997 68219 -20581 -233676 29921 -195074 22521 -370576 -23338 -79280 101791 -255525 66879
9985 575242 -66350 -57332 -284942 125336 -156154 -94797 -136885 -26965 -130193 -56225 94200
9973 -90065 89227 700 62494 -43392 -29395 250165 84920 -222524 -25732 113853 -161629
9961 -64587 -95711 146820 -12722 -43090 -75259 32201 80725 -83405 -82348 -55868 -109578 217513
9948 -173991 -173679 46221 -301125 181773 -80016 -59523 -31838 -9510 -94211 225979 23941 -219639
9935 231066 -58183 -148409 -18813 -116073 -241435 -272309 5460 -10450 -73208 18927 1120 -132323
9922a74332E8718d0109a0636B68977a01340C7950Q0725b88620d3437I3368a82247
9910a17850C14698a36979j15528l7139D5549b9063k18426j2136A41984K4114b30726
9898a93779O2942K9714m5477d6845j3155j8402A10906m9229b20884J04636c3219
9886B56590b23555c2056n0136j67275A55071a06856B66829N5625G2953R9308J3095
9875A85356a56869f6690l1069j41173b4556F0574L3445c0944D15564D7304Q8548
9864A35852b94403a20376A62736a97503a0466j03866l69579b1638E2286b0489
9853c2760j44745a1080j32269j59778D178i0989C09181c32242a0622l29904B468
9841B55420c01272R4202J01681A306J56732F7239r084a48091l54096A10560i210
$$ plain form
9922 -174332 58718 -40109 -10636 268977 -101340 37950 118675 -288620 -43437 93368 -182247
9910 -117850 314698 -136979 -252507 -289646 45549 -29063 -247489 -259625 141984 166098 -230726
9898 -193779 -130837 -101123 -146600 -46845 -60000 -78402 110906 61677 -220884 -116248 -33219
9886 256590 -223555 -32056 -82192 -249467 155071 -106856 266829 322454 72953 172261 185356
9875 185356 -156869 -66690 -97759 -238932 -24556 60574 94019 -30944 415564 47304 135852
9864 135852 -294403 -120376 162736 -197503 -10466 -114332 -483911 -21638 52286 -20489
9853 -32760 -177505 -11080 -143349 -303127 4178 -90989 309181 -332242 -10622 -340526 2468
9841 255420 -301272 -207070 -105389 1306 158038 67239 58155 -148091 -502187 110560 -9210
9829a54939A69142R8697i6254a1510B95123d1464j29094A22055b9623J4125n2257
9818f7755k79548a477j73518k23160K4803A8856b42046J5031j0006i8069m2992
9807a41061A77773G6468d5249o4189d6333B02085a89831K9638Q666L9081m6009
9796a58455A31571c7017A24442d2113O149j2031r1673L6780k73952e7750k312
9785f0062A179h0592A69045a00593j07098C433K38181E1099a72286m9038A23269
9773b59489h0662j12607F2466b12412A3574e8286A15587e1176A53897a85933d9234
9761E4024N4838h6927O927H5920D213J65921A7820a89670C4083i7298M8579j35063
9749a83782A9211a30626m1278g6544p6537g0371E4517b55698d2804J9751k93599
$$ plain form
9829 -154939 169142 267839 -96254 -11510 295123 -41464 -170558 122055 -29623 -15498 -67755
9818 -67755 -347303 -1477 -174995 -398155 -373352 18856 -242046 -227015 -237021 -98069 -141061
9807 -141061 177773 76468 -45249 -109438 -46333 202085 -189831 -160193 -151527 -112446 -158455
9796 -158455 131571 -37017 124442 -42113 -35964 -47995 -139668 -102888 -376840 -57750 -60062
9785 -60062 1179 -80592 169045 -100593 -207691 3433 241614 51099 -172286 -221324 123269
9773 -259489 -80662 -193269 62466 -212412 13574 -58286 115587 -51176 153897 -185933 -49234
9761 54024 108862 -86927 -80000 85920 4213 170134 17820 -189670 34083 -97298 -48719 -183782
9749 -183782 19211 -130626 -171904 -76544 -153081 -70371 54517 -255698 -42804 -23053 -316652
9738c16652A3655a45411j80315I1329b55646a09160m17527K37268e9221n0678
9728a09899l53484e1901o0455A59506a36654A33664J08591a45791d802E3412K42761
9717B96173a58135N3193k40423A54499D9187e5745j80239d3776k75968E0951n835
9706D5116e50117c5619k8983k51002O3070B90380m1158g3344j86381j00619i5982
9694C06003F3647b54264l7184N2266a07528B8371a36664n7663L5869A45270a77111
9682a85235n1486K7046G7566b75168A95817D0138a39696B48349b20183A8759b9837
9670a66007f9314C690P69f3418b9966k8634A75408b83517e1230B13252b3659m1618
9658f5277k45864I5912a36300M7379j76686a32705d1264k70461A4597L14474A2664
$$ plain form
9738 -316652 13655 -145411 -325726 91329 -255646 -109160 -526687 -289419 -59221 -109899
9728 -109899 -463383 -51901 -112356 159506 -136654 133664 242255 -145791 -4802 53412 296173
9717 296173 -158135 -104942 -345365 154499 49187 -55745 -235984 -43776 -319744 50951 45116
9706 45116 -550117 -35619 -64602 -315604 -252534 290380 249222 -73344 -259725 -360344 -95982
9694 306003 63647 -254264 -291448 -239182 -107528 28371 -136664 -194327 -158458 145270 -177111
9682 -185235 -236721 -209675 77566 -275168 195817 40138 -139696 248349 -220183 18759 -29837
9670 -166007 -69314 3690 4459 -63418 -29966 -58600 175408 -283517 -51230 213252 -23659 -65277
9658 -65277 -311141 95912 -136300 -88921 -265607 -132705 -41264 -311725 14597 329071 12664
9646b17524Q6869A49994c4830l01620d0972B17860R4499A28502a71945o5016I5169
9634i7232o8482n0078A89243a96795B1226O2888K7480a51883j18504N7643F0444
9622a31710L3102b2995j61128r567r91a6601C7253F289J08838b80151L0818e6982
9609b22651E2748i7559D73131b46792P5996g9421k98017e1276j2154I8143g3647
9597a28925a5022m9073J7229j78917a10360d2393k3041n8350h24k56241a17968
9585a07841A3715P3909d25456J89927B36796a86408B84762B0676K7253a63973
9574c05455h2655C04194B8606a94710o607G187a38490A1424R3455g5785p4032
9563a49817O1928l5173L872o3817A12675L0153a05570B86446a42823A69285e00554
$$ plain form
9646 -217524 -130655 149994 -34830 -336450 -40972 217860 312359 128502 -171945 -236961 95169
9634 -97232 -165714 -215792 189243 -196795 21226 84114 111594 -151883 -270387 -212744 60444
9622 -131710 -98608 -22995 -184123 -193690 -194681 -16601 37253 6289 115127 -280151 -249333 -56982
9609 -222651 52748 -97559 473131 -246792 -170796 -79421 -377438 -51276 -63430 98143 -73647
9597 -128925 -15022 -64095 -46866 -225783 -110360 -42393 -65434 -123784 -824 -257065 -117968
9585 -107841 13715 87624 -425456 -235529 236796 -186408 284762 20676 47929 -163973
9574 -305455 -82655 304194 28606 -194710 -201317 7187 -138490 11424 104879 -75785 -149817
9563 -149817 -87889 -123062 -119190 -183007 112675 142828 -105570 286446 -142823 169285 -500554
9551A19959a48369j87409g1394L769m05251B33974A2930c1189j073G1388h7723
9539B20963a62312g2660j41018j48670H1900a1097k7029l33913B95452b55026
9528i9356A2655K06426D8193j4747D336a94797A5084K41637g5684k39130B41073
9516c065l9622j53797d9446p7259b0384G1364b73922R4918A39060b10914C2015
9504H6012b53214C82692j20682I400c13804g2490l47793a33296M0288I6233N2814
9493A49047a39091j22149n3296D3432h4597r7250j4928A9777b74425L8236C8140
9481b20989A14039h6238B23364C481J65071d5257F7855c62245a14526j10582Q3304
9470a41804l2198B69699i6349B67476i6883e347n8409h708j07791j9216M3932
$$ plain form
9551 119959 -148369 -335778 -71394 -67625 -472876 233974 12930 -31189 -32262 71388 -87723
9539 220963 -162312 -72660 -213678 -362348 81900 -11097 -38126 -372039 295452 -255026
9528 -99356 12655 219081 48193 33446 4336 -194797 15084 256721 -75684 -314814 241073
9516 -3065 -42687 -196484 -49446 -126705 -20384 71364 -273922 -179004 139060 -210914 32015
9504 86012 -253214 382692 262010 9400 -313804 -72490 -420283 -133296 -93008 96233 149047
9493 149047 -139091 -261240 -314536 43432 -84597 -181847 -196775 19777 -274425 -236189 38140
9481 -220989 114039 -86238 223364 3481 168552 -45257 67855 -362245 -114526 -225108 -141804
9470 -141804 -174002 269699 -96349 267476 -96883 -5347 -63756 -8708 -116499 -135715 -91783
9459i1783G442e0038j17620a4180j06232L9204A5229J8081J35452h477m5496j6354
9447g0327B29184b99879B37141c66075d6130N003A6712J69693b68513A37442J14915
9436B52357a53943F6693B3698b27357B1877b14047a43o3200j65944B43757i55
9424I2925A1597b32038d1668j45944d7971j20591K0301A16315b07530k5326f7176
9412a81718f8304n2135q1598i7878A74571b39207d7612j6108j43616Q1376l26804
9401d52764P1272a7468l69038J77920f4585L859H7205J15338n9231b22287P1943
9390a50344A29819a63394O3210k7478G2375a13347H3331d00740B54882b52823
9379a01357k2470o151N4795p7143j48613b9665p0473G2691i3320D98114A64118
$$ plain form
9459 -91783 7442 -50038 -167658 -14180 -120412 -81208 15229 33310 168762 -8477 -53973 -70327
9447 -70327 229184 -299879 237141 -366075 -46130 -41127 16712 186405 -268513 137442 252357
9436 252357 -153943 66693 23698 -227357 21877 -214047 -143 -63343 -229287 243757 -955
9424 92925 11597 -232038 -41668 -187612 -47971 -168562 -148261 116315 -207530 -232856 -67176
9412 -181718 -68304 -120439 -202037 -97878 174571 -239207 -47612 -63720 -207336 -125960 -452764
9401 -452764 -381492 -17468 -386506 -208586 -64585 -60726 87205 202543 143312 -222287 -150344
9390 -150344 129819 -163394 -100184 -127662 72375 -113347 83331 -400740 254882 -252823
9379 -101357 -123827 -129978 -75183 -152326 -300939 -29665 -100138 72691 -93320 498114 164118
9367G705a7093A35463f9382C13497H904N5962B7318e28483a23476F1536J32193
9356A93729h2940B20447d3641k38309k7434M1947D184h0854j39363f5699H0361
9344g8625D3250a2546F3874a29539B11200a06146l24365K04506B0795a80614N5287
9333a25327a5087E7386B6848J67794e7002l1628I1938a31256B89297j09072b23833
9321a21892A17174b92144F2744a19225A11058a4097l18701g8495B17879a55773
9310c02248A94774a173k38450a17855l35530b02286m7343m7219B08875r2118a04122
9298b67320a17684B61695a58079k38284A47009b25534h9861K9942J5326n9709
9288a04302J5332j2340l49922A35755a56515A29596d739k05750H808N047d472
$$ plain form
9367 7705 -17093 135463 -69382 313497 8904 64866 27318 -528483 -123476 61536 193729
9356 193729 -82940 220447 -43641 -281950 -309384 -267437 4184 -80854 -220217 -65699 80361
9344 -78625 43250 -12546 63874 -129539 211200 -106146 -430511 -226005 20795 -180614 -125327
9333 -125327 -15087 57386 26848 194642 -57002 -88630 91938 -131256 289297 180225 -223833
9321 -121892 117174 -292144 62744 -119225 111058 -14097 -332798 -78495 217879 -155773
9310 -302248 194774 -1173 -239623 -117855 -453385 -202286 -249629 -296848 208875 116757 -104122
9298 -267320 -117684 261695 -158079 -396363 147009 -225534 -89861 -59919 -44593 -104302
9288 -104302 -88970 -101310 -451232 135755 -156515 129596 -4739 -210489 8808 13855 -4472
9276a09472d669k69594a1771B58579b50178C1236g4310A836e0501l77150G35b1382
9263b07786h018l78832E9911i3312C04950b19108L8485j44893A01255a72051Q686
9252a63365A43665a06467j35145B02458L9239L3151c16526A05090J36897b75877
9241b39343A55757k6561F3750a48535L9518H7096a35354H1366a64243b1919A01877
9229b68786A42844e0188j27686j48331J57853A12587b20652A5481g6057L6323
9219c9734j8592a3445j13027m2189f9849d389A47690Q3174f2494a1161k54835
9208b65996J5050k2354a10085j86057A31269l7451l4393H998L01328a78213H9662
9196E9390J25110e4884K356C3695A1165b68079g4965o5616q3556n1301B7368C80
$$ plain form
9276 -109472 -4669 -274263 -11771 258579 -250178 31236 -74310 1836 -50501 -427651 735 -21382
9263 -207786 -8018 -386850 59911 -93312 304950 -219108 -180623 -325516 101255 -172051 -163365
9252 -163365 143665 -106467 -241612 202458 241697 274848 -316526 105090 241987 -275877
9241 -239343 155757 129196 63750 -148535 -109017 87096 -135354 81366 -164243 -21919 101877
9229 -268786 142844 -50188 -177874 -326205 -168352 112587 -220652 15481 -76057 -39734
9219 -39734 -58326 -13445 -126472 -168661 -69849 -4389 147690 230864 -62494 -11161 -265996
9208 -265996 -250946 -273300 -110085 -296142 131269 93818 59425 8998 310326 -178213 89662
9196 59390 184500 -54884 -52528 33695 11165 -268079 -74965 -140581 -224137 -275438 27368 380
9183e1891l1487G9860Q430J5462K5478a16226L7684G2644L6038b69573a24760
9171h26j11674E5056b20446p3074I7389a48685B55063F9007a38635O0245r3508
9160a71898l5666e3407H5394J85424A15701a03552d1728n2573A91185a98440A32424
9148e8328A75098E4809a30402D1825c20889A82664g0922j25223k6615i1946j4783
9137a06729j39893i423A27083b30979e6427M171k48730d1230A75909C7585b77350
9125b2093o983I8552a97622A41098a69559R859L5193N3912j42735O6029C6481
9113a34192O1131D8977f399l8085q9783a7374A01473J88433G6340L0613a94525
9101B3461b63842f1868A94859b06269M8825m2414L6320N683P0790L1879k07365
$$ plain form
9183 -51891 -83378 79860 88290 103752 129230 -116226 -78542 72644 108682 -269573 -124760
9171 -826 -112500 55056 -220446 -293520 97389 -148685 255063 69007 -138635 -78390 -171898
9160 -171898 -207564 -53407 85394 270818 115701 -103552 -41728 -94301 191185 -198440 132424
9148 -58328 175098 54809 -130402 41825 -320889 182664 -70922 -196145 -222760 -91946 -106729
9137 -106729 -246622 -9423 127083 -230979 -56427 -52256 -300986 -41230 175909 37585 -277350
9125 -22093 -29076 98552 -197622 141098 -169559 -159700 -124507 -70595 -213330 -147301 36481
9113 -134192 -73061 48977 -6399 -44484 -134267 -17374 101473 289906 76340 106953 -194525
9101 23461 -263842 -61868 194859 -206269 -157444 -199858 -163538 -157855 -87065 -55186 -262551
9090b62551f4901l92380C31272p0320b04694g2548J580B388J02750h2392j05068
9079a87460D630J34457C7709e0653j07876l0436D8460L4831B9870c55877A6056
9067a65113A10161b04416e8498E1627f6092j23028N8574G3556a55901g4555j23385
9056a97940r082E3467a28350g578j50933A79680a1099q1736A1483A420i6475a9509
9043h979j48099l9527B91970H638K9183R0258a35756I5019Q420b63131J25889
9032a37242L0030A48244D802f8323A06868I670c94590A84215a22321e2132O919
9021d5213a3794l62080a18337l4756j21856C62331a71516k16969a43656A19101
9010A41192g7311B95013A34488g1748j17786A56699P6101b13570J05907A2634
$$ plain form
9090 -262551 -64901 -457281 331272 260952 -204694 -72548 -70968 2388 105138 -82392 -187460
9079 -187460 4630 139087 37709 -50653 -158529 -188965 48460 83291 29870 -355877 16056
9067 -165113 110161 -204416 -58498 51627 -66092 -189120 -130546 73556 -155901 -74555 -197940
9056 -197940 -207022 53467 -128350 -7578 -158511 179680 -11099 -92835 11483 1420 -96475 -19509
9043 -8979 -157078 -196605 291970 8638 37821 128079 -135756 95019 103439 -263131 -137242
9032 -137242 -107212 148244 4802 -68323 106868 9670 -394590 184215 -122321 -52132 -45213
9021 -45213 -13794 -375874 -118337 -153093 -274949 362331 -171516 -388485 -143656 119101
9010 141192 -77311 295013 134488 -71748 -189534 156699 232800 -213570 -107663 12634
8999b9197j45639E5605J7420b85056D0258e8119L981k20345J11809c7958j52633
8988a90591a03k84186J28656c924B07070E3254j1281J61527b74065F2637a13029
8976A2903b81647M9706D9927b27279B64841j21863D0938J69478b55401B84405
8965b3051k49464A63386N6251m4687E8530e944j06237j49050a04971A92629B4151
8953A08193D2612I140J19896C4155a09777j7021M5301E8288J84235c09339A4016
8941g9711E3307J59855a43025F6921f905C3304K75717l6872d8825k8797D95709
8929B67124J19841r4205J47574N95641J74965O10103J482620L623767l74858B822213
8918A714774H03565k13855k79263K39673k65106H8639L91350B18221H068R8695
$$ plain form
8999 -29197 -174836 55605 73025 -285056 40258 -58119 -54138 -274483 -162674 -37958 -190591
8988 -190591 -103 -284289 -155633 -3924 207070 53254 41973 203500 -274065 62637 -113029
8976 12903 -281647 -231941 49927 -227279 264841 142978 40938 210416 -255401 284405
8965 -23051 -272515 163386 219637 174950 58530 -5944 -112181 -261231 -104971 192629 24151
8953 108193 42612 9140 129036 34155 -109777 -126798 -81497 58288 242523 -309339 14016
8941 -79711 53307 213162 -143025 66921 -6905 33304 309021 272149 -48825 -77622 495709
8929 267124 386965 292760 440334 1035975 1210940 1821043 3303663 6927430 6552572 2822213
8918 1714774 803565 589710 310447 550120 285014 88639 479989 218221 8068 106763
8908A06763C2204J14376K62533B04031E0212c64712H2470L158i888j69934M5051
8897a34771J3816n0942C13015a21834B45066a57761d7621k23562d6016j41871
8887a87887p6002f8431I7596g2466A15029E5809c08861B92739B5835J06714b18684
8875A58718n0232a8783j22691D54203a08490I6491l1120N1966m1754Q7160b01702
8863a51426p5378D6291Q6700h2194K963q9076l69956K48257A16322b15591m8014
$$ plain form
8908 106763 32204 146580 409113 204031 50212 -364712 82470 85628 -9888 -179822 -134771
8897 -134771 -120955 -171897 313015 -121834 245066 -157761 -47621 -271183 -46016 -187887
8887 -187887 -263889 -68431 97596 -72466 115029 55809 -308861 292739 25835 132549 -218684
8875 158718 108486 -18783 -141474 454203 -108490 96491 65371 117337 75583 162743 -201702
8863 -151426 -226804 46291 132991 -82194 -79231 -168307 -538263 -290006 116322 -215591 -263605
$$ [...]
##END NTUPLES=NMR SPECTRUM
##END=
