
##TITLE=AC1354_CPIAH12173_6648069_Yin7xcXN6v
##JCAMPDX= 6.0         $$ Bruker NMR JCAMP-DX V2.0
##DATA TYPE= NMR SPECTRUM
##DATA CLASS= NTUPLES
##ORIGIN= BRUKER
##OWNER= Administrator
$$ 1.72 TOPSPIN		Version 2.1
$$ 2012-08-10 21:13:06.921 -0500  Administrator@TOPSPIN
$$ Compression mode = diff/dup
##.OBSERVE FREQUENCY= 400.02188249412
##.OBSERVE NUCLEUS= ^1H
##.ACQUISITION MODE= SIMULTANEOUS (DQD)
##.ACQUISITION SCHEME= undefined
##.AVERAGES= 8
##.DIGITISER RES= 22
##SPECTROMETER/DATA SYSTEM= spect
##.PULSE SEQUENCE= zg30
##.SOLVENT NAME= COFFEE_meoh
##.SHIFT REFERENCE= INTERNAL, COFFEE_meoh, 1, 14.98509
##AUDIT TRAIL= $$ (NUMBER, WHEN, WHO, WHERE, PROCESS, VERSION, WHAT)
$$ ##TITLE= Audit trail, TOPSPIN		Version 2.1
$$ ##JCAMPDX= 5.01
$$ ##ORIGIN= Bruker BioSpin GmbH
$$ ##OWNER= Administrator
$$ $$ C:\Bruker\TOPSPIN/data/COFFEE/nmr/AC1354_CPIAH12173_6648069_Yin7xcXN6v/10/pdata/1/auditp.txt
$$ ##AUDIT TRAIL=  $$ (NUMBER, WHEN, WHO, WHERE, PROCESS, VERSION, WHAT)
(   1,<2012-08-10 21:12:58.437 -0500>,<Administrator>,<TOPSPIN>,<go>,<TOPSPIN 2.1>,
      <created by zg
	started at 2012-08-10 21:11:51.906 -0500,
	POWCHK enabled, PULCHK disabled,
       configuration hash MD5:
       6B 1B 68 BB D9 2E 58 E2 7F 35 AD 54 07 DF 0E 41
       data hash MD5: 64K
       70 46 0F 75 0E 0D DD 5C 3C 79 B9 3A 17 56 9C 79>)
(   2,<2012-08-10 21:13:02.609 -0500>,<Administrator>,<TOPSPIN>,<proc1d>,<TOPSPIN 2.1>,
      <Start of raw data processing
       efp LB = 0 FT_mod = 6 PKNL = 1 PHC0 = 0 PHC1 = 0 SI = 32K 
       data hash MD5: 32K
       39 69 32 B8 D4 B0 08 AA 2D 14 A8 49 29 39 50 1B>)
(   3,<2012-08-10 21:13:02.921 -0500>,<Administrator>,<TOPSPIN>,<proc1d>,<TOPSPIN 2.1>,
      <pk PHC0 = 180.5109 PHC1 = 0 
       data hash MD5: 32K
       64 E5 86 77 35 E8 B0 50 C5 15 DE 2D 62 9B EF 80>)
(   4,<2012-08-10 21:13:03.093 -0500>,<Administrator>,<TOPSPIN>,<proc1d>,<TOPSPIN 2.1>,
      <abs ABSG = 1 
       data hash MD5: 32K
       FA 13 D4 D1 C4 2C 14 81 3E D9 BC 96 60 4D 37 2A>)
(   5,<2012-08-10 21:13:03.187 -0500>,<Administrator>,<TOPSPIN>,<proc1d>,<TOPSPIN 2.1>,
      <abs ABSG = 2 
       data hash MD5: 32K
       B7 E3 23 90 4D 0B EA A5 74 96 C7 0D E5 A6 14 19>)
(   6,<2012-08-10 21:13:03.218 -0500>,<Administrator>,<TOPSPIN>,<proc1d>,<TOPSPIN 2.1>,
      <abs ABSG = 3 
       data hash MD5: 32K
       20 DC 1E 6E 6B 86 D2 85 00 02 63 D1 1B 83 C8 7F>)
(   7,<2012-08-10 21:13:03.250 -0500>,<Administrator>,<TOPSPIN>,<proc1d>,<TOPSPIN 2.1>,
      <abs ABSG = 4 
       data hash MD5: 32K
       C4 6A 7A 1A 48 50 06 34 2F 22 B4 A3 82 4D 3F 3C>)
(   8,<2012-08-10 21:13:03.281 -0500>,<Administrator>,<TOPSPIN>,<proc1d>,<TOPSPIN 2.1>,
      <abs ABSG = 5 
       data hash MD5: 32K
       D9 45 B6 FF 9A 96 F6 8F 67 B5 12 A1 F6 A5 2D E8>)
$$ ##END=
$$ 
$$ $$ hash MD5
$$ $$ 11 CC 96 FD 94 A5 BA 58 1E 4E 34 47 74 C6 7C 6F
##$RELAX= 
##$RELAX= 
##$RELAX= 
##$RELAX= 
##$RELAX= 
##$RELAX= 
##$RELAX= 
$$ Bruker specific parameters
$$ --------------------------
$$ [...]
150 150 150 150 150 150 150 150
##$TP07= 0
##$TPNAME0= <>
##$TPNAME1= <>
##$TPNAME2= <>
##$TPNAME3= <>
##$TPNAME4= <>
##$TPNAME5= <>
##$TPNAME6= <>
##$TPNAME7= <>
##$TPOAL= (0..7)
0.5 0.5 0.5 0.5 0.5 0.5 0.5 0.5
##$TPOFFS= (0..7)
0 0 0 0 0 0 0 0
##$TUNHIN= 0
##$TUNHOUT= 0
##$TUNXOUT= 0
##$USERA1= <user>
##$USERA2= <user>
##$USERA3= <user>
##$USERA4= <user>
##$USERA5= <user>
##$V9= 5
##$VALIST= <valist>
##$VCLIST= <CCCCCCCCCCCCCCC>
##$VD= 0
##$VDLIST= <DDDDDDDDDDDDDDD>
##$VPLIST= <PPPPPPPPPPPPPPP>
##$VTLIST= <TTTTTTTTTTTTTTT>
##$WBST= 1024
##$WBSW= 4
##$XGAIN= (0..3)
0 0 0 0
##$XL= 0
##$YL= 0
##$YMAX_a= 457285
##$YMIN_a= -597631
##$ZGOPTNS= <>
##$ZL1= 120
##$ZL2= 120
##$ZL3= 120
##$ZL4= 120
##$ABSF1= 14.98509
##$ABSF2= -5.573092
##$ABSG= 5
##$ABSL= 3
##$ALPHA= 0
##$AQORDER= 0
##$ASSFAC= 0
##$ASSFACI= 0
##$ASSFACX= 0
##$ASSWID= 0
##$AUNMP= <proc_prof1d_extract_pilot.lims>
##$AXLEFT= 0
##$AXNAME= <>
##$AXNUC= <1H>
##$AXRIGHT= 0
##$AXTYPE= 0
##$AXUNIT= <>
##$AZFE= 0.1
##$AZFW= 0.1
##$BCFW= 0
##$BC_mod= 0
##$BYTORDP= 0
##$COROFFS= 0
##$CY= 15
##$DATMOD= 1
##$DC= 0
##$DFILT= <>
##$DTYPP= 0
##$F1P= 0
##$F2P= 0
##$FCOR= 0.5
##$FTSIZE= 32768
##$FT_mod= 6
##$GAMMA= 0
##$GB= 0
##$INTBC= 1
##$INTSCL= 1
##$ISEN= 128
##$LB= 0
##$LEV0= 0
##$LPBIN= 0
##$MAXI= 10000
##$MC2= 0
##$MEAN= 0
##$ME_mod= 0
##$MI= 0
##$NCOEF= 0
##$NC_proc= -8
##$NLEV= 6
##$NOISF1= 0
##$NOISF2= 0
##$NSP= 0
##$NTH_PI= 0
##$NZP= 0
##$OFFSET= 14.98509
##$PC= 1
##$PHC0= 180.5109
##$PHC1= 0
##$PH_mod= 1
##$PKNL= yes
##$PPARMOD= 0
##$PPDIAG= 0
##$PPIPTYP= 0
##$PPMPNUM= 2147483647
##$PPRESOL= 1
##$PSCAL= 4
##$PSIGN= 0
##$PYNMP= <proc.py>
##$REVERSE= no
##$SF= 400.02
##$SI= 32768
##$SIGF1= 0
##$SIGF2= 0
##$SINO= 400
##$SIOLD= 32768
##$SPECTYP= <>
##$SREGLST= <1H.CDCl3>
##$SSB= 0
##$STSI= 32768
##$STSR= 0
##$SW_p= 8223.68421052631
##$SYMM= 0
##$S_DEV= 0
##$TDeff= 65536
##$TDoff= 0
##$TI= <>
##$TILT= no
##$TM1= 0
##$TM2= 0
##$TOPLEV= 0
##$USERP1= <user>
##$USERP2= <user>
##$USERP3= <user>
##$USERP4= <user>
##$USERP5= <user>
##$WDW= 1
##$XDIM= 32768
##$YMAX_p= 461582652
##$YMIN_p= -684308
##$CURPLOT= <Network HP LaserJet P1505>
##$CURPRIN= <$Network HP LaserJet P1505>
##$DFORMAT= <normdp>
##$LAYOUT= <+/1D_H.xwp>
##$LFORMAT= <normlp>
##$PFORMAT= <normpl>
##$SURQMSG= 1
$$ End of Bruker specific parameters
$$ ---------------------------------
##NTUPLES= NMR SPECTRUM
##VAR_NAME=  FREQUENCY,     SPECTRUM/REAL,   SPECTRUM/IMAG
##SYMBOL=    X,             R,               I
##VAR_TYPE=  INDEPENDENT,   DEPENDENT,       DEPENDENT
##VAR_FORM=  AFFN,          ASDF,            ASDF
##VAR_DIM=   32768,         32768,           32768
##UNITS=     HZ,            ARBITRARY UNITS, ARBITRARY UNITS
##FACTOR=    0.250966925370066, 1,           1
##FIRST=     8223.43324360094, -397151,      -245356
##LAST=      0,             99918,           269945
##MIN=       0,             -684308,         0
##MAX=       8223.43324360094, 461582652,    0
$$ Real data points
##PAGE= N=1
##DATA TABLE= (X++(R..R)), XYDATA
$$ [...]
$$ plain form
19482 188740 -332731 75965 -58011 109065 -275609 -247722 86217 -168546 -186956 -437627
19472 -437627 196574 -445635 -9370 -57427 -54754 -60908 9309 -180357 -82764 -65588 2897 -103890
19459 -53522 -239236 77747 -248462 -83785 161452 67592 -42700 -78121 146755 102625 15719
19447 -79918 189810 -289481 -256189 53407 -21600 -63548 79650 -50728 38432 -75959 -384159
19436 -384159 -10370 -87853 -26714 133444 -258923 -344394 -167131 62874 184425 -164250
19425 3157 22878 -258009 -29168 -23473 -205096 -380785 -166233 -296566 -289078 4025 -7007 -192656
19413 -192656 31066 -312807 12368 33494 -465249 -136791 -13478 10711 12717 313196 184127
19402 184127 34374 -212162 -261884 8801 11567 -293446 -157237 54768 -322129 -82110 148328
$$ packed form
19482A88740c32731G5965e8011A09065b75609K7887H6217a68546j8410k50671
19472d37627A96574d45635i370m8057K673o154I309a80357h2764J7176B897a03890
19459e3522j85714G7747b48462h3785A61452F7592d2700l5421A46755m4130A5719
19447g9918A89810b89481L3292E3407b1600m1948G9650e0728C8432g5959l08200
19436c84159a0370p7483b6714A33444b58923q5471a67131F2874J21551a64250
19425C157J9721b58009b9168N695j81623j75689a66233j30333P488D025g007j85649
19413a92656C1066c12807A2368K1126d65249a36791a3478A0711K006L00479j29069
19402A84127C4374b12162m9722H801K766b93446J36209E4768c22129h2110A48328
$$ plain form
19390 201056 -11809 -349235 -102784 -123580 1910 -254992 -64807 101709 38499 -258689 -409024
19379 -409024 -1194 -5681 -216149 -68966 247768 -147501 -202299 -41854 45329 141162 -153419
19367 -171275 -70254 17409 81813 -41428 78465 268212 -233402 -249066 -13432 -199650 -33707
19355 90305 22756 134456 -79691 -252662 -227069 -87081 -82774 184984 -79958 105370 142113
19344 142113 -143086 -108847 -84783 -63561 -284314 -446982 71701 -113815 -60467 181415
19333 -146003 127649 -51696 -23902 -164715 -300080 216883 -49771 -102249 86445 143053 -234360
19321 318320 -242247 -40727 130547 -156851 -144530 -286333 6366 -43750 -136898 64990 83764
19310 83764 51531 81847 208081 97265 49047 303756 -97641 -179070 -149135 -275443 -85213
$$ packed form
19390B01056a1809l37426a02784k0796A910b54992f4807A01709C8499b58689j50335
19379d09024a194m487k10468f8966B47768a47501n4798d1854D5329R5833a53419
19367a71275g0254A7409O4404d1428G8465J89747b33402j5664a3432j86218c3707
19355I0305B2756J11700g9691j72971K5593h7081M307A84984g9958A05370L6743
19344A42113a43086L4239K4064K1222k20753j62668G1701a13815N3348A81415
19333a46003A27649e1696b3902j40813j35365B16883d9771n2478H6445N6608b34360
19321C18320b42247d0727A30547a56851J2321j41803F366d3750r3148F4990J8774
19310H3764l2233L0316J26234I7265m8218K54709i7641q1429K9935j26308h5213
$$ plain form
19298 -98770 -119636 47916 261123 -121663 -228445 128305 174816 14861 -38936 6721 -135654
19286 -72016 -225719 96683 121957 49881 -149547 34912 122489 17046 293135 57043 -358429
19274 -29868 170932 229350 -303456 -28703 -48081 6335 -196852 -68441 -9937 21905 80927
19263 80927 -42233 57067 25837 -102380 -454872 -329188 -157431 -146140 -309908 -56228 -262485
19252 -262485 224134 -166268 -18198 -218001 -267648 -115945 81970 547134 -51274 -177146
19242 -177146 57336 -48626 160024 -216480 43931 -223416 -1377 104253 17357 53845 424438
19231 424438 63055 -249180 -210952 -32822 -111495 -43562 -154541 -114484 69417 -283439 -77933
19219 -43452 -41780 -23991 -524730 7614 -239445 -71083 36967 67785 -33162 -63956 82919 -164286
$$ packed form
19298i8770k0866D7916K13207a21663j06782A28305M6511A4861c8936F721a35654
19286g2016j53703I6683K5274D9881a49547C4912Q7577A7046K76089E7043c58429
19274b9868A70932N8418c03456b8703j9378F335a96852f8441i937B1905N9022
19263H0927d2233E7067B5837a02380l52492J25684a57431J1291j63768e6228k06257
19252b62485B24134a66268a8198j99803m9647a15945H1970M65164e1274j25872
19242a77146E7336d8626A60024b16480D3931b23416a377A04253A7357L6488L70593
19231D24438F3055b49180L8228c2822p8673d3562j10979M0057F9417b83439g7933
19219d3452J672J7789n00739G614b39445g1083C6967L0818c3162l0794H2919a64286
$$ plain form
19206 -53649 -98644 282840 177344 66035 3442 -297328 -198722 261821 106801 -82445 -67521
19195 -67521 -74098 -241535 -56062 5544 -130119 129689 -351473 115929 -314962 -292170 75339
19183 87420 189756 4559 74960 -141533 72227 -107213 -37890 53356 154720 -303130 -316474
19172 -316474 -114833 -212044 25317 -66269 88788 -478830 -135375 125999 102780 120146 -323633
19160 -40543 -38458 -151398 -74639 -239733 17963 -15964 70769 -9610 277945 -103380 -34639
19148 -185595 -331443 118580 -228222 -81162 -183266 -149317 -81253 -175210 -12583 -16078 19872
19136 90691 -152145 -26009 -107956 -320161 -22345 -180162 -12063 29263 -186839 -336 -145402
19125 -145402 -138967 -148679 89880 145713 14296 109876 67571 -247041 -32283 -16668 146357
$$ packed form
19206e3649m4995B82840j05496F6035C442b97328R8606B61821A06801h2445J4924
19195f7521o577j67437e6062E544a30119A29689c51473A15929c14962K2792G5339
19183H7420J02336D559P0401a41533G2227a07213c7890E3356J01364c03130j3344
19172c16474a14833r7211B5317f6269H8788d78830a35375A25999k3219J7366c23633
19160d0543K085j12940g4639j65094A7963a5964G0769i610B77945a03380c4639
19148a85595j45848A18580b28222h1162j02104L3949O8064r3957a2583l495A9872
19136I0691a52145b6009q1947k12205b2345j57817a2063B9263a86839c36j45066
19125a45402O435r712H9880N5833A4296R5580m2305b47041c2283J5615A46357
$$ plain form
19113 -213521 121906 65180 -290547 46433 93078 1188 -210972 -412296 -347965 -128981 -225983
19102 -225983 183157 274837 -126305 -215568 -176764 86285 97298 -203323 -253540 168673 109374
19091 109374 188520 185628 -305316 -51914 5171 179770 129898 61279 -122671 -399826 8596
19079 61405 46837 -4019 105668 225150 -148134 -173426 176043 -75951 -111226 85211 155387
19068 155387 312420 -95 149884 -246425 30305 27274 228829 -41015 -86923 63038 271893
19057 271893 253273 -60475 -71580 -287722 -181351 -125438 -99513 -147509 -170113 177589 -37539
19045 -85555 -193192 -89669 -225643 -275171 -88611 -117494 -153717 197988 -557870 -36143 -103607
19034 -103607 -97200 -25887 77966 15765 116255 64213 80443 -187537 -245020 -217241 133232
$$ packed form
19113b13521A21906n6726b90547D6433M6645A188b10972k01324O4331a28981r7002
19102b25983A83157R1680a26305q9263L8804H6285J1013b03323n0217A68673n9299
19091A09374P9146k892c05316e1914E171J74599m9872F1279a22671k77155H596
19079F1405j4568d019A05668J19482a48134k5292A76043g5951l5275H5211P0176
19068A55387J57033i5A49884b46425C0305l031K01555d1015m5908F3038K08855
19057B71893j8620f0475j1105k16142J06371N5913K5925m7996k2604A77589c7539
19045h5555j07637h9669j35974m9528h8611k8883l6223A97988e57870c6143o7464
19034a03607O407b5887G7966A5765J00490n2042J6230a87537n7483K7779A33232
$$ plain form
19022 224913 -168721 96838 14743 -5591 329302 -83616 -13988 223425 -209239 -64150 -380702
19011 -380702 -71433 -24567 -99298 -130515 301281 -96225 148189 138946 34273 348540 -127519
18999 -27497 -169237 72762 -87887 -9581 33421 124726 -42017 82280 60566 38380 -64445 -306449
18987 -306449 3753 92757 -33477 -160072 17231 -256827 253967 192466 -124041 -155742 -10500
18975 -238705 312039 -76398 194379 390506 392463 588462 430815 23469 59323 -156884
18964 -147666 259077 -90744 132103 43620 32807 -20396 -193811 -90688 48745 -292304 315862
18952 2858 114727 -130283 -205354 160832 -49680 -90063 95832 -11332 -302680 -282068 -450905
18941 -450905 182638 65300 -169570 76817 153456 13900 -65452 -118380 -73303 -35149 107079
$$ packed form
19022B24913a68721I6838A4743e591C29302h3616a3988B23425b09239f4150l16552
19011c80702g1433b4567p4731l1217C01281i6225A48189r243C4273L14267a27519
18999b7497j41740G2762h7887i581C3421R1305d2017H2280k1714k2186f4445k42004
18987c06449C753Q9004c3477j26595A7231b56827B53967o1501a24041l1701a0500
18975b38705C12039g6398A94379J96127J957J95999j57647B3469L5854a56884
18964a47666B59077i0744A32103D3620j0813b0396j73415i0688D8745b92304C15862
18952B858J11869a30283p5071A60832d9680m0383I5832a1332k91348K0612j68837
18941d50905A82638F5300a69570G6817P6639A3900f5452n2928M5077c5149A07079
$$ plain form
18929 -629 -97271 62331 70032 137476 57683 54467 -43631 147643 41212 -103566 75535 -86490
18916 149371 -179466 65491 -95076 17592 24547 353454 39275 309333 416313 901974 98393
18904 299040 -404741 -132412 -268221 -283104 -175651 -41873 -135485 -75236 196681 239043
18894 239043 -120953 -2814 132383 -154414 72557 35075 -97436 207062 -77295 42087 27329
18883 27329 122428 58335 -340262 -230475 390613 -157517 114107 -183918 -9025 64926 -207851
18871 338211 -169975 -79310 -149999 201511 -278857 -66333 145360 166969 -142358 -19695
18860 263467 -382227 -148230 159207 -251413 17980 237768 -129976 116683 233981 -64556
18849 -211505 62664 156783 -5026 -62581 157362 -356333 -42720 77786 236711 119460 132066
$$ packed form
18929f29r6642F2331P701O7444E7683l216d3631A47643D1212a03566G5535h6490
18916A49371a79466F5491i5076A7592O955L28907C9275K70058J06980M85661I8393
18904B99040d04741a32412j35809j4883J07453d1873r3612O0249A96681M2362
18894B39043a20953b814A32383a54414G2557C5075i7436B07062g7295D2087j4758
18883B7329R5099E8335c40262J09787C90613a57517A14107a83918i025F4926b07851
18871C38211a69975g9310p0689B01511b78857f6333A45360K1609a42358a9695
18860B63467c82227a48230A59207b51413A7980K19788a29976A16683J17298f4556
18849b11505F2664R4119e026n7555A57362c56333d2720G7786J58925j17251J2606
$$ plain form
18838 132066 166067 -188885 -250044 -326048 -173431 27423 132982 -159448 -369768 87206
18827 -51624 -306538 -50200 18458 116134 -104494 210086 157817 -224691 30797 -192482 -145934
18816 -145934 -131261 -187191 -18821 32025 106436 -88790 66999 173876 66746 70470 17142
18804 297143 -165103 25121 -229750 -130804 -135089 118421 -135174 -96928 137760 84460 177078
18793 177078 -150410 -216664 131335 -116443 -124337 184915 21539 76066 -37965 -114276 140121
18781 -175563 -170851 11518 -219150 -175372 -288933 70919 -347061 -424379 -127458 185253 -153599
18769 -286874 -78871 -113304 -309305 -294247 -184605 -130182 3288 289785 89922 35605 -137582
18757 -49996 120364 -366298 -167481 9136 -284868 33397 -34594 294038 50197 -229092 210581
$$ packed form
18838A32066L4001a88885o1159p6004J52617B7423J05559a59448k10320H7206
18827e1624k54914e0200A8458R7676a04494B10086n2269b24691C0797a92482M6548
18816a45934J4673n5930a8821C2025P4411h8790F6999J06877F6746L724A7142
18804B97143a65103B5121b29750R8946m285A18421a35174L8246A37760n3300R2618
18793A77078a50410o6254A31335a16443p894A84915B1539N4527c7965p6311A40121
18781a75563M712A1518b19150M3778j13561G0919c47061p7318a27458A85253a53599
18769b86874g8871l4433j96001J5058J09642N4423C288K86497H9922C5605a37582
18757d9996A20364c66298a67481I136b84868C3397c4594B94038E0197b29092B10581
$$ plain form
18745 -186265 115057 -23730 -38575 29184 -128835 -61205 -100895 -51219 279268 -1409 17690
18733 102004 42029 2574 -63299 -32283 -73833 166643 15692 216920 -165695 124955 -86341
18721 11058 229084 39925 -197197 255292 83296 -239354 -66956 -37014 -360247 -331436 -76995
18709 -54340 -280148 -534894 221600 -124145 -272031 1226 -169417 9927 -117175 27270 -409531
18697 -255014 -96955 -249509 32886 -134441 -155322 -61720 -124542 -70123 -316677 -194176 -249528
18686 -249528 -150335 15451 194647 32921 -43684 -36719 43871 -158296 -124547 95402 268259
18675 268259 61674 -15702 219827 -199059 73036 -36216 -12411 -123185 103411 52654 -61133
18663 -43068 -325292 15510 219715 54249 -339682 -186269 264184 -67086 -251161 -5262 -166677
$$ packed form
18745a86265A15057b3730j4845B9184a28835f1205l9690M9676B79268a409A7690
18733A02004D2029B574f3299L1016m1550A66643A5692K01228a65695A24955h6341
18721A1058K18026C9925a97197B55292H3296b39354f6956K9942l23233K8811g6995
18709e4340k25808k54746B21600a24145j47886A226a69417I927a17175B7270d09531
18697b55014i6955j52554C2886a34441k0881f1720o2822N4419k46554J22501n5352
18686b49528R9193A5451J79196C2921d3684O965D3871a58296L3749I5402J72857
18675B68259F1674a5702B19827a99059G3036c6216a2411j10774A03411n0757f1133
18663d3068k82224A5510K04205E4249c39682J53413B64184f7086j84075e262j61415
$$ plain form
18652 -166677 89931 15842 -52386 -210655 -189896 -24991 7248 -276932 -35260 -85329 -47047
18641 -47047 -272963 278595 -125653 -185421 99710 -171161 -162428 -255536 -389577 -132808 -371156
18630 -371156 -308279 -97176 -305893 21355 -263258 -183313 -27090 -202717 -116905 -257241 180301
18618 -257187 -23334 12893 -290355 -60349 -118037 77064 -169328 4556 105473 239094 782
18606 -11846 352453 -80712 219574 -113505 -113514 -208466 -93776 -167910 -103002 -71170 -83956 -91590
18594 -91590 -199728 -210765 -72291 183793 -190670 102466 -37023 199318 170496 -346984
18583 -62531 -183551 30928 255293 54971 -5309 -99612 165008 -105721 -171553 -232261 -231790
18572 -231790 -375594 -72125 -81520 -237080 -278510 65022 36985 190565 84546 -119672 -189780
$$ packed form
18652a66677H9931A5842e2386j58269K0759b4991G248b76932c5260n0069L8282
18641d7047k25916B78595a25653n9768I9710a71161Q733r3108j34041a32808k38348
18630c71156O2877i7176k08717B1355b63258P9945b7090j75627Q5812j40336A80301
18618b57187b3334A2893b90355f0349n7688G7064a69328D556J00917J33621G82
18606a1846C52453h0712B19574a13505rr4952i3776p4134O4908L1832j2786p634
18594i1590j08138j1037g2291A83793a90670A02466c7023A99318k8822c46984
18583f2531j21020C0928K24365E4971e309r4303A65008a05721o5832o0708M71
18572b31790j43804g2125r395j55560m1430F5022k8037J53580H4546a19672p0108
$$ plain form
18561 -189780 -223041 -99988 231973 -171791 22564 133963 -50745 -78026 516780 -60152 -9460
18549 -84405 -110743 -171562 251823 -249536 -320819 -8169 23259 166372 -15517 58894 116335
18538 116335 -221795 -112526 24130 100970 -198342 -139886 11751 -321304 -196173 -153408
18528 -153408 -7859 134725 196028 -242385 -29594 7951 -256718 116620 -113921 33700 -278744
18516 147128 388110 60179 -150202 -141832 71253 11685 24688 10136 59732 -92530 33075
18504 19433 13089 60882 -171182 -203373 -80330 -380921 -77723 -463259 -157378 75459 -149892
18492 -215195 314679 65685 224189 -55543 -14431 28848 221945 -155488 51452 -148264
18481 -120767 87572 68108 -1938 -133405 -282396 -151745 -168304 101631 1145 -38430 573646
$$ packed form
18561a89780l3261i9988B31973a71791B2564J11399e0745k7281E16780f0152i460
18549h4405k6338o0819B51823b49536p1283h169B3259J43113a5517E8894N7441
18538A16335b21795J09269B4130P6840a98342N8456A1751c21304J25131M2765
18528a53408g859A34725O1303b42385b9594G951b56718A16620a13921C3700b78744
18516A47128K40982F0179a50202Q370G1253A1685J3003A0136M9596i2530C3075
18504A9433o344M7793a71182l2191h0330l00591g7723l85536a57378G5459a49892
18492b15195C14679F5685J58504e5543a4431B8848J93097a55488E1452a48264
18481a20767H7572j9464a938j31467j48991J30651j6559A01631A145c8430E73646
$$ plain form
18469 -69196 -128701 -245247 76609 -289087 -69103 74289 -183995 -53323 -363640 -252582 -209592
18458 -209592 -403635 261745 151937 -59644 -87664 -215521 -10623 -285001 -44481 188066
18447 94238 -318182 -45003 -131384 248917 -72831 32571 -157049 -101271 -230167 -52917 118085
18435 -124821 7839 211744 26279 -294165 -228241 -103059 75154 -12452 109413 290618 50652
18423 -144315 -377568 -226526 151164 -17001 -91692 -181751 -348931 55123 30147 -322666
18412 -6179 223652 249853 140430 42728 -418236 -70485 -210027 -120879 136043 129326 118128
18401 118128 -222647 77411 77697 377782 -286534 -41400 -55589 518435 38812 125269 484550
18390 484550 -104979 -201389 -288678 -86178 87061 -115568 -131091 54860 4423 149700 357905
$$ packed form
18469f9196n9505j16546G6609b89087f9103G4289a83995e3323l10317J11058M2990
18458b09592j94043B61745j09808e9644k8020j27857a0623k74378d4481A88066
18447I4238c18182d5003q6381B48917g2831C2571a57049N5778j28896e2917A18085
18435a24821G839K03905B6279b94165O5924a03059G5154a2452A09413J81205E0652
18423a44315k33253J51042A51164a7001p4691r0059j67180E5123k4976c22666
18412f179B23652K6201j09423D2728d18236g0485j39542Q9148A36043o717j1198
18401A18128b22647G7411K86L00085b86534d1400j4189E18435C8812Q6457L59281
18390D84550a04979r6410q7289h6178H7061a15568j5523E4860D423J45277K08205
$$ plain form
18379 357905 95279 -45297 -166571 -94153 -196419 -153537 -20622 145053 -124476 33791 -162601
18367 86568 -32963 176903 28016 176991 52861 229780 -195063 129025 142692 117847 45227
18355 -375079 24453 -328417 -253814 -378861 5367 189582 -185570 -212250 75473 392341 -72734
18343 -144170 271283 -169803 -297675 138192 156933 297340 20278 219998 -401174 206811
18332 -47454 -125581 130026 -293538 -21897 271052 84059 320850 -164981 8315 -194219 -6636
18320 128675 -57650 18214 -193976 -117177 -129697 -54529 -46012 -71116 69366 240796 -380724
18308 -195711 45288 -494447 -319563 -140839 -88433 -224318 -260929 168064 -506534 -205482
18297 -192447 276453 20411 378226 -113570 -44006 40672 -96948 38918 153080 281148
$$ packed form
18379C57905I5279d5297j21274P2418j02266M2882b0622A45053a24476C3791a62601
18367H6568c2963A76903B8016J48975E2861J76919a95063A29025J3667k4845D5227
18355c75079B4453c28417P4603j25047E367J84215a85570k6680G5473L16868g2734
18343a44170B71283a69803j27872A38192J8741J40407B0278J99720d01174B06811
18332d7454p8127A30026b93538b1897B71052H4059K36791a64981H315a94219f636
18320A28675e7650A8214a93976P6799j2520e4529Q517k5104F9366J71430c80724
18308a95711D5288d94447J74884a40839N2406j35885l6611A68064e06534b05482
18297a92447B76453B0411L57815a13570d4006D0672i6948C8918J14162J28068
$$ plain form
18287 281148 -210220 -246976 -115345 -20394 231202 29403 -93185 120358 66910 63818 182457
18276 182457 -297047 -140386 89321 94510 -251284 -304039 8544 169510 415773 -98260 32591
18264 207935 -103695 -233034 53494 -174876 -73884 57153 164111 -43229 -170076 -263654
18254 -263654 16231 25799 42037 80750 -130975 -319621 -84073 125929 -216787 -162762 112968
18242 -193436 -35520 -293956 116214 154702 387788 -340830 -36064 90234 -150984 -33295
18231 54920 -349242 -89519 -138519 -168971 -131174 -93086 97010 79437 190751 -189497 -7676
18219 214759 159932 231547 11430 522 -126599 -21020 27359 186748 64449 -467855 -320934
18208 -320934 -29923 17381 -32414 143660 176569 -414668 -121335 157168 -149340 -120049
$$ packed form
18287B81148b10220l6756a15345b0394B31202B9403i3185A20358n3448l092J18639
18276A82457b97047a40386H9321N189b51284n2755H544J60966K46263i8260C2591
18264B07935a03695j29339E3494a74876g3884E7153J06958d3229j26847r3578
18254b63654A6231R568J6238L8713a30975j88646h4073A25929b16787N4025A12968
18242a93436c5520k58436A16214L8488K33086c40830c6064I0234a50984c3295
18231E4920c49242h9519m9000l0452L7797L8088I7010j7573J11314a89497g676
18219B14759n4827P1615A1430E22a26599b1020B7359J59389F4449d67855J46921
18208c20934b9923A7381c2414A43660L2909d14668a21335A57168a49340K9291
$$ plain form
18198 -120049 -68220 -50122 65935 -24983 -217939 -165885 63790 60240 -78845 -58517 19349
18186 -22277 236709 -46558 64924 126434 -66551 60 -212814 152643 -86420 -106333 -27381 159897
18173 -54628 3435 -266123 207653 25497 -78957 -160937 37510 -181291 -60364 -47702 -202067
18162 -202067 183087 236471 -85800 7115 31071 124169 -68883 124108 -2576 -195862 88727
18150 -373436 -123380 262288 26533 89379 -96558 -82624 192162 154251 110781 -141919 -153912
18139 -153912 -56561 -315554 150507 17656 119426 -114707 -24575 193682 189290 139413 -96919
18127 -144529 55400 184815 -98840 -148432 -80547 64245 -11747 113731 127544 -156603 38052
18115 152913 251373 -19783 160418 218151 -305368 124116 -83543 288399 325187 29848 108537
$$ packed form
18198a20049N1829J8098F5935b4983j92956N2054F3790l550g8845K0328A9349
18186b2277B36709d6558F4924O1510f6551F0b12814A52643h6420j9913b7381A59897
18173e4628C435b66123B07653B5497g8957q1980C7510a81291f0364J2662j54365
18162b02067A83087N3384h5800G115K3956R3098f8883A24108b576j93286H8727
18150c73436a23380B62288B6533O2846i6558J3934A92162l7911m3470a41919j1993
18139a53912e6561k58993A50507A7656J01770a14707b4575A93682m392m9877i6919
18127a44529E5400J29415i8840m9592O7885F4245a1747A13731J3813a56603C8052
18115A52913R8460a9783A60418N7733c05368A24116h3543B88399L6788B9848P8689
$$ plain form
18104 108537 -32829 29529 -114651 969 -346687 -297281 11399 -75381 123854 -242333 20948
18092 140912 122841 -136264 -33763 110782 299842 148083 -284369 42153 190217 -9186
18081 -92398 57808 -149982 17427 164443 179829 73421 -358327 36976 80662 63180 40825
18070 40825 -59171 -296325 106726 19501 -116974 100052 -20926 -113222 299913 -46307 -64545
18059 -64545 -118249 -214702 244450 96791 -40716 132417 -340991 31860 -397733 -120635 -19898
18047 -223380 -28938 -101397 267530 308917 2049 -248727 123026 131637 -118350 -53952 -95807
18036 -95807 119557 158499 -409841 176266 5354 7412 -139462 74473 -141585 -1231 -180766
18025 -180766 -380934 -48684 -463 128832 -129504 9165 -123003 131761 55709 115038 -6994
$$ packed form
18104A08537c2829B9529a14651I69c46687M9406A1399g5381A23854b42333B0948
18092A40912j8071a36264c3763A10782J89060A48083b84369D2153J48064i186
18081i2398E7808a49982A7427J47016J5386G3421c58327C6976M3686j7482k2355
18070D0825e9171k37154A06726A9501a16974A00052b0926r2296B99913d6307j8238
18059f4545n3704r6453B44450I6791d0716A32417c40991C1860c97733a20635a9898
18047b23380b8938p2459B67530M1387B049b48727A23026Q611a18350e3952m1855
18036i5807A19557L8942d09841A76266E354K058a39462G4473a41585a231j79535
18025a80766k00168d8684d63A28832a29504I165a23003A31761E5709N9329f994
$$ plain form
18013 -40478 122277 15572 13836 45727 80973 123048 19936 -506805 -35059 -118001 -42559
18001 364970 55886 262073 243935 275839 99436 -65900 113357 -142561 162546 445262
17991 445262 58106 -981 -38234 -10064 -97068 -235733 -224620 55078 -55400 42433 -1825 1653
17978 -40485 17117 -1542 -320457 49907 152723 25024 -226332 26236 254698 -119075 71360
17966 144102 81608 70121 2808 108796 211387 111576 -134102 -140639 5266 54749 -145973
17954 74443 -140086 -280858 166631 -247495 -207661 -15760 55706 -39403 -12208 100311 199338
17943 199338 51230 -155606 -171162 134046 292755 205990 118326 -66996 139322 -122878
17932 41853 -247666 -271342 137567 76687 234137 -62639 102588 172362 30730 101602 -96976
$$ packed form
18013d0478A22277A5572j736L1891L5246M2075A9936e06805c5059q2942d2559
18001C64970E5886K06187j8138L1904I9436f5900A13357a42561A62546K82716
17991D45262E8106i81l7253a0064q7004j38665J1113E5078e5400D2433a825A653
17978d0485A7117a542l18915D9907J02816B5024b26332B6236K28462a19075G1360
17966A44102o2494j1487B808J05988J02591r9811a34102o537E266M9483a45973
17954G4443a40086j40772A66631b47495L9834a5760E5706c9403a2208A00311R9027
17943A99338E1230a55606j5556A34046J58709q6765q7664f6996A39322a22878
17932D1853b47666k3676A37567o0880J57450f2639A02588O9774C0730P0872i6976
$$ plain form
17920 -124028 147955 130064 -271134 145183 -19297 1910 496 -108459 42157 -87968 164697
17908 -155262 18491 246525 140585 -97094 170288 -18400 -84508 200484 99397 -31847 -230590
17897 -230590 338385 -24207 -57208 191024 97879 212337 3208 -1436 -50195 29007 227143
17886 227143 -13762 44124 13720 74345 -97242 -275144 -109678 104351 3635 118833 -85418
17874 -97908 -61293 -149082 -241306 249687 -243170 268518 218498 290775 -4607 -3424 -10242 -111610
17862 -111610 97938 -6153 155471 149964 -60407 69095 168882 -40303 161984 180098 -13820
17850 44337 23252 -10158 -239934 -66324 274446 -178230 266167 -8794 -123720 87131 -245324
17838 -164698 -281648 26640 -300232 133707 -83267 31350 217289 -25124 256583 -9476 -145838
$$ packed form
17920a24028A47955j7891b71134A45183a9297A910D96a08459D2157h7968A64697
17908a55262A8491K28034j05940i7094A70288a8400o6108B00484I9397c1847j98743
17897b30590C38385b4207l3001A91024r3145J14458C208a436m8759B9007J98136
17886B27143a3762D4124A3720O0625i7242j77902a09678A04351C635J15198h5418
17874i7908L6615q7789r2224B49687b43170B68518n0020P2277d607J183o818j01368
17862a11610I7938f153A55471n507f0407F9095R9787d0303A61984J8114a3820
17850D4337k1085a0158k29776f6324B74446a78230B66167h794j14926H7131b45324
17838a64698j16950B6640c00232A33707h3267C1350J85939b5124B56583i476j36362
$$ plain form
17827 -145838 -172169 22250 67091 -99159 25013 50887 59196 576078 124217 -299383 -97636
17815 80494 -153267 120370 106363 138562 82287 -44200 194552 135478 51550 245279 136128
17804 136128 -69575 217931 -229716 23555 82718 -72692 -183378 -109381 56222 -37106 -167446
17793 -167446 316202 226182 165847 -54651 -75727 -4903 185886 -44934 562840 92570 73800
17782 73800 276161 -35115 -143530 -95358 292433 -14232 -7755 -78904 210844 -81274 -118861
17771 -118861 -282335 -11271 21878 150422 51267 516822 -38590 270984 196346 50738 95812
17760 95812 -92990 141856 -105523 93841 292362 -297585 84978 -45752 -38387 161616 -162531
17748 169504 311210 108760 -443261 41186 227925 87982 -19805 536762 324543 27341
$$ packed form
17827a45838k6331B2250M4841i9159B5013K5874Q309N16882A24217b99383i7636
17815H0494a53267A20370j4007L2199n6275d4200A94552n9074E1550J93729j09151
17804A36128f9575B17931b29716B3555N9163g2692j10686P3997E6222c7106j30340
17793a67446C16202r0020o0335e4651k1076d903A85886d4934E62840I2570j8770
17782G3800K02361c5115j08415M8172B92433a4232O477p1149B10844h1274l7587
17771a18861j63474a1271B1878J28544E1267M65555c8590B70984p4638E0738M5074
17760I5812i2990A41856a05523I3841J98521b97585H4978d5752P365A61616a62531
17748A69504J41706A08760d43261D1186J86739H7982a9805E36762k12219B7341
$$ plain form
17737 -26044 121704 -81109 -8738 269245 -266535 49199 246943 -14747 -98166 109451 84061
17726 84061 -5869 55038 -113670 85680 -92344 -19860 372062 259908 47658 110190 -254691
17714 46561 304291 218967 177296 196409 -43707 110766 -39621 251416 169411 326961 -37163
17702 65452 -45489 -116500 99639 77295 492558 182035 -2022 -160269 -30922 22447 -47662
17690 61055 182557 129399 55233 15495 215073 193411 -48422 322506 188498 312559 367232
17679 367232 -151021 106803 -48823 -86198 125517 16987 45321 25760 261966 361575 436196
17668 436196 -185596 149729 39887 198755 245041 194906 -13861 -20033 -144769 95353 -213294
17656 641812 387316 164780 138867 225941 137010 344593 253023 74959 119355 275763 164117
$$ packed form
17737b6044A21704h1109h738B69245b66535D9199J97744a4747q3419A09451k5390
17726H4061e869E5038a13670H5680i2344a9860C72062j12154D7658O2532b54691
17714D6561K57730q5324m1671J9113d3707A10766c9621B51416q2005J57550c7163
17702F5452d5489p1011I9639k2344M15263A82035b022j58247c0922B2447d7662
17690F1055J21502n3158E5233A5495J99578k1662d8422C22506j34008J24061N4673
17679C67232a51021A06803d8823l7375A25517A6987K8334j9561K36206R9609P4621
17668D36196a85596A49729C9887J58868M6286n0135a3861o172j24736I5353b13294
17656F41812k54496A64780k5913Q7074q8931K07583r1570G4959M4396J56408j11646
$$ plain form
17645 164117 197352 300435 -20394 58536 101412 52244 391147 194762 144784 252702 356864
17634 356864 -15459 103057 -100203 61395 -4034 19528 149253 -137438 2120 -201067 131640
17622 23016 171682 181251 -151536 -39112 89862 36278 432152 237819 -13115 2998 -84204
17610 248724 -67295 -105646 168737 102095 95070 -121093 71121 283308 -92827 405885 -28360
17598 -32470 -111029 256113 96111 225948 -206968 88161 309383 49732 -4176 422946 312103
17587 312103 182599 120561 269509 -63952 255676 116562 89261 -16563 23471 414756
17577 414756 216306 37104 313342 -3135 61747 -78803 -107207 400245 118782 -74874 170374
17565 129167 299659 469118 61816 189207 245754 -5468 125768 185638 121366 470775 132528
$$ packed form
17645A64117L3235J03083b0394E8536M2876m9168L38903A94762m9978J07918J04162
17634C56864a5459A03057a00203F1395d034A9528J29725a37438B120b01067A31640
17622B3016J48666R569a51536c9112H9862C6278L95874j94333a3115B998h4204
17610B48724f7295l8351A68737o6642p025a21093G1121K12187i2827D05885b8360
17598c2470p8559B56113I6111J29837b06968H8161K21222D9732d176D22946j10843
17587C12103j29504o2038J48948f3952B55676A16562k7301a6563B3471L91285
17577D14756j98450C7104K76238c135F1747g8803k8404D00245A18782g4874A70374
17565A29167J70492J69459F1816J27391N6547e468A25768N9870o4272L49409A32528
$$ plain form
17553 -22036 267336 31253 -7849 448713 231737 271685 524059 613353 107778 339487 455335
17542 455335 281812 254691 431064 89194 115588 -94138 47688 197899 473390 145066
17531 108879 537127 297637 536106 139108 790082 817031 1110608 1333757 1230890 1018950
17521 1018950 750082 500590 344381 787671 347585 274481 302929 613142 480136 563750
17511 563750 873296 824733 1396124 1437649 878101 959252 509051 442896 443111 186718 258428
17500 258428 256023 402212 263555 217060 300526 381223 -9389 384115 517346 45239 240570
17489 240570 490272 358007 253867 410679 -66573 290872 599471 496103 369762 286623
17479 286623 306967 139618 231364 441248 268038 266542 -67739 163065 154638 183086 485946
$$ packed form
17553b2036B67336C1253g849D48713k16976L9948K52374Q9294A07778K31709J15848
17542D55335j73523k7121J76373H9194K6394i4138D7688J50211K75491A45066
17531A08879M28248k39490K38469A39108O50974K6949K93577K23149j02867k11940
17521A018950k68868k49492j56209M43290C47585p3104K8448L10213j33006Q3614
17511E63750L09546m8563N71391M1525n59548Q1151m50201o6155K15A86718P1710
17500B58428k405J46189j38657m6495Q3466Q0697i389C84115J33231D5239J95331
17489B40570K49702j32265j04140J56812f6573B90872L08599j03368j26341q3139
17479B86623K0344A39618R1746K09884j73210j496f7739A63065q427K8448L02860
$$ plain form
17468 485946 -122136 264871 196434 216162 254236 319168 326219 276146 420610 -29597 137181
17456 370046 296457 216891 331588 468453 390364 384642 268758 314178 387045 292193 409257
17445 409257 454101 179058 750691 173130 573148 499814 129113 132970 245441 456744
17435 456744 694189 237229 188275 355504 142185 36533 307792 325508 19132 363765
17425 363765 529660 354960 405624 595268 493499 610134 219497 417728 179016 123143
17415 123143 304458 519066 387657 459178 429541 603023 223823 654584 429869 76604
17404 320955 338050 468920 112927 334129 41428 246359 212949 -18872 -37061 -19249 194000
17392 376125 541838 -77795 43390 396095 315861 117519 286437 418599 370006 156043
$$ packed form
17468D85946a22136B64871o8437J9728L8074O4932P051n0073J44464b9597A37181
17456C70046p3589p9566J14697J36865p8089n722j15884M5420P2867r4852J17064
17445D09257M4844A79058N71633A73130M00018p3334A29113L857J12471K11303
17435D56744K37445B37229m8954J67229A42185C6533K71259J7716A9132L44633
17425C63765J65895j74700N0664J89644j01769J16635B19497J98231A79016n5873
17415A23143J81315K14608j31409P1521k9637J73482B23823M30761k24715G6604
17404C20955J7095J30870A12927K21202D1428K04931l3410a8872j8189J7812A94000
17392C76125J65713g7795D3390L52705q0234A17519J68918J32162m8593A56043
$$ plain form
17381 297833 463120 170282 273293 534799 246861 81431 330644 407713 178269 420861
17371 420861 247727 278028 406666 357784 444201 247167 379192 190425 164962 -69754
17360 -31632 292488 15095 7447 351959 172190 181494 168528 272057 115508 519824 67336
17348 430314 191275 208543 417420 18968 277773 529112 247206 263362 377455 334676
17338 334676 182948 333030 63653 345151 153243 341056 188779 197578 388853 258111
17328 258111 375097 134960 129726 383854 69960 318585 7925 548089 250886 224243 464477
17317 464477 238605 171412 446474 522152 36085 235001 370448 471413 157707 299142
17307 299142 174691 480765 356912 635204 560463 423950 60054 360914 250155 475750
$$ packed form
17381B97833J65287A70282J03011K61506B46861H1431K49213P7069A78269K42592
17371D20861j73134L0301J28638m8882Q6417j97034J32025j88767k5463f9754
17360c1632B92488A5095G447L44512A72190R304j2966J03529A15508M04316F7336
17348D30314A91275J7268K08877A8968K58805K51339B47206J6156J14093m2779
17338C34676j51728J50082F3653K81498A53243J87813j52277Q799J91275j30742
17328B58111J16986A34960n234K54128F9960K48625G925N40164B50886k6643K40234
17317D64477k25872o7193K75062P5678C6085J98916J35447J00965A57707J41435
17307B99142j24451L06074j23853K78292p4741j36513F0054L00860j10759K25595
$$ plain form
17297 475750 278666 103838 248677 187503 76833 454776 195218 -159079 461739 166852
17286 138355 23212 298475 117629 551984 453775 95017 587804 -93676 202157 186168
17276 186168 323034 357960 112568 36626 499460 609558 53982 404280 302483 302712 257004
17265 257004 350332 212101 232513 422013 337660 586987 379957 385324 421125 398661 141133
17253 108791 315757 446510 210151 213792 438373 291190 271229 217641 385136 35952
17242 443720 339849 172212 108601 364143 238622 596535 410517 425326 441786 422807
17232 422807 552204 260214 108740 161310 491465 230177 61221 396207 397448 346577
17222 346577 391807 274293 313968 104586 576601 -10247 492589 526293 555980 508495 417291
$$ packed form
17297D75750j97084A03838J44839o1174G6833L77943A95218a59079D61739A66852
17286A38355B3212K75263A17629M34355r8209I5017M92787i3676B02157j5989
17276A86168J36866L4926A12568C6626M62834J10098E3982L50298j01797K29m5708
17265B57004R3328j38231K0412J89500q4353K49327k07030N367L5801k2464A41133
17253A08791K06966J30753B10151L641K24581j47183j9961n3588J67495C5952
17242D43720j03871j67637o3611K55542j25521L57913j86018J4809J6460j8979
17232D22807J29397B60214A08740N2570L30155B30177F1221L34986J241n0871
17222C46577M5230j17514L9675A04586M72015a0247D92589L3704K9687m7485r1204
$$ plain form
17211 417291 485516 562349 121316 421501 515928 574269 289502 429452 273092 464112
17201 464112 230992 407465 245837 35817 518529 294038 409731 430680 653666 484192
17191 484192 593670 667482 445456 496429 461794 309717 498410 693467 732898 248951
17180 791093 476183 589209 680912 275833 269847 312483 899415 339464 561289 123376
17169 529137 679835 445128 615597 505933 766299 760230 434443 641903 391849 464200
17159 464200 486067 566957 903289 581506 1010534 554793 375400 420790 754769 679177
17149 679177 916564 512851 559693 601267 574155 578404 583821 472221 625256 573686 639768
17138 639768 547068 163161 877755 569460 632449 605738 863769 648244 404865 536141
$$ packed form
17211D17291O8225P6833A21316L00185R4427N8341k84767J39950j56360J91020
17201D64112B30992J76473j61628C5817M82712k24491J15693K0949K22986j69474
17191D84192J09478P3812k22026N0973l4635j52077J88693J95057L9431B48951
17180G91093l14910J13026R1703B75833n986M2636N86932C39464K21825A23376
17169E29137J50698k34707J70469j09664K60366o069l25787K07460k50054P2351
17159D64200K1867Q0890L36332l21783M29028m55741j79393M5390L33979p5592
17149F79177K37387m03713M6842M1574k7112M249N417j11600J53035n1570O6082
17138F39768r2700A63161P14594l08295O2989k6711K58031k15525k43379J31276
$$ plain form
17128 536141 490216 611895 493286 256398 484143 504133 582007 484175 826774 886191
17118 886191 452739 659073 693517 824239 744214 546166 673340 362010 856846 530294
17108 530294 688832 683645 690144 684028 744862 338788 930339 619670 850952 656375 542673
17097 542673 404375 357748 611220 597721 849063 552075 786001 880413 1061383 759262
17087 759262 838768 1254118 678369 550473 939159 873505 781708 786745 496152 950928
17077 950928 795183 1084450 841456 962208 930334 615086 620707 796233 539919 738646
17067 738646 759440 748087 860815 874154 978660 572640 815688 502580 852895 1000705
17057 1000705 844457 1087622 947971 1114520 852079 961401 897677 642448 825840 1037587
$$ packed form
17128E36141m5925J21679j18609k36888K27745J9990P7874r7832L42599N9417
17118H86191m33452K06334L4444J30722q0025j98048J27174l11330M94836l26552
17108E30294J58538n187O499o116O0834C38788N91551l10669K31282j94577j13702
17097E42673j38298m6627K53472j3499K51342k96988K33926R4412J80970l02121
17087G59262P9506M15350n75749j27896L88686o5654r1797N037k90593M54776
17077I50928j55745K89267k42994J20752l1874l15248N621J75526k56314J98727
17067G38646K0794j1353J12728J3339J04506m06020K43048l13108L50315J47810
17057A000705j56248K43165j39651J66549k62441J09322o3724k55229J83392K11747
$$ plain form
17047 1037587 855333 859067 987276 1142657 1054003 1160158 970729 670689 813882 876589
17037 876589 1005412 780841 1235313 802928 682624 947880 925343 1069913 814680 961981
17027 961981 947869 1079292 1182624 1107648 895155 1031804 1084156 1328434 627910 636055
17017 636055 938218 879261 1293621 1180707 1184242 1274278 1083617 1113294 1320281 1249208 1150782
17006 1150782 1215331 1415451 955306 1067651 1239353 1418527 1115812 1269661 1094755 1401651
16996 1401651 1331993 1329993 1758788 1079710 1440501 1548157 1317619 1550394 1209916 1294802
16986 1294802 1368874 1241630 1539867 1399018 1557938 1231276 1330023 1446288 1314782 1737394
16976 1737394 1860198 1370690 1478036 1390939 1582806 1699196 1622229 1395082 1364410 1567752
$$ packed form
17047A037587j82254L734J28209J55381q8654J06155j89429l00040J43193O2707
17037H76589J28823k24571M54472m32385j20304K65256k2537J44570k55233J47301
17027I61981j4112J31423J03332p4976k12493J36649N2352K44278F27910Q145
17017F36055L02163n8957M14360j12914L535R0036j90661K9677K06987p1073r8426
17006A150782O4549K00120m60145J12345J71702J79174l02715J53849j74906L06896
16996A401651o9658k000M28795o79078L60791J07656k30538K32775l40478Q4886
16986A294802P4072j27244K98237j40849J58920l26662R8747J16265j31506M22612
16976A737394J22804m89508J07346q7097J91867J16390p6967k27147l0672K03342
$$ plain form
16966 1567752 1652396 1627139 1637981 1554229 1331136 1599139 1501628 1414662 1753755 1857731
16956 1857731 1817651 2057272 1885383 1867635 1801699 1719920 1835129 1837239 1829598 1649328 1876922
16945 1876922 1884414 1980480 1983432 1910169 2350589 1758489 2042833 2188663 2154444 2050679 2092392
16934 2092392 2227826 2082000 2000925 2053100 2062741 2315592 2051279 2075498 2384150 2455115
16924 2455115 2225781 2330697 2490806 2126530 2458446 2410222 2331335 2659208 2350793 2413393
16914 2413393 2475822 2707669 2871353 2487827 2772291 2446082 2764162 2882996 2643561 2746074
16904 2746074 2935609 2795619 2891378 2758285 2861928 3163576 3001240 2926449 2944263 3133366
16894 3133366 3198570 3431123 3128523 3131548 3371724 3542367 3058387 3300700 3426897 3359011
$$ packed form
16966A567752Q4644k5257J0842q3752k23093K68003r7511q6966L39093J03976
16956A857731m0080K39621j71889j7748o5936q1779J15209K110p641j80270K27594
16945A876922P492R6066K952p3263M40420n92100K84344J45830l4219j03765M1713
16934B092392J35434j45826q1075N2175R641K52851k64313K4219L08652P0965
16924B455115k29334J04916J60109l64276L31916m8224p8887L27873l08415O2600
16914B413393O2429K31847J63684l83526K84464l26209L18080J18834k39435J02513
16904B746074J89535j39990R5759j33093J03643L01648j62336p4791J7814J89103
16894C133366O5204K32553l02600L025K40176J70643m83980K42313J26197o7886
$$ plain form
16884 3359011 3238948 3625284 3563664 3573814 3923215 4079119 3422849 4037108 3804135 3666763
16874 3666763 4107026 4227438 3794138 4277111 4247470 4047990 4320513 4033885 4606956 4493083
16864 4493083 4638842 4712262 4295061 4573865 5028956 4749396 4874711 5064137 5104937 4989428
16854 4989428 5125086 5267551 5117790 5189823 5316367 5721987 5274100 5509499 5490434 5713092
16844 5713092 6058014 6144457 6053500 6403842 6354089 6334529 6664089 6579476 6557230 7132581
16834 7132581 7136052 6919049 6964683 7472693 7452381 7525589 7633301 7849685 8075802 8011773
16824 8011773 8626606 8342221 8482517 8673409 8983696 9018506 9443216 9243070 9653928 9687038
16814 9687038 10166159 10216720 10165935 10260189 10895911 10826936 10840078 11433988 11491691 11727463
$$ packed form
16884C359011j20063L86336o1620J0150L49401J55904o56270O14259k32973j37372
16874C666763M40263J20412m33300M82973k9641j99480K72523k86628N73071j13873
16864D493083J45759P3420m17201K78804M55091k79560J25315J89426M0800j15509
16854D989428J35658J42465j49761P2033J26544M05620m47887K35399j9065K22658
16844E713092L44922Q6443r0957L50342m9753j9560L29560q4613k2246N75351
16834G132581L471k17003M5634N08010k0312P3208J07712K16384K26117o4029
16824H011773O14833k84385J40296J90892L10287L4810M24710k00146M10858L3110
16814I687038M79121N0561n0785R4254O35722o8975J3142N93910N7703K35772
$$ plain form
16804 11727463 12188517 12201353 12475137 13023761 13129345 13538878 13886116 14051479 14476261
16795 14476261 14772351 15128256 15582231 15923929 16357524 16585106 17104542 17676095 18160940
16786 18160940 18177536 18947878 19369643 19811401 20289585 20743881 21860484 22007090 22530431
16777 22530431 23044325 24000583 24496231 25255329 25504364 26769414 27621514 28599013 29374704
16768 29374704 30108352 31148800 32056425 33345811 33826559 35227720 36441745 37345333 38720378
16759 38720378 39765637 41445538 42388249 44084114 45640352 46948593 48538210 50265119
16751 50265119 51574689 53662276 55278595 56972638 59150543 61157608 63140226 65358343
16743 65358343 67005176 69635541 71751178 73827451 76067057 78376669 80325684 83098538
$$ packed form
16804A1727463M61054J2836K73784N48624J05584M09533L47238J65363M24782
16795A4476261K96090L55905M53975L41698M33595K27582N19436N71553M84845
16786A8160940J6596P70342M21765M41758M78184M54296J116603J46606N23341
16777B2530431N13894R56258M95648P59098K49035J265050Q52100R77499P75691
16768B9374704P33648J040448R07625J289386M80748J401161J214025R03588J375045
16759C8720378J045259J679901R42711J695865J556238J308241J589617J726909
16751E0265119J309570K087587J616319J694043K177905K007065J982618K218117
16743F5358343J646833K630365K115637K076273K239606K309612J949015K772854
$$ plain form
16735 83098538 85000135 87689294 89260612 91401602 93306231 95415342 96774488 98173863
16727 98173863 99977581 101519051 102324418 102992184 103542339 104120186 104395874 104327326 104305279
16718 104305279 103920680 103004086 102248660 101061350 99673745 97938206 96351094 94781720
16710 94781720 93067061 90821991 88843460 86729105 84102148 82192914 80198182 77704603
16702 77704603 75156672 72948440 71188385 68732929 66454436 64222818 62014765 59949490
16694 59949490 58115365 56251142 54162672 52544973 50848140 49096411 47451100 45876151
16686 45876151 44353879 43017134 41342273 40100940 38904669 37843904 36274392 35502874
16678 35502874 34283384 33089062 32285687 31102563 30125305 29056687 28328509 27495010 26618555
$$ packed form
16735H3098538J901597K689159J571318K140990J904629K109111J359146J399375
16727I8173863J803718J541470Q05367O67766N50155N77847K75688o8548k2047
16718A04305279l84599r16594p55426j187310j387605j735539j587112j569374
16710I4781720j714659k245070j978531k114355k626957j909234j994732k493579
16702G7704603k547931k208232j760055k455456k278493k231618k208053k065275
16694E9949490j834125j864223k088470j617699j696833j751729j645311j574949
16686D5876151j522272j336745j674861j241333j196271j060765j569512p71518
16678C5502874j219490j194322q03375j183124r77258j068618p28178q33499q76455
$$ plain form
16669 26618555 25952552 25008492 24414563 23661380 23208199 22525790 22127087 21137759 20703462
16660 20703462 20502699 20006089 19130960 18777623 18154581 17641926 17111773 16470602 16560536
16651 16560536 16146344 15466632 15383965 14787504 14607445 13921961 14000406 13388580 13318685 13015841
16641 13015841 12756077 12661782 12281457 12088032 11962486 11482448 11184738 10967638 10888779 10230397
16631 10230397 10144185 9822142 9771605 9466185 9581288 9107035 9134644 8800379 8828077 8494331
16621 8494331 8022109 8371902 8057109 8144592 7786152 7780567 7548458 7271535 7459594 7136416
16611 7136416 7050326 6836610 6906126 6636529 6693012 6419687 6433497 6191475 6379870 6180632
16601 6180632 5725525 6025781 5648903 5694696 5704747 5466983 5267155 5579992 5393340 5190594
$$ packed form
16669B6618555o66003r44060n93929p53183m53181o82409l98703r89328m34297
16660B0703462k00763m96610q75129l53337o23042n12655n30153o41171Q9934
16651A6560536m14192o79712q2667n96461j80059o85484P8445o11826o9895l02844
16641A3015841k59764r4295l80325j93425j25546m80038k97710k17100p8859o58382
16631A0230397q6212l22043n0537l05420J15103m74253K7609l34265K7698l33746
16621H494331m72222L49793l14793Q7483l58440n585k32109k76923J88059l23178
16611G136416q6090k13716O9516k69597N6483k73325J3810k42022J88395j99238
16601F180632m55107L00256l76878M5793J0051k37764j99828L12837j86652k02746
$$ plain form
16591 5190594 5129764 5004418 4863724 4919957 4962206 5018981 5227552 4682704 4453403 4525465
16581 4525465 4628121 4091079 4606725 4437041 4365504 4148323 4252710 3727375 3982062 3853161
16571 3853161 3693759 3908123 3688824 3617082 3441916 3351902 4065767 3637300 3335911 3377291
16561 3377291 3438742 3695354 3489823 3235982 3364116 2908366 3222900 3182665 3098741 3360645
16551 3360645 2960600 3080122 2985512 3080053 2800178 2818757 2551112 2700291 2620535 2572089
16541 2572089 2811786 2659215 2980631 2528258 2596946 2421191 2519287 2412668 2537138 2658190
16531 2658190 2271577 2461272 2059166 2124193 2252480 2311160 2072031 2109453 2432366 2442169
16521 2442169 1977554 2053215 2037757 2261015 1890414 2255405 1917480 1904075 1878032 1991931
$$ packed form
16591E190594o0830j25346j40694N6233M2249N6775K08571n44848k29301P2062
16581D525465J02656n37042N15646j69684p1537k17181J04387n25335K54687j28901
16571C853161j59402K14364k19299p1742j75166r0014P13865m28467l01389M1380
16561C377291O1451K56612k05531k53841J28134m55750L14534m0235q3924K61904
16551C360645m00045J19522r4610R4541k79875J8579k67645J49179p9756m8446
16541B572089K39697j52571L21416m52373O8688j75755R8096j06619J24470J21052
16531B658190l86613J89695m02106O5027J28287N8680k39129L7422L22913R803
16521B442169m64615P5661j5458K23258l70601L64991l37925j3405k6043J13899
$$ plain form
16511 1991931 1607851 1822322 1640024 2181904 2101650 2175539 2015473 2246196 1961902 1919405
16501 1919405 1507503 1810132 1793255 1692740 2381459 1662650 1804996 1633854 1900222 1561540
16491 1561540 1911904 1719246 1533210 1591161 1536208 1693307 1834825 1931245 1474817 1191218
16481 1191218 1622885 1535607 1625967 1548428 1627729 1699000 1520133 1141453 1528081 1117492
16471 1117492 1154547 1421574 1255876 1317886 1685987 1761589 1588441 1222193 1729299 1051254
16461 1051254 1120551 1537269 1284846 1199754 1025644 1297064 1591779 1101879 1456968 1207788
16451 1207788 1325766 1624797 1220047 1164204 1190401 1162583 1241346 1320860 1139961 1216854
16441 1216854 1106237 1422103 1246442 1192781 1261579 1053056 1053081 1181721 1069075 887344
$$ packed form
16511A991931l84080K14471j82298N41880q0254P3889j60066K30723k84294m2497
16501A919405m11902L02629j6877j00515O88719p18809J42346j71142K66368l38682
16491A561540L50364j92658j86036N7951n4953J57099J41518R6420m56428k83599
16481A191218M31667q7278R0360p7539P9301P1271j78867l78680L86628m10589
16471A117492L7055K67027j65698O2010L68101P5602j73148l66248N07106o78045
16461A051254O9297M16718k52423q5092j74110K71420K94715m89900L55089k49180
16451A207788J17978K99031m04750n5843K6197k7818P8763P9514j80899P6893
16441A216854j10617L15866j75661n3661O8798k08523K5J28640j12646j81731
$$ plain form
16431 887344 1347273 1077685 929397 1025576 1179012 878097 767034 1098255 764570 682848
16421 682848 735787 899089 743600 1058597 804399 915571 941470 1255753 614116 1039602
16411 1039602 817394 840312 1022508 1230955 1043544 896958 1147104 969252 821831 855014
16401 855014 571200 893064 1158350 924033 1046710 642573 859637 661882 730068 499145
16391 499145 694326 673314 744576 690368 839480 810697 498040 732468 383097 622465
16381 622465 747524 686522 608714 727218 802457 849241 460665 531287 786330 522267
16371 522267 475539 586284 588044 424972 824398 668208 673671 553136 651527 508383 482851
16360 482851 1010079 439188 749320 641443 515333 685180 758216 469417 445816 462619
$$ packed form
16431H87344M59929k69588j48288R6179J53436l00915j11063L31221l33685q1722
16421F82848N2939J63302j55489L14997k54198J11172K5899L14283F14116M25486
16411A039602k22208K2918J82196K08447j87411j46586K50146j77852j47421L3183
16401H55014k83814L21864K65286k34317J22677m04137K17064j97755O8186k30923
16391D99145J95181k1012P1262n4208J49112k8783l12657K34428l49371K39368
16381F22465J25059o1002p7808J18504P5239M6784l88576P0622K55043k64063
16371E22267m6728J10745J760j63072L99426j56190N463j20535R8391j43144k5532
16360D82851N27228D39188L10132j07877j26110J69847P3036k88799k3601J6803
$$ plain form
16350 462619 672281 514351 646462 472236 647105 711555 794499 344448 613734 247050
16339 399763 775254 926537 456945 913282 469818 415874 562001 791729 566011 352323
16329 352323 712978 747646 569420 432916 225986 539371 558141 844023 680223 701781
16319 701781 534991 206368 550907 597282 416861 492160 544522 491546 433113 274248
16309 274248 312744 553861 165537 466083 431433 496036 425236 246518 278559 332127 390730
16298 390730 373673 430701 556055 364684 156592 414788 337728 497392 344724 441396
16288 441396 148203 787312 304831 613566 312170 493233 569168 607901 587757 178786
16277 121046 316772 436936 254366 301105 328756 445002 460901 284496 313327 419792
$$ packed form
16350D62619K09662j57930J32111j74226J74869O4450Q2944C44448K69286B47050
16339C99763L75491J51283D56945M56337m43464n3944J46127K29728k25718k13688
16329C52323L60655L4668j78226j36504k06930L13385J8770K85882j63800K1558
16319G01781j66790B06368L44539M6375j80421P5299N2362n2976n8433j58865
16309B74248L8496K41117A65537L00546l4650O4603p0800j78718L2041N3568N8603
16298C90730j7057N7028J25354j91371A56592K58196p7060J59664j52668R6672
16288D41396A48203O39109C04831L08735l01396J81063P5935L8733k0144A78786
16277A21046J95726J20164j82570M6739K7651J16246J5899j76405K8831J06465
$$ plain form
16267 419792 385033 83922 518662 437530 271830 340739 258580 216063 389275 552092 214078
16255 517198 419157 303541 292384 257136 235494 99027 567366 85958 285844 436249 242696
16244 242696 673681 362198 238484 250072 305228 128710 342233 411059 447345 341014
16234 341014 576042 155271 378326 699838 349428 284519 278774 531113 334975 268065
16224 268065 306405 481215 329805 274882 136391 244713 169192 501671 399664 37202
16213 383070 550706 246590 519022 386552 19363 312085 -5920 324071 344266 120911
16202 213295 49086 470956 163942 406817 517843 204763 179115 86277 172770 424118
16192 424118 19357 250537 157456 203741 493280 335902 117934 266904 392882 19786
$$ packed form
16267D19792l4759H3922M34740q1132j65700O8909q2159m2517J73212J62817B14078
16255E17198r8041j15616j1157l5248k1642I9027M68339H5958J99886J50405j93553
16244B42696M30985l11483j23714J1588N5156A28710K13523O8826L6286j06331
16234C41014K35028A55271K23055L21512C49428o4909n745K52339j96138o6910
16224B68065L8340J74810j51410n4923A36391J08322p5521L32479j02007C7202
16213C83070J67636B46590K72432j32470A9363K92722e920C24071K0195A20911
16202B13295D9086M21870A63942K42875J11026B04763k5648H6277Q6493K51348
16192D24118A9357K31180r3081M6285K89539j57378A17934J48970J25978A9786
$$ plain form
16181 -87568 345367 -204809 200836 432344 551870 77940 312030 79885 194527 192509
16171 192509 326408 188539 499073 280055 -133490 29239 342679 187085 92064 771075
16161 771075 70151 93206 241567 -25598 145485 -13209 274004 119192 -73672 322742
16150 181801 -164521 350519 469316 182425 288854 -54469 143041 77682 171447 34920
16139 79307 122929 361277 395853 4817 40095 78650 139336 -100029 158313 98107 66016
16128 66016 275611 223218 264062 142899 233994 7644 268283 327983 -478584 274163 170310
16117 170310 346162 80267 -137675 192751 130169 104776 218339 179968 179878 238233 133845
16106 133845 167985 178288 343921 178620 228365 335032 -17694 158727 115291 -134728
$$ packed form
16181h7568C45367b04809B00836K31508J19526G7940K34090G9885J14642k018
16171A92509J33899j37869L10534k19018a33490B9239L13440j55594I2064O79011
16161G71075G0151K3055J48361b5598A45485a3209B74004A19192g3672C22742
16150A81801a64521C50519J18797A82425J06429e4469A43041o5359R3765C4920
16139G9307M3622K38348L4576D817L5278L8555O0686a00029A58313o0206l2091
16128F6016K09595n2393M0844j21163R1095G644K60639N9700d78584B74163j03853
16117A70310J75852H0267a37675A92751o2582k5393J13563l8371r0N8355j04388
16106A33845L4140J0303J65633j65301M9745J06667a7694A58727m3436a34728
$$ plain form
16095 -190237 -50988 192474 -244424 -19341 296957 207895 63224 -104 -134526 96648 454908
16084 454908 -94004 35030 10176 161658 -38749 -290405 125383 262271 -149358 -300546
16074 -300546 312473 248256 117758 324956 171069 369633 206696 185866 243252 37793
16063 186067 27562 112477 -138949 -271835 -267296 -307059 -162487 -97581 -11031 -42649 198335
16051 25311 428376 -5734 -115276 155144 113856 -182297 118138 204619 172926 91478 226549
16040 226549 37283 277640 -148408 -85594 91793 -70367 34906 395314 31935 207496 -274546
16028 -38189 173293 6605 -45108 -142080 -209300 102449 -45634 181613 139559 40793 -263745
16016 263667 -20272 -99037 -284922 295329 133612 273742 -23273 99920 120467 231902
$$ packed form
16095a90237e0988A92474b44424a9341B96957q9062F3224a04j34422I6648L58260
16084D54908i4004C5030A0176J51482c8749k51656A25383J36888a49358j51188
16074c00546C12473o4217A17758K07198j53887J98564j62937k0830N7386C7793
16063A86067B7562Q4915a38949j32886M539l9763J44572O4906a1031l1618A98335
16051B5311M03065e734j09542A55144m1288a82297A18138Q6481l1693q1448J35071
16040B26549C7283K40357a48408O2814I1793g0367C4906L60408C1935J75561b74546
16028c8189A73293F605d5108r6972o7220A02449d5634A81613m2054D0793b63745
16016B63667b0272p8765j85885B95329A33612J40130b3273I9920K0547J11435
$$ plain form
16006 231902 -169254 1741 140049 178769 -47139 202725 105912 18548 -34335 -83968 236868
15994 -99019 77087 316314 -129797 89233 157210 320547 489916 441603 1061005 1164457
15984 1164457 1365937 1263580 971611 807270 332960 532362 411110 274954 262088 372086
15974 372086 37365 -54816 -51475 341860 212832 -151278 112918 -245999 46233 4137 -166179
15962 -215717 130150 191709 -79516 40197 -172297 106304 -195015 212637 -181597 338651
15951 179161 -48897 -149926 -64685 275961 65016 313029 99364 87600 -195101 -139139 16057
15939 126835 -210930 -268760 -20978 70896 27469 -181885 -2642 -931 33095 11875 -40287 196654
15926 -177131 202760 -16817 31328 -130551 -230860 210759 -46145 -192725 -140175 -112540
$$ packed form
16006B31902a69254A741J38308L8720d7139B02725r6813A8548c4335m9633B36868
15994i9019G7087K39227a29797H9233O7977J63337J69369m8313O19402J03452
15984A164457K01480j02357k91969j64341C32960J99402j21252j36156j2866J09998
15974C72086C7365e4816L341C41860j29028a51278A12918b45999D6233D137a66179
15962b15717A30150O1559g9516D0197a72297A06304a95015B12637a81597C38651
15951A79161d8897j01029f4685B75961F5016K48013I9364j1764a95101N5962A6057
15939A26835b10930n7830b0978G0896B7469a81885b642i31C3095A1875d0287A96654
15926a77131B02760a6817C1328a30551j00309B10759d6145j46580N2550K7635
$$ plain form
15916 -112540 208432 104768 1331 94943 -92951 34287 161541 -7239 -25789 298994 102456
15904 -165690 -222437 98967 108135 167556 -401939 -58205 -134807 292629 -323425 236588 111683
15892 -65415 -375374 270652 -53499 33749 111471 336838 -352007 47428 10553 -253429 -117730
15880 226035 -2694 308123 35396 370412 -218096 101322 -85580 5952 3550 -274160 -179116
15869 -179116 260733 10980 272554 89150 -83937 -139898 102692 57124 92917 -45954 -63658
15858 -63658 -48160 28368 -49466 -24597 337520 95929 151849 -304865 108629 -88550 -99875
15847 -99875 266604 447 -4325 168851 -281248 -48218 -14433 153483 -25478 139253 -91504
15835 -57050 -307202 -133566 129458 -31238 -18098 -30993 -119367 116897 89960 -180207 385431
$$ packed form
15916a12540B08432j03664A331R3612i2951C4287J27254g239j8550B98994A02456
15904a65690n6747I8967R168N9421d01939e8205p6602B92629c23425B36588A11683
15892f5415l09959B70652e3499C3749P7722K25367c52007D7428A0553b53429a17730
15880B26035b694C08123C5396L35016b18096A01322h5580E952k402b74160R5044
15869a79116B60733A0980K61574H9150h3937n5961A02692m5568L5793d5954j7704
15858f3658J5498B8368d9466b4597C37520I5929N5920c04865A08629h8550j1325
15847i9875B66604D47d325A68851b81248d8218a4433A53483b5478A39253i1504
15835e7050k50152a33566A29458c1238J3140j2895q8374A16897k6937a80207C85431
$$ plain form
15823 -163709 266428 -129670 40831 60873 -52054 36804 -32522 -8190 565 178884 -99721
15811 -1359 -126817 374414 -233559 -139172 -74941 257606 -187951 -53095 -159608 -203530 117127
15799 -16603 -123089 322508 -162862 221015 -8314 154045 92674 134921 153296 299972 -103263
15787 -106448 -6978 62142 120458 96164 -88647 -258505 65374 71472 154093 -345551 -126002
15775 24193 113684 -7597 -82141 -12417 -47595 -242496 253984 -45685 -300968 -340465 -230026
15764 -230026 -71586 -106054 -109461 176453 3766 -97104 246446 75097 233556 -6137 -39862
15753 -39862 263320 18781 -77250 -78985 -128110 329716 -74834 -70923 -103083 240340 79946
15741 -57450 -112674 48163 -75904 -188244 -386705 -427702 -325767 191202 283627 -49473 271930
$$ packed form
15823a63709B66428a29670D0831K0042e2054C6804c2522h190E65J78319i9721
15811a359j25458C74414b33559R4387O4231B57606a87951e3095j06513m3922A17127
15799a6603j06486C22508a62862B21015h314A54045o1371M2247J8375J46676a03263
15787a06448f978F2142N8316k4294h8647j69858F5374O098Q2621c45551a26002
15775B4193Q9491g597p4544a2417l5178j94901B53984d5685k55283l9497J10439
15764b30026g1586l4468l407A76453C766i7104B46446G5097J58459f137l3725
15753c9862B63320A8781g7250j735m9125C29716g4834L911l2160B40340G9946
15741e7450n5224D8163g5904j12340j98461m0997J01935A91202R2425d9473B71930
$$ plain form
15729 -20874 -50834 -145560 52902 -446624 -233627 -71631 -21067 -42988 -345681 131665 336952
15718 336952 -399507 -175531 -150561 -6922 110724 -230184 20695 -259955 113664 210980
15708 210980 14345 37936 78533 -7026 -33882 11667 -39817 -315501 116563 145307 24623
15696 19232 -100022 -176400 33234 -136040 -191682 -38739 13767 -60850 118146 -406594 -119122
15684 -227298 -107144 -150938 -397286 -15416 39217 210469 119975 -107104 -79757 25538 -17981
15672 -14619 -21816 -23054 8904 -286987 -194065 -215655 -124766 17652 29054 -407011 -52693 -95619
15660 -95619 276109 298869 -207282 -49025 -133815 115256 -94772 -244920 19044 45128 -107737
15648 -98397 -336366 -141533 -189852 -164774 -70891 65196 -223925 -2013 182879 -355305 132168
$$ packed form
15729b0874k9960r4726E2902d46624K12997g1631b1067k1921l02693A31665K05287
15718C36952c99507a75531K4970f922A10724b30184B0695b59955A13664R7316
15708B10980A4345K3591M0597g026k6856A1667c9817k75684A16563K8744B4623
15696A9232a00022p6378C3234a36040n5642c8739A3767f0850A18146d06594a19122
15684b27298a07144m3794k46348a5416C9217J71252r0494a07104K7347B5538a7981
15672a4619p197j238H904b86987R2922k1590R0889A7652J1402d07011e2693m2926
15660i5619B76109K2760b07282d9025q4790A15256i4772j50148A9044K6084a07737
15648i8397k37969a41533m8319K5078g0891F5196b23925b013A82879c55305A32168
$$ plain form
15636 -71745 -146609 180981 -38818 93382 35681 36318 -54651 46915 -112490 50563 33853 192183
15624 192183 6065 -167742 131032 185251 -365949 97527 5247 -91254 16018 -115409 -444414
15613 -444414 -118970 143251 -100520 -328641 240475 251348 -188011 77513 233588 -194241
15602 42352 119918 245975 -217330 -169129 -464003 246117 -158294 -76278 -149212 31028 104741
15591 104741 -171609 55782 66224 113449 282265 8175 -4317 -20999 -250892 74421 -257594
15579 79035 66306 199382 -217979 -122440 -57226 -80077 71766 -202652 148344 109634 -22899
15567 317943 -188554 280103 -409880 188902 55250 221652 153328 172505 98252 -179321
15556 139723 194920 69417 -63671 48788 158151 193339 -156297 56359 -15121 47225 -11231
$$ packed form
15636g1745p4864A80981c8818I3382C5681O37e4651D6915a12490E0563j6710J58330
15624A92183F065a67742A31032N4219c65949I7527E247i1254A6018a15409l29005
15613d44414a18970A43251a00520k28121B40475J0873a88011G7513J56075a94241
15602D2352P7566J26057b17330M8201k94874B46117a58294g6278p2934C1028P3713
15591A04741a71609E5782J0442M7225J68816H175d317j6682k29893G4421b57594
15579G9035j2729J33076b17979R5539e7226k2851G1766b02652A48344l8710b2899
15567C17943a88554B80103d09880A88902E5250J66402o8324J9177p4253a79321
15556A39723N5197F9417f3671D8788J09363L5188a56297E6359a5121D7225a1231
$$ plain form
15544 -251583 -184981 345437 -268903 13042 135958 -224940 301463 195561 -130344 161823
15533 104373 183621 -57827 -84291 -45195 -57458 110433 31964 -87355 325383 79461 -53999
15521 84168 -24618 386669 -44806 427197 138585 390007 316531 655286 369514 -118521
15510 172383 267733 291260 347680 182777 -5224 265949 49256 -188517 31671 264926 267446
15499 267446 233553 -9315 54405 246621 -260957 53208 340990 273277 112032 77970 -2468
15487 27513 -45165 64754 -303613 35948 292573 -203964 -50918 71944 369640 415790 26752
15475 288987 573217 732396 788340 750489 470505 300448 -24966 53654 153360 -81958 -8390
15463 -131044 544614 124416 -182649 152138 -224882 -195517 209378 105043 204168 149519
$$ packed form
15544b51583O6602C45437b68903A3042J22916b24940C01463j05902a30344A61823
15533A04373P9248e7827k6464L9096j2263A10433C1964h7355C25383G9461e3999
15521H4168b4618C86669d4806D27197A38585K51422p3476L38755k85772a18521
15510A72383R5350K3527N6420j64903e224B65949D9256a88517C1671K33255K520
15499B67446l3893i315E4405J92216b60957E3208K87782o7713A12032l4062b468
15487B7513d5165F4754c03613C5948K56625b03964e0918G1944K97696M6150B6752
15475B88987K84230J59179N5944l7851k79984j70057b4966E3654R9706h1958h390
15463a31044E44614A24416a82649A52138b24882K9365B09378j04335R9125n4649
$$ plain form
15453 149519 16505 -68841 -61145 35675 121680 -264668 22376 279763 103206 591839 740177
15442 740177 1023089 1629871 1520152 834964 172454 329135 31176 -83127 37949 387836
15432 387836 -211110 265306 -46813 197407 132978 66148 351634 34285 -131086 -39360
15421 166887 21787 -83184 85934 209122 339510 25219 220069 -33596 -223633 -112516
15411 -112516 191876 58296 5722 215661 -191807 66981 304615 28730 -187370 250289
15400 125685 -58535 -266336 234696 -141576 116975 41451 289012 201248 275079 127727
15389 53581 -71450 -58384 325703 -191361 61015 -11338 -170824 -375947 49125 226847 -44503
15377 -400206 85015 -26449 176256 182420 368297 306898 582111 158709 -66269 173292 277053
$$ packed form
15453A49519A6505f8841P696C5675Q6005b64668B2376K57387A03206M88633J48338
15442G40177K82912O06782j09719o85188A72454J56681C1176h3127C7949L49887
15432C87836b11110B65306d6813A97407o4429F6148K85486C4285a31086c9360
15421A66887B1787h3184H5934J23188J30388B5219J94850c3596j90037J11117
15411a12516A91876E8296E722K09939a91807F6981K37634B8730a87370B50289
15400A25685e8535k07801B34696a41576A16975D1451K47561q7764P3831A27727
15389E3581g1450J3066C25703a91361F1015a1338j59486k05123D9125J77722d4503
15377d00206H5015b6449A76256O164J85877o1399K75213A58709f6269A73292J03761
$$ plain form
15366 277053 229065 292731 65393 38237 57968 313896 144994 257236 85598 11723 452393
15355 452393 165928 -2057 260962 -49230 -84750 11628 126539 263602 -34458 59010 313983
15344 313983 242026 295927 535228 421291 178494 415781 301543 149430 369992 346739
15334 346739 -118209 -248054 -4655 221116 405426 101687 236873 71746 83315 351514
15324 351514 245414 83581 155765 101586 600712 268283 31249 53642 404708 353473 124517
15312 240429 286995 13005 282343 272264 174347 300772 -82958 90343 121752 77078 -7365
15300 -1409 314442 28408 115208 161996 -1426 -306750 119505 -178910 78034 114912 178006
15289 178006 -322247 -111115 332425 53848 73131 -136820 69054 30443 68710 218573
$$ packed form
15366B77053m7988O3666F5393k7156J9731K55928A44994J12242H5598A1723M40670
15355D52393A65928b057B60962d9230l5520A1628J14911J37063c4458E9010K54973
15344C13983p1957N3901K39301j13937A78494K37287j14238A49430K20562k3253
15334C46739a18209j29845d655B21116J84310A01687J35186G1746J1569K68199
15324C51514j06100H3581P2184n4179M99126B68283C1249K2393L51066n1235A24517
15312B40429M6566A3005K69338j0079r7917J26425h2958I0343L1409m4674g365
15300a409C14442B8408Q6800M6788a426l05324A19505a78910G8034L6878O3094
15289A78006c22247a11115C32425E3848J9283a36820F9054C0443L8267J49863
$$ plain form
15279 218573 -40140 207475 -407885 30835 252518 -26804 -127239 -272720 -23988 413943
15268 394652 49445 141816 245199 88913 -80945 299841 116038 175940 -129495 333341
15257 -89527 350622 -8016 108405 309581 145179 70271 426296 -112984 17967 -56537 232852
15245 181444 274510 119375 317504 472942 1185389 2185986 1298270 1892292 1513717 783291
15235 783291 -10052 -132461 172186 303118 165831 44225 340409 -135397 134094 -32415
15224 -196539 178861 197778 45213 -217589 -86118 -32740 175331 121655 123923 9456 157082
15213 157082 -83270 410551 54608 109201 95111 184431 74187 86285 -116611 93377 10633
15201 243346 -44010 213208 100888 197597 78256 250954 88086 175206 -6098 177967 -8227
$$ packed form
15279B18573d0140B07475d07885C0835K21683b6804j00435j45481b3988D13943
15268C94652D9445R2371J03383H8913h0945B99841A16038N9902a29495C33341
15257h9527C50622h016A08405K01176A45179G0271L56025a12984A7967e6537B32852
15245A81444R3066A19375J98129J55438P12447J000597q87716N94022l78575p30426
15235G83291a0052j22409A72186J30932j37287D4225K96184a35397A34094c2415
15224a96539A78861J8917D5213b17589h6118c2740A75331n3676K268I456J47626
15213A57082h3270D10551E4608N4593j4090Q9320G4187J2098a16611I3377A0633
15201B43346d4010B13208A00888R6709G8256J72698H8086Q7120f098A77967h227
$$ plain form
15189 224264 88553 68596 346287 60376 -350841 413447 230509 -24236 -43731 347383
15178 135148 -37843 21120 -184 -10378 87899 160810 61939 230508 55191 -202431 304218
15166 -110568 -18332 178125 -206409 -89798 -76173 -191014 70844 177024 93956 525095
15156 525095 287947 122112 -12272 96104 383503 -106676 42154 -218571 68302 479791
15146 479791 304547 16643 72668 213595 153147 231602 108880 -25477 181335 3708 -154979
15134 -178729 -59834 203680 230794 156270 34133 76248 -61118 218068 -146978 36003 90287
15123 90287 186263 -22918 341306 207164 245438 485737 627609 186463 27818 169612
15113 169612 -158086 309978 179781 228155 -64656 43995 186855 197009 -221042 354814
$$ packed form
15189B24264H8553j9957K77691F0376c50841D13447j82938b4236j9495C47383
15178A35148c7843B1120a84j0194H7899P2911F1939J68569E5191b02431C04218
15166a10568a8332A78125b06409h9798J3625j14841G0844J06180q3068M31139
15156E25095k37148A22112a2272I6104K87399a06676D2154b18571F8302M11489
15146D79791j75244A6643N6025J40927o0448P8455A08880b5477A81335C708a54979
15134a78729e9834B03680K7114p4524C4133M2115f1118B18068a46978C6003N4284
15123I0287R5976b2918C41306j34142L8274K40299J41872A86463B7818J41794
15113A69612a58086C09978j30197M8374f4656D3995J42860J0154b21042C54814
$$ plain form
15102 -23045 133408 111384 237757 12054 -107633 86664 238887 267173 113131 -89966 33285
15090 200561 -9403 245771 99528 -209452 89980 362381 -98341 136924 453268 -35140 19358
15078 14835 -139407 219105 -52401 254878 106274 63188 -55074 67880 317090 189336
15068 189336 -184197 38475 -10209 352470 378978 154991 198066 210356 322167 107846
15057 217014 395100 736235 103706 259151 339670 250243 242906 228064 251136 512275 188471
15045 279680 589374 413483 272010 422128 563861 62408 350043 431529 247577 223577
15035 223577 253427 839571 417889 751160 602633 859278 555668 722879 627643 863324
15025 863324 530377 446273 414701 303571 769690 718693 490479 311123 727260 507618
$$ packed form
15102b3045A33408k2024J26373A2054a07633H6664J52223K8286A13131h9966C3285
15090B00561i403B45771I9528b09452H9980K72401i8341A36924L16344c5140A9358
15078A4835a39407B19105e2401B54878A06274m3086e5074F7880K49210j27754
15068A89336a84197C8475a0209C52470K6508A54991M3075J2290J11811A07846
15057B17014J78086L41135A03706J55445Q0519q9427p337j4842K3072K61139A88471
15045B79680L09694j75891j41473J50118J41733F2408K87635Q1486j83952k4000
15035B23577K9850N86144D17889L33271j48527K56645l03610J67211r5236K35681
15025H63324l32947q4104l1572j11130M66119n0997k28214j79356M16137k19642
$$ plain form
15015 507618 567606 363974 106449 640859 429126 411814 330842 547583 82374 434065
15005 434065 343510 646877 176744 222847 367705 127943 428050 394831 560789 599893
14995 599893 413602 287088 -62425 633924 496862 542211 632368 461170 505286 633928
14985 633928 674546 590781 566442 905644 971948 1046081 810881 789122 406729 369839 341324
14974 341324 808291 603161 826179 568900 564827 593291 736463 383760 608206 615704
14964 615704 397389 322780 388382 487800 307278 411165 360328 437024 331544 469447
14954 469447 317709 677866 238132 380229 451436 188901 599982 435483 222505 666551
14944 666551 590154 509459 677323 510363 648660 523859 485909 654085 528809 439336
$$ packed form
15015E07618N9988k03632A06449N34410k11733j7312q0972K16741H2374L51691
15005D34065r0555L03367A76744M6103J44858A27943L00107l3219J65958L9104
14995E99893j86291j26514f2425F33924j37062M5349R0157j71198M4116J28642
14985F33928M0618q3765k4339L39202O6304P4133k35200k1759l82393l6890k8515
14974C41324M66967k05130K23018k57279m073K8464J43172l52703K24446P498
14964F15704k18315p4609O5602R9418j80522J03887n0837P6696j05480J37903
14954D69447j51738L60157B38132J42097P1207A88901M11081j64499k12978M44046
14944F66551p6397q0695J67864j66960J38297j24801l7950J68176j25276q9473
$$ plain form
14934 439336 507120 606085 880360 1349947 879641 1654396 1686699 1678154 2025484 1869332
14924 1869332 1948213 1733843 2018187 1681063 1621154 2168353 2478681 2738600 2646550 1899133
14914 1899133 1791737 1309797 1597776 1204946 654374 458668 422672 239072 381918 447257
14904 447257 299186 361468 464506 624887 380243 250973 430788 301673 228699 404213
14894 404213 230838 331478 696235 702774 670085 623421 768857 744359 775956 917070 773731
14883 773731 873737 1085476 993277 956475 813390 843998 746337 347043 474686 477314 340157
14872 340157 343776 432247 667161 628140 678795 796150 943771 753703 1118446 796339
14862 796339 696157 217335 452747 560594 294812 421378 252316 746965 446872 641175
$$ packed form
14934D39336O7784R8965K74275M69587m70306P74755L2303q545L47330j56152
14924A869332P8881k14370K84344l37124n9909N47199L10328K59919r2050p47417
14914A899133j07396m81940K87979l92830n50572j95706l5996j83600J42846O5339
14904D47257j48071O2282J03038J60381k44644j29270J79815j29115p2974J75514
14894D04213j73375J00640L64757O539l2689m6664J45436k4498L1597J41114j43339
14883G73731J00006K11739r2199l6802j43085L0608r7661C47043J27643K628j37157
14872C40157L619Q8471K34914l9021N0655J17355J47621j90068L64743l22107
14862G96339j00182B17335K35412J07847k65782J26566j69062M94649l00093J94303
$$ plain form
14852 641175 859446 518490 501755 552057 571417 769637 1109896 1161927 1039820 1419178
14842 1419178 1270197 1149128 1179137 662753 1057690 877947 1018736 870069 653361 534488
14832 534488 555975 197424 494116 457636 644040 350995 706853 373808 847699 430339
14822 430339 533145 548076 840545 822370 927128 906684 721768 899212 521457 549782
14812 549782 788035 809797 611869 368336 732628 805583 890804 1042159 855052 968013
14802 968013 740078 488613 407742 410122 377703 500617 264768 466763 733749 131469
14791 257992 597657 522681 837269 713894 929639 461883 520726 486338 622543 312169
14781 312169 525878 417061 718188 892842 1132613 1067281 710663 787804 668364 710061
$$ packed form
14852F41175K18271l40956j6735N0302J9360J98220L40259N2031j22107L79358
14842A419178j48981j21069L0009n16384L94937j79743J40789j48667k16708j18873
14832E34488K1487A97424K96692l6480J86404k93045L55858l33045M73891m17360
14822D30339J02806J4931K92469j8175J04758k0444j84916J77444l77755K8325
14812E49782K38253K1762j97928k43533L64292P2955Q5221J51355j87107J12961
14802I68013k27935k51465q0871K380l2419J22914k35849K01995K66986A31469
14791B57992L39665p4976L14588j23375K15745D61883N8843l4388J36205l10374
14781C12169K13709j08817L01127J74654K39771o5332l56618P7141j19440M1697
$$ plain form
14771 710061 803611 829841 435876 607396 754378 386506 643937 364349 547720 403690
14761 403690 552709 597227 482534 680559 541950 559065 740943 745292 156966 704519
14751 704519 470740 713020 805466 819089 544332 713258 604169 586263 317397 352935
14741 352935 621222 701837 717434 518363 423702 559544 558954 558051 1004130 1356447 1480766
14730 1480766 1395823 1486424 1938961 2294348 1995911 1333277 982527 1487473 1048221 1047197
14720 1047197 536895 1066637 915917 824959 991560 682623 783331 885195 946440 929179
14710 929179 697848 966969 727870 1041296 774772 1224271 1572127 1725465 2038576 2211938
14700 2211938 1612356 1839045 1446160 945344 982198 813224 838930 904846 1076905 912130
$$ packed form
14771G10061R3550K6230l93965J71520J46982l67872K57431k79588J83371j44030
14761D03690J49019M4518j14693J98025j38609J7115J81878M349A56966N47553
14751G04519k33779K42280R2446J3623k74757J68926j09089j7906k68866L5538
14741C52935K68287Q0615J5597j99071r4661J35842n90r03M46079L52317J24319
14730A480766q4943R0601M52537L55387k98437o62634l50750N04946m39252j024
14720A047197n10302N29742j50720r0958J66601l08937J00708J01864O1245j7261
14710I29179k31331K69121k39099L13426k66524M49499L47856J53338L13111J73362
14700B211938n99582K26689l92885n00816L6854j68974K5706O5916J72059j64775
$$ plain form
14690 912130 842385 1050270 971840 852515 691881 1005552 670442 700074 1003507 893545
14680 893545 846023 1145501 826783 910298 802137 726628 1108141 766091 891146 641074
14670 641074 756959 639640 452940 529013 950774 965858 727234 656377 744981 740637 876170
14659 876170 714344 931193 1155150 1156347 1200874 1310451 1355253 1372267 1385251 1289313 1003084
14648 1003084 751825 1122052 972681 1008422 1229287 1037001 1161407 1168651 880416 1309355
14638 1309355 1133570 1125571 1131889 1266124 1181795 1284885 1126589 1049916 1183379 807165
14628 807165 912037 755283 971011 1120146 1078290 1326012 1252678 1211016 1464511 1394215
14618 1394215 1222514 1037625 1550091 1572661 1253966 939563 1424485 1033402 1158757 1099179
$$ packed form
14690I12130o9745K07885p8430j19325j60634L13671l35110K9632L03433j09962
14680H93545m7522K99478l18718Q3515j08161p5509L81513l42050J25055k50072
14670F41074J15885j17319j86700P6073M21761J5084k38624p0857Q8604m344J35533
14659H76170j61826K16849K23957J197M4527J09577M4802J7014J2984r5938k86229
14648A003084k51259L70227j49371L5741K20865j92286J24406P244k88235M28939
14638A309355j75785p999O318J34235q4329J03090j58296p6673J33463l76214
14628H07165J04872j56754K15728J49135m1856K47722p3334m1662K53495p0296
14618A394215j71701j84889N12466K2570l18695l14403M84922l91083J25355n9578
$$ plain form
14608 1099179 1254998 1030452 1094627 1303591 1207319 1298200 1587380 1285743 1364253 1348091
14598 1348091 1301439 1563422 1569486 1716920 1516206 1581707 1607311 1653229 1466858 1659740
14588 1659740 1328288 1350718 1589578 1373811 1566822 1620826 1351516 1452163 1658132 1620276
14578 1620276 1665355 1839372 1757827 1770179 1962844 1625962 1760530 1980698 1667013 1476150
14568 1476150 1846859 1958432 1921899 2140693 2004339 2063789 2120246 2244884 2304995 1986599
14558 1986599 2472815 2448964 2749237 2714082 2750346 3345404 3539304 3757222 4934786 6714575
14548 6714575 9443477 16556619 35287594 46739722 20608658 7348869 3521570 2412078
14540 2412078 2135877 2256127 2462525 2892377 5605416 3878915 2477887 1472567 1285993
$$ packed form
14608A099179J55819k24546O4175K08964r6272R0881K89180l01637P8510j6162
14598A348091m6652K61983O064J47434k00714O5501K5604M5918j86371J92882
14588A659740l31452K2430K38860k15767J93011N4004k69310J00647K05969l7856
14578A620276M5079J74017q1545J2352J92665l36882J34568K20168l13685j90863
14568A476150L70709J11573l6533K18794j36354N9450N6457J24638O0111l18396
14558A986599M86216k3851L00273l5155L6264N95058J93900K17918J177564J779789
14548F714575K728902P113142J8730975J1452128B0608658G348869C521570j109492
14540B412078k76201J20250K06398M29852K713039j726501j401028j005320j86574
$$ plain form
14531 1285993 1784744 1663640 1998859 2096779 1989149 1953266 1736409 2054224 2028382 2014430
14521 2014430 2426767 1933710 2360692 2238373 1900469 2189019 2404978 2001748 2330596
14512 2330596 2182630 2191886 2295000 2315277 2424969 2688825 2563152 2369698 2718872 2539967
14502 2539967 2651041 2808792 2352169 2820796 2467237 2680053 2518327 2866092 2778498 2973655
14492 2973655 3160703 3234666 2888423 3247518 3054426 3090465 3323544 3048452 3385368 3174557
14482 3174557 3109961 3380021 3565411 3038337 3374383 3182381 3263259 3314585 3675106 3726893
14472 3726893 3853128 3628802 3670478 3623991 3455240 3837639 3842280 3968189 3887767 3525292
14462 3525292 3977333 4178232 3971147 4034121 4336516 4310805 4338887 4365045 4319792 4470493
$$ packed form
14531A285993M98751j21104L35219R7920j07630l5883k16857L17815k5842j3952
14521B014430M12337m93057M26982j22319l37904K88550K15959m03230L28848
14512B330596j47966R256J03114K0277J09692K63856j25673j93454L49174j78905
14502B539967J11074J57751m56623M68627l53559K12816j61726L47765q7594J95157
14492B973655J87048P3963l46243L59095j93092L6039K33079k75092L36916k10811
14482C174557o4596K70060J85390n27074L36046j92002Q0878N1326L60521N1787
14472C726893J26235k24326M1676m6487j68751L82399M641J25909q0422l62475
14462C525292M52041K00899k07085O2974L02395k5711K8082K6158m5253J50701
$$ plain form
14452 4470493 4686222 4652258 4952340 4703549 4845383 4785586 4961948 4811832 4465667 5074346
14442 5074346 5101920 5378750 5274488 5363894 5503961 5160843 5413238 5368453 5689188 5775331
14432 5775331 5912833 5916335 6151796 6093040 6279503 6148447 6334632 6352349 6563290 6903567
14422 6903567 7199705 7190768 7152257 7153597 7169585 7290257 7493336 7322241 7552986 7524504 7770892
14411 7770892 7736177 7902932 8120351 8611942 8597337 8761041 8646185 9044128 8843111 9005027
14401 9005027 9323034 8954426 9122382 9144973 9304579 9807953 9667646 10143268 10169526 10233919
14391 10233919 10504511 10606941 11321949 10942430 11206988 11712195 11857526 12331970 12492657
14382 12492657 12891624 12814058 13086606 12725854 13343295 13533144 13636912 13823444 14343092
$$ packed form
14452D470493K15729l3964L00082k48791J41834n9797J76362j50116l46165O08679
14442E074346K7574K76830j04262Q9406J40067l43118K52395m4785L20735Q6143
14432E775331J37502L502K35461n8756J86463j31056J86185J7717K10941L40277
14422F903567K96138q937l8511J340J5988J20672K03079j71095K30745k8482K46388
14411G770892l4715J66755K17419M91591j4605J63704j14856L97943k01017J61916
14401I005027L18007l68608J67956K2591J59606N03374j40307M75622K6258O4393
14391A0233919K70592J02430P15008l79519K64558N05207J45331M74444J60687
14382A2492657L98967p7566K72548l60752O17441J89849J03768J86532N19648
$$ plain form
14373 14343092 14346164 14730251 14885947 15352135 16395006 16283482 16644713 16962385 17169171
14364 17169171 17416849 17870251 17996572 18852891 18685879 19203315 19841310 20206037 20664678
14355 20664678 21193210 21550942 22272240 22507176 23100782 23674236 24361813 24613951 25505526
14346 25505526 26181209 26929316 27704159 28358649 29411804 29946965 30970094 31646172 32190832
14337 32190832 33321632 34461059 35262479 36506968 37130663 38441583 39729111 40978098
14329 40978098 42404903 43913357 45470376 46657438 48318208 49974582 51451228 54041461
14321 54041461 55302780 57427253 59954663 61632271 63735120 66027127 68996823 71256397
14313 71256397 74047095 77156682 80632387 84314861 87579857 91925584 95948522 100251160
$$ packed form
14373A4343092L072L84087J55696M66188J042871j11524L61231L17672K06786
14364A7169171K47678M53402J26321Q56319j67012N17436O37995L64727M58641
14355B0664678N28532L57732P21298K34936N93606N73454O87577K52138Q91575
14346B5505526O75683P48107P74843O54490J053155N35161J023129O76078N44660
14337C2190832J130800J139427Q01420J244489O23695J310920J287528J248987
14329D0978098J426805J508454J557019J187062J660770J656374J476646K590233
14321E4041461J261319K124473K527410J677608K102849K292007K969696K259574
14313G1256397K790698L109587L475705L682474L264996M345727M022938M302638
$$ plain form
14305 100251160 104379535 109445561 114397207 119865504 125605190 132022615 138905858 145941671
14297 145941671 153494150 161468145 170039610 179171362 188716959 198864897 209751602 221048364
14289 221048364 233374321 246328088 259581503 273738505 288513276 304074847 319426260
14282 319426260 335575260 352120326 368397406 384320345 400292211 415430066 429469708
14275 429469708 441763475 449855452 454041880 457638779 459615742 461352330 461582652 456132168
14267 456132168 453612132 446362817 436001189 423885362 409850384 395053736 379724532
14260 379724532 363363242 346485256 329643051 312896206 296991878 281177015 266575477
14253 266575477 252282102 238764130 225892219 213712262 202381135 191233834 182353344
$$ packed form
14305A00251160M128375N066026M951646N468297N739686O417425O883243P035813
14297A45941671P552479P973995Q571465R131752R545597J0147938J0886705J1296762
14289B21048364J2325957J2953767J3253415J4157002J4774771J5561571J5351413
14282C19426260J6149000J6545066J6277080J5922939J5971866J5137855J4039642
14275D29469708J2293767Q091977M186428L596899J976963J736588K30322n450484
14267D56132168k520036p249315j0361628j2115827j4034978j4796648j5329204
14260C79724532j6361290j6877986j6842205j6746845j5904328j5814863j4601538
14253B66575477j4293375j3517972j2871911j2179957j1331127j1147301q880490
$$ plain form
14246 182353344 174092665 164676633 156806147 149131728 141520381 134472951 127823902 121852040
14238 121852040 116522827 111760190 106293949 101395678 96979935 92705697 88769690 85386627
14230 85386627 82204811 78207543 75102506 72203487 69807742 66894574 64279613 62006008
14222 62006008 59676807 57862561 55872562 53871518 52032175 49864779 48553596 47024847
14214 47024847 45558908 44396478 43118403 41594377 40330358 38749678 37825951 37243581
14206 37243581 36296994 35220073 33798009 32973006 31821081 31064450 30729396 29849743 28683891
14197 28683891 27757364 27243360 26708173 26196900 25521147 24889121 24112882 23250263 22890735
14188 22890735 22639450 21693567 21403851 20926276 20634451 20199757 19355231 18936552 18578811
$$ packed form
14246A82353344q260679r416032p870486p674419p611347p047430o649049n971862
14238A21852040n329213m762637n466241m898271m415743m274238l936007l383063
14230H5386627l181816l997268l105037k899019k395745k913168k614961k273605
14222F2006008k329201j814246j989999k001044j839343k167396j311183j528749
14214D7024847j465939j162430j278075j524026j264019j580680r23727n82370
14206C7243581r46587j076921j422064q25003j151925p56631l35054q79653j165852
14197B8683891r26527n14004n35187n11273o75753o32026p76239q62619l59528
14188B2890735k51285r45883k89716m77575k91825m34694q44526m18679l57741
$$ plain form
14179 18578811 18330538 17692670 17482664 17274622 16425338 16747853 16201921 15987296 15519653
14170 15519653 15256981 14838646 14176610 14387305 14341639 13851284 13749259 13100670 13291959
14161 13291959 12860856 12464244 12464802 12401074 11356565 12037987 11523327 11235194 11304515 10990772
14151 10990772 10694844 10987208 10770436 10267175 10438650 10058619 9901067 9827740 9461424
14142 9461424 9181736 9337950 9109788 9382029 8606715 8572619 8625697 8793759 8437456 7992584
14132 7992584 7883102 7986283 7960673 7673037 7609985 7599549 7673828 7244283 7167560 7094744
14122 7094744 7121198 6884044 6919601 7145479 6617476 6580092 6646805 6513078 6417050 6512001
14112 6512001 6104490 6423802 5849726 5768250 6183962 5885918 5614392 5384593 5675902 5581129
$$ packed form
14179A8578811k48273o37868k10006k08042q49284L22515n45932k14625m67643
14170A5519653k62672m18335o62036K10695m5666m90355j02025o48589J91289
14161A3291959m31103l96612N58o3728j044509O81422n14660k88133O9321l13743
14151A0990772k95928K92364k16772n03261J71475l80031j57552p3327l66316
14142I461424k79688J56214k28162K72241p75314l4096N3078J68062l56303m44872
14132G992584j09482J03181k5610k87636o3052j0436P4279m29545p6723p2816
14122G094744K6454k37154L5557K25878n28003l7384O6713j33727r6028R4951
14112F512001m07511L19312n74076q1476M15712k98044k71526k29799K91309r4773
$$ plain form
14102 5581129 5174669 5474655 5556250 5406105 5018408 4881311 5043940 4892287 5184407 4742264
14092 4742264 4837059 4822593 4810245 4694796 4618106 4728777 4400729 4666713 4532869 4373314
14082 4373314 4251486 4199891 4387885 4350205 4333194 4342320 3936519 4223374 4045028 3963594
14072 3963594 4278750 4099191 3805293 3615994 3766747 3795018 3446079 4114898 3893177 3780117
14062 3780117 3786257 3779009 3661272 3616764 3355407 3440107 3494662 3200874 3016824 3117556 3270102
14051 3270102 3295982 3291177 2814923 2991732 2986647 2920710 2979586 3167532 2975278 2818213 2744684
14040 2744684 2607391 2672007 2617803 2774261 2769114 2659234 2408546 2570061 2682248 2671070
14030 2671070 2550493 2909153 2814048 2365898 2669409 2366805 2663098 2080502 2455081 2206239
$$ packed form
14102E581129m06460K99986Q1595j50145l87697j37097J62629j51653K92120m42143
14092D742264R4795j4466j2348j15449p6690J10671l28048K65984j33844j59555
14082D373314j21828n1595J87994l7680j7011R126m05801K86855j78346q1434
14072C963594L15156j79559k93898j89299J50753K8271l48939O68819k21721j13060
14062C780117O140p248j17737m4508k61357Q4700N4555k93788j84050J00732J52546
14051C270102K5880m805m76254J76809n085o5937N8876J87946j92254j57065p3529
14040B744684j37293O4616n4204J56458n147j09880k50688J61515J12187j1178
14030B671070j20577L58660r5105m48150L03511l02604K96293n82596L74579k48842
$$ plain form
14020 2206239 2267179 2404037 2253901 1947174 2107446 2233480 1931441 2224852 2179448 2178255
14010 2178255 2300176 1768623 2141589 1970073 1979341 1794130 2002196 2138043 1537598 2053102
14000 2053102 1878302 1746160 1995727 1649122 2087156 1655070 1808919 1547807 1840856
13991 1840856 1988885 2179068 3520289 5165911 9727140 25406386 49437491 28519582
13983 28519582 13143959 7174338 5125054 4407594 3198638 3046523 2724962 2829807
13975 2829807 2639367 2344867 2537633 2344767 2009665 2345762 1979885 1882683 1884773 1911538
13965 1911538 2159366 2259991 2306327 2114541 1680117 2224743 1953086 2033082 1785775 1896275
13955 1896275 1532279 1725143 1591354 1560128 1740845 1757413 1983747 1371543 1526869 1809549
$$ packed form
14020B206239O0940J36858j50136l06727J60272J26034l02039K93411m5404j193
14010B178255J21921n31553L72966j71516R268j85211K08066J35847o00445N15504
14000B053102j74800j32142K49567l46605M38034m32086J53849k61112K93049
13991A840856J48029J90183J341221J645622M561229J5679246K4031105k0917909
13983B8519582A3143959n969621k049284p17460j208956j52115l21561J04845
13975B829807j90440k94500J92766j92866l35102L36097l65877r7202K090K6765
13965A911538K47828J00625M6336j91786m34424N44626k71657P9996k47307J10500
13955A896275l63996J92864j33789l1226J80717J6568K26334o12204J55326K82680
$$ plain form
13945 1809549 1483653 1895846 1301873 1564308 1703205 1811765 1345942 1813860 1465132
13936 1465132 1487388 1281992 1730810 1439408 1629712 1578714 1247184 1475905 1422832 1395412
13926 1395412 1151472 1243787 1575399 1159219 1589250 989531 1326222 993429 1442645 1336736
13916 1336736 1197185 1291146 1494964 1143057 1296973 996966 1014427 973429 1303219 1356176
13906 1356176 1236168 1252792 985749 1013969 1102255 1232221 1106408 1299236 1296474 1079241
13896 1079241 1145872 855906 1216097 1217108 1079629 1125086 1115364 1314316 1275733 1189327 1072802
13885 1072802 1011667 1183844 898273 1235656 900357 1000986 1258769 1424137 1243006 1017788
13875 1017788 889757 1558528 1063752 1246489 1067558 992627 1023484 1040015 949399 1189053
$$ packed form
13945A809549l25896M12193n93973K62435J38897J08560m65823M67918l48728
13936A465132K2256k05396M48818k91402J90304n0998l31530K28721n3073k7420
13926A395412k43940R2315L31612m16180M30031n99719L36691l32793M49216j05909
13916A336736j39551R3961K03818l51907J53916l00007J7461m0998L29790N2957
13906A356176j20008J6624k67043K8220Q8286J29966j25813J92828k762k17233
13896A079241O6631k89966L60191J011j37479M5457r722J98952l8583q6406j16525
13885A072802o1135J72177k85571L37383l35299J00629K57783J65368j81131k25218
13875A017788j28031O68771m94776J82737j78931p4931L0857J6531r0616K39654
$$ plain form
13865 1189053 855076 1027496 819720 999717 733460 889410 916630 1171291 827259 692191
13855 692191 760130 1179863 847413 978283 866451 887290 931945 918410 860472 736253
13845 736253 862609 604342 929160 896014 1020084 766303 705576 766018 806930 806985 948252
13834 948252 1173086 546383 687313 1010604 964132 762458 947777 791788 747132 888518
13824 888518 809139 707941 515906 832427 874523 747162 947608 941627 626118 548068
13814 548068 1146263 676848 757127 1183209 673031 816011 628515 520180 539528 444349
13804 444349 822292 874305 686138 640447 631860 1008648 581034 845800 707864 571466
13794 571466 536425 873050 838886 542517 668230 729759 468331 785113 740930 723064
$$ packed form
13865A189053l33977J72420k07776J79997k66257J55950K7220K54661l44032j35068
13855F92191O7939M19733l32450J30870j11832K0839M4655j3535n7938j24219
13845G36253J26356k58267L24818l3146J24070k53781o0727O0442M0912N5J41267
13834I48252K24834E46383J40930L23291m6472k01674J85319j55989m4656J41386
13824H88518p9379j01198j92035L16521M2096j27361K00446n981l15509p8050
13814E48068N98195m69415Q0279M26082n10178J42980j87496j08335J9348r5179
13804D44349L77943N2013j88167m5691q587L76788m27614K64766j37936j36398
13794E71466l5041L36625l4164k96369J25713O1529k61428L16782m4183j7866
$$ plain form
13784 723064 703113 407618 928131 637207 561302 446238 588134 862408 523802 476356
13774 476356 605052 617530 433427 406921 721025 545835 724354 630860 281639 416601
13764 416601 639395 722698 587026 589215 585145 661562 533723 688780 745631 441519 536801
13753 536801 478179 488950 244036 400918 807841 314061 608642 924669 354160 464775
13743 464775 454833 3628 796583 319777 330063 769679 1016803 766160 406779 398929 517240
13732 517240 495710 423603 225393 432368 564749 444211 422073 555377 576299 669881
13722 669881 553085 373063 602661 467823 275250 153930 692095 360359 361854 674696
13712 674696 20393 128484 646538 361451 203745 714723 712899 138842 385658 410066
$$ packed form
13784G23064j9951k95495N20513k90924p5905j15064J41896K74274l38606m7446
13774D76356J28696J2478j84103k6506L14104j75190J78519r3494B81639J34962
13764D16601K22794Q3303j35672K189m070P6417j27839J55057N6851l04112R5282
13753E36801n8622J0771B44036J56882M06923C14061K94581L16027C54160J10615
13743D64775r942C628P92955C19777J0286M39616K47124k50643l59381p850J18311
13732E17240k1530p2107j98210K06975J32381j20538k2138J33304K0922R3582
13722F69881j16796j80022K29598j34838j92573j21320N38165l31736J495L12842
13712F74696B0393J08091N18054k85087j57706N10978j824A38842K46816K4408
$$ plain form
13702 410066 278816 371389 606211 883451 400065 277373 484749 420345 316821 535680
13692 535680 131706 231318 444512 334451 459417 638262 295674 495721 518527 592257
13682 592257 431933 440958 235150 610226 222717 711850 581066 246273 742951 623042
13672 623042 472473 404216 83334 379148 291078 334672 527935 325273 366887 317568 323822
13661 323822 455273 389010 732019 501701 572080 243585 143609 137318 512152 159315
13650 285338 377502 88539 285815 663376 225243 324611 129063 183842 472314 333889
13640 333889 345579 759729 473286 241454 391919 191638 593940 143242 354888 487369
13630 487369 324723 670428 408319 191405 336565 304667 263821 109564 126553 1075790
$$ packed form
13702D10066j31250R2573K34822K77240D00065j22692K07376o4404j03524K18859
13692E35680A31706R9612K13194j10061J24966J78845B95674K00047K2806P3730
13682E92257j60324R025k05808L75076B22717M89133j30784B46273M96678j19909
13672F23042j50569o8257H3334K95814q8070M3594J93263k02662M1614m9319O254
13661C23822J31451o6263L43009k30318P0379B43585r9976o291L74834A59315
13650B85338R2164H8539J97276L77561B25243R9368A29063N4779K88472j38425
13640C33889J1690M14150k86443k31832J50465A91638M02302A43242K11646J32481
13630D87369j62646L45705k62109A91405J45160l1898m0846A09564J6989R49237
$$ plain form
13620 1075790 113550 251529 312533 -144691 336690 78745 85271 213177 398198 -159835
13609 271656 414348 517729 572933 448475 150217 188369 257526 357975 47425 434843
13599 434843 260328 226371 356906 426195 199207 294487 205551 318009 499025 -134125
13588 162195 443687 341456 353999 502263 15187 371213 -3582 335060 441067 190229
13577 239022 255156 250534 485533 259733 310798 427722 282661 330413 360953 -98735 466742
13565 312239 538890 544640 329472 349286 84085 216885 258842 229126 139951 233806 374952
13554 374952 291352 89690 188857 452220 141705 202133 72105 182817 259225 165169 307034
13543 307034 66968 116766 247647 240448 272680 182285 261011 341759 48086 69889 735358
$$ packed form
13620A075790A13550J37979O1004a44691C36690G8745O526J27906J85021a59835
13609B71656J42692J03381N5204j24458A50217L8152O9157J00449D7425L87418
13599D34843j74515l3957J30535O9289A99207R5280q8936J12458J81016a34125
13588A62195K81492j02231J2543J48264A5187L56026c582C35060J06007A90229
13577B39022J6134m622K34999k25800N1065J16924j45061M7752L0540i8735D66742
13565C12239K26651N750k15168J9814H4085J32800M1957k9716q9175R3855J41146
13554C74952q3600H9690R9167K63363A41705O0428G2105J10712P6408r4056J41865
13543C07034F6968M9798J30881p199L2232r0395P8726Q0748D8086K1803O65469
$$ plain form
13532 735358 465238 50049 238293 106189 478805 282177 465677 298274 172654 -69189
13521 151562 76045 123012 100948 287723 44938 62039 272488 202560 268788 401063 -3809
13509 178731 461184 473995 179017 291597 219472 110938 198116 105540 125900 399928
13499 399928 388665 225310 278085 448051 329403 144974 231680 247670 327400 110982
13488 -923 -53444 169204 -277725 228655 54193 127333 -47682 220046 174739 235671 252640
13477 252640 -7816 430084 1767 291741 125070 121849 185558 20238 21963 213793 92294
13465 321275 191878 -73755 281351 131050 478890 132798 154992 71261 46737 339976
13455 339976 334242 -529 187791 305655 316048 62876 569250 -48612 160094 173895 170236
$$ packed form
13532G35358k70120E0049J88244A06189L72616j96628J83500j67403j25620f9189
13521A51562p5517M6967k2064J86775D4938J7101K10449o9928O6228J32275c809
13509A78731K82453J2811A79017J12580p2125j08534Q7178r2576K0360K74028
13499C99928j1263j63355N2775J69966j18648A44974Q6706J5990P9730A10982
13488i23n2521A69204b77725B28655E4193P3140d7682B20046m5307O0932J6969
13477B52640g816D30084A767K89974A25070l221O3709B0238J725J91830I2294
13465C21275j29397g3755B81351A31050L47840A32798K2194G1261k4524K93239
13455C39976n734e29A87791J17864J0393F2876N06374d8612A60094J3801l659
$$ plain form
13444 170236 266829 36429 491450 264745 127361 -80110 13199 391606 180362 243411
13434 243411 187747 107495 157791 -97153 387411 275164 257166 -20543 -50908 146969 170616
13423 170616 666725 -50343 180751 336642 138067 144555 226896 74613 189363 178038 5374
13411 -35614 106731 -186127 177627 225838 230273 -4005 171723 76155 111536 -89587 47859
13399 87768 205199 186748 256998 266096 340181 108720 164222 22631 426093 256704 131109
13388 131109 27915 100858 401084 222549 140860 -57464 154619 467964 -109930 -755 120784
13376 327595 -199784 139456 217533 65758 82002 -97542 194898 97441 27125 29862 126543
13365 126543 139117 48865 114774 298362 44963 423070 -2382 113428 262040 221705 194283
$$ packed form
13444A70236R6593C6429M55021k26705A27361h0110A3199L78407A80362O3049
13434B43411n5664q0252N0296i7153C87411j12247j7998b0543l0365A46969K3647
13423A70616M96109e0343A80751J55891A38067O488Q2341G4613J14750j1325E374
13411c5614A06731a86127A77627M8211M435d005A71723G6155L5381h9587D7859
13399H7768J17431j8451P0250R098P4085A08720N5502B2631M03462j69389j25595
13388A31109B7915P2943L00226j78535q1689e7464A54619L13345a09930g55A20784
13376C27595a99784A39456P8077F5758J6244i7542A94898I7441B7125K737R6681
13365A26543J2574D8865O5909J83588D4963L78107b382A13428J48612m0335k7422
$$ plain form
13354 194283 35728 236353 229262 133066 177227 -6389 349518 259235 381575 545958 480877
13343 480877 68726 237534 -9219 438200 97620 394357 423372 -100725 229663 250151 63462
13331 271577 218822 119643 507984 -1266 178750 67652 79932 193788 418888 -72150 177766
13319 78898 264670 81145 -39921 407488 265355 371441 -22397 403637 52642 162173
13309 162173 35593 273073 290560 89220 -229514 7390 -94808 44825 58231 301605 153597
13298 153597 -295305 145447 -143330 128442 167426 251311 279624 -199370 -83258 -91842 237785
13286 61369 183474 -267680 9143 -72120 -136647 -129843 69776 386851 47829 27374 54637
13275 54637 318554 112408 225178 5967 -27233 164483 -70054 5012 -65568 461096 244228
$$ packed form
13354A94283C5728K00625p091r6196M4161f389C49518r0283J22340J64383o5081
13343D80877F8726J68808i219D38200I7620K96737K9015a00725B29663K0488F3462
13331B71577n2755r9179L88341a266A78750F7652J2280J13856K25100g2150A77766
13319G8898J85772H1145c9921D07488j42133J06086b2397D03637E2642J09531
13309A62173C5593K37480J7487H9220b29514G390i4808D4825J3406K43374j48008
13298A53597b95305A45447a43330A28442L8984Q3885K8313a99370h3258q584B37785
13286F1369J22105b67680I143g2120o4527O804F9776L17075D7829k0455K7263
13275E4637K63917A12408J12770E967b7233A64483g0054E012f5568D61096k16868
$$ plain form
13264 244228 -149276 -79644 -26129 291926 117331 60945 149529 138673 -94464 -28555 276190
13252 9773 -43477 42967 -109355 -375552 -107858 -36093 491496 -25857 -173794 198713 -207304
13240 -403851 283128 -290571 -12302 388218 34691 65962 -42916 218649 99803 303466
13230 303466 338435 204516 63521 -215159 30679 28251 79554 88776 106792 164611 140095
13219 140095 90244 98063 87013 -150706 30062 309022 221806 220709 42330 400024 206791
13208 206791 50157 75526 145527 -54853 175312 -360434 85312 -134769 -94892 -145154 -63486
13196 65464 -101037 2957 -155387 12182 -145587 -250507 119022 -94259 -26915 66783 34057
13185 34057 224230 35366 332152 -133370 332668 -78570 339019 30895 23400 -212426 -117732
$$ packed form
13264B44228a49276O9632b6129B91926A17331n6386Q8584j0856i4464b8555B76190
13252I773d3477D2967a09355k66197a07858c6093D91496b5857j47937A98713b07304
13240d03851B83128b90571a2302C88218C4691L1271d2916B18649I9803K03663
13230C03466L4969j33919F3521b15159C0679k428N1303R222J8016N7819k4516
13219A40095m9851P819j1050a50706C0062K78960q7216j097D2330L57694j93233
13208B06791E0157K5369P0001e4853A75312c60434H5312a34769L9877n0262f3486
13196F5464a01037B957a55387A2182a45587j04920A19022i4259b6915F6783l2726
13185C4057J90173C5366K96786a33370C32668g8570C39019C0895p495b12426R4694
$$ plain form
13174 -117732 208097 87271 -5050 169259 244774 208918 -177502 47342 -118998 61866 -15174
13162 9235 63712 156714 -211118 -264033 316943 106134 -131349 -183267 -86953 87720 85365
13151 85365 -77591 126359 161312 953 10277 -111629 -71320 183693 98677 187265 -93376 -84880
13139 -84880 115624 261503 -19514 131753 158072 -98015 125265 -236295 30591 -56361 50669
13127 381802 275602 -122375 21875 -121188 16827 203630 72166 9592 53517 285589 252017
13116 252017 322017 245082 -90794 -116250 -147718 -84149 -104657 -93799 282306 -21537 283376
13104 -53686 276826 48130 188867 142958 69980 -132795 -133041 -86758 544426 -48437 430933
13092 -72983 170906 -178184 -2684 176849 136399 -14449 -213112 433434 -283531 72879 -117408
$$ packed form
13174a17732B08097H7271e050A69259P5515l5856a77502D7342a18998F1866a5174
13162I235N4477R3002b11118n2915C16943A06134a31349n1918h6953H7720k355
13151H5365g7591A26359L4953I53R324a11629M0309A83693q5016Q8588i3376Q496
13139h4880A15624J45879a9514A31753K6319i8015A25265b36295C0591e6361E0669
13127C81802j06200a22375B1875a21188A6827J86803G2166I592M3925K32072l3572
13116B52017P0000p6935i0794k5456l1468O3569k0508J0858B82306b1537B83376
13104e3686B76826D8130J40737m5909F9980a32795k46M6283E44426d8437D30933
13092g2983A70906a78184b684A76849m0450a4449j98663D33434b83531G2879a17408
$$ plain form
13080 78626 188971 -93343 173053 159754 40543 8704 -11774 42584 32117 -10625 -283543
13069 -283543 306647 -147735 -215125 28513 -160697 -18378 70387 390954 -110678 -112807 -177920
13058 -177920 142515 399660 -36224 141681 -376617 172943 181534 231467 -92460 -3647 340837
13046 -159444 -144133 284290 54639 -341188 136937 -170052 -74174 16970 94202 166874 222913
13035 222913 162573 266682 151523 -102759 -96187 19945 106052 -28256 -62204 312019 -192887
13023 19049 166097 1191 338667 29356 470081 255984 300090 343801 119457 -100588 -208660
13012 -208660 42767 166405 113510 -13841 -65289 370007 -65435 -104773 61835 25713 -19355
13000 6756 -116820 24117 -84938 420034 -124963 165941 -162510 31109 -311792 -6518 -27720
$$ packed form
13080G8626J10345i3343A73053j3299D0543H704a1774D2584j0467a0625k72918
13069b83543C06647a47735o7390B8513a60697a8378G0387L20567a10678k129o5113
13058a77920A42515K57145c6224A41681c76617A72943Q591M9933i2460c647C40837
13046a59444J5311B84290E4639c41188A36937a70052g4174A6970P7232P2672N6039
13035B22913o0340J04109j15159a02759O572A9945Q6107b8256l3948C12019a92887
13023A9049J47048A191L37476B9356M40725k14097M4106M3711A19457a00588j08072
13012b08660D2767J23638n2895a3841n1448C70007f5435l9338F1835B5713a9355
13000F756a16820B4117h4938D20034a24963A65941a62510C1109c11792f518k1202
$$ plain form
12989 -27720 87306 63144 -129462 107901 319310 -230107 200405 99498 -3639 -233795 97199
12977 282161 319332 -9554 239878 -3241 275386 201400 -91144 82278 -11738 -221713 -44298
12965 -233416 -6919 160370 281284 -160840 -86354 155990 -60007 147142 56786 290467
12955 290467 70758 -5449 179137 123225 137892 177879 77464 -297450 20386 128578 251152
12944 251152 279921 -227640 -26019 -127395 -243900 -36960 -122953 -131051 61047 -105944 -218111
12933 -218111 324561 165898 431417 -186397 -147008 -154688 -101951 399478 53532 315266
12923 315266 -89844 175787 -37348 22535 120720 -15553 158054 309565 23243 -129133 32553
12911 -77423 -343208 268316 18965 -78859 15818 -347033 78718 53816 93767 294814 112842
$$ packed form
12989b7720H7306k4162a29462A07901K11409b30107B00405I9498c639k30156I7199
12977B82161L7171i554B39878c241B75386p3986i1144H2278a1738k09975d4298
12965b33416f919A60370J20914a60840P4486A55990f0007A47142E6786K33681
12955B90467G0758e449A79137n5912J4667L9987G7464b97450B0386J08192J22574
12944B51152K8769b27640b6019j01376j16505c6960q5993q098F1047a05944j12167
12933b18111C24561j58663K65519a86397L9389p680N2737C99478E3532K61734
12923C15266h9844A75787c7348B2535R8185a5553A58054J51511B3243a29133C2553
12911g7423k65785B68316A8965g8859A5818c47033G8718k4902L9951K01047A12842
$$ plain form
12899 66308 147491 -22442 -4560 -6459 -187745 -227022 -133760 -151744 182011 245474 25797 -186979
12886 148417 57754 108283 -56718 37688 -384626 12122 -230833 151672 44476 18312 44232
12875 44232 283479 -122953 -1993 -7723 110484 -90668 20574 49943 -57089 -215819 83175
12863 107399 284408 205139 152459 -113108 108948 -80473 -43200 31573 102967 52651 -88932
12851 -343579 -124295 -220614 -80752 -28796 -180196 111835 -63848 214905 -353826 3035 -7810
12839 353592 -10947 9175 -261653 241555 -179809 134462 -118202 43410 -102098 -141238
12829 -141238 70128 68302 -209963 96055 71946 -122840 263148 49084 77711 -304075 285839
12817 -114676 351106 -154798 95502 -204983 -165823 -166191 100483 121689 125471 -232089 -277928
$$ packed form
12899F6308Q1183b2442d560j899j81286l9277R3262j7984A82011O3463B5797a86979
12886A48417E7754N0529e6718C7688c84626A2122b30833A51672D4476A8312K5920
12875D4232K39247a22953a993n730A10484i0668B0574K9369e7089j58730H3175
12863A07399J77009p9269n2680a13108A08948h0473L7273C1573P1394n0316h8932
12851c43579a24295r6319h0752b8796j51400A11835f3848B14905c53826C035g810
12839C53592a0947I175b61653B41555a79809A34462a18202D3410a02098l9140
12829a41238G0128j826b09963I6055k4109a22840B63148D9084K8627c04075B85839
12817a14676C51106a54798I5502b04983L9160l68A00483K1206L782b32089m5839
$$ plain form
12806 -277928 329842 -148903 -78338 36359 -94394 -53004 -123842 83705 -83161 -45405 96047
12794 -41899 219147 66721 -167827 -91373 62290 128140 117446 -100423 -99079 -94973 -289311
12783 -289311 11908 -42823 -166990 -120626 -196396 144229 11899 -11253 -182324 29512 -203190
12771 -11190 225546 59748 118360 165573 145596 -418080 -96041 100795 25286 -298216 109561
12759 271474 -182475 239421 -60251 105430 -77310 79545 -218294 252458 157344 46992
12748 174012 -290474 29696 219619 454670 -4182 29179 125967 167309 276946 -111726 409608
12736 211048 105555 -45061 -129191 32912 34481 -223246 -444811 255738 266022 -247172 -360429
12725 -360429 209921 -3242 -125050 -140341 206975 -209856 48333 -134570 -74665 99236 -65611
$$ packed form
12806b77928C29842a48903P0565C6359i4394M1390p0838H3705h3161L7756I6047
12794d1899B19147F6721a67827P6454F2290O5850j0694a00423J344M106j94338
12783b89311A1908d2823j24167M6364p5770A44229A1899a1253j71071B9512b03190
12771a1190B25546E9748N8612M7213j9977d18080i6041A00795B5286b98216A09561
12759B71474a82475B39421f0251A05430g7310G9545b18294B52458r5114D6992
12748A74012b90474B9696J89923K35051d182B9179R6788M1342J09637a11726D09608
12736B11048j05493d5061q4130C2912J569b23246k21565B55738J0284b47172j13257
12725c60429B09921c242j21808j5291B06975b09856D8333a34570N9905I9236f5611
$$ plain form
12713 -60863 -45903 -59475 52987 134618 275423 346498 10776 264224 318739 -95742 -11628
12701 90963 34995 53609 117514 -27998 12299 11971 44130 -22863 298808 -192443 -227456 166383
12688 -28089 113376 162896 300827 44845 98966 142566 15947 31722 91588 141642 276082
12677 276082 -115873 -68447 231760 34871 21570 -183515 -291666 -31800 279391 -250639
12666 -63235 87184 -158942 -177915 -148206 18576 161114 251348 77999 -158340 -1557 154561
12654 172169 -99541 -138937 -105836 -131750 91132 29790 205478 45055 -40122 -371976 -114051
12642 -284795 -7514 -15298 -109514 97654 -48232 274385 348026 -346799 -69065 -30004 -69086
12631 -69086 -17915 138916 60898 -34411 -166878 -34787 215974 -151995 216 21835 156947
$$ packed form
12713f0863J4960j3572E2987Q1631J40805P1075A0776K53448N4515i5742a1628
12701I0963C4995J8614O3905b7998A2299l28L2159b2863B98808a92443l5013A66383
12688b8089A13376M9520J37931D4845N4121M3600A5947J5775N9866N0054J34440
12677B76082a15873M7426B31760C4871j3301a83515j08151c1800B79391b50639
12666f3235H7184a58942j8973K9709A8576J42538R0234G7999a58340a557A54561
12654A72169i9541l9396L3101k5914I1132B9790J75688D5055d0122l31854a14051
12642b84795g514p784r4216I7654d8232B74385P3641c46799f9065c0004l9082
12631f9086a7915A38916F0898c4411j32467c4787B15974a51995B16K1619J35112
$$ plain form
12620 156947 -177055 337675 -142394 -387364 -703 284888 396730 153387 -93549 -125470
12610 -125470 281837 148595 -25184 -328161 115188 69036 48223 117436 195068 130238 -54051
12598 176338 27582 -39211 97936 -77703 -39107 -53408 -235232 196931 85272 46481 52033
12587 52033 -169970 8660 218774 -41711 123981 -50405 32684 43174 -29930 -150812 21190
12575 -403332 52515 166925 301113 -266556 -57050 -95282 48894 -63479 -21288 110913 -220776
12563 28654 -118509 -67244 226086 169329 -71510 -162513 171705 -102470 221179 -47209 78333
12551 -47128 125736 67133 -83896 195727 443321 69410 74646 39646 -343804 -231513 145957
12539 303263 42429 -13968 86049 -40623 204439 -101654 -62720 297713 232401 -282124 -147000
$$ packed form
12620A56947a77055C37675a42394k44970g03B84888J11842A53387i3549l1921
12610a25470B81837j33242b5184l02977A15188m6152k0813O9213P7632o4830e4051
12598A76338B7582c9211I7936g7703L8596j4301j81824A96931H5272l8791N552
12587E2033a69970H660K10114d1711A23981e0405C2684J0490b9930j20882B1190
12575d03332E2515J14410J34188b66556e7050l8232D8894f3479b1288A10913b20776
12563B8654a18509N1265B26086n6757g1510r1003A71705a02470B21179d7209G8333
12551d7128A25736n8603h3896A95727K47594F9410N236l5000c43804J12291A45957
12539C03263D2429a3968H6049d0623B04439a01654L8934B97713o5312b82124J35124
$$ plain form
12528 -147000 -47110 -332467 3467 110578 79767 -133713 -413273 54361 208353 -120757
12517 27935 12630 12398 -97959 160879 -35229 165036 105667 -141994 -35407 -24449 -56809
12506 -56809 119591 -123246 41859 -159976 -36373 -168293 98258 331205 223295 79030
12495 127369 57242 -64775 -100062 124303 -154233 99285 -86068 206765 30958 -62389 -58799
12484 -58799 191394 -196421 -246402 66211 8577 -131027 -228457 -231502 70934 109183 192166
12473 192166 33765 -125731 -187374 17853 73406 -140859 -9506 -121642 75835 -101832 -8670
12461 -21565 -186695 -31377 287534 8750 -155620 102696 165696 -259176 -85366 -83918 -223737
12450 -223737 -4238 -270249 -247967 276530 227193 -227829 -13937 17135 209024 -82241 154764
$$ packed form
12528a47000d7110k85357C467J07111l0811a33713k79560E4361J53992a20757
12517B7935A2630k32i7959A60879c5229A65036n9369a41994c5407J0958l2360
12506e6809A19591a23246D1859a59976c6373j31920I8258K32947j07910G9030
12495A27369E7242f4775l5287A24303a54233I9285h6068B06765C0958f2389L590
12484e8799A91394a96421m9981F6211H577a31027r7430l045G0934L8249Q2983
12473A92166C3765a25731o1643A7853N5553a40859i506j12136G5835a01832h670
12461b1565j65130c1377B87534H750a55620A02696O3000b59176h5366J448j39819
12450b23737d238k66011K2282B76530m9337b27829a3937A7135J91889h2241A54764
$$ plain form
12438 275131 -26997 93044 81682 153780 -160570 -8888 76692 -74953 -20975 -7569 -168988
12427 -168988 -32452 -38511 208392 -52586 -343701 -105568 -9166 -17888 -47772 -193440 -88429
12415 92110 38278 25484 -59275 -324819 61492 -41872 -282841 -108235 100578 -278919 71582
12403 -276996 -106034 -93771 -39145 -351726 -293114 -184570 -43300 58111 -152124 72282 56669
12392 56669 -207874 13632 -16460 -50218 -6663 -286206 78488 -145616 202195 113879 243210
12381 243210 332107 119121 166514 126574 27219 28750 236246 223461 200156 282939 -6368
12369 -73407 -41935 92889 115367 -95944 -62312 -156032 94887 182908 46754 -280249 -463367
12358 -463367 35613 -65345 45412 -131254 115526 -52945 -50556 196924 -344148 140796 -72253
$$ packed form
12438B75131b6997I3044j1362P2098a60570h888G6692g4953b0975g569j61419
12427a68988c2452o059B08392e2586k91115a05568i166q722k9884j45668h8429
12415I2110C8278j2794e9275k65544F1492d1872k40969a08235A00578b78919G1582
12403b76996a06034J2263c9145l12581N8612J08544d3300E8111a52124G2282j5613
12392E6669b07874A3632a6460l3758f663k79543G8488a45616B02195q8316J29331
12381B43210Q8897A19121M7393l9940B7219J531K07496j2785k3305Q2783f368
12369g3407L1472I2889K2478i5944L3632r3720I4887Q8021D6754b80249j83118
12358d63367C5613f5345D5412a31254A15526e2945K389A96924c44148A40796g2253
$$ plain form
12346 -18821 59445 78327 4982 -23857 190443 19674 -324201 -51167 62552 -146483 71839
12334 167358 -2009 101152 -49965 274877 13951 297617 606263 357830 87409 327451
12324 327451 169926 138172 356139 96778 170157 150606 -196093 299191 200131 99696 -36540
12312 171693 65582 34054 -4306 -36049 205566 -26095 352376 -4640 36022 -238968 -119707
12301 -119707 -53112 72702 86921 118618 344961 -5210 -189465 68237 969 183320 17129
12289 -218408 255119 -131994 74096 230305 295135 97001 328111 108857 -69850 318070
12278 228120 16104 -95702 -88159 258749 33994 -56743 117490 94261 175321 331792 122615
12266 293786 228067 313 -11522 292139 379842 -6608 147603 18660 -56363 -162174 -239117
$$ packed form
12346a8821E9445J8882D982b3857A90443A9674c24201e1167F2552a46483G1839
12334A67358b009A01152d9965B74877A3951K83666L08646k48433H7409K40042
12324C27451j57525l1754K17967I6778P3379j9551a96093B99191r9060I9696c6540
12312A71693F5582l1528d306l1743B05566b6095C52376d640C6022b38968J19261
12301a19707e3112G2702J4219L1697K26343e210j84255F8237I69J82351A7129
12289b18408B55119a31994G4096J56209O4830I7001K31110A08857f9850C18070
12278B28120A6104i5702P543B58749C3994e6743A17490k3229Q1060J56471A22615
12266B93786o5719C13a1522B92139Q7703f608A47603A8660e6363j05811p6943
$$ plain form
12255 -239117 73221 181255 -27529 -91792 -40232 129722 246836 305898 -25954 125345 16427
12243 285244 -129628 105110 273992 55748 322657 169984 52838 89428 -3277 -27564 322597
12231 162340 -31896 -201445 416839 203066 212125 265221 370222 205453 263224 403784
12221 403784 117314 -35546 287472 154034 57441 231593 -16075 279786 77621 104046
12211 104046 199270 -155904 259833 136958 236857 -223102 138030 -39612 239923 -122649
12200 77274 257687 189893 7879 -38632 19246 -122464 120045 213229 39217 -96324 8174
12188 250379 118263 190695 390090 318514 340356 90406 145182 -95922 212444 272342 102226
12176 36939 -127624 92163 342210 875 -261440 -36815 90722 176954 369892 409785 117556
$$ packed form
12255b39117G3221J08034b7529o4263d0232A29722J17114N9062b5954A25345A6427
12243B85244a29628A05110J68882E5748K66909j52673E2838L6590c277k4287C22597
12231A62340c1896j69549D16839B03066R059N3096J05001j64769N7771J40560
12221D03784A17314c5546B87472j33438E7441J74152a6075B79786G7621K6425
12211A04046R5224a55904B59833j22875R9899b23102A38030c9612B39923a22649
12200G7274J80413o7794G879c8632A9246a22464A20045R3184C9217i6324H174
12188B50379A18263P2432J99395p1576K1842I0406N4776i5922B12444N9898A02226
12176C6939a27624I2163K50047H75b61440c6815I0722Q6232J92938L9893A17556
$$ plain form
12164 199427 -186249 -20246 70823 138047 420968 238369 62641 -172841 144234 57242
12153 341706 -20683 137786 48845 -98073 127430 -205382 -409835 168917 -185283 82891
12142 37681 -116276 -237355 8760 252129 257579 -89893 -86465 312722 151040 44816 42375
12131 42375 -339035 565127 -95805 233501 275414 60619 21409 330316 205611 283821 309827
12120 309827 382769 312398 221647 -164462 -23952 124305 198363 184723 113025 228814 -40164
12108 192506 66750 168795 -112949 365465 343644 -2352 97127 204869 228886 -6669 -41417
12097 -41417 101188 142008 202569 77826 229743 309565 -42708 198325 -37910 -41630 358250
12085 175881 80934 236880 -205317 5032 304084 450971 60950 245894 302231 -100413
$$ packed form
12164A99427a86249b0246G0823O7224K82921j82599F2641a72841A44234E7242
12153C41706b0683A37786D8845i8073A27430b05382k04453A68917a85283H2891
12142C7681a16276j21079H760K43369N450h9893L428C12722A51040D4816k441
12131D2375c39035E65127i5805B33501M1913F0619B1409L08907j24705P8210K6006
12120C09827P2942p0371r0751a64462b3952A24305P4058j3640p1698J15789d0164
12108A92506F6750J02045a12949C65465k1821b352I7127J07742K4017f669l4748
12097d1417A01188M0820O0561G7826J51917P9822d2708A98325c7910l720C58250
12085A75881H0934J55946b05317E032K99052J46887F0950J84944N6337a00413
$$ plain form
12074 338017 -77124 149047 346161 60176 278172 65792 351724 68750 -77909 216719
12063 4228 79293 -6669 90330 269759 283768 -72860 290621 298888 104397 -65194 478776
12051 -14893 48393 164415 -24056 38538 140307 82908 138732 -128755 -157860 81747 59985
12040 59985 24006 31942 -89444 90998 345632 422595 26708 106586 28070 67174 306283
12029 306283 97684 308131 -424843 -85574 -15233 -119123 218044 -133727 -55065 54582
12018 -128998 -3907 -46072 -189745 -47785 -181841 28919 -174900 -95439 203284 441876 462071
12007 462071 -230640 -177496 246142 3870 -57847 -103497 77236 242165 40021 -60462 37220
11995 155007 -21420 -296175 -110478 -250615 -185819 165951 -91970 -370636 -35179 -58633
$$ packed form
12074C38017g7124A49047J97114F0176K17996F5792K85932F8750g7909B16719
12063D228P5065f669I0330J79429J4009g2860B90621Q267A04397f5194D78776
12051a4893D8393J16022b4056C8538J01769n7399N5824a28755k9105H1747k1762
12040E9985B4006P936h9444I0998K54634P6963B6708P9878B8070L9104K39109
12029C06283I7684K10447d24843h5574a5233j03890B18044a33727e5065E4582
12018a28998c907m2165j43673d7785j34056B8919a74900P9461B03284K38592K0195
12007D62071b30640N3144B46142C870e7847m5650G7236J64929D0021f0462C7220
11995A55007b1420k74755a10478j40137O4796A65951i1970k78666c5179k3454
$$ plain form
11985 -58633 203447 71805 -76463 -17415 98252 122798 -178681 311863 -232772 -183373 -18355
11973 -119401 -122215 113080 136673 -380536 -22707 -181264 -8516 -178452 -246109 72115 -277133
11961 880 -244178 -322418 -326800 126087 -275245 151359 -47400 148807 160448 -4549 68950
11949 2553 462 -311035 -32950 -100709 -62513 -229054 43455 -97741 -2348 99175 -59217 20729
11936 -34980 251082 84234 104768 36146 -196499 175088 235059 -240536 -50279 8787 33006
11925 33006 290439 85251 292362 13813 -66777 232902 104392 -160776 -321872 -412791
11915 -412791 -238689 -60209 164421 32234 110136 41988 1501 165371 188735 -277255 47157
11903 -297376 -129457 -390495 100856 185195 -39585 -31410 235261 85499 99784 174995 55609
$$ packed form
11985e8633B03447G1805g6463a7415I8252K4546a78681C11863b32772M9399a8355
11973a19401k814A13080K3593c80536b2707j58557h516j69936o7657G2115b77133
11961H80b44178p8240m382A26087b75245A51359d7400A48807J1641d549F8950
11949B553D62c11035c2950o7759L8196j66541D3455i7741b348I9175e9217B0729
11936c4980B51082H4234K0534C6146a96499A75088N9971b40536e0279H787K4219
11925C3006K57433H5251K07111A3813f6777B32902A04392a60776j61096r0919
11915d12791J74102f0209A64421C2234P7902D1988A501J63870K3364b77255D7157
11903b97376a29457k61038A00856Q4339c9585Q175B35261H5499J4285P5211E5609
$$ plain form
11891 -139362 171829 -28407 -112663 -9580 -297895 -59413 -251834 -29584 -44578 73431 -80412
11879 31193 -9818 -179304 60416 118056 74516 17387 139133 -91270 3703 -163915 -380216
11868 -380216 -185022 -145044 125021 -125860 -88520 286511 -145446 -74340 271029 -105578
11857 217378 132220 -75656 -88786 -354333 -113282 175525 115854 -95373 40758 -331610 -216387
11846 -216387 -219991 -44636 -53493 -295440 -163723 57147 -17035 29093 -80105 -210375 9020
11834 -97722 -279808 70673 11075 210553 263046 -66286 111877 -249811 -30273 -266357 -91115
11822 1631 -77271 202777 -35981 99018 70596 245051 -153690 -329623 164943 -83825 48900
11810 174809 339041 -51703 -185414 -121262 91276 -188244 -11949 190679 -226215 110651
$$ packed form
11891a39362A71829b8407q4256i580k88315e9413j92421b9584j4994G3431h0412
11879C1193i818j69486F0416N7640m3540A7387J21746i1270C703a63915k16301
11868c80216a85022L9978A25021a25860L7340B86511a45446P1106B71029a05578
11857B17378q5158g5656j3130k65547a13282A75525n9671i5373D0758c31610J15223
11846b16387l604d4636q857k41947J31717E7147a7035B9093h0105j30270I020
11834i7722j82086G0673A1075J99478N2493f6286A11877b49811c0273k36084i1115
11822A631g7271B02777c5981I9018k8422J74455a53690j75933A64943h3825D8900
11810A74809J64232e1703j33711O4152I1276a88244a1949A90679b26215A10651
$$ plain form
11799 -407243 -36900 -192265 246663 -163522 -4348 -94906 46147 196677 59959 327951 -73346
11787 22314 155282 326680 316016 -40117 104282 91591 -177768 493079 149539 178179
11777 178179 -38712 -56520 368811 -6676 133972 -140750 -2902 93471 -313507 2123 232867
11766 232867 -216918 -78219 89538 110879 -127494 -151267 90975 -223159 30279 -156406 -35939
11754 26172 -505243 -266174 -80315 -36365 -123146 -33439 7072 -19343 -181921 262558 -83794
11742 -450296 287727 -113111 119694 -293524 -348723 12326 -178145 -215949 287413 37465
11731 -361315 123366 53344 -170035 -21809 90428 18101 -73348 -136396 -370346 222514 -166006
11719 -51566 203017 -153464 38856 202164 -33514 267706 -180883 47423 -6302 -25956 -21348
$$ packed form
11799d07243c6900j55365B46663a63522d348r0558D6147J50530E9959K67992g3346
11787B2314J32968J71398j0664d0117A04282j2691a77768D93079A49539K8640
11777A78179c8712j7808C68811f676A33972a40750b902I3471c13507B123K30744
11766B32867b16918g8219H9538K1341a27494k3773I0975b23159C0279a56406c5939
11754B6172e05243K39069h0315c6365q6781c3439G072a9343j62578B62558h3794
11742d50296B87727a13111A19694b93524n5199A2326a78145l7804B87413C7465
11731c61315A23366E3344a70035b1809I0428A8101g3348o3048k33950B22514a66006
11719e1566B03017a53464C8856J63308c3514B67706a80883D7423f302j9654M608
$$ plain form
11708 -21348 447087 3784 -247528 167722 -72822 -171661 -103419 -742 305094 113314 231782
11697 231782 -167888 67154 400693 -138435 304912 -36913 55571 -173111 -200370 177892
11686 100639 -174853 -72235 -56882 104712 -124587 109751 -84159 -130035 5455 -32346 -116946
11675 -116946 38188 -120875 -357950 53147 -220010 -176583 -29419 -89977 75885 302996 -78655
11663 201108 106139 213098 88975 182118 25642 -243889 -100359 -216427 -242279 271936
11652 168626 87259 81784 -320900 -133604 -75107 -128936 -188628 86904 49180 157392 -23540
11640 3567 -302975 -49063 -155417 -18246 -21876 101416 83842 -294657 2347 109288 -226137
11628 130623 -96368 -314222 80844 -376316 -71735 134444 -13672 125331 208965 -134880
$$ packed form
11708b1348D47087C784b47528A67722g2822r8839O8242g42C05094A13314J18468
11697B31782a67888F7154L33539a38435C04912c6913E5571a73111k7259A77892
11686A00639a74853g2235J5353A04712a24587A09751h4159m5876E455c2346q4600
11675a16946C8188a20875k37075E3147b20010M3427b9419o0558G5885K27111g8655
11663B01108r4969J06959H8975R3143B5642b43889a00359j16068k5852B71936
11652A68626q1367n475c20900a33604N8497n3829n9692H6904l7724J08212b3540
11640C567c02975d9063j06354a8246l630A01416j7574b94657B347J06941b26137
11628A30623i6368k17854H0844c76316g1735A34444a3672A25331Q3634a34880
$$ plain form
11617 -22689 -345719 243282 -19299 40782 6069 -57397 -74355 291572 -184309 -354519 -118485
11605 190528 -163580 156927 -35762 -187278 110426 -188596 54211 297396 -114748 23045
11594 56732 200015 23895 172757 261077 -52682 -85104 -104782 -87268 261214 -75381 -271301
11583 -271301 -23404 62573 50400 -108226 341097 6348 20447 48446 -99529 -108910 476706
11571 87639 -27660 196325 186859 131520 135897 -233402 -264452 145989 -225403 -538563 -405241
11560 -405241 -332153 -187584 95112 226492 222971 183505 3162 251229 72639 103166 -353859
11548 -63008 75686 -334785 250189 -130050 -111168 184176 -31271 -150629 61279 -121183
11537 -87795 276836 -196458 -2537 45062 137166 -124479 -53307 -45781 34023 -47487 -204483
$$ packed form
11617b2689l23030B43282a9299D0782F069e7397j6958B91572a84309j70210a18485
11605A90528a63580A56927c5762j51516A10426a88596E4211K43185a14748B3045
11594E6732J43283B3895J48862Q8320e2682l2422j9678J7514B61214g5381j95920
11583b71301b3404F2573j2173a08226C41097F348J4099K7999i9529r381D76706
11571H7639b7660A96325r466n5339M377b33402l1050A45989b25403l13160J33322
11560d05241P3088J44569I5112J31380l521l9466C162K48067G2639L0527c53859
11548f3008G5686c34785B50189a30050J8882A84176c1271j19358F1279a21183
11537h7795B76836a96458b537D5062R2104a24479e3307P526C4023d7487j56996
$$ plain form
11526 -204483 -313613 27587 -81631 175510 23286 239559 -279560 -30119 289754 282038 101459
11514 25697 30397 -131615 -176101 139388 221818 -405547 -81796 -226327 -211209 171810 99692
11503 99692 -315511 443447 -218469 136997 226393 78351 368500 -73397 78162 149741 198460
11492 198460 -193515 47538 142622 -245724 198092 147148 30869 115197 228927 171781 276543
11481 276543 21739 161959 156528 -132359 73231 46098 -37293 -178155 -38522 477813 -123641
11469 183190 -40717 -368831 89900 -41369 162649 28642 154260 116159 108523 -156697 104615
11457 235236 165448 181964 80919 82413 15323 129551 217433 -233570 98800 -248341 44911
11445 -495159 -105948 292029 318540 -27697 -169613 -101514 211710 97984 160552 -33767 -57348
$$ packed form
11526b04483j09130B7587h1631A75510B3286K16273b79560c0119B89754p716A01459
11514B5697M700a31615m4486A39388Q2430d05547h1796j44531J5118A71810p2118
11503I9692c15511D43447b18469A36997Q9396G8351K90149g3397G8162P1579M8719
11492A98460a93515D7538R5084b45724A98092n0944C0869Q4328J13730n7146J04762
11481B76543B1739J40220n431a32359G3231k7133c7293j40862c8522D77813a23641
11469A83190d0717l28114H9900d1369A62649B8642J25618l8101p636a56697A04615
11457B35236o9788J6516H0919J494A5323J14228Q7882b33570I8800b48341D4911
11445d95159a05948B92029K6511b7697j41916O8099B11710I7984O2568c3767k3581
$$ plain form
11434 -57348 52572 1508 132657 77618 -123615 102786 164102 -135823 318290 95675 -227044
11422 38507 -205931 -3913 246909 30384 272249 5325 -115530 -804 63201 276329 -215923
11410 -9707 28702 -39010 -60433 47285 82720 98326 -6957 -98481 -20393 56660 134455 207688
11398 207688 -178235 -73314 227564 431495 132804 90644 -71452 51691 153759 288738
11388 288738 -44177 149407 -139511 43344 -231389 -238989 -138685 32910 -82504 145928 -95909
11376 115502 -17456 51879 235106 -54292 -30175 -167499 13026 151695 349480 171797
11365 -113557 -46810 -17185 -107974 32012 345266 189189 74601 -138739 -299828 -174978
11355 -174978 -103890 -45088 -373711 119786 -10870 -521721 154346 -16834 8399 -233686 71451
$$ packed form
11434e7348E2572A508J31149n5039a23615A02786O1316a35823C18290I5675b27044
11422C8507b05931c913B46909C0384K41865E325a15530h04F3201K13128b15923
11410i707B8702c9010k1423D7285L5435J5606f957r1524b0393E6660P7795P3233
11398B07688a78235g3314B27564K03931A32804m2160g1452E1691J02068J34979
11388B88738d4177A49407a39511D3344b31389p600J00304C2910h2504A45928i5909
11376A15502a7456E1879J83227e4292K4117j37324A3026J38669J97785A71797
11365a13557d6810a7185r0789C2012L13254j56077G4601a38739j61089J24850
11355a74978P1088d5088l28623A19786a0870n10851A54346a6834H399b33686G1451
$$ plain form
11343 107096 -203107 102724 90044 10117 67515 -149468 90203 -234828 -53000 -141245 282826
11331 16718 73390 60009 -229594 -135294 -61258 -52262 -286289 191252 -24118 -30385 -305518
11320 -305518 -104930 145977 -13401 -90376 -243607 -401906 16866 -213937 79271 190031
11310 190031 -178162 29424 -131541 -99133 -177084 -414680 -12717 17134 -379059 -125169
11299 50899 -240772 -290131 -322606 76050 167201 -202404 -39815 -166390 -245731 -363203 -11693
11287 -214587 -174367 208392 55409 -118779 -116701 -290053 -357687 143891 234222 -19253 -16295
11276 -16295 -169672 110056 -311457 -40802 -81158 180860 111202 132261 228082 -174403 96222
11264 108797 135304 -34680 4923 -88406 29091 -186665 -178235 119975 -256540 269463 -80489
$$ packed form
11343A07096b03107A02724j2680A0117N7398a49468I0203b34828e3000q8245B82826
11331A6718N6672j3381b29594R4300f1258Q996k34027A91252b4118o267k75133
11320c05518a04930A45977a3401p6975j53231j58299A6866b13937G9271J10760
11310A90031a78162B9424a31541L2408p7951k37596a2717A7134c79059a25169
11299E0899b40772m9359l2475G6050R1151b02404c9815j26575p9341j17472a1693
11287b14587M0220B08392E5409a18779K078j73352o7634A43891R0331a9253K958
11276a6295j53377A10056c11457d0802m0356A80860o9658K1059R5821a74403I6222
11264A08797K6507c4680D923h8406B9091a86665Q430A19975b56540B69463h0489
$$ plain form
11252 -118614 218657 200509 -86580 -133536 -307068 -178729 -12403 358548 -59131 -231824
11242 -231824 -195311 64516 137705 -87768 89384 -165185 -82345 -120917 226546 -94450 -234822
11231 -234822 71207 -275654 -149616 -18362 -134481 184106 266221 52576 -78966 -50074 43332
11219 -63510 -175051 -207430 47441 79886 12203 91105 9558 -60214 -143562 -2991 -223863 -266177
11207 -266177 -83911 -92003 36730 -236395 -69686 148987 -134234 -64521 -102429 -188967 107309
11195 20580 -120646 -287769 -81486 -27566 -100307 -73433 -12876 -111680 -83487 104116 -100069
11183 255141 138484 43181 -126874 -19849 -314216 84365 -52280 -58251 -38685 -316852 -50907
11171 -188043 -233807 -157674 170575 -74761 -28757 43908 -190681 206779 -636223 29121 43507
$$ packed form
11252a18614B18657j8148h6580m6956j73532J28339a2403C58548e9131j72693
11242b31824L6513F4516P3189h7768H9384a65185h2345l8572B26546i4450j40372
11231b34822G1207b75654J26038a8362j16119A84106Q2115E2576g8966K8892D3332
11219f3510j11541l2379D7441L2445A2203P8902I558f0214q3348b991k20872m2314
11207b66177h3911q092C6730b36395f9686A48987a34234f4521l7908q6538A07309
11195B0580a20646j67123h1486b7566p2741K6874a2876r8804K8193A04116a00069
11183B55141j16657D3181a26874a9849k94367H4365e2280n971J9566k78167e0907
11171a88043m5764P6133A70575g4761b8757D3908a90681B06779f36223B9121J4386
$$ plain form
11160 43507 -288722 151633 -196686 -119401 507635 24493 -82993 -167853 193534 -152055
11149 47173 179994 -80730 -34076 37613 211157 286183 -445172 2004 26519 -140930 95476
11137 -175979 -58637 -5912 56384 -164807 58258 126094 -170462 -70661 15982 -7049 -17801
11126 -17801 17297 -132171 -34304 -63671 -93706 -102445 39763 73650 268433 -107262 -236279
11115 -236279 325061 -120924 -138743 135681 -236424 382924 -80155 -351403 -34479 10789
11104 56908 111824 210918 37212 326582 130880 113660 -97559 234673 294058 39997 294193
11093 294193 86416 138128 -321955 -26340 135548 261984 -104243 -199396 -26578 458430
11082 459616 278709 188639 213271 -103502 35489 -7495 320797 112684 17690 -220343 333828
$$ packed form
11160D3507b88722A51633a96686P7285E07635B4493h2993q4860A93534a52055
11149D7173J32821h0730c4076C7613J73544P5026d45172B004K4515a40930I5476
11137a75979e8637e912E6384a64807E8258O7836a70462g0661A5982g049j0752
11126a7801A7297a32171c4304k9367l0035q739C9763L3887J94783a07262j29017
11115b36279C25061a20924j7819A35681b36424C82924h0155k71248c4479A0789
11104E6908N4916R9094C7212K89370A30880j7220i7559B34673N9385C9997K54196
11093B94193H6416N1712c21955b6340A35548J26436a04243r5153b6578D58430
11082D59616j80907r0070K4632a03502C5489g495C20797A12684A7690b20343C33828
$$ plain form
11070 322383 328765 -138940 22035 100696 -14048 271566 -71327 554519 323493 705605 142096
11058 403510 473576 175745 258978 575541 364971 459445 83307 476256 650254 338379
11048 338379 469140 656229 610056 517234 575152 439571 255867 451995 499152 80897
11037 208244 746081 223864 577161 368086 485816 424762 315760 333027 48080 590902
11027 590902 295221 221573 586224 598879 591323 388653 632054 609072 309836 423074
11017 423074 564605 471225 403996 256292 385497 352934 378794 568781 443289 506183
11007 506183 527580 351624 706892 399445 200172 392647 264189 281965 449051 355952
10997 355952 293856 436641 262271 352376 128176 605295 493364 581215 365613 533370
$$ packed form
11070C22383O382a38940B2035P8661a4048B71566g1327E54519k31026L82112A42096
11058D03510P0066A75745Q3233L16563k10570R4474H3307L92949J73998l11875
11048C38379J30761J87089m6173r2822N7918j35581j83704J96128M7157H0897
11037B08244N37837B23864L53297k09075J17730o1054j09002J7267D8080N42822
11027E90902B95221p3648L64651J2655p556k02670K43401k2982k99236J13238
11017D23074J41531r3380o7229j47704J29205l2563K5860J89987j25492O2894
11007E06183K1397j75956L55268l07447j99273J92475j28458J7776J67086r3099
10997C55952o2096J42785j74370R0105A28176M77119j11931Q7851k15602J67757
$$ plain form
10987 533370 245754 586825 580893 789784 367008 370057 641743 627676 613578 609456 910464
10976 910464 1046363 823171 902024 1365439 1200020 1320313 1383748 1658998 1779541 1774833
10966 1774833 1970071 1977448 1621612 1706794 1603621 1620569 1555284 1373656 1134515 883937
10956 883937 1053755 1109016 1149810 1393730 1390607 1425027 1442107 1492873 1386604 833037 1003944
10945 1003944 618333 852071 401443 511458 309616 334110 342204 295825 -167591 65344
10934 -52348 -69033 211423 456178 49404 43137 -83234 -266862 -47131 -164311 -160900 -97500
10923 -97500 -22766 -105290 105970 -128941 204732 -82145 208742 -32884 -4641 -55606 -9614
10911 44727 -150495 74110 -36907 -221636 157481 -196801 65862 105408 80131 19314 -53828
$$ packed form
10987E33370B45754L41071n932K08891C67008L049K71686j4067j4098m122L01008
10976I10464J35899k23192P8853M63415j65419J20293O3435K75250J20543m708
10966A774833J95238P377l55836Q5182j03173J6948o5285j81628k39141k50578
10956H83937J69818N5261M0794K43920l123L4420J7080N0766j06269n53567J70907
10945A003944l85611K33738D01443J10015k01842K4494Q094m6379a67591F5344
10934e2348j6685B11423K44755D9404o267h3234j83628d7131j17180L411O3400
10923i7500b2766q2524A05970a28941B04732h2145B08742c2884d641n0965i614
10911D4727a50495G4110c6907j84729A57481a96801F5862L9546k5277A9314e3828
$$ plain form
10899 10460 -349966 -67210 20399 -145911 50457 54373 125591 -253659 -14382 187921 172131
10888 172131 -86183 131108 -321322 -95316 -307827 166585 -4663 22739 16587 220662 -88478
10876 -175140 -77824 13979 -578038 -303646 -66594 -308897 96256 58429 -71147 -115194 -81602
10865 -81602 -180745 82973 -421999 117033 16857 224118 -150643 250572 -163097 230989
10854 -104279 109026 -18073 149538 -209618 -56429 -8840 61519 -28144 115858 -107078 -174055
10843 -174055 -422057 -96797 -40121 -307376 -294857 -119354 -17679 -376932 74565 -11559 35894
10831 -201373 -254277 -206423 -13169 -205307 162411 -23583 146425 -173555 -8886 -105587 122443
10819 -68120 151497 -187149 -16398 -48622 -48168 118161 136390 217891 -112561 -110807 -167660
$$ packed form
10899A0460c49966f7210B0399a45911E0457L916P1218b53659a4382A87921j5790
10888A72131h6183A31108c21322i5316k12511A66585d663B2739o152K04075h8478
10876a75140g7824A3979e78038K74392f6594k42303I6256l7827g1147m4047L3592
10865h1602r9143H2973d21999A17033A6857K07261a50643B50572a63097B30989
10854a04279A09026a8073A49538b09618e6429h840F1519b8144A15858a07078o6977
10843a74055k48002i6797d0121k67255J2519a19354a7679l59253G4565a1559C5894
10831b01373n2904M7854a3169j92138A62411b3583A46425a73555h886r6701A22443
10819f8120A51497a87149a6398l2224M54A18161J8229Q1501a12561J754n6853
$$ plain form
10808 -167660 -40319 -80555 108194 66114 256774 13458 204841 -263024 -432714 124943
10797 112011 -228692 -33721 425314 24762 105234 -99893 -51177 -193040 245777 -245491
10786 -74591 34242 -65480 -405851 -133269 -44510 -317706 -179671 42764 126128 78781 -6126
10774 89699 -379084 -294192 -259401 -146383 -192263 78452 -171185 277716 -144731 -40351 -437048
10763 -437048 158200 -199756 -84654 12303 201776 -180648 -214813 -1121 -213139 -280654 179068
10751 72615 137884 72509 115100 140255 -11578 -173527 126679 223250 -58432 20935 -345081
10739 -147983 9310 -122857 124721 -345248 -29609 84781 -68290 55514 77527 -280409 -107539
10727 -12942 43465 -111619 -108358 -23840 390240 -532064 -368977 -5138 234812 36969 196490
$$ packed form
10808a67660d0319m0236A08194m2080J90660A3458J91383b63024j69690A24943
10797A12011b28692c3721D25314B4762Q0472i9893M8716j41863B45777b45491
10786g4591C4242f5480l40371a33269d4510k73196J38035D2764Q3364m7347f126
10774H9699c79084Q4892L4791J13018m5880G8452a71185B77716a44731d0351l96697
10763d37048A58200a99756h4654A2303J89473a80648l4165a121k12018o7515A79068
10751G2615O5269o5375M2591K5155a1578j61949A26679R6571e8432B0935c45081
10739a47983I310a22857A24721c45248b9609H4781f8290E5514K2013b80409a07539
10727a2942D3465a11619L261b3840C90240e32064J63087e138B34812C6969J59521
$$ plain form
10716 196490 -257514 -191833 80295 145597 -134227 162283 4794 -11787 -58527 19376 27772
10705 27772 -110576 2236 -222473 65765 170583 -186651 30832 58599 -10882 292363 -232969
10693 -68404 171406 -41081 303112 -200038 145828 -210586 51556 -86178 -100519 -180422 -258086
10682 -258086 -201450 240842 -327161 84529 22534 -238015 -206304 -50705 145519 38182 6323
10670 -501777 -170416 -30191 -245034 91239 -86718 131811 159442 20389 134412 -104921
10659 -232768 -47301 23220 -212810 -313024 197749 -47089 95930 -226649 -2798 -47786 -45931
10648 -45931 -203217 -251036 -237829 153592 -173078 -191052 14064 -283866 122106 -137048
10637 -267005 -178762 -194343 -293314 -162512 -352896 -254873 -60321 -68665 40633 -298438 -105224
$$ packed form
10716A96490b57514O5681H0295O5302a34227A62283D794a1787m6740A9376Q396
10705B7772a10576B236b22473F5765J04818a86651C0832K7767a0882B92363b32969
10693f8404A71406d1081C03112b00038A45828b10586E1556h6178j4341p9903p7664
10682b58086N6636B40842c27161H4529B2534b38015L1711e0705A45519C8182F323
10670e01777a70416c0191k14843I1239h6718A31811K7631B0389J14023a04921
10659b32768d7301B3220b12810j00214A97749d7089I5930b26649b798m4988J855
10648d5931j57286m7819J3207A53592a73078j7974A4064b83866A22106a37048
10637b67005Q8243j5581r8971J30802j90384R8023f0321q344D0633b98438a05224
$$ plain form
10625 53633 112107 199205 -296631 77725 -332356 -143678 -324560 -221973 71014 29873 -472728
10613 118067 46722 -153920 11922 -126996 -111601 -207181 -76839 -240926 69867 -339706 -220485
10602 -220485 17269 239977 -106401 33274 151346 2705 -319208 -209203 -184171 -219773 8770
10590 -153068 205300 68980 -203023 275984 247887 -65026 150277 -64922 97465 -82733 82094
10578 143985 59462 2162 -129144 -194226 90156 213943 145912 -19453 -47286 20549 -73389
10566 -13731 91706 -38772 18926 49670 -55145 -204375 359746 168343 -968 -152136 11155
10554 -97242 -46597 -191362 118793 60758 244024 -70999 47301 -317329 34319 -167933 -198673
10543 -198673 149510 -166850 -109981 -298664 58566 -87689 174852 130014 -178687 -81365
$$ packed form
10625E3633N8474Q7098b96631G7725c32356a43678j80882J02587G1014B9873d72728
10613A18067D6722a53920A1922a26996J5395r5580g6839j64087F9867c39706J19221
10602b20485A7269K22708a06401C3274J18072B705c19208J10005K5032l5602H770
10590a53068B05300F8980b03023B75984k8097f5026A50277f4922I7465h2733H2094
10578A43985E9462B162a29144o5082I0156J23787o8031a9453k7833B0549g3389
10566a3731I1706c8772A8926L0744e5145j49230C59746A68343i68j51168A1155
10554i7242d6597j44765A18793n8035J83266g0999D7301c17329C4319a67933l0740
10543a98673A49510a66850N6869j88683E8566h7689A74852m4838a78687h1365
$$ plain form
10532 51990 -255170 -91940 94177 26135 -271030 -45937 4238 38371 249430 -17981 -284693
10521 -284693 67738 -196580 -138422 23358 131758 -194465 -240839 153056 -221512 -161521
10511 -161521 -91409 -85505 -336513 -192480 -140930 -296076 -204263 -301099 -182738 257466 -60752
10499 97699 -66967 180911 77347 -188978 -65068 229879 47237 -15676 82203 -100371 132603
10487 -12825 -239871 -293839 -30867 156472 83126 -132969 148147 162239 136812 -81394 -49363
10476 -49363 119910 121872 572251 591801 360538 479942 668383 -75504 45243 15421 -64110
10464 -84006 -31430 -136945 192745 153586 -10977 72395 76394 -38165 -17629 -14764 -415065
10453 -415065 -12455 47572 -347387 34939 54184 -46150 43426 -152506 -33363 -46835 239794
$$ packed form
10532E1990b55170i1940I4177B6135b71030d5937D238L4133K11059a7981k66712
10521b84693F7738a96580N8158B3358J08400a94465m6374A53056b21512N9991
10511a61521P0112N904k51008J44033N1550j55146R1813r6836J18361B57466f0752
10499I7699f6967A80911G7347a88978f5068B29879D7237a5676H2203a00371A32603
10487a2825k27046n3968c0867A56472p3346a32969A48147J4092k5427h1394L2031
10476d9363A19910J962M50379J9550k31263J19404J88441g5504D5243A5421f4110
10464h4006c1430j05515A92745l9159a0977G2395L999c8165a7629K865m00301
10453d15065a2455D7572c47387C4939J9245d6150D3426a52506c3363j3472B39794
$$ plain form
10441 309980 -311223 -11215 191925 -151284 -248151 32996 128617 -98673 67941 -264188 -36945
10429 150945 100816 13655 -2348 -259568 216025 -166967 -226737 312 -75786 176870 -246599
10417 -221016 -23816 80126 -214470 92854 93500 -57494 121200 59142 129162 -130716 -96595
10406 -96595 20557 -367793 -137135 -37052 248456 -187654 -132714 32220 -82476 99321 178813
10395 178813 -130212 -158548 -35270 -281249 39602 107956 392134 449511 198260 270895 100567
10383 115179 332939 184938 -36738 -262312 -127257 323466 -323232 -53660 178327 119794
10373 119794 201075 -60887 64460 128885 41149 -61359 -193080 350641 3080 202505 430691
10362 430691 495247 415750 335435 -177801 16253 50357 119301 77155 32341 -84080 135879
$$ packed form
10441C09980c11223a1215A91925a51284r6867C2996R5621i8673F7941b64188c6945
10429A50945n0129A3655b348k57220B16025a66967n9770C12g5786A76870b46599
10417b21016b3816H0126b14470I2854O46e7494A21200E9142P0020a30716L4121
10406i6595B0557c67793a37135c7052B48456a87654N4940C2220h2476I9321P9492
10395A78813a30212k8336c5270k45979C9602O8354K84178N7377A98260P2635A00567
10383A15179K17760j48001c6738k25574a27257C23466c23232e3660A78327n8533
10373A19794Q1281f0887F4460O4425D1149f1359j31721C50641C080J99425K28186
10362D30691O4556p9497q0315a77801A6253L4104O8944m2146C2341h4080A35879
$$ plain form
10350 210729 104709 388315 286276 346622 161095 255572 -238160 -28388 -46345 75111
10339 183286 -58644 -99209 126064 115120 38119 114293 106234 184601 147880 -8988 -392553
10328 -392553 -74278 35774 41473 22299 -11881 -84043 -137544 -334 -64296 308973 -187368 312808
10315 -236606 32742 123554 -266138 382650 48193 160886 140614 -77232 -109250 313430 174855
10304 174855 -15755 137906 -126879 53541 118679 -33241 -42408 123389 -7647 39422 -205003
10292 123305 -11490 128194 -142501 191157 160447 37678 310377 -84126 -130220 -281597
10282 -281597 62600 -163530 -175720 -136716 10793 -203368 210776 -71856 160047 70274 29898
10270 -99044 -398607 -165660 -166383 313479 -156805 216551 -6145 -227491 66184 -88360 68837
$$ packed form
10350B10729A04709K83606j02039O0346A61095R4477b38160b8388j7957G5111
10339A83286e8644m0565A26064j0944C8119P6174q059P8367l6721h988l83565
10328c92553g4278C5774N699j9174a1881p2162n3501c34o3962C08973a87368C12808
10315b36606C2742R0812b66138C82650D8193J12693k0272g7232l2018C13430j38575
10304A74855a5755A37906a26879E3541O5138c3241r167A23389g647C9422b05003
10292A23305a1490A28194a42501A91157l0710C7678K72699h4126m6094j51377
10282b81597F2600a63530j2190L9004A0793b03368B10776g1856A60047G0274B9898
10270i9044k99563a65660p23C13479a56805B16551f145k21346F6184h8360F8837
$$ plain form
10258 -344581 -327483 127331 -28847 49460 -32440 -110660 559978 401564 218187 120596 -220174
10246 -127697 -40153 10221 110771 -5361 -270978 126121 -108108 -386704 -204588 -42392
10235 10873 -210688 -244929 282914 -78810 -202720 -27992 196449 55440 -208165 31594 -350293
10223 256329 -21903 -27654 -85595 -14674 -319328 -128708 -130309 -118481 -271116 188697 -192563
10211 -38392 146509 103119 286769 -190779 29607 -63877 147693 211969 329689 -60552 -64908
10200 -64908 18964 62912 -263541 -101870 -82994 -30945 -211757 114346 166867 -85233 -444787
10189 -444787 -70778 -136536 -141498 -28539 -19325 6492 -176921 -9392 -169976 -12058 85457 158963
10177 158963 -229641 -191703 24890 109665 68121 -55822 -62682 -151859 -75402 -96642 64333
$$ packed form
10258c44581J7098A27331b8847D9460c2440p8220E59978j58414j83377r7591b20174
10246a27697d0153A0221J00550e361k65617A26121a08108k78596J82116d2392
10235A0873b10688l4241B82914g8810j23910b7992A96449E5440b08165C1594c50293
10223B56329b1903n751n7941a4674l04654a28708j601J1828j52635A88697a92563
10211c8392A46509m3390J83650a90779B9607f3877A47693O4276J17720f0552m356
10200f4908A8964M3948b63541a01870J8876c0945j80812A14346N2521h5233l59554
10189d44787g0778o5758m962b8539R214F492a76921i392j60584a2058H5457P3506
10177A58963b29641L7938B4890Q4775m1544e5822o860q9177g5402k1240F4333
$$ plain form
10165 28640 -60440 -34140 -103181 -108932 73672 52345 -20007 -349598 -407330 -220994 -88172
10153 -106374 -316050 218094 -91856 -78102 22267 -117382 250908 -88010 -51225 -37996 -200221
10142 -200221 124114 138704 199522 -159992 -106466 -58387 -355264 122445 69647 -152834
10131 -229874 -272724 -143012 -211860 -74256 -204346 21024 -15069 -345835 23607 18289 -50018
10119 -68576 227287 17384 -163829 -62008 -217985 84956 -68402 115690 -235368 102646
10108 -414 153502 -179085 -245170 340141 -195986 -361597 113098 111892 63881 92398 -34351
10096 -250359 -88239 -73281 -77882 235766 -172434 -204632 131946 -175567 -102898 -176272 75602
10084 -414867 75082 12443 182957 -62098 -14021 -17777 -210422 -23071 -229895 -69130 -122326
$$ packed form
10165B8640f0440K6300o9041n751G3672k1327b0007l29591n7732J86336h8172
10153a06374k09676B18094i1856J3754B2267a17382B50908h8010L6785J3229j62225
10142b00221A24114J4590O0818a59992N3526M8079k96877A22445n2798a52834
10131b29874m2850J29712o8848g4256j30090B1024a5069l30766B3607n318e0018
10119f8576B27287A7384a63829f2008j55977H4956f8402A15690b35368A02646
10108d14A53502a79085o6085C40141a95986j65611A13098j206m8011K8517c4351
10096b50359h8239J4958m601B35766a72434l2198A31946a75567P2669p3374G5602
10084d14867G5082A2443J70514f2098a4021l756j92645b3071k06824f9130n3196
$$ plain form
10073 -122326 -219459 -159925 -93571 115348 85286 -1669 88561 184442 108792 -96009 29203
10061 -165481 -379549 92541 67140 65071 129085 -256475 -89035 -127837 215642 101671 187997
10050 187997 48864 -69944 -223564 -16088 -182290 -21702 -41700 -288318 -288971 -116111 79480
10038 -307901 30890 -31147 58363 82826 -71143 -109131 26766 -237451 -406023 -430570 -270664
10027 -270664 -135913 27914 63802 -329312 -252664 -102235 -81923 86007 -42506 -43379 -118409
10016 -118409 29790 -19928 -62304 -76336 -296385 -35881 -57249 57449 -94037 -104117 -30445
10004 95315 -31308 -172995 -91548 -35016 -102728 -260718 -29976 297168 -45435 68567 -179904
9992 -117276 240297 136227 -170948 -48334 -16536 14423 193335 -90956 227372 158791 -124220
$$ packed form
10073a22326r7133N9534O6354A15348l0062a669H8561R5881p5650i6009B9203
10061a65481k14068I2541k5401k069O4014b56475h9035l8802B15642A01671Q6326
10050A87997D8864f9944j53620a6088j66202b1702j9998k46618o53a16111G9480
10038c07901C0890c1147E8363K4463g1143l7988B6766b37451j68572k4547J59906
10027b70664J34751B7914L5888c29312P6648a02235K0312H6007d2506q73p5030
10016a18409B9790a9928m2376j4032k20049c5881k1368E7449i4037j0080c0445
10004I5315c1308j41687Q1447c5016o7712j57990b9976B97168d5435F8567a79904
9992a17276B40297j04070a70948d8334a6536A4423J78912i0956B27372o8581a24220
$$ plain form
9980 -119029 9122 -7572 -247646 -86924 -352909 71106 -114204 -292126 -65865 -79056 -99589
9969 -99589 -84689 55165 -283561 168880 -248193 -13820 -32014 -133253 141448 -1172 -525653
9958 -525653 31168 -88979 -13143 -270693 -351027 -23011 24029 -475680 29242 13816 -74758
9946 -118178 -11523 -158646 101007 -105425 96296 -239075 -490100 -6240 -225039 -202741 -181856
9935 -181856 -318427 59584 -106725 -35388 -233911 50294 -210639 155796 42325 -107413
9924 -58040 -64911 -354819 242081 212934 205726 43104 -345148 9100 -226376 6379 -5489 200472
9911 -235419 109391 -157658 -390322 369545 124830 -291499 -126697 -178193 22451 46144
9901 46144 245778 -274574 70918 54124 -325460 -147358 -203863 -343026 14962 51391 -235358
$$ packed form
9980a19029I122g572k40074h6924k65985G1106a14204j77922f5865j3191k0533
9969i9589J4900E5165b83561A68880b48193a3820j8194j01239A41448a172n24481
9958e25653C1168h8979a3143k57550q0334b3011B4029d75680B9242A3816g4758
9946a18178a1523j47123A01007a05425I6296b39075k51025f240k18799K2298K0885
9935a81856j36571E9584a06725c5388j98523E0294b10639A55796D2325a07413
9924e8040o871k89908B42081k9147p208D3104c45148I100b26376F379e489B00472
9911b35419A09391a57658k32664C69545A24830b91499a26697n1496B2451K3693
9901D6144J99634b74574G0918j6794c25460a47358n6505j39163A4962L6429b35358
$$ plain form
9889 -77061 -163626 -280338 80210 -84634 90889 292591 -102922 163031 -68743 -26675 -4459
9877 -38838 -376526 -228216 -132918 81885 -80903 670 79371 -53542 -122537 -61378 -209447 -44797
9864 263678 -228210 126068 -17485 -55668 -361849 -124049 -228730 -129272 2300 280076 -312624
9852 91100 -31965 -180759 -334134 127797 216332 -64667 142200 55578 71122 -25012 218469
9840 -201308 -58014 -80767 -1383 -73202 -284062 -44501 -64293 -202926 -204084 -64861 -23561 21166
9827 -65144 -11463 -138094 -45217 -65936 -338675 -422587 351639 -82808 -114120 -247470 -79129
9815 -65257 61880 90308 -424 -153259 -207555 -140456 -27179 36279 55712 -90157 -11488 80255
9802 -224278 -138588 141140 -359573 225885 36975 -23765 40545 -110362 -156327 -57615 -171713
$$ packed form
9889g7061q6565j16712H0210h4634I0889K01702a02922A63031f8743b6675d459
9877c8838l37688J48310R5298H1885h0903F70P8701e3542o8995O1159j48069d4797
9864B63678b28210A26068a7485l8183l06181a24049j04681R9458B300K77776c12624
9852I1100c1965j48794j53375A27797Q8535f4667A42200E5578J5544b5012B18469
9840b01308e8014k2753a383p1819k10860d4501j9792j38633j158f4861b3561B1166
9827f5144a1463j26631d5217k0719k72739q3912C51639h2808l1312j33350g9129
9815f5257F1880K8428d24j52835n4296O7099b7179C6279J9433i0157a1488H0255
9802b24278Q5690A41140c59573B25885C6975b3765D0545a10362m5965e7615j14098
$$ plain form
9791 -171713 -428701 -42909 -108392 -19670 -129446 -348842 -328460 -62001 159575 41324 58732
9780 58732 -182734 -151777 -128878 -118287 -174743 71600 -97685 152394 -96033 -74257 -76423 -126518
9768 -126518 -21434 -15932 -120599 -81482 -295971 161699 106080 -227092 -164008 -144138 -72612
9757 -72612 73294 -69675 -66675 -266662 -59370 -124165 -268155 -307819 -22661 42711 -89725 -389032
9745 -389032 -105484 -450112 -333008 -226859 103676 45686 194322 -268587 -242274 389378
9734 17177 -152507 -40553 -165497 44066 70544 18707 -251717 67507 -401658 -210956 -21716
9722 62388 -302043 10500 -57833 -107475 7709 40046 88595 -250747 -87249 -139987 98318 -19348
9709 10735 67674 -166170 149642 44651 -91191 457762 -280403 232466 -71391 45111 229114
$$ packed form
9791a71713k56988d2909o5483a9670j09776k19396K0382f2001A59575D1324J7408
9780E8732a82734L0957K2899J0591n6456G1600i7685A52394i6033K1776k166n0095
9768a26518b1434N502j04667L9117k14489A61699n5619b27092O3084J9870P1526
9757g2612G3294f9675L000j99987e9370o4795j43990l9664b2661D2711h9725k99307
9745c89032a05484l44628J17104J06149A03676D5686J48636b68587K6313C89378
9734A7177a52507d0553j24944D4066K6478A8707b51717F7507d01658J90702b1716
9722F2388c02043A0500e7833m9642G709L2337M8549b50747h7249n2738I8318a9348
9709A0735N6939a66170A49642D4651i1191D57762b80403B32466g1391D5111J84003
$$ plain form
9698 229114 -1574 -118308 126351 -265122 12441 -136177 44774 -247203 -26887 291161 107214
9686 -347100 18290 331402 -33128 -133160 -10916 -83384 -31525 -354375 -163095 280015 -233906
9674 -125364 -104256 16892 117512 -243725 344477 -311965 -293560 -283577 -92904 -19725 41413
9662 21952 -19368 -374110 115555 -83363 -106256 -365995 209067 -42006 101837 -202687 -149124
9651 -149124 312299 5152 85059 196229 -328524 -186085 71657 -103219 -67533 388206 -32842
9639 -344564 -122317 -76306 -29436 -258709 -227322 -21379 -94843 -35764 135420 -132390 -68303
9628 -68303 95684 -105636 -278977 48798 339637 16166 31996 32201 -232818 -172817 -201039
9617 -201039 -362471 62181 -268414 -293095 228742 141162 -28139 304960 -64370 -178201 23312
$$ packed form
9698B29114a574j16734A26351b65122A2441a36177D4774b47203b6887B91161A07214
9686c47100A8290L13112c3128j00032a0916p2468c1525l22850a63095B80015b33906
9674a25364K1108A6892J00620b43725C44477c11965J8405R983i2904a9725D1413
9662B1952a9368l54742A15555h3363k2893k59739B09067d2006A01837b02687N3563
9651a49124C12299E152P9907J11170c28524J42439G1657a03219L5686C88206c2842
9639c44564a22317M6011b9436k29273L1387b1379p3464c5764A35420a32390O4087
9628f8303I5684a05636j73341D8798K90839A6166J5830K05b32818O0001k8222
9617b01039j61432F2181b68414k4681B28742q7580b8139C04960f4370j13831B3312
$$ plain form
9605 43933 122886 94584 -64230 205572 -133551 79018 -56065 -104580 -397278 -72475 52528
9593 316960 104294 -57818 -126977 -72846 -319234 21111 -222516 -53552 125282 49867 -3216
9581 185631 -45824 216863 -2338 -43879 -313182 214636 -268907 -386231 -95179 -39529 -270942
9570 -270942 -91682 -68945 230013 -157432 -38373 -372301 -228703 -144804 -415921 -276205
9560 -276205 -26699 -281423 -144978 -177087 124011 217264 21812 42475 -279272 249153 -108970
9548 -323225 38874 35877 -356946 174849 -17972 -115961 457 -229135 -120685 -196858 -19344
9536 -121139 -142243 127644 -101182 262495 135974 -375651 -15844 -33957 114378 -59298
9525 -9724 -119754 -100660 -24419 200276 58626 -129540 -178727 -106830 60212 490 -43855 -3040
$$ packed form
9605D3933P8953k8302f4230B05572a33551G9018e6065m8515k92698g2475E2528
9593C16960A04294e7818o9159N4131k46388B1111b22516e3552A25282D9867c216
9581A85631d5824B16863b338m1541k69303B14636b68907j17324i5179c9529k31413
9570b70942i1682K2737B30013a57432c8373l33928J43598Q3899k71117J39716
9560b76205b6699k54724J36445l2109A24011R3253B1812K0663b79272B49153a08970
9548c23225C8874k997c56946A74849a7972r7989D57b29135J08450p6173a9344
9536a21139k1104A27644a01182B62495j26521c75651a5844j8113A14378e9298
9525i724j10030J9094b4419B00276E8626a29540m9187P1897F0212D90d3855c040
$$ plain form
9512 123250 70354 -99686 148503 73678 -11835 -69583 -160127 16283 -318888 84593 108016
9501 108016 285280 -64463 -23947 107595 -219406 -54956 141370 -193702 -282790 190828
9490 -48495 -255595 -215452 -336098 -7384 51725 282239 -35569 253810 48586 191081 22212
9478 -35126 72865 -199404 94851 -445946 -456096 -407079 -74123 -60976 -317679 76895 -157521
9466 38035 -133564 -132655 55425 48160 -228767 -140222 -123781 32425 -213015 77868 449418 -564289
9453 86598 -132418 -177399 -19697 13581 -325875 -256719 -33509 -261854 193527 -102250 -150455
9442 -150455 -41318 -111855 82073 -213013 -4007 -123207 148609 40086 131677 -35838 -112912
9431 -112912 232225 -67464 73457 -280665 179046 128866 176245 178898 -117636 129946 -180875
$$ packed form
9512A23250n2896i9686A48503G3678a1835n7748r0544A6283c18888H4593K3423
9501A08016J77264f4463b3947A07595b19406e4956A41370a93702q9088A90828
9490d8495k07100M0143j20646g384E1725K30514c5569B53810D8586J42495B2212
9478c5126G2865a99404I4851d45946j0150M9017g4123J3147k56703G6895a57521
9466C8035a33564R09E5425p265b28767Q8545J6441C2425b13015G7868L71550e64289
9453H6598a32418m4981a9697A3581c25875O9156c3509k28345A93527a02250m8205
9442a50455d1318p0537H2073b13013d007j19200A48609D0086R1591c5838p7074
9431a12912B32225f7464G3457b80665A79046n0180M7379K653a17636A29946a80875
$$ plain form
9419 146749 199734 29759 26409 -279850 -64751 120895 -297896 -42618 12191 -268728 170298
9407 -271148 351022 197188 172466 47026 -189242 -42891 94908 57461 -105647 -134859 -107652
9396 -107652 -128344 -236640 -252547 -146017 84814 18472 59498 -294934 -46897 122821 -223629
9384 -294259 -172411 194949 63559 20577 138874 -100432 -55365 166075 111438 -200439
9373 -6418 171072 132835 -231360 -213980 -118989 -20288 -269316 39134 -302840 151502 45498
9361 -184845 -115051 -236442 126467 -157428 -88309 -260039 -12231 -159080 10259 -75821 -51695
9350 -51695 166934 -231480 -201868 138477 -40721 -66307 -4408 -155193 8066 -364184 97762
9338 -218242 240801 -131847 195833 -44039 -258584 -103383 -201474 10549 -4472 216027 99181
$$ packed form
9419A46749N2985B9759l350b79850f4751A20895b97896d2618A2191b68728A70298
9407b71148C51022j53834k4722D7026a89242d2891I4908l7447a05647k9212K7207
9396a07652k0692j08296j5907J06530H4814A8472M1026b94934d6897A22821b23629
9384b94259J21848A94949F3559B0577J18297a00432M5067A66075n4637b00439
9373f418A71072l8237b31360J7380R4991b0288k49028C9134c02840A51502D5498
9361a84845O9794j21391A26467a57428O9119j71730a2231j46849A0259g5821K4126
9350e1695A66934b31480K9612A38477d0721k5586d408j50785H066c64184I7762
9338b18242B40801a31847A95833d4039k14545a03383r8091A0549d472B16027I9181
$$ plain form
9326 -14553 66288 14401 106327 -117733 -53789 -207316 602 20936 48220 -62044 -221838 -43385
9313 52737 -163627 123252 206072 136157 -228266 -25855 -88059 89631 -264132 -34247 -181426
9302 -181426 -27786 -212536 73941 -233056 -68331 196073 -273743 64552 -225976 130764
9291 -70520 -82149 -74830 -416819 49708 25072 -345900 -18806 -232139 95325 -210536 -176275
9280 -176275 -249965 59399 130179 335344 -67286 -286646 224202 113841 -179445 186062
9269 -39803 -64366 -303134 -1881 228598 -160472 -12475 -334536 162111 -15456 -11236 17907
9257 119551 58279 -266112 -106370 -250779 -113425 11490 -307921 -133093 -427451 -70155
9246 -59736 -279188 -79320 118662 -3708 -143062 -86740 -141378 -103710 119877 -98319 -407189
$$ packed form
9326a4553F6288A4401R1926a17733e3789j53527F02K0334K7284f2044j59794d3385
9313E2737a63627A23252Q2820o9915b28266b5855o2204H9631b64132c4247j47179
9302a81426b7786j84750G3941b33056f8331A96073b73743F4552b25976A30764
9291g0520j1629P319l41989D9708k4636c45900a8806k13333I5325b10536L4261
9280a76275p3690E9399P0780K05165f7286k19360B24202j10361a79445A86062
9269c9803k4563k38768a881B28598a60472a2475l22061A62111a5456M220A7907
9257A19551E8279b66112a06370j44409a13425A1490c07921a33093k94358g0155
9246e9736k19452g9320A18662c708j39354N6322n4638L7668A19877i8319l08870
$$ plain form
9235 -407189 -290892 44780 42088 -185974 5444 1213 -37114 -92194 32518 40066 233590 79245
9222 -255696 -200550 -87604 215240 -308885 -113703 -43401 -177349 -18906 -238868 294954
9211 87933 -300417 -256673 -29144 23053 117157 108681 -281144 78139 -256416 -77071 42266
9199 281705 39040 -138817 -92463 -204265 -80179 -66455 65504 -86671 -176982 -39858 -104180
9188 -104180 -135567 -95660 -376167 -28561 -299307 -27080 -15641 -101910 121181 -112765 -334418
9177 -334418 83958 -244151 241470 -321420 -228429 -95117 -40818 -86988 -318823 153684 202214
9166 202214 -3148 87936 41757 -45223 -24650 -29064 180844 -187599 -78044 48267 -123375
9154 45781 9559 42516 -64131 -139550 -294643 -65642 -145843 -290249 326475 -169549 -34359
$$ packed form
9235d07189J16297D4780k692a85974E444A213c7114n5080C2518P548J93524G9245
9222b55696N5146h7604B15240c08885a13703d3401j33948a8906k19962B94954
9211H7933c00417M3744b9144B3053R4104q476b81144G8139b56416g7071D2266
9199B81705C9040a38817M6354j11802h0179J3724F5504h6671r0311c9858o4322
9188a04180l1387L9907k80507b8561k70746b7080J1439q6269A21181a12765k21653
9177c34418H3958b44151B41470c21420R2991i5117d0818m6170k31835A53684M8530
9166B02214c148H7936D1757d5223K0573m414A80844a87599g8044D8267a23375
9154D5781I559L2957f4131p5419j55093f5642q0201j44406C26475a69549c4359
$$ plain form
9142 -25052 -87837 18266 70819 -86392 -274009 251910 -134623 -212979 -258873 -208714 37040
9130 -18885 -20342 -20305 18798 117522 -512049 -104033 199113 -181188 -192091 109368 214616
9119 214616 33640 207828 -68077 236157 38509 130862 -5728 47645 -26855 106711 -91004
9107 14507 31519 -254354 -261744 -279075 -208981 103158 278500 -168190 128515 44033 -4638
9095 -171972 -136824 173104 -222167 44577 44976 41391 -346779 94026 -4912 142593 77650 -112672
9082 274492 -72985 128771 -303083 -45486 44428 187156 -238011 -215223 -64590 -68764 -117530
9071 -117530 -95872 65416 -237843 -41490 102800 -20982 87820 -85362 -83589 -65429 -327506
9060 -327506 -28188 76084 16656 -46106 136270 79490 -156186 -122430 106474 -142857 -125949
$$ packed form
9142b5052o2785A8266N2553h6392j87617B51910a34623p8356m5894N0159C7040
9130a8885j457L7A8798R8724e12049a04033A99113a81188j0903A09368J05248
9119B14616C3640J74188f8077B36157C8509R2353e728D7645b6855A06711i1004
9107A4507J7012b54354p390j7331P0094A03158J75342a68190A28515D4033d638
9095a71972L5148A73104b22167D4577L99l585c46779I4026d912A42593o4943a12672
9082B74492g2985A28771c03083d5486D4428J42728b38011K2788f4590m174m8766
9071a17530K1658F5416b37843d1490A02800b0982H7820h5362J773J8160k62077
9060c27506b8188G6084A6656d6106A36270n6780a56186L3756A06474a42857J6908
$$ plain form
9049 -125949 -10675 -82975 -424526 -182509 -328081 -255701 189055 -118118 -103775 -111589 -131948
9038 -131948 -283108 187611 154063 8212 -173710 64329 -98891 -115300 -60250 -380317 -50666
9026 24096 196217 80195 146101 -253497 -170975 -523286 -77012 -125010 956 10059 -243959 -169948
9014 -169948 17392 -39997 15485 -197128 -124478 -303101 460363 69990 61187 91761 56320
9003 56320 -32245 10569 -85521 -208844 -18999 74194 -102073 -191286 -297775 -152085 -206160
8992 -206160 -2292 -143244 -84758 182520 42922 103854 150822 -45732 -346786 122001 -41183
8980 -183518 -222720 39835 -7968 5821 -157307 44988 -64692 -511730 233266 -69016 -281343
8969 -281343 154254 -67948 -326617 -32387 -55218 -236661 -208624 -14785 -27223 -198794 -435475
$$ packed form
9049a25949a0675p2300l41551a82509j45572P2380A89055a18118J4343p814k0359
9038a31948j51160A87611l3548H212a73710F4329i8891j6409N5050l20067e0666
9026B4096J72121H0195O5906b53497Q2522l52311g7012m7998I56R103b43959P4011
9014a69948A7392c9997A5485a97128P2650j78623D60363F9990q803L0574l5441
9003E6320c2245A0569h5521j23323a8999G4194a02073q9213j06489J45690n4075
8992b06160b292j40952N8486A82520D2922O0932M6968d5732l01054A22001d1183
8980a83518l9202C9835g968E821a57307D4988f4692m47038B33266f9016k12327
8969b81343A54254f7948k58669c2387k2831j81443K8037a4785j2438j71571k36681
$$ plain form
8958 -435475 -129551 282992 -279114 -143626 33460 259720 21473 -81578 112824 -157619
8947 258144 102538 1263 -112500 128709 22343 -37124 -137362 378438 391263 141118 -138762
8935 -71681 33586 -154166 -86125 652805 208966 -89442 -283378 140669 52639 -121231 -31095
8923 113534 175120 331767 844058 2598534 9720296 14197414 4103082 811889 396177
8913 161514 14594 179421 -344048 98521 260018 332192 -310147 -41912 384601 369668 -60848
8901 -122769 221738 -300922 -163513 -363297 -158127 164083 65861 -262493 100345 -62611
8890 -310947 368589 -79765 -184912 -78634 -327173 204943 -122928 122540 -132424 -158849
8880 -158849 146954 -202193 29402 -126018 193438 48368 72582 41296 -158407 282099
$$ packed form
8958d35475a29551B82992b79114J35488C3460K26260B1473h1578A12824a57619
8947B58144A02538A263a12500A28709B2343c7124j00238C78438J2825A41118a38762
8935g1681C3586a54166O8041F52805B08966h9442j93936A40669E2639a21231c1095
8923A13534O1586J56647N12291J754476P121762M477118D103082H11889C96177
8913A61514A4594J64827c44048I8521J61497P2174c10147d1912C84601j4933f0848
8901a22769B21738c00922J37409j99784a58127A64083F5861b62493A00345f2611
8890c10947C68589g9765j05147g8634k48539B04943a22928A22540a32424k6425
8880a58849A46954b02193B9402a26018A93438D8368K4214l1286a58407B82099
$$ plain form
8869 -85331 -89667 -140266 47760 -204287 -97464 13786 77977 -34806 -273660 -207466 -522857
8858 -522857 -354742 -45026 -206526 -51677 -265049 -354472 -175278 -78618 -253696 83623 -123446
8846 -290751 38296 -165807 147065 -195033 68350 203403 218280 -162992 -342294 89772
8835 -351835 123099 265899 -53975 237468 112865 66169 -9718 -184229 189748 -74301 46575
$$ packed form
8869h5331m336n0599D7760b04287i7464A3786O4191c4806k38854O6194l15391
8858e22857J68115d5026j61500e1677k13372q9423a75278g8618j75078H3623a23446
8846b90751C8296a65807A47065a95033F8350J35053J4877a62992j79302H9772
8835c51835A23099J42800e3975B37468A12865m6696i718j74511A89748g4301D6575
$$ [...]
##END NTUPLES=NMR SPECTRUM
##END=
