
##TITLE=AC1355_CPIAH12174_6648218_0SZLkQtrN2
##JCAMPDX= 6.0         $$ Bruker NMR JCAMP-DX V2.0
##DATA TYPE= NMR SPECTRUM
##DATA CLASS= NTUPLES
##ORIGIN= BRUKER
##OWNER= Administrator
$$ 1.72 TOPSPIN		Version 2.1
$$ 2012-08-10 23:02:29.375 -0500  Administrator@TOPSPIN
$$ Compression mode = diff/dup
##.OBSERVE FREQUENCY= 400.02188249412
##.OBSERVE NUCLEUS= ^1H
##.ACQUISITION MODE= SIMULTANEOUS (DQD)
##.ACQUISITION SCHEME= undefined
##.AVERAGES= 8
##.DIGITISER RES= 22
##SPECTROMETER/DATA SYSTEM= spect
##.PULSE SEQUENCE= zg30
##.SOLVENT NAME= COFFEE_meoh
##.SHIFT REFERENCE= INTERNAL, COFFEE_meoh, 1, 14.98509
##AUDIT TRAIL= $$ (NUMBER, WHEN, WHO, WHERE, PROCESS, VERSION, WHAT)
$$ ##TITLE= Audit trail, TOPSPIN		Version 2.1
$$ ##JCAMPDX= 5.01
$$ ##ORIGIN= Bruker BioSpin GmbH
$$ ##OWNER= Administrator
$$ $$ C:\Bruker\TOPSPIN/data/COFFEE/nmr/AC1355_CPIAH12174_6648218_0SZLkQtrN2/10/pdata/1/auditp.txt
$$ ##AUDIT TRAIL=  $$ (NUMBER, WHEN, WHO, WHERE, PROCESS, VERSION, WHAT)
(   1,<2012-08-10 23:02:21.546 -0500>,<Administrator>,<TOPSPIN>,<go>,<TOPSPIN 2.1>,
      <created by zg
	started at 2012-08-10 23:01:14.484 -0500,
	POWCHK enabled, PULCHK disabled,
       configuration hash MD5:
       6B 1B 68 BB D9 2E 58 E2 7F 35 AD 54 07 DF 0E 41
       data hash MD5: 64K
       27 C4 FB 98 36 C1 32 E4 DF A3 91 83 07 BB B6 ED>)
(   2,<2012-08-10 23:02:25.078 -0500>,<Administrator>,<TOPSPIN>,<proc1d>,<TOPSPIN 2.1>,
      <Start of raw data processing
       efp LB = 0 FT_mod = 6 PKNL = 1 PHC0 = 0 PHC1 = 0 SI = 32K 
       data hash MD5: 32K
       A9 D3 82 E3 36 E1 AB 9E C7 74 C4 39 09 A2 FC 4F>)
(   3,<2012-08-10 23:02:25.359 -0500>,<Administrator>,<TOPSPIN>,<proc1d>,<TOPSPIN 2.1>,
      <pk PHC0 = 179.7363 PHC1 = 0 
       data hash MD5: 32K
       B6 1E 6F 48 E4 7A C8 08 AA 5E 3B 76 6F 11 E8 75>)
(   4,<2012-08-10 23:02:25.421 -0500>,<Administrator>,<TOPSPIN>,<proc1d>,<TOPSPIN 2.1>,
      <abs ABSG = 1 
       data hash MD5: 32K
       B1 CF EB 5F 73 8E 5B 67 B5 5A EC A3 C6 40 C8 4F>)
(   5,<2012-08-10 23:02:25.453 -0500>,<Administrator>,<TOPSPIN>,<proc1d>,<TOPSPIN 2.1>,
      <abs ABSG = 2 
       data hash MD5: 32K
       EB 48 46 4F 7D 42 E1 86 7E D9 75 1D 2E F3 D1 B4>)
(   6,<2012-08-10 23:02:25.484 -0500>,<Administrator>,<TOPSPIN>,<proc1d>,<TOPSPIN 2.1>,
      <abs ABSG = 3 
       data hash MD5: 32K
       3F A0 02 7C E8 E6 0A C5 0D 48 9B 9E 90 29 D2 F7>)
(   7,<2012-08-10 23:02:25.500 -0500>,<Administrator>,<TOPSPIN>,<proc1d>,<TOPSPIN 2.1>,
      <abs ABSG = 4 
       data hash MD5: 32K
       12 F6 68 AC 68 66 DF B1 2B F9 95 5E F2 49 C9 79>)
(   8,<2012-08-10 23:02:25.546 -0500>,<Administrator>,<TOPSPIN>,<proc1d>,<TOPSPIN 2.1>,
      <abs ABSG = 5 
       data hash MD5: 32K
       11 2F FA 23 E5 86 13 E0 A6 31 44 45 7D AE D4 6F>)
$$ ##END=
$$ 
$$ $$ hash MD5
$$ $$ A7 1C C4 71 09 87 15 38 DB 75 6A 4F 1E AD 07 D4
##$RELAX= 
##$RELAX= 
##$RELAX= 
##$RELAX= 
##$RELAX= 
##$RELAX= 
##$RELAX= 
$$ Bruker specific parameters
$$ --------------------------
$$ [...]
##$TP= (0..7)
150 150 150 150 150 150 150 150
##$TP07= 0
##$TPNAME0= <>
##$TPNAME1= <>
##$TPNAME2= <>
##$TPNAME3= <>
##$TPNAME4= <>
##$TPNAME5= <>
##$TPNAME6= <>
##$TPNAME7= <>
##$TPOAL= (0..7)
0.5 0.5 0.5 0.5 0.5 0.5 0.5 0.5
##$TPOFFS= (0..7)
0 0 0 0 0 0 0 0
##$TUNHIN= 0
##$TUNHOUT= 0
##$TUNXOUT= 0
##$USERA1= <user>
##$USERA2= <user>
##$USERA3= <user>
##$USERA4= <user>
##$USERA5= <user>
##$V9= 5
##$VALIST= <valist>
##$VCLIST= <CCCCCCCCCCCCCCC>
##$VD= 0
##$VDLIST= <DDDDDDDDDDDDDDD>
##$VPLIST= <PPPPPPPPPPPPPPP>
##$VTLIST= <TTTTTTTTTTTTTTT>
##$WBST= 1024
##$WBSW= 4
##$XGAIN= (0..3)
0 0 0 0
##$XL= 0
##$YL= 0
##$YMAX_a= 482050
##$YMIN_a= -632962
##$ZGOPTNS= <>
##$ZL1= 120
##$ZL2= 120
##$ZL3= 120
##$ZL4= 120
##$ABSF1= 14.98509
##$ABSF2= -5.573092
##$ABSG= 5
##$ABSL= 3
##$ALPHA= 0
##$AQORDER= 0
##$ASSFAC= 0
##$ASSFACI= 0
##$ASSFACX= 0
##$ASSWID= 0
##$AUNMP= <proc_prof1d_extract_pilot.lims>
##$AXLEFT= 0
##$AXNAME= <>
##$AXNUC= <1H>
##$AXRIGHT= 0
##$AXTYPE= 0
##$AXUNIT= <>
##$AZFE= 0.1
##$AZFW= 0.1
##$BCFW= 0
##$BC_mod= 0
##$BYTORDP= 0
##$COROFFS= 0
##$CY= 15
##$DATMOD= 1
##$DC= 0
##$DFILT= <>
##$DTYPP= 0
##$F1P= 0
##$F2P= 0
##$FCOR= 0.5
##$FTSIZE= 32768
##$FT_mod= 6
##$GAMMA= 0
##$GB= 0
##$INTBC= 1
##$INTSCL= 1
##$ISEN= 128
##$LB= 0
##$LEV0= 0
##$LPBIN= 0
##$MAXI= 10000
##$MC2= 0
##$MEAN= 0
##$ME_mod= 0
##$MI= 0
##$NCOEF= 0
##$NC_proc= -8
##$NLEV= 6
##$NOISF1= 0
##$NOISF2= 0
##$NSP= 0
##$NTH_PI= 0
##$NZP= 0
##$OFFSET= 14.98509
##$PC= 1
##$PHC0= 179.7363
##$PHC1= 0
##$PH_mod= 1
##$PKNL= yes
##$PPARMOD= 0
##$PPDIAG= 0
##$PPIPTYP= 0
##$PPMPNUM= 2147483647
##$PPRESOL= 1
##$PSCAL= 4
##$PSIGN= 0
##$PYNMP= <proc.py>
##$REVERSE= no
##$SF= 400.02
##$SI= 32768
##$SIGF1= 0
##$SIGF2= 0
##$SINO= 400
##$SIOLD= 32768
##$SPECTYP= <>
##$SREGLST= <1H.CDCl3>
##$SSB= 0
##$STSI= 32768
##$STSR= 0
##$SW_p= 8223.68421052631
##$SYMM= 0
##$S_DEV= 0
##$TDeff= 65536
##$TDoff= 0
##$TI= <>
##$TILT= no
##$TM1= 0
##$TM2= 0
##$TOPLEV= 0
##$USERP1= <user>
##$USERP2= <user>
##$USERP3= <user>
##$USERP4= <user>
##$USERP5= <user>
##$WDW= 1
##$XDIM= 32768
##$YMAX_p= 456065812
##$YMIN_p= -763740
##$CURPLOT= <Network HP LaserJet P1505>
##$CURPRIN= <$Network HP LaserJet P1505>
##$DFORMAT= <normdp>
##$LAYOUT= <+/1D_H.xwp>
##$LFORMAT= <normlp>
##$PFORMAT= <normpl>
##$SURQMSG= 1
$$ End of Bruker specific parameters
$$ ---------------------------------
##NTUPLES= NMR SPECTRUM
##VAR_NAME=  FREQUENCY,     SPECTRUM/REAL,   SPECTRUM/IMAG
##SYMBOL=    X,             R,               I
##VAR_TYPE=  INDEPENDENT,   DEPENDENT,       DEPENDENT
##VAR_FORM=  AFFN,          ASDF,            ASDF
##VAR_DIM=   32768,         32768,           32768
##UNITS=     HZ,            ARBITRARY UNITS, ARBITRARY UNITS
##FACTOR=    0.250966925370066, 1,           1
##FIRST=     8223.43324360094, -184037,      -6492
##LAST=      0,             57763,           -260524
##MIN=       0,             -763740,         0
##MAX=       8223.43324360094, 456065812,    0
$$ Real data points
##PAGE= N=1
##DATA TABLE= (X++(R..R)), XYDATA
$$ [...]
23771 98606 -214832 -233779 -193679 72373 -13239 240292 -69467 124989 -367468 -371829 -29335
23759 16601 18505 -199111 75131 -163541 -196492 35906 25869 419197 -55513 84284 -52538
23747 135921 -30397 -12953 447163 -24733 -38589 -48271 -35504 -106770 -81336 229488 65744
23735 -132555 -18240 3046 -74146 -99411 -19080 84905 58577 139027 -107580 -109981 29459 46481
23723 46481 -194030 -148898 93477 88219 72425 -131752 41822 153932 -19330 75336 -292231
23711 -84495 46075 63815 12003 430262 38200 -28595 236125 -153041 43891 219234 -12401
23699 -123475 -129681 -97950 120418 -275564 -122301 -37339 -92554 -2428 -45798 -273927 -37844
23687 -153711 -270146 167314 -35946 -81222 -20516 118273 205090 116189 -231979 -202796 -298364
23676 -298364 -41530 -36138 68976 -48344 70606 -285551 -280945 -150741 392606 -149521 117410
23664 -67040 -154599 77016 -12729 -81333 -120041 -230763 34490 -96812 30108 -88787 -162060
23653 -162060 169704 -148266 -33196 -120940 48712 79 365 -149727 -104478 -225346 -131216 -269088
23641 -269088 -308696 -290662 -315630 -16865 36064 139247 -117185 21682 -435304 188362 167383
23630 167383 -82173 -472 194036 114468 30320 -246677 -210536 248670 200489 -359596 -88658
23618 77261 111845 -54996 271637 92107 -119480 -63496 -287583 -82322 -221985 -37025 -253900
23607 -253900 310632 34358 29231 -213688 -14149 -56777 48502 114014 153117 -282209 397978
23595 239612 302207 -179131 31924 2028 -164445 152607 71096 161867 109407 -150934 -26078
23583 181855 290102 -17860 332238 -2295 114814 74626 280314 15947 75010 89519 34207
23571 -18916 154532 152331 314679 -44089 9424 46736 -265849 -108775 132730 80432 54469
23560 54469 164332 -199160 25870 189260 118985 -270004 -236364 331656 -157397 39090
23549 -344095 -40031 40367 158786 -7436 -182993 179340 -59780 304590 -233191 221549
23538 -116674 -78201 90003 -79071 -56089 180024 -149060 72456 8575 345789 19385 252152
23527 252152 -36566 -166961 175069 -198121 17302 29407 125808 423740 -5101 -27264 -300503
23516 -300503 -150292 -122259 64656 -185797 110103 -1072 162803 -63394 50190 -71153 -42946
23505 -42946 8278 -177900 169439 -40074 -127002 21511 -35246 7459 -136831 -387593 -44872
23493 143509 1656 37253 4982 -194789 250178 -305762 -106341 -21806 185283 -120618 144555
23481 -72948 -332419 -323460 1947 -214759 -94200 24543 -6672 -86172 -165308 -155302 -326882 -150554
23468 -196299 -22390 -19557 -30275 -146678 351344 -138029 98259 -269131 -110550 40328 29460
23457 29460 13619 -350955 -88311 -7865 -607313 113127 102625 19633 312644 248212 -110444
23445 -23481 59602 -2134 -165278 -354106 -134105 258295 -270470 -370706 -75525 -87973 -89942
23434 -89942 135812 -122048 -246823 2244 -62060 -286258 388285 -259112 69728 69609 -73140
23422 -59253 -10581 42943 -3197 -32315 -195913 37668 -41795 -116531 64507 6434 -348323 -123899
23409 6129 74029 -38284 102270 11025 36622 -221469 -233016 362022 45220 -77703 -414850
23398 -414850 -33484 135479 103956 134349 18952 150972 -259352 -60757 -254549 116141
23387 388983 -199095 113866 -29773 13822 299226 -68762 -36526 -61345 33914 -36312 210517
23375 306560 -4448 6108 159804 -15161 -135130 225314 356972 261658 -298404 -51032 -12493
23363 -17109 136295 -271528 -4093 -208001 211796 484834 -197984 333687 -133290 32865
23352 -136053 -70527 -18536 -79554 170504 -240635 -38909 -94530 97582 46147 -78432 -211200
23341 -211200 167581 86865 -244106 49534 -169200 -219677 -38386 259636 172104 -121586
23330 158534 -288370 209938 64287 -16287 -61166 -47171 24092 70543 -22042 86762 -179930
23318 20539 -210489 151042 -179476 224171 47358 -117252 18783 92380 -143427 9539 72245
23307 72245 213290 -68911 -299021 166717 27625 116850 -34680 157552 -194645 -276526 49355
23295 6927 309851 -462376 175733 136271 54920 -138849 -108688 -153030 59440 -128703 -194991
23284 -194991 -94937 -303772 -150330 -112103 -178407 23705 17497 146234 146471 -27023 -290091
23273 -290091 -171827 -398903 91364 -261923 -9906 -150628 -344956 -53585 -371107 -22881
23262 168348 -157036 -272538 157515 67273 -47577 -208230 -21215 -128333 -285706 -168241
23252 -168241 -178068 77931 156351 -64884 44768 -260216 67457 180058 33078 193386 -354385
23240 -302261 113832 -74734 -63361 -241341 -116172 -280300 -55256 181491 188704 -163999
23229 27555 14073 -115874 -17610 153250 -84903 181414 -240916 135180 -207696 -158074
23219 -158074 -267302 -278592 85495 -108965 166188 -234070 -2353 -237892 32852 -184299
23208 -167007 83529 28373 33553 -208846 2754 150126 72288 -94100 6502 -248942 25741
23196 -122830 -1949 24575 -161459 27052 -177277 -444767 108807 -460796 -49018 -225283
23186 -225283 -8378 6193 39026 201355 56868 180416 4797 105757 -141471 248860 242780
23175 242780 116762 95281 213861 -56273 -4500 18701 -136947 67293 -133225 -21474 286757
23163 -215112 -77994 19860 -165431 -23231 -6048 177414 28109 125679 193295 72669 46093
23152 46093 6003 -296748 126491 -88717 123520 -49834 122312 -65976 149959 249814 83952
23140 113975 -62105 72901 -65120 -204051 -170791 32970 -16846 228316 30711 114790 -137857
23128 -103401 382411 207915 175481 162440 98596 397169 150531 -147027 -188368 132368
23117 -179558 -52464 187780 314892 110615 -250305 -175331 139366 -66277 -170869 13178
23106 -224829 -190883 -43193 65319 -240678 155334 -74452 95768 258426 -126488 54122 187161
23095 187161 -260119 158529 137866 -69368 240254 -45502 -269496 95145 127198 -335314
23084 475495 -138541 -337186 20322 -83400 -458112 -403176 -295858 173312 -115478 -164071
23074 -164071 122381 80446 135216 -161 294064 -120560 -295688 119907 11398 -620 316960
23062 152153 -155501 162670 -71056 58526 233919 -299796 95112 -245487 110099 153478
23052 153478 -768 93129 -35237 195439 237518 283255 17321 -237944 45129 63724 -35466
23040 -221343 56601 81677 -98760 336101 -54582 -164284 313461 -230123 39256 37825 142771
23029 142771 77779 418325 -45629 -72591 -6489 151350 172236 121220 -77336 -60054 -8308
23017 94677 -31477 -219628 -20747 -12042 -156534 3374 38987 -8183 22419 -147668 -32130 -81749
23005 -81749 -158130 89992 16 50674 92591 -68591 319 -138143 49980 66643 37022 -54338
22992 23464 -80118 33568 -75074 74885 4110 28257 -230019 -84182 95551 47297 258345
22981 258345 219608 115079 -100930 -212780 -104011 -214111 -152749 -199187 -139427 3060 102798
22970 102798 36605 -144239 -20250 86404 -142770 4339 -219311 -392537 110071 -75556 -35376
22958 -6473 11450 12662 -69899 -3307 -180053 -73043 -458748 -336418 -219468 20140 257316
22947 257316 66437 80240 -91340 -177052 73895 -127087 -92537 60653 109840 75617 -71581
22935 64785 229070 -308075 -488839 150148 -199390 -86536 -57034 -13825 -2640 -224392 332233
22923 -104047 -126452 -187107 141409 -36567 -204362 -133337 -72946 -158656 -98048 -116943 -497560
22912 -497560 51532 80976 182974 -247876 158788 -133085 126684 -240625 -147920 156973
22901 -502 -29500 -17825 5641 157361 -115693 -195434 -328992 79120 -316442 -233795 -120278
22890 -120278 -49880 195729 48674 -285779 -153758 -175519 76709 -215004 -323383 -68773
22879 3516 228713 -131610 -73983 -77017 243840 131072 74712 65706 -39060 -239128 -67118
22867 -56752 -336394 -143987 100231 55821 -118094 -415690 -79437 -25525 -27264 -154663 -543569
22856 -543569 -110786 68308 -101344 14801 -107929 -240239 312224 -250141 63552 -239877
22845 302519 135391 292500 38610 -246974 -37111 -16518 141160 73571 37529 -233362
22834 -93384 107687 -192106 -26792 -127278 41945 66812 173297 116393 -310190 -20117 -199480
22823 -199480 -73062 -102050 -249611 50694 -54032 -244843 -144933 -277637 9081 60165 19021
22811 38407 -90421 12296 96801 -196253 -363058 218106 36925 9792 404766 75448 -420529
22799 -490513 -94398 350124 -66660 -10562 85390 -23644 -42857 429318 -113432 -148853 -133808
22788 -133808 8831 -153109 -374239 -225377 -334567 -346599 132159 25678 16026 212849 -124200
22776 -63128 263429 -175045 -413620 -184475 -115534 140682 67287 -17326 -100897 -50456 -72481
22765 -72481 52875 -125103 108567 -333960 -18787 -77973 219103 -297791 -124300 55672
22754 22178 -312982 -79309 -263 141237 -201713 22741 49658 -63116 -137534 178901 -94585
22742 -99699 -149138 67308 61532 82441 18291 -38587 42101 4977 196770 -58785 -23657 13598
22729 333487 -273190 -20268 11737 136477 75457 78698 90477 6501 225988 49452 52488
22718 52488 -180216 11089 111055 -434816 98152 3874 201136 176209 -123041 58819 435230
22707 435230 -229174 -176880 -130296 219761 -80986 17004 211356 59105 64941 -85201 357553
22695 -34149 39748 -55915 -112580 140789 -72993 39838 124588 105777 -97250 -112803 -126060
22684 -126060 133790 -31974 -164078 -461481 57869 -41059 155636 -160396 -87381 172578
22673 81304 136746 27684 -11519 113859 55376 45042 241292 129253 17115 299127 -227523
22661 75521 -97058 -248385 -25956 -142657 276424 36872 -132257 -50199 -6971 -186183 210261
22649 -280959 143369 -93794 -252588 -76969 -28846 -23145 -135507 256395 125304 71164 69030
22638 69030 -136140 -144279 78130 61224 -137070 -209870 -11704 178934 177367 -85007 -176547
22627 -176547 -115716 -193349 145160 125483 -25784 39871 -66881 -240470 -43561 -289081 79274
22615 -221884 -75349 28091 132768 160503 -478653 -266483 7307 -14911 39756 -70859 160354
22603 -272379 42714 -100201 -109571 206956 68903 285433 -218241 -296439 138111 87619 -169352
22591 111213 80163 127466 -10549 -22136 140796 -115742 68392 119471 -177925 -84159 -38993
22579 79875 -84278 -213410 -52358 282355 -226467 66948 16175 -209568 58973 -417640 238984
22567 -177513 32088 -17062 -37056 -117019 4208 -3194 42823 -150086 40432 -17095 22569 -59937
22554 151010 97595 -60370 -130157 -20108 52473 267746 -240475 203561 16284 -143337 59062
22542 -46427 41837 -290348 -334593 -85682 -295017 -64917 -74036 -35453 -161116 27486 -252259
22530 -346813 -216312 -317744 -75135 -137793 85956 -215064 -110821 -25389 150786 -156898
22519 -8664 -225211 -127220 96884 -232627 410591 9594 -87504 -97211 -237604 75712 1924 17857
22507 17857 217917 -107982 15620 -154800 -33730 -7437 -455632 -42139 -130357 11680 -80689
22495 -9257 -25819 -148263 -70394 68444 -157104 139542 -124794 -69481 -137437 -26299 -94263
22484 -94263 -47519 148592 67835 68608 -180581 43344 150583 -167800 348126 -230400 -35049
22472 104690 13153 47453 -230028 -92189 -40129 205181 265416 -66050 -186579 -367396 98754
22460 -13461 -26052 77940 -105622 16881 -181822 -49839 -135394 -6778 89514 -179613 -195477
22449 -195477 -195615 -450894 -356827 -123492 50771 -197907 179789 -142338 -172361 -109125 55215
22437 -227641 -73763 32620 -158895 -61775 24259 -72108 -181383 326687 -114553 -115401 94047
22425 254452 -77559 -166530 -113118 69704 -62347 -23000 150071 -146797 -35023 -11112 153154
22413 26219 -306830 -201942 -46295 312494 47516 -147726 -299032 -394906 231827 -513114
22402 261675 58827 145548 -357551 -22089 102899 -255396 38615 -7694 -18385 -6612 404295
22390 -355338 -65959 253893 88661 -133943 -5239 85700 -110336 -47019 -225822 248751 -7395
22378 175273 -404816 -358216 167785 -374102 -62594 22780 -5183 30829 -89400 30030 -19560
22366 57674 235330 -165112 -35621 -96532 -8584 -82415 65596 57928 36243 -116998 -255419
22355 -255419 -70895 127129 12818 -25201 -401095 10914 212922 -186873 15084 -101770
22344 -418010 35013 -181616 -180215 55420 -461936 -196472 282844 29809 22455 -116510 -59758
22333 -59758 -20280 -57501 -369531 -97744 31333 -372904 -15324 38444 -5669 180775 -63118
22321 181806 -101730 -264855 381463 78216 -69870 -215889 -9689 100571 -115993 -37730
22310 -125400 52266 -11629 -255537 -193459 -5024 87054 -466892 45675 111315 -202755 -49947
22298 -283282 58829 68572 46187 -34995 -223989 41149 68459 69873 -273115 -71469 -226258
22287 -226258 181062 -96361 109718 -142176 15246 128849 -94117 260285 -102283 78768
22276 4778 192818 161055 187021 -192598 -163914 168531 -325545 106464 -100169 -323133
22266 -323133 -216218 -152137 68461 -3932 195690 -35819 69243 340897 175665 -23505 -104505
22255 -104505 -177337 478966 -252135 -22882 137657 44635 308676 -158763 155152 -134135
22244 68309 318382 -17694 25600 -228705 50405 -151518 -22489 57897 -1054 -14938 -26655
22233 -26655 113343 -152905 13765 404381 -51862 204649 -204341 -148643 -172632 -74234 -47915
22222 -47915 23859 53709 4331 -31969 -334107 -203472 183028 -178768 -158891 -110364 -308746
22211 -308746 -102903 -933 -161612 9401 -41517 79361 -147034 -11407 -112041 -167326 -173218
22200 -173218 53936 32793 -128082 220508 115009 297237 -75069 -228794 -66872 -357015
22190 -357015 -136951 201976 -256762 109318 85145 -296763 211166 -187498 27453 -125765
22179 118026 174688 -79935 -676 -346990 -82482 -314026 77067 -339928 -325133 -400862 -255328
22168 -255328 -105191 -197335 150679 -192809 -39970 74495 -178525 204002 108840 -57702
22157 -146574 60787 191919 -188608 -137140 -358965 156552 117677 -150211 15931 -35502
22146 -157570 -70420 -96371 -17453 73872 -242358 -484372 117422 105022 -35995 12273 59594
22135 59594 -92358 152556 195884 -20061 -37085 182721 58118 -51863 -295186 -410121 40626
22123 -172453 -214887 -357074 -237038 -46956 27438 -16360 31710 -62155 -70850 128157 -102078
22111 -249193 -212214 -58546 15769 -252192 52882 -115421 -41392 -123983 94951 239795 -28376
22099 -137272 245940 -8724 -272404 179720 -79239 -91453 -16583 -87503 -243450 -35827 -34960
22088 -34960 -171708 -106292 43159 -272345 -233902 -272886 -174630 124923 -193887 -181851 58555
22076 -114181 94521 -82282 -17031 13325 -45612 196892 203127 47342 -387987 -112976 12627
22064 -60666 45815 58716 -13503 -223424 -320030 -37201 27784 -21863 -120785 124668 -58696
22052 -79739 185604 -62415 197352 -309649 111552 -13124 -60827 -210582 59845 -160887
22041 49615 -148683 -621 24937 -242575 -340607 81921 -4394 -159475 -49651 9224 -206009 166181
22028 -90570 12706 129903 -126215 129234 -234950 -94988 46818 -404281 -18077 -122637
22018 -122637 -9453 -164910 -299568 -12476 -155787 54124 177115 -71045 -28649 16454 16161
22007 16161 -198327 245218 67208 -254881 -109807 -424107 10779 -179376 -11343 -261604
21997 -261604 -213597 -137176 -175399 -97077 -11648 -7356 -169843 -178117 -525442 46210 206035
21986 206035 229446 -41454 -176462 158765 -39023 -102437 -258435 93823 -47641 -442512 -298222
21975 -298222 -347234 188585 -194404 -110443 29007 -161172 63059 37596 -82924 -14446 83395
21963 311008 49357 -33730 34798 290294 -19970 -12197 -71427 82910 119849 -25147 40983
21951 176030 -35263 -104167 142123 19359 -53621 245212 -140740 -122274 -493304 -173924
21940 -148183 -3585 42002 -121138 -48070 139643 -172039 -230664 -292266 284369 419418 -127241
21928 -116058 -233527 162571 92076 -407531 142018 -52565 199217 44581 -283649 59371
21917 104934 -96392 214457 -193503 153898 -68180 140059 -373121 127525 133262 74058
21907 74058 -260073 -112604 -144244 88471 -140165 -203630 20022 -358224 -161383 -224665 124586
21895 -238559 -39811 -148657 153436 210999 -37092 -444559 -129656 -29802 -285788 57182
21884 -160993 -91865 134004 -153366 -64195 -185548 51809 110221 -19656 29835 -62643 -127706
21873 -127706 -25797 243483 52181 -404248 -57744 -27053 159755 26820 -2465 -108615 8444
21861 -101435 -196105 51541 102268 75170 -213398 88136 -148706 232772 -65312 -165596 57025
21849 -137221 -191963 183375 -342040 158427 77949 -80899 -138881 -214755 153229 373700
21839 373700 112595 -91211 122542 239505 -195902 -390844 -182904 106993 21351 62644
21829 62644 14300 135384 -82613 169759 -351600 -245737 -93840 132699 -335446 -29455
21818 -47233 -247680 -22531 -151299 2269 -2625 257813 -18766 -138390 -240408 4767 -399538
21806 -239842 -53848 220178 5866 208156 -60830 -218230 -242529 -56124 -125489 -27647 233766
21794 -133514 27653 -200284 -24842 -99609 202515 84075 -13958 -28714 -137799 -14863 -146366
21783 -146366 493434 -2412 -291810 -143501 -357414 -373831 -21139 -8896 92386 -73303 -221358
21772 -221358 83620 -144237 249863 11989 -459 -95617 20126 -190714 210435 54901 -98611
21760 218208 -8931 -135010 17560 43312 336951 -160195 159370 -75492 -26191 219234 195740
21749 195740 -64947 35479 -44505 285403 -341799 -74737 -27621 123820 108026 172853 -388754
21737 -6354 -90805 174758 -30751 7791 -277882 -23831 -48417 -293029 163850 -96576 -21456
21725 232373 154104 -83300 -95386 -310207 -55048 45261 -43036 -22436 19556 147811 120647
21714 120647 -90924 -158081 121697 145137 170371 -253111 288045 -341055 45747 -155297
21703 178819 -21056 -295872 -82724 -80600 334485 -60620 -114206 -84112 -189514 75549 -94325
21691 253703 -232406 -298069 -51185 -190042 -167150 121399 -133607 81182 5770 6294 7234 -220154
21678 -406553 -471195 37622 -364737 80906 96924 -145521 93670 173404 -68670 -26384 -132205
21667 -132205 -72776 146137 151755 19338 -327661 -98062 -15406 -303663 -82598 -47007 -211077
21656 -211077 -97855 1263 235418 113482 51038 -123257 -140125 -249968 -75219 222610 -161142
21644 -61610 32551 -48261 253778 -277433 -168330 74741 -108923 -18152 -210072 -271067 138052
21632 -34516 16684 365146 -329320 -174273 195639 95061 -40293 -397830 102520 120988
21622 120988 18709 -167018 -94191 -331472 53060 -87658 50043 -175204 253961 -222826
21611 -13555 113839 -461878 -37135 313091 -145961 -91457 -93521 125208 -122196 143598
21600 43527 6563 -115795 -181793 -157992 -189591 -140378 -374940 12252 164355 123029 -181463
21588 -52285 23926 -168989 -358678 4937 49651 258765 -3571 -43826 -104492 112286 203583
21577 203583 -46594 -114364 -263083 -178198 -161342 72515 -48069 59245 -197270 -87716 -147563
21566 -147563 210164 -326033 61999 -42313 -70130 189420 -106631 -13772 -134626 192222
21555 -174305 133770 -103384 -4633 12118 -125714 179891 344588 151967 -99250 -121249
21545 -121249 -245725 -112692 204875 79025 -36452 10056 -205799 49009 -304530 -72986
21534 152128 -105804 -141458 -79219 -43344 -42067 -217570 -140913 -109511 -7195 110169 88536
21523 88536 92243 -112019 203448 -127358 -46786 -296816 -120316 103470 -112742 -187396
21513 -187396 157957 -127838 -112429 68002 -194018 63009 -328615 -71004 68070 -123971
21502 11683 -191229 -324176 -333494 57125 -65908 -19253 87332 -313064 8990 29974 -26993
21490 -274174 -263595 144680 246404 -29149 -295811 -9859 46855 -541908 71175 48113 -77811
21478 -224948 -158630 98226 -163333 117758 -146465 111615 113878 15959 -149775 118846
21467 305296 -118868 -150177 65704 71968 -248411 -58012 -243092 -90234 -53742 6912 -139668
21455 -141114 -41252 -87601 -162408 145831 -261485 -332277 -221343 -262180 -86970 -49122 11285
21443 236413 -108385 -228430 266290 60541 103642 25393 -81188 -62650 387135 576682
21433 576682 305307 373318 280685 179984 -107232 -51283 160443 132920 102087 -138775
21422 152848 38829 -395156 13092 -273 297960 -321282 -212815 -231084 -62155 17984 220156
21411 220156 -199718 -139399 -149819 -279773 -349842 112015 -248804 -20886 93520 -262531
21400 -309301 -25229 -224770 43070 -25921 236816 33910 310346 197034 151524 -105687
21389 -109737 7980 -240212 377954 -352192 130436 122641 -151514 -94195 120233 -118005
21378 -10728 -331620 117928 -39064 -24586 50639 -118294 23420 -68796 -275038 -141026 -109600
21367 -109600 -119175 -100205 194656 141609 -209105 -178334 51614 -101434 283884 233071 -36808
21355 -91730 -65916 -28457 -111555 -174133 -403042 -12449 178748 47937 -255213 125570 -243137
21343 -199014 128549 31982 -202944 -52413 71707 -144401 62862 -136836 147933 -181388
21332 -67910 -102407 -248410 133162 -185974 -250808 10822 90187 -72412 -205028 -144251 11932
21320 72314 -165997 -123203 -134070 -161800 -24483 -220920 -86670 100039 -51039 -270870 100862
21308 216633 -353823 246807 57449 262543 -7868 207640 65127 143781 223114 -145398 138326
21296 340877 -159619 43617 -271691 17459 -244061 -60750 -268692 -52292 -2292 -80684 -7146
21284 -363546 78453 -317159 -296437 -64002 99473 -76408 244785 30020 62593 -54600 -345368
21273 -345368 -148819 -145154 -17732 -57161 -32745 386667 248961 -175073 61279 83303 -13286
21261 -140198 -240330 250642 22012 -223720 -146367 -122700 -2893 -250967 107708 175066 1117
21249 119237 -394297 -98972 80397 -43316 -107446 -445114 -237585 -243546 -38463 54154 -3050
21237 -243866 10690 323756 148335 -7163 -220387 -37989 7781 -118467 -84128 -312941 62505
21225 152984 -322817 -22598 75113 -323140 -323126 -151680 58919 -44271 -154338 -35129 -240365
21214 -240365 -253831 11144 260049 -106888 -210889 -52996 -43215 115203 95359 -116598 -298735
21203 -298735 -91458 448487 132189 -148222 -105304 -196685 39000 279578 -23385 -84394 24732
21191 -240138 -258351 -64705 -392448 -7576 -204667 -43312 87842 92868 -29942 -53669 -107904
21180 -107904 8365 -110205 -295624 -33645 193302 -67977 -75993 -26876 -194469 -92975 92295
21168 39572 -351620 -254919 -198468 153458 -344177 -290626 -114685 195652 299306 176688
21158 176688 -338765 85713 -31135 86097 102980 -162335 -86289 -76250 -145494 3392 -25086
21146 76455 -23218 -222745 -276075 -13620 43062 152663 266426 -200881 -162047 250702 250974
21135 250974 22768 29719 70536 139089 -106342 -26199 -524742 285126 298628 -138790 -109767
21124 -109767 -113756 106249 166531 -183544 9976 -533760 148168 -369660 43239 -117910 -130952
21113 -130952 -250290 -80093 219837 -6261 -181094 116647 -119382 -91556 -145 225275 -69726
21101 -361641 412830 -18173 -42626 42929 182543 58415 77449 -178454 -25760 30492 -230902
21089 -4186 22463 126858 4537 -313404 -103355 239197 -55807 -92211 -110144 20266 -243502
21077 85199 -210325 1284 -16352 -36753 -199120 -144534 -94565 -129754 23912 -323864 -353964
21066 -353964 -326946 36213 -97130 43601 -279916 -14721 -281075 112100 -37282 -135955 396667
21054 -199247 -65902 -127511 72752 -3377 -187785 164224 -159303 67201 -181935 -105391 187926
21042 16203 80877 57841 104541 -62462 -149443 -186639 -277067 100251 -34643 -223688 311543
21030 97006 307926 -262296 23111 -9911 33489 105806 108819 -265861 -186223 218539 212856
21019 212856 95481 8398 4887 114642 -96888 -91580 84613 32103 -77895 -144470 79670 198627
21007 198627 250074 627394 512910 368566 263845 348804 265840 140114 -245944 55099
20996 158827 -112554 229053 -313950 -254117 116966 237290 13984 -83374 -89934 -174973 -170911
20985 -170911 -100878 -129270 81670 160754 190388 41915 -350234 -39339 -323118 -225256 9372
20973 119061 -153850 108856 109077 -249198 -83586 -109611 -26878 162342 279112 45712 -38808
20961 60236 -186666 54565 -200877 -298267 201161 17194 54125 -9310 -174716 -61968 -230338
20950 -230338 -185814 -348187 -189663 -84020 203850 47944 187731 533328 17603 137271
20940 137271 257221 368242 206661 384 36489 -259822 13829 -264757 -153937 125886
20929 62552 -24204 25156 -214934 10827 -11786 -119113 9129 41292 -125327 -196544 138129
20917 155963 -36811 7398 98054 105171 -224989 -145897 141607 106935 187376 -170525 92098
20905 238923 -26957 38207 31698 -53171 -151286 148874 -245711 143317 60740 -294776 151531
20893 -22726 -130219 -238900 133405 -11521 177695 24417 151202 -75526 14529 75652 -62810
20881 -74623 -78349 -299473 -315927 78529 -181979 -225982 -178053 117832 335618 64175 16429
20869 -221024 -378184 185908 125967 -142794 298717 65650 -156946 -99365 4992 16790 163123
20858 163123 -288695 -39187 202570 61105 192655 -164091 206666 -15765 96883 -506494
20847 -69473 -15962 -669467 51595 15367 -73937 -231949 -233927 -170698 38477 -207414 -236753
20836 -236753 -44558 70231 -243693 28046 -157151 -23330 123704 -69062 64814 -118844 74175
20824 49697 -181533 44258 -292351 129885 -41158 237823 141615 279152 -185106 -121195
20814 -121195 -219410 45159 2573 -102898 84191 -434941 -13248 -218461 -265217 -9619 -192668
20803 -192668 -298473 -220328 -208946 -55296 280103 52468 -97054 -18468 59579 -20083 -330425
20792 -330425 251058 -34962 -250712 -480718 -69543 -329016 155691 -13566 -55940 127927
20781 -40008 31691 22654 51880 -33592 -53943 -98266 -31071 -64626 -4886 -111302 -99436 -78362
20769 -78362 -206630 324167 -215791 -131349 203174 -135174 -344889 -2956 -305875 -113615
20758 -199853 94705 -143543 6760 153984 -14923 -332337 -252575 -667901 -346121 201770
20747 -169819 -246476 -60897 67746 128394 -149108 -149442 -201607 5876 -257891 -64383 -43311 63055
20734 -145828 -154217 98146 -226109 -397243 -183624 144870 -219510 15937 237734 95811
20723 64291 34318 -424974 53205 144447 -169730 -105979 -36040 40888 -72399 28805 12937
20711 232128 33367 131731 30700 -140238 221747 127595 -169204 -174715 397711 -11969 15408
20699 75782 56131 -308129 -128419 134356 218427 55582 128146 141819 -65322 8404 96555
20688 96555 37323 -244155 -150462 -304674 22581 -182792 -179731 -170230 -158600 69190 -27623
20676 27743 -1725 -273765 -117912 91512 58397 -11099 164751 87961 52540 165939 -268545
20664 -147660 -66830 172492 -197989 -55290 -253359 -134932 44772 -27320 -210773 -246597
20654 -246597 306750 -196815 -113328 -199984 257254 119108 -3096 50226 -81832 36671 -49777
20642 281890 192644 -195538 -163920 63477 -38048 -233980 -61147 -423147 -120455 96837 -290123
20630 92955 -336343 68035 167227 55718 55627 -4000 -278209 -91219 -365753 89147 224012 -160579
20617 36206 143705 -76931 -257504 -66063 -185532 -44128 -158803 -75473 -182582 -60446 -132595
20606 -132595 -87497 15523 -190720 -342360 -404587 -204564 216549 -146545 207281 -187313
20595 373355 59548 -142607 -145725 -8167 152471 -195084 -329559 11124 9654 157804 -406163
20583 -5421 -267771 -7384 68748 82554 123255 -141367 -88280 -35172 129415 171867 94572
20572 94572 -103214 6263 -137942 -244149 14024 -266206 -57739 -20527 -112818 58837 26533
20560 -292019 -524029 -379360 -191791 -171495 -27118 -156811 -187328 204023 -187130 -93717
20550 -93717 -51557 -384837 -178731 210616 -48286 6697 -202857 -17316 -53822 -81554 -27670
20538 -75749 203965 -219744 -161354 -325669 33924 -17676 -90941 -83981 234491 -62757 32689
20526 -54183 -432688 -197318 21378 -349580 -19190 -362485 -13925 320361 -156181 -12190
20515 -194880 -52395 -125066 -175696 49647 -117434 110301 13894 44215 41666 -106838 136200
20503 -238264 286989 -55642 26165 200988 121768 -438738 -169460 -222510 -79391 -37580 25430
20491 199221 -211461 111141 -90671 -184333 -25517 -209463 131511 35408 -36898 -166103
20481 -166103 -80627 164039 -230961 183197 204157 125853 -179499 22587 -192672 -42825
20470 67533 -195906 -518722 -274321 -333170 -43582 165535 -219253 -160702 -34286 250491
20459 65813 -16770 164434 -250930 -11499 227564 228925 -103470 64890 -283820 112207 -16749
20447 254041 39499 -140040 45197 -4543 -380151 -112380 -341297 133827 128282 132002 142751
20436 142751 257519 91550 148559 -147912 -83138 102030 -292032 94259 25501 189626
20426 189626 -65076 -400705 -79851 -49044 -194932 -417222 -65413 24946 33992 -131990 -274877
20415 -274877 156231 311337 -13961 -214914 -45122 247941 -61455 146654 104278 -154629
20404 82271 -149916 -118817 347026 102680 -52169 -26321 -360550 97511 -158967 20268 -81129
20392 -283951 87242 373 -25869 222198 -124507 -269883 -48478 12034 -186994 -35833 -33295
20381 -33295 -183120 -155698 -103066 -218571 183411 -139353 55045 -120407 187240 106427
20371 106427 -187446 302147 -253864 -243596 -158175 184140 -106076 -203623 -99322 -23968
20360 -205905 -135094 -288198 105561 -116607 358818 140924 54425 125372 85861 234804
20350 234804 237413 -16916 -24708 -83907 -440760 -83442 174164 27539 249877 101653 -315203
20338 -354573 237136 130252 -271576 -43053 -317058 -46253 -37204 -204775 -259151 -92992 8898
20326 -221588 -125779 203253 -508 -82191 -106151 257933 -51207 134515 132138 -306302 -93424
20314 -288514 144450 -156760 -14228 -425818 215539 -143588 -102934 279527 6128 -144045
20303 -506777 30936 32762 -320992 180336 -219793 -172384 -283431 59728 216874 160183 -209863
20291 -202321 99210 -203896 183540 -101822 56514 -62720 117242 73940 -277889 20730
20280 125477 72575 201293 -143568 -155086 -162479 -222344 37509 55905 -195216 -221902 -15900
20268 231398 -267647 -41352 -21770 -171109 19385 12682 48780 -309319 30567 -40458 -24919
20257 -24919 -150035 -98717 275713 15787 -124714 -7588 -8246 196956 -369909 176754 -112505
20245 -226215 -237721 20045 225584 -364079 -38829 -69280 -101060 2444 -354052 24790 1858
20233 78279 -15515 -124115 -182935 -79249 -365925 -197808 -58467 -64084 -312562 139835 -186003
20221 -460397 -200409 200758 -66500 -98025 244168 -181523 -104394 -85158 -25398 217021
20210 77664 30854 108679 -302259 136168 6720 -38975 -40284 -75672 111442 -91284 -391460
20199 -391460 -192852 -207764 -1305 -28594 207772 166240 44295 -122236 -14373 375016 -124585
20187 -572339 64241 -1277 -511810 -158332 230163 -286973 -213309 131846 437326 111656
20176 -22305 172122 -189992 -186322 179200 -122291 43755 -206261 -160208 -135145 -161210 104325
20164 96624 -69184 154517 167707 192408 83906 253551 76182 198871 41838 102064 134228
20153 134228 65329 152698 65589 40507 242128 339643 200428 392029 263787 364185
20143 364185 358058 284764 292487 258705 319365 364463 169844 653646 495384 607334 13370
20131 64272 -124960 -87588 -9266 332006 206152 -141766 -498531 -246392 -49915 -14844 -273318
20120 -273318 -44079 -194539 164929 -22000 -254818 122290 -312493 -222835 154738 -39831
20109 -172061 -248563 -308557 -8813 15828 226678 -215103 -30026 -114820 -142741 58071 -75150
20097 -117303 91162 35970 136732 273307 -244538 -60313 -19930 -148604 -209843 -261477 143572
20085 -56879 -32555 -35148 -182690 21318 -234245 -15758 -127585 311325 -7423 -229638 74102
20073 81254 137590 -73373 111213 -99062 -339677 -27974 -436 -212674 -165552 45253 -171794
20061 34901 -167886 -33892 19154 129174 76338 -137338 -304661 -169305 65955 -9149 -52577
20050 -52577 234397 246551 -163873 -759 -84894 90994 97680 113204 -169890 72034 -143499
20038 -271660 -233714 -150984 -125027 312524 -199566 -19253 172285 -488898 98573 291733
20028 291733 -96969 48364 -107597 206398 -80761 68620 -131833 44800 -62445 -290645 141342
20016 -14311 -5519 83055 -182743 -51631 -160349 30806 57196 55024 77354 -123994 -251672
20005 -251672 -168344 265619 -363206 171576 34239 -83763 -44703 -196200 182579 202103
19995 202103 392078 161121 205874 18115 192306 131649 171458 334967 131113 397728
19985 397728 355105 -198820 161149 -32656 105430 -294078 303174 -37487 308656 162983
19975 162983 -142926 136312 28809 179574 -148264 -64501 -109441 28159 -87121 103567
19964 143262 -123832 -76696 421850 69814 74175 281822 74321 67475 66269 -6539 349853
19952 -85590 329667 74201 303751 -171443 40072 98517 -23459 -137598 -314148 -48490 -269022
19941 -269022 -65468 277673 -112754 -122986 -113457 232642 -333477 95958 -299169 -295185 429681
19929 -225845 130922 17435 -63253 -40291 -121832 14643 -3468 -335977 -151683 -228474 177140
19917 -173514 -129598 33687 205973 5058 328162 -31825 152083 215930 149135 -237513 -244369
19906 -244369 -264513 -184778 -139283 -14507 35441 -25402 -386949 89574 -189247 118804 -73790
19894 -96950 -183447 -20413 -77771 -162292 -108141 60090 -217977 -223934 -11363 110752 13660
19882 -152436 -132172 155652 109097 -131575 -143446 -257406 -113830 -144319 -214530 -212187 -253261
19871 -253261 -302394 -110667 -44226 -211792 -69499 94771 -307792 296233 -99639 -187096 -267613
19860 -267613 -144053 -304823 -276857 109246 -126887 281206 -191605 -74419 -151607 -385681
19850 -385681 -253175 2830 -230113 -514549 -180257 -183919 107823 -344591 30205 -208685
19839 -81689 53433 -153527 75729 -376128 -161587 -143398 91955 25953 49367 -3594 311901
19827 -17090 128541 -113981 -382968 -56507 -128527 57295 -169347 -136724 139562 -61901 68432
19815 -206832 -112791 -67803 -354258 101695 -73055 -44594 -134466 124173 -455180 -162478
19804 -95470 -16193 -75589 200944 39448 42899 -263014 131886 11051 90826 -185720 -69419
19792 217499 -203408 -27072 -139041 207512 48604 -131911 124339 -150203 97536 77006
19782 77006 -14693 -163837 84025 -15569 -282348 -115999 -155543 216234 -324697 -330581 -30143
19770 -251129 -175139 -129313 -69804 -48723 -69932 -23984 191234 421793 -438723 -150002 106659
19758 -142813 -177376 8468 -121219 466700 104214 -299788 -274793 216948 -136144 -102832
19748 -102832 -224433 -47708 -25841 -53846 -113245 -78053 94232 196941 -70239 126498 -358785
19736 25807 186596 62555 100439 41010 231413 120904 90822 174899 687761 354586 443791
19725 443791 407901 -80097 81718 -85764 -207826 2728 182145 38947 -250705 72417 288550
19714 288550 -231437 -68765 390912 26413 137523 47636 -186700 269395 -94889 104602
19703 -77122 -188951 169567 -3816 266990 93995 408664 299505 515366 113871 540360
19693 540360 219672 -17517 -55491 -316981 -243052 19799 230210 -18832 -50815 95186 -80545
19681 -384851 59462 -175276 118952 90197 -92648 -322747 -214256 270369 200673 -186690
19670 -93299 2410 -254207 -215079 219886 25549 -540835 -58180 -108452 56478 -93708 -151068
19659 -151068 -24481 -324169 255863 -83831 -118716 -42108 -81501 -87998 11090 -262766 -130131
19647 -283830 -83320 -22316 38117 -9295 -37999 68385 -39706 -69757 -66697 26970 100117 -277914
19634 -37185 -312322 -445098 -168169 -84795 -150970 -122267 305365 -165464 -53432 166276
19623 -253832 -81366 -262349 -313660 -94634 -44129 48626 26160 -94214 68339 -296536 167965
19611 125873 -236758 -67503 101356 -279875 95511 -122511 82143 95936 118625 5647 -192207
19599 -280622 -198997 411636 -229142 -363691 113547 -326502 -228788 -248872 -255237 -41402 12249
19587 -160612 -193554 103326 -302321 -59595 90153 -459891 -286224 28107 -84492 -190128
19577 -190128 -111857 -133243 -94720 -110361 117249 -240525 -147996 -109513 33254 -105604 284169
19565 -212663 114845 -48950 -316550 -80833 -42437 -107228 33175 49310 -257704 -78711 -207938
19554 -207938 -267798 92055 -134898 -396886 -468952 132913 235758 143009 519080 189399
19543 86611 80524 -21969 -13634 -260734 -281423 -249888 -167915 339729 -90821 -27412 -115939 8844
19530 32057 -37441 48416 26183 -70226 215805 162136 18913 -191632 -96197 -73888 61502
19518 252737 -149502 98980 54043 -429978 -3618 106952 117259 72452 -26998 90437 -202117
19506 -254538 -239179 -102136 -246125 -293070 118868 219809 39769 -121606 -102792 -242999
19496 -242999 209932 92030 -29100 -23704 48360 224138 54275 -361592 47930 -187820 -54425
19484 125394 99201 210882 -425 32508 185240 -169880 -537739 -19973 -172092 93451 -411916
19472 277528 -65470 -121815 -294248 -149701 -444276 -79920 -210405 -47398 -271232 -47434
19461 -44537 38635 -195195 25404 -117941 -242652 16789 322331 -41382 -229567 149763
19450 -124363 57076 -84656 -226663 189518 -19017 22433 -85198 118102 -498 -83774 80927
19438 -21765 98171 -176606 177399 -32256 -313120 -85699 -49117 155992 -66668 -218852 142486
19426 -282423 -188364 -250262 -54086 -366728 262054 133690 -395482 232423 -2895 -4068 221322
19414 70601 -62982 -212369 118876 -396943 262162 234036 -93588 -200254 103561 -44609
19403 351078 -486061 -126607 -180633 -268020 174229 -86857 182620 -200259 -240171 -100256
19392 -1630 -128246 26446 -63940 29761 -31740 -238914 -145405 65831 -181505 -73796 -61645
19381 -61645 -74242 6017 -103847 -104121 128055 -304081 -111846 -92284 27894 -145117 -214394
19370 -214394 -18241 49511 78288 -174779 -236610 120773 -31321 -98584 -8327 -128114 -190494
19359 -190494 -332139 193794 -288470 -147297 -141844 19496 -300426 21067 -13591 -103869 -64947
19348 -64947 -275473 224113 192942 14870 -205570 -41395 -28727 -73445 42039 -437540 106793
19336 -122870 -116753 118106 74733 86792 6072 -229991 -27002 -118458 -262818 -194908 -79260
19324 101966 37052 34133 42345 80127 -134894 -91890 294534 65751 -156914 218554 128869
19313 128869 18091 160422 5245 -107864 149674 -83503 -162348 100490 -276830 -125262
19302 204051 -94786 -183158 87307 -110226 -489593 -111714 -127865 195735 -175470 -162309
19292 -162309 76707 -188203 106169 -320736 -139891 -235852 35176 -258768 -68242 -51564
19282 -51564 69609 -197181 -197441 -133672 17652 -223314 -56203 47318 -130969 -210273 -248833
19271 -248833 247466 -255591 -199927 -60902 461285 -87984 113187 163487 86620 43078 13386
19259 85202 -318104 168676 152491 -231683 -313079 45419 -340190 -277381 -280006 -87185 -287492
19248 -287492 345433 -30923 8744 -185859 220633 -71473 23299 103172 -132435 -19519 -31457
19237 -31457 108960 -234212 -286731 -187164 6258 -84137 -62876 -7916 134173 -173925 -84628
19225 -304284 -61053 -72005 -278 -382019 230449 170381 -11014 163553 61388 -269154 -225654
19214 -225654 -45458 -290774 -235254 -134590 398581 143060 62100 374488 108444 38615
19203 -218719 31201 -353122 85876 -335558 231740 -257819 24586 -288472 330368 -276633
19192 174548 -225548 302509 -36519 -128647 -126917 255157 -181586 -247577 7993 -261026 -296128
19181 -296128 -161537 -46520 -44235 183868 -198344 -253577 2292 -289889 176237 -307362 -4017
19169 173622 -29448 3862 62990 -30139 165131 78460 -311731 -31802 -250635 -137866 -43764
19157 -178495 -209210 101023 180686 88384 -186749 138828 29414 -236292 -216097 125535
19146 -217570 -69546 76208 -233244 -114866 234416 -90223 -408567 -218203 -153345 -222545
19136 -222545 33167 292665 -71586 53272 -184404 -332833 -329711 -205734 33361 -308281 117157
19124 -35599 -60082 -18243 -159834 -259661 -377902 -14344 -22884 -182096 -184238 30496 -109892
19112 -168345 95668 189937 -111795 -264197 -97139 34992 -119743 -183298 -164620 295830 287006
19101 287006 43805 108411 -160818 -145664 -109361 -433135 71418 -68883 -332551 -79536 100698
19089 -43356 5 -235481 -183601 74606 105026 -134202 90340 -50787 -118736 -29453 -58453 -111032
19077 -111032 193111 -177207 60583 -325502 96450 146331 -64378 -58083 83471 -372587 144247
19065 33553 229398 59280 255498 -321767 225344 -19598 130869 -149805 277740 -319029
19054 -42359 -199359 -123720 -104596 -121015 -85970 -30287 117457 -72129 -29417 -132150 58320
19042 45679 -81919 -280711 -41666 -215729 -435791 264303 91579 -214082 -56915 -206904
19032 -206904 -78432 181234 3912 197082 213665 2497 -224600 8114 -57872 172821 -6848
19020 480838 -56958 146533 124670 183978 -19239 -102014 -40048 368749 -201672 -27719 287788
19008 -242694 448316 45966 247601 -271768 94808 129763 -342734 131447 37652 7298 66816
18997 66816 -186198 -94663 81497 -54366 194662 -44630 -196571 -13110 -65392 64272 31084
18985 -265177 -79786 -101303 279233 111855 86734 16270 -81519 -137768 -117605 -123787 -302429
18974 -302429 105005 174019 278496 354384 221583 442502 331322 79052 113641 130831
18964 130831 -244572 -263263 -17243 -209006 -440789 251957 292840 197595 77806 -56679 62779
18952 -90031 -122778 -163723 -171625 25084 -80354 265760 -248014 -54661 -185581 -176030 -27402
18940 23031 1934 -115244 -70900 -46533 4851 -61822 -7385 -10178 -45165 165717 107346 -5734
18927 -324704 166693 -384176 361805 -130477 -146644 33747 82870 -82447 1735 35582 -188717
18915 73822 144996 -139086 52328 -20109 -368945 42684 41666 193495 453098 519989 21318
18903 165335 103223 74121 -328770 50531 -293509 -108827 -152890 100139 -26114 212376
18892 -50120 -138890 -93277 -109045 177460 -554090 5442 23189 7660 37871 -212242 -406730
18881 -406730 53165 130488 -74439 -142848 -149327 -148212 395928 -283222 193780 -22997 -278133
18870 -278133 -166529 -194659 -344330 -157041 -62370 -156428 -280068 239423 191512 -202789
18859 -17523 -329455 139815 -85202 -54585 323464 -156748 59285 302474 29509 155279
18849 155279 -6333 119574 136036 -71767 101249 -213108 -41467 -21086 -124114 -21366 -17042
18838 -17042 -115588 -205216 -111867 15384 28828 -241957 221287 -317830 -198215 251768 329521
18827 329521 61933 -34151 -11472 -339630 31703 -265626 -37041 107125 -118101 31916 -48883
18815 55078 15103 61741 -208514 200040 -68227 -322097 196175 291039 429948 138308
18804 359310 -247583 -232026 23494 -336290 -155542 -59678 302095 -274895 127792 128106 -71435
18792 212474 -129785 -529712 -3964 -61314 -161602 -261260 -152550 298687 -272268 48181
18781 -305017 -54204 191517 24265 -121872 107171 321678 -31264 102319 36862 -32881
18770 169332 -109838 -30263 -202249 -275605 41104 40424 -117074 -89079 -190156 266674 204730
18759 204730 -395586 -116829 1873 -261049 302518 -24118 306905 -67472 107838 -39858
18748 37025 222339 -153393 383422 -81651 -131948 99805 -44886 -297905 14395 -272619 -119046
18736 147580 -77097 253891 -129028 -165105 160000 28880 -173355 34369 32359 -41752 -264002
18725 -264002 -51324 32056 33764 -99095 -26209 136075 -133358 -167629 -262224 16351 -32995
18713 -199468 -64755 -255264 -543 -91659 166368 -578340 -636669 -121785 -83268 -158991 -190734
18702 -190734 -171351 -70186 -138130 34093 -100639 -344497 347082 352193 127083 -143960 192392
18690 -111804 -82568 164647 219950 -187142 44180 -32205 63401 70301 -117510 -97324 -49745
18679 -49745 89301 -70059 242225 135 14876 -15979 65573 249735 -29647 59624 -4172 -57426
18667 -57426 99 -206353 -129049 131161 50777 1666 -265491 -172227 -87558 -10639 -294757 134061
18654 -124481 -167215 -125197 -107248 -94818 -49816 -74459 -167865 22908 -13337 -169790 -26160
18642 -210401 -142390 -90942 -38411 84836 -162969 1309 -210557 -69019 177273 -327094 -102017
18630 -12866 180849 8906 66141 3187 -139200 -49286 114605 -156907 -204865 -215944 -284091
18619 -284091 -225127 -102583 41550 113614 -22160 223446 -111554 46432 -198846 146586
18608 -97988 47794 -182521 49141 -101918 5436 148421 -253178 91183 72350 -220751 -189860
18597 -189860 -236482 -92258 -187775 154237 -88577 63063 301875 239923 120950 135341 38408
18585 -80858 58468 -46906 96760 -134627 158942 -114714 169097 -90504 -124363 214179 200626
18574 200626 -14640 11893 -377795 -21097 215417 -166131 -226261 -386298 -395314 103325 -205461
18562 -204851 20582 -193874 12830 -99165 -118894 -63593 257942 -97728 -222412 158875 44386
18550 -32945 -169488 6810 -76389 135946 -64615 124228 103436 15321 -272328 -12620 -33230
18539 -33230 -90641 -71334 -68879 148409 -107931 -37013 -427117 170437 161704 -46278 -106987
18528 -106987 78283 -47359 -82881 218103 -247400 294380 59335 -410006 12700 -38523 375755
18516 130174 170458 -97351 1166 -191164 -236305 -33267 -280961 -195281 -93465 118352 50060
18504 50424 54053 -158323 -85130 53882 22941 207420 -54113 -154787 -246939 -165864 -86172
18493 -86172 39208 218353 -4464 -443088 -201455 -99212 53950 -280975 -177160 -81266 103977
18481 -139148 43001 -267121 -11219 -49975 -46528 76494 38573 -32699 259904 -219707 -236897
18470 -236897 -98411 -208974 113004 -42460 -103093 -313322 118944 117578 -184092 -93905 -105954
18459 -105954 90136 148205 122642 -255721 -43145 -151659 37448 109445 140853 -15277 -196056
18448 -196056 -74529 24932 126860 435179 126365 -78282 -177684 -332530 81805 318247
18438 318247 109714 236189 -118155 189895 -8161 205974 241478 -19711 184490 215804
18428 215804 -547579 127488 -26191 51345 176 -67557 -50811 -303093 11576 98969 -190673
18416 -125673 -381291 -243323 -124458 72954 -230129 38357 128152 -209224 -92796 5607 -274596
18404 -163665 16864 60176 472734 41864 58826 -158764 253594 185633 -214950 -179584 -136732
18393 -136732 112073 -227847 100838 18961 -307334 165095 387678 -257753 228122 -139714
18382 -95963 -128881 -68133 310732 -187252 -134721 237234 155270 112872 -47622 -80575 -48030
18371 -48030 -209428 264989 -27307 -35155 -304502 107992 -37678 129232 -212644 -167338 -92622
18360 -92622 25070 -173929 -165400 220614 129520 21778 -2366 -127419 56054 -122343 16142
18348 -29968 -28395 109790 -128720 -131574 -264064 -137299 -223066 6523 49526 -302822 319280
18336 16507 -148810 362818 160633 -16642 33437 -282007 231498 -28591 102253 -153255
18325 113281 58119 42297 -23770 225590 -144498 -95630 58390 -383971 -24104 -286331 104972
18313 -128581 83383 -173548 -174970 59447 236108 103335 -147108 165884 6603 -76997 -169634
18302 -169634 -19014 -90813 368240 96841 8390 -174466 -40903 -178808 -133669 25905 97289
18291 97289 -72291 -216042 -132516 136724 -301136 126877 -137740 -123224 51542 -86551 -16567
18279 30245 -6949 139193 19505 198999 434333 374388 -296347 -4401 -154109 -258080 -124652
18267 -56975 -346103 138850 -20033 112941 -104134 -153212 -135400 -133541 -1932 -186289 29112
18255 316539 182622 -92936 -87799 40384 -235738 30960 -181062 -83313 -311796 -38029 41210
18243 -133461 -47355 -571887 240915 -115001 -265707 66838 88551 33197 -50835 -374948
18233 -374948 -34389 -346682 -62696 -119176 -194126 -50853 152051 306142 -111716 -102923 -336196
18222 -336196 139756 -255415 179879 -105133 -80694 63150 -125370 217021 -30576 59059
18211 -113225 -201624 -93037 -17831 -296227 66641 -437427 101997 168895 -3319 -41928 -63919
18200 -63919 194300 338365 219968 13003 259230 -105483 -91091 323323 31594 -92066
18189 -211156 53677 81702 43330 41648 -112627 -310133 28538 -130683 408215 -310579 -157981
18178 -157981 -181761 113138 -95092 -44205 268919 347352 33227 173976 213329 -33199 -21390
18167 -21390 45504 66316 -111935 19805 -40447 361467 177782 -122747 -250682 -19106 90184
18155 -406829 -187627 -26609 27861 112407 -227188 271815 50480 201509 43571 4739 426511
18144 426511 -116762 7438 349496 65173 199827 -399680 195139 -98729 -77198 22592 167582
18133 167582 -418074 -105701 180191 198652 -108526 -16496 -12362 289324 126026 19737
18122 -143169 143441 96262 -271884 -274270 -13768 83894 -23347 -132847 40864 -126634 53373
18110 -102399 30659 -157830 63332 145769 -14629 -11201 51673 -60594 228766 -242926 -152989
18099 -152989 308823 210328 193935 36321 -228315 225854 -213149 -1496 54347 -190001 -63245
18087 126594 229362 356829 -21701 -6803 -295269 103512 225294 82364 -4003 -15520 17728
18075 -90167 -63030 -151158 -248956 80277 177348 53663 101280 -427518 107215 -197332 43510
18063 160909 99659 239552 -113097 46301 -184898 342082 -265700 -249237 28020 -112231
18052 -225751 -220543 -140086 -57074 102380 -30018 -2348 114834 147826 8212 49961 -38057 167605
18039 -7293 -123481 -320713 157552 73763 7536 159754 -66877 -233156 5806 155298 80678
18028 80678 -127590 -111531 54438 -263969 20187 169761 -114510 225847 -54641 -99614 -45556
18016 128838 -91715 -44692 -72661 156627 -392429 -2635 5727 -186528 -85214 -3473 -73477
18005 -73477 -64673 -59373 -23578 28572 164301 -175566 -137632 267141 104827 136381 48511
17993 97444 33982 254675 -305971 588 -76263 17634 428214 245451 39515 31410 57160
17982 57160 -127770 118591 433471 25261 -79502 -9769 326613 -264356 209671 -23559 -151084
17971 -151084 185618 191719 278331 -47371 -100276 163079 -24536 -169080 1020 93878 -50834
17959 -273784 190178 279741 143942 180968 84180 244968 -156285 -75182 99424 -140280
17948 221878 178204 70862 -246242 -271074 -74783 -4122 -4573 366810 -56324 63749 324301
17937 324301 -71914 102931 -134775 338725 -45230 25526 -204656 34825 -102665 -159092
17927 -159092 -113742 372310 197622 19221 7762 173408 -501244 219637 61571 -318619
17916 -99388 20262 -12773 -176954 137245 -136738 -230666 181242 24108 4280 248289 23061
17904 -100475 -116746 -108451 -82936 -330003 -35781 75299 -206052 292849 -44564 -268061 115706
17892 328555 -55754 4542 -177779 2382 -203343 -182118 58889 145576 356462 150620 63102
17880 126637 51789 -29823 -105421 -190783 -42479 -224606 -21933 11620 70075 -23989 -155791
17869 -155791 131909 68643 186935 -158410 111710 25874 -124021 89553 -19479 175278
17858 36937 267671 -166344 46890 -137633 337896 -65259 422720 -124646 100756 23203
17847 -48265 -31393 173969 57512 176744 215002 -148996 96278 270482 339729 346363 112251
17835 -102634 -108374 218998 -64176 -104877 15988 77599 125410 173453 85100 -186868 5338
17823 -90284 176383 -156328 -34403 66935 282865 87684 112281 -71330 61339 -1075 343218
17811 213127 84969 -220238 158987 178242 265326 -186484 -203161 -65678 151050 126454 9729
17799 400235 -3284 12184 -229616 -177771 -231642 112364 -212282 251203 -233124 -16185 26132
17787 38354 184829 -35169 4213 156487 75874 44129 73283 241557 -254823 -10679 -203556
17776 -203556 347364 87007 -187164 -95907 -62389 105569 101393 23989 213433 -26434 437615
17764 110115 412887 15713 234155 -35579 106005 180966 167491 -471 -200 -17578 236590
17752 51948 204295 344032 -19409 123859 -79679 -22595 308616 162576 246187 167741 24728
17740 -41037 302941 -199393 -47922 84914 149832 -24193 210368 147526 108830 21606 -45857
17728 129093 199729 148408 61580 -47594 55659 192668 35286 254353 204659 170266 64230
17716 104227 119796 -588 223523 84969 410338 -168305 29307 312309 -251914 29823 139037
17705 139037 -162367 240987 467106 63957 -161489 184795 35944 128001 170412 359066
17695 359066 59113 154967 195047 280308 228280 -187318 186342 388344 116793 253590
17685 253590 -84824 -224330 111421 -99739 -18863 23240 210860 -92498 -64056 -19225 -62524
17674 -62524 257187 130859 80172 305437 259140 82652 183201 -17274 177518 392141
17664 392141 252990 57165 -67251 333503 -212941 218015 -70471 98802 27095 282464
17654 282464 51577 73025 33812 187942 583960 107851 69319 133831 257936 179104 37386
17642 150646 155898 240217 209954 232335 -161106 245945 141936 113516 -134859 118016 239479
17631 239479 396338 -11448 -159961 334841 74126 378862 39817 164303 135916 -81971
17620 74836 199331 -111985 129694 500021 -80629 261550 23296 -271251 -91709 46307
17609 276817 121483 4130 180585 188788 264808 186190 112271 340791 -4763 377283 286753
17598 286753 265479 -130493 -1322 424134 42597 137461 179043 374920 -86031 334437 226000
17587 226000 319058 129186 204463 40060 -70959 387422 -6181 137329 276231 442718 46848
17575 509810 352280 187912 -19917 56233 -44422 24829 171968 295070 7994 151611 281245
17564 281245 547730 223576 248790 182280 -49689 410721 374124 420959 1144 366096 206853
17553 206853 382210 40740 303945 65268 76241 313277 58229 110465 219776 114897
17543 114897 605058 404948 197542 1685 117064 269022 161537 104892 169158 362456
17533 362456 174055 562268 -120918 299226 258298 327879 1050358 920119 1168908 1190921
17523 1190921 1381204 1320259 715705 759857 644891 548260 291872 203866 278226 27605
17512 385244 407958 971694 929748 958813 1067285 1022227 871210 721980 455135 255707
17502 255707 497429 201574 117660 337908 499402 298481 587763 336718 135731 481319
17492 481319 181937 328691 162270 174709 331821 182758 106461 89566 418976 169599
17481 114737 191199 400389 177189 230435 558914 351623 342949 -21405 66750 367863 110173
17469 593015 434013 420593 187147 435764 88752 142930 339078 32804 336616 215162
17459 215162 344435 344378 -146016 485475 454304 14581 270334 770003 432081 319664 794806
17448 794806 699258 548609 571509 464710 322194 77969 636769 349035 478871 396537
17438 396537 370149 486203 436903 371660 246728 464770 457527 285241 509789 285283
17428 285283 148424 407307 546729 666591 318649 582698 500502 335129 170287 104076
17418 104076 544327 332786 222146 680301 373397 314280 461623 492907 459172 143616
17407 311022 225623 566553 366629 26358 319494 -68679 214120 21192 241272 54993
17396 124324 216502 603690 189564 204833 378647 476939 566084 15663 159439 535717
17386 535717 303237 435131 448077 180979 336155 433844 73825 179768 181508 274944 334984
17375 334984 128772 110603 304068 56028 425336 304670 428746 344028 572477 292584
17365 292584 327231 422493 547787 221197 311750 385192 103317 601368 144571 128093
17355 128093 171154 62451 163013 438319 279221 64216 356241 109058 347779 437488
17345 437488 168111 93363 308175 531289 539319 141552 424952 202164 175723 210369
17335 210369 309633 704759 42626 4378 440904 444734 210460 424843 151514 574619 96804
17323 537738 246639 132076 540282 123841 474730 317670 590534 375577 338518 298369
17313 298369 409762 444181 153791 278398 277443 381147 371176 67262 540974 288148 437234
17302 437234 362791 222371 530916 512623 614422 355244 513664 283046 638330 558777
17292 558777 451141 480916 471850 161722 397436 332389 442762 178334 379215 217692
17282 217692 338101 443285 320019 413627 80839 354362 -238752 186768 599485 144901
17271 256965 164938 306864 425318 -13037 112394 127239 345285 381186 75857 372083
17261 372083 234680 459564 228238 100411 698242 454127 6738 698335 94490 499531
17251 499531 558076 461897 347801 488928 509745 171495 447905 130903 440818 183540
17240 432141 169146 257218 74423 377547 412198 347182 190191 -90982 385255 473790 556937
17229 556937 787570 96175 406705 175148 135926 352409 373264 213319 482811 263259
17219 263259 114904 794411 626126 203767 641219 402195 682729 878433 12093 275547
17209 275547 333984 557873 498636 348223 295629 499019 437932 619612 535284 484326 614237
17198 614237 786452 544919 303359 202425 503952 548830 696045 687402 246781 503004
17188 503004 496945 317125 372809 462710 439343 364477 517312 695270 604192 604719 519932
17177 519932 909181 151058 693654 475501 390971 395333 551163 452385 514999 944603
17167 944603 571808 618090 217091 478087 660646 569062 546340 596575 492214 442109
17157 442109 548879 609442 477023 432588 631976 987778 628842 655355 796467 548266
17147 548266 375691 499560 584267 594115 943505 638284 534537 511092 671477 484751
17137 484751 705859 431992 569246 880322 863574 796514 578595 520586 481381 672954
17127 672954 659410 385323 660605 691513 632544 639493 688033 639788 714889 566753 260459
17115 494272 785630 625976 949763 624813 690524 500488 697490 818217 962865 701247
17105 701247 813301 541165 447626 707719 466863 591863 949028 976010 707489 946569
17095 946569 756367 741762 705372 556893 519878 688429 749736 871112 780361 465711
17085 465711 918100 1131511 819486 776618 975502 765952 571263 923544 602844 590201
17075 590201 980186 761523 761263 840004 1056932 1286652 570341 898007 881900 953707 606961
17064 606961 771948 1077912 691830 1045213 823362 1328321 969589 1009801 978770 550647
17054 550647 832929 1027585 1119236 823514 738242 1251111 1070689 1061770 1087661 1204031
17044 1204031 1248446 1038208 1208924 828030 636263 900813 1102495 1006425 791135 1151083
17034 1151083 1021682 1421319 1303862 772080 842478 810506 1323288 991220 954838 1148929
17024 1148929 1155113 704170 984329 787100 1250134 1045392 1239005 1225575 851222 1169735
17014 1169735 1078929 1011388 1319997 1178391 1344695 1532524 1203538 1549305 1261393 1038492
17004 1038492 1131184 1548580 1248239 1217139 1099123 1450118 1363498 1263971 1504982 1169731
16994 1169731 1518482 1468497 1260574 1747964 1384543 1256842 1751831 1307551 1457058 1282020
16984 1282020 1364989 1416009 1401621 1404773 1838633 1629418 1539932 1206082 1432041 1694634
16974 1694634 1707293 1811913 1545832 1676026 1708561 1463528 1900440 1497011 1269178 1640095
16964 1640095 1723339 1847450 1838929 1948834 1584743 1732093 1691659 1616323 1862084 1913896
16954 1913896 1854372 2114171 1875785 1692054 1899830 1688642 2155944 1882520 2172020 1711225
16944 1711225 1934571 2233833 1676059 1965057 2059524 1892046 2278336 2218628 1964569 2298751
16934 2298751 2500521 2151938 2113450 2222836 2192761 2243531 2227752 2290356 2271992 2453003
16924 2453003 2468177 2414625 2392903 2484141 2649457 2548064 2443064 2609684 2531307 2298790
16914 2298790 2695493 2823882 2801537 2806117 2731303 3074259 2513913 2919066 2960061 2858778
16904 2858778 2894253 3002726 3092040 2928083 3002313 2777380 3336037 3217344 3130111 3142311
16894 3142311 2968170 3268086 3580260 3409047 3580508 3414902 3142231 3649358 3807231
16885 3807231 3442215 3383352 3522162 3814168 3770456 4332558 4165463 3590303 3547977 4065851
16875 4065851 4033751 4075696 4052778 4037434 4522915 4368503 4364435 4400315 4647101 4419884 4370261
16864 4370261 4387062 4813038 4752082 4822709 4873485 4805449 5131263 4841959 5205294 5496926
16854 5496926 5278140 4965943 5181684 5554191 5808428 5777546 5731165 5721302 5849407 5663031
16844 5663031 5946575 6148319 6178785 6439106 6499057 6734619 6511893 6827243 7104062 7294647
16834 7294647 7307780 7434970 6987478 7259406 7816462 7827410 7853399 8008705 8026163 8551962
16824 8551962 8444129 8828894 8846323 8469233 8790275 9389325 9173165 9584926 9577069 10038587
16814 10038587 9990665 10047048 10834735 10512709 11113309 11147573 11371110 11951617 12174987 12380879
16804 12380879 12502311 12590358 12871481 13134846 13424796 13653750 14223998 14110881 14998342
16795 14998342 15095287 15601619 15676640 16004244 16315401 16812014 17159879 17776254 18228184 18670451
16785 18670451 18996291 19531810 19956010 20632785 20893119 21616344 22598779 22788970 23850747
16776 23850747 24092997 24957885 25296631 26422657 27154522 27982595 28753528 29826239 30384183
16767 30384183 31510443 32310689 33293787 34371072 35186777 36641371 37586666 39012862 40086129
16758 40086129 41663481 43021311 44596247 46272929 47646539 49375380 50894772 52724281
16750 52724281 54492824 56800400 58617990 60650902 62679111 64984562 67262494 69440823
16742 69440823 71861402 74201597 76962771 79221991 81703183 84618883 87274844 89877409
16734 89877409 92413478 94991318 97735318 100188972 102391914 104616723 106660295 108863961
16726 108863961 110618502 112162449 113800484 114692897 115485331 115835535 116265283 116354874 116367984
16717 116367984 115796609 114777275 113405581 112448520 110735731 108734308 107219991 104574590
16709 104574590 102632103 99852598 97601512 95394466 92197416 89801338 86996254 84337791
16701 84337791 81879300 79165783 76593320 73835442 71446087 69074646 66579799 63962826
16693 63962826 61711975 59946751 57735286 55305930 53585463 51571690 49845496 47864088
16685 47864088 46477447 44702292 43418779 41803108 40502672 38896203 37553371 36262737
16677 36262737 35141595 34444533 32673946 32047289 30810917 29915373 28926164 28156596 27269803
16668 27269803 26359973 25587342 24861272 24326890 23291487 22799844 22021117 21525799 20953548
16659 20953548 20334524 19873813 19527752 18738186 18270849 17936046 17278582 16611740 16216918
16650 16216918 15766599 15730274 15020466 14458230 14750961 14326141 14026021 13618013 12836114
16641 12836114 12820029 12415355 12022796 11915989 11548248 11408230 11253752 10970683 10595203
16632 10595203 10375572 10493674 9982717 9784736 9881951 9420366 9367646 9086410 8985109 8356337
16622 8356337 8785737 8276307 8378214 7984653 7886928 7847247 7869322 7589062 7426615 7255240
16612 7255240 7039307 6918493 6887448 6714832 6793056 6038732 6541092 6564832 6262667 5946351
16602 5946351 5886595 5855670 5858188 5756006 5580172 5728244 5609437 5355030 5438728 5184832
16592 5184832 5210077 5436358 5028321 4868443 5115774 4867255 4703349 4343561 4595011 4499471
16582 4499471 4292447 4273059 4330426 4304246 4108222 4389691 4076528 3966887 3905048 3881448
16572 3881448 4117081 3918364 3673784 3551827 3555956 3674933 3683705 3383919 3334050 3288664
16562 3288664 3401192 3009621 3376346 3164600 3050825 3175648 3107409 2918433 3060914 3059411
16552 3059411 3013455 3023188 2881517 3023734 2792695 2496037 2982428 2546698 2762674 2693173
16542 2693173 2279943 2521791 2641448 2168369 2538184 2652515 2414669 2412841 2411576 2358494
16532 2358494 2152266 2345688 2346420 2314555 2291013 2373134 2381865 1967469 2155048 1828584 1983052
16521 1983052 2061181 2160552 2014776 2025655 2115305 2312033 1829853 1973131 1844667 2163162
16511 2163162 1983370 1786783 1371284 1672133 1612509 2132336 1626475 1674676 1786034 1564364
16501 1564364 2290723 1575232 1663196 1925255 1602337 1704537 1567062 1619161 1614464 1388562
16491 1388562 1576939 1259977 1669772 1127760 1394279 1602514 1234585 1463844 1477878 1604657
16481 1604657 1596051 1498465 1292501 1328886 1223225 1310329 1508277 1251260 1659694 1594488
16471 1594488 1489971 1528958 1365437 1669327 1275970 1469685 1331661 1397897 1444728 1056840
16461 1056840 1295878 1071636 1144536 1266946 1286032 1148595 1356213 1281779 1287628 977639
16451 977639 1125586 970592 944775 956267 1240027 1065902 1027639 1009942 968920 936247 793403
16440 793403 936970 1158244 922543 877383 1085732 1321207 976856 1076669 910560 776129
16430 776129 1018613 1082395 904393 903801 948379 937393 1014158 880047 1005452 1218328 1157688
16419 1157688 1127073 665596 1074079 1182457 790296 775759 506234 631171 882446 766647
16409 766647 973646 916465 739802 571719 318399 875848 749704 994275 768046 1062987
16399 1062987 983414 837210 652754 763316 604727 687344 907777 764825 624489 434464
16389 434464 786152 618889 652054 634385 636246 532044 722217 508295 546509 243052
16378 774072 681537 778617 726961 807810 288423 820933 586042 683870 633974 681376 695783
16367 695783 908524 591398 940888 971321 822001 604805 583426 327094 509324 735196
16357 735196 579197 370939 566069 660192 644008 264339 528564 501297 831941 873279
16347 873279 800457 459580 511389 794295 613251 367739 621219 666956 669109 611227 763820
16336 763820 826333 596897 564849 439892 697196 539025 324438 557592 426832 298334
16326 298334 442876 434500 364144 495684 340630 186377 516132 808192 506985 552977
16316 552977 440407 311449 511452 736623 334533 215673 634740 219279 500994 440345
16306 440345 331563 211746 229382 224728 302575 557279 673061 321240 667784 130363
16295 564653 536327 402154 671239 439235 320372 364832 249985 428741 318558 210542
16285 210542 518993 476223 311113 462759 531352 129295 125843 398970 546933 224809
16274 463994 198833 515724 195298 542271 366401 537790 585007 243351 312482 169083
16264 169083 286949 404425 104337 360558 438549 244879 82877 23761 114674 317857
16254 317857 117000 294026 54319 343130 88717 249417 497777 398763 164882 -20568
16243 117129 77399 134187 -8016 452913 212157 146182 141011 285139 472850 -62977 87827
16231 320265 344439 282408 492685 305665 172373 379403 -142286 294400 93108 312078
16221 312078 437700 89744 248082 139711 623394 165501 376140 174472 141647 66488
16210 -121837 286928 440679 117045 185602 72516 281941 263273 51316 19480 234031
16200 234031 -65829 115475 154594 540833 312354 108841 164992 380172 260624 180806
16190 180806 114807 234654 65787 219676 146385 250389 38369 210807 30001 53724 626099
16179 626099 -101002 127768 112579 415238 -4275 270834 167529 -1035 551914 310573
16169 310573 165175 44143 -190309 502487 269334 314821 372049 152582 205244 87039
16158 -150967 235924 193064 265690 229805 641261 -28435 7010 138921 245006 234692 192667
16147 192667 249176 -41514 138149 29659 74288 218178 56155 16255 -108020 363157 120930
16135 234376 -69278 127964 251915 239230 246037 167670 -86285 53833 205124 -35491 -133223
16124 -133223 230937 87808 -76351 74275 161539 238277 -57624 -39801 46963 134474 10221
16112 121476 -81301 204754 159314 298579 163829 183755 54184 -78911 -90804 -32076 63729
16100 240521 -10230 4622 55098 149499 281261 46199 198779 17065 167355 72803 79203
16089 79203 -61270 454824 -1050 87611 66180 -417 110663 -22232 -101775 -114315 -354842 -273147
16077 -273147 -32663 -408748 233223 45256 -550 1013 327752 -71157 -7586 443666 -271808
16065 89856 135191 222438 2190 237016 465092 118373 30533 -118874 395894 -46230 191649
16053 -186145 -91223 230504 269722 -123757 -307830 -346518 -78806 -205075 -270451 154997
16042 -110657 29215 46520 -15506 -35391 367588 -60043 282183 79579 -157339 55958 321294
16031 321294 142905 -86269 21635 327814 306934 161432 -72944 -184249 -100692 49130 -10357
16019 201523 -76369 97207 115689 -181452 215229 207838 -48302 82164 196488 78121 303341
16008 303341 14512 -52148 140665 219597 94042 20490 106953 71849 283619 138480 207647
15997 207647 145356 477644 -111593 163561 -60155 -109780 -250394 37993 162074 414267
15987 414267 534243 616100 762716 809726 888828 631903 591945 406091 301120 63253
15976 15399 11233 83226 179331 -5145 332 70899 -222924 45576 -137270 -301882 -67770 296881
15963 -255652 -10601 33742 -91679 -167 -68264 140730 106 222745 -359133 241130 55346
15951 -104152 -124843 39113 163270 -190391 -142269 -79372 42092 111845 236056 -55151 -105447
15940 -105447 -334253 334971 328540 -255954 -104531 -132886 211942 -76354 96195 -202343
15929 67347 238865 183774 178661 30792 52449 -290746 -268522 -150456 125200 -293100 -32833
15917 -23214 -214046 -90658 275946 -397262 -121110 127188 189125 -213288 114426 379456
15907 379456 -381370 -186041 -53189 -120086 198931 347964 42160 173779 191786 -84153
15896 -14327 112248 -192934 98397 -115486 344798 -200244 32936 151320 -75951 -21454
15885 37849 -123497 30305 136700 -315376 349363 -25230 14876 16961 31930 -100861 241633
15873 -175075 -57053 -82531 -202429 -105580 -360706 141557 -484209 10597 -200229 -273381
15863 -273381 111246 -152478 8446 325180 158096 -22002 19502 119776 -136605 -41561
15852 22684 286112 -122473 -185427 -68478 -28162 -225034 28852 94560 -274855 -97150 366200
15840 181818 -79613 -185668 189454 -229250 210798 -176014 -70864 132906 -116879 -55183
15829 540213 203400 -56362 140021 109900 -8514 74632 71065 -19911 -99074 316563 11227
15817 63463 -119297 -114392 105759 -216587 -176167 -159389 -80258 -289847 94335 -195204 44553
15805 -39811 -177936 -184998 153001 202127 -137866 -158523 -183781 30791 5780 42888 -140706
15793 295620 261986 197964 33917 98005 -106606 -114131 -121714 -48535 -395724 167928 -381402
15781 -47107 -100239 42192 -76601 -219964 -443079 -134060 -19638 227734 -118844 161885
15770 -27470 -22221 46121 263193 -67511 334366 106602 58 201368 -101088 59220 59468 -120365
15757 269648 -4112 153024 213880 15388 203438 -39247 13597 237496 -18370 -357676 -88935
15745 -145750 182257 -31557 62794 283963 143143 83857 54506 -175992 -140408 117467
15734 128433 -123989 -15955 5202 11757 12706 -76639 -237519 -191842 -253324 -190783 -131642 -71398
15722 -71398 109767 -102344 230578 170788 334815 -222227 -29261 -214475 100452 -113707
15711 200468 10013 105500 -335530 -149007 -3953 29734 -291773 220356 96453 -176754 -143428
15700 -143428 -48113 47839 145546 -46966 -278361 -84948 13838 -59117 28361 -2330 -22840
15689 -22840 -53026 -64917 113625 -306729 98353 -213656 280592 253398 -71196 258143 80190
15677 -44504 -115351 138920 168425 152259 278565 -90158 30950 -310392 -102907 -9057 -73294
15666 -73294 316 -249181 -125359 -81651 -153740 163617 -1047 20730 213386 -294042 -23610
15654 -42735 -52068 -269917 -136934 -149916 -394893 -227088 -410257 -181253 -342965 205047
15643 56689 -35025 -286095 -9704 -285583 -88849 -99216 34920 -109243 -268310 195943 139289
15632 139289 -44355 -90950 -203978 5034 -170492 -352588 -2592 73507 162783 89950 21799
15620 -1237 40716 -153956 -286866 -165932 -36332 -20704 143083 118793 129191 -14636 168605
15608 -40709 40610 -235253 118351 -106494 -360965 106227 -56751 -20893 -82490 87668 -170728
15596 -11256 -107542 -131567 62141 172778 124215 80329 56337 -219207 -196566 -100614 -185515
15585 -185515 -460897 -384834 -86556 188096 29342 -157654 -292324 8205 77777 171434 -157261
15573 -697 306790 -96325 -105739 99260 -29890 188681 -409440 330638 282503 320752 24609
15561 264130 -327889 324904 -126257 -118383 74162 -79798 -143371 75145 -298575 66416 161279
15550 161279 -43023 2315 -5943 277888 -159277 -78282 124617 -185646 144758 -1451 96055
15538 149285 102397 311424 -67223 120033 225274 120104 13566 129255 -11817 38249
15527 54162 227991 -391868 36006 -4059 174470 253164 -202497 14079 346501 7465 497251
15516 497251 418656 189010 245457 239438 214929 -99270 112405 290023 -193681 165936 -88524
15504 259343 -180141 -74926 44658 225034 3562 44391 -68480 -69375 37103 307538 108932
15492 -205951 -92043 14673 -81480 -98095 -64796 -121409 139744 -358556 -150589 206188 178998
15481 178998 67704 121434 25981 6763 383826 215013 481288 922732 776357 567046
15471 567046 396046 257045 -62302 277930 10999 21620 440946 189316 -52124 321806
15460 133285 -39798 82125 25405 -20204 128782 -367967 -267730 321140 275325 -6595 268030
15448 255835 314411 -263038 59997 350944 332596 351185 1153916 1295386 1178337 1419910
15438 1419910 688556 623146 -152939 47446 75290 -27745 326485 157691 69555 339116
15428 339116 248441 423926 44802 -174321 41760 -242097 -20142 -2270 40741 -6724 -365485
15417 -365485 184186 -89866 95460 24227 41099 424568 206919 7558 92329 109074 -131438
15405 209799 -188619 8262 -256883 -377779 -33765 -260466 -3798 -71537 74759 116597 63083
15394 63083 -176707 272574 79000 75406 -70623 -75704 -58274 189016 222442 -163617 66929
15382 86844 244899 233844 17226 307162 249777 434228 88882 89304 138872 193532 140117
15371 140117 395822 62357 578184 373379 144921 -138362 524727 -135811 -2836 278687
15360 396989 70616 122314 69516 372904 349696 257158 464937 198011 224278 1958 200236
15349 200236 118481 361841 295287 178235 318666 376618 460819 502856 454615 101785 266926
15338 266926 382506 208102 85016 -152604 335808 257525 -6972 -13025 147756 23477 275880
15327 275880 541785 138577 345125 8900 215542 71254 358175 11488 177928 132440
15317 132440 456371 349744 143815 530703 215460 166208 86907 -174814 357484 85572
15306 68933 -181474 153777 73287 228811 -286636 -104434 -9310 317639 271640 -432864
15295 160563 -37027 -40735 20825 -248317 40884 12166 184139 307312 -7419 111604 -1739
15283 67775 47216 121687 10332 68967 68399 -3899 185914 -16569 12272 402977 49427 433658
15271 433658 199134 118707 76705 -168616 238363 -87462 75622 90698 -36971 -18084 -129206
15260 -129206 367430 120637 -138708 227095 184220 37 -27030 157768 32693 92823 -12047
15248 155885 108074 58216 168373 123386 434576 402224 1153838 1620576 1002604 1638089
15238 1638089 1553625 1123664 350015 455647 231353 504421 433909 155857 461529 -187746
15227 -128443 -187803 19373 -327896 98775 -22979 88162 -208035 61744 -26347 305400 -93179
15215 107884 173440 -120993 28862 89901 272596 8148 212952 456411 118512 192390 114632
15204 114632 70718 -62072 104797 172896 -43941 242583 -79081 79060 116110 -153023 371130
15192 53135 -97628 148108 222128 287204 144102 -190068 -229559 -63893 389392 317953 -64519
15180 44767 67045 198274 303120 135858 117031 -189011 -509 -86680 -158857 54481 -226405
15168 200999 -116686 -77141 300170 196573 180254 -82409 56089 -16235 -262531 -44121 258094
15156 234018 325646 101922 152731 145019 199589 162233 -35902 299815 295266 280266 380821
15145 380821 254550 349368 -177287 107656 186022 -234606 207257 -63263 223420 335116
15135 335116 -53042 -64556 350374 -115553 93967 -208258 113389 398116 -69167 224397
15124 365824 297906 104737 -58896 320142 400671 58139 374553 506800 548569 162799
15113 247012 61319 264351 92849 282540 375121 9852 159886 367847 168696 -94131 185111
15101 275346 71360 11796 271235 140471 371926 104794 196923 133 168451 1627 129737
15090 129737 -29189 92673 169596 156710 -16251 159418 -82950 87080 174312 299711 68418
15078 59199 276566 179010 -47204 152343 86587 306116 -1044 270749 337687 24595 420595
15067 420595 291793 268185 -76654 -125562 334988 21064 266330 239964 98943 213643 560523
15056 560523 371046 185593 150985 595162 527956 232051 494649 30739 458845 459285 510716
15045 510716 281910 134628 681280 -28778 554582 440172 208484 239405 703950 295035
15034 114848 299865 315598 479605 402893 830591 830961 809210 672476 667233 438959 460554
15023 460554 295696 574709 647578 766375 533607 614005 803507 447998 473217 609961
15013 609961 112185 303317 540846 539027 872513 758577 269976 679570 450356 420380
15003 420380 114592 294255 343217 465020 548575 742048 533090 499954 449792 592200
14993 592200 222486 559024 537159 214988 373517 588146 652755 460512 518991 778967
14983 778967 529218 1246569 857548 943133 1039265 937298 523057 666825 605077 651568
14973 651568 451798 814569 713955 917409 591286 409063 373877 365697 638514 375385
14963 375385 450640 363378 564000 741585 523321 413824 428200 296717 238589 392044
14953 392044 505486 220732 579364 292297 329038 319990 471124 846170 712212 402891
14943 402891 799595 910632 1116654 840322 655114 409767 363875 465737 582452 787661
14933 787661 524254 595686 1117530 1255838 1309852 1219904 1509968 1576371 1957438 2069584
14923 2069584 1937642 2200520 1997748 1736817 1589260 2389595 2848568 2753700 2444378 1980405
14913 1980405 1890085 1622999 1380233 958437 1053006 752565 804114 490600 719506 494513
14903 494513 718137 706981 749801 607956 455942 444705 506761 539201 402986 491917 405304
14892 405304 320118 712887 532442 635493 715880 630001 653008 661264 1152658 882347 1235348
14881 1235348 1088024 1229191 1047011 761512 1170168 727638 422293 586863 760576
14872 760576 707919 418146 696270 308817 762285 676012 1212893 790035 946304 780056
14862 780056 728976 670666 405702 300927 716109 559667 807676 877047 434851 589408
14852 589408 397503 434591 375005 389779 963187 481526 710956 840019 1008895 1475448
14842 1475448 1318728 1247522 1071296 1080106 1306407 1066520 990389 1089535 790779 614015
14832 614015 780365 895812 516294 456081 615258 735587 413908 760430 610486 678246
14822 678246 628623 660644 613611 637823 924640 975872 842663 863817 872705 796982 868301
14811 868301 655389 586613 981419 684823 513230 883020 1027992 1267997 1135363 917566
14801 917566 761796 441319 1015197 466160 645457 535358 410539 776164 599083 800547
14791 800547 1078497 655380 410784 631982 560352 655869 426748 860080 593776 551544
14781 551544 936563 618057 547825 872968 881297 905194 948206 929347 802950 742979 804796
14770 804796 659006 897133 522034 822863 585644 670898 978560 909388 746811 560926
14760 560926 736925 438378 666397 780446 536672 838183 704819 404684 624260 930264
14750 930264 861085 809331 866860 798293 714561 723578 789383 703813 633028 714808 695858 900082
14738 900082 722241 957337 662937 978831 631333 932769 800548 1006675 1339766 1228890
14728 1228890 1630797 2161653 2433704 2103133 1783575 1473157 1174626 1371622 1293344 1434903
14718 1434903 1054911 946474 1153490 1120152 1131926 998172 1122690 756613 938414 1026604
14708 1026604 982002 938146 1031764 1152999 1516728 1583703 1739473 2087536 2246042 2241601
14698 2241601 1691725 1583197 1725599 1299454 1244121 1109741 1056325 784338 938402 903676
14688 903676 933864 765500 867167 730231 934684 1049707 907479 1107662 876158 1128865
14678 1128865 663886 1190089 948125 1133126 924332 1053827 892734 1110647 1182743 1072634
14668 1072634 1115575 885798 1299892 1266855 1242083 702965 877857 687239 1441643 1089509
14658 1089509 1320711 999621 1164196 1269183 1441705 1493137 1324433 1387143 1516643 1298165
14648 1298165 1622432 1129470 1570277 1195599 1254243 1209396 1520456 1419518 1149689 1249946
14638 1249946 1200348 1351501 1270899 1136962 1163539 1440074 1293704 1193319 1462839 1106024
14628 1106024 1201901 1470250 1607795 1575834 1596738 1569159 1132305 1444022 1350702 1430794
14618 1430794 1382628 1451614 1489990 1594497 1562182 1312455 1573617 1347082 1457581 1615117
14608 1615117 1447268 1670278 1499714 1315251 1629862 1526838 1675888 1685747 1725554 1846517
14598 1846517 1690750 1649753 1550511 1741191 1901331 1771234 1739577 1788155 1433088 1698974
14588 1698974 1680863 1762463 1722109 1558997 1952262 1843246 1580866 1917651 2090040 1917875
14578 1917875 1880183 1972198 1790996 2388100 2162356 2250905 2208450 2505829 2023022 2229445
14568 2229445 2284598 2585491 2386547 2296379 2275929 2740988 2373163 2314781 2952184 2956080
14558 2956080 2832586 2760045 2946306 3220185 3522922 3950727 4020688 4599505 5346266 7133012
14548 7133012 11559803 18492237 33903922 36358701 22897800 12342368 6311733 4498591
14540 4498591 3527295 3296983 4060242 5168503 4470823 3243848 2452384 2395390 2461411
14531 2461411 2065964 2273770 2067859 2183308 2273945 2304724 2434013 2423816 2575738 2467581
14521 2467581 2501343 2411749 2535242 2792756 2779045 2834020 2857416 2337618 2682654 2438865
14511 2438865 2491028 2905816 2903364 3058546 2669497 2892978 3010822 3108823 3206583 3472008
14501 3472008 3358672 3183359 3050472 3337631 3577563 3617665 3311352 3721185 3604673 3215830
14491 3215830 3480414 3436136 3672479 3806523 3294054 3817374 3693997 3640461 3740742 3848661
14481 3848661 3991372 4004566 3943278 3809846 4295040 4238771 4133988 4150216 4246988 4469571
14471 4469571 4774792 4339975 4505487 4564548 4817292 4788325 4818939 4615269 4810040 4859746
14461 4859746 4913064 5101115 4807769 4918041 5169982 5301494 5154704 5490519 5383472 5338517
14451 5338517 5475245 5814091 5771865 5770923 5760073 5817041 5863779 6107796 5747893 6178453 6227069
14440 6227069 6244170 6401569 6586627 6696888 6640895 6367207 6706628 6907204 6875429 6852150
14430 6852150 7266592 7198067 7275550 7296453 7683766 7695972 7654961 8164114 8241551 8321115 8807134
14419 8807134 8915444 8905022 8891042 8754372 8851199 8884743 9169312 9196351 9006542 9410356
14409 9410356 9426207 9655099 10132821 10321907 10677413 10552810 10872761 10973750 10748333 10750426
14399 10750426 10727436 11239896 11368798 11308341 11877228 12047666 12072628 12403094 12180594 12513949
14389 12513949 13204132 13112089 13232410 13896098 14174251 14228073 14394128 14862410 15213611 15631648
14379 15631648 15477778 16037752 16147901 16294296 16611166 16822204 17090569 17440517 18137182
14370 18137182 18378131 18951864 19202621 19604201 19736309 20640714 20802891 21342180 21853881
14361 21853881 21970872 22534618 22727346 23099892 23587388 24365754 24933384 25658169 26130737
14352 26130737 26434965 27032225 27746779 28411331 28943278 29822961 30501727 31358257 32074096
14343 32074096 33139739 34029346 34768092 35426324 36410360 37688519 38889107 40004260 40728899
14334 40728899 41782872 43405342 44389571 45911231 47292020 48896150 50202329 51851425
14326 51851425 53538019 55558501 56982446 59392181 61337209 63251424 65366616 67682946
14318 67682946 69937382 72147350 75032849 77835814 80807819 83926105 86999700 90662303
14310 90662303 94100763 97767145 101557618 106189825 110527991 115533006 120520325 125814523
14302 125814523 131340507 137239449 143703480 150291553 157515280 165261308 173073703 181468605
14294 181468605 190589046 199953694 210116148 220653574 231703561 243362594 255578606
14287 255578606 268661535 281934016 295896507 309965051 324738324 339665068 354831717
14280 354831717 369966540 384831976 399438700 413501923 426048198 437788094 447172417
14273 447172417 453578971 454769481 454556882 456065812 454100118 445037080 441170200 438166628
14265 438166628 430886727 420333080 408571516 396721078 384404113 371388075 358321035
14258 358321035 344568558 329956222 315123890 300466602 285706093 271283801 257637101
14251 257637101 244413894 231916564 219824634 209491524 199478098 189493651 180209347
14244 180209347 171384719 163283469 155429734 147892580 140940612 134622708 128952524 123052545
14236 123052545 117815865 112401685 107550461 102953832 98852356 95328518 91175568 87578003
14228 87578003 84119952 80763045 77390889 74602354 71853203 69157461 66808926 64382889
14220 64382889 62520226 60230114 58216359 56187221 54029262 52653772 51373952 49681913
14212 49681913 48134671 46554873 44898100 43682462 42992518 41934827 40594047 39295573
14204 39295573 38289002 36680777 35802309 35319870 34472063 33746742 32765174 31574920 30953387
14195 30953387 30203506 29138681 28853251 28037775 27405962 26629592 25961916 25218532 24859740
14186 24859740 24431176 23657695 22766658 22930353 22073425 21544420 21070103 20512076 20368218
14177 20368218 19593374 19372192 18685617 18640158 18268143 17740757 17344791 16830660 17003718
14168 17003718 16691478 16145508 15822691 15633184 15221441 15065007 15032002 14432763 14237961
14159 14237961 14032168 13778693 13687034 13478660 12989815 12708672 12544053 12195251 12293179 12314097
14149 12314097 11951561 11708120 11516464 11257382 11014699 11089369 10587654 10604641 10431473 10308222
14139 10308222 10288296 9876431 9971662 9582720 9494093 9363901 9113270 9266564 9045486 8941939
14129 8941939 8808674 8275884 8522577 8354891 7847535 8373803 8201018 8245344 7776341 7813116
14119 7813116 7727405 7439280 7516212 7607888 7139069 7111713 6846868 6931666 6777511 6962366
14109 6962366 6586872 6746746 6626756 6426685 6215362 6175092 6139219 5952722 6325077 5726482
14099 5726482 6096948 5746916 5846448 5640338 5364244 5917491 5746654 5328497 5489104 5401227
14089 5401227 5294441 5040588 5204730 5206618 5204818 5021373 4890064 4719995 4813309 4977341
14079 4977341 5178649 4786240 4430978 4549220 4631790 4512033 4225108 4388065 4472746 4617262
14069 4617262 3931188 4175133 4030131 4188010 4114349 4304455 4110147 4470718 4406376 4099572
14059 4099572 3828976 4234028 3902297 4064712 3655229 3751899 3819543 3935313 3593015 3564774
14049 3564774 3522253 3485976 3209544 3351157 3326330 3207053 3422137 3200796 3312839 3671585
14039 3671585 3374982 3371408 3196029 3458744 3060417 3262912 3204227 3149244 2879513 3131437
14029 3131437 2766530 2718181 2967001 3074618 2790585 2772121 2616843 2839934 2950051 2733931
14019 2733931 2780612 2215981 2768730 2238332 2909891 2534113 2747520 1953398 2271645 2181417
14009 2181417 2367151 2029598 2367224 2545927 2161937 2085643 2191248 2155919 1897624 2184499
13999 2184499 2011185 2152676 1863340 2128053 2245227 2359023 2090677 2096891 2555756 2403466
13989 2403466 3200464 6495821 12211612 26453912 38947170 27375697 17473638 10568382
13981 10568382 7134946 5420645 5047291 4135465 3727506 3401907 3567127 2816137 2983908
13972 2983908 2354737 2761028 2586239 2560769 2465559 2514912 2522304 2471995 2378258 2085384 2311640
13961 2311640 1962451 2385548 2301226 1992816 1911508 1847912 1727124 1925065 1892856 1823695
13951 1823695 2022490 1866582 1487054 1898582 1892705 1702559 1681459 2138612 1793253 1893198
13941 1893198 1946302 1937786 1712865 1782659 1803629 1852775 1945464 1505041 1350402 1546261 1752148
13930 1752148 1762613 1717147 1263064 1319427 1550692 1553630 1614811 1521876 1689688 1638178 1625588
13919 1625588 1637990 1499584 1380236 1216916 1421002 1407213 1295471 1654777 1528633 1710567
13909 1710567 1249166 1654076 1351089 1229333 1294905 1401587 1242192 1471928 1240800 1470859
13899 1470859 1231637 1299531 1140880 1294412 1181388 1485087 1607064 1533604 1099477 1177965
13889 1177965 1504925 1452047 1423034 1342626 1062469 1135886 1335330 1304079 1281511 1128420
13879 1128420 1541354 1165276 1003223 1178868 1116309 1152662 867865 1262989 1251080 955669
13869 955669 983370 969687 856195 1183028 928383 914985 1197431 1000334 840683 1134328
13859 1134328 676233 859013 1144872 1127094 1171296 1049282 1089694 1023315 851672 875278
13849 875278 937228 1031581 1262009 1295315 944218 930499 1248499 822593 799389 715904 943937
13838 943937 469686 1168585 875444 1163860 651431 1010319 1024448 1240343 895749 860007
13828 860007 1135042 1078511 870312 787473 884859 1134898 981741 1080461 616053 934784
13818 934784 753289 1180900 937261 493819 978417 864066 681139 778085 1075154 928007
13808 928007 731164 798354 738927 930882 730065 1216960 943084 869098 555395 914517
13798 914517 740160 769449 931205 755443 497261 498515 912907 508491 970370 822417
13788 822417 722678 659278 769543 741201 456378 378643 725145 808503 1060231 852735
13778 852735 473031 568567 517667 865539 640606 961501 645463 476283 637218 719985
13768 719985 803156 602187 553378 883171 327873 735302 923327 840397 667901 571250
13758 571250 553501 640691 517835 425976 589825 469912 877638 419873 438554 378835
13748 378835 884942 703409 788601 856835 531247 515424 729896 615845 649845 943080
13738 943080 229665 605449 785724 400410 682765 658223 815257 558374 559953 511222
13728 511222 743475 518378 513096 829853 535283 582812 739650 716199 500423 401366
13718 401366 591773 556717 658980 542931 511159 180614 434245 386655 511159 443148
13708 443148 197609 323457 471719 451950 548047 44590 471645 567443 749140 697579
13698 697579 554276 611937 698453 560961 492137 872816 255606 934945 450683 256666
13688 256666 493158 726942 838031 551535 465912 356385 453020 591429 738174 349155
13677 200443 423378 525065 307495 336179 341797 393855 606745 521909 581080 632244 352371
13666 352371 674779 221860 206089 374108 765937 448036 308361 677126 590873 202694
13655 305789 338453 381000 595413 350725 151750 528534 659299 838583 585589 325503
13645 325503 675813 486751 374931 281708 540074 293628 375451 -53497 592850 299768
13635 299768 357686 433596 381772 522146 291844 323478 349261 349976 469805 851284 433757
13624 433757 220188 143626 510240 616513 382844 638574 694925 624809 81786 414645
13614 414645 346227 362322 583822 786753 430631 187173 330818 247744 349981 195848
13604 195848 371211 504330 546080 236201 499767 287764 326793 -47840 473875 251629
13594 251629 299148 226301 47958 195627 558881 -108081 468054 648477 277026 96223
13583 275786 327062 277972 147046 301559 509369 414928 504014 98555 529816 456293 552810
13572 552810 684088 310852 761392 219693 299104 461413 342835 399485 246705 -70892
13561 459302 5660 217951 -47074 322443 560370 132147 449276 546753 416529 6806 228229
13550 228229 326690 10916 388041 569626 171631 212262 523934 11076 133487 -125280
13539 570489 230280 144030 381562 175058 46189 491161 297426 172884 272105 107409
13528 311821 310508 21091 377259 196837 250699 278946 -101145 368897 276971 175760 131236
13517 131236 93447 453163 373611 91584 489654 45790 66927 483941 482161 399193 206204
13506 206204 355973 258252 237978 400042 76750 485923 258158 395764 420190 240473
13496 240473 126508 182853 332963 144944 297749 251637 337489 92463 266767 186167
13486 186167 211464 315702 136518 13845 202726 -163065 291290 189582 182933 264825
13476 264825 444090 32177 -8837 343467 222890 39571 119216 227803 506518 368387
13466 368387 127145 234788 96764 -55743 31340 -105459 2188 271733 174997 -63257 103122
13454 281906 349492 103616 596287 309584 59420 165958 -95950 153060 105976 61373
13444 61373 296038 133503 353464 446782 338148 375201 179304 424437 409882 325827
13434 325827 -161998 34453 592911 86144 -446583 160559 216894 422005 19944 157450
13424 157450 -62682 250579 400531 88682 316620 578971 352958 139880 349946 222900
13414 222900 161905 164209 272514 -194269 14295 97910 115757 51627 214532 518254 267009
13403 267009 348630 289936 122769 535041 137116 143677 197778 480006 339278 -176223
13392 24112 -23047 234525 42992 119421 -11217 61246 322330 26231 596107 337401 429033
13381 429033 242218 294886 111888 482287 182425 277500 171826 308943 89740 377691
13371 377691 -78738 49131 251606 263214 319989 222565 153418 512281 224610 105474 278812
13360 278812 71997 338542 -82563 -46499 121349 47021 -184440 45177 279136 325470 371444
13349 371444 422818 273011 323073 131802 619795 67243 253239 472960 316086 429644
13339 429644 306589 352637 100458 289515 504245 235062 159273 113279 258643 128327
13328 -47339 401320 377411 175173 234068 358594 365299 293300 15491 262563 212931 231817
13317 231817 129237 223016 319034 65889 335461 147565 78029 110890 277515 217382 536290
13306 536290 172882 246588 444395 501173 57996 244912 234463 -33538 157248 359840
13296 359840 -2052 85028 -88413 200995 -43503 51067 50880 253175 443514 115959 175445
13285 175445 134169 122598 126174 77272 262420 -157762 290603 419561 112667 -30597 177626
13273 -251819 296987 147591 396319 133641 89836 309321 102138 3449 73005 53107
13263 53107 120513 145794 186611 -89131 -76833 89684 213144 187918 204297 -87808 292442
13251 173395 149702 335115 102812 229653 246934 67266 -42429 305999 24122 -57767 124521
13239 205502 126954 -75137 417760 263027 -70538 -71991 -19757 63127 -345340 258150 46709
13227 -119704 -116622 113019 473357 137089 110972 -3235 139045 -132990 -106113 45661 -20327
13215 128638 -44428 260549 5970 -280812 20671 57711 -41696 66360 -45935 -2745 83540
13203 -86898 87096 -214902 -176624 -204410 -133673 238056 214171 288098 383072 402878 264078
13192 264078 -132174 21694 -59954 144279 199990 56687 22099 145485 231683 -32946 110504
13180 104303 66431 -70589 -317940 -260673 90645 265975 60307 276806 -190315 185991
13169 84877 49303 105263 -151199 180913 -216210 175946 13869 301509 340905 249770 -350791
13157 -83603 111083 207501 -121554 -347362 74303 28107 119804 41489 -61749 414697 84608
13145 -52088 371163 275439 -128992 31302 -208349 60207 132826 321021 309222 170102 -149500
13133 57636 167564 101395 60163 235255 302256 -111158 404620 -68252 444864 -169260
13122 -218089 -221520 184265 -217049 -37939 -61376 81346 96670 -68172 -199703 66504 -194377
13110 -206876 38373 202578 253041 -66509 -12063 300469 284386 239841 179437 -70264 75208
13098 169037 -111436 145932 133019 -11798 51312 432107 3289 76316 -110111 -54574 -19971
13086 89712 -33318 -12790 -79850 -101158 193967 103103 295532 -158715 -6369 -30453 42587
13074 6487 -69662 302585 -311828 393425 -191622 5674 -239018 168717 -53337 89647 87263
13063 87263 49366 -15336 -129420 84409 56403 37343 61574 178034 128452 32348 84484
13052 84484 75486 100974 -183420 146583 -36362 217875 111337 243800 92140 183352 -14177
13040 -200429 147599 272151 170779 186293 -4418 118448 -105824 3117 -69236 -120811 -149894
13029 -149894 78500 -114828 588 -46545 232188 -121078 209198 230643 256849 147457 151019
13018 151019 237134 -438006 105272 -323048 109050 383542 146080 334542 -60527 78988
13007 -243304 50460 2232 -133769 146564 168574 353818 44781 209517 45561 88472 373481
12996 373481 162950 -187676 244209 147273 -278362 344363 -60844 140227 56878 175497
12986 175497 -170892 58828 31604 121323 122678 313562 -113814 161951 -54739 -20748 118726
12974 37378 66285 -339819 -104763 61979 38645 92165 60232 132048 330519 -176490 181351
12962 -191193 193751 -93803 35248 -72219 -216333 -118152 -88644 -150911 274767 182491 119380
12951 119380 137755 122644 -8675 159430 -139929 -145753 -18416 -3966 -257150 -95788 38452
12939 -82561 -17458 -183192 305203 311786 -68727 -342503 -603062 -173659 132600 37239 -210355
12927 176984 148896 -85888 25483 -361414 180256 71073 346783 -28783 90501 -66089 269921
12915 -241777 -25257 -232350 43271 261722 -31026 109151 153980 -126072 217579 4297 50224
12904 50224 54574 -259240 -46572 104591 52545 -185676 51745 8451 -103932 -77396 96274
12892 -102528 341187 263039 -11014 207186 -70939 74994 -148641 66092 74283 26569 78101
12881 78101 4454 197673 -142636 -128085 108485 117101 -144252 -69994 67432 -164060 16528
12869 -36049 85015 39582 -256138 9563 -135519 -437524 73883 -75955 100975 -10551 -303001
12858 -303001 -149600 141040 -144618 10876 190958 -14715 18382 125293 325854 -59054
12847 63704 -15866 90941 3256 -155675 290977 -285433 -185714 -61595 -5388 -283806 405183
12835 -134574 -97168 202544 -27570 36817 -110031 -191330 130251 158287 -98347 210308 15345
12823 -83252 5056 125059 50801 145097 -86629 -149868 -21362 -35639 81547 -47642 142880
12811 250091 -35042 -299067 34537 32749 66891 126578 -245294 -116777 35384 134367 -65549
12799 -143582 14906 -96930 -89004 278630 -15725 -183039 -57973 -168961 19170 198800 115334
12788 115334 -25698 -56304 -148249 -115562 255 -123807 -140370 -90914 193365 -181019 2126
12776 -273053 -71237 -107735 363928 -48625 40144 127842 -45403 259431 -88064 -220656 -215507
12765 -215507 -36018 -72816 -12978 265538 18239 30519 -6099 69385 -9701 -95380 -148256 -221241
12753 -221241 -134971 -235121 -11351 -170316 74600 -158342 121958 -69395 186376 90016
12742 174855 -108782 -87731 -228746 -283477 -44607 -96545 530499 22861 180557 86665 -95834
12730 -37319 -131222 133692 91041 -15160 -3400 -266016 31921 55869 -147564 -108774 26781
12718 126350 229347 -107872 -83980 -194666 -108793 -51647 102045 234732 -117792 246752
12707 454047 -8825 215914 185837 425234 -8606 -210072 18059 -99893 113402 -84716 114278
12695 -56437 250420 -24913 -48805 -58453 111872 76309 -65969 -18862 80846 72077 -288534
12683 22374 226003 76775 446164 400934 150832 111830 -129051 151901 45190 -53144 -6834
12671 97218 163711 238000 201353 -57552 -33244 61529 150314 -82588 54512 129124 -163579
12659 28101 20623 -32624 19380 192804 77683 276132 -120736 33131 -292604 174440 221345
12648 221345 -403200 249897 149559 144634 132849 -115931 244029 277994 59953 -180781
12637 -70406 211638 235749 -71967 20789 234337 129567 177091 -34714 288723 -38336 1461
12625 -1533 245030 406477 128065 35422 132761 196360 352610 85825 -123223 -14291 456949
12613 -77388 -178846 281967 128791 -181821 -104878 113006 -145286 171957 20664 86854
12603 86854 250438 402683 -25553 38298 -21770 -153617 -209966 19582 27743 -37378 62284
12591 -285680 -155763 -101010 133049 -45337 112334 -81462 203110 156820 112610 -23187 -165322
12580 -165322 -339579 -124853 30810 96267 50607 120492 451681 -13151 22529 -33821 -86800
12569 -86800 -43604 -307428 -10509 -52352 156039 -37733 -19643 184296 -398597 177058 288543
12558 288543 215407 -489725 -29730 -152496 -187556 -370389 161580 35135 20870 101177 218102
12547 218102 -21228 -150865 193910 134067 -109239 -49977 -24832 55344 -81543 -71849 7764
12535 -24088 63095 -53412 57064 -140966 -62058 39023 -125451 -200555 217564 -240976 -20430
12523 -190681 87813 -79491 110084 -280191 -289523 -269440 34023 103959 -299372 199545 -7844
12511 360469 -53776 200889 315401 197710 -62532 190248 391545 195446 67717 -72435
12500 194725 234954 342102 -28532 195299 113355 -255907 -42387 -136301 -449820 43511 -112225
12488 445689 -276182 1070 104757 -32885 -39535 -233146 -183185 120079 -62407 -378275 41422
12476 234669 79632 -140989 257909 465196 128205 184777 -261634 -243861 -37663 -108569
12466 -108569 -340941 -73849 -195024 168747 -3212 -35280 -116584 150533 120943 299413 -380590
12454 -168374 -44527 262322 -91247 -48270 133363 -138830 201391 6958 -422755 -185532
12443 42902 -59230 -13446 41285 169576 174170 277573 64729 -294046 17541 -129039 -275511
12432 -275511 81053 89103 127907 23359 24273 -12211 -70905 -46945 -45047 132048 -243786 -7775
12419 249818 -73286 372800 -141572 -125681 -216297 37515 -66262 -51355 -37864 -226611 229350
12407 131275 90848 254719 -195175 310695 -364887 108894 67665 -18994 40405 -150817
12396 -84257 -393587 -122841 223780 -190927 91835 -328095 182308 -109797 194975 158708
12386 158708 -104297 42481 52492 155196 -144285 -114571 137891 -23304 150330 -69459
12375 -27145 -188891 -10235 -89913 -67155 -41150 156800 31461 -128217 -48495 -85231 245613
12363 -108857 25666 -32377 -112663 -146963 109943 185158 -262540 -83042 -220089 -192996 140001
12351 71977 -141399 105316 224551 -140421 -121313 -235283 16830 -5617 -124456 -16278 -131989
12340 -131989 -23567 489019 -90811 110281 68992 188838 -174733 60510 61922 21806 157853
12329 157853 37000 -12144 369196 144089 -146510 59832 145020 -52023 335918 125314
12318 115890 947 212600 226158 151601 78418 96015 131757 -101082 358200 179115 294918
12307 294918 51769 -28295 90092 230834 -28970 22012 212880 -8174 205453 96239 294423
12296 294423 -19497 18406 -70424 469796 164960 178187 162856 -15251 -88510 18938 250864
12285 250864 45486 185006 226635 236388 193445 -88388 -420775 29831 86834 -17464 116656
12273 15618 293347 365665 252607 126606 306075 -60260 -83927 -300970 92371 -114144
12262 21200 2340 141171 150559 150790 -21389 66097 -175699 30355 166408 156671 -34011 -66341
12250 -66341 -310324 111403 -11833 140986 141781 128499 -50206 68317 -184311 494742 276781
12239 276781 -72342 -79380 28732 148231 81668 -95631 -16185 65812 -90712 223173 85845
12227 4004 258786 -18299 226163 81917 100527 193062 184211 179075 174683 348511 307000 368179
12215 368179 231936 201122 186147 -32037 -6688 4636 152613 99958 312966 227025 131426
12204 131426 8630 251501 339812 230104 349764 372485 291991 130320 -12774 182018 597812
12193 597812 198474 319350 847419 337853 288443 205566 129837 317180 33884 329987
12183 329987 109517 252009 -75269 154371 123364 50878 113904 12071 235098 -3644 320213
12171 196657 -41289 224913 20923 60495 227139 136957 101228 430663 -117223 -110167 312074
12159 113869 657141 164801 218996 144726 181789 243409 -5544 -208178 -148270 127346 49824
12147 53295 -112664 -67566 198850 278458 180723 236316 311453 129165 96380 32260 189301
12136 189301 101308 242697 -43010 483384 107609 56359 98469 129890 -192492 37675 292906
12125 292906 56415 69171 359283 162112 112302 105276 257209 142260 247883 136433
12115 136433 284840 -11624 3638 331901 60514 118265 203579 211705 39452 534460 169159
12103 238304 229209 282897 -158368 65765 305863 201740 -83411 350385 210635 62397 107712
12092 107712 315211 -217789 91045 -162527 231647 170821 172152 74371 4540 -162742 -30614
12080 150069 114645 171886 -20520 188832 266235 90602 369529 70992 157030 -14598 5936
12068 -33107 19758 212151 -82325 -272360 395132 -243663 83549 154052 -70979 -178169 21995
12056 -172416 -223913 -371083 -33987 548744 357427 -117011 156052 101007 168099 371574
12046 371574 391689 131588 -13178 163516 -163777 -20265 -6201 -264210 -443147 5851 97756
12035 97756 -122416 -188201 136534 -335964 179909 -351921 -154833 19103 -2645 -94185 316918
12023 189476 236570 18132 108322 98249 -154785 212202 91567 299196 -170959 173999
12012 34791 -248140 -66288 -139458 -274440 -273020 -144589 -27406 175939 -138114 94530 302625
12001 302625 -112379 83985 206223 220069 -265463 319025 -36212 34912 58281 159198
11991 159198 18937 -4949 -16342 -59774 52308 -149307 37916 159151 5930 47898 34229
11980 34229 176620 75481 -216984 337537 268985 -158890 -232087 81393 42796 399158 94242
11968 202714 126078 -69641 -242379 234924 -193509 227818 -71961 -164903 -348325 43963
11957 -352479 74646 410739 -5452 117815 4283 13942 298844 -9221 26400 -12116 -263038
11946 -263038 137924 -380370 122915 84586 -107320 -123291 121506 34635 -96772 -25541
11935 232846 224948 -40154 141656 -260663 186045 143248 -199344 17702 -122309 -86627 -282573
11924 -282573 54587 8422 80563 -158808 60151 31597 -200077 -216812 136269 -224888 158868
11912 -248427 -12334 460675 -32631 153034 -175883 218938 -133138 127007 -245634 -292995
11902 -292995 -46497 152910 -86038 94535 -396428 197977 6588 54884 12491 -255410 76887
11890 539336 -75091 -180644 -246792 14646 8193 -118829 -307909 67880 70833 -27151 -194141
11879 -194141 149986 -136340 -139776 30376 -39845 -139938 -415274 13247 -72936 62604 -550228
11867 -73318 -201314 -65089 267333 -127565 -78777 -12214 59387 -463623 218382 326513
11857 326513 193486 -75370 180944 11423 67813 54203 -215432 37631 112530 -13073 13567
11845 -5655 84085 -179250 -243701 378136 -322548 -176898 -441176 -18111 -330073 -55680 -44350
11834 -44350 -192041 -126040 -15757 -84367 306886 75695 -374996 -233489 -616962 -131637
11823 21162 24505 -17699 74127 -37975 167096 -107842 -64341 38184 -93077 -177440 -54439
11811 -265894 22967 -318169 204149 -49616 -333134 198432 50194 -64685 112991 -60463
11800 -126356 -138726 -154388 -331912 -17571 -222722 -208120 -172609 -396864 -291200 103409
11789 -114297 77838 257640 13199 222145 -130867 103478 64218 52397 74320 -157645
11778 -24430 -4974 -126291 18195 -17081 5158 -194283 16053 69049 -368247 112437 -337825
11766 305710 39769 -123554 94879 -60094 77941 33062 -13904 298983 -74877 -304851 24941
11754 -68326 90073 -99673 150612 -85657 59466 -178507 -56854 -32405 42936 -426956 -59802
11742 50978 85124 -20485 234617 93952 27985 19435 51389 118876 -32810 316086 5318 -208465
11729 51994 -1429 132058 -132072 76067 -193287 24610 179396 -39777 -54858 -123790 37467
11717 239687 13552 105043 -262707 135956 84646 -119537 83209 185132 -66409 -178850
11707 -178850 108811 480090 -31069 289334 172571 -111326 72676 165710 110696 -363 133604
11695 -1489 -2454 -29689 105977 -12756 178850 218751 -38784 6069 -54601 83770 -941 -56695
11683 -56695 74878 -76741 -256685 124439 10008 -26399 133906 -69538 -269967 -290439 -66019
11671 101109 121375 -35306 -342517 284632 19548 -134705 -118230 -63351 40900 -151656 -57777
11659 -102040 -127152 159645 -73033 -62603 -112800 -248849 -47054 -32964 382863 268752 -216773
11647 28452 95079 44538 33161 98278 166667 -9296 -231018 52672 -321360 -283427 -198172
11636 -198172 43496 -282 160878 57253 -133347 -197808 241077 -17541 -59362 299810 -6534
11624 83541 38186 -231150 295342 223670 -243898 92973 167869 82222 174121 -47542 -2323
11612 -22107 -438467 -75244 -178768 7316 -16582 164423 -217226 -186260 -82659 -32244 108135
11600 192606 -103867 -243412 328823 35485 -271396 -203134 31825 -342708 111550 24071
11589 94374 21785 376728 -36893 215079 4496 -2629 91677 -47942 232166 1181 -107827
11577 -23812 169769 17888 -153154 16709 204453 231087 304275 -271448 43511 -41734 171439
11565 -195997 189480 -21566 146740 -304936 -548135 154995 99759 7389 103923 92982 -193846
11553 86916 -83913 32740 116600 268427 277285 -252403 41427 78276 378231 49756 -7365
11541 17251 51410 -237957 57612 174688 384813 139559 347512 197554 -111791 387081
11530 -195014 26078 30869 372605 59153 -269589 41490 174495 349942 37123 -63833 -13058
11518 16041 204343 247287 -316787 179456 -28378 152756 9366 -164406 -83116 -28770 420019
11506 -53854 -115575 133458 235779 231348 252030 174143 11510 163578 81962 304564 198149
11495 198149 89317 91091 658 -240226 32241 -139977 -58821 312896 -76352 247158 124505
11484 124505 192265 127590 128964 -205170 -58472 187028 194036 344980 -15128 91836 -15458
11472 144354 318728 94186 127113 88130 188044 -293817 -450 128837 163679 185130 139024
11461 139024 -96421 191076 -43912 96816 87928 146308 356103 -83229 -38444 -36522 391629
11449 373991 22968 -85645 64843 -112558 -91906 -176213 -201413 14869 224762 134373 -246415
11437 -84459 -172391 44180 123495 -64496 -147610 481572 -168189 -87238 280205 259895 265295
11426 265295 146895 -380304 80450 188553 258212 -122932 -28066 131245 -101745 -126831
11416 -126831 63784 -10362 297054 -79555 -7073 -53828 -265932 452273 -28257 240957 76487
11404 146552 44049 190518 113035 -135173 -189798 -5404 128898 -79661 -204964 18058 -353697
11392 17230 -69906 -248170 215382 -82027 -14529 -150011 161779 -118485 -108884 82314 -177770
11380 -82485 -308554 340001 -310457 -223080 152860 -192116 102708 -335976 4902 191326
11370 191326 -249448 -182032 -191202 380522 9352 -123537 -145007 -113294 151544 -212362 -3154
11358 -86882 -146393 -51479 112008 95731 -42271 57517 -41160 10491 87746 -227668 153236
11346 -2964 110037 239571 -192337 259252 -101667 20405 117887 43570 -363053 112288
11335 -151882 57060 -224256 -240833 437354 -575296 -231290 103462 17892 -226547 55719
11324 262859 2882 -58394 -174739 43876 -14879 59154 180777 99044 -126069 -145092 -83594
11313 -83594 -234123 68338 33089 -77781 -89725 -248780 3831 167119 -122327 -250988 -430876
11302 -430876 -258631 119783 124235 30687 -47866 -116463 -35259 250870 53569 57406 -30761
11290 -31594 -230772 -369469 -275839 -261185 -79323 -252537 -170049 -85475 257491 265290 38030
11278 19523 -43027 -17587 -326011 205251 -334152 -69225 -39632 -168923 -237136 -294989 -234741
11267 -234741 -63003 -201512 -88721 -307563 -141560 -54828 -265328 -95172 151766 -461404
11256 -191806 158269 -37708 -378803 -89467 -147979 230751 79587 -321368 -196264 -124113
11246 -124113 -189548 -49676 264693 62849 -395838 -142858 -205956 82958 -51526 439997 -38106
11234 -298019 223129 -20184 238171 277868 231160 -152718 252841 211204 -59603 -81407 -230464
11223 -230464 158306 -328078 141521 191099 55611 -283532 117413 39847 -88570 -209531
11213 -209531 -167415 93485 -33630 111713 -65612 -150589 -267591 -279166 -71090 62327 -179489
11201 136030 61845 -176710 61053 -102240 -217246 -136874 391047 -409370 -88467 -237689
11191 -237689 153520 -120631 -17935 -40946 -65532 -34521 -239105 -16334 131930 -2004 -264558
11180 -264558 11193 -36711 30940 -61467 -248226 -195804 -156667 -83580 -105376 27237 96864
11169 96864 -24766 -134736 -135225 278687 36882 -562254 -228864 225848 143730 -204678 -72803
11157 138489 -156734 -80959 122481 -126976 37757 -344678 132374 -58206 -134586 -31335
11146 -184486 237389 249690 112541 -102036 -194512 -77120 -105176 -145146 258500 -105864
11135 -36030 78945 -245850 275157 -181528 -238738 158275 -6145 227237 8462 311480 194581
11124 194581 241586 -165793 10700 -21040 -166865 125626 -118727 122535 126878 53118 14392
11112 -40819 223343 354289 131360 -159963 -69563 183039 419163 113638 -251134 362908
11101 272733 10033 111105 205974 67188 119862 101078 225493 160365 184974 556250 80576
11089 109384 232147 173602 239206 264909 29479 292397 293639 295155 42819 7515 200585
11078 200585 418567 248542 326526 461458 418026 190938 97732 631840 264069 39947
11067 137600 304370 456286 495273 393790 188493 399544 200287 305559 423219 503131
11057 503131 717401 778921 683590 582037 412154 599374 825042 869566 876405 676146
11047 676146 772150 823022 692687 699309 479019 1057106 1045885 1132301 662013 784045 684052
11036 684052 919342 968172 795527 619797 730734 566171 425664 862509 748765 803502
11026 803502 811865 885930 636898 862289 903221 838049 723646 764584 685414 103251 751069
11015 751069 705133 854286 604743 637036 834085 720835 513633 437202 761793 757793
11005 757793 748883 792382 614104 685454 800859 632372 243834 590835 981834 798022
10995 798022 765798 734312 816860 753082 744126 902785 692068 942411 705131 843628 518007
10984 518007 616188 692875 953220 885513 1028593 1135487 1152807 1036227 1114222 1643269
10974 1643269 1672416 1875153 1800524 2592802 2636909 2892390 3007512 3202891 2951020 2818550
10964 2818550 3014668 2771293 2702556 2145274 2114573 1724598 1733578 1530720 1565311 1411226
10954 1411226 1576478 1768780 1498271 1323394 1814653 1502893 1078152 1098102 586171 1017400
10944 1017400 646189 391073 765769 421075 326062 453524 220643 413457 393532 185676
10933 43514 143094 -113532 94794 24627 33371 22811 140568 86699 72358 199112 41103
10921 176130 257838 -157842 16103 -165958 168579 -322184 127203 -132180 58768 -99759
10910 68002 -187975 81193 -233016 181558 -14990 -90562 171522 -220086 28676 -41183 -610092
10899 -610092 73866 -35699 265671 -212906 16974 -105967 238826 427512 -7952 88781 -148695
10887 34683 -112255 -337300 -97781 -113062 114012 -376298 -78682 195827 47725 295495
10877 295495 -285987 -87837 62582 -50503 -64628 -93380 -215569 128475 -99312 -41998 -42010
10866 -42010 -353060 229462 -59169 250339 -234201 -132481 35426 206008 -200839 104445
10855 255314 48129 16093 -263097 -81441 -211648 48299 122752 182300 -154319 -82575 -80405
10844 -80405 70974 148966 -108224 -71914 -459992 19978 -181740 -36741 -65447 170241 -21570
10832 20075 -64685 193084 -99575 -290846 -254218 -55866 -43146 76468 5267 18129 -112422
10820 209980 83706 132753 -147435 67897 -33003 -157148 -250888 77127 -298957 -69497 -62386
10809 -62386 25831 -86267 -232537 -56061 -7277 81448 -108697 31165 13920 -83073 -63006
10798 -63006 -4564 -147176 59922 -131508 45947 108130 -55336 207846 -15572 -311929 -104471
10786 -163613 53645 56431 188087 -27462 67197 -121653 -3689 -111690 -60217 -133841 -296537
10775 -296537 56361 -81452 -324935 -68031 55121 -156521 -64335 240944 -141569 117135
10764 48772 -98349 220930 184122 -32889 178217 -168238 -31853 -72426 138058 -23860 154100
10752 -224439 -76364 -214094 -81183 260083 -193170 134885 112974 121120 -41035 48857 -139581
10740 -117979 -130813 -274131 57170 172916 -126735 6222 107059 -43227 21295 -211222 140282
10728 -211440 152374 -81309 74660 155370 -149278 -74318 -20575 31163 310127 -37182 -68872
10717 -68872 -30993 -238341 -200028 45455 1086 -142403 -47509 -55669 -185087 50322 -136491
10705 -104654 -194758 -116938 -59628 104865 -317855 -131566 -45896 38726 -65740 -66933 186289
10693 -272150 59570 -163393 -110294 67271 38822 105969 -145466 -18087 203966 -280506 28206
10681 -59351 214324 118457 -208296 -41907 -184954 -153165 263308 -36487 -275187 -543782
10671 -543782 -197833 -300177 -46217 -122720 -2838 -352275 -76598 -195737 -71695 -94125 -344405
10660 -344405 283252 88200 -93723 20542 -19565 -369674 75561 131069 51838 -165820 -182920
10649 -182920 -8329 -253016 -124852 -12408 -285881 19586 -145327 -60106 -56229 -57489 -141039
10638 -141039 151584 -67799 17100 -290281 -440687 4522 233581 -83798 3473 -6811 -196078
10627 -196078 72500 -137871 -128221 193106 13748 -227901 -40316 -28152 -12124 59940 -83521
10615 -143356 -221557 189628 6417 265081 38563 -134433 -170329 168307 -363308 -84823 -5587
10603 -107154 -50803 22920 111274 -130935 -49710 187805 -78713 -196508 -228169 79275 -58442
10591 -140778 330736 28139 -190225 108292 87318 -71087 -97132 -252988 -60604 -261913
10581 -261913 -17085 11833 -94945 24263 36201 85087 82371 -203259 -226402 -20476 -125621
10570 -125621 -33657 -100175 -216045 54565 -326892 -241712 -92254 41333 185468 1624 119374
10559 119374 86555 -99386 40736 -28649 -18409 69112 26825 -17629 -35194 -340859 143733
10547 175660 122632 282864 250478 -49371 234657 -32433 -48268 -42268 -183380 -166089 157666
10535 -9091 84200 28395 -200084 200608 88705 26677 157295 -133197 73470 -301861 -198507
10524 -198507 -35958 -260779 8130 -33154 -149212 151312 -74527 -2200 -52797 -160491 117567
10512 123984 -143443 -284858 -227535 -252891 199547 151827 56049 7919 -211182 -39608 230993
10500 -87675 253486 167806 -144084 6087 122455 199471 -16688 -11852 37692 -17984 75096
10488 -402830 -158853 116629 115273 -38862 -172321 -43732 -160109 14305 89270 165173 -135082
10476 240831 513948 401144 386306 66372 300043 420281 -258403 274561 -137185 132502
10465 18235 10328 -15647 162742 75551 -80670 -21011 -333820 -176771 -94687 -4830 -29359
10454 -29359 -323657 261447 -182741 -298251 266654 26914 294080 -207953 184550 -5340
10443 -54064 -297989 -563025 -101655 -67631 -53074 233834 201227 278320 108668 -191239
10432 86737 188265 34577 -282765 25045 -406257 -38252 -184047 -130267 -26915 -352395 283999
10420 -129549 10628 253682 -220801 -11329 -224296 5520 32159 -179294 -127433 65194 -94486
10408 -75565 -233103 179992 141485 -175319 -326348 -199330 80504 106401 -24959 184256
10397 -255327 233106 104501 -148581 143132 11415 165839 141564 -269173 -152531 235231
10386 496747 -193208 202929 273677 163074 -6951 -138 -150847 367948 -92971 212911 87584
10374 338418 295985 504524 590989 184669 149035 86306 72872 -13114 377718 559018 464888
10363 464888 335897 435939 307987 218611 392087 -135959 82461 110099 49450 14800
10352 160671 183800 589243 -10862 289522 538879 536149 208424 309598 521278 165985
10341 295879 450196 270370 139448 52320 -82297 177319 216151 -162664 72406 186034
10331 186034 -98626 82071 178385 50675 53508 17030 -143421 -34273 45127 128936 125805 180121
10319 180121 209497 120251 -64383 115249 114828 91218 129480 183252 336447 81281 173851
10308 173851 20649 -203047 173892 -44112 222877 -296100 253685 100667 -100570 334837
10297 -26091 34959 36160 -40342 -38633 -105326 -121285 119728 81039 80305 -130143 104644 190897
10285 190897 -290250 -83499 -153483 -129109 -150470 160539 -151476 -87181 -11905 206106 -375792
10273 -14332 -239681 21061 -254029 -47845 107722 -12995 69787 160682 -86646 28879 -359677
10261 -209781 -15887 -140595 13590 125296 188765 -370303 105341 211558 -102119 72468
10250 -147751 -278778 -90442 206642 -19170 58699 77143 -85522 -309392 -149493 64618 3534
10238 440232 -60503 -112985 -131039 88405 275203 -17992 -180653 -301282 -11822 -339028 64527
10226 71870 86741 63839 -141497 51981 95469 -298453 35088 -161886 -264200 15646 336346
10215 336346 -126103 -28186 -3560 -28094 84976 -211453 57203 -54494 -96793 -94736 23696
10203 252943 163998 47375 159200 115406 -253610 24613 -342550 -23956 -54581 24873 -374609
10191 -349205 89041 251815 133322 -85020 165931 -188733 -4209 14468 139060 -180825
10180 -365392 -73574 -28142 120611 -109222 -348678 -96600 -9832 -159695 -242155 -42248 -125537
10169 -125537 92222 -95641 283774 -13624 44676 -28017 -148096 224430 -99987 287676 -173061
10157 -33959 -280279 58617 -281851 93767 -185376 -249687 -91467 142393 -3389 -143328 -163050
10146 -163050 -325585 43104 -46928 -19894 -230130 -325541 -86963 -153421 -97881 189899 113257
10135 113257 -257870 -274487 -39996 -121027 193974 -252944 -46771 174483 -213485 -53787
10124 -164995 141051 -71317 -79117 -39033 -188917 -46921 -167787 17481 -43344 -91929 -225738
10113 -225738 229491 -82507 -9978 136933 333066 -19604 -182784 -137723 387766 -282405
10102 269150 203152 7645 -177463 44182 -379427 61538 -284220 -300001 17954 11738 -49699
10090 -128346 -29912 -243886 335545 168392 -57809 75983 9545 35864 62411 -45822 -398447
10079 -398447 -337773 -349698 86019 -206279 -212848 -34911 -46523 -246096 -179944 44105 -72948
10067 157629 -158721 -365776 -120212 -19812 -102746 58576 6086 -292047 -23922 -234923 -136325
10056 -136325 132880 -261886 -255750 152289 -36254 -119503 -31247 -148156 604335 -51215 -99090
10045 -99090 -177347 -288236 -146554 -248530 -250907 -303902 -120882 -74983 -496443 39217 104590
10034 104590 238775 -38244 -101912 123765 78786 -567970 89878 -279375 20135 100438 -44392
10022 -104129 12141 17119 -59706 144723 -416263 -67353 69852 -280162 -143804 39379 150823
10011 150823 -25224 77407 -5246 153548 99639 -186390 -416661 -304985 -41663 -164152 -125047
10000 -125047 -47519 -145229 186261 -290937 72750 82905 -121105 -246089 82 -233943 -266864
9989 -266864 56387 38216 -40177 47786 -313835 -131618 -296708 -215326 268089 -177804 14107
9977 34925 163374 -135796 170488 -208883 44696 65870 -126229 17415 140596 -92375 -9872
9965 -266166 -157859 -10920 -157886 51106 176679 -23587 -93433 136827 -15593 -123758 182674
9953 47654 -14404 160559 87948 -196053 81049 -120522 -280589 -331864 -34992 -469212 -214680
9941 48707 157693 45875 51093 -80447 -156725 -256815 -269374 -63815 194871 316286 -263941
9929 253630 -180761 -97662 20836 -317552 -129976 129573 202869 -226299 -24746 -112690 55194
9917 114333 16138 -125064 -184224 57171 316859 -182701 -192188 -77130 46742 -15123 3734
9905 -7579 221265 -213690 -106535 -85356 -66457 116785 -370822 25736 -267034 -26882 -271317
9894 -271317 304603 158731 -735 -329909 21640 -110615 59345 -165191 -174656 -323147 134894
9882 250477 162348 93270 90260 -155634 150771 -98520 -196902 -687624 -309411 -225528 -36629
9870 83078 -173032 -378534 -329963 63499 100121 147922 -33693 -93830 -21174 -279854 -146627
9859 -146627 78139 -247641 149385 -120457 -221665 26689 -329298 -119967 119563 -350923
9848 -5191 -98062 -111469 -22823 -32258 -61002 -209070 -20268 7498 -48351 158186 -149093 72976
9835 -36177 344634 -62556 -19543 -26946 25849 -8272 42553 -219263 -232991 4786 -200051 -150297
9823 -150297 -258377 435340 -99885 -247134 -140940 -96870 78254 19700 -154029 -182751 -344762
9812 -344762 -21431 5925 81174 -118257 24206 -125068 118821 -139335 75453 -273524 -137561
9801 -137561 -49079 31410 -217998 -120395 -158931 37834 123612 322768 -15033 -108826 -167273
9790 -167273 -332573 109199 -347181 -270822 -327273 -74959 -164907 -125507 -215533 -461499 -192712
9778 407508 -67140 -239561 228477 -296614 -192685 -256073 25288 193086 -76238 -353691
9768 -353691 11248 -176172 298769 146561 65130 -186733 -363926 15634 -131573 -411797
9758 -411797 -156913 69433 75157 -42543 59989 -109285 81362 -202010 -13314 6842 -107397
9746 34756 106225 60109 90874 -242193 -44891 -87299 -38524 -138981 -326728 104042 -70230
9734 -205414 283330 -178331 -153582 -396430 -246149 -69287 74459 249547 110501 102923 -65371
9722 -278236 159471 136193 107455 237782 234996 17748 324066 342010 -193952 -148313 267188
9710 -45425 -218667 190369 -81872 -139598 -115310 -154034 138232 -192846 -58544 -122554 -14415
9698 -220654 -151557 -177052 -40741 -271018 -236218 -205432 -152338 -132628 -494385 -89282 -100123
9687 -100123 -105440 -168181 191297 -37030 -229693 4070 -78647 157908 164098 -264931 -226285
9676 -226285 -187911 -4797 -124137 -212249 23277 356266 -302990 -199122 -29909 -15369 -20792
9665 -20792 -169653 -442378 -107831 -114906 -143263 263210 27891 34918 -165950 -239882 -285996
9654 -285996 -101130 -6551 -148909 -54675 -58270 -405011 11579 -68350 -64309 90515 176515 -219446
9641 61009 -156587 119476 -298360 -251051 115408 -13636 146553 -193977 -92453 89730 61952
9630 61952 -55237 -58166 13459 -53571 151933 166366 386201 63199 -382833 4292 -336509
9618 6118 -84803 137994 -15305 114667 -244313 -182945 -213200 97434 -51193 -144150 193081
9606 -168400 -31673 -252809 -8794 -468043 -125186 -63023 -277568 -227507 48194 -25894 116066
9594 -276374 57617 85761 -19314 164207 -232119 -66572 -108294 -87784 -237795 -129674 -126205
9583 -126205 68774 -200608 81347 -185421 -237735 -84948 -239322 87712 145208 -124392 -99635
9572 -99635 -268856 -62075 -131343 -173959 -172104 -173878 -110816 79880 -409710 -187607 -36242 -211092
9560 -211092 210546 -47756 -271671 -467928 -245414 47028 -19044 -89465 -44057 -163055 188595
9548 -468535 -91318 -230274 -100148 23747 36836 81395 98372 -72269 -131027 -331195 8399
9536 -465811 114440 -40379 -114655 -306871 215899 -36798 -397406 -85377 78886 -433980 -13096
9524 53773 -241558 -157521 130060 -162791 -12631 7513 157432 -151848 -179036 -122617 -120876
9513 -120876 -143608 -171070 48734 -116383 -70873 63318 -31080 -411732 131916 -109242 -4998
9501 -69690 36823 -141083 -318185 149567 -104494 -343110 188168 163729 -151905 -67769
9490 -225848 -256525 -213411 -62447 -169192 -32212 45856 -198076 104151 141385 -76686 -161761
9479 -161761 30051 -330223 -422406 136810 244291 -204524 -1188 6788 -322633 125316 104237
9468 104237 -56182 -197168 -180845 19637 186536 179558 16721 -279477 193403 -52070 -196129
9457 -196129 -131828 -102680 316709 -61151 137159 -137076 62137 -114822 92392 -153917 122599
9445 -36780 453 -277935 -343981 34689 -215705 -43272 -111734 -171052 211102 -86316 -131380 225600
9432 -54840 189056 4826 -170270 -209195 -212434 -88159 -209607 63583 309484 -53925 -124940
9421 -124940 -158121 -180379 -266215 164984 -174870 5129 -520091 -32031 -279964 84669 -174434
9409 -148330 -176807 -210756 186849 -264922 -143898 -62721 -21153 26600 267307 -130864 -12236
9397 85358 -55073 80472 16205 453284 154702 -111935 163288 -527306 -167573 -212044 -145240
9386 -145240 53054 -29063 -104062 76748 68709 -154461 275863 -154337 -147656 -4344 -260840
9375 -260840 -44402 145703 67104 -183367 -3121 -224683 54529 -201186 45818 -264521 46140
9363 -232341 -128333 -238200 153954 -18741 -123614 -64882 -247690 -149534 74579 -294400
9352 -12667 -102220 29100 -96895 -208177 -186673 257105 -149332 -236683 -19067 -422974 240582
9340 133046 -97585 -293567 -81378 -57930 166344 -80455 57214 -5899 -85276 76762 -145787
9328 18612 163751 -197780 -135708 -14047 109616 169385 -634694 72362 -126733 9396 -144527
9316 -10775 -158834 20800 -97931 -63595 -228557 108234 -69862 223151 111771 28283 -139306
9304 -69085 62907 -117449 -144649 123349 41469 218203 -196068 -245451 -8455 -226819 150240
9292 -121131 -226118 -132574 -103367 252124 -350678 -57201 118041 222747 -58705 -65519 71631
9280 -148466 -15002 -164387 -228216 -62337 -161082 73722 293385 -16643 -42239 -105969 -128920
9269 -128920 -93395 -2494 10241 -12280 40223 -71790 -84896 -164381 -133185 -11944 -174651 -175843
9257 -175843 -99618 115357 11236 158374 -138655 187385 -133499 17507 -89062 -48896 33789
9245 -96908 -141763 -185926 -155787 30040 -149698 217726 161660 -187003 -45524 -492115 -47392
9233 -201043 113460 -111295 -199241 290362 -362106 -14753 112039 -37243 -225319 -89306
9222 -217875 -236156 54787 31539 -326858 53434 92054 -53084 171109 48003 -226337 103072
9210 152295 -85598 -138545 -79485 184541 -136815 66685 -3517 -103560 -75941 74385 -54538
9198 43904 -19537 164823 -218168 1233 -35382 128465 -257172 -91287 102976 -373011 -234700
9187 -234700 -253164 -84410 -91925 -224205 127327 205499 69259 373026 149886 77283 -444318
9175 -331135 245387 55536 65816 -113845 -465983 -319352 -83715 -82163 -278775 -91403 -142360
9164 -142360 -258364 -18424 -85415 -18634 84078 -33166 -95626 39937 -24003 -81050 151884
9152 203779 -77202 -546084 44991 90779 101057 -123762 -73191 304451 -209518 -38548 237215
9140 -120436 -294273 -111902 -174139 142271 104182 41209 270060 -189768 123373 59485
9129 -475841 36177 -208740 -164494 -142500 -265284 -27685 -169995 -67768 249767 107385 20483
9117 -153283 168775 22598 -127451 -126213 13291 139959 -90277 -153430 -93300 -83540 -156143
9106 -156143 -231586 -31995 94141 -452930 -293946 -105451 -153700 -35574 50286 -36572 -437065
9095 -437065 -161844 -170308 114413 -5226 75374 244251 -3150 -27520 21015 -26913 -208013
9084 -208013 -200336 103537 80715 -434570 -257840 -134844 -42822 66303 392562 -122350 -145450
9073 -145450 -81999 57810 -209355 51361 198997 -116161 -206733 -124000 52458 -41219 -194428
9062 -194428 59040 -130186 43937 289441 55486 -335873 -294774 -23307 -95182 -10872 -206050
9051 -206050 -368842 -12666 135012 -14784 210373 -79231 -430679 63172 -21921 126506 153507
9040 153507 -150576 106834 -330361 -174914 -155914 105891 45298 -32515 -137611 123068
9029 170107 -205366 95565 -156052 -245355 76913 110616 -237538 28969 138662 78391 -110212
9017 30535 75923 64354 -185059 -35902 365 -43667 -248510 209799 -107287 87204 -190875
9005 -6697 108643 -222375 -32262 74003 -87090 -140469 -97996 149222 100384 -329817 -308312
8994 -308312 -105504 -20835 56642 -300448 -324764 -12266 20636 40404 -76965 -136440 109987
8982 15348 -154483 -11697 -72810 3829 105023 -105872 -146716 264303 81188 270388 100897
8970 -393900 -1663 -359820 -154882 -330180 -85030 201156 -75731 -30885 -28968 77984 94627
8959 94627 317370 -157747 262301 147962 -24658 -186930 159788 -109144 245041 178714
8949 178714 -133269 -129670 -184155 128575 -214825 106435 74950 28766 -374206 -78097 38867
8937 23559 206359 -97234 89796 257095 313787 484626 291409 35599 62257 27466 153066
8926 153066 241265 67047 159423 368016 808791 2258512 6230984 12914154 6932036 3041764
8915 1661344 521650 643190 823434 356089 289885 2639 55802 -67378 101082 471524
8905 471524 299834 -86157 214795 261 -21011 193054 -306455 -105631 221068 -249000 -160190
8894 -160190 -285565 -151141 -266188 -223790 110118 -97718 372644 214194 50568 59520 168481
8883 168481 14321 9162 20202 -131627 66763 -201690 -165462 -181830 -185254 -163982 10 -244108
8870 -260839 326327 -254070 -121926 120228 107520 12047 -147641 -54386 -69061 171740
8859 -96084 111827 -219454 332238 -121664 -53704 -169252 -64268 -324297 -333521 163834 -10413
8847 -85724 -43049 84710 -333226 -197572 -21130 -320984 19176 -4959 27612 -115320 27639
8835 12355 -403643 121433 194362 224247 -173219 -12387 -115227 227223 -230729 -447863
8825 -447863 -221147 -8471 -50088 -114415 50860 -387888 -14990 160296 -55628 -195313 -115038
8814 -115038 45531 181075 -309146 -22692 -167765 -150289 -213438 -308111 120312 -11219 -166548
8803 -166548 -308207 105898 -350727 277126 105835 -109168 -290745 -201379 242419 197716
8793 197716 -20675 -13434 -16526 -115394 261416 -30234 51389 -380920 60731 -7350 92204 -111179
8780 201526 -245864 22519 -163582 -280075 11652 -61799 -159230 -345986 -55234 14721 -117704
8768 -50937 106397 -69475 143167 -218612 127056 -44193 -7303 -247631 -110332 -190533 -89624
8756 -35131 138834 134732 -2277 70213 -184056 -425042 -185292 -67617 -224737 38127 -109082
8744 -85653 -253873 48357 -35011 -366 -186231 59132 -174155 -39581 -211821 2003 80905 36452
8731 -117666 277530 -181314 -285482 34155 -90561 -56971 -54650 -29301 -267853 -135029 25558
8719 61130 -229690 -289514 12228 -77839 154959 24665 -101287 24153 51328 -409976 163556
8707 227980 -219804 86783 -451040 72996 262512 95172 -233939 -94060 -127855 -26665 299692
8695 55464 68750 -211936 -1169 17201 161889 127341 60523 -129010 -160087 18454 -1349 -174363
8683 -174363 68124 187587 35137 130156 213105 90777 368688 52220 182629 98795 -63270
8671 3269 -53360 39391 124187 -366338 -82709 153906 45883 -93390 -49436 -270534 12134
8659 24692 201376 -121299 -248262 -166795 -142226 -60955 -98220 -270912 -215794 233676 -13659
8647 26101 -82856 275389 -138626 370655 -244602 -163507 -131937 253621 -173790 -119700 -35676
8635 163545 126415 -69025 -244679 -98891 -116004 423371 113239 -110867 -15174 40632 92861
8624 92861 311430 17072 -105968 158253 40070 120712 65847 -339268 13296 -314285 -28404
8612 -54945 -169138 308823 -44717 -104528 -87260 -105875 6219 121688 -155445 -18793 25698
8600 -80445 -12179 21843 123133 -254276 28665 28336 -18895 -29850 -127614 -274951 -210521 -34333
8587 269962 214744 -298621 52862 -41016 -207177 -131423 -100454 -186598 -301920 -150948 -228127
8576 -228127 -374658 -34522 -130849 -195152 -97116 -257977 -96149 -178772 -46844 2182 -53159
8564 -202433 -93651 41544 305565 94965 -82414 244272 72156 -317473 -95978 -355100 -258638
8553 -258638 -87338 -145332 -163 -79217 -75110 237966 4966 152835 37647 -194882 -39414 -361642
8541 -361642 -342158 -299208 155974 183096 -24310 -272326 80749 -102714 -75723 -172351 131655
8529 -96755 -291769 -23035 215489 223793 -181622 170234 -420653 -169226 -29862 122413 -378065
8517 272768 120072 -229006 192843 15967 -62438 -22410 144927 413752 -58222 -372213
8507 -372213 -48365 214815 17775 354240 -483339 101145 -180844 -188003 -149074 -68354 -120601
8496 -120601 -194382 -135065 155882 -145359 -369566 -49517 -266090 126822 -126442 -19435
8485 203775 112063 -141942 -33882 145612 -191029 -182621 -130989 215316 -333343 -49974 -20923
8473 5649 107231 -119744 68882 -167965 39060 4218 5347 -374492 -142400 -109529 -34328
8461 -361264 -222689 -71709 -184796 -33813 142428 -149902 355277 -97340 -12555 176254
8450 -99486 -168490 85266 -189743 225622 -82594 173744 -90156 -125511 68141 -36685 111688
8438 324214 175665 -239729 81170 -25206 -30078 -55194 -78183 -123021 -43537 -353935 -60004
8426 -252003 -20784 -73429 -51278 -132290 -47544 -234651 -194298 38650 121907 -29028 -67009
8415 -67009 -180134 -318492 97814 -13424 96759 -239873 1597 -227857 83342 -303571 5420
8403 136289 119653 -281536 -239261 -177557 204433 -12258 -80260 194761 246493 -199069 -142830
8392 -142830 -163060 -102576 -144763 -212367 152313 52726 -194864 -246039 -39285 -140704 -1419
8380 -127580 -231954 -130121 228722 -42685 145870 112 -95364 -165182 -164864 26708 171759
8369 171759 -172965 -116537 -181240 3473 -73601 -161443 -51385 -95515 -39539 -18740 132037
8357 208343 23963 -94695 -160007 353447 35494 -14686 -248525 -194980 182537 226140 -184387
8345 -64154 -125124 -170368 211638 -365264 -76709 -107342 239761 199365 -241771 -267794 -140595
8334 -140595 86577 -121772 -164190 -92117 -346902 -152132 -461405 28128 149930 -269511
8323 -204046 93136 3789 -206041 -264267 -77108 -61292 -94085 -18629 36061 66671 -80422 -87215
8311 -87215 95116 -295613 -109720 -49956 143187 53566 194296 184612 24466 -142325 155388
8299 79064 -22826 -112744 12916 107010 -168864 103623 -210589 151343 17711 -158414 43608
8287 122693 -138379 98128 355341 -10175 156963 -138305 194775 366775 -245109 -132097
8277 -132097 9119 -100367 -304158 -86742 88269 166729 -134793 -181730 -10282 25469 -175689
8265 154509 -220412 51840 -244259 121568 -218652 119605 -36725 156599 186723 -74162
8254 -178274 149495 134733 49358 -97992 15112 23747 50540 14665 206177 -180585 2096
8242 -214352 116594 38294 -196079 28169 -29247 136566 187553 -209453 -99170 -28951 82711
8230 -181583 -207849 39930 130779 -94216 192980 56875 333521 40499 18157 -62508 150539
8218 -42424 -525660 260081 -46344 -225101 58162 171233 -60856 280360 -268688 84261 103397
8207 103397 -41094 -312953 -68247 210207 335327 -238716 -112551 -64898 -358650 -189082
8197 -189082 -55390 -167624 -9493 -306583 -168637 268457 -143584 14917 104392 93043 -150176
8185 139878 -54659 -188228 -142836 -186100 -88662 66167 118813 81203 64528 -124796 -235814
8174 -235814 -120159 -533204 315400 -72102 -234535 -5550 344758 9879 59472 -53243 178544
8162 -189463 -260303 -171681 -379574 -140979 -394024 330965 44257 -172678 -119486 -339566
8152 -339566 107129 138679 -39435 -2202 -323154 -35609 53882 -63264 72295 -161992 -78646
8140 276013 -192071 158739 -267378 -28291 -224906 19111 -236310 22517 -116765 -35738
8129 -18249 -108945 -160271 -17308 -28059 -114498 136120 -14553 43739 -113358 239040 5006
8117 78382 -56275 120526 -98463 -245219 35720 -121054 -275980 277000 21703 33333 174360
8106 174360 137614 186080 -45445 -90302 21263 -104103 206542 -123636 -17962 -51864 250141
8094 4886 240363 254207 66545 88882 378173 -310982 191771 21988 112424 -123359 -42804
8082 -211233 20814 -47810 128551 52637 69327 -117630 45634 27045 -9953 -292533 70308
8070 224216 -3270 -192314 108691 195909 -207344 -50403 -98508 -342871 -125608 -54118 -274024
8059 -274024 -86794 -216154 -24172 3150 -99513 -126481 -165742 -165876 61753 128801 42899 -482302
8046 -41485 -77654 474906 84771 233174 141808 -334274 -67656 -244417 41445 -64941 154812
8034 -348929 -59896 17853 -116313 -202858 29643 -85948 16586 -526848 -58239 -118032 121521
8022 110460 92433 166888 142231 -105746 -159707 -463083 -16458 -91386 144684 -375457 -280908
8011 -280908 83195 142901 174153 -12085 -116507 -195801 -95482 -42412 -124424 -418877 66086
7999 75177 -336328 257759 46787 -237336 -229608 -113886 -83154 118781 -344297 -121929 95462
7987 153038 40055 46291 69355 -141051 -259906 227821 -132204 -77355 40543 -155092 -143541
7976 -143541 -197505 202654 -161734 52548 -301239 -185048 189904 -162319 291425 169833
7966 169833 244944 -189275 -288439 -111319 -96903 47062 214267 189543 -197814 17126 -18335
7954 -52093 156539 115460 -262418 -83688 -48404 19338 -230191 -93994 -103959 -19868 -176063
7943 -176063 33431 -153455 -50935 -126876 -195836 481768 -389601 -7870 125425 -31914 -168527
7932 -168527 14280 -25532 55812 -405405 -326491 -212622 138607 235227 45676 -294103 -86007
7920 -23470 12290 -162082 1016 -287384 -254497 62046 355025 -146678 -119444 -407712 -86337
7908 -410249 21812 312039 -379875 266466 121778 -212096 -67104 -66081 -218799 24761 -184794
7896 -837 -137095 -146184 -202390 -44489 -123628 12072 18069 83933 -227007 38524 -35825 10383
7883 204883 -138719 24268 -47298 -51903 -17516 -143516 -163434 -170773 4662 -156454 -54994 -211223
7871 -211223 -35901 15700 33440 356017 100569 -38543 320357 -77587 394119 -191828 -53663
7859 55703 -171173 2287 -96523 -191440 -23630 38162 270310 -227931 325013 -350014 -153607
7847 4747 154068 55905 45580 -144105 -48838 -219730 -69209 -363965 16163 59290 -73107
7835 -19633 -72348 -26637 -4932 71995 148098 86432 -106930 162139 29565 63273 -431858
7823 91355 -222962 150775 -278605 -65774 111509 -158483 -361670 180833 130371 18582
7812 31739 84684 87814 290914 -67203 -230894 -144513 226322 -119041 -172127 -167676 177112
7800 74174 251939 -98263 4936 -265652 45494 -187018 -86692 -127641 -31932 -182630 -190775
7789 -190775 -187144 127395 242913 40603 -152835 -237313 195456 -26615 -193073 21514 105297
7778 105297 92591 -109764 -85989 -53510 9412 -89672 10787 55640 62546 20104 -19053 -239418
7766 -239418 391870 -3841 33963 37653 -16322 19982 -38509 -351144 -42926 45061 -249720
7754 -356209 -51017 -346065 -125456 -41174 -43006 -247049 77601 163424 -15508 -172271 -60083
7742 8910 -199779 73657 -16735 104448 -17346 215384 17899 -88042 154750 -187710 -69555
7730 -70798 44363 -298780 -61032 114659 -251354 -169882 -141491 -182798 90426 128331 -79409
7718 99278 -178316 -261803 244624 -1391 88257 -159296 -64205 -281323 -6074 -121152 287047
7706 -213384 -129269 -61686 113473 121406 -3278 -121190 -121283 -31761 120347 -181488 -42756 -81382
7694 -81382 -155263 163103 -338713 31955 -147343 139677 19040 -151573 -175645 253013 -307096
7682 -110323 -225204 126071 145022 69623 -142909 169401 347035 -178885 21747 -83408
7671 61174 198625 221703 10496 -296125 -178130 -255124 109567 -432488 -178101 -52346 -7313
7659 -196419 93095 72238 253214 -355250 -161068 -163173 -423517 -232448 -61962 -171234 -259225
7648 -259225 91849 -56477 337770 -391511 -73646 -314380 -93677 39367 -260317 -300143 51495
7636 87158 145996 309213 42048 -120144 -164676 -98228 -359633 77856 -358453 -186310 -45931
7624 -32894 -51626 69114 -177850 8305 75427 -208735 -82589 -50293 141152 -253668 167691
7612 75176 -128972 -88828 234433 51233 81729 74187 -185120 -164616 15808 -286101 98912
7600 -203657 286996 -69544 -141113 -65232 96814 14830 -68934 65980 -265679 -93219 -16184
7588 203137 167289 -552654 -102161 389884 -170516 136164 217846 281044 130766 -37466
7577 251144 -39125 -10584 70321 132185 14207 -170734 194938 95765 13686 -210776 98543
7565 83788 -82524 -166932 17710 -507270 -181469 -139696 343841 87975 -130575 42866 -425741
7553 -134043 -8437 -92809 123537 -143925 87260 -144886 107543 -131513 -255735 76532 160374
7542 160374 30934 15665 -132850 -51777 65641 126532 -86851 98415 224868 9558 -21208
7530 119763 81509 -88787 -110351 -115034 204078 -339499 353194 -71982 -323476 -437377 -297671
7519 -297671 204190 -352053 -65758 -142284 112825 -57172 -115572 -119423 419721 67381 55457
7508 55457 142730 -263878 453070 -20006 -103040 -56467 71632 -9653 273256 -182905 246367
7496 -280811 86746 -210499 -158852 65910 -206678 -312091 -86854 -265388 48158 -326636 74638
7484 329299 -43321 68412 -191968 66036 -128710 48326 75626 -53680 91239 -51492 -136547
7473 -136547 166382 -146232 75692 -70832 -326299 26238 67576 -11782 238609 -289795 -67034
7461 -319148 -72665 -2692 -5907 153085 -278839 11200 -74442 -431033 155130 -183114 9328
7449 570498 -185354 153279 -7504 -72140 283232 -194158 -62116 -149952 54623 -51029 -305546
7438 -305546 -1138 -180373 -123898 29403 94931 169530 100210 67850 126505 -120098 274947
7426 -197457 111951 -332173 -291072 -134179 -208844 -210577 414468 155066 19865 -62872 77265
7414 -446121 -249079 -89768 -125284 -350653 110957 -98632 -440668 162491 21487 -86355 136791
7402 -177677 161343 -243138 83702 -111861 249421 -70999 54655 15004 196261 -115995
7391 26434 -98833 18785 -217991 -389573 74446 -23464 89933 -122949 12790 -38456 -121164
7380 -121164 -82057 -331219 -145517 410537 -270686 -181310 170138 -91397 153348 -257685
7369 264703 -108281 205389 -292873 -247186 43342 57026 -142980 16001 -8319 139371 -53054
7357 -73817 -123902 260080 -219797 -178836 149281 -232988 305984 -190349 -18625 165900
7346 -18501 115218 271620 -155499 -187705 159902 332872 248390 -96126 -318128 -288030 44141
7334 45145 -22836 242748 119907 136274 -221187 -32673 -229338 -17279 161472 -96940 23385
7322 25636 260605 113734 59745 -6525 226531 -101361 -95925 -21148 -111602 -318785 24101
7310 -152035 -213746 -280407 -222114 286767 -112444 33339 -26033 -236187 -124505 -29639 211437
7298 -157760 -46638 -103313 -47757 -174499 -69370 131463 -107184 119377 29135 -77798 -5379
7286 208021 577737 -103020 -298008 -167605 -326547 388504 99524 133232 -464342 -51033
7275 -92001 -91094 -11721 92629 208936 6401 -78313 294211 466630 -235287 345590 217774
7264 217774 -76527 -93392 69934 -138066 17867 -125118 -167744 -253088 -70254 24196 64618
7253 64618 8136 -91842 -15270 -191804 119316 204261 -89356 72810 -52613 268599 -37140
7241 59251 -153862 -61870 99484 188982 302217 264096 171222 81711 -261780 -67241 137271
7229 44641 -43253 192661 298914 153447 29556 -73649 -41757 48006 56576 -219286 -15168
7217 -37790 -162868 83177 -14470 25585 153158 -39909 208852 65330 19445 -103084 14495
7205 -75596 78100 32908 -98183 -146909 -60071 37424 -173310 -124545 -266361 -115423 181219
7193 -84766 42593 -126757 30674 65405 -302234 -99704 52906 182180 182115 -75375 212701 127301
7181 127301 -7640 167558 -92070 -196175 122348 273291 151719 -75986 226114 -207543
7170 128606 -34861 -160926 158206 85341 141803 288995 -406826 -71740 81017 -218889 -25287
7158 143249 -51374 231301 141413 -148295 -169221 -26630 359376 -21202 -350882 -117102 -5901
7146 -139019 -236621 43618 -33167 -259246 -16233 -13 146875 34509 -29692 62523 38588 -37175
7133 -283812 -53531 119999 158628 -274696 -54659 231560 -32876 172498 29319 -112547 163039
7121 -150773 -136292 225832 -171316 89434 -62177 198729 341505 79326 24064 -418820 -34063
7109 92503 -141610 17418 -140663 -30808 -456810 -332072 -244807 -503450 -29667 -44959 -276979
7098 -276979 215305 -275199 -1884 -81761 94325 82410 128941 143981 48134 -292324 -150574
7087 -150574 274897 -60301 -9327 209309 332657 -78689 298464 -77813 -227035 -274498 56345
7075 -48016 -126755 -191154 275800 -48985 -38325 -248942 -82134 -202524 70305 -231324 -204409
7064 -204409 173353 -84184 9109 -206268 148198 -236054 100793 103437 -123252 -127407 281068
7052 266991 192825 14917 111672 91076 -54765 28796 191360 125854 -181580 -36065 -61490
7041 -61490 -50542 -212583 25320 250863 121759 -98173 32293 139655 -78174 -131951 -116601
7030 -116601 -158486 79262 63519 240702 -121528 118185 42918 253724 -139272 13605 126789
7019 126789 8069 -76846 -508146 -2185 252574 -79486 -65037 121041 -183629 -48020 -286275
7008 -286275 126568 -189982 -116080 -254866 124436 121793 -219446 -24773 -127541 -393948
6998 -393948 33395 -25634 89264 -68167 35442 77626 295183 64903 -195148 139323 52916
6986 -113776 -104787 168143 -4040 -184067 -69401 208388 -140803 -49772 -199433 -154205 -246479
6975 -246479 -56576 133425 318139 40471 -35092 -262943 -223090 -99462 -180711 -117925 -68090
6964 -68090 12817 -177531 31986 -132283 -15796 353052 -15839 199725 -198252 -131062 356460
6952 -259506 -14943 2619 -209715 243675 228384 -102788 -152965 310864 -69169 -215052 8174
6940 126785 -155193 148373 396445 -163811 -66380 115853 -38371 -134408 323862 -122224
6929 24753 10930 -174568 194005 -117555 -87446 -204728 28163 -11594 -137488 -37797 154146
6917 73829 -84178 -46409 78331 79279 -316213 -133821 -17835 235356 22639 70131 -94500 -4638
6904 -91983 354844 51487 -121235 99241 111177 -177297 95258 2661 -107426 -408894 -243447
6893 -243447 -214940 136408 94616 134137 -278059 133418 19325 120515 -171823 -202204 -158627
6882 -158627 215619 74613 -121100 64783 112648 217872 54863 -326734 -46890 -147307 -191627
6871 -191627 -193865 -262183 -184867 156312 -78124 -52687 -99888 -1527 181419 -5169 46033 26774
6859 26774 8781 -123488 53577 -446409 292015 -282140 -147715 -12881 -64727 100961 158131
6848 158131 -133058 -143008 326148 21123 -37771 -12405 33660 270983 68992 -38274 -423089
6837 -423089 296185 -58158 -60639 51656 103000 27227 -15731 -83269 404273 52066 -168028
6825 89611 -419779 38820 -43092 44323 212822 356754 69277 -31412 170928 94258 -28170
6813 5168 -182956 191087 364993 109976 78722 207705 -132718 178157 -354674 67118
6802 -50893 -71810 -45699 195718 133153 -108987 61490 -167999 -43364 67554 -284794 -18260
6790 -72126 -17566 12050 -4896 -92960 -2717 34282 -140621 -187306 -154037 -65327 173771 76909
6777 123126 -105513 14584 -305807 -24687 -65472 -63969 163276 -171343 -123665 184709 -285539
6765 148906 -50095 25529 32035 -87783 -534711 155876 -228054 148882 -31058 110601 -133709
6753 116664 172787 329166 -201574 -193929 -512347 -78341 182736 186404 -148587 43138 41969
6742 41969 -18295 -7489 209427 -292218 -127582 182154 -132289 -30038 -172971 -226695 155584
6730 -274532 -160616 16250 -219565 -68298 -130208 130293 -155180 -41019 -232307 236721
6719 -141393 -52520 330525 -64702 81082 -109067 49144 85239 61663 131326 48282 -62929
6707 -151712 297666 50645 -191039 249125 -133520 75556 1683 30600 83912 -162992 337828
6695 220540 117326 248674 132991 36548 -76743 -243322 -247855 114677 -220021 -47253 -329239
6684 -329239 -123964 185156 -57903 -4122 -60679 31058 45844 -260894 -203105 83422 187627
6673 187627 -65588 89294 -9496 -184082 114365 -25800 -127153 128634 210010 17778 -20339
6661 -75950 -4483 -86683 92119 -130523 -282426 88126 120448 -139598 -24904 -39383 -98724
6650 -98724 -200724 -308323 81465 186414 16045 125172 100654 51134 23031 -374914 -39594
6638 62005 -34819 -238682 134919 -58852 -62978 132973 -340294 28833 -33010 -21594 209593
6626 -279075 -54891 -43837 -151842 -106760 -224484 59586 77446 110298 -67947 -280616 -241087
6615 -241087 -96284 -403564 -60523 46499 -26231 -265732 -22227 -198456 360245 -65125 -147181
6604 -147181 -246793 241614 -44220 -69109 -46256 -126762 -186333 250449 -178069 91784 88133
6593 88133 133323 -155776 -154179 177927 -84507 -43913 225638 -109735 -111190 177637 120564
6582 120564 272611 -592435 37240 -154192 137690 -193416 67948 -319297 219438 -74418
6571 -7180 -11439 -366308 -85250 -18420 247929 -35765 35068 983 -107652 49782 -18944 -92727
6559 -92727 -253016 194230 427098 -69712 115774 31075 76349 -219817 -118779 -81445 -215332
6548 -215332 -94659 147428 -154739 344726 -107726 -315978 -152637 -315601 -270809 -228573
6538 -228573 -23632 214323 -49745 -26603 -172102 -199272 -63488 129932 210031 80295 -13459
6526 -111939 -28906 35688 233776 -278313 -28228 -266532 -275259 -390396 -105804 107938 -13904
6514 -111926 33973 -2189 -16861 58084 16072 313879 113541 90821 232721 -431960 116216
6502 -9632 324895 82018 -146402 -14245 -72569 -138467 -15317 -60547 27660 42215 -8927 -55294
6490 -55294 12383 -50593 -21894 173800 -110419 320047 -96607 -71362 -24373 -164851 -249399
6479 -249399 -6346 188739 258704 -114039 73085 67586 -85012 -277460 98156 143475 32294
6467 -227286 -178746 9179 21149 91378 -109555 435366 273874 66075 124485 45267 101618
6456 101618 13762 48502 -130295 -148198 -240188 20415 -167855 82596 -221478 -195246 -1663
6444 218690 -475956 266020 2376 51566 -111164 166160 -76188 -268275 25421 -24239 -35533
6433 -35533 82653 88906 -255784 -126063 -64247 58974 13586 199475 130862 -104224 11956
6421 -179386 -69637 200593 -319253 29103 185799 103350 97443 40694 235213 -7822 7525
6409 -113519 -311196 -145260 89249 -130517 -41651 -60800 54984 -21332 -160399 -62429 73955
6397 -322891 -160878 -40984 150947 238183 197192 24296 -11805 -193746 207077 -82128 128515
6385 -94580 -154584 93753 -100936 -26305 -66912 -315838 -39157 98550 -218714 109821 -29014
6373 -67989 242419 -280442 83634 54791 -136389 -125516 262640 -43049 -36557 67961 -117265
6361 135678 196759 -132377 -328314 138335 -229623 339438 -440901 -278921 -133185 159690
6350 49817 113134 -159484 -368063 -32814 269042 -154850 -1841 -52640 169086 -7037 185148
6338 -140131 23437 73725 141579 -109040 -182805 45288 -463968 270925 29281 18228 -40261
6326 -339472 125769 -141025 -35915 -46907 5788 97691 240797 14887 -77664 59711 3855
6314 -344547 -333862 -60700 61976 228714 31384 -136460 62217 -181873 199543 -172989 -179248
6303 -179248 380232 -207930 286033 -257076 -142470 -58836 341130 188716 221479 -163660
6292 -116887 -86048 256670 -210809 -83603 -106795 61624 123451 36512 81440 155839 -65686
6280 -165087 60967 69642 -175346 65464 -152890 61586 102743 13680 45234 38142 210773
6269 210773 -46958 -196945 -72284 48587 -88438 -79583 143350 -74976 -124442 56608 121581
6258 121581 197402 87457 -167384 55695 119119 131561 -93922 -327972 267 142466 -144248
6246 -115986 -75832 82857 -110283 -15975 18602 -5269 117719 -175758 -18706 21547 109582
6235 109582 -158348 62848 155267 113251 -197419 -128171 -326257 235553 -176290 -89136 -16975
6223 24160 -59019 -124188 84436 -293155 -74243 55026 33516 50048 -194981 24530 -117358
6211 -107363 -90021 76649 -201388 -132709 -11207 1374 218383 -274716 137542 53288 -6037
6199 227613 -357266 -205911 -424797 -45470 39444 39037 -59625 -67842 36678 -242293 -39668
6187 -32820 163769 -191062 168922 -216361 -246736 -238117 156599 -40151 140037 52999 -103343
6175 -174964 193068 -260213 57679 -132836 57456 -408889 123553 44027 -197240 170454
6164 60465 68685 -20623 -80999 -184137 -238703 -139410 118863 415778 301108 7682 -1674 -157685
6152 -157685 -283598 -44321 -250614 9973 92040 -158934 22376 244046 35147 196632 -265342
6140 -265627 48498 -12350 -91550 79534 -345742 191055 -13869 317652 -141804 120065 -185041
6128 -22967 -236635 -34501 93495 -319239 118908 -150409 216529 109749 235784 112655
6117 -70115 -136872 -44192 72751 34538 -68171 78373 -157241 79915 -84233 22929 -37919 239891
6104 93350 63538 -54120 263651 -153281 -60186 -270504 -6823 122431 -166216 -282364 -260108
6093 -260108 43325 126393 110549 3787 -20036 184049 38903 -90940 193995 -36472 30327
6081 162634 13208 -158732 65019 356426 -147738 311342 -184433 87778 221046 -115754
6070 113453 114759 -2792 -186819 -88233 193967 317442 115586 32157 111307 135350 -396675
6058 11789 -156680 38599 -369565 -72880 42308 91362 -92891 293280 163423 163665 -42319
6046 121849 -229144 151979 -194412 259422 -1386 129480 3281 358531 -13675 -80012 305577
6034 72097 1203 -96041 -288204 149305 126465 -166718 -28644 75579 268372 4539 58374
6023 58374 -4043 -657 214107 -148170 192117 -131444 153964 139962 -238427 97548 76265
6012 76265 44021 83788 -147292 139647 -119838 -124428 296419 235492 -17699 26525 144668
6001 144668 99181 -174033 -42328 236608 -263064 -104072 205759 -92173 109433 -141240
5990 -363862 -49905 -203861 128288 104766 -4653 -143249 -205437 104800 -79400 313050 91781
5978 38061 -124299 175015 -122833 -128232 -80413 -360400 542015 -290109 115899 -23528 268272
5966 25464 211237 -320319 -88723 96470 121202 -257138 123352 -85479 277944 159535 219975
5955 219975 -156186 -39907 -17723 -349240 -300250 -278416 50000 53418 -91522 -161817 182616
5943 111004 -263366 48108 -210955 -25858 83553 58132 -913 -262091 -71842 -69193 -114151 -83480
5931 -83480 -116236 -63313 -98631 153404 -110581 112844 237390 -20495 -65419 -73706 98810
5919 -4485 -262352 -21407 -218101 273949 -160489 -371983 45085 -54331 -70473 -293913 -42689
5907 45020 -51436 114104 109069 313606 256320 -169322 -43326 408224 105445 10998 -17936
5895 -311846 358517 5320 67289 -201198 -182367 146580 -193663 -277920 -198473 32434 203280
5884 203280 5870 -170776 212078 171024 99499 -244319 -357018 145574 -81308 -173937 -81806
5872 -297031 25125 278272 -143988 -80468 -2268 -15666 -21352 -26939 -344061 38038 -56426 76352
5859 -63013 242476 204185 197945 78621 -74760 -152899 43097 -248699 -107511 24716 -322044
5847 -43242 -177814 81074 -364157 185839 49669 -107298 -120768 -132307 -308990 -34558 -84025
5836 -84025 247822 -109814 157948 -80785 59525 -85392 144250 -44704 141061 -56745 287577
5824 176339 -150275 145025 -142327 363196 34271 -10114 106122 -349537 -89030 124399
5813 90994 -154309 -38054 204648 92219 71868 374870 12008 218794 104335 -230666 129290
5801 -186408 19739 142182 -104944 -253873 -156854 34720 -313851 -78315 -208738 -249477 -118190
5789 115506 171957 240248 268604 76978 -210556 -5458 -181049 -78201 -140013 -386035 402211
5777 214855 -157129 144482 -232283 -51639 143198 94249 133224 -214981 -34771 163205
5766 -64331 98356 134515 131712 -37491 -391161 -135265 89287 128367 -236459 112143 149678
5755 149678 161600 125556 -322416 -148140 -6304 -170514 -9983 -329603 335392 -278584 -511481
5744 -511481 11130 -112111 -286864 -374544 -241654 287665 -11553 117676 219533 160378
5734 160378 -131277 -525086 57803 57725 10406 240277 -134945 54679 42105 -29660 -139422
5723 -139422 39718 242118 366529 -1710 -125051 71845 -58073 -66055 274121 -16498 115224
5711 152825 -260508 -204305 185569 153697 70112 41493 -463946 -406051 -94720 33536 -244511
5699 -200869 -237687 -102297 -330998 -340959 -66862 -2694 172575 254040 61520 -26499 -19106 119170
5686 92632 -237508 -279969 252066 4153 803 76785 -337892 -71762 277282 138734 155145
5675 155145 41598 142042 39419 -209732 -90579 -160961 -332253 218242 86393 -110932 -455041
5664 -455041 -102896 223374 37625 58161 164256 -143152 -128017 -44130 -200975 -89910 172357
5652 11070 25001 112743 -223551 32734 122972 98282 -24307 151107 73910 44587 130777
5641 130777 -36257 -150544 -103828 82875 149216 -43839 13713 205379 45841 -50456 400980
5629 -200211 119889 -131727 -99185 10661 -130813 103334 186124 106961 -159759 205848
5618 52600 -96917 -206952 186571 -31460 27481 3616 -101859 -190040 -274693 338228 37049
5606 -124892 -81206 45535 48899 -116714 119072 47518 -121293 238862 10243 -7047 132613
5594 -132594 -166433 166583 -106380 99 114408 187859 148742 -103749 -384711 244238 -114902
5582 -74065 82373 -13024 188421 21301 -53256 73717 -333400 -123714 -122849 -28958 -77319 83612
5569 -502627 -413183 -331472 129968 169077 160867 180556 76502 -260893 258824 198075 -33444
5557 114604 158808 45341 99760 29947 129528 103881 51595 -135520 -52247 -151271 156086
5545 -188151 24519 283504 92879 69712 330790 -104125 76001 -56484 -132406 23256 -58620
5533 201242 64717 55736 -18868 278793 -113046 197872 -12574 161713 -186470 -2396 -92286
5522 -92286 253652 72304 150465 105334 44300 -122553 137333 -255539 128597 -4216 20436
5510 68884 242107 -144190 231642 -94250 249288 -63045 157931 39012 115267 -144289 -219019
5499 -219019 72527 158409 232328 -29493 124049 -155821 -152549 74848 229799 103656 -310550
5487 49170 -179632 85714 -147684 -366589 -66748 -436662 17739 -43791 -230694 46358 377447
5476 377447 -72158 47142 93995 -47891 -176888 246857 159270 -414045 -482608 74362 10351
5464 -221512 -181766 -338926 -324266 35004 117634 -98809 3702 115512 160924 62074 -301650
5452 29910 -57678 -77992 -22551 74499 156419 5375 -124097 -196621 188507 138282 -68807 -10329
5439 34296 7087 -187374 80315 -156304 -109874 -182033 -27255 -77145 99285 -205296 10428
5427 -3319 -45639 -232442 111156 138652 142956 31869 200410 115563 -292952 -19056 12138
5415 286487 54132 26464 275741 -230257 -236000 -39944 -163410 -226574 25457 220855 -86979
5403 39835 -79665 278434 244775 55141 -55305 -115654 43255 -56896 -330023 153504 -150415
5391 34314 80962 81213 -190766 118803 72855 -116930 56651 13496 -12438 15398 101659 -149482
5378 -177689 22531 -41758 132779 -95675 80672 163012 88380 89989 19175 -126028 -113631
5367 -113631 167925 -221234 157379 -142759 14350 -78754 -89841 31013 154721 -188462
5356 356488 241202 151416 175643 -254487 253802 -63473 29533 -173419 48766 30834 174447
5345 174447 20356 155594 81320 -73792 123017 -216227 175316 114211 227694 -19079 -79782
5334 -79782 233267 -220030 -65410 165580 -188163 -259604 -75719 -35523 -106880 99178 -123987
5322 -166199 -52029 -165412 133469 147288 -10440 -109666 -59318 148607 -12569 18945 -104851
5310 72064 -129172 -37697 198880 -260153 89590 336788 364438 14633 -97762 96707 15359
5298 -270126 -72220 34959 143926 92097 153203 -16135 -426898 -139176 172771 -61308 121556
5286 27022 -110031 -206649 69639 21982 -107979 -310834 35924 -6095 5921 -98992 -33116 -8242
5273 95969 30078 -153176 173276 159628 -31925 262236 -61004 151204 155689 -43904 72933
5261 -141910 63427 -219601 -62477 98082 132438 209489 141608 -84030 202214 -90572 -347485
5250 -347485 -102274 190962 -93771 85363 139653 208755 -126995 88491 114632 -61705 169455
5238 55826 7191 -32121 -205371 -330988 45454 -243865 -161543 92506 -195594 204846 -90910
5226 -67471 -27123 -122742 255308 166558 -238965 125816 -128967 -397623 -101117 -210746
5216 -210746 -51699 299784 55685 12588 -92549 5434 -273948 -43359 40615 175501 -249476
5204 -84284 240942 45162 121359 36883 -298813 -77084 -128416 460524 153222 111922 -125105
5192 234261 -40180 -48737 -83199 223284 272239 -3745 -146236 -282943 74671 212396 -203288
5180 -232355 -465932 263453 -5016 82569 237704 -264459 -237737 59247 53242 183293 50874
5168 -309704 -19633 -252391 -232239 -53529 62934 148001 86633 -32877 87427 -42816 325674
5156 198779 137850 114889 314758 -197388 105286 -40866 118429 48721 144247 402989 -167546
5144 -66557 -104962 204288 -15011 -68556 134074 -66314 -245897 234138 81663 -22283 -137610
5133 -137610 -69386 152223 -73564 -64702 145808 -41139 -213595 -128233 -9486 -207666 39910
5121 115369 -288905 231145 94395 65764 49614 186202 -24465 -188737 87735 62383 171229
5110 171229 -247931 -172367 -88775 50384 84512 19696 29505 34389 186260 -7791 356987 -76005
5097 -445177 38036 -209928 23107 152834 -20096 15674 -132194 -48030 129444 -11447 188668
5085 -25088 -172852 153943 -109809 202981 -123244 -160505 195789 110864 -20951 10995 -17677
5073 49138 -107725 134188 153606 150437 214631 -339120 -35860 -15882 27582 -133120 47716
5061 -86041 -28343 47398 153096 -97533 -202474 -105960 267429 -85987 101709 -56447 -376701
5050 -376701 68854 106893 -29161 263358 -132082 -38442 -112946 -24254 41107 -56027 109623
5038 -191480 116747 59175 -242764 117478 100113 80781 143716 -210746 52063 79857 -112800
5026 280632 155302 99373 -36368 -273601 -65791 -505794 143593 103876 -114512 -65987 -41339
5015 -41339 52449 -108149 -69705 39626 28 55854 -132395 -143096 -485602 -57232 168042 -76304
5002 -224106 306718 -13812 108401 -298610 -85882 -159682 54661 -107081 241104 -123506
4991 210485 -305138 317468 63220 74345 81345 -136561 -77939 37546 -442510 -4311 78274
4979 103273 -174934 -191438 73668 -70091 177377 101414 181972 -21919 364038 143781 -15046
4967 -181252 222079 3414 135066 -15260 -286107 231989 14675 135994 297186 -100659
4956 -150124 -90222 21501 300589 66257 -170629 164905 29353 -232699 81892 -182997 137878
4944 -157636 -183634 74396 -189595 146950 -313057 -98192 -15595 219900 302646 115785 -118222
4932 155200 -61220 -27881 -218534 -39353 254296 193434 -72921 -227695 48199 -86514 220492
4920 -216115 71285 141124 -26375 506234 -318117 363064 100552 -84801 110993 -43569 40836
4908 -63898 -98797 -90219 125359 108972 31651 -84467 60250 -68051 23245 88146 -138212 -240820
4896 -240820 345892 -116568 282019 -288342 -95540 -68205 130736 128322 17637 -53636 -53890
4885 -53890 -174095 108568 -179253 229260 -3523 5722 -145233 -265627 32257 82890 195659
4874 195659 -102689 412660 -235070 60208 -101129 -87866 121542 288080 9584 -144860
4863 22663 82387 -144859 -174772 281574 66204 -32369 117317 -1405 133261 135756 179988
4852 179988 14814 381717 -253567 -56638 223605 -64096 70973 -305989 80677 119978 -152944
4840 -19211 237044 -32596 -94984 -208347 115632 -84588 61332 -213031 145766 340234 276599
4829 276599 19408 -120167 362184 88445 7842 -257181 -189735 269279 -13504 147851 -160390
4817 86342 -77485 -94317 114826 -209327 183307 -337394 -107856 441321 161294 39676
4806 12094 93993 210842 188311 426846 51925 168892 -67382 166669 164225 97677 200772
4795 200772 33159 -50418 -41637 -151544 50916 -2870 -117391 24328 -164982 46915 56878 -175093
4782 158106 -90176 86394 150336 -221479 78673 -73867 21152 309932 275637 46556 -35842
4770 -116059 127525 58547 -9661 116873 -220889 258485 -6035 -138465 -12603 -54837 -29056
4759 -29056 91653 219417 -28853 285636 -16541 16162 125904 174264 -96958 -316255 -120732
4747 163800 -138086 166500 111031 -20116 71508 -20067 117273 66252 -43588 -28927 -104958
4736 -104958 12915 -134597 245190 244958 164592 40351 27662 -167046 -16200 70720 -27635
4724 -60251 -45995 13950 2372 -278699 31823 223476 -78744 -108349 -292006 78614 -13303
4712 -485533 -60678 126635 209198 171087 140406 -146685 331201 -57463 2476 -36561 273253
4700 -11533 -129743 235016 -121177 121066 -477347 210134 223246 117807 305585 67124
4689 -226131 185077 -319081 -172533 47281 -203374 -1402 -40904 -32646 -216820 144028 -114967
4677 126822 -158441 -1553 3217 86348 10024 -195288 -95379 -52804 35291 61813 154824 -9115
4664 -78248 28628 27085 221634 22950 17353 254208 182822 349095 56234 67185 289800
4653 289800 409658 66256 172780 -180307 324993 138242 -73340 -278686 232085 -194973
4642 168033 -317911 365861 248045 -234698 355270 209622 78619 94943 -86614 165485
4631 -292561 -125167 184094 -81920 -126995 95964 152609 -381385 92065 357186 440543 118781
4619 126144 -174671 33116 -39032 169818 -187550 31565 -60615 -172971 -335233 174628
4608 -178441 -27803 236087 -41978 221424 -205788 -146625 -65534 416096 144151 107476 -267714
4596 -107808 -283718 91884 110623 -151107 -49475 -130427 217878 37769 65905 -29951 -34061
4585 -34061 -77506 -202501 33290 -29737 -212905 105282 354396 187206 145543 -161888 -77074
4573 42702 -165855 3701 -105375 86713 -293595 144181 -147422 -57254 -69109 -195239 -163267
4562 -163267 -205205 -156697 -92960 -67908 289519 35808 -233577 -190819 -103941 -183690 228935
4550 72632 3399 -142862 135052 92816 -155946 -217182 5885 109579 -49839 -123369 40540
4538 -12191 32765 -53562 225931 -56231 -15858 215247 28960 266346 -193382 -113684 52923
4526 150028 284900 50772 140338 -287548 -155051 -99719 169942 65685 19530 36000 -224733
4514 -213114 335069 85776 41083 194298 46005 128674 259290 -102639 91213 50535 -204376
4502 46818 24203 -24780 53886 54643 357078 -30163 122459 167343 -81920 -161191 137749 308368
4490 308368 -17126 -28747 79866 106300 -131795 -9761 -60651 386867 59614 70596 -177829
$$ [...]
##END NTUPLES=NMR SPECTRUM
##END=
