
##TITLE=AC1357_GUARH12176_6672443_vCM8YDQbAB
##JCAMPDX= 6.0         $$ Bruker NMR JCAMP-DX V2.0
##DATA TYPE= NMR SPECTRUM
##DATA CLASS= NTUPLES
##ORIGIN= BRUKER
##OWNER= Administrator
$$ 1.72 TOPSPIN		Version 2.1
$$ 2012-08-14 16:27:33.125 -0500  Administrator@TOPSPIN
$$ Compression mode = diff/dup
##.OBSERVE FREQUENCY= 400.02188249412
##.OBSERVE NUCLEUS= ^1H
##.ACQUISITION MODE= SIMULTANEOUS (DQD)
##.ACQUISITION SCHEME= undefined
##.AVERAGES= 8
##.DIGITISER RES= 22
##SPECTROMETER/DATA SYSTEM= spect
##.PULSE SEQUENCE= zg30
##.SOLVENT NAME= COFFEE_meoh
##.SHIFT REFERENCE= INTERNAL, COFFEE_meoh, 1, 14.98509
##AUDIT TRAIL= $$ (NUMBER, WHEN, WHO, WHERE, PROCESS, VERSION, WHAT)
$$ ##TITLE= Audit trail, TOPSPIN		Version 2.1
$$ ##JCAMPDX= 5.01
$$ ##ORIGIN= Bruker BioSpin GmbH
$$ ##OWNER= Administrator
$$ $$ C:\Bruker\TOPSPIN/data/COFFEE/nmr/AC1357_GUARH12176_6672443_vCM8YDQbAB/10/pdata/1/auditp.txt
$$ ##AUDIT TRAIL=  $$ (NUMBER, WHEN, WHO, WHERE, PROCESS, VERSION, WHAT)
(   1,<2012-08-14 16:27:08.843 -0500>,<Administrator>,<TOPSPIN>,<go>,<TOPSPIN 2.1>,
      <created by zg
	started at 2012-08-14 16:26:00.593 -0500,
	POWCHK enabled, PULCHK disabled,
       configuration hash MD5:
       6B 1B 68 BB D9 2E 58 E2 7F 35 AD 54 07 DF 0E 41
       data hash MD5: 64K
       DD 34 85 BF 7B 72 1D B9 7C 3A 65 0F A9 17 44 E2>)
(   2,<2012-08-14 16:27:19.750 -0500>,<Administrator>,<TOPSPIN>,<proc1d>,<TOPSPIN 2.1>,
      <Start of raw data processing
       efp LB = 0 FT_mod = 6 PKNL = 1 PHC0 = 0 PHC1 = 0 SI = 32K 
       data hash MD5: 32K
       6D AB 08 22 F6 DB 34 1C 50 6F D2 9A D9 4A AC 92>)
(   3,<2012-08-14 16:27:20.546 -0500>,<Administrator>,<TOPSPIN>,<proc1d>,<TOPSPIN 2.1>,
      <pk PHC0 = 176.7151 PHC1 = 0 
       data hash MD5: 32K
       A7 82 DD A1 B6 4D 0B 99 65 7D 5B 0E 92 E0 92 D7>)
(   4,<2012-08-14 16:27:21.312 -0500>,<Administrator>,<TOPSPIN>,<proc1d>,<TOPSPIN 2.1>,
      <abs ABSG = 1 
       data hash MD5: 32K
       3E 2E BA 44 C5 95 C8 63 5F 64 C4 74 A1 8C 7A 23>)
(   5,<2012-08-14 16:27:21.750 -0500>,<Administrator>,<TOPSPIN>,<proc1d>,<TOPSPIN 2.1>,
      <abs ABSG = 2 
       data hash MD5: 32K
       C2 7A F5 99 E9 E7 EA 05 74 74 8D 83 88 0F 71 75>)
(   6,<2012-08-14 16:27:22.062 -0500>,<Administrator>,<TOPSPIN>,<proc1d>,<TOPSPIN 2.1>,
      <abs ABSG = 3 
       data hash MD5: 32K
       7F 33 37 1A E8 4C 70 80 25 26 8C 4D E6 26 33 CF>)
(   7,<2012-08-14 16:27:22.312 -0500>,<Administrator>,<TOPSPIN>,<proc1d>,<TOPSPIN 2.1>,
      <abs ABSG = 4 
       data hash MD5: 32K
       F9 DA 42 49 42 64 5F 09 7E A3 7C 2C 57 C8 C8 46>)
(   8,<2012-08-14 16:27:22.593 -0500>,<Administrator>,<TOPSPIN>,<proc1d>,<TOPSPIN 2.1>,
      <abs ABSG = 5 
       data hash MD5: 32K
       C3 C5 C0 08 7F B6 24 C4 FE 11 CA CF 9B 56 CB 55>)
$$ ##END=
$$ 
$$ $$ hash MD5
$$ $$ 63 2B 47 E6 22 AA BB 0A 5C 87 42 61 75 60 10 C5
##$RELAX= 
##$RELAX= 
##$RELAX= 
##$RELAX= 
##$RELAX= 
##$RELAX= 
##$RELAX= 
$$ Bruker specific parameters
$$ --------------------------
$$ [...]
##$TP= (0..7)
150 150 150 150 150 150 150 150
##$TP07= 0
##$TPNAME0= <>
##$TPNAME1= <>
##$TPNAME2= <>
##$TPNAME3= <>
##$TPNAME4= <>
##$TPNAME5= <>
##$TPNAME6= <>
##$TPNAME7= <>
##$TPOAL= (0..7)
0.5 0.5 0.5 0.5 0.5 0.5 0.5 0.5
##$TPOFFS= (0..7)
0 0 0 0 0 0 0 0
##$TUNHIN= 0
##$TUNHOUT= 0
##$TUNXOUT= 0
##$USERA1= <user>
##$USERA2= <user>
##$USERA3= <user>
##$USERA4= <user>
##$USERA5= <user>
##$V9= 5
##$VALIST= <valist>
##$VCLIST= <CCCCCCCCCCCCCCC>
##$VD= 0
##$VDLIST= <DDDDDDDDDDDDDDD>
##$VPLIST= <PPPPPPPPPPPPPPP>
##$VTLIST= <TTTTTTTTTTTTTTT>
##$WBST= 1024
##$WBSW= 4
##$XGAIN= (0..3)
0 0 0 0
##$XL= 0
##$YL= 0
##$YMAX_a= 486837
##$YMIN_a= -648511
##$ZGOPTNS= <>
##$ZL1= 120
##$ZL2= 120
##$ZL3= 120
##$ZL4= 120
##$ABSF1= 14.98509
##$ABSF2= -5.573092
##$ABSG= 5
##$ABSL= 3
##$ALPHA= 0
##$AQORDER= 0
##$ASSFAC= 0
##$ASSFACI= 0
##$ASSFACX= 0
##$ASSWID= 0
##$AUNMP= <proc_prof1d_extract_pilot.lims>
##$AXLEFT= 0
##$AXNAME= <>
##$AXNUC= <1H>
##$AXRIGHT= 0
##$AXTYPE= 0
##$AXUNIT= <>
##$AZFE= 0.1
##$AZFW= 0.1
##$BCFW= 0
##$BC_mod= 0
##$BYTORDP= 0
##$COROFFS= 0
##$CY= 15
##$DATMOD= 1
##$DC= 0
##$DFILT= <>
##$DTYPP= 0
##$F1P= 0
##$F2P= 0
##$FCOR= 0.5
##$FTSIZE= 32768
##$FT_mod= 6
##$GAMMA= 0
##$GB= 0
##$INTBC= 1
##$INTSCL= 1
##$ISEN= 128
##$LB= 0
##$LEV0= 0
##$LPBIN= 0
##$MAXI= 10000
##$MC2= 0
##$MEAN= 0
##$ME_mod= 0
##$MI= 0
##$NCOEF= 0
##$NC_proc= -9
##$NLEV= 6
##$NOISF1= 0
##$NOISF2= 0
##$NSP= 0
##$NTH_PI= 0
##$NZP= 0
##$OFFSET= 14.98509
##$PC= 1
##$PHC0= 176.7151
##$PHC1= 0
##$PH_mod= 1
##$PKNL= yes
##$PPARMOD= 0
##$PPDIAG= 0
##$PPIPTYP= 0
##$PPMPNUM= 2147483647
##$PPRESOL= 1
##$PSCAL= 4
##$PSIGN= 0
##$PYNMP= <proc.py>
##$REVERSE= no
##$SF= 400.02
##$SI= 32768
##$SIGF1= 0
##$SIGF2= 0
##$SINO= 400
##$SIOLD= 32768
##$SPECTYP= <>
##$SREGLST= <1H.CDCl3>
##$SSB= 0
##$STSI= 32768
##$STSR= 0
##$SW_p= 8223.68421052631
##$SYMM= 0
##$S_DEV= 0
##$TDeff= 65536
##$TDoff= 0
##$TI= <>
##$TILT= no
##$TM1= 0
##$TM2= 0
##$TOPLEV= 0
##$USERP1= <user>
##$USERP2= <user>
##$USERP3= <user>
##$USERP4= <user>
##$USERP5= <user>
##$WDW= 1
##$XDIM= 32768
##$YMAX_p= 433066878
##$YMIN_p= -1381354
##$CURPLOT= <Network HP LaserJet P1505>
##$CURPRIN= <$Network HP LaserJet P1505>
##$DFORMAT= <normdp>
##$LAYOUT= <+/1D_H.xwp>
##$LFORMAT= <normlp>
##$PFORMAT= <normpl>
##$SURQMSG= 1
$$ End of Bruker specific parameters
$$ ---------------------------------
##NTUPLES= NMR SPECTRUM
##VAR_NAME=  FREQUENCY,     SPECTRUM/REAL,   SPECTRUM/IMAG
##SYMBOL=    X,             R,               I
##VAR_TYPE=  INDEPENDENT,   DEPENDENT,       DEPENDENT
##VAR_FORM=  AFFN,          ASDF,            ASDF
##VAR_DIM=   32768,         32768,           32768
##UNITS=     HZ,            ARBITRARY UNITS, ARBITRARY UNITS
##FACTOR=    0.250966925370066, 1,           1
##FIRST=     8223.43324360094, -307385,      45051
##LAST=      0,             -134719,         194790
##MIN=       0,             -1381354,        0
##MAX=       8223.43324360094, 433066878,    0
$$ Real data points
##PAGE= N=1
##DATA TABLE= (X++(R..R)), XYDATA
$$ [...]
19267A03374l1294c76410Q2770a30180D09417j53019b23214C82646c35607l94428
19257g30035A16198p073J29274M3156e07352b22590A22527a19425p59110H75362
19246A97353H5307J85919a42949A33427f37837a42978A02140c70933C2771h36985
19235c13199i9469B0980d21433F22535E4595H987b77415a27871j73947F68149
19224B86038g28186K70292f7544A40741a16563j5617l03199h6980k68184N6636
19214b98528A577c51016F34500N4243a71745l34892H1722i5443j6159m16514K17960
19203c10156J29932f886k74970H28927b25881E5674B65d60213B20379f60196D2563
19191f62794A64618L0014e86759a47009c9365j65132j14814K4625o1251b049n64420
$$ plain form
19267 103374 72080 -376410 -293640 -130180 409417 256398 -223214 382646 -335607 -730035
19257 -730035 116198 109125 238399 281555 -507352 -222590 122527 -119425 -878535 875362
19246 197353 85307 271226 -142949 133427 -637837 -142978 102140 -370933 32771 -836985
19235 -313199 -99469 20980 -421433 622535 54595 8987 -277415 -127871 -301818 668149
19224 286038 -728186 -457894 -67544 140741 -116563 -132180 -435379 -86980 -355164 -298528
19214 -298528 1577 -351016 634500 688743 -171745 -506637 81722 -95443 -111602 -528116 -310156
19203 -310156 -180224 -6886 -281856 828927 -225881 55674 265 -460213 220379 -660196 42563
19191 -662794 164618 194632 -586759 -147009 -39365 -204497 -319311 -294686 -355937 -2049 -566469
19180e66469C66551d80237e6769k10221E49819f01267a14414k95190B61694g66964
19169d48422l4870a00856H6901a184234c53752D43686b07716j84216p486J49883
19159b49535k73505J31726O4553R6022k21646J95857J27472A06277K53998I0683
19148G48810h3347r8061C20505b83380A08045c16822J28483A61745g72151a14949
19137b80555B4467b59652C62850a53967o80020G8377b45738l03448K57753B23870
19126c32321j07525a44329E49148m8907m2055a49763B0897M09820A44739c31080
19115a69739l48987J5617J75594n45768A08490M83025e3482F8759C1253M36179
19105D67432B8114c72616A34638d3486l63333P5325D19198g07585L37079a57876
$$ plain form
19180 -566469 366551 -480237 -56769 -266990 549819 -601267 -114414 -409604 261694 -766964
19169 -448422 -483292 -100856 86901 -1184234 -353752 443686 -207716 -391932 -399418 -249535
19159 -249535 -523040 -391314 -326761 -230739 -452385 -256528 -129056 106277 360275 90683
19148 748810 -83347 -181408 320505 -283380 108045 -316822 -188339 161745 -772151 -114949
19137 -280555 24467 -259652 362850 -153967 -833987 78377 -245738 -549186 -291433 223870
19126 -332321 -439846 -144329 549148 500241 458186 -149763 20897 430717 144739 -331080
19115 -169739 -518726 -503109 -327515 -873283 108490 591515 -53482 68759 31253 467432
19105 467432 28114 -372616 134638 -43486 -406819 -331494 419198 -707585 -370506 -157876
19094d55353o2718a65370B09659e9117B63269n1161J17076b17802C04649d00004
19083a98918G368L50748i4092G199O0322b13515M3854B79278d13764O3668a5873
19071B31062N3452L95978l27040G0223K86380C4494b86786h5317r0565Q0941l66822
19060d61763b01969k54875o6417C01488e3327m79714a09563B25840e51091a77852
19049b26966l98671B3270K80191b55491m58325a21181o8601D05741b74060q364
19039b82424E6306j7805j8300b74961i0059l02087m4879D43679g0393k54441j14406
19028d39240R2169D60597K23058F5438b21377f6209b7184p8099E17882a29481
19017E27104q0703c92749F90634A24245J5978J79085L31939j42018j35766a20256
$$ plain form
19094 -455353 -518071 -165370 209659 -59117 263269 212108 329184 -217802 304649 -400004
19083 -198918 7368 358116 -94092 7199 67521 -213515 -169661 279278 -413764 -350096 -15873
19071 231062 284514 680492 353452 70223 356603 34494 -286786 -85317 -175882 -94941 -461763
19060 -461763 -201969 -456844 -523261 301488 -53327 -533041 -109563 225840 -551091 -177852
19049 -226966 -625637 23270 303461 -255491 -713816 -121181 -189782 405741 -274060 -282424
19039 -282424 56306 38501 20201 -274961 -90059 -392146 -437025 443679 -70393 -324834 -439240
19028 -439240 -347071 460597 683655 65438 -221377 -66209 -27184 -105283 517882 -129481
19017 527104 446401 -392749 690634 124245 140223 319308 651247 509229 373463 -120256
19006i28850d34273A02962J37596a87757k88639L6179B15293a146724a3449n34273
18996e47722B64891A01573h4681j07673q0782f2496C05536C86L89842c21486l77560
18985f99046F885R04299b10487k6994D59663f2699k81965a5302p23177c11342
18974A88940j1490g13603F6362J84768c96549k76456B30085E1111e85431b08380
18963A39619J04456r498C3280a85278E50783b56988B78385J32003b26773l7929
18953b64702k47818f0070k57822i2052k9164C713J35217L07646d98361E3749N3790
18942A07539g24795J83927m2335b1377k71188J36411k86245B89431J38355e30414
18931A34199b28495C56164d65782A2673b77262P0585k55159j39199N205b3103
$$ plain form
19006 -928850 -434273 102962 240558 -187757 -476396 -440217 215293 -1146724 -13449 -547722
18996 -547722 264891 101573 -84681 -192354 -273136 -62496 305536 386 390228 -321486 -699046
18985 -699046 6885 911184 -210487 -237481 459663 -62699 -344664 -15302 -738479 -311342
18974 188940 177450 -713603 66362 251130 -396549 -673005 230085 51111 -585431 -208380
18963 139619 244075 234577 33280 -185278 550783 -256988 278385 410388 -226773 -264702
18953 -264702 -512520 -60070 -317892 -92052 -121216 3713 138930 446576 -498361 53749 107539
18942 107539 -724795 -540868 -583203 -21377 -292565 -156154 -442399 289431 427786 -530414
18931 134199 -228495 356164 -465782 12673 -277262 -206677 -461836 -601035 -595830 -23103
18920a43802C7088K6978b67827B21571a69889B38905N21880e1107m07959a32677
18909C48761A13221c21597E55035e3928D1610O11245a76000j37362f1806r13914
18899i75720D04626N62644d89127E25274O2133c08574l58231H6108a65019e1729
18888c1777j95649b9521l54507B37932M34438d43396j7385a81820j47294k66171
18878e95285A67764O28862f31603E81805f50573B5381a84510k09556F2065c99750
18867E77548A97506K0411N73847e01028a5091B91518c95997h9388q68062a17142
18856a94369j186985F95403k36500a88429n77834c12649F319b3490H4044R0607
18846A74651F1091c72808B72363a28115l46676m2468A75283a9260B46845e4704
$$ plain form
18920 -143802 37088 64066 -267827 221571 -169889 238905 760785 -51107 -459066 -132677
18909 348761 113221 -321597 555035 -53928 41610 652855 -176000 -313362 -61806 -975720
18899 -975720 404626 967270 -489127 525274 587407 -308574 -666805 86108 -165019 -51729
18888 -31777 -227426 -29521 -384028 237932 672370 -443396 -460781 -181820 -329114 -595285
18878 -595285 167764 796626 -631603 581805 -650573 25381 -184510 -394066 62065 -399750
18867 577548 197506 217917 791764 -501028 -15091 291518 -395997 -89388 -957450 -117142
18856 -194369 -1381354 695403 458903 -188429 -766263 -312649 6319 -23490 84044 174651
18846 174651 61091 -372808 272363 -128115 -474791 -517259 175283 -19260 246845 -54704
18835d15658h8197b2430B58901e21131d5414A37563a0856l23279D09742j56959
18825B52783F874e37399A89835d6773j81498n88260A11709c76417e3246j79186
18815b32432j13281A59385a1192F20656b71330j2431J2341C95650j62401e1482
18804D03744e4207j46381H0679b13849m876A62648l1701a28931B49753h35324
18793d25416K5802b7603A9426a58643j20499n74094M11536A03321k4859N689L56617
18782D40768a9079R117A82067f4542k4482b0971m4536j80459m4642n93999c47124
18770E38860f17113J17776A62961a8718j47757E3598A4340c46044c7677G29222
18759a98648m75170A42571J8528g57307B52085L4671a65154B32685J46416j14315
$$ plain form
18835 -415658 -88197 -22430 258901 -521131 -45414 137563 -10856 -334135 409742 252783
18825 252783 6874 -537399 189835 -46773 -228271 -816531 111709 -376417 -53246 -232432
18815 -232432 -345713 159385 -11192 620656 -271330 -283761 -271420 395650 233249 -51482
18804 403744 -54207 -200588 80679 -213849 -218725 162648 130947 -128931 249753 -835324
18793 -425416 -399614 -27603 19426 -158643 -279142 -853236 -441700 103321 78462 84151 440768
18782 440768 -19079 -9962 182067 -64542 -89024 -20971 -65507 -245966 -290608 -884607 -347124
18770 538860 -617113 -499337 162961 -18718 -166475 53598 14340 -346044 -37677 729222
18759 -198648 -673818 142571 161099 -757307 252085 286756 -165154 232685 379101 264786
18749B64786m8657A9040J03329D9302a57243k86389b10073L1751k8782J8761k31546
18738d19889J27730J43364A62780f46900I08731f48182c9680o10074B81813J13282
18728C95095A22400b15666p86524d93291a9874H9432b96575j81691J83167B56410
18717B7194f61232E05532o0653E9659L42298a05208k65530k32162B02236R0592
18707B92828b14459j8771j1800G0151a30453D54870d73731n6747K60982B57778
18696A58400k0771l0850a03588A96221K75446l6959a46967j082068c22532J829
18686c20703j8848R8181D6141J94813b10147l39995c8792k97356q8299a14315
18675F28726b4898l50538P3972k31155O6625b05438i3979A14270f45451A5288
$$ plain form
18749 264786 216129 19040 122369 49302 -157243 -443632 -210073 -178322 -207104 -188343 -419889
18738 -419889 -292159 -148795 162780 -646900 908731 -648182 -39680 -649754 281813 395095
18728 395095 122400 -215666 -1002190 -493291 -19874 89432 -296575 -478266 -295099 256410
18717 27194 -661232 505532 444879 59659 401957 -105208 -370738 -602900 202236 292828
18707 292828 -214459 -233230 -245030 70151 -130453 454870 -473731 -530478 -269496 257778
18696 158400 137629 106779 -103588 196221 471667 434708 -146967 -1229035 -322532 -320703
18686 -320703 -339551 -241370 46141 240954 -210147 -550142 -38792 -336148 -424447 -114315
18675 628726 -24898 -375436 -301464 -532619 -465994 -205438 -93979 114270 -645451 15288
18664F36294c78349k36914H957e42698K1845C17493j45668b09784n4674m37235
18654g01693a80469m94859c30458j59765Q5829B03193j6447b07593J7074A4714
18643a85303n88638b55070I1744c66167A33484J28955J0318b56592B87854b52364
18632B88758J4186a3591j004768B878O2096K11615J09100K58743e12188A91379
18621i4820A12137M76354k1016B26773e4300C79432A61982a17685F4640d34009
18610e16138D46454g0915A2446L76027H3526c03563D2965K41536j6797b86989
18599a16067B7079c7209j31411l20752N0920a97425P2969j69461m1040q4686i3144
18587d6947l64019A4002J28289d15493A22683a7120B75414J19105M04329A56122
$$ plain form
18664 636294 -378349 -615263 8957 -542698 -520853 317493 171825 -209784 -264458 -701693
18654 -701693 -180469 -675328 -330458 -490223 -404394 203193 186746 -207593 -190519 14714
18643 -185303 -773941 -255070 91744 -366167 133484 262439 272757 -256592 287854 -252364
18632 288758 302944 -13591 -1018359 2878 64974 276589 385689 644432 -512188 191379
18621 -94820 112137 588491 567475 226773 -54300 379432 161982 -117685 64640 -434009
18610 -516138 446454 -70915 12446 388473 83526 -303563 42965 284501 267704 -286989
18599 -116067 27079 -37209 -168620 -489372 -438452 -197425 -124456 -293917 -334957 -419643 -93144
18587 -46947 -410966 14002 142291 -415493 122683 -17120 275414 394519 798848 156122
18576A88273R4519j12878i0398p87930C92231A38024l3501b32400e9112A43503
18565h2793G8440h068B69614h53184C2587J36341g49581L64118A67822d70891
18554a35923N1898l03099A33797M64755B71470a60553D26118b33330p3499j63786
18544d70615A96518I997d06441E3938a6205l06252a44345j21131n9215e8399B69287
18532b71944J14481m36080K5564b7865j85250j24639B02867b03434l16608K10479
18522c09563j347C1181a15157B7039M03127a77193j56280a4722j49414A10840
18511C96941g46805A60346c55831f0002q652j91370A39205a39524A96445c26749
18500h79982D6509h42998m18663D2460d53439a36649l19662J26611D20427g61990
$$ plain form
18576 188273 282792 169914 -90398 -878328 392231 138024 104523 -232400 -59112 143503
18565 -82793 78440 -8068 269614 -853184 32587 168928 -749581 -385463 167822 -470891
18554 -135923 -84025 -387124 133797 598552 271470 -160553 426118 -233330 -306829 -470615
18544 -470615 196518 9997 -406441 53938 -16205 -322457 -144345 -265476 -324691 -58399 269287
18532 -271944 -157463 -593543 -567979 -27865 -213115 -337754 202867 -203434 -520042 -309563
18522 -309563 -310910 31181 -115157 27039 430166 -177193 -333473 -14722 -164136 110840
18511 396941 -746805 160346 -355831 -60002 -68654 -260024 139205 -139524 196445 -326749
18500 -879982 46509 -842998 -1261661 42460 -453439 -136649 -456311 -329700 420427 -761990
18489B88192c61521L7027P237B82022J73849C4860Q9449a81055F51607a11934
18478f3175m67893J20451H3203K22922J8890O2637J73326B54178e02003j16083
18468f18086K93059H5673a98713j12430a15033B097a76527g1158B16373p7540
18458A38833b22480L7300C15006b63964M0791f4169C40996d3530q1795C76898
18447a74217J0796l39757j07386A26443J17548h2939o12291A65110K77313a40364
18436c92190j02969l4808O4586A81903g9499a1173m48631C710M65036e26750a38115
18424B94811g75302b79982j22084H7447k027a58908F5087a5931n16732D57543
18413c95468B35718d23153J34011B07420f19489A00706g54738a55163j07674d7157
$$ plain form
18489 288192 -361521 -324494 -317257 282022 455871 34860 124309 -181055 651607 -111934
18478 -63175 -531068 -410617 83203 306125 325015 387652 560978 254178 -502003 -618086
18468 -618086 -325027 85673 -198713 -311143 -115033 2097 -176527 -71158 216373 138833
18458 138833 -222480 -185180 315006 -263964 -223173 -64169 340996 -43530 -125325 376898
18447 -174217 -163421 -503178 -610564 126443 243991 -82939 -695230 165110 442423 -140364
18436 -392190 -495159 -529967 -465381 181903 -79499 -11173 -459804 3710 468746 -526750 -138115
18424 294811 -775302 -279982 -402066 87447 85420 -158908 65087 -15931 -532663 457543
18413 -395468 235718 -423153 -289142 207420 -619489 100706 -754738 -155163 -262837 -47157
18402F1813K17304R8549h0704B18377d23679J08230I37300C83255b09653A1795
18391B16172d18977a83609n12350J83714A09702M2069n0928M6009f4430l42982
18381d07412D01783e98941m3164a8542n8776K8343p35275E9405K06768a29353
18370h22309A81887G8179L43562a0160j52388B44019a33212N3786A09058d00849
18359C23898d11290a78622D2854c07587k8326h1115F94085h7231m83734D80171
18348B79656b19045d0191B43103i3187p80838D24507E6532M42136G8033K1217
18338I9250N58090B43730A15138K44640d14405L8584o6836a89627P6029p73158
18328h86756B12304g0941k00639A8687c76764P5214a10424F811b28485n79536
$$ plain form
18402 61813 279117 377666 -80704 218377 -423679 -315449 937300 383255 -209653 11795
18391 216172 -418977 -183609 -695959 -512245 109702 151771 100843 146852 -64430 -407412
18381 -407412 401783 -598941 -642105 -18542 -77318 -48975 -784250 59405 266173 -129353
18370 -822309 181887 78179 421741 -10160 -162548 244019 -133212 -79426 109058 -400849
18359 323898 -411290 -178622 42854 -307587 -335913 -81115 694085 -87231 -570965 480171
18348 279656 -219045 -40191 243103 -93187 -874025 424507 56532 498668 78033 99250
18338 99250 657340 243730 115138 359778 -414405 -375821 -442657 -189627 -113598 -886756
18328 -886756 212304 -70941 -271580 18687 -376764 -301550 -110424 6811 -228485 -808021
18318h08021e2248A047631C63139e1282q1553B19591b24567l8923a15010p8345
18308a93355k61404A36856c69256A45112m318d43103B31161K1416G7562M83696
18298E61258I1224a28141l06425q8907D91260k06665r6242b82307B99856E7629
18287A59878M0928K33959k11452c17537A10103a77671K2757l43855P0752a96791
18276A87942a54096j70768j5575Q9645j68664C12170a17106k60279a2130k502
18266a4632j74156o38533c78518n2257a03905A67162b62683H3372K74530b00600
18255d704m70155J59432A31096b30138g1441o11535G3992c06565C19113b85817
18244b9840B09085D863a71882j04463i7630E6709b92788c6177B80208a29938j79891
$$ plain form
18318 -808021 -52248 1047631 363139 -51282 -132835 219591 -224567 -263490 -115010 -193355
18308 -193355 -454759 136856 -369256 145112 140794 -443103 231161 252577 77562 561258
18298 561258 91224 -128141 -434566 -523473 491260 284595 188353 -282307 299856 57629
18287 159878 200806 434765 223313 -317537 110103 -177671 -154914 -498769 -428017 -196791
18276 187942 -154096 -324864 -340439 -250794 -419458 312170 -117106 -377385 -12130 -14632
18266 -14632 -188788 -827321 -378518 -430775 -103905 167162 -262683 83372 357902 -200600
18255 -4704 -474859 -315427 131096 -230138 -71441 -682976 73992 -306565 319113 -285817
18244 -29840 209085 4863 -171882 -276345 -97630 56709 -292788 -36177 280208 -129938 -309829
18233c09829H606a51142A93489p5807J78060f61466A47397c6733n34164K81737
18223b89160B51865d27456J47684q1597c6917p590k14685H35612b01205C83750
18212A37834c25402A24739d40370I05384d20030B62734a06792D02481j23029g93425
18201A20536E8K69850b44275C84841b87611j07221H99707c73626a23382m91836
18191f15218k07807A80767L1458e6230k6389K3549o74709j70953B26866f79765
18180B56573a62983P4339l08830E10074A80469d02696A71809L6498b496j24670
18170a27166A8067P0844b07429j5450k68690a58276C59657A9225c05437l09517
18160f14954g7044C48520K29191b4447B77242e61877k6043C8813f59406K50954
$$ plain form
18233 -309829 8606 -151142 193489 117682 295742 -661466 147397 -36733 -570897 -289160
18223 -289160 251865 -427456 -279772 -361369 -36917 -44507 -259192 835612 -201205 383750
18212 137834 -325402 124739 -440370 905384 -420030 262734 -106792 402481 279452 -793425
18201 120536 58 269908 -244275 384841 -287611 -394832 899707 -373626 -123382 -615218
18191 -615218 -823025 180767 212225 -56230 -82619 -59070 -733779 -904732 226866 -679765
18180 256573 -162983 -88644 -397474 510074 180469 -402696 171809 208307 -2496 -127166
18170 -127166 18067 88911 -207429 -222879 -491569 -158276 359657 19225 -305437 -614954
18160 -614954 -77044 348520 577711 -24447 277242 -561877 -587920 38813 -659406 -408452
18150d08452E2205M09420J823F5390M38635j64664a7388G8750N3678E7747A2168
18138b02756g3442C52587G4333J079571C4801k613L90669a47933d0721j7903A34923
18126B68046b56601G25918B54386L92513d88439c4342n01594b67684l65306B35362
18115b23569G1663Q558d42821f5331C54587H1619e01005J29042I3687k3924e0772
18103c05892A74854c5112j12309M8685k7127k64927e7389o508k37873A68261N8129
18092B26390d92175J92759p8497C9790a77169A06263J98795r602l8149d04538
18081D7066c40081j49660A95030b30692E57472f02795b59867D08466c1409j4253
18071d5662K1297k98126l0363l27573b15173m08123K18304O3351D3440c30245
$$ plain form
18150 -408452 52205 461625 463448 65390 504025 339361 -17388 78750 132428 57747 12168
18138 -202756 -73442 352587 74333 1153904 34801 32188 422857 -147933 -40721 -58624 134923
18126 268046 -256601 725918 254386 646899 -488439 -34342 -535936 -267684 -632990 235362
18115 -223569 71663 80221 -442821 -65331 354587 81619 -501005 -371963 93687 69763 -50772
18103 -305892 174854 -35112 -147421 -98736 -125863 -390790 -57389 -63897 -301770 168261 226390
18092 226390 -492175 -299416 -377913 39790 -177169 106263 305058 295456 257307 -404538
18081 47066 -340081 -489741 195030 -230692 557472 -602795 -259867 408466 -31409 -45662
18071 -45662 -24365 -322491 -352854 -680427 -215173 -623296 -404992 -341641 43440 -330245
18060C935a36605f4106N373j11067D81887k17379a91657E028J02191N47759e76825
18048b08763A15811d48704r1326e2746B75449B0667d1639B83754a84736B763a08464
18036b05484B79919a74781C01976d83927K0980A29185C9036c55739k37415B36923
18025b53147k05239B98143A33430a09671E0589J722a74708j01772j32131k10736
18015f19347A81892d7020A66949j2179J5984F8288b2148H13130a50526B49193
18004d24036O3279k46591A77261f98777G69689f24580J84859J18655A9332F757
17993B56856D2147K69919f43982A11298J50638f30191H4109k5783a17777G6977
17982C37377R9032k05854a81530A95703a65100j08438J6702E34785B62920A31398
$$ plain form
18060 3935 -136605 -64106 -58733 -169800 481887 264508 -191657 5028 107219 654978 -576825
18048 -208763 115811 -448704 -540030 -52746 275449 20667 -41639 283754 -184736 2763 -108464
18036 -205484 279919 -174781 301976 -483927 -462947 129185 39036 -355739 -593154 236923
18025 -253147 -458386 298143 133430 -109671 50589 52311 -174708 -276480 -408611 -619347
18015 -619347 181892 -47020 166949 154770 170754 68288 -22148 813130 -150526 249193
18004 -424036 -360757 -607348 177261 -698777 769689 -624580 -439721 -321066 19332 6757
17993 256856 42147 312066 -643982 111298 261936 -630191 84109 58326 -117777 76977
17982 337377 436409 230555 -181530 195703 -165100 -273538 -256836 534785 262920 131398
17971F75088e1646k67247B41845c45642E40340g06011A27515N37135B3955b79794
17960A56387M45420b86341J08121g2477a7527k4719C2036M53734d77016L4849
17950d42167I9804J20429A01374d068G534L48447H0073P7878R4204n5692a92651
17938e01335A08042b18879A56162c8915I06953j618f96736Q7716M7599c8689E35233
17926a58366A8401L67502A56406e1960k94879A39907c78570E25607c5879A64430
17915f12892a05315l35226B36123J7384b17812C12476N0083e04430a3224p35398
17905g48622A05290a42784k62042e9120D15850d28906a18135F507e7536k11588
17895b69124j88305A39057K09969K02613j5377B19107r4491c76246D69747b22276
$$ plain form
17971 675088 -51646 -318893 241845 -345642 540340 -706011 127515 664650 23955 -279794
17960 156387 601807 -286341 -178220 -72477 -17527 -42246 32036 485770 -477016 -442167
17950 -442167 99804 220233 101374 -4068 7534 355981 80073 157951 252155 196463 -192651
17938 -501335 108042 -218879 156162 -38915 906953 905335 -696736 -609020 -561421 -38689 535233
17926 -158366 18401 385903 156406 -51960 -346839 139907 -378570 525607 -35879 164430
17915 -612892 -105315 -440541 236123 253507 -217812 312476 362559 -504430 -13224 -748622
17905 -748622 105290 -142784 -404826 -59120 415850 -428906 -118135 6507 -57536 -269124
17895 -269124 -457429 139057 349026 551639 536262 219107 124616 -376246 469747 -222276
17884d00664B11729J55822c62965A48899b41590a08626L6517k33994m1526l24700
17874f72329B59343d66900b19852H04513c79930a30230l19831B46066c36971k48992
17864e85963d5829j64128k54400j97424i7200r369C1149J76528P939R511K10724
17853D35851A47609L97867A16208d96902a62033j73349c5634G85211b3213l24318
17843c47531a22280B51372c82811j6870C25227a54942a7122k94857K2206m72920
17833g62693F9914c95662E2031Q33278H560c24460f6264j7415D20911G5044P0641
17822A45685d93643a42070j7089K7578k17838o0075g813j22170j9822I7141L70780
17811D67921a1719n59631B9725K7344K66660f16088B08242N897R9218a27322j59116
$$ plain form
17884 -400664 211729 367551 -362965 148899 -241590 -108626 -72109 -306103 -347629 -672329
17874 -672329 259343 -466900 -219852 804513 -379930 -130230 -450061 246066 -336971 -585963
17864 -585963 -45829 -209957 -464357 -661781 -97200 -106569 31149 207677 215616 225127 435851
17853 435851 147609 545476 116208 -496902 -162033 -335382 -35634 785211 -23213 -347531
17843 -347531 -122280 251372 -382811 -399681 325227 -154942 -17122 -311979 -289773 -762693
17833 -762693 69914 -395662 52031 885309 8560 -324460 -66264 -83679 420911 75044 145685
17822 145685 -493643 -142070 -159159 -131581 -349419 -409494 -7813 -129983 -149805 97141 467921
17811 467921 -11719 -571350 29725 57069 323729 -616088 208242 214139 313357 -127322 -286438
17800b86438e2803C99341b09584B13777K38283n5010M78955a23954e3751C51034
17789c51501B82485j15870b17332B03105J00586a00937C09902b66860E51043a42135
17778h4863C38354d52233A02556b36257B04905g80649L19621A34667c7799p01900
17768g39699B6459a36055C89696r5666c45177d3871l89412a4054r5817j09068
17758b18939f0522B24785J17126c667k05161A08084J26149a86457A66886R907
17748A76793C2281L92740f84118B23452G7422a40575a8833B66918b59011a17393
17737b30941G05415B24331b02851j68147o6382E39546a587A93996a24095D45419
17726A19126L14633a08860C9228J77125e7838j3147l41201J29849N8744D49190
$$ plain form
17800 -286438 -52803 399341 -209584 213777 452060 397050 876005 -123954 -53751 351034
17789 -351501 282485 166615 -217332 203105 303691 -100937 309902 -266860 551043 -142135
17778 -84863 338354 -452233 102556 -236257 204905 -780649 -461028 134667 -37799 -739699
17768 -739699 26459 -136055 389696 294030 -345177 -43871 -433283 -14054 -109871 -218939
17758 -218939 -60522 224785 341911 -3667 -208828 108084 234233 -186457 166886 176793
17748 176793 32281 425021 -684118 223452 77422 -140575 -18833 266918 -259011 -117393
17737 -230941 705415 224331 -202851 -370998 -437380 539546 -1587 193996 -124095 445419
17726 119126 433759 -108860 39228 216353 -57838 -70985 -412186 -282337 -223593 449190
17715A10624a06833l4521A08415b64108D72189a82522k81468A73069K90266K68239
17705G31574C56690c41998B16939B7920a60304B11181e00811a81514H9185a92616
17694F8246c90243k32243a86757B51872n4942b38842j9098D8740m697d7859k51888
17683b99747C26873c12094f7185o50701K10466A83017f09916A65153J31724d39
17672e73075D26977K9112j88447a09312A80977C1325J05874c30555A89777c24054
17661c03327B20839a36471I7328M67947k32333f36868c08998J14579B48819C8468
17650c91514B67585L29453j49492C4243O85181H5010b00997C74902j45876b00256
17639d254A87030b89343A97017n2452a27024K1417A60388i1388A35337R3619b23361
$$ plain form
17715 110624 -106833 -141354 108415 -264108 472189 -182522 -463990 173069 463335 731574
17705 731574 356690 -341998 216939 27920 -160304 211181 -500811 -181514 89185 -192616
17694 68246 -390243 -622486 -186757 251872 196930 -238842 -257940 48740 44043 -47859 -299747
17683 -299747 326873 -312094 -67185 -717886 -507420 183017 -609916 165153 296877 -439
17672 -573075 426977 456089 267642 -109312 180977 31325 137199 -330555 189777 -324054
17661 -303327 220839 -136471 97328 565275 332942 -636868 -308998 -194419 248819 38468
17650 -391514 267585 597038 447546 34243 719424 85010 -200997 374902 229026 -200256
17639 -4254 187030 -289343 197017 144565 -127024 -105607 160388 -91388 135337 228956 -223361
17627C37073b53487C04012I8776L40331d02028C61284e27437B2464e85971b90639
17616B65035J41781c89040B20194B2313Q78972H8677h2027j48448F05296k17821
17606C87475e46097B74447e6716D81166a81033j89398A04122a61031M234I15452
17595g59881C65406C8463M5895c99341I9192k6999L32957d4346B33721Q26921
17585A060642m17404d11827E08571c01253H3967e3521n0023m94006F04425k37617
17575C66808B4654f62193C39722C2047a8931j25959k22861A01987b32153C25730
17564B53146K16126K83284A38975O11683A87237A5402K82478g6561B79984i011
17553e86070L0615A21250J64922k4596F4495K20176o2350a52128A892Q7242j9545
$$ plain form
17627 337073 -253487 304012 98776 439107 -402028 361284 -527437 22464 -585971 -290639
17616 265035 406816 -389040 220194 22313 901285 88677 -82027 -230475 605296 387475
17606 387475 -546097 274447 -56716 481166 -181033 -370431 104122 -161031 -156797 915452
17595 -759881 365406 38463 84358 -399341 99192 72193 405150 -44346 233721 1060642
17585 1060642 643238 -411827 508571 -301253 83967 -53521 -103544 -597550 604425 366808
17575 366808 24654 -662193 339722 32047 -18931 -144890 -367751 101987 -232153 325730
17564 253146 469272 752556 138975 750658 187237 15402 297880 -76561 279984 -9011
17553 -586070 -555455 121250 286172 261576 64495 284671 222321 -152128 1892 89134 69589
17542F9589K20688L65629B09020O032C4226d12488C4611K9052J32275L52765e28081
17530f78696G12349G2204J5619J72346n9500P6607j08415K91014a99064A80237
17519C5585Q34279E3886J72047A8655d35962F74207C19337A37930B9386J88070
17509B17456M49150B55505i4221o4738g4235B15590J71085e2181D24887c36592
17498G52266B90826L22729a022358B45520l0180H4894P5574E7437d2049A11661
17487A79236a24261B3372Q37922B79506N39701l82085L14792B78843j666M93280
17477G70457K70952n20261J70076A77O08086A66553n0895M76379b11187C88776
17466A050913D96235k26926J57454A91305N98933j30724k60513F2086M33916k40772
$$ plain form
17542 69589 290277 655906 209020 215052 34226 -412488 34611 63663 195938 548703 -528081
17530 -678696 712349 72204 87823 260169 200669 277276 168861 459875 -199064 180237
17519 35585 869864 53886 225933 18655 -435962 674207 319337 137930 29386 217456
17509 217456 666606 255505 -94221 -158959 -74235 215590 386675 -52181 424887 -336592
17498 752266 290826 613555 -1022358 245520 215340 84894 160468 57437 -42049 111661
17487 179236 -124261 23372 861294 279506 819207 437122 751914 278843 277177 770457
17477 770457 1041409 521148 691224 177 608263 166553 115658 592037 -211187 388776
17466 1050913 496235 269309 426763 191305 790238 659514 399001 62086 496002 255230
17456B55230r6758b76719B93451f9238C58809J6668O7607g72327B19913k814L50319
17445E67418o8023M63269E0617P78927C65242c44374H5120B2417M70209L37325
17435H29951G3707K02283K08086r0992l9748P3061A91270M64513N0801k38982
17425D67602B30526Q46643D23106K32837n7900A60589K03962J5473A24019K85718
17415D09737A45338J73848L35795a9891B89488j26488J88715j2686a07740B96360
17404C04413j41245m0942b54933E19421B29331O07449A63195K25098b34337m3255
17394b77592C28656n0532c31053E59168j587M5302d09106C69704n3635A52381
17383A13684Q9331e65079A13756M91105C1337K31195B1414K28858n6891L44830
$$ plain form
17456 255230 158472 -276719 293451 -69238 358809 375477 443084 -772327 219913 217099 567418
17445 567418 499395 962664 50617 829544 365242 -344374 85120 22417 492626 829951
17435 829951 73707 275990 484076 393084 353336 426397 191270 655783 706584 467602
17425 467602 230526 1077169 423106 655943 598043 160589 364551 380024 124019 409737
17415 409737 145338 319186 654981 -19891 289488 163000 351715 339029 -107740 296360
17404 304413 163168 122226 -254933 519421 229331 836780 163195 388293 -234337 -277592
17394 -277592 328656 278124 -331053 559168 557581 602883 -409106 369704 316069 152381
17383 113684 203015 -565079 113756 604861 31337 262532 21414 250272 193381 538211
17373E38211K1732B37627P21852D14615H1720K01831O71945C58134j56588O30731
17363H32277b59295k28610A25596a80876h6644r0100G47667k64433K30365l15875
17353C97724p298a81C20439N23915l69100m0691A8390L08260J7346j17243J33133
17342C59886o3602K20752A51856h7183C76714b33373D50237g1888A22284J003580
17332A125864C57943j65530o3500P9629L51844B26374J70852O7892k15924n4160
17322A95034N06316C15560H7966Q9295J03997N07607D8437M22149N41914A99569
17311a15630D69914o274B7819J107767m39029B04684j5565D7820N46605p7663
17301E16762J33161B43315K3770j3055J65531a32024r3292E37740J31860K39451
$$ plain form
17373 538211 559943 237627 959479 414615 81720 283551 955496 358134 201546 832277
17363 832277 -259295 -487905 125596 -180876 -86644 -176744 747667 483234 713599 397724
17353 397724 390426 -181 320439 844354 475254 434563 18390 326650 343996 226753 359886
17342 359886 296284 517036 151856 -87183 376714 -233373 450237 -71888 122284 1125864
17332 1125864 357943 192413 128913 208542 560386 226374 397226 465118 249194 195034
17322 195034 701350 315560 87966 177261 281258 788865 48437 470586 1012500 199569
17311 -115630 469914 463640 27819 1135586 696557 204684 189119 47820 594425 516762
17301 516762 649923 243315 267085 254030 419561 -132024 -225316 537740 669600 909051
17291I09051h1982I33302A16866J20201K28331K6411N11252B94666B3539N3939
17281G7478J88340L40454k8146a08188A65147L47319O87510h7206j75090B48680
17270D04412J16164A46614E4492L53084a96909n7215E72258k59896J22023K50188
17260F84573p7059A32218M78372P4560Q1432B99649M41840k12550c10353F62274
17249H95244M29865B66654R38653E30054L90440B88311G0991h4764j95545a34300
17238B60367L6802q2037J44511L1911j17976O95559l28196j73235M15879l84331
17228D99254k1216N10838A91671K72719J74065K17765D20130M44342C69164L06881
17218F76045R1385L72933G082P53052K64023a04716I81479j03176J18113j70668
$$ plain form
17291 909051 -81982 933302 116866 237067 465398 491809 1003061 294666 23539 77478
17281 77478 265818 606272 578126 -108188 165147 512466 1199976 -87206 -262296 248680
17270 404412 520576 146614 54492 407576 -196909 -254124 572258 312362 434385 684573
17260 684573 607514 132218 610590 685150 766582 299649 741489 528939 -310353 662274
17249 895244 1325109 266654 1205307 530054 920494 288311 70991 -84764 -280309 -134300
17238 260367 297169 215132 359643 391554 273578 969137 640941 467706 883585 499254
17228 499254 478038 988876 191671 464390 638455 856220 420130 864472 369164 676045
17218 676045 767430 1140363 7082 760134 1024157 -104716 981479 878303 996416 825748
17208H25748l37457M31740o0407B05300P29311D38091m4780L97086K5491o8834
17198G47054o8205C15628a75516B38615C4126K05240Q5179M42335P2583B96090
17187A29155L18451N87474N6902D13662j20154N05883j30254J12217A85528Q75589
17177A061117j84946A83573M55312P00344C17865K85160a60509F10063N61263
17168A171326A02151J33104b24464A78685J137177l57440L49704D57715J57385
17159F15100M43556D53385Q84674F44321L1500K49323m23991M61779K29082E16152
17148G28311L04636l79895R526P29090E02113L98856l65635M23139l33206M7593
17138F72860j76880N71423K78034l94316k30776M02723l37082K18144D58860O9566
$$ plain form
17208 825748 488291 920031 859624 205300 934611 438091 393311 790397 815888 747054
17198 747054 678849 315628 -175516 238615 34126 239366 324545 766880 839463 296090
17187 129155 447606 1035080 1091982 413662 293508 799391 669137 781354 185528 1061117
17177 1061117 876171 183573 638885 1339229 317865 603025 -160509 610063 1171326
17168 1171326 102151 235255 -224464 178685 1315862 958422 1308126 457715 615100
17159 615100 1058656 453385 1338059 644321 675821 925144 501153 962932 1192014 516152
17148 728311 1032947 653052 662578 1391668 502113 900969 535334 958473 625267 672860
17138 672860 495980 1067403 1345437 951121 720345 1123068 785986 1004130 458860 528426
17128E28426P09738l26650O1210j89967o8509B74879R08486L71731E03144Q15693
17118A318837p2793n17066J17170J47403j17296k95360O93571m36682Q86029n60321
17108A163492n57889O6269B96564P62420l99821J83496L94707m66645N34994K61867
17098A567582j71688K06364p22360L4838N08584k78022J00176R6299l98834L0150
17088I73089N29949j57880Q1237L75159H96886J53899K68018j54952K37400k45771
17078A155480J56267L67837m04336L05247J85204F30102J287038m59159M9480
17069A507461o8513n3959M4179k40653m8378J120745r91526L30648k50661J33493
17059A482836j02114L70533M24987n22909J90536n67015j92888K35281K46289
$$ plain form
17128 528426 1238164 911514 972724 782757 714248 274879 1183365 1555096 503144 1318837
17118 1318837 1246044 728978 846148 993551 876255 580895 1274466 837784 1723813 1163492
17108 1163492 605603 671872 296564 1058984 659163 842659 1237366 770721 1305715 1567582
17098 1567582 1395894 1602258 879898 914736 1423320 1145298 1245474 1341773 942939 973089
17088 973089 1503038 1345158 1426395 1801554 896886 1050785 1318803 1163851 1401251 1155480
17078 1155480 1311747 1679584 1275248 1580495 1765699 630102 1917140 1457981 1507461
17069 1507461 1438948 1384989 1429168 1188515 1140137 2260882 1269356 1600004 1349343 1482836
17059 1482836 1380722 1751255 2176242 1653333 1843869 1276854 1083966 1319247 1565536
17050A565536K20107K49568p08992M46469m70258J338208j208435J01810M12731
17041A946744O40370A002080J678873m44177o54383Q6338K72804L13556j096032
17032A159059Q05474J15240J74259m24858R52908n05606o55248K12005p6431J89192
17022A945994n72983M16096O47967j94373K62873o19754l5387N10961L16281n38099
17012B139576J81367j74228R8131N78580K89501o35108L72122J35562l99389J02638
17002B688752R3030j82371o1631q5971L63380L6634K4073l06192l7101l42341
16992B190262J035565j77828J1132j26231M04393l90663r3088o35463L15434n00972
16982B032541Q27763j41981P66607p16131O51194K04577r5901n89993N38183k44677
$$ plain form
17050 1565536 1785643 2035211 1326219 1772688 1302430 2640638 1432203 1534013 1946744
17041 1946744 2587114 1002080 2680953 2236776 1582393 1668731 1941535 2255091 1159059
17032 1159059 1964533 2079773 2254032 1829174 2782082 2276476 1621228 1833233 1756802 1945994
17022 1945994 1373011 1789107 2437074 2242701 2505574 1885820 1850433 2361394 2677675 2139576
17012 2139576 2320943 2146715 2244846 2823426 3112927 2477819 2849941 2985503 2586114 2688752
17002 2688752 2781782 2599411 2537780 2451809 2815189 2851823 2875896 2569704 2532603 2190262
16992 2190262 3225827 3047999 3059131 2932900 3337293 2946630 2853542 2218079 2533513 2032541
16982 2032541 2860304 2718323 3484930 2768799 3419993 3624570 3528669 2938676 3476859 3232182
16972C232182K97542j40771J30145L2590l801M08442L5332r06428J135223k502
16962D217954l94353R1965j66144K52951J43358M3567k20565N88177n67146L18099
16952D307863L0572j87901K23613K31164p6293J49380L27621n79184K12608L80943
16942E020386K346k6154Q391M39762n55823P91245l60604j61846n32991Q61476
16932E486188K5918Q0967j71039L88816M67663q73362M89413k50491L97300M89678
16922F531051j134270J121821J1543k42598L79597K63947p09364L98710P07997
16913G328434k73560Q95358m39460l47675M0170M53177k07938L02564J10916K68267
16903H130253O25736k43107P5772q5485L70460j77463K40991k23849L32525L42916
$$ plain form
16972 3232182 3529724 3388953 3519098 3551688 3547887 3956329 3991661 3085233 4220456 4217954
16962 4217954 3823601 3915566 3749422 4002373 4145731 4189298 3968733 4556910 3989764 4307863
16952 4307863 4338435 4150534 4374147 4605311 4529018 4678398 5006019 4426835 4639443 5020386
16942 5020386 5022732 4996578 5004969 5444731 4888908 5680153 5319549 5157703 4624712 5486188
16932 5486188 5512106 5593073 5422034 5810850 6278513 5405151 5894564 5644073 6041373 6531051
16922 6531051 5396781 6518602 6530145 6287547 6667144 6931091 6221727 6620437 7328434
16913 7328434 7054874 7950232 7510772 7163097 7203267 7656444 7448506 7751070 7861986 8130253
16903 8130253 8755989 8512882 8588654 8503169 8873629 8696166 8937157 8713308 9045833 9388749
16893I388749m27992O40756J24867j2092K96732p9255L61924N53848q11442O21539
16883A0657634J9473P2647J030955m73182L75270J4793N18631m3783L17222j26463
16873A2363197M78871K42135M55654m937n62227Q79916L26238O1484O2999N00249
16863A4803579M96749L99008J08164l31157N26158R25525k11850m77234P94922
16854A7033864O81283m19448Q57494N89730L08461L07631K46082J77655N80891
16845B0363643O37356J90504l60674P08539N47866K17595M18056L99978Q53410
16836B3976273J12280L36470r9849J087500Q64954O30853O916J113678L7231P64677
16826B8830983J057422l37258J387593J66176O92416J83058J387516m6181J143840
$$ plain form
16893 9388749 8960757 9601513 9726380 9714288 10011020 9931765 10293689 10847537 10036095 10657634
16883 10657634 10677107 10749754 11780709 11307527 11682797 11697590 12216221 12172438 12489660 12363197
16873 12363197 12842068 13084203 13539857 13534920 12972693 13852609 14178847 14240331 14303330 14803579
16863 14803579 15300328 15699336 15807500 15476343 16002501 16928026 16716176 16238942 17033864
16854 17033864 17715147 17295699 18153193 18742923 19051384 19359015 19605097 19782752 20363643
16845 20363643 21000999 21191503 20830829 21539368 22087234 22304829 22722885 23122863 23976273
16836 23976273 24088553 24425023 24325174 25412674 26277628 26908481 26915397 28029075 28066306 28830983
16826 28830983 29888405 29551147 30938740 31104916 31797332 31980390 33367906 33321725 34465565
16817C4465565J52860J081526K63040L12551J371714R46692O39550O38613O27206
16808D0499317Q25803Q47292J84496J328494R60342N69519J168956Q55422N45443
16799D7785084J592560N15864P45436J287656J556428Q40705N04553J938586R32486
16790E7699358P72203R34221J805469N13120J015673J701244R68102O81894J672177
16781F7763461J532780R29032J497071J616725M26049L063015N31551K362291
16773G9721975P51892J693104J502535J172402J898915J835681J140318J694903
16765I1411725K149240L75295K775477K119937J389991J102454K290183J466490
16757A05080792J424266K566834P11530K544355J307196K393459J668209J445983
$$ plain form
16817 34465565 34618425 35699951 35962991 36275542 37647256 38593948 39233498 39872111 40499317
16808 40499317 41325120 42172412 42356908 43685402 44645744 45215263 46384219 47239641 47785084
16799 47785084 49377644 49893508 50638944 51926600 53483028 54323733 54828286 56766872 57699358
16790 57699358 58471561 59405782 61211251 61724371 62740044 64441288 65409390 66091284 67763461
16781 67763461 69296241 70225273 71722344 73339069 73765118 76828133 77359684 79721975
16773 79721975 80473867 82166971 83669506 84841908 86740823 88576504 89716822 91411725
16765 91411725 93560965 93936260 96711737 98831674 100221665 101324119 103614302 105080792
16757 105080792 106505058 109071892 109783422 112327777 113634973 116028432 117696641 119142624
16749A19142624K674598J551820J478482J749934K333320K030360J792222K051783
16741A34805143J539366J980460K011488J803604J353661J962649K665696J009080
16733A49131147J581947K028942J291222J787281J285773J410477J093557J941896
16725A61552242J311643J119901J589376J089419J288459m4208J995372j9846
16717A69882358Q81131O30057L1652k89842K54713l21353J66332o55709q79690
16708A69699649M07918j801467l20545r98297j801310j840374j480233q95454
16700A60969887r38433k152842k207213j487470k680044r23691l061491j827502
16692A45691201l264440k288451k085891k420560k689394l095377l370492l094443
$$ plain form
16749 119142624 121817222 123369042 124847524 126597458 128930778 130961138 132753360 134805143
16741 134805143 136344509 138324969 140336457 142140061 143493722 145456371 148122067 149131147
16733 149131147 150713094 152742036 154033258 155820539 157106312 158516789 159610346 161552242
16725 161552242 162863885 163983786 165573162 166662581 167951040 167906832 169902204 169882358
16717 169882358 170763489 171393546 171425198 171135356 171390069 171068716 171235048 170579339 169699649
16708 169699649 170107567 168306100 167985555 166987258 165185948 163345574 161865341 160969887
16700 160969887 160031454 157878612 155671399 154183929 151503885 150580194 147518703 145691201
16692 145691201 142426761 140138310 138052419 135631859 132942465 129847088 126476596 123382153
16684A23382153l249946k735865l417155k218567l583794k514851m440131l032007
16676I8189837k905748l708922k819623l443458k341535k662667l495658j885305
16668G4926921l153783k625142k712051k217870k747076j585796k621792j875745
16660E5387666k795126j706964j943056j651429k106901j516754k146243j062079
16652D0459114j460028k377095o21068r74234j803521q12025j333697j132465
16644B9944981j596985l71223j482405j70533j038439j235934r42316L5293k090204
16635B1052235k17535p63857q57476p2187j367163L34727o18765j263993o80890
16626A5545096l47385k70087r22444K23160l53707n57392k39629q18788l79976
$$ plain form
16684 123382153 120132207 117396342 113979187 111760620 108176826 105661975 101221844 98189837
16676 98189837 95284089 91575167 88755544 85312086 82970551 80307884 76812226 74926921
16668 74926921 71773138 69147996 66435945 64218075 61470999 59885203 57263411 55387666
16660 55387666 52592540 50885576 48942520 47291091 45184190 43667436 41521193 40459114
16652 40459114 38999086 36621991 36000923 35026689 33223168 32411143 31077446 29944981
16644 29944981 28347996 27976773 26494368 26323835 25285396 24049462 23107146 23142439 21052235
16635 21052235 20834700 20070843 19213367 19141180 17774017 18108744 17489979 16225986 15545096
16626 15545096 15197711 14927624 14005180 14228340 13874633 13317241 13077612 12258824 11878848
16617A1878848L16902o70129q93335K74783n72446n58859M42024l01052m69165
16608I447571R8438m63368r5400k25448p1509k01971j24462J51404l96172l42065
16598G777018m37994j78085j35727N89593k61881m34178L25254k99854k18359
16589F725787j82850r79639J367192m96426j014122M26655k32261L26621r44923
16580D996034J221025j137810N69731k06880m11983m45325L12067l55216M49760
16571D991403J9243l5235l40853m97637N60014q51842P66366n99440M66782l89780
16561D089021J57874k72114Q25722p33382J19299n76095J17000l99573K00596
16552C528348Q8814q02957N43541P9276N47208J45371p13792J37048k27569L54257
$$ plain form
16617 11878848 12195750 11525621 10632286 10907069 10334623 9775764 10217788 9916736 9447571
16608 9447571 9546009 9082641 8987241 8761793 8690284 8488313 8363851 8515255 8119083 7777018
16598 7777018 7339024 7160939 7025212 7614805 7352924 6918746 7244000 6944146 6725787
16589 6725787 6542937 5563298 6930490 6434064 5419942 5846597 5614336 5940957 4996034
16580 4996034 6217059 5079249 5648980 5442100 5030117 4584792 4896859 4541643 4991403
16571 4991403 5010646 4975411 4634558 4136921 4696935 3845093 4611459 4012019 4478801 4089021
16561 4089021 4246895 3974781 4800503 4067121 4186420 3610325 3727325 3327752 3528348
16552 3528348 3617162 2814205 3357746 3437022 3984230 4129601 3415809 3552857 3325288 3679545
16542C679545k90336m46711L87752q74633Q10997m59850R08171o03093L38751
16533C450593q17846j43253L48421k56702O9009K2407p50190Q73215j36962J57850
16523B816542j78663K40142j110096J247207p33424n2585m7682k63064M50824
16514B369201K37402l6625o56938J34715m56021R51924L6046j43162m73304L48244
16504B311482p49206O93611N25171l67688j77329m67536J35692J71618j67280
16495A908535j60661P334J39012K98964p20241M8929N68308L8696k60822l41797
16485A526257N57088m54012J38152K65962J28181o09026K52082k21711G04139
16475I67990M03096k1928M27666k85171k59327K39920k99812J42952j724O63075
$$ plain form
16542 3679545 3389209 2942498 3330250 2455617 3266614 2806764 3714935 3111842 3450593
16533 3450593 2632747 2489494 2837915 2581213 2650222 2672629 1922439 2795654 2658692 2816542
16523 2816542 2637879 2878021 1767925 3015132 2281708 2229123 2181441 1918377 2369201
16514 2369201 2606603 2569978 1913040 2047755 1591734 2543658 2579704 2436542 1963238 2311482
16504 2311482 1562276 2255887 2781058 2413370 2236041 1768505 1904197 2075815 1908535
16495 1908535 1747874 1755208 1894220 2193184 1472943 1521872 2090180 2128876 1868054 1526257
16485 1526257 2083345 1629333 1767485 2033447 2161628 1552602 1804684 1582973 704139
16475 967990 1371086 1349158 1776824 1491653 1232326 1472246 1172434 1315386 1313662 1976737
16465A976737p47705M05234K78858r13688P12515j56406j40631k10474r5852L8272
16455A146860O77897m75290J77264C23331Q22817P69721p38454k03102L40237
16446A314550j14950l27299K20888R2935j39658N60027J64792m89429k91864N10757
16436A500749N6J13628m50394m92583M07687O3212C71112M7892R88976n26960
16426H81020L81805R526j14737l13515J79501K594m25759M27267l51608O3319
16416G39413j71265J205892E38159M650L50047o7493M00260n60068I1142Q94212
16406I85354m47537K01610O87306k27207n79188L7619L99216m31472J23416J86108
16396I35225l88984M88791D17006O40290j33494M3212j35525K78690J53547l44670
$$ plain form
16465 1976737 1229032 1634266 1913124 999436 1711951 1555545 1414914 1204440 1108588 1146860
16455 1146860 1824757 1349467 1526731 323331 1146148 1915869 1177415 974313 1314550
16446 1314550 1199600 872301 1093189 1186124 1046466 1606493 1771285 1281856 989992 1500749
16436 1500749 1500805 1614433 1164039 671456 1079143 1142355 371112 419004 1407980 881020
16426 881020 1262825 1272351 1157614 844099 1023600 1026194 600435 1027702 676094 739413
16416 739413 568148 1774040 538159 542809 892856 825363 1225623 665555 91142 985354
16406 985354 537817 739427 1426733 1199526 620338 657957 1057173 625701 749117 935225
16396 935225 546241 1035032 417006 1057296 923802 967014 831489 1110179 1263726 919056
16386I19056O5012l77055k88745J84907m1692K19918l07854K90714o026C13045
16375H00368M15946J6506J84322k6132l2685F41726L28670q3930k98434m4860
16365E43172M161k18492C7080J066164m15842R9342C92308B6583J149890o4341
16355A112132P1794l71437H1954R92601j62834o1236C39447L27106l9091J5085
16345F42547C08225M48374l512a22850H93961b51331E9256f1086E76677b049C92969
16333I52261C91757H8131R36515K54312F14109O28553D72994L51518B99202n0049
16323B49153K95299b12223I19536J14616G1872K1281N28073r4779J82113k01585
16313E06975A44239L05988J76828k92973L79073j09333k64512K56036j95087j25364
$$ plain form
16386 919056 984068 607013 318268 503175 461483 681401 373547 664261 658235 313045
16375 800368 1216314 1232820 1417142 1391010 1358325 641726 970396 886466 588032 543172
16365 543172 547333 328841 37080 1103244 687402 786744 392308 26583 1176473 1112132
16355 1112132 1183926 812489 81954 1074555 911721 850485 339447 666553 627462 642547
16345 642547 308225 756599 753087 -122850 893961 -251331 59256 -61086 576677 -2049 392969
16333 952261 391757 88131 1024646 1278958 614109 1242662 472994 824512 299202 249153
16323 249153 544452 -212223 919536 1034152 71872 93153 621226 526447 708560 506975
16313 506975 144239 450227 627055 334082 713155 603822 339310 595346 400259 274895
16303B74895K42431j9873L1651B49227N67993l18661N95396m21619j66655E8797
16292B25165K51060j14588L40670j15860q9427Q2948j02540M83878D46666B13672
16281C47672M39320j09669b3509A55878N91349a27555I85165D50956J14791A09278
16270a80719D86609b43342C88724j79449b53765F03099j43696I1466N69217l18924
16260C41759J7063h5193B75351K64372c12778D25016K09344K88068j20870H0916
16249B42185H2947L38350Q7803g5572C44418Q4318o0499n0918E6506N35644b4841
16237C4285a26664C59444R68148n54685R1268k89190d09710R6641c1967j22504
16227a54471D17728c52197j7136a9829G3216N65666j89842B13660K08861j12197
$$ plain form
16303 274895 517326 497453 529104 249227 817220 498559 1093955 672336 505681 58797
16292 225165 476225 361637 702307 586447 497020 579968 477428 961306 446666 213672
16281 347672 786992 677323 -23509 155878 747227 -127555 985165 450956 565747 109278
16270 -180719 486609 -243342 388724 209275 -253765 603099 459403 91466 660683 341759
16260 341759 358822 -85193 275351 539723 -312778 425016 634360 922428 801558 80916
16249 242185 82947 421297 509100 -75572 344418 428736 368237 317319 56506 592150 -24841
16237 34285 -126664 359444 1327592 772907 864175 574985 -409710 -313069 -31967 -154471
16227 -154471 417728 -352197 -369333 -19829 73216 638882 449040 213660 422521 310324
16217C10324e49417B90158e2406A37599L59369A29583e07294F89482a8756A06705
16206E94276j19784K9433C0244K67823L64637b49030B19010M61568e1465n32876
16196e84341i4281n22094E50019k8658B27556m754a12577c7016A7862M66490d28821
16184B55744J4143P25686a66776D41777o2006M1045j92912K42507C4220f88299
16173A58905b44077A81542N662J92005c01062A96081b55287B80841H6907K1961
16163A08868q722K73482b85887G8697K8359M96632B83105k50k6135b50278a6870
16151d33459k39772D9693j0822J97646M52639A74714J98180j85893g44941D1779
16140d4285A25937a14179C87710A88745d3640O332E36898e0950F68994B45359
$$ plain form
16217 310324 -549417 290158 -52406 137599 496968 129583 -507294 689482 -18756 106705
16206 594276 474492 503925 30244 298067 662704 -249030 219010 680578 -51465 -584341
16196 -584341 -94281 -616375 550019 521361 227556 222802 -112577 -37016 17862 484352 -428821
16184 255744 269887 995573 -166776 441777 379771 420816 227904 470411 34220 -688299
16173 158905 -244077 181542 187204 379209 -301062 196081 -255287 280841 86907 108868
16163 108868 100146 373628 -285887 78697 107056 603688 283105 282855 256720 -250278 -16870
16151 -433459 -673231 49693 38871 236517 689156 174714 372894 187001 -744941 41779
16140 -44285 125937 -114179 387710 188745 -43640 -37308 536898 -50950 668994 245359
16129C70136A83666c83941o38143H9245L10434a94788K1259m7058I3161e16978
16118E4830K29414K27827a33808D53380p2852A45733g3243l15627C30351K37840
16108E68191k46988J1782O234F5571b35896D37078M9180r0995b1924b297n8382
16097f0679H8433a16085b8629o2127D74300N2441a44044D05012B0312J2428c98236
16085f17817a95052D10610B00640J42442e93507C30145J8971E356M1791M30822
16075D77969r0367K50357A41041b58923B19967K07109b62110m01928R7697B93510
16064a11417j48714D52137d84987F0732e98266F40875A46411h3860j6143C2387
16053D95121k29911d25192E66798c3608j73216j42182C13770e66904A42237e50042
$$ plain form
16129 370136 183666 -383941 -1022084 89245 399679 -194788 -173529 -220587 93161 -516978
16118 54830 284244 512071 -133808 453380 380528 145733 -73243 -388870 330351 568191
16108 568191 321203 332985 339219 65571 -235896 437078 486258 395263 -21924 -2297 -60679
16097 -60679 88433 -116085 -28629 -90756 474300 526741 -144044 405012 20312 32740 -398236
16085 -617817 -195052 410610 200640 343082 -593507 330145 349116 5356 47147 477969
16075 477969 387602 637959 141041 -258923 219967 427076 -262110 -664038 -566341 293510
16064 -111417 -260131 452137 -484987 60732 -598266 640875 146411 -83860 -100003 32387
16053 495121 265210 -425192 566798 -33608 -206824 -349006 313770 -566904 142237 -550042
16042F6442M78497A96708d37423F65567A35663M91020b76348f7521k36A89698
16031a84617L9271k42131g3053j52640F5135d81275I7329e06872B8770K17832
16021B46602q4169d31886D80955b45142D1566J29725n2744K14598b63781K4197
16011b39584B50855g10495A04381a91760A11426e03756b06839R2559E3261J9860
16001G3121K83736i2375C74646J27435G7068M08448H6674K67028H8599f48286
15990b11536o29808h9790l4550B47060g3992j23068A64041J56765d02196B93678
15979e57359b60326l2479B40614a45685k89378A37008L35414B08941e37178A61887
15968D39548J66624j49086D4638K05698a98700A75302b39886C83430E6962d338
$$ plain form
16042 66442 544939 196708 -437423 665567 135663 626683 -276348 -67521 -67757 189698
16031 -184617 -145346 -387477 -73053 -225693 65135 -481275 97329 -506872 28770 246602
16021 246602 162433 -431886 480955 -245142 41566 171291 118547 333145 -263781 -239584
16011 -239584 250855 -710495 104381 -191760 111426 -503756 -206839 -114280 53261 73121
16001 73121 356857 -92375 374646 502081 77068 485516 86674 353702 88599 -648286
15990 -211536 -841344 -89790 -124340 247060 -73992 -197060 164041 320806 -402196 293678
15979 -557359 -260326 -292805 240614 -145685 -435063 137008 472422 208941 -537178 161887
15968 439548 606172 457086 44638 250336 -198700 175302 -239886 383430 56962 -4338
15957b71092a07817B30344a71464d4544A67942J1787e63700b1106p466B41326
15946D84041c38959f5005m68428a70962B78910d60313C82124A65253d96789b24127
15935B3057c03866j30197B29582J97705j05175b58017j87334B95565d39875l87021
15925h26896i4510l0656F82125c1328j87752P8947K9057j94207k41022B70171
15914a42548l21346B05518G9449N43400B57268a98977c3127r60601B97306a62155
15903H52133B66821e3953B71955c89850h5294j43309C27769f36898A25100j3065
15893A12035a37347k18298B39972b79675B32582b64208B76470c48092D05152a18703
15882E39226J00246c26045P4277D84098k13650f8508B56241k1210b90773L4338
$$ plain form
15957 -271092 -107817 230344 -171464 -44544 167942 179729 -563700 -21106 -28572 241326
15946 484041 -338959 -65005 -533433 -170962 278910 -460313 382124 165253 -496789 -224127
15935 23057 -303866 -434063 229582 427287 322112 -258017 -445351 295565 -439875 -826896
15925 -826896 -94510 -125166 682125 -31328 -219080 -140133 -111076 -305283 -546305 270171
15914 -142548 -463894 205518 79449 622849 257268 -198977 -33127 -993728 297306 -162155
15903 852133 266821 -53953 271955 -389850 -85294 -228603 327769 -636898 125100 112035
15893 112035 -137347 -355645 239972 -279675 232582 -264208 276470 -348092 405152 -118703
15882 539226 639472 -326045 -251768 484098 270448 -68508 256241 235031 -290773 -256435
15872b56435B87988J82694d02648j9255E79914A5189L33835K82103G3727e45362
15861F32737e92905a72001B24224c53106f1035k9180B26547a19234o02520b17155
15850c93557B86541K15116H0646l6615d11849J87158a7522o3373l42555B03699
15839d59982D96531b57078k11075a77355o1711k51906a88490A33628f6942C54105
15828A79829b1130A71588F0569g33380D75305C8097c93119a36898B7093c4398
15817b70374F03108a38130p366m56983m21622a38809G29795g34741a36694m2562
15807a79256j53249a22653k01924k07147a58171E1163J04203A0939K94498J5006
15797C20443b20045f6744k18314k97671b42344K7719j93941h21E54718N4736A06368
$$ plain form
15872 -256435 287988 470682 -402648 -421903 579914 15189 349024 631127 73727 -545362
15861 632737 -592905 -172001 224224 -353106 -61035 -90215 226547 -119234 -721754 -217155
15850 -393557 286541 501657 80646 44031 -411849 -224691 -17522 -80895 -423450 203699
15839 -459982 496531 -257078 -468153 -177355 -239066 -490972 -188490 133628 -66942 354105
15828 179829 -21130 171588 60569 -733380 475305 38097 -393119 -136898 27093 -34398
15817 -270374 603108 -138130 -145496 -602479 -1024101 -138809 729795 -734741 -136694 -179256
15807 -179256 -332505 -122653 -324577 -531724 -158171 51163 155366 10939 305437 320443
15797 320443 -220045 -66744 -285058 -582729 -242344 -214625 -408566 -821 554718 609454 106368
15785d69325A19006d60158D91179A02749e27739I599a53994E82090f18348K60642
15775c57706m1844A5958d67026B97412b43261O0883l3101G9410e75738b58875
15764a81090r2128C29492b90969C88511a01023D24465b94498c9471m51981K30578
15754b60874C73729A73838c38853i397r5343m39539b07505C17047c12580A21893
15743A58642a83923E18194b06006l07565A63839b2571l02723C9233a61139j03630
15733b64769B49274e7016D1402a61998f505k57038C56209o7985a85101j69390
15723c54491l06741G2717d03936c9141E1019a23944C95090J92748B20166d9104
15712A22469b83585b2240n39090h7881q1073L1638J3040d9440C5892d49175a1958
$$ plain form
15785 -469325 119006 -460158 491179 102749 -527739 9599 -153994 582090 -618348 -357706
15775 -357706 -399550 15958 -467026 297412 -243261 -182378 -215479 79410 -575738 -258875
15764 -181090 -273218 329492 -290969 388511 -101023 424465 -294498 -39471 -491452 -260874
15754 -260874 373729 173838 -338853 -9397 -104740 -544279 -207505 317047 -312580 121893
15743 158642 -183923 518194 -206006 -513571 163839 -22571 -325294 39233 -161139 -264769
15733 -264769 249274 -57016 41402 -161998 -6505 -263543 356209 288224 -185101 -354491
15723 -354491 -661232 72717 -403936 -39141 51019 -123944 395090 587838 220166 -49104
15712 122469 -283585 -22240 -561330 -87881 -168954 -137316 -124276 -49440 35892 -449175 -11958
15700b27460E13085d77231C65188c07495A02857b27007j38548B89793a57189f6350
15689a57900n16221c25263a16149m94464C14079d19225l0081C59479A03517e36362
15678E12631h23650f7793m92496A91735d9553k62819h1532c2338B48460f76762
15667b54221B14771r0970a5368n3276A37096e09771q5627J32720a00872A47129
15656A02619J86594c97108d4810k65573A60683E720c94310a08602D14524a80219
15645b19272l80800C09288A21553N43280h9113j10617h7461p72557E36996a58291
15634b625m27191E3911L7358a55589A22849b16990j14809A25709g47857c9698
15623b97427A73236K41747b58053N7833D34237h4145A98138a38180m1891j13119
$$ plain form
15700 -227460 513085 -477231 365188 -307495 102857 -227007 -365555 289793 -157189 -66350
15689 -157900 -674121 -325263 -116149 -610613 314079 -419225 -449306 359479 103517 -536362
15678 512631 -823650 -67793 -560289 191735 -49553 -312372 -81532 -32338 248460 -676762
15667 -254221 214771 123801 -15368 -68644 137096 -509771 -595398 -462678 -100872 147129
15656 102619 289213 -397108 -44810 -310383 160683 5720 -394310 -108602 414524 -180219
15645 -219272 -600072 309288 121553 664833 -89113 -199730 -87461 -860018 536996 -158291
15634 -2625 -429816 53911 91269 -155589 122849 -216990 -331799 125709 -747857 -39698
15623 -297427 173236 414983 -258053 -200220 434237 -84145 198138 -138180 -180071 -293190
15613b93190G9802c49761A18736J92638a9957n88481D2369O1216d64694B79518
15602b60224l28461A41936N26809a021919A72453G886K54457I050O80811f6583
15591A27031a37374C54258G4732c66539a1252o38966A28108i36107C83380f48765
15580A34580b52569l78147b13043A25335c26836a48087l9036A2474b69871l67628
15570f37499E39529A83471a01017A6229J4970e19304g2286C20753f0447E73921
15559b57757l91180E24706c96514C33827A48765c29239G77872A2084R561c05503
15548C71732A38091g75985A21562c42270B10421d29027a5433o58814C95174a75687
15537a25174C7694J49172a81322A86575M23930j76408g8421M270j058160a49767
$$ plain form
15613 -293190 79802 -349761 118736 311374 -19957 -608438 42369 103585 -464694 279518
15602 -260224 -588685 141936 668745 -1021919 172453 7886 262343 9050 689861 -66583
15591 127031 -137374 354258 74732 -366539 -11252 -650218 128108 -936107 383380 -648765
15580 134580 -252569 -630716 -213043 125335 -326836 -148087 -187123 12474 -269871 -637499
15570 -637499 539529 183471 -101017 16229 31199 -519304 -72286 320753 -60447 573921
15559 -257757 -648937 524706 -396514 333827 148765 -329239 777872 12084 21645 -305503
15548 371732 138091 -775985 121562 -342270 210421 -429027 -15433 -674247 395174 -175687
15537 -125174 37694 186866 -181322 186575 610505 434097 -78421 -74151 -1132311 -149767
15526c20802J28724j13232A25990d65334m2736a67149A05099L9201c10206F2380
15515D30153N91872b28728O2241j9288q9274m58646F32249b03533h4967G2662
15504h8053j36752b789B32831L0164J09951b71235F21656g7273l69540B6638f36947
15492A68804b34204E00302f37399E8804b25771C01165g7418G1722g37561H42775
15481F67783h14169L03935K5177B11246b2860B91011a27193A51150G636K8796
15471C6432c97191D25679c69106b9948E7291A8911N49815B13448q6545J25467
15461B52370k8644i8484r3165E1086O40661b99991E5003d7692G151a51644B29777
15449B01334J76318c52072A81354P2549b18203A67467e04079A56368b22152H60514
$$ plain form
15526 -320802 -192078 -305310 125990 -465334 -508070 -167149 105099 144300 -310206 62380
15515 430153 1022025 -228728 -166487 -185775 -275049 -733695 632249 -203533 -84967 72662
15504 -88053 -224805 -2789 232831 262995 372946 -271235 621656 -77273 -446813 26638 -636947
15492 168804 -234204 500302 -637399 58804 -225771 301165 -77418 71722 -737561 842775
15481 667783 -814169 -510234 -485057 211246 -22860 291011 -127193 151150 7636 36432
15471 36432 -397191 425679 -369106 -29948 57291 18911 568726 213448 126903 252370
15461 252370 223726 -98484 -191649 51086 691747 -299991 55003 -47692 7151 -151644 229777
15449 201334 377652 -352072 181354 253903 -218203 167467 -504079 156368 -222152 860514
15438d1610D75921e87419H9887N90190C01442b93119K4979E84410j56516L93963
15428H21857b63126R3627f6387A121141c74821O0255E34385c35414f206A44900
15417d8531a4558n96C2825b72041J3787B84069f79775b39437j2047j27519k40225
15406f19228A69742J92004j14226a74591b7822l15365B99159K89492a65960B51095
15395A89273a72498A16973a04721A760a0319B76370a97764j05696J39588n89374
15385g53246E69343A65039A2989P4382M11203f6256k02832b6353l1251B61781
15374b06671f6500F28670A11153O9987a808k72747K128H6944J47399g19661H5386
15362D66566b16466D4399K08189F8574d14841J68404e0275o83185a6724C89197
$$ plain form
15438 -41610 475921 -587419 89887 680077 301442 -293119 -268140 584410 427894 821857
15428 821857 -263126 -169499 -66387 1121141 -374821 -314566 534385 -335414 -6206 144900
15417 -48531 -14558 -15154 32825 -272041 -258254 284069 -679775 -239437 -251484 -379003 -619228
15406 -619228 169742 361746 247520 -174591 -27822 -343187 299159 588651 -165960 251095
15395 189273 -172498 116973 -104721 1760 -10319 276370 -197764 -303460 -163872 -753246
15385 -753246 569343 165039 12989 87371 498574 -66256 -269088 -26353 -57604 261781
15374 -206671 -66500 628670 111153 181140 -1808 -274555 -272427 86944 234343 -719661 85386
15362 466566 -216466 44399 252588 68574 -414841 -246437 -50275 -733460 -16724 389197
15351b00886B9263J28020b16354I22745b44257I9119a2002m0105j08869F32670
15340B23853B5328K49822K36995a66498D35384k11128b5351C1619K33844l1050
15330B34413c73560a50707j30B31470G3409d01620B89151Q6728b0050k84205g8383
15318c41172A59609n7817J26839j07862K00804b80479P1729k66695A73132f99437
15307D17610c01791F15257A2048M15340a37053A65235J7607a48837A23652a62198
15296A64610a61054D05440j27975b44n24155b37903k37075D17841j40641J84026
15286D61226q1888L16231n5649e79082C60961G9927a62777C17925c3596p1950
15276a05546C72749L23832B14438R7634j10411M13714m5672B82014K10428K25221
$$ plain form
15351 -200886 29263 157283 -216354 922745 -244257 99119 -12002 -52107 -160976 632670
15340 223853 25328 275150 512145 -166498 435384 224256 -25351 31619 265463 234413
15330 234413 -373560 -150707 -150837 231470 73409 -401620 289151 375879 -20050 -304255 -78383
15318 -341172 159609 101792 228631 120769 321573 -280479 -208750 -475445 173132 -699437
15307 417610 -301791 615257 12048 427388 -137053 165235 182842 -148837 123652 -162198
15296 164610 -161054 405440 277465 -244 -524399 -237903 -474978 417841 277200 461226
15286 461226 379338 695569 639920 -579082 360961 79927 -162777 317925 -33596 -105546
15276 -105546 372749 696581 214438 312072 201661 615375 569703 282014 492442 717663
15266G17663j78968J2615k53522L13934M40320a30531B35924A7053L16351j31613
15256B01791N96208a30615k96874E43817L3380J08957K12134b85331f3272F90452
15245F46543M05159A93036L74654d88050H91333B7709M00850A72258J29449J07434
15235D09141j52861M01816l6843k91824M01714k16946K16420J72363D27460K25496
15225F52956k52293j21255O72651m64402d3599B36232Q79062m99479k83376F3403
15214A361033c04822B17083L37050j1630j78059P51891E51541k5758K87119j07380
15204G05522A1860M36883A77869Q58545a66774C13991J48380B24260a76434B09717
15193B93497O79745B88969J46794A74018H4113a19575C38042a14850E01220k14543
$$ plain form
15266 717663 538695 551310 297788 611722 1052042 -130531 235924 17053 333404 201791
15256 201791 797999 -130615 -427489 543817 577197 686154 898288 -285331 -63272 690452
15245 646543 1051702 193036 567690 -488050 891333 27709 428559 172258 301707 409141
15235 409141 256280 658096 621253 329429 731143 514197 730617 902980 427460 652956
15225 652956 400663 279408 952059 487657 -43599 236232 1115294 615815 332439 63403
15214 1361033 -304822 217083 554133 542503 364444 1116335 551541 525783 812902 705522
15204 705522 11860 448743 177869 1036414 -166774 313991 462371 224260 -176434 209717
15193 293497 973242 288969 435763 174018 84113 -119575 338042 -114850 501220 286677
15183B86677b17131C85963a96567B21818i1730C06923C5787O23770j07224j93839
15173C58494c2596g012E11589r2695N6027o4288K91578E4481k636Q3193o3547
15162G1491L13814j77627R7021n8188A22157J00165N07520k20993q8390b53855
15151D18506j90594e73363C08096j11657J41767h4118B56055c30612C13928J0595
15141C24523P57297D86895c60404a45657a5791j71075D94697j93919n0333L82572
15131F33017j57980k1066B01421p6720P45558f0688j01076A41424K28737K99657
15121F69818Q4872B45917L04595j19236b44171B05235O96403A47791Q84042d2395
15110G24610j20521k19739k1262A80947l0557L7606L19423a63163A20834R1292
$$ plain form
15183 286677 -217131 385963 -196567 221818 -91730 306923 35787 659557 552333 358494
15173 358494 -32596 -7012 511589 418894 474921 410633 702211 54481 51845 135038 71491
15162 71491 385305 207678 304699 246511 122157 222322 729842 508849 420459 -253855
15151 418506 227912 -573363 308096 196439 338206 -84118 256055 -330612 313928 324523
15141 324523 1081820 486895 -360404 -145657 -15791 -186866 494697 300778 250445 633017
15131 633017 475037 453971 201421 124701 870259 -60688 -161764 141424 370161 669818
15121 669818 754690 245917 550512 431276 -244171 205235 901638 147791 1031833 -42395
15110 724610 604089 384350 363088 180947 150390 187996 507419 -163163 120834 212126
15100B12126l812K32212L13484k47731r2345L8620p3585J72133j58724b0789E83820
15088H97144J77808D04823J80132g0551p5149B58171A8477b72504G532a86137
15077F7260J92117D4756O24671a40710C76111N12232a05197C05129M12036j27093
15067E90072k38856M2252M41614k87375O33536n55495A43458L06272A78403a12627
15056F00769j35495N65301C94251N22290B5108h0389j41283Q9943C11089b67440
15045C56667J21368k18169J79213J90768E7810O09040k85299L05334j50426B54157
15034F09747K74542D37520j75052K63755q5620h0491c4890G48034K32773C75615
15023d5743C39727A04153K29483K15406e19374A520532m04375D73175A55309M08448
$$ plain form
15100 212126 208314 440526 754010 506279 413934 452554 378969 551102 392378 -20789 583820
15088 897144 1074952 404823 584955 -70551 -145700 258171 18477 -272504 7532 -186137
15077 67260 259377 44756 669427 -140710 376111 888343 -105197 305129 717165 590072
15067 590072 351216 393468 835082 547707 1181243 625748 143458 449730 178403 -112627
15056 600769 465274 1030575 394251 916541 25108 -80389 -221672 -131729 311089 -267440
15045 356667 478035 259866 439079 629847 57810 666850 381551 686885 536459 254157
15034 609747 884289 437520 262468 526223 440603 -80491 -34890 748034 980807 375615
15023 -45743 339727 104153 333636 549042 -519374 1520532 1116157 473175 155309 563757
15013E63757L26719B30613M54096J50969H0411P27172J7535A0428P13908B18331
15002E71338A69151J338127C89247P12262D86240o1060L11578C50023J79436M88739
14992A018198A41810L42997j75903Q4697a53103B22541R60306m33402H675N55298
14982E63973P0960k23050L5795B21346c29525F87470K41867C51959J17656J88018
14972F57633L77669B11812O16611k25648J56079l190C52382K14903j58729K51788
14962F60344J28819C66655l1017F1053J00962R44514j61149D49616K62908j64950
14952E47574N44508K2495l76513L29130J42015H7795P91039n3842G0231P61173
14942H31404C09816O60096r0894B55658N76357L3183J21855m16331O38792D88863
$$ plain form
15013 563757 890476 230613 684709 835678 80411 807583 825118 10428 724336 218331
15002 571338 169151 1507278 389247 1101509 486240 425180 736758 350023 529459 1018198
14992 1018198 141810 484807 308904 393601 -153103 222541 1182847 749445 8675 563973
14982 563973 634933 411883 447678 221346 -329525 687470 929337 351959 469615 657633
14972 657633 1035302 211812 828423 602775 758854 755664 352382 567285 408556 660344
14962 660344 789163 366655 335638 61053 162015 1106529 945380 449616 712524 547574
14952 547574 1092082 1114577 738064 1067194 1209209 87795 878834 824992 70231 831404
14942 831404 309816 969912 879018 255658 832015 865198 987053 570722 1209514 488863
14931d69985I94227j03180p8675n1756Q7583k98310k47133M08556B63398Q09090
14921A072488L7195D86518C186J082801k38386l26076O08632E42519j21129M13002
14911H34392C09448P70901L6623n53963A59558M81761L47304B68902O47989J32699
14901A049590L32258m84172R2167j88637l92824M66318M27279E47584O59966n22299
14891F85251l20874P24892j2155l74808q5246M51648m37249N14758m48210j4004
14881F84003k79283l5999Q90688m01169k62241M01879M6782k98924M0815Q55846
14871A642397o92463L19467k27030p5314L98078C41852P99903n17800L15284m08937
14861E30302P60465N0644n55502L21118l30170O91690D80266B07808Q00551p449
$$ plain form
14931 -469985 994227 891047 812372 760616 848199 549889 302756 711312 263398 1072488
14921 1072488 1109683 486518 3186 1085987 847601 521525 1130157 542519 421390 834392
14911 834392 309448 1080349 1116972 563009 159558 641319 988623 268902 916891 1049590
14901 1049590 1381848 897676 989843 801206 408382 874700 1301979 547584 1207550 685251
14891 685251 364377 1089269 1077114 702306 617060 1068708 631459 1146217 698007 684003
14881 684003 404720 368721 1259409 858240 595999 997878 1044660 745736 786551 1642397
14871 1642397 949934 1269401 1042371 967057 1365135 341852 1141755 623955 939239 530302
14861 530302 1290767 1341411 785909 1107027 776857 1468547 480266 207808 1008359 1000910
14851A000910N70626n30288m11788L53384p7114r3921o5090N28835E79601k66285
14841C13316P37295K86661m76326J78059k08625p6855M72638j23814n18685j69993
14831D13671P50455A48623J024637L29226k18L47358l11146C63594R72069C83399
14820A665683k80065K28890j78023k64043k87386P68472P8855m27787M03229o20889
14810A086936M57218E48307K56860K94788N46789l98749l84668J459279A131871
14800H25960J205271n15374j90164K0906M81119n68437M16697l13402K6980K22733
14790A612289G91486N95480K46358k70796m75093K97284O59833p2587l69731K29287
14780A631521L02393m60296Q4748N42819q88257q6988J25453K88747l18322L290
$$ plain form
14851 1000910 1571536 1041248 629460 982844 905730 811809 746719 1275554 579601 313316
14841 313316 1050611 1337272 860946 1039005 830380 753525 1226163 1102349 583664 413671
14831 413671 1164126 148623 1173260 1502486 1502268 1849626 1538480 363594 1335663 383399
14820 1665683 1385618 1614508 1436485 1172442 885056 1653528 1732383 1304596 1707825 1086936
14810 1086936 1544154 548307 805167 1099955 1646744 1247995 863327 2322606 1131871
14800 825960 2031231 1515857 1325693 1346599 1827718 1259281 1675978 1362576 1389556 1612289
14790 1612289 791486 1386966 1633324 1362528 887435 1184719 1844552 1771965 1402234 1631521
14780 1631521 1933914 1473618 1558366 2101185 1212928 1125940 1251393 1540140 1221818 1225108
14770A225108Q4356L0658J80626M9005N87424k74716n47013M74199k51676M89686
14760B047657m75135m63580J260759l07854p18802O82336P6514m78915J45880
14751A768860L1474m74786N76651M45177r25895O46537r33558M26328j15089J84401
14741A630100M21626p91849R5781O33062k31911K86764j24824l01952n3622P64279
14731B327454n37066P01802r10163N42684K15929p83788O47854m02165o46036
14722A156505O97698L92434q6120Q3005M21223l53333M88759k96057J32989K5252
14712B662355m98014J22759R481L09995K0475p58090P13445k83232N31326q83343
14702A947157L41896P52008j74880J71573n2279o5544q0565m43680k55825M95044
$$ plain form
14770 1225108 1309464 1340122 1520748 1569753 2157177 1882461 1335448 1809647 1557971 2047657
14760 2047657 1572522 1108942 2369701 2061847 1343045 2025381 2101895 1622980 1768860
14751 1768860 1800334 1325548 1902199 2347376 1421481 2068018 1134460 1560788 1445699 1630100
14741 1630100 2051726 1259877 1355658 1988720 1756809 2043573 1918749 1616797 1563175 2327454
14731 2327454 1790388 2492190 1582027 2124711 2340640 1556852 2204706 1802541 1156505
14722 1156505 1854203 2246637 2160517 2243522 2664745 2311412 2800171 2504114 2637103 2662355
14712 2662355 2164341 2287100 2296581 2606576 2627051 1868961 2582406 2299174 2830500 1947157
14702 1947157 2289053 3041061 2866181 3037754 2985475 2919931 2839366 2395686 2139861 2634905
14692B634905Q1703o80812N12137M59588l4663l46331J52051O28549p84509k38133
14682B384485M22678J00006L61409r9598m49413J88023K029R4411M3735k21281
14672B826484l16459M33573j77892R62592m85639L92663j18416j56346k09014
14663C151546J29230L30173n58903K53479j39453P55987n62782n9971M02883r63632
14653B738557P28536o0955M16582L0977J2532n72308J49123K25060O99661j04004
14643D263761o60035O15635m12982N86091M0487k10736n7287J27261m57729J85089
14633D019555P95504l56217k62569L87686l15925K12949k72467J18672R51709
14624E278897l47887j67649O80499j57914r38727J034569j83859j08082J239666
$$ plain form
14692 2634905 2716608 2035796 2547933 3007521 2972858 2626527 2778578 3407127 2622618 2384485
14682 2384485 2807163 2907169 3268578 3168980 2719567 2907590 2909619 3004030 3047765 2826484
14672 2826484 2510025 2943598 2765706 3728298 3242659 3635322 3516906 3360560 3151546
14663 3151546 3280776 3610949 3052046 3305525 3166072 3922059 3359277 3299306 3702189 2738557
14653 2738557 3467093 3406138 3822720 3853697 3866229 3293921 3443044 3668104 4367765 4263761
14643 4263761 3603726 4219361 3806379 4392470 4432957 4222221 4164934 4292195 3834466 4019555
14633 4019555 4815059 4458842 4196273 4583959 4268034 4480983 4208516 4327188 5278897
14624 5278897 4931010 4763361 5443860 5285946 4347219 5381788 5197929 5089847 6329513
14615F329513r28335n07203M13048J153298o96816m88047m26786R37188M29771
14606F215631j18334M53223o34168L98035n29761j55838K08546Q41541M03532
14597G082407q83529O00421p939L62563R6826l00418Q9231L02542j60835M39695
14587G620964N12901p32780M37511k51589j36715N53755N5390K63877l14187O93692
14577H702819j44469K62122k26395K50611l5612k92445J99561P96942k58148L93447
14567I648433K31560N78013l85191M90426o87336J393646o35572K2026N30821
14558A1186826J67721k74703J55154K6831L11596L08036L26061j56406K07133
14549A2258249l21358N90253K5925m0497N05688J75089k19960M56494L28766n05021
$$ plain form
14615 6329513 5401178 4893975 5307023 6460321 5763505 5275458 4848672 5785860 6215631
14606 6215631 6097297 6550520 5916352 6314387 5784626 5628788 5837334 6678875 7082407
14597 7082407 6198878 6799299 6791360 7153923 7250749 6950331 7039562 7342104 7181269 7620964
14587 7620964 8133865 7401085 7838596 7587007 7450292 8004047 8059437 8323314 8009127 8702819
14577 8702819 8558350 8820472 8594077 8844688 8809076 8516631 8716192 9513134 9254986 9648433
14567 9648433 9879993 10458006 10072815 10563241 9875905 11269551 10633979 10656005 11186826
14558 11186826 11354547 11079844 11234998 11261829 11573425 11881461 12207522 12051116 12258249
14549 12258249 11936891 12527144 12553069 12512572 13018260 13193349 12973389 13429883 13758649 13253628
14539A3253628J72244J7497K313M14222q67716L60380L96794j90706J16845L92751
14529A4068252p07758J92264J3134Q07750r1038p97795L31307M58492L7202n41964
14519A3769846K89873J023344j13459j575519J002469m24393m49715Q08593P0317
14510A4401356l29977q965j45887N64208M16326l71237k38636M29918L9563P8695
14500A4835364N9796M02520m84153J76689J291211q57726P08067J49226q3818
14491A6197176P6004O58028K81200n50850J23988Q81083k3710K72795j00896j07438
14481A7707380R60487k39741N43899Q4563n36692M34711O2785O78389J505368
14472B1201149j49631L99235J61461Q1908J62501N84733K35684O47407k92995
$$ plain form
14539 13253628 13425872 13443369 13445682 13859904 12992188 13352568 13749362 13558656 13675501 14068252
14529 14068252 13360494 13552758 13565892 14373642 14282604 13484809 13816116 14274608 14311810 13769846
14519 13769846 14059719 15083063 14969604 13394085 14396554 13972161 13522446 14331039 14401356
14510 14401356 14071379 14062414 13916527 14480735 14897061 14525824 14287188 14717106 14756669 14835364
14500 14835364 14895160 15297680 14813527 14990216 16281427 15423701 16131768 16280994 16197176
14491 16197176 16273180 16931208 17212408 16661558 16785546 17666629 17642919 17915714 17814818 17707380
14481 17707380 18667867 18428126 18972025 19056588 18519896 18954607 19017392 19695781 21201149
14472 21201149 21051518 21450753 21612214 21694122 21856623 22441356 22677040 23324447 23031452
14463B3031452J78630M81873k01158J6952R41641J161307q77781K40213N57626
14454B5530755R64981P05487O47916n09414P32347Q43050j84095R03205m80665
14445B9153567J052704R08343j07306J028071P52626r9718Q38862p7822J117746
14436C4567073k04969N2789J443745J073824M52916L01500R86831J77808Q77909
14427C9729426K38431P13838P76085R00217Q91756k78387J131237J376251Q39199
14418D6318053n01095J540710J011629M89713J414060O89457J561009M9833O52486
14409E3225855O08038K739134n5526R83444J229611Q29099J020493J486051J065397
14400F3131596J537797R56166J081049R89211J612900J102792J713077J523760
$$ plain form
14463 23031452 23210082 23691955 23490797 23507749 24449390 25610697 24732916 24973129 25530755
14454 25530755 26495736 27201223 27849139 27339725 28072072 28915122 28731027 29634232 29153567
14445 29153567 30206271 31114614 31007308 32035379 32788005 32688287 33527149 33449327 34567073
14436 34567073 34362104 34414893 35858638 36932462 37385378 37686878 38673709 38851517 39729426
14427 39729426 39967857 40681695 41457780 42357997 43249753 42971366 44102603 45478854 46318053
14418 46318053 45816958 47357668 48369297 48859010 50273070 50962527 52523536 52573369 53225855
14409 53225855 53833893 56573027 56517501 57500945 58730556 59559655 60580148 62066199 63131596
14400 63131596 64669393 65625559 66706608 67695819 69308719 70411511 72124588 73648348
14392G3648348P78599J427120J504042J756612J375648J333549J758269J605872
14384H5188059M34112K673087J963973J464288J277544J505195J698372K141939
14376I8346569J597088K218685J112503K449821K172433K169512J821332J988715
14368A13876658J631100K418171J746074L390591J215221K492944K122871K263787
14360A31157417K042339K769223K715272J001295K554152K689226L362313K866767
14352A51158004K372667L474567L303985L119617K641951L438757J459698L189106
14344A74158352K445039K602598K803681M102399L340517L576519L628818K974933
14336A99632856L741306M163638K944095L233221K749636L276215L948458L202904
$$ plain form
14392 73648348 74426947 75854067 77358109 79114721 80490369 81823918 83582187 85188059
14384 85188059 85622171 88295258 90259231 91723519 93001063 94506258 96204630 98346569
14376 98346569 99943657 102162342 103274845 105724666 107897099 110066611 111887943 113876658
14368 113876658 115507758 117925929 119672003 123062594 124277815 126770759 128893630 131157417
14360 131157417 133199756 135968979 138684251 139685546 142239698 144928924 148291237 151158004
14352 151158004 153530671 157005238 160309223 163428840 166070791 169509548 170969246 174158352
14344 174158352 176603391 179205989 182009670 186112069 189452586 193029105 196657923 199632856
14336 199632856 203374162 207537800 210481895 213715116 216464752 219740967 223689425 226892329
14328B26892329M052012K850252L671811K807579M200108N122636M917506M472623
14320B58986856K818083M238446L956292L934038M566145N286024M204831M377663
14312B92368378K218407L023722K446708L945972L663051K572897L685925L586337
14304C17511397M434252M084870M360009L380656M721510L359647M108796M326632
14296C50287769M752188J868140M039338K403238K387612L237174M551296N292007
14288C78818762L148207J922212L700968M158680M354638K750820K000523L195369
14280D04050179N001369K999518K039618J382433L133971L054195K759877K959246
14272D27380406L25176N13412M55594J001925L375502k1451j444224J480538k78857
$$ plain form
14328 226892329 230944341 233794593 237466404 240273983 244474091 249596727 254514233 258986856
14320 258986856 261804939 266043385 269999677 273933715 278499860 283785884 287990715 292368378
14312 292368378 294586785 297610507 300057215 304003187 307666238 310239135 313925060 317511397
14304 317511397 321945649 326030519 330390528 333771184 338492694 341852341 345961137 350287769
14296 350287769 355039957 356908097 360947435 363350673 365738285 368975459 373526755 378818762
14288 378818762 381966969 383889181 387590149 391748829 396103467 398854287 400854810 404050179
14280 404050179 409051548 412051066 414090684 415473117 418607088 421661283 424421160 427380406
14272 427380406 427705582 428218994 428674588 429676513 433052015 433030564 431586340 433066878 432788021
14263D32788021k74251j604896k177960k346738k496557j863972k681777j826771
14255D17515099j142323l442877o187453k833387o90130k338810k431482k049217
14247C96399420j417708k20093k224344k572444l863424m201976o697632o437693
14239C68764106o461580o745495o479324o135083o060265q888650n766777j0001981
14231C12224951o485965q247958o417830q735413r706040j0806045p183072j0350046
14223B44292582r755238q598719o832574o751433p686021q962413p121801n776083
14215A82808300p419160n481865n590884n225412o082370o466030n408383n725321
14207A35408875m209632m565422m375947m267960m186174l932139l492224l624006
$$ plain form
14263 432788021 432513770 430908874 428730914 426384176 423887619 422023647 419341870 417515099
14255 417515099 416372776 412929899 406742446 403909059 403218929 400880119 398448637 396399420
14247 396399420 394981712 394761619 392537275 389964831 386101407 381899431 375201799 368764106
14239 368764106 362302526 355557031 349077707 342942624 336882359 327993709 322226932 312224951
14231 312224951 305738986 297491028 291073198 282337785 272631745 261825700 254642628 244292582
14223 244292582 234537344 225938625 219106051 212354618 204668597 195706184 188584383 182808300
14215 182808300 175389140 169907275 164316391 159090979 153008609 146542579 141134196 135408875
14207 135408875 131199243 126633821 122257874 117989914 113803740 109871601 106379377 102755371
14199A02755371m043168l510470l169481l071941m328755k104175l307135k827133
14191G6393113l623528k973081k028148k097637k597280k771258k201619j617580
14183E6482982j412143j964660j854644k281820j335883j480000j680995j693938
14175D2778899j152001n07723p47770o37623j492530j031335j091506n69674j858957
14166C3689780L27473p56011j521547k97812j228520m73154l25858k67079p67716
14157B8379556k97083n07969k55491q99619Q5154j840314R40855o60749n50053
14148B4394287j223866r5300J1043n75972k17562j25769l18970j72765m02375
14139B1272751p59902j6880l8229j529097K69756K33400m25108r33549Q05989
$$ plain form
14199 102755371 98712203 95201733 92032252 88960311 84631556 82527381 79220246 76393113
14191 76393113 72769585 69796504 67768356 65670719 63073439 60302181 58100562 56482982
14183 56482982 55070839 53106179 51251535 48969715 47633832 46153832 44472837 42778899
14175 42778899 41626898 41119175 40371405 39733782 38241252 37209917 36118411 35548737 33689780
14166 33689780 34017253 33261242 31739695 31441883 30213363 29740209 29414351 29147272 28379556
14157 28379556 28082473 27574504 27319013 26419394 26504548 24664234 25605089 24944340 24394287
14148 24394287 23170421 23075121 23086164 22510192 22292630 22166861 21847891 21675126 21272751
14139 21272751 20512849 20495969 20457740 18928643 19198399 19431799 19006691 18073142 18879131
14130A8879131q80932j244876O52276k95520o00884j08670N34517n37831L43021
14121A6740232o22319m70837n44427n60083N43911o20774k74047L56783l19238
14112A4229201k30311J65335p43900R83376p26240n80831l65452K49786M57631
14103A3438595k73254q4960p04299L82107q82760P5183R23424j063224N66917
14094A2377729r37373J05374j43629J31085l63082j40300l87921r5328j435n10590
14084A0034530N98968j10647p09896O58514l95234J34845j281217O70433j79937
14075I420359L81986m64233k17706J04555N13803k83342l94890j47610J079417
14066I992339j696802P03462o04467k79229R68554l30339J37607L08863r51289
$$ plain form
14130 18879131 17998199 16753323 17405599 17110079 16509195 16400525 16935042 16397211 16740232
14121 16740232 16117913 15647076 15102649 14542566 15086477 14465703 14191656 14548439 14229201
14112 14229201 13998890 14164225 13420325 14403701 13677461 13096630 12731178 12980964 13438595
14103 13438595 13165341 13080381 12376082 12758189 11875429 11950612 12874036 11810812 12377729
14094 12377729 11440356 11545730 11402101 11533186 11170104 11029804 10641883 10546555 10545120 10034530
14084 10034530 10633498 10522851 9812955 10471469 10076235 10211080 8929863 9600296 9420359
14075 9420359 9802345 9338112 9120406 9224961 9738764 9455422 9060532 8912922 9992339
14066 9992339 8295537 8998999 8394532 8115303 9083857 8753518 8891125 9199988 8248699
14057H248699L3796j0378J84911n5790k54210k69633J07610R5254l46700L97342
14047H130901R82686p87243p39625j40007R41041o35002j03521J30606K73760
14038H053596J90599o84646l05475N49024j129639O88889R46607o41035l90397
14029G277523O43753p80363L01616K83073m36902M32526m09124j80388Q48716
14020G980430n15453o09300M44217J54187p1228M8481L12909l6801k98483K80492
14010G689451m02585J125638j175089O94513J5989l42255K7829l07359K04388
14001G530520n9736L99889N07284r9253l94623L92339m79771M92571l10072K80127
13991H259275N85889j49648m99650m30199K50586N92035J98697m34688n48086
$$ plain form
14057 8248699 8282495 8272117 8457028 8401238 8147028 7877395 7985005 8080259 7733559 8130901
14047 8130901 9113587 8326344 7586719 7446712 8387753 7752751 7649230 7779836 8053596
14038 8053596 8244195 7559549 7254074 7803098 6673459 7362348 8308955 7667920 7277523
14029 7277523 7921276 7140913 7442529 7725602 7288700 7721226 7312102 7131714 7980430
14020 7980430 7464977 6855677 7299894 7454081 7382853 7431334 7744243 7707442 7408959 7689451
14010 7689451 7286866 8412504 7237415 7931928 7947917 7605662 7633491 7326132 7530520
14001 7530520 7470784 7870673 8377957 8278704 7884081 8276420 7796649 8289220 7979148 8259275
13991 8259275 8845164 8695516 8195866 7765667 8016253 8608288 8806985 8372297 7824211
13982G824211N09263P42410p36801J2602J60068o19787j5714N88431p60857L77538
13972H081364o38564O23549R8944p51598L6773m77524O40101k20931j93800l10987
13962F887327l14019K75249j42986J08690m99014M25261m43560k82829k74339
13953E739780L1628k68848J8337j38417j50093l25836K80898p69121P62812o96543
13943D484597L49760k55292m4884m59339L45417j67228m77341R15279n37617l24495
13933C828857K40885J7310o3160l53463M49927m11119k48462j24700O3305j20901
13923C278479K40098J80812p63833J61022J86431L23708n08055J22597k8881K52986
13913C445364l27103m62661k60626R74841m34396m76510J170180j253045N98525
$$ plain form
13982 7824211 8333474 9075884 8339083 8351685 8511753 7891966 7876252 8464683 7703826 8081364
13972 8081364 7442800 8066349 8165293 7413695 7450468 6972944 7613045 7392114 7198314 6887327
13962 6887327 6573308 6848557 6705571 6814261 6315247 6740508 6296948 6014119 5739780
13953 5739780 5771408 5502560 5520897 5382480 5232387 4906551 5187449 4418328 5181140 4484597
13943 4484597 4834357 4579065 4534181 4074842 4420259 4253031 3775690 4690969 4153352 3828857
13933 3828857 4069742 4087052 4023892 3670429 4120356 3709237 3460775 3336075 3399380 3278479
13923 3278479 3518577 3699389 2935556 3096578 3283009 3606717 3098662 3221259 3192378 3445364
13913 3445364 3118261 2655600 2394974 3369815 2935419 2458909 3629089 2376044 2974569
13904B974569k19438L62529k4163J80315k22357P4682o44655k01003J009931o00560
13894B689850J66917k10974j12829L24890l55402k54828M0670j2944O77652m85577
13884B467425m3434M91628j021309M62624j62206K66053J19401n26648P15082
13875B768616K00430k48405l09856j33391O09238q83833o2674L19268K3814O70050
13865B953257m55631p85261N32033l46637M22688Q29k28236M69748m68745Q6296
13855B180341r845m94392L55822k18107O73228n71300O91312l91485k00252Q801
13845B024123L90866o2937J18777l27004n66510M13914m14229m46357J051873
13836B182516n59281Q00165k76226m74464J058716n84629M22520q37214L72126
$$ plain form
13904 2974569 2755131 3117660 3093497 3273812 3051455 3126137 2481482 2280479 3290410 2689850
13894 2689850 2856767 2645793 2532964 2857854 2502452 2247624 2288294 2275350 2953002 2467425
13884 2467425 2423991 2915619 1894310 2356934 2194728 2460781 2580182 2053534 2768616
13875 2768616 2969046 2720641 2410785 2277394 2886632 2002799 1940125 2259393 2283207 2953257
13865 2953257 2497626 1712365 2244398 1897761 2320449 2321278 2093042 2562790 2094045 2180341
13855 2180341 2170496 1676104 2031926 1813819 2487047 1915747 2607059 2215574 2015322 2024123
13845 2024123 2414989 2352052 2470829 2143825 1577315 1991229 1577000 1130643 2182516
13836 2182516 1623235 2423400 2147174 1672710 2731426 2146797 2569317 1732103 2104229
13827B104229l29439P59672n10632k73345n56586L69189K86554K62464m22527
13818A689579K96111l55103J01311M9142L7821k40889K92670j82408J97530p2936
13808A812828M74013o22379n34142J140495m70400j35180O747l46307O0821j26310
13798A260186J07945p5352K84539j40364l65580O72714M11409p31445J94528L54493
13788A973073o12884O718k1989L88703j83184m31503n5739N06775m20295N37717
13778A687392p90831O16235D86324J167696m80681L97551O4156L13403j5028l29286
13768A604135m48241K51146j00366K56235k44864L69091m77104j1079l96837N27031
13758A329147q3166N15645q42427m41507J221363o40676J171754r35551N72168
$$ plain form
13827 2104229 1774790 2534462 2023830 1750485 1193899 1563088 1849642 2112106 1689579
13818 1689579 1985690 1630587 1731898 1781040 1818861 1577972 1870642 1688234 1885764 1812828
13808 1812828 2286841 1664462 1130320 2270815 1800415 1665235 1671982 1325675 1386496 1260186
13798 1260186 1368131 1292779 1577318 1436954 1071374 1744088 2155497 1424052 1618580 1973073
13788 1973073 1360189 1366907 1344918 1733621 1550437 1118934 1063195 1569970 1149675 1687392
13778 1687392 896561 1512796 486324 1654020 1173339 1570890 1635046 1948449 1933421 1604135
13768 1604135 1155894 1407040 1306674 1562909 1318045 1687136 1210032 1198953 802116 1329147
13758 1329147 1245981 1761626 919199 477692 1699055 1058379 2230133 1294582 1866750
13749A866750j20829o68276l26944K54495L26814D08855R08495j09911j71269
13740A036170N64662o05092M24689M73909k83644L64120n44129m28614P57798
13731A759869p15994L03441m34519n0004k94551Q19476o03568n7671N21296k57519
13721I90256J3076k72054K48324K55302r0090K66474j86630j3090o5772k78683
13711H67113M0799O43255n56458k15378N34645L10958J42125G23090R7395L70782
13701A191267J95876m8047J41192j30271q5586j76581j24158R3613j22875j4155
13691I20275N20989l12607K08200m97337R065j90105L35360J75381j82153M45408
13681A432476m50377P0620k10026a85656E86191M0704A30658J005666j16786r5690
$$ plain form
13749 1866750 1745921 1077645 750701 1005196 1332010 408855 1317350 1207439 1036170
13740 1036170 1600832 995740 1420429 1894338 1610694 1974814 1430685 1002071 1759869
13731 1759869 1043875 1347316 912797 862793 568242 1387718 784150 726479 1247775 990256
13721 990256 1003332 731278 979602 1234904 1144814 1411288 1224658 1211568 1145796 867113
13711 867113 907912 1551167 994709 779331 1313976 1624934 1767059 723090 820485 1191267
13701 1191267 1387143 1339096 1480288 1350017 1264431 1087850 963692 1057305 934430 920275
13691 920275 1441264 1128657 1336857 839520 848585 658480 993840 1169221 987068 1432476
13681 1432476 982099 1052719 842693 -185656 586191 626895 130658 1136324 1019538 923848
13671I23848J62124m48736O89393C49406O11988k79894N18486E31756N28205P06800
13661A766761D47879L12131O17081C11209Q61240j13057m67862Q07145k41386
13652A157289J0164M1661E73818O2529K02611n4075K14635m63044o9171L45769
13642H13072O38672o65661C77673J94270M28337J70031p025m50258M48807D98610
13631A004429l41901J17953M56177C77605N78140l53048B77464O9968K76756j99859
13621D24329K22756A65474O43773J43032l01672k61459J02545K31987K67758J94406
13611A185844J27540F00986o8046A54637M22715J19924L86852O6402K11422F56143
13600A170009E68202B1813J355008n57803j16364P89039j56176D58320J22115
$$ plain form
13671 923848 1085972 637236 1326629 349406 961394 681500 1199986 531756 1059961 1766761
13661 1766761 447879 760010 1377091 311209 1172449 1059392 591530 1398675 1157289
13652 1157289 1167453 1209114 573818 636347 838958 784883 999518 536474 467303 813072
13642 813072 1451744 786083 377673 571943 1000280 1170311 1163286 713028 1161835 498610
13631 1004429 662528 780481 1236658 377605 955745 602697 277464 347432 624188 424329
13621 424329 647085 165474 809247 952279 650607 389148 491693 723680 991438 1185844
13611 1185844 1313384 600986 532940 154637 577352 697276 1084128 1150530 1361952 656143
13600 1170009 568202 21813 1376821 819018 702654 1491693 1335517 458320 580435
13591E80435j05122O24504j33268l04330L09612D33724J33148b27918D99593L57280
13581H56873O64095m96429J50933k70259N5205k46603f359F94783R54130j67795
13571A481118D09140K76054e7393I12025R1589k74924M40542B26310N20793j90905
13561E56198k2940A12977J266864C76852J37716j4617i7773l3886B53852b8485
13550H45093J05789F3170O03027C05716M3827n117M32432C43152J73536a54476
13539F44978J32481H3629Q93136k32502M9668k86958J08510A97484L59176l4203
13529E22457j90735l1573j17102K82348k4664j63244J59243o5863J039784C42141
13518E26643B16422L25007j34394M46497l86424K49689B74338N44379A57550L29707
$$ plain form
13591 580435 475313 1099817 966549 662219 971831 433724 566872 -227918 499593 856873
13581 856873 1520968 1024539 1175472 905213 960418 713815 -6359 694783 1648913 1481118
13571 1481118 409140 685194 -57393 912025 1003614 728690 1169232 226310 747103 556198
13561 556198 533258 112977 1379841 376852 514568 499951 -97773 -131659 253852 -28485
13550 845093 950882 63170 666197 305716 349543 344426 776858 343152 516688 -154476
13539 644978 777459 83629 976765 744263 793931 506973 615483 197484 556660 522457
13529 522457 331722 300149 183047 465395 440731 277487 436730 370867 1410651 342141
13518 526643 216422 541429 407035 853532 467108 716797 274338 818717 157550 487257
13508D87257p514K48579j09522L42843m60862K7858j89642M63447e576B50903
13497E98525p2131J71331L0746b0330A032339A17980J167626n24190R807m4370
13487G26853B91868Q09807m26936N77177B85002a78927A52495N9289K13443j27897
13477B97330J39317I0829N6094P09627B33013K32050j39869I1170M54831J25784
13467F71785B8825M40275A76532K74720J34311J72202A03012Q77724a68257F73189
13456D50486P3509f8995D66364o7100O39691k99112a85565C34936j10584b28670
13445G19225j77368k18469K80465k91041J64346L9048K56971m1003k25553a24968
13434A77763M0070G5337P85452o0545j61833G1380P98252D32574L81589A66122
$$ plain form
13508 487257 479743 728322 618800 961643 500781 528639 338997 802444 -5576 250903
13497 598525 526394 697725 728471 -20330 1032339 117980 1285606 761416 771223 726853
13487 726853 291868 1101675 674739 1251916 285002 -178927 152495 211784 425227 297330
13477 297330 436647 90829 146923 856550 233013 465063 325194 91170 546001 671785
13467 671785 28825 469100 176532 451252 585563 757765 103012 980736 -168257 673189
13456 450486 523995 -68995 466364 399264 1038955 739843 -185565 334936 224352 -228670
13445 719225 541857 323388 603853 312812 477158 516206 773177 732174 506621 -124968
13434 177763 217833 75337 860789 800244 638411 71380 869632 432574 814163 166122
13423C95566A32771P1539r297M0139O77815l7539A56161c20636F21708L49969
13413I71677a32532D91241K03767F3058O23253B69045M67188F6319J383870B49364
13402B50203J75388H4650J36622O53908k45719k8395a09552D54874l2408m5690
13392C76776N79534A81918F2726K08563k8839K67053k03351r9114n8316O17428
13382G66150J0953B92675b11606F28910N2990a56930B54257J45939p6109K6094
13372C50181K78602B10701J46689A33448n5101N51787B86271J90203Q0393k60408
13362B96459j04345R6389P07755m06234I2666a06180G39847B29976N12588j97735
13352E44829L57914A05891L06628c10485A96551J33078R3011K09633j25994A40114
$$ plain form
13423 395566 132771 204310 195013 235152 912967 875428 156161 -320636 621708 971677
13413 971677 -132532 491241 695008 63058 686311 269045 736233 66319 1450189 249364
13402 250203 425591 84650 221272 875180 629461 601066 -109552 454874 422466 376776
13392 376776 956310 181918 62726 271289 242450 509503 306152 207038 148722 766150
13382 766150 777103 292675 -211606 628910 681900 -156930 254257 400196 324087 350181
13372 350181 628783 210701 357390 133448 78347 630134 286271 476474 556867 296459
13362 296459 192114 288503 996258 590024 92666 -106180 739847 229976 742564 544829
13352 544829 902743 105891 412519 -310485 196551 329629 422640 632273 506279 140114
13341D03757I9763D7809N55693B6601N88416k85082Q2024L59003l76551J88232
13331E82643A43803a78775D52448M85815A09258R3257a2339D78184L67879H8421
13320I48577B85603K92899a61031H30956n5270c89974a5997I11347j96265A22259
13309C04067b7753r093B61061K27791L01582k03575G7640K88531E7789K16607
13299B74396m1304n6837f3499H37983k79935j39756a84363B08044m7651e70301
13288B1527L17262e4203D71100A41628a11139E89953e26311b9578m4033E60287
13277d2453G84401l47118B5166L81150K87821b28948C77911e55864F98816j40908
13267E57908A59879l8449L64036A09640J94259M91573B91945q6414a52599E72056
$$ plain form
13341 403757 99763 47809 603502 26601 615017 329935 411959 770962 394411 582643
13331 582643 143803 -178775 452448 938263 109258 202515 -12339 478184 846063 88421
13320 948577 285603 578502 -161031 830956 775686 -389974 -15997 911347 715082 122259
13309 304067 -27753 -36846 261061 488852 790434 586859 77640 366171 57789 274396
13299 274396 233092 176255 -63499 837983 558048 418292 -184363 208044 160393 -570301
13288 21527 338789 -54203 471100 141628 -111139 589953 -526311 -29578 -73611 560287
13277 -42453 784401 437283 25166 406316 694137 -228948 377911 -555864 698816 557908
13267 557908 159879 121430 485466 109640 303899 795472 291945 205531 -152599 572056
13256E57727k62460E6224K6459O72315D0783K28882a95529C1717M21522N0105
13246E03344k10914L98565l14362A19992J64943L20334A61783N4596i4894I04746
13235I8533L29899A5837K71858p0682q296g6986A26278K8935n5106N0140N88178
13224G38425c86927F5124L6722O29475B25194a25562C63744p6777g8374F54047
13213F57089A777b856A92753M28674a04320m35414D21529L6741a55533D1988N3333
13202I5321N58162A33805c7492G2776N140K55230f00399B53223b88166k23959
13192e12125A97728K98294a07311j05210E06612Q7233j59640g65100B61914g4896
13181F25282a73236E12620b79533E51P5149O6335J43310h3273D90901A24654M71901
$$ plain form
13256 557727 295267 56224 82683 754998 40783 269665 -195529 31717 453239 503344
13246 503344 292430 690995 376633 119992 284935 605269 161783 216379 -94894 904746
13235 98533 428432 15837 287695 217013 208717 -76986 126278 155213 100107 150247 738425
13224 738425 -386927 65124 101846 731321 225194 -125562 363744 286967 -78374 654047
13213 657089 1777 -2856 192753 621427 -104320 -539734 421529 458270 -155533 41988 95321
13202 95321 653483 133805 -37492 72776 77916 333146 -600399 253223 -288166 -512125
13192 -512125 197728 496022 -107311 -212521 506612 593845 434205 -765100 261914 -74896
13181 625282 -173236 512620 -279533 551 75700 142035 285345 -83273 490901 124654 596555
13170E96555J91795k08944F5507a79880D1961L53029a7329G3775N38957a7651
13159d85774E10704c66099H53800I0220c75311A55031N5068L44686j15258b39235
13148A94149L1761M159f63785A53258a98704F85408f5100D39777L60658n7482
13138G42953c50032a02701M7010N417B75604d18310F76307j87881c10560D93234
13127B9700L62445f0327K1352C12454J13430j68817M71254C45078K01178A28926
13116B70814c62259A55059Q92R921R4527K66856j47341j48607b91881F45869c22845
13104c20476G07431B32948K15995a45939A48798G3366K15151K33590j53034a1380
13093f18544f7090C54165E9268J76230B7010M39631k01128K97938b65781F12181
$$ plain form
13170 596555 788350 579406 65507 -179880 41961 394990 -17329 73775 612732 -17651
13159 -485774 510704 -366099 853800 90220 -375311 155031 210099 554785 439527 -239235
13148 194149 225910 230069 -663785 153258 -198704 685408 -65100 439777 800435 742953
13138 742953 -350032 -102701 -55691 -50274 275604 -418310 676307 488426 -310560 493234
13127 29700 392145 -60327 -38975 312454 425884 257067 728321 345078 546256 128926
13116 270814 -362259 155059 155951 165872 260399 527255 379914 231307 -291881 645869 -322845
13104 -320476 707431 232948 448943 -145939 148798 73366 288517 522107 369073 -11380
13093 -618544 -67090 354165 59268 235498 27010 466641 265513 563451 -265781 612181
13082E84610k40449Q3660b05861i4924K9132m37074D60885b3220H6014j3389Q97882
13071I70507A14479L18422E6621c6110A53801N08344C1290A5385K86865k5848
13061B76402D4188a18638D90678J47271j44120d30315E58890B963a07231F07826
13050D5594J07622n5322K47818b4315E43927H7471L6958J21416j8103e7745F20844
13038A121381D66894K68913k91812b26072C23831J28081B15683g77080C52489
13028D35785A37901P09445d0095H9695N99786b38261P8420F1816b4823G46442
13017A5228f9920K9022E09841I1744J7111L24584i3908D99988n3497B16422m1155
13006A75267c33983B29457c9982j03286k18425E68084A43044N94429g5215D37629
$$ plain form
13082 584610 344161 427821 -205861 -94924 -65792 -502866 460885 -23220 86014 72625 970507
13071 970507 114479 432901 56621 -36110 153801 662145 31290 15385 302250 276402
13061 276402 44188 -118638 490678 637949 493829 -430315 558890 2963 -107231 607826
13050 45594 153216 97894 345712 -24315 543927 87471 124429 245845 227742 -57745 620844
13038 1121381 466894 735807 443995 -226072 323831 451912 215683 -777080 352489
13028 435785 137901 847346 -40095 89695 689481 -238261 -159841 61816 -24823 746442
13017 15228 -69920 -40898 509841 91744 108855 433439 -93908 499988 446491 216422 175267
13006 175267 -333983 229457 -39982 -143268 -361693 568084 143044 737473 -75215 437629
12995c21170D04096a15873A89834a29027J0468E92512j91733H5636Q5833A1090
12984a91232A47930L77998c1466j77989B35915a91033B55361J42825F5406b9912
12973A41780g51948C99082A13738d62001F69000I8426J00244a61936A02710b0810
12962a54318A1360M83978B09476j3515K5704b97989A97093a74055A823M75810
12952D77633B14239o0503L21387H4119d46612A85784K54031j73426N49965a85878
12941H292N63043a16961B40697c46426A62899c55309D29209n404b3080k65476
12931b88556f7748o3722H2487N26415f28466m8729C9948K25591M4392a13733l73770
12920d87503C6700J99042c38897a60624A05850K98321j84319d5010B30945K96082
$$ plain form
12995 -321170 404096 -115873 189834 -129027 -118559 592512 400779 85636 171469 11090
12984 -191232 147930 525928 -31466 -209455 235915 -191033 255361 398186 65406 -29912
12973 141780 -751948 399082 113738 -462001 669000 98426 198670 -161936 102710 -20810
12962 -154318 11360 495338 209476 195961 221665 -297989 197093 -174055 1823 477633
12952 477633 214239 153736 475123 84119 -446612 185784 439815 266389 816354 -185878
12941 8292 571335 -116961 240697 -346426 162899 -355309 429209 423805 -23080 -288556
12931 -288556 -67748 -131470 82487 608902 -628466 -677195 39948 265539 309931 -113733 -487503
12920 -487503 36700 235742 -338897 -160624 105850 404171 219852 -45010 230945 527027
12910E27027f0028C76466J58113b11019A47043j9300J35513Q6068A24144c22993
12899G90327c33610A90832J47447e18149A04957C2057L94277j46938b54345C60655
12888c82962B49207d46610d1192j6169A91229L07462a29B45844P542b7279k0809
12877d8088A17337R7571f1059D27735e70712b1780B91096a50712E79656e4486
12866B58471d4462F14749c64502A73751p8680b69154B46689K5183j6690e87773
12855B23551l8687h7073D6321K9898K22723A39701J71263M00257d27184J04143
12845c23041R8156A95274b37116B08849b82610A075054A07484O4885d43132C2187
12834C44394a51598N2013g635H6537a40739F19347j46624J12814k17187e2728
$$ plain form
12910 527027 -60028 376466 534579 -211019 147043 127743 263256 349324 124144 -322993
12899 790327 -333610 190832 338279 -518149 104957 32057 426334 279396 -254345 360655
12888 -382962 249207 -446610 -41192 -57361 191229 498691 -129 245844 253386 -27279 -48088
12877 -48088 117337 214908 -61059 427735 -570712 -21780 291096 -150712 579656 -54486
12866 258471 -44462 614749 -364502 173751 95071 -269154 246689 271872 255182 -587773
12855 223551 184864 -87073 46321 76219 298942 139701 310964 711221 -427184 -323041
12845 -323041 -224885 195274 -237116 208849 -282610 1075054 107484 172369 -443132 32187
12834 344394 -151598 -99585 -7635 86537 -140739 619347 472723 585537 368350 -52728
12823C26016j27852o1471c604A53723C8661N11479j29784a44492p01945G7638
12812B11509b58723L5428A30770d81972f3683k202n51956b49017Q4703K8838M840
12801a30636m357H0488O8041d05096r3079A18710J69732A33431E9488L11660d45301
12789E53411j93044F1403O45207f8014D00006A84507K88974p1390a46769j72224
12779c18993M1366A12303f08354B20916g3444k28946M8602o8545D92989j69207
12769C23782a17511D75487J40252j23918a79793A52778c11237C94524a50568j41957
12759b92525j19974D07822k01472c02763g5824m95864k72786E12694b33964B05669
12748A26426f8735q4381B01218e21351I93155a86023F01744f34860K16720f3095
$$ plain form
12823 326016 198164 136693 -3604 153723 38661 550140 420356 -144492 -846437 77638
12812 211509 -258723 -223295 130770 -481972 -63683 -65885 -617841 -249017 -164314 -135476 -130636
12801 -130636 -134993 80488 148529 -405096 -498175 118710 288442 133431 59488 371148 -445301
12789 553411 360367 61403 706610 -68014 400006 184507 473481 402091 -146769 -318993
12779 -318993 -277627 112303 -608354 220916 -73444 -302390 -253788 -322333 492989 323782
12769 323782 -117511 475487 615739 491821 -179793 152778 -311237 394524 -150568 -292525
12759 -292525 -412499 407822 206350 -302763 -75824 -571688 -844474 512694 -233964 205669
12748 126426 -68735 -153116 201218 -521351 993155 -186023 601744 -634860 -418140 -63095
12737d37083c5417o882B50974L85700A35329J90171J43890B14877J70129f41323
12726a41258k54082J50194J01493p32875L06810B89866L45452A76589h7858G09555
12715I8613J53585B1250b27138d4097B93647n1819g3886q5208A7755K98394j37287
12704A78862F4271M57234c5010B15032K54733k08355c03800D92957A80791m0082
12694A40709c30734l33845B63426N49244A82213K33114M33213a07615o8440D35859
12683A94871b935D30437F945L22870J04331j68147g19664B74929b50000A11949
12672F8060L45621j11603J64706Q8326A19022R6148b89569A79919J95273g7848
12661F3250a54905B34054A3106Q11960m07167a47600j63710G81377Q2525B9171
$$ plain form
12737 -437083 -35417 -42299 250974 636674 135329 325500 469390 214877 385006 -641323
12726 -141258 -395340 -245146 -143653 -876528 -569718 289866 635318 176589 -87858 709555
12715 98613 252198 21250 -227138 -44097 293647 241828 -73886 -159094 17755 316149 178862
12704 178862 64271 521505 -35010 215032 469765 261410 -303800 492957 180791 140709
12694 140709 -330734 -664579 263426 812670 182213 415327 848540 -107615 -176055 435859
12683 194871 -2935 430437 6945 329815 434146 265999 -719664 274929 -250000 111949
12672 68060 413681 302078 466784 555110 119022 215170 -289569 179919 375192 -77848
12661 63250 -154905 234054 13106 825066 417899 -147600 -311310 781377 863902 29171
12650A05232N80495a26001E73018b64342D00268K17896h42450a16006B20184J17906
12640C38090F2415g722B40039a24608D22013j62344c05173a37344l61443B22265
12629B19472r4420c50317c7763G69161B86914K80380b09091J2467B23246M48845
12619F72091H6151a96584f9090m50613J08133a89688H8918h0102D54982J70120
12609F25102A46900m0298D3802e19434B16284J05809E4159K91697K03087a5826
12598B26135r4528L65801a05563j62505R3577D41769B15587a37651A08513K40968
12588C49481J5623e99403a84572A78789D1439e043j25976l35391E28872b74734
12577F16314k89166K51019j36728a64901B61215J93131Q02359a50668n19641h4381
$$ plain form
12650 105232 685727 -126001 573018 -264342 400268 618164 -842450 -116006 220184 338090
12640 338090 62415 -7722 240039 -124608 422013 259669 -305173 -137344 -498787 222265
12629 219472 125052 -350317 -37763 769161 286914 567294 -209091 -196624 223246 672091
12619 672091 86151 -196584 -69090 -519703 -411570 -189688 88918 -80102 454982 625102
12609 625102 146900 106602 43802 -519434 216284 322093 54159 345856 548943 -15826
12598 226135 131607 497408 -105563 -268068 -174491 441769 215587 -137651 108513 349481
12588 349481 365104 -599403 -184572 178789 41439 -5043 -131019 -466410 528872 -274734
12577 616314 327148 578167 441439 -164901 261215 454346 1256705 -150668 -670309 -84381
12566e20764J46448q5790A27587k0208b40988H60104b3447A43979c76991C98208
12555a44537D56762A55886P6567a40572E34981K11353l520A92733F6032N83057
12545F49089E6095h70815e2085q6909k09277f4223j72624A25469g48402B41825
12534A38945J126M78949c0706l29070J25484j00198F375M97170c41492g7398D8488
12522a38006L2441J4790D94841b99077B52092D2371J0957K66011q3348K19799
12512D55790g6185B11935L3393F5000a72586J7278q2911B30457a12159c6863g785
12500F9274a85931R0861c8913A41388K08508H8521c96170D16636d0517k30394
12490b70911J04343C09463A3503c60269j75831D18684E5365e49373C24621d25531
$$ plain form
12566 -520764 -374316 -460106 127587 107379 -240988 860104 -23447 143979 -376991 398208
12555 -144537 456762 155886 232453 -140572 534981 746334 742814 192733 66032 649089
12545 649089 56095 -870815 -52085 -138994 -348271 -64223 -236847 125469 -748402 241825
12534 138945 140071 619020 -30706 -359776 -234292 -334490 6375 503545 -341492 -77398 48488
12522 -138006 -105565 -90775 494841 -299077 252092 42371 53328 319339 235991 455790
12512 455790 -76185 211935 245328 65000 -172586 -155308 -238219 230457 -112159 -36863 -7785
12500 69274 -185931 -95070 -38913 141388 349896 88521 -396170 416636 -40517 -270911
12490 -270911 -166568 309463 13503 -360269 -536100 418684 55365 -549373 324621 -425531
12479c47040c1961j75753D78212d26677C98959e69307Q6584q001a81359K8175
12469a53184a6562n42542D09972Q1007B33673J02345b2785B87656K02972A99544
12458E12732j52793b70152J09286a6187j80025n2638F98090j23981e3694r2451
12448a46145K5435E20410b02104g0066j24720l75640a13949a9220k62767D51928
12437C56893F0046c4085B47716E8415a0358B94823a71025j59137D24701c87491
12426b05194j0528E4737b4573D93733d26628J76506j46884B81410a36369F95739
12415b03418j07791A77512e3902C23303n2106G1762N11868B8886a529E98380b82131
12403h6937a0805j59233B40844M35680a13324E92661G008a60967H52589b36209
$$ plain form
12479 -347040 -31961 -207714 478212 -426677 398959 -569307 -482723 -490724 -181359 -153184
12469 -153184 -16562 -559104 409972 490979 233673 336018 -22785 287656 490628 199544
12458 512732 359939 -270152 -160866 -16187 -196212 -248850 698090 574109 -53694 -146145
12448 -146145 -120710 520410 -202104 -70066 -194786 -570426 -113949 -19220 -281987 451928
12437 356893 60046 -34085 247716 58415 -10358 294823 -171025 -330162 424701 -387491
12426 -205194 -215722 54737 -24573 493733 -426628 -250122 -397006 281410 -136369 695739
12415 -203418 -311209 177512 -53902 323303 271197 71762 583630 28886 -1529 598380 -282131
12403 -86937 -10805 -170038 240844 676524 -113324 592661 7008 -160967 852589 -236209
12392A99617a04278p833B90740e90851A28763a16928A17781N8404k7657a11k73672
12381b73783l5200l01495f6394D6971f01827J20032G3783N24907B17793d43720
12370I086K48700N87499c00844O0813j14230a59629C69065Q0740b09385B93236
12359a72970L9364a815C33602a88573D53469b72962G6033a61896D5932b87811
12348e97072K25306A72767c02035C3855a90939J9726B20639O21799A06859k1631
12338H5228c23924B41363a35219p30713L44764A54526a62879O8487n27979B85977
12327A86748g24654A51568E8191b01978A54298b8208k07459g9897q9448O4880
12317a04465C01222a75848N2329C0259j4631d35597a99206H6302b48556b7469
$$ plain form
12392 199617 -104278 -112111 290740 -590851 128763 -116928 117781 176185 148528 -111 -273783
12381 -273783 -308983 -610478 -66394 46971 -601827 -481795 73783 598690 217793 -443720
12370 9086 257786 845285 -300844 -240031 -354261 -159629 369065 449805 -209385 293236
12359 -172970 -133606 -1815 333602 -188573 453469 -272962 76033 -161896 45932 -287811
12348 -597072 -371766 172767 -302035 33855 -190939 -171213 220639 842438 106859 85228
12338 85228 -323924 241363 -135219 -865932 -521168 154526 -162879 -94392 -622371 285977
12327 186748 -724654 151568 58191 -201978 154298 -28208 -235667 -79897 -169345 -104465
12317 -104465 301222 -175848 -123519 30259 15628 -435597 -199206 86302 -248556 -27469
12306C50387b71906p686j40097A51740a50323e084k42448L9879D22403L0948a50412
12294b06477B39745J93329R309g0372Q623k78412i3104l16001a66141B53007c58186
12282f6509j99153n88072B77909a7212m6570m46915F16393e54643j87622h9665
12271c1825k36994g9114F6258b10497F04192k22531h08161a3573I4303a31389
12260B2144J99508a54495G46444C0339J14716M11321b06575F79794k10401a00277
12249A67690a79693a0568I5331c2716A78444a39281A07235B738b12167B22798
12238G98008J98501C12741c54181e4579E1379K2303b18221j20195D99760A73059
12227H82714C47459A14267R8067c06332B22737j467j05701a22713B69199B2480
$$ plain form
12306 350387 -271906 -279592 -419689 151740 -150323 -5084 -247532 -207653 422403 453351 -150412
12294 -206477 239745 433074 442383 -70372 -61749 -340161 -93104 -409105 -166141 253007 -358186
12282 -66509 -265662 -853734 277909 -17212 -63782 -510697 616393 -554643 -742265 -89665
12271 -31825 -268819 -79114 66258 -210497 604192 381661 -808161 -13573 94303 -131389
12260 22144 221652 -154495 746444 30339 145055 556376 -206575 679794 469393 -100277
12249 167690 -179693 -10568 95331 -32716 178444 -139281 107235 2738 -212167 222798
12238 798008 996509 312741 -354181 -54579 51379 73682 -218221 -338416 499760 173059
12227 882714 347459 114267 212334 -306332 222737 221270 115569 -122713 269199 22480
12216b30412C14075F9251J37608M07498A89942J08060r6054K24857p5102a08477
12205b20262B32331K28535L96895h6529E6355j7974J43447C7248b44489D44175
12194E26690k20071b08556B55265E2301K93178A29327b47439L5686A5044K61576
12184B76620j08375d38950e6498B54635b8727H8367A2962J24817M47256K1618
12174F06653A02563d9418E95202D9436e67836A67727c84739m0067I64609G7658
12163B70479B997M80662B22620J35014O270J02776B10720f7111A13563e108C96380
12151d0097C89306A37463K07011N8112r2874e4193m87373B43625a01024p30080
12141h31104D30120c56898I7412L03233a71178k4390B4493c88495C2838J990J74037
$$ plain form
12216 -230412 314075 69251 206859 614357 189942 298002 201948 426805 351703 -108477
12205 -220262 232331 460866 857761 -86529 56355 38381 181828 37248 -244489 444175
12194 526690 306619 -208556 255265 52301 345479 129327 -247439 -211753 15044 276620
12184 276620 168245 -438950 -56498 254635 -28727 88367 12962 137779 585035 606653
12174 606653 102563 -49418 595202 49436 -567836 167727 -384739 -424806 964609 77658
12163 270479 2997 483659 222620 357634 363904 466680 210720 -67111 113563 -5108 396380
12151 -40097 389306 137463 344474 402586 309712 -54193 -541566 243625 -101024 -831104
12141 -831104 430120 -356898 97412 400645 -171178 -195568 24493 -388495 32838 34828 208865
12130B08865G20J38606D6316b52731D73421k23949N164G4908O0959e1064C63257
12118c33623b6687k76166G27985k45014d81409K02529k0849a14187M7516C66047
12107b51292C63859N5300a24559H30651A07719d42331R1193D1191a67859F3836
12096C30559J21470A76420N2684H8125J85461a420A04925b84010n63654c03746
12085a4079l6740E01974j95637a08596A07842c4922A66599a35018B1840M24431
12075D46271C5878a90526p4369n4028D448a9123G03358e3146A43894h5432G28289
12063C15844f2612G0188J35766f59667j4010H04048e97740b66744J12380B39000
12052B20882e33341i9501A48585f53133B26955N979O36103a92839b246G0262P3124
$$ plain form
12130 208865 720 139326 46316 -252731 473421 249472 254636 74908 135867 -51064 363257
12118 -333623 -26687 -302853 727985 482971 -481409 -278880 -299729 -114187 -66671 366047
12107 -251292 363859 419159 -124559 830651 107719 -442331 -351138 41191 -167859 63836
12096 330559 452029 176420 229104 88125 273586 -1420 104925 -284010 -847664 -303746
12085 -14079 -50819 501974 306337 -108596 107842 -34922 166599 -135018 21840 446271
12075 446271 35878 -190526 -264895 -318923 4448 -19123 703358 -53146 143894 -85432 728289
12063 315844 -62612 70188 205954 -659667 -673677 804048 -597740 -266744 -154364 239000
12052 220882 -533341 -99501 148585 -653133 226955 232934 869037 -192839 -2246 70262 143386
12041A43386o2760L62856A54352c4850m5603D26566a38954l52565e088k5687k48762
12030b79537A90377c55772E9604f8616A33697J40865p9147e87476a51624k24035
12020c75659E63478A54156d3503k45704L0803C24221b15597j24656F46275a75803
12009A07200L5395f07934a90195q2826C17322A46914P6261G5346J46537d48671
11998e86765J64597G5363L04418a71668p19875a39370j62702D0549J54680b9984
11987D4718c07332A31923a80646k77197d224C1501J86026h0482m63513b4072E47286
11975g06564B43320J44996b23943B55340J71702b67361Q0995b3632D94678g07256
11964A23712c15597j33404a01471B84692e0954J2631B64859e85909K26886J16269
$$ plain form
12041 143386 80626 443482 154352 -34850 -80453 426566 -138954 -491519 -5088 -30775 -279537
12030 -279537 190377 -355772 59604 -68616 133697 274562 195415 -587476 -151624 -375659
12020 -375659 563478 154156 -43503 -289207 -258404 324221 -215597 -340253 646275 -175803
12009 107200 142595 -607934 -190195 -273021 317322 146914 223175 75346 221883 -448671
11998 -586765 -422168 75363 379781 -171668 -891543 -139370 -302072 40549 195229 -29984
11987 44718 -307332 131923 -180646 -457843 -4224 31501 217527 -80482 -543995 -24072 547286
11975 -706564 243320 388316 -223943 255340 427042 -267361 -186366 -23632 494678 -707256
11964 123712 -315597 -449001 -101471 284692 -50954 -38323 264859 -585909 -359023 -242754
11954b42754n2761k71977D10577A29131a96829e0938a7054D45035e39882D05705
11943D17347c87822j33443a92408o194i8581j4990B75833e5601A95439Q9428b98517
11931E24724a75905F1926a32898A65847J99142J26562b25313B61958M7451g37545
11920E81671A76902m3749d73388A10142e230F7811N21769d7023k35231B75066
11909b4638A62496d49725K10916C43923g45906c58318J55521o4205J25757j39171
11899b80416B75804b7569n46456H1458c69416G50899d88355J6933G1767b86421
11888a60997k56745Q9588b7411F23980j13019d05850J30564B09354l2453a19776
11877D10187A10293p803a094965B91577c959D29049r4668c56248i0506j82461
$$ plain form
11954 -242754 -295515 -567492 410577 129131 -196829 -50938 -17054 445035 -539882 405705
11943 417347 -387822 -521265 -192408 -198602 -98581 -113571 275833 -55601 195439 284867 -298517
11931 524724 -175905 61926 -132898 165847 364989 491551 -225313 261958 309409 -737545
11920 581671 176902 133153 -473388 110142 -5230 67811 589580 -47023 -282254 275066
11909 -24638 162496 -449725 -238809 343923 -745906 -358318 -202797 -267002 -141245 -280416
11899 -280416 275804 -27569 -574025 81458 -369416 750899 -488355 -471422 71767 -286421
11888 -160997 -417742 -328154 -27411 623980 510961 -405850 -275286 209354 176901 -119776
11877 410187 110293 102490 -1094965 291577 -3959 429049 334381 -356248 -90506 -272967
11867b72967C03235J20488K59337B49545C7452c86676a21593j34002B94270a39990
11856b37311p4956a19450e6571o9959B25002o6973d46099A20536b27760B92921
11845B55379b57369F4311J47091p7175b30508k24239C32341A13816K70410f6537
11834b32697D31708b48088B4991J30121Q8113d86093D51578c74838J70012l14961
11824e19787a81670A17781c26609c6103A89069D0621g4256l50777a21974p63463
11814h85437H7918K78163d04457C9732J13766C0946b2413j49970l6772r6229m0415
11803c45799f359A18444h5287r6683p7197A13416J26764e54152Q7310b03939L0900
11792a73039B99113g2149n3857l98151F7852R5032c21180a19926C92226G5874
$$ plain form
11867 -272967 303235 423723 683060 249545 37452 -386676 -121593 -255595 294270 -139990
11856 -237311 -312267 -119450 -56571 -126530 225002 158029 -446099 120536 -227760 292921
11845 255379 -257369 64311 211402 134227 -230508 -454747 332341 113816 384226 -66537
11834 -232697 431708 -248088 24991 155112 243225 -486093 451578 -374838 -204826 -519787
11824 -519787 -181670 117781 -326609 -36103 189069 40621 -74256 -425033 -121974 -885437
11814 -885437 87918 366081 -404457 39732 153498 30946 -22413 -172383 -209155 -305384 -345799
11803 -345799 -6359 118444 -85287 -181970 -259167 113416 240180 -554152 -466842 -203939 -173039
11792 -173039 299113 -72149 -126006 -524157 67852 162884 -321180 -119926 392226 75874
11781F05191C01255J86868b00227B04779j6475i3492K676q3596l09833C05810
11770g83109B29273a85640F9190J23433a69293B35043f33399A42494K8845b98623
11759A87258b72418c4629n04988J48449a9274n16790i4881A06426O6227b90178
11748c96202C0863b59911O7752j42989o9716l92080a81407p51753D49635f0651
11737A18675e19439n5013C85723b42805J2553b2243l82269D74657k08980c98705
11726a63603B11508G3476a92080A65926R162b03247h0856E21011g4321k44223
11716c18544f5300a9884D52858n9750d4185A21567c88338a40440E62742b2251
11705A75711c470l63379j2593C9839A9767f33269j17467a54337R367k19848k14398
$$ plain form
11781 605191 301255 488123 -200227 204779 188304 -93492 -90816 -174412 -484245 305810
11770 -783109 229273 -185640 69190 192623 -169293 235043 -633399 142494 171339 -298623
11759 187258 -272418 -34629 -539617 -391168 -19274 -536064 -94881 106426 172653 -290178
11748 -396202 30863 -259911 -192159 -335148 -404864 -796944 -181407 -933160 449635 -60651
11737 118675 -519439 -574452 385723 -242805 -230252 -22243 -404512 474657 265677 -398705
11726 -163603 211508 73476 -192080 165926 175088 -203247 -80856 521011 -74321 -318544
11716 -318544 -65300 -19884 452858 393108 -44185 121567 -388338 -140440 562742 -22251
11705 175711 -3470 -366849 -379442 39839 19767 -633269 -750736 -154337 -144970 -364818 -579216
11694e79216C20196d22387J60146D25094N10348m36458i9981D66946a48848O5606
11684h3242C64672J5711f1056A35281o2182g1431E6616R7691m2885b01772A7469
11672d27159F5869H174i0048o06195c7873j00789N4322A57671c19540k20252a01194
11660a39704d6254m55678A17589C0615b69352B96070A10015O6644D944J08954
11650A13898b36691k4390J26695j52755M7559D6707h5230C0293b30668G8011a83454
11638a59735k43899D80242I09e65258A70605a2934C09340J65950B03907e60021
11627g0748D3503i37911E16633a22890m6634H502i85891b17186C33858h9682J438
11616h8244j08912A4380b09937k41541A20741C1343J200b19631N7354f1071A0477
$$ plain form
11694 -579216 320196 -422387 -262241 425094 935442 498984 -99981 466946 -148848 -83242
11684 -83242 364672 380383 -61056 135281 73099 -71431 56616 154307 111422 -201772 17469
11672 -427159 65869 8174 -90048 -696243 -37873 -138662 -84340 157671 -319540 -539792 -101194
11660 -139704 -46254 -501932 117589 30615 -269352 296070 110015 176659 4944 113898
11650 113898 -236691 -261081 -134386 -287141 -239582 46707 -85230 30293 -230668 78011 -183454
11638 -159735 -403634 480242 909 -565258 170605 -12934 309340 475290 203907 -560021
11627 -70748 43503 -937911 516633 -122890 -169524 8502 -985891 -217186 333858 -89682 -88244
11616 -88244 -197156 14380 -209937 -451478 120741 31343 32543 -219631 -162277 -61071 10477
11604C40472j36344d43079A32082a14736k60905a38474B647h0919k20623C1233
11593D82110b26114C5072K56985n7835a1461E63251b53597A84405K16856a56615
11582A123084e2798p11527D14674a9096F0158a28855F0667b03820j22994G39983
11571E05852p5977a1891n18259a69975C93521G8378a68813A30171N0838N2900
11561B33909a06033B12284b28423k39458E8400K05923D9522J52713J30286j13530
11551B18991l7938L28553c76443G1844j3948A2753g72186b78528C8396L56230
11541C94626A13139O95626A79246F9506N5480C9699h323j85436B65347B4209L11889
11530C36098l5922a36069k36602E73588k85421b46676P3078o39946A19578O1978
$$ plain form
11604 340472 204128 -443079 132082 -114736 -375641 -138474 2647 -80919 -301542 31233
11593 482110 -226114 35072 292057 234222 -11461 563251 -253597 184405 401261 -156615
11582 1123084 -52798 -764325 414674 -19096 60158 -128855 60667 -203820 -326814 739983
11571 505852 429875 -11891 -530150 -169975 393521 78378 -168813 130171 181009 233909
11561 233909 -106033 212284 -228423 -467881 58400 264323 49522 202235 332521 218991
11551 218991 181053 509606 -376443 71844 57896 12753 -772186 -278528 38396 394626
11541 394626 113139 808765 179246 69506 124986 39699 -8323 -193759 265347 24209 336098
11530 336098 300176 -136069 -372671 573588 288167 -246676 -173598 -813544 119578 181556
11520A81556k8243b23156j03305n1226B31396e4724D36190d53983K10506k59314
11510e02791N5959i4035A10554L3601C415K1969J9118L03552j46245a14788j5027
11499a29815C52247b13765k84214B9356R64727a0984q1831p8781C6579M72885
11489E09464A58837b98594j44806r655D60802j74660c59437C19979b0923L038
11479a7885C24372k1209K58072A95894C4365K41850f86798J41008E14010A55353
11468b39799o2991A70808J91459g10652K94538A13187h2612j82475G1247f40915
11457a22054E29696c46760d0646D34632H017h272C31740J75091E0818N580R091
11446F5489L46676f2249A27881K04496q1560p2742R7558c76528L2719j8163d9878
$$ plain form
11520 181556 153313 -223156 -326461 -377687 231396 -54724 436190 -453983 -243477 -502791
11510 -502791 -446832 -94035 110554 144155 3415 25384 44502 348054 201809 -114788 -129815
11499 -129815 352247 -213765 -497979 29356 994083 -10984 -92815 -171596 36579 509464
11489 509464 158837 -298594 -443400 -453055 460802 286142 -359437 319979 -20923 -17885
11479 -17885 324372 303163 561235 195894 34365 276215 -686798 -545790 514010 155353
11468 -239799 -302790 170808 362267 -710652 -416114 113187 -82612 -265087 71247 -640915
11457 -122054 529696 -346760 -40646 434632 8017 -8272 331740 506831 50818 56398 65489
11446 65489 412165 -62249 127881 332377 250817 178075 275633 -376528 -343809 -361972 -49878
11434b72752j36385N1311j33825a8548E90916b83546E8829e0170n17253b59045
11423A71694J01785K90836B9278L00532a13801l14245a43006A08031j1616a64076
11412b40682F54190k01548e07783B73832b25082n1985C54104j08130G2436R8618
11402A71054F6915M09800A97602a2630D67308d15070e9427k989j14167F71388
11391D3673c88202G338K47713O2681a75759B91506f78045a41469I31224C12403
11380A33692h51275J11627L60137B91015e05647f8331j91348o791O2986N7178
11370a46306j79552B49604N3287f66510K51139E13255k24329q2890M94509l26614
11360C73931b19831c3950n66151a49847j98940E9681a63305j80531A48311a84142
$$ plain form
11434 -272752 -409137 -357826 -491651 -18548 590916 -283546 58829 -50170 -567423 -259045
11423 171694 273479 564315 29278 329810 -113801 -428046 -143006 108031 96415 -164076
11412 -240682 654190 452642 -507783 273832 -225082 -277067 354104 245974 72436 171054
11402 171054 66915 476715 197602 -12630 467308 -415070 -59427 -62416 -176583 671388
11391 43673 -388202 7338 255051 317732 -175759 291506 -678045 -141469 931224 312403
11380 133692 -851275 -739648 -379511 291015 -505647 -68331 -259679 -266470 -203484 -146306
11370 -146306 -325858 249604 302891 -666510 -415371 513255 288926 206036 700545 373931
11360 373931 -219831 -33950 -600101 -149847 -348787 59681 -163305 -343836 148311 -184142
11349a97283N7603m96562J03463E34549A0086L59115K5198J77884m1596A93353
11338e80936F2675K32595I4282L12095A82490d86756f0340A12481d08778e2828
11327h05557c75229e7928j56823I2295J36459e10156O5380B70111c17720N0396
11317b67324C80216K26000k9726a89706k09481j8128B39582M23527a38155j67437
11307c05592C24955K01329B37787i2254k1009o48934G1293J08638O7085c08574
11296B36479i9019r5957L1970k2052P7315D19616f41615M5724b9446B07339J8149
11285B25488d76505a08115r03138A45829h60134L35080D43455f51839a09933r9840
11275b09773C9124a97323B73859f04764A12738L16645A27749K04182a40278B82646
$$ plain form
11349 -197283 -139680 -636242 -532779 534549 10086 369201 394399 572283 530687 193353
11338 -580936 62675 295270 94282 406377 182490 -486756 -60340 112481 -408778 -52828
11327 -805557 -375229 -57928 -214751 92295 228754 -510156 -444776 270111 -317720 -267324
11317 -267324 380216 606216 576490 -189706 -399187 -417315 239582 663109 -138155 -305592
11307 -305592 324955 526284 237787 -92254 -113263 -762197 71293 179931 247016 -308574
11296 236479 -99019 -194976 -163006 -185058 -107743 419616 -641615 -595891 -29446 207339 225488
11285 225488 -476505 -108115 -1011253 145829 -860134 -525054 443455 -651839 -109933 -209773
11275 -209773 39124 -197323 273859 -604764 112738 429383 127749 331931 -140278 282646
11264c7141E9665J86296K75606c3017p69245Q0139O8756A81349a65075j47278
11254c12353c3866k33944j52430E13487b6043j71231g1304B37055J72772h087
11243c15756J4685g6836o74785a59260q75280G50313l38199c3113e720G79780
11232c09808n99158D45028B19228b98386Q4263G70208a51932B19592b10801A60593
11221b09650j82302J47746F2938K46412j35760f54184K11755b0833m61516C16215
11210E91216B17774R4736J77621e1399E71073I1552k6431M9275d74805a22810
11199a93629F36L8868J07765b47023N8722A60944a87698E97282k08600e40496
11188a43308C27611f2463k56075A2888d2289F0230d29234B89803a19284A91047
$$ plain form
11264 -37141 59665 245961 521567 -33017 -802262 -722123 -653367 181349 -165075 -312353
11254 -312353 -33866 -267810 -420240 513487 -26043 -197274 -71304 237055 409827 -8087
11243 -315756 -301071 -76836 -751621 -159260 -1034540 750313 412114 -33113 -5720 779780
11232 -309808 -908966 445028 219228 -298386 -214123 770208 -151932 219592 -210801 160593
11221 -209650 -391952 -244206 62938 309350 173590 -654184 -442429 -20833 -482349 316215
11210 591216 217774 312510 490131 -51399 571073 91552 65121 114396 -474805 -122810
11199 -193629 636 39504 147269 -247023 -188301 160944 -187698 597282 388682 -540496
11188 -143308 327611 -62463 -318538 12888 -42289 60230 -429234 289803 -119284 191047
11177e01117E14768j53017L5647a08311F03835b01168k5417J04298C64451e04237
11166A67594b60017c7513o0906I2113a92796j71285B92496a85107Q3795p4563
11156a75875N4603C15466b34309J05675d4194B99493d24178R1742O1242B17493
11145e01741I4376a69230j44269F6996c12373l59091A83295J98340A31844I061
11134e25193B13246e2322C2563b5785A52519b86657A12641O14122L63631I5174
11123B24958P14559f2526C79623J9862H9441K45587j04855L88656K49367c18013
11112E24823k3152c11520I3764K15444n1242o1900K87964m356L2005j67781f66172
11100F89055F4838K12526K37264L75893m24719J98556J31815P1950j63756C27290
$$ plain form
11177 -501117 514768 361751 397398 -108311 603835 -201168 -226585 -122287 364451 -504237
11166 167594 -260017 -37513 -98419 92113 -192796 -364081 292496 -185107 -101312 -175875
11156 -175875 -121272 315466 -234309 -128634 -44194 299493 -424178 -332436 -271194 217493
11145 -501741 94376 -169230 -313499 66996 -312373 -671464 183295 381635 131844 9061
11134 -525193 213246 -52322 32563 -25785 152519 -286657 112641 726763 1090394 95174
11123 224958 939517 -62526 379623 399485 89441 335028 230173 618829 868196 -318013
11112 524823 501671 -311520 93764 309208 257966 196066 484030 479674 511679 343898 -666172
11100 689055 64838 277364 514628 890521 465802 664358 796173 868123 704367 327290
11089C05561K69391E1757Q90654d27033G21301j83011O9664j006P76641a05910
11078g514C28805j39622P17861B06367Q89553p9261C50367K65158A60782a80242
11067F94269J90157I8947J580698B47382J60758L83238k72966O28897C11127c44557
11056G51009k27212A86893K44727O7406K52095C43184L94285C32757k1433L55896
11046F67220O3278L52548D61948P08080n66553k07111K05551N33745m5304J63003
11036A253359E49603j90823K57278B93935N63736L41627q8075m35821M57888J34483
11026A267773k43289j93354l27685L78903J44814j80550O64155o15640l44923
11017E50204N48808p5188L11688j57039j1094j45171j72646B24830Q38224L44472
$$ plain form
11089 305561 574952 51757 942411 -427033 721301 538290 607954 606948 1383589 -105910
11078 -7514 328805 189183 907044 206367 1095920 1016659 350367 615525 160782 -180242
11067 694269 884426 98947 1679645 247382 408140 791378 518412 1147309 311127 -344557
11056 751009 523797 186893 431620 499026 751121 343184 737469 332757 311324 667220
11046 667220 730498 1083046 461948 1170028 603475 396364 601915 1135660 1090356 1253359
11036 1253359 549603 358780 616058 293935 857671 1199298 1111223 675402 1133290 1267773
11026 1267773 1024484 831130 503445 882348 1027162 846612 1510767 895127 550204
11017 550204 1099012 1023824 1335512 1178473 1167379 1022208 849562 224830 1063054 1407526
11007A407526p0691m96908K533O06212n19892m12270P29335l80658K63869J8624
10997A147680k39946K06168K52725F54490L58739l16938l2617R04704F24165N09752
10987A133917J73176K0984k97656L41552N42862q04357P58889E99786J351404
10978A951190p31141n38744N37960k66517O88317o34522N68493M9622m38311l34522
10968H51825P29637n4914L602K19260l6966F89297L81045j57686A99507O93984
10958H93491R07829G07198J1671M47114R9528C94265L78696K90319k28739K10827
10948A045368L07714F71813j86179M74075Q5133l54865j28668m9505j48744P13279
10938A076339m34812j62686O2554A27616M9572o79K67807j31732J42493J36044
$$ plain form
11007 1407526 1336835 839927 842460 1448672 928780 516510 1245845 865187 1129056 1147680
10997 1147680 907734 1113902 1366627 654490 1013229 696291 663674 1568378 624165 1133917
10987 1133917 1307093 1328077 1030421 1371973 1914835 1110478 1869367 599786 1951190
10978 1951190 1220049 681305 1219265 952748 1641065 1006543 1575036 1624658 1186347 851825
10968 851825 1581462 1526548 1530150 1749410 1712444 689297 1070342 912656 199507 893491
10958 893491 1801320 707198 718869 1165983 1265511 394265 772961 1063280 834541 1045368
10948 1045368 1353082 671813 485634 959709 1044842 689977 561309 511804 363060 1076339
10938 1076339 641527 478841 541395 127616 177188 176509 444316 312584 455077 591121
10928E91121m0095c58220G35725a85408E19150J42865B06347J29058a60453E2234
10917C68096A51960A5047O59192A14288L4208f0472C99000A31181J05452c99329
10906H62345g27812A52392L36339b56455B12731P96462A78536b56540P003B20346
10895c65093C10624F6611c68618c300C97342A2290c15946G9697c79213a17061
10884e82176c0290E36911B46516J47099B5396h5013n02171P6066A33486L18715
10874D52201F2998a362H51452g23545A83673C4404a08243B7869a65301G34609
10863C02333d29996d2622A96924d02474B72354f6699m33060k59604K96779i924
10852C3715d07143a79605k79241A70979b87940A52845l2955c61330J51824j48260
$$ plain form
10928 591121 551026 -358220 735725 -185408 519150 662015 206347 335405 -160453 52234
10917 368096 151960 15047 674239 114288 148496 -60472 399000 131181 236633 -399329
10906 862345 -727812 152392 488731 -256455 212731 1009193 178536 -256540 -249537 220346
10895 -365093 310624 66611 -368618 -3300 397342 12290 -315946 79697 -379213 -117061
10884 -582176 -30290 536911 246516 393615 25396 -85013 -587184 -511118 133486 452201
10874 452201 62998 -1362 851452 -723545 183673 34404 -108243 27869 -165301 734609
10863 302333 -429996 -42622 196924 -402474 272354 -66699 -499759 -759363 -462584 -9924
10852 33715 -407143 -179605 -458846 170979 -287940 152845 119890 -361330 -209506 -357766
10842c57766B53231D9256a140520B14017G4841d29623L445D23510b9286B5452
10831A04435K00782B4873a90530n33115A8839L22754c10128R2572n0206A28236
10820b64406A67278a63840C57107n6568L65295c4139A09317K87845a47378D06033
10809B05056a25774K8858k17601C10723N20486C16962b32841L6652A7036f11676
10798d64655a28497B33767M44260b08794k18627C90294a71641o6101q3192d3877
10787e1140m8130j66504j51309l0503D41962j54435a34523A42740C2437L18409
10777C50846C004P00221A17095L2781B2165b35417E5662e69369B1198b45944F71394
10765B02557i47192L49195A09401d66405B41910h12105b62439e8971j32812j51686
$$ plain form
10842 -357766 253231 49256 -1140520 214017 74841 -429623 -426178 423510 -29286 25452
10831 104435 305217 24873 -190530 -723645 18839 341593 -310128 -217556 -267762 128236
10820 -264406 167278 -163840 357107 300539 665834 -34139 109317 397162 -147378 406033
10809 205056 -125774 -96916 -314517 310723 831209 316962 -232841 -196189 17036 -611676
10798 -464655 -128497 233767 678027 -208794 -427421 390294 -171641 -237742 -320934 -43877
10787 -51140 -99270 -265774 -417083 -447586 441962 287527 -134523 142740 32437 350846
10777 350846 3004 703225 117095 149876 22165 -235417 55662 -569369 21198 -245944 671394
10765 202557 -947192 -597997 109401 -466405 241910 -812105 -262439 -58971 -191783 -343469
10755c43469J46721K8948k24256A11140a85959j74955N0185J03925l4024H8262
10744C3381N6207O0879e60220K61682B28878J01382L56874c5500J0475G5344h85652
10732c6329l48844q8015C31789a33761A52951b14222c7225C2618b13320c0797
10721I2907g14336c3692k75158H6686c16660K7310B94436b0865E60880A44017
10710b24068B07913C2803d72802F10337d89299J7202J43798O0417m12133g5532
10699E65472e75852a40059m01014d2221L172f585l76757A43973d7992C79326B4200
10687C1407J8245d98184A00874L08162c54063E47384D8299P575a86050j61034
10677c47084j3671J11479j46049C60454f47900a0675n19525J65240i9529l55609
$$ plain form
10755 -343469 -196748 -167800 -392056 111140 -185959 -360914 -310729 -206804 -240828 88262
10744 33381 89588 150467 -560220 -298538 228878 330260 687134 -35500 -25025 75344 -885652
10732 -36329 -385173 -473188 331789 -133761 152951 -214222 -37225 32618 -213320 -30797
10721 92907 -714336 -33692 -308850 86686 -316660 -289350 294436 -20865 560880 144017
10710 -224068 207913 32803 -472802 610337 -489299 -472097 -328299 -267882 -680015 -75532
10699 565472 -575852 -140059 -541073 -42221 -39049 -6585 -383342 143973 -47992 379326 24200
10687 31407 49652 -498184 100874 409036 -354063 547384 48299 55874 -186050 -347084
10677 -347084 -360755 -249276 -395325 360454 -647900 -10675 -530200 -364960 -99529 -455138
10667d55138a17027j89962A49305h40739c16256l09881C32772d82131j03095C0459
10656a51159q9653B15112N2811h25162c48865C93113a49656c6590l38845R9733
10646b75702j7446J39784j169A37842n8755b51492C80413A29665m2960j3235L46724
10635D20194j85224g84733c13621a17248j21152B61836c62355A02913c19788l47198
10625f66986b16174E93498b10509J7036k43749D60763g23936c07118q2626a38346
10614G60238a01266k79720D04614I7462J70556a3999B19850e26744e8408m70135
10604e28543G4191k8196A6283d98815i9716B94175L42494b0033n40251a30593
10593b42183j70605b02592D39829b47412D73974a25027e5372C4585e43072H7219
$$ plain form
10667 -455138 -117027 -306989 149305 -840739 -316256 -626137 332772 -482131 -585226 30459
10656 -151159 -240812 215112 267923 -825162 -348865 393113 -149656 -36590 -375435 -275702
10646 -275702 -293148 -153364 -154533 137842 79087 -251492 380413 129665 86705 73470 420194
10635 420194 234970 -784733 -313621 -117248 -238400 261836 -362355 102913 -319788 -666986
10625 -666986 -216174 593498 -210509 -193473 -437222 460763 -723936 -307118 -389744 -138346
10614 760238 -101266 -380986 404614 97462 268018 -13999 219850 -526744 -58408 -528543
10604 -528543 74191 45995 16283 -498815 -99716 294175 636669 -20033 -560284 -130593
10593 -242183 -412788 -202592 439829 -247412 473974 -125027 -55372 34585 -543072 87219
10582f51183O7892j75644a97893l72399A6916i4085F82M52405H8959L1468a1822
10570a29862a7279m5501C83184G5169g7180B28918Q9892e41789n4507J23657G0430
10558b72313h2690j75346E00248a38016o69658K71011d9A43690B5703a84694D30650
10546F0161J37062n6194c09733C2458h36596A95845a08789n79999A23804c01081
10535h00693L34730J06064G15474b86675f9408A82000c00336B76036j26567a42673
10524c4839l32891I7211Q8468B206b73879C0812K21990K50157A75817c99853O1193
10513c38660C07722J29821a66050j92539O0205N8093l44989K01603A96931k9889
10503A67042b32241m15649d205D35514d57669b08414k12980g232E40231F4077
$$ plain form
10582 -651183 -583291 -758935 -197893 -570292 16916 -94085 682 453087 88959 120427 -11822
10570 -129862 -17279 -62780 383184 75169 -77180 228918 318810 -541789 -596296 -472639 70430
10558 -272313 -82690 -258036 500248 -138016 -807674 -536663 -49 143690 25703 -184694 430650
10546 60161 197223 141029 -309733 32458 -836596 195845 -108789 -688788 123804 -301081
10535 -800693 -465963 -359899 715474 -286675 -69408 182000 -300336 276036 149469 -142673
10524 -34839 -367730 97211 185679 2206 -273879 30812 252802 502959 175817 -399853 -338660
10513 -338660 307722 437543 -166050 -358589 -298384 -240291 -585280 -383677 196931 167042
10503 167042 -232241 -647890 -4205 435514 -457669 -208414 -421394 -7232 540231 64077
10492b9860j85124G0162L05473I6156O18148b87509j09522k34195P7460A8680
10481b07388a6818B34755i3717j19293k91068D33853K10321B20863b44297a20925
10470H18572F0164c49803a66936E62537k20842a78906A291441e31675G88186D7306
10459d79556a80131B51280a41096A70791k2575J31245a49785p29586a58352m98861
10449f57213b30895D38782A00934g4504o7575d7949n50921A42168E0822O433c10331
10437E07047a52501o5091A00664g9917A88739d17754A98105c59868R3852j14873
10427c80889e3056A87096p7010Q174J113a06158l64900D47141b26530k77503B66397
10415f3834M886J8461C96564j4851e97720F30415I6601J75804b3990D74292c39269
$$ plain form
10492 -29860 -214984 70162 375635 96156 714304 -287509 -397031 -631226 -553766 18680
10481 -207388 -16818 234755 -93717 -213010 -504078 433853 644174 220863 -244297 -120925
10470 818572 60164 -349803 -166936 562537 341695 -178906 1291441 -531675 788186 47306
10459 -479556 -180131 251280 -141096 170791 148216 279461 -149785 -879371 -158352 -657213
10449 -657213 -230895 438782 100934 -74504 -142079 -47949 -598870 142168 50822 57255 -310331
10437 507047 -152501 -217592 100664 -79917 188739 -417754 198105 -359868 -266016 -380889
10427 -380889 -53056 187096 110086 118260 119373 -106158 -471058 447141 -226530 -504033 266397
10415 -63834 -58948 -40487 396564 381713 -597720 630415 96601 272405 -23990 474292 -339269
10403A81395d46745A28790R48792g70A047311D71547d62137B14541E1780c29962
10392b8842C7087K62227g615A48287a88176B00906c37481D73191k11835D4489
10381b21686O8536m33625G7302c2675A1185K28548A7704L91633p5636M81319a87338
10369C33322c45018k73731B966M62432q0820j80013N7942B6673K27433e19299
10358B63035R71591H2110J26683K39752j90295k3686i99717C57961a77321J6314
10348a61007B18835c62269b6461H23420D9242L26031C0848d81627C16398N26020
10338H42418e33096C06564b1905k59367M3264P7880B52186L52542A24666c70138
10327e56252A84314O4507A7661a25423A46510g0312D82936O2400b37376B7319
$$ plain form
10403 181395 -446745 128790 1077582 -770 1047311 471547 -462137 214541 51780 -329962
10392 -28842 37087 299314 -7615 148287 -188176 200906 -337481 473191 261356 44489
10381 -221686 -153150 -586775 77302 -32675 11185 239733 17704 409337 333701 815020 -187338
10369 333322 -345018 -618749 2966 465398 384578 204565 262507 26673 254106 -519299
10358 263035 1234626 82110 208793 448545 258250 234564 -999717 357961 -177321 -161007
10348 -161007 218835 -362269 -26461 823420 49242 375273 30848 -481627 316398 842418
10338 842418 -533096 306564 -21905 -281272 -238008 -160128 252186 604728 124666 -370138
10327 -556252 184314 248821 17661 -125423 146510 -70312 482936 545336 -237376 27319
10316c29339A049971f82890D07426j1671J43746A95838J15175J89813a01769D48439
10305a29060b6896n5270l43624B98041a37587l32614o351o2647G22498f7395G857
10293c04447C02264d77404C66672F2412M52253k14696p5615K38444d5696p32808
10283g78504E9047L36548b16517E53742b93374e5193C37366b19865Q0981N5617
10273h3267I0614d56560a47009e5303D06131b5866A97809e49251N380A05343a06053
10261a81795B71169d7256o50674H8165f94940C47948G6306e70179C9383f7130
10250b02355Q7959C94001d61319I6233f6112C61931P207c68497j31542A40057
10239b59600j42562J79762A52932J19492c12129k69459F4811c78065c6800q23001
$$ plain form
10316 -329339 1049971 -682890 407426 395755 539501 195838 311013 500826 -101769 448439
10305 -129060 -26896 -82166 -425790 298041 -137587 -470201 -476552 -539199 722498 -67395 7857
10293 -304447 302264 -477404 366672 62412 514665 299969 224354 462798 -45696 -778504
10283 -778504 59047 395595 -216517 553742 -293374 -55193 337366 -219865 -138884 -83267
10273 -83267 90614 -456560 -147009 -55303 406131 -25866 197809 -549251 -543871 105343 -106053
10261 -181795 271169 -47256 -697930 88165 -694940 347948 76306 -570179 39383 -67130
10250 -202355 -114396 394001 -461319 96233 -66112 361931 369138 -368497 -500039 140057
10239 -259600 -402162 -222400 152932 272424 -312129 -581588 64811 -378065 -36800 -859801
10229h59801g7799C1800d88913i3448m32025I9297l5313g18512b60892B81669
10218h63946c09125m16297F28752B27239K02435A24149a39052F15619a05415r5728
10208b01143k49037A98443i26865M22957A79938c63437J12435a418m1933j17314
10198a60665A02239Q3487M61831c43801a23968J9025M6095k55648D33703c01671
10187g00163c41861B28883b33861j58580J95478R1884B68965J07920b20753r0496
10177c11249A40711C0947r77L79909A20334a39271q7601D4666k069L06626d26708
10165B01103c97722C26810h1090k01566l80808a19872B7032e25823K10003E09595
10154B27753n6838e68242e9033e583k92045k4798l45023b81313B97553h1627H6323
$$ plain form
10229 -859801 -77799 31800 -488913 -93448 -525473 99297 63984 -718512 -260892 281669
10218 -863946 -309125 -725422 628752 227239 429674 124149 -139052 615619 -105415 -201143
10208 -201143 -450180 198443 -926865 -503908 179938 -363437 -251002 -1418 -43351 -160665
10198 -160665 102239 185726 647557 -343801 -123968 -104943 -58848 -314496 433703 -301671
10187 -700163 -341861 228883 -233861 -392441 -196963 -105079 268965 376885 -220753 -311249
10177 -311249 140711 30947 29970 409879 120334 -139271 -226872 44666 42597 349223 -426708
10165 201103 -397722 326810 -81090 -282656 -663464 -119872 27032 -525823 -315820 509595
10154 227753 170915 -568242 -59033 -5583 -297628 -322426 -667449 -281313 297553 -81627 86323
10142b53460a8621k39794f197n315B02347a88721p44056C12354J17659a50811
10131A8039c08684g6423o1256D74637B19554a1131n65893A87686a38748E22380
10120B22553q4852f48398B08486h10403H5360J49139m8261m5188L53731c32345
10109D30708C8827a44921H68467f58010c3415B37536D6906b51099A32427J01134
10099B33561a49040K4552k63480m06064B57874d49070h7583o4255K2509k88852
10089d18181m34677M01869C16899j05562G6733P1760F5697K65228b00168k86450
10079d86618E93018G1834b99047k12714D03014f7923l48025r11399d23063B4259
10068d8293j12551C8765e47400e1138m21663B60670c12677J40512j6014M3577
$$ plain form
10142 -253460 -18621 -258415 -6197 -11512 202347 -188721 -932777 312354 430013 -150811
10131 18039 -308684 -76423 -137679 474637 219554 -11131 -577024 187686 -138748 522380
10120 222553 137701 -648398 208486 -810403 85360 234499 186238 141050 494781 -332345
10109 430708 38827 -144921 868467 -658010 -33415 237536 46906 -251099 132427 233561
10099 233561 -149040 -124488 -387968 -794032 257874 -449070 -87583 -151838 -129329 -418181
10089 -418181 -852858 -450989 316899 211337 76733 148493 65697 330925 -200168 -486618
10079 -486618 593018 71834 -299047 -511761 403014 -67923 -415948 -1327347 -423063 24259
10068 -48293 -160844 38765 -547400 -51138 -472801 260670 -312677 -172165 -188179 -144602
10058a44602l77887J77085B80390b98250a05165l57857H4832K31555J11318b04554
10047b19979j16725q8467J58538J23223B84533M01590b92230P477J20584G6864
10036D31432J33428a89917B78884e54345K56200j00190n9541a92140B49177c77033
10025f24737J71380K19671n2382Q6879i7060J2101j59378P0956A73595d21963
10014a51706m70282F434N11202c07651C27890e40400D46702c72205C78917c81732
10003H3012K58824B1315M15969a11376E1933P80859b91j91272k99532A30059a29246
9991C0667b79314p0247m3871j38286l8216I7289J12483e03510k0226a6876h378
9979c80820n4080a32674A78393b77865d8305l49431J48445M6885E95685c91837
$$ plain form
10058 -144602 -522489 -345404 280390 -298250 -105165 -463022 84832 316387 427705 -204554
10047 -219979 -336704 -425171 -266633 -143410 284533 686123 -292230 -284753 -164169 76864
10036 431432 564860 -189917 278884 -554345 -298145 -398335 -457876 -192140 249177 -377033
10025 -624737 -453357 -233686 -286068 -199189 -97060 -84959 -244337 -173381 173595 -421963
10014 -151706 -621988 6434 517636 -307651 327890 -540400 446702 -372205 378917 -381732
10003 83012 341836 21315 437284 -111376 51933 832792 -291 -191563 -491095 130059 -129246
9991 30667 -279314 -349561 -393432 -531718 -569934 97289 209772 -503510 -523736 -16876 -8378
9979 -380820 -434900 -132674 178393 -277865 -48305 -397736 -249291 -202406 595685 -391837
9968f64628L31846F3058d6368A04870c99449F3861g6390I6189e78297a95452m01129
9957e96581A61312b39435d411C8356d6677k80349P4485m18279j6311K15425d6736
9945d49183J272m61856K1168A21134a12789m4909D803b26666l82875b2851n76717
9934e99568g6660l9983j65036q6284m2159C93945E1967M9668Q6393a46199B64094
9922d77798a98626j03289E4009K35565d55052A84836a75657g3464k27977P2325
9912b29116N031H4420A4048c77791j0501g2992m01741a86411j2021k73239g8923
9900D78120i8808m9893l04523J92429J29045B02476a33196j13220j55834A87684
9889d352l05926h6088J4176B75314b78538j19828D560M9882L87297A56953l5705
$$ plain form
9968 -664628 -332782 63058 -46368 104870 -399449 63861 -76390 96189 -578297 -195452 -596581
9957 -596581 161312 -239435 -4411 38356 -46677 -327026 -252541 -670820 -687131 -471706 -46736
9945 -449183 -447911 -909767 -888599 121134 -112789 -157698 4803 -226666 -609541 -22851 -599568
9934 -599568 -76660 -116643 -281679 -367963 -410122 393945 51967 101635 188028 -146199 264094
9922 -477798 -198626 -301915 54009 289574 -455052 184836 -175657 -73464 -301441 -229116
9912 -229116 -224085 84420 14048 -377791 -388292 -72992 -474733 -186411 -198432 -471671 -78923
9900 478120 -98808 -148701 -453224 -260795 -131750 202476 -133196 -246416 -402250 187684
9889 -4352 -310278 -86088 -71912 275314 -278538 -398366 4560 54442 441739 156953 121248
9878A21248J59368E3681c078k77942j05812G65862A28447D3140d08536a63329
9867B20451a63183o2713g3114C20197K8405b89637J27778j41069n3431A25913
9856C79468a88328F21693B24096d87748a25645B01594E8265a00089M8324I51477
9845b04559D30470d9781j70333q82671A81466b72547E04745B15429h62430E369
9834F92140b34365q2473n25977L42928b22534k93265f4226j62392N5831k92181
9824d62968A88027C032c07756B48246f07323B79740b265o81092C46586d62028
9813b7377B46654e67465G4407A1339c40638l40311b73399P2332j35321n10796
9803h47184a22095k46512a19282o5826k02907A16387R5989M4309d92009K45367
$$ plain form
9878 121248 280616 53681 -3078 -281020 -386832 765862 128447 43140 -408536 -163329
9867 220451 -163183 -225896 -73114 320197 348602 -289637 -161859 -302928 -356359 125913
9856 379468 -188328 621693 224096 -487748 -125645 201594 58265 -100089 -51765 951477
9845 -204559 430470 -49781 -220114 -1102785 181466 -272547 504745 215429 -862430 5369
9834 692140 -234365 -316838 -842815 -499887 -222534 -515799 -64226 -226618 -170787 -462968
9824 -462968 188027 3032 -307756 248246 -607323 279740 -2265 -683357 346586 -462028
9813 -27377 246654 -567465 74407 11339 -340638 -680949 -273399 -201067 -336388 -847184
9803 -847184 -122095 -368607 -119282 -185108 -388015 116387 212376 256685 -492009 -246642
9793b46642C224c23260D06558A54195a94061r2442d8677n09182J44795G33372
9782F74402b58503o22618K17482B62459D5737L42565b7193n16416J95290E7387
9771b95744j5814C84275b19356D44628h26402b12839j6489n3441e7991k39973
9761b97964D86886c42513R0170l7521C9747K66160e06910D30567a30946K1776
9751a09170a2478p28742B29226h81047a08837B11609c00942a0770A16734K82441
9741C99175d55214b10419j22804j01589A90707g0805B77034f32631J67040n343
9731d70934i4926l57576D26806c24725K5073A93187a13360p3903Q9104n40288
9721f38447A29669c63388D69514c92581j5914q3217j24443b32415C5497d05518
$$ plain form
9793 -246642 3224 -323260 406558 154195 -194061 -286503 -48677 -557859 -413064 733372
9782 674402 -258503 -881121 -663639 262459 45737 388302 -27193 -543609 -348319 57387
9771 -295744 -311558 384275 -219356 444628 -826402 -212839 -229328 -282769 -57991 -297964
9761 -297964 486886 -342513 -252343 -289864 39747 305907 -506910 430567 -130946 -109170
9751 -109170 -12478 -741220 229226 -881047 -108837 211609 -300942 -10770 116734 399175
9741 399175 -455214 -210419 -333223 -434812 190707 -70805 277034 -632631 -465591 -470934
9731 -470934 -94926 -452502 426806 -324725 -299652 193187 -113360 -187263 -98159 -638447
9721 -638447 129669 -363388 469514 -392581 -408495 -491712 -616155 -232415 35497 -405518
9710A74106a97521D43346E3349J35286l1692f2994l79301D103M323a11627n40969
9699f52596J48222A23637g28062I27122a24379r92833D3154J78149E833d97340
9688B91681d44818o74695b31649n38639c6986A03409j9973J35850e74412K27812
9678c46600q3737p25281b16881j12072D37021b12979B74069f51750K17182C69412
9667A16160j3447h40719b07869I8506C1601J01107a24178n1263h6056k22659D81824
9655A31334Q1276e5412B3121M27469I4691O09654k47194h84157K31978B68794
9644c00093M7594A56935m0217A0742J21584F3739d41901e618m12881B82279b86610
9632g53625g8176B23656q8682L01079d08197A79693R0295b0093m46354C42709
$$ plain form
9710 174106 -197521 443346 53349 188635 156943 -62994 -442295 4103 8426 -111627 -652596
9699 -652596 -504374 123637 -728062 927122 -124379 -1117212 43154 221303 5833 -497340
9688 291681 -444818 -1119513 -231649 -770288 -36986 103409 83436 219286 -574412 -346600
9678 -346600 -430337 -1155618 -216881 -328953 437021 -212979 274069 -651750 -434568 369412
9667 116160 102713 -840719 -207869 98506 31601 132708 -124178 -175441 -86056 -308715 481824
9655 131334 212610 -55412 23121 450590 94691 704345 457151 -884157 -652179 268794
9644 -300093 -252499 156935 116718 10742 132326 63739 -441901 -5618 -418499 282279 -286610
9632 -753625 -78176 223656 134974 436053 -408197 179693 269988 -20093 -466447 342709
9621A06775b66996k98794j70971d3062B20032c55220B19398b6395F71174h5506
9610d39403J56619R5541o6298B86814f22426h7355b2213D5311P474j0026J47854
9599A90613h33348F8346b67695r8749m92049f8623B03064e1664A26143e87310
9588c1933j81925D52158c29167A88938b71519a15286j64728C2877L71760a46366
9577C53207d47603O1852j45068a54654o01358J73096a29825n02300A58167b09371
9566F91336e5069l67590a14330m99358C55350N8778A9091K49946L08361A44697
9555b78690A98639c08402e7654A44108B2558a91385p0498a8226I0231Q3196h3104
9543C77725a31660A44500d67784d7169C00434d80091A92678L96237b87475d6417
$$ plain form
9621 106775 -266996 -565790 -736761 -43062 220032 -355220 219398 -26395 671174 -85506
9610 -439403 -282784 -187243 -253541 286814 -622426 -87355 -22213 45311 52785 42759 190613
9599 190613 -833348 68346 -267695 -366444 -858493 -68623 203064 -51664 126143 -587310
9588 -31933 -213858 452158 -329167 188938 -271519 -115286 -280014 32877 404637 -146366
9577 353207 -447603 -385751 -530819 -154654 -756012 -582916 -129825 -632125 158167 -209371
9566 691336 -55069 -422659 -114330 -613688 355350 414128 19091 269037 577398 144697
9555 -278690 198639 -308402 -57654 144108 22558 -191385 -261883 -18226 90231 173427 -83104
9543 377725 -131660 144500 -467784 -47169 300434 -480091 192678 588915 -287475 -46417
9532i5906r6505o2386j59061J84886k30635a47893m38768A06881d09614J68783
9522b40831J13761A165J45832b5878n1861A64749E2247J8106b22240N3773r1570
9511b60037c3869o20728G6780c58954a40481B66949A012J33347f53467J84920
9501d68547F2117K41204h2587l63437J30689D34347e20606A52633D1828d99394
9490F31671B53300e04738D80205a83455j42875k34118a74228j68199h6381F43753
9479I0628e12411j63403J86506M487J26156A73539b45363j97276R1657P1022D32504
9467b04778A74875d89246D9785M32248J46668b43691E6778b77106B5905d76863
9456D89136a95740f6269l86609g8361r6124B09995e76550J41046e3919m30845
$$ plain form
9532 -95906 -192411 -254797 -413858 -228972 -459607 -147893 -586661 106881 -409614 -240831
9522 -240831 -127070 1165 146997 -25878 -77739 164749 52247 70353 -222240 -168467 -260037
9511 -260037 -33869 -654597 76780 -358954 -140481 266949 1012 134359 -653467 -468547
9501 -468547 62117 303321 -82587 -446024 -315335 434347 -520606 152633 41828 -499394
9490 631671 253300 -504738 480205 -183455 -326330 -560448 -174228 -342427 -86381 643753
9479 90628 -512411 -675814 -489308 -484821 -358665 173539 -245363 -442639 -350982 -279960 432504
9467 -204778 174875 -489246 49785 482033 628701 -243691 56778 -277106 25905 -476863
9456 489136 -195740 -66269 -452878 -78361 -174485 209995 -576550 -435504 -53919 -484764
9446d84764A97432K09164c54426A30151M85221a29019j40511C88643h9141K2341
9436f6800k98884B95450i99964g5866B67420b34368k4912C00830b7106k28918
9426b56024J23527l91199a06396A76463p4166d71778H4486e3026b3047o23602
9416f46649e1031J0708j15826j1413J6067a4217B67276A10381i75158A0975i9944
9404b66338h4698l58322E0171M3541g54892b40073i5936k11792k43269a76520
9393C25202a3288A92100J11206e97033j35900K06217b56969l2576l49234B90549
9382c68555A33821O53578h3993B16230e21222n49575M75899D03424a92427N3609
9372a38818O6046A99463J16912f7366k07763q8039g3269o86550c57022Q5922M8083
$$ plain form
9446 -484764 197432 406596 -354426 130151 615372 -129019 -269530 388643 -89141 -66800
9436 -66800 -365684 295450 -999964 -75866 267420 -234368 -259280 300830 -27106 -256024
9426 -256024 -132497 -523696 -106396 176463 102297 -471778 84486 -53026 -23047 -646649
9416 -646649 -51031 -40323 -156149 -167562 -151495 -14217 267276 110381 -975158 10975 -99944
9404 -266338 -84698 -443020 50171 93712 -754892 -240073 -95936 -307728 -550997 -176520
9393 325202 -13288 192100 303306 -597033 -732933 -526716 -256969 -289545 -638779 290549
9382 -368555 133821 787399 -83993 216230 -521222 -1070797 -594898 403424 -192427 -138818
9372 -138818 -72772 199463 316375 -67366 -275129 -363168 -73269 -759819 -357022 -271100 -223017
9361b23017G46433a24945A49600l856R9458J97638e5742G59395d37568n900A11213
9349a28474o80365c09535D97882J0448e95285g9298j67074B29842c13040D17926
9338b07630e4523m51115B96940o0054b44642k20483J92244g2700l85080A46787
9327d11620m89579K61718E60534B39920e37544a44268G57285f29797J58437B06050
9316g883p56784A60076a13649B41236c68402M9851f3969C97437h786j90395o4738
9305b63919M3676B60205N05562C69030a34219M0972m95702h9043F79279a13590
9294a05917j0434A42351c16387C1087b48448m8639A07341N24338j28403d28122
9283a10524n72780D5222a18180o93918c49840F5340J54659f46101B39900d05967
$$ plain form
9361 -223017 746433 -124945 149600 145744 245202 442840 -55742 759395 -437568 -443468 111213
9349 -128474 -808839 -309535 497882 508330 -595285 -79298 -246372 229842 -313040 417926
9338 -207630 -54523 -505638 296940 236886 -244642 -465125 -272881 -72700 -457780 146787
9327 -411620 -901199 -639481 560534 239920 -537544 -144268 757285 -629797 -471360 206050
9316 -7883 -764667 160076 -113649 241236 -368402 -318551 -63969 397437 -8786 -199181 -263919
9305 -263919 -220243 260205 765767 369030 -134219 -93247 -588949 -89043 679279 -113590
9294 -105917 -116351 142351 -316387 31087 -248448 -297087 107341 631679 503276 -428122
9283 -110524 -683304 45222 -118180 -812098 -349840 65340 219999 -646101 239900 -405967
9272c35173B60986H7639c23884m84904E44583j14979c17339C02798a01848l42894
9262d44742A39630K30489a10808j32948B70411c43582k26190K37100e1037A17795
9251a7990j65061B9568J93822e7175r071n15642B77121G9618d1301j11588B54087
9239B86347K19307B2990L85460e47200C79422a95766f7361B62538e84411a37424
9228A39436J47221b59534m32250a60130C6446c85883Q7033E62756B950L21051
9218C24001c77345B1416d28939D1933c97619e1020r4889l60599C5310P2533b3191
9206g82858b77329j72045n8891C33304c66838C55721b5617l16261J06498H7132
9195A74692b84583m12708A09219b86253M9142e8048j49596E6968Q3697C8688J56206
$$ plain form
9272 -335173 260986 87639 -323884 -808788 544583 429604 -317339 302798 -101848 -444742
9262 -444742 139630 370119 -110808 -243756 270411 -343582 -569772 -332672 -51037 117795
9251 -17990 -183051 29568 223390 -57175 -66246 -581888 277121 79618 -41301 -152889 254087
9239 286347 505654 22990 408450 -547200 379422 -195766 -67361 262538 -584411 -137424
9228 139436 286657 -259534 -691784 -160130 36446 -385883 -298850 562756 2950 324001
9218 324001 -377345 21416 -428939 41933 -397619 -51020 -145909 -506508 35310 107843 -23191
9206 -782858 -277329 -449374 -508265 333304 -366838 355721 -25617 -341878 -235380 87132
9195 174692 -284583 -697291 109219 -286253 -237111 -58048 -207644 56968 140665 38688 194894
9184A94894J3317c29362a61190N5769B74184g49483K99904J54116a20986I906
9173c33802a14156B06494d31759A77975e34102A19236d24600J02027G03166a93634
9162f00460C91628e54732J76408A25660K07970Q0369f13464B97551c23386D6352
9151e82422f4774E42884f81362a25538e3578D5439L17797d82399D83522c31469
9140I0441a06265c780n09900b36137l0207Q0992K9231H13478f36109a49433k52268
9129d01701O9333D24828k04862h9713l14262a94140j0351A06124g69624e0125
9118G05780a62221H2726g18963j54836A0303a67537e4058j43302J0702C18143
9107d98202J14753k96480i8529j1322m99931J35133F54506I7711c05586A67155
$$ plain form
9184 194894 208211 -329362 -161190 -105421 274184 -749483 -449579 -295463 -120986 9906
9173 -333802 -114156 206494 -431759 177975 -534102 119236 -424600 -322573 703166 -193634
9162 -600460 391628 -554732 -378324 125660 333630 413999 -613464 297551 -323386 46352
9151 -582422 -64774 542884 -681362 -125538 -53578 45439 363236 -482399 483522 -331469
9140 90441 -106265 -3780 -513680 -236137 -266344 -185352 -156121 813478 -636109 -149433 -401701
9129 -401701 -332368 424828 219966 -89713 -403975 -194140 -204491 106124 -769624 -50125
9118 705780 -162221 82726 -718963 -873799 10303 -167537 -54058 -197360 -186658 318143
9107 -498202 -383449 -679929 -98529 -109851 -609782 -474649 654506 97711 -305586 167155
9096D41597c01510J08855B21105d05691A55318g0866k44924A33148g58253F29545
9085c4040M970r7568G5934O46686b62781B82144e14302a48466b8254A26375c90965
$$ plain form
9096 441597 -301510 -192655 221105 -405691 155318 -70866 -315790 133148 -758253 629545
9085 -34040 -29070 -126638 75934 722620 -262781 282144 -514302 -148466 -28254 126375 -390965
$$ [...]
##END NTUPLES=NMR SPECTRUM
##END=
