
##TITLE=AC1357_GUARH12176_6672443_vCM8YDQbAB
##JCAMPDX= 6.0         $$ Bruker NMR JCAMP-DX V2.0
##DATA TYPE= NMR SPECTRUM
##DATA CLASS= NTUPLES
##ORIGIN= BRUKER
##OWNER= Administrator
$$ 1.72 TOPSPIN		Version 2.1
$$ 2012-08-14 17:02:55.859 -0500  Administrator@TOPSPIN
$$ Compression mode = diff/dup
##.OBSERVE FREQUENCY= 400.02188249412
##.OBSERVE NUCLEUS= ^1H
##.ACQUISITION MODE= SIMULTANEOUS (DQD)
##.ACQUISITION SCHEME= undefined
##.AVERAGES= 64
##.DIGITISER RES= 22
##SPECTROMETER/DATA SYSTEM= spect
##.PULSE SEQUENCE= noesygpps1d.comp
##.SOLVENT NAME= COFFEE_meoh
##.SHIFT REFERENCE= INTERNAL, COFFEE_meoh, 1, 14.96102
##AUDIT TRAIL= $$ (NUMBER, WHEN, WHO, WHERE, PROCESS, VERSION, WHAT)
$$ ##TITLE= Audit trail, TOPSPIN		Version 2.1
$$ ##JCAMPDX= 5.01
$$ ##ORIGIN= Bruker BioSpin GmbH
$$ ##OWNER= Administrator
$$ $$ C:\Bruker\TOPSPIN/data/COFFEE/nmr/AC1357_GUARH12176_6672443_vCM8YDQbAB/12/pdata/1/auditp.txt
$$ ##AUDIT TRAIL=  $$ (NUMBER, WHEN, WHO, WHERE, PROCESS, VERSION, WHAT)
(   1,<2012-08-14 17:02:50.734 -0500>,<Administrator>,<TOPSPIN>,<go>,<TOPSPIN 2.1>,
      <created by zg
	started at 2012-08-14 16:51:18.609 -0500,
	POWCHK enabled, PULCHK disabled,
       configuration hash MD5:
       6B 1B 68 BB D9 2E 58 E2 7F 35 AD 54 07 DF 0E 41
       data hash MD5: 64K
       18 A5 F9 7F F3 3B 34 00 E9 6D 76 FF 1C 25 25 C4>)
(   2,<2012-08-14 17:02:53.765 -0500>,<Administrator>,<TOPSPIN>,<proc1d>,<TOPSPIN 2.1>,
      <Start of raw data processing
       efp LB = 0.3 FT_mod = 6 PKNL = 1 PHC0 = 0 PHC1 = 0 SI = 128K 
       data hash MD5: 128K
       62 8A AD B6 83 02 67 AC F1 9E E2 1C 14 37 FF 90>)
(   3,<2012-08-14 17:02:54.937 -0500>,<Administrator>,<TOPSPIN>,<proc1d>,<TOPSPIN 2.1>,
      <pk PHC0 = -0.9558105 PHC1 = 0 
       data hash MD5: 128K
       AE 9F ED CA AB 29 38 C5 43 0C 46 CE 38 95 97 47>)
(   4,<2012-08-14 17:02:55.500 -0500>,<Administrator>,<TOPSPIN>,<proc1d>,<TOPSPIN 2.1>,
      <abs ABSG = 1 
       data hash MD5: 128K
       BF EC 94 CB D1 44 62 38 45 8D 65 34 C6 70 9D 2D>)
(   5,<2012-08-14 17:02:55.578 -0500>,<Administrator>,<TOPSPIN>,<proc1d>,<TOPSPIN 2.1>,
      <abs ABSG = 2 
       data hash MD5: 128K
       6D 9B 4E 9A 2A 6E 2A 6C 9A F6 81 E5 65 B2 D2 AB>)
(   6,<2012-08-14 17:02:55.625 -0500>,<Administrator>,<TOPSPIN>,<proc1d>,<TOPSPIN 2.1>,
      <abs ABSG = 3 
       data hash MD5: 128K
       40 6B 09 78 5C 97 67 1F 26 47 FB 80 48 BD 07 1B>)
(   7,<2012-08-14 17:02:55.718 -0500>,<Administrator>,<TOPSPIN>,<proc1d>,<TOPSPIN 2.1>,
      <abs ABSG = 4 
       data hash MD5: 128K
       03 31 BD 40 46 72 51 FA 05 5A 3B 6B 0B 89 D0 DB>)
(   8,<2012-08-14 17:02:55.781 -0500>,<Administrator>,<TOPSPIN>,<proc1d>,<TOPSPIN 2.1>,
      <abs ABSG = 5 
       data hash MD5: 128K
       70 46 72 E6 4C 59 FA 4E 95 31 11 2A 56 E1 77 19>)
$$ ##END=
$$ 
$$ $$ hash MD5
$$ $$ 50 43 08 F7 81 60 AA 00 C9 8A 8B B6 02 BD F7 C0
##$RELAX= 
##$RELAX= 
##$RELAX= 
##$RELAX= 
##$RELAX= 
##$RELAX= 
##$RELAX= 
##$RELAX= 
$$ Bruker specific parameters
$$ [...]
##$TP07= 0
##$TPNAME0= <>
##$TPNAME1= <>
##$TPNAME2= <>
##$TPNAME3= <>
##$TPNAME4= <>
##$TPNAME5= <>
##$TPNAME6= <>
##$TPNAME7= <>
##$TPOAL= (0..7)
0.5 0.5 0.5 0.5 0.5 0.5 0.5 0.5
##$TPOFFS= (0..7)
0 0 0 0 0 0 0 0
##$TUNHIN= 0
##$TUNHOUT= 0
##$TUNXOUT= 0
##$USERA1= <user>
##$USERA2= <user>
##$USERA3= <user>
##$USERA4= <user>
##$USERA5= <user>
##$V9= 5
##$VALIST= <valist>
##$VCLIST= <CCCCCCCCCCCCCCC>
##$VD= 0
##$VDLIST= <DDDDDDDDDDDDDDD>
##$VPLIST= <PPPPPPPPPPPPPPP>
##$VTLIST= <TTTTTTTTTTTTTTT>
##$WBST= 1024
##$WBSW= 4
##$XGAIN= (0..3)
0 0 0 0
##$XL= 0
##$YL= 0
##$YMAX_a= 10364357
##$YMIN_a= -7473533
##$ZGOPTNS= <>
##$ZL1= 120
##$ZL2= 120
##$ZL3= 120
##$ZL4= 120
##$ABSF1= 14.96102
##$ABSF2= -5.597161
##$ABSG= 5
##$ABSL= 3
##$ALPHA= 0
##$AQORDER= 0
##$ASSFAC= 0
##$ASSFACI= 0
##$ASSFACX= 0
##$ASSWID= 0
##$AUNMP= <proc_prof1d_extract.lims>
##$AXLEFT= 0
##$AXNAME= <>
##$AXNUC= <1H>
##$AXRIGHT= 0
##$AXTYPE= 0
##$AXUNIT= <>
##$AZFE= 0.1
##$AZFW= 0.1
##$BCFW= 0
##$BC_mod= 0
##$BYTORDP= 0
##$COROFFS= 0
##$CY= 15
##$DATMOD= 1
##$DC= 0
##$DFILT= <>
##$DTYPP= 0
##$F1P= 0
##$F2P= 0
##$FCOR= 0.5
##$FTSIZE= 131072
##$FT_mod= 6
##$GAMMA= 0
##$GB= 0
##$INTBC= 1
##$INTSCL= 1
##$ISEN= 128
##$LB= 0.3
##$LEV0= 0
##$LPBIN= 0
##$MAXI= 10000
##$MC2= 0
##$MEAN= 0
##$ME_mod= 0
##$MI= 0
##$NCOEF= 0
##$NC_proc= -2
##$NLEV= 6
##$NOISF1= 0
##$NOISF2= 0
##$NSP= 0
##$NTH_PI= 0
##$NZP= 0
##$OFFSET= 14.96102
##$PC= 1
##$PHC0= -0.9558105
##$PHC1= 0
##$PH_mod= 1
##$PKNL= yes
##$PPARMOD= 0
##$PPDIAG= 0
##$PPIPTYP= 0
##$PPMPNUM= 2147483647
##$PPRESOL= 1
##$PSCAL= 4
##$PSIGN= 0
##$PYNMP= <proc.py>
##$REVERSE= no
##$SF= 400.020009629381
##$SI= 131072
##$SIGF1= 0
##$SIGF2= 0
##$SINO= 400
##$SIOLD= 131072
##$SPECTYP= <>
##$SREGLST= <1H.CDCl3>
##$SSB= 0
##$STSI= 131072
##$STSR= 0
##$SW_p= 8223.68421052631
##$SYMM= 0
##$S_DEV= 0
##$TDeff= 65536
##$TDoff= 0
##$TI= <>
##$TILT= no
##$TM1= 0
##$TM2= 0
##$TOPLEV= 0
##$USERP1= <user>
##$USERP2= <user>
##$USERP3= <user>
##$USERP4= <user>
##$USERP5= <user>
##$WDW= 1
##$XDIM= 131072
##$YMAX_p= 408090926
##$YMIN_p= -11355
##$CURPLOT= <Network HP LaserJet P1505>
##$CURPRIN= <$Network HP LaserJet P1505>
##$DFORMAT= <normdp>
##$LAYOUT= <+/1D_H.xwp>
##$LFORMAT= <normlp>
##$PFORMAT= <normpl>
##$SURQMSG= 1
$$ End of Bruker specific parameters
$$ ---------------------------------
##NTUPLES= NMR SPECTRUM
##VAR_NAME=  FREQUENCY,     SPECTRUM/REAL,   SPECTRUM/IMAG
##SYMBOL=    X,             R,               I
##VAR_TYPE=  INDEPENDENT,   DEPENDENT,       DEPENDENT
##VAR_FORM=  AFFN,          ASDF,            ASDF
##VAR_DIM=   131072,        131072,          131072
##UNITS=     HZ,            ARBITRARY UNITS, ARBITRARY UNITS
##FACTOR=    0.0627417313425164, 1,          1
##FIRST=     8223.62146879497, 3967,         -48730
##LAST=      0,             5396,            -48874
##MIN=       0,             -11355,          0
##MAX=       8223.62146879497, 408090926,    0
$$ Real data points
##PAGE= N=1
##DATA TABLE= (X++(R..R)), XYDATA
$$ [...]
61601D18411n632n794n920n819n152m183l552l377l304l295l574l861l572k706
61587C58670j868j465j559k194l113l438k661j589j367j827j877j330j097j598
61573C31687k158k157j732j241q83r43j498j853j222n9L01n01j309j074j34M71
61557C15695L44nJ66J065K026K059J095K48L75Q63O63j07n32l97j78J62J029J999
61539C26570K004Q82l69r87j100q83j84P94J402J404J264J321J373J180P11p9
61523C35303j142j959j996j451r85q87j085j618k372k749k392j774j275l16J411
61508C14713K608J783m01j740j389n35k21r8L77R58J287J392J210N92m6j26L5
61491C20399l30r80r62l06Kk00k8O53Q08P6n37l95k09n63q34l89K86N72P42J208
$$ plain form
61601 418411 412779 406985 401065 395246 390094 385911 382359 378982 375678 372383 368809 364948 361376 358670
61587 358670 356802 355337 353778 351584 348471 345033 342372 340783 339416 337589 335712 334382 333285 331687
61573 331687 329529 327372 325640 324399 323516 322573 321075 319222 318000 317941 318242 317741 316432 315358 315224 315695
61557 315695 316039 316034 316200 317265 319291 321350 322445 322693 323068 323931 324594 324487 323955 323558 323380 323542 324571 326570
61539 326570 328574 329456 329087 328100 327000 326117 325933 326727 328129 329533 330797 332118 333491 334671 335382 335303
61523 335303 334161 332202 330206 328755 327770 326883 325798 324180 321808 319059 316667 314893 313618 313302 314713
61508 314713 317321 319104 318703 316963 315574 315039 314818 314720 315097 316055 317342 318734 319944 320536 320490 320364 320399
61491 320399 320069 319089 318127 317821 317823 317623 317595 318248 319056 319132 318595 318200 317991 317428 316594 316205 316491 317063 317805 319013
61471C19013J612J513J155Q72M40k63p21n92l42m68o48l42L45R11J130J037O64
61454C25316J46l02o96j046r37M2J379K000J602Q87M25K15L66J112J945J844P88
61437C35086K8M47J503K259K556K755L040L427L844L929L348K459J971J909J641
61422C70202R77L53k1k87k84K01O25K89k66J53J313J572K89j140j248k33P25Q19
61404C74039j73j939l388l348k002o71r1P9l6p87j744j729o50K11K57M21J276
61387C59725J913J643J316J837K643K753K320K040J993J969K101K320K010J083
61373C87666M34O65J260J647K067K685K981K789K777L105K841J627O01O09P45
61358D14499n2j081j003M3Q98J309J947K977L789M021L919L927M541O050P850
$$ plain form
61471 319013 320625 322138 323293 324165 324605 324342 323621 323029 322687 322219 321571 321229 321574 322485 323615 324652 325316
61454 325316 325462 325160 324464 323418 322481 322523 323902 325902 327504 328391 328816 329031 329397 330509 332454 334298 335086
61437 335086 335114 335561 337064 339323 341879 344634 347674 351101 354945 358874 362222 364681 366652 368561 370202
61422 370202 371179 371532 371511 371224 370940 371141 371766 372055 371789 371942 373255 374827 375116 373976 372728 372495 373220 374039
61404 374039 373866 371927 368539 365191 363189 362518 362427 362506 362470 361683 359939 358210 357560 357771 358028 358449 359725
61387 359725 361638 363281 364597 366434 369077 371830 374150 376190 378183 380152 382253 384573 386583 387666
61373 387666 388100 388765 390025 391672 393739 396424 399405 402194 404971 408076 410917 412544 413145 413754 414499
61358 414499 414447 413366 412363 412406 413304 414613 416560 419537 423326 427347 431266 435193 439734 445784 453634
61343D53634Q709Q273P595P555P696P246O327N305L970K297J088Q22P39j4j093
61328E20149j804k294k914l248k924k598k927l305k773j580p44n06l03J62P80
61313D93171J514K293K828L156L760M637N126N161N644O889P923Q230Q866J0688
61299E69886J2643J3231J2563J1596J0277Q036N304K978R24j557m243o342p785
61286F27511q928r513r192q502q078p456o001m330l477l126k195o68N24J112J605
61271E59286K088K319K665L684M912N353M939M418M084L762L641M003M460M522
61257F14136M560N105N763N963O245P424Q918R323Q360O907N363L272M69k571
61243F89237n349p446q363q270q264q941r332q477p093o309n655m070k113j192
$$ plain form
61343 453634 462343 470616 478211 485766 493462 500708 507035 512340 516310 518607 519695 520517 521256 521242 520149
61328 520149 518345 516051 513137 509889 506965 504367 501440 498135 495362 493782 493038 492532 492229 492391 493171
61313 493171 494685 496978 499806 502962 506722 511359 516485 521646 527290 534179 542102 550332 559198 569886
61299 569886 582529 595760 608323 619919 630196 638232 643536 646514 647438 645881 641638 635296 627511
61286 627511 618583 609070 599878 591376 583298 575842 569841 565511 562034 558908 556713 556045 556569 557681 559286
61271 559286 561374 563693 566358 570042 574954 580307 585246 589664 593748 597510 601151 605154 609614 614136
61257 614136 618696 623801 629564 635527 641772 649196 658114 667437 675797 682704 688067 691339 691808 689237
61243 689237 683888 676442 668079 659809 651545 642604 633272 624795 617702 611393 605738 601668 599555 598363
61229E98363j025p4J758K913K766K398K586K869L073L948N697P332Q057Q114P830
61214F56605P085O097N532N408M967M005L334L592M465N347N930N990N429M615
61200G28401L985L409K698K436L285M837O174P307Q863J0648J1863J2567J3542
61187H20015J4814J5561J5487J5002J4010J1869Q603N072J891p71k522l069l114
61174I12848l690m758n595o204p002p530p083o422p136r306j1418j2606j3341
61161H10757j3893j3886j3599j3974j4925j5188j4334j3403j3134j2977j2263
61150F59181j1102r663p832n911m520l497k083k66J203K185L162L902L536K029
61136F30324K11j634l667n104m818l412k770l215l035j232J144L022M760O774
$$ plain form
61229 598363 597338 597264 599022 601935 604701 607099 609685 612554 615627 619575 625272 632604 640661 648775 656605
61214 656605 663690 669787 675319 680727 685694 689699 693033 696625 701090 706437 712367 718357 723786 728401
61200 728401 732386 735795 738493 740929 744214 749051 755225 762532 771395 782043 793906 806473 820015
61187 820015 834829 850390 865877 880879 894889 906758 915361 920433 922324 921553 919031 915962 912848
61174 912848 909158 904400 898805 892601 885599 878069 870986 864564 857428 848122 836704 824098 810757
61161 810757 796864 782978 769379 755405 740480 725292 710958 697555 684421 671444 659181
61150 659181 648079 638416 630584 624673 620153 616656 614573 614307 615510 617695 620857 624759 628295 630324
61136 630324 630535 628901 625234 620130 615312 611900 609130 605915 602880 601648 602792 605814 610574 617348
61122F17348Q491R596J0775J2407J3827J4738J5901J7695J9299K0151K0944K2393
61110H03565K4003K4833K4624K3659K2406K1420K0697J9161J6033J2477J0394
61099A023272R734Q765O872N021L317M94l695p755j0819j3694j6835j9265k0432
61086I64980k1177k2007k2240k1650k1103k0771j9631j7504j5661j4654j3540
61075G55042j2019j1162j1143j0525q824p471p135o357m217k006r35l68L52O43
61061F73875O11J784M356O153O012N769P050Q697R280R673J0861J1689J1263J1276
61047G78349J3291J5891J7118J7743J9405K1548K2917K4197K6281K7869K7693
61036A012302K7365K9001L1696L3350L4186L5443L6456L6253L6329L8407M1173
$$ plain form
61122 617348 625839 635435 646210 658617 672444 687182 703083 720778 740077 760228 781172 803565
61110 803565 827568 852401 877025 900684 923090 944510 965207 984368 1000401 1012878 1023272
61099 1023272 1033006 1041771 1048643 1053664 1056981 1057475 1053780 1046025 1035206 1021512 1004677 985412 964980
61086 964980 943803 921796 899556 877906 856803 836032 816401 798897 783236 768582 755042
61075 755042 743023 731861 720718 710193 701369 693898 686763 680406 676189 674183 673248 672880 673232 673875
61061 673875 674486 676270 680626 686779 692791 698560 705610 714307 723587 733260 744121 755810 767073 778349
61047 778349 791640 807531 824649 842392 861797 883345 906262 930459 956740 984609 1012302
61036 1012302 1039667 1068668 1100364 1133714 1167900 1203343 1239799 1276052 1312381 1350788 1391961
61025A391961M2660M4130M7893N3054N7257O0990O6021P1205P4187P5787P8310
61014B063455Q1165Q3029Q6676R6205J10690J26345J43663J66056J92327K17731
61004C367342K42530K72312L09732L53752M07406M77316N64145O63597P79666
60995G437798R25954J109744J327202J580366J883335K238585K619591K988313
60987B2110888L303858L476541L331882K701725J616483L90808n45898r40499
60979C5445788q40197m54925L2760M83854O99811M37449l94055j577071k689549
60970C1143865l389434l598666l446688l101827k677927k244679j851620j521803
60962I311221j249531j021949q35135o86583n66746m66817l86434l26845k82997
$$ plain form
61025 1391961 1434621 1478751 1526644 1579698 1636955 1697945 1763966 1835171 1909358 1985145 2063455
61014 2063455 2144620 2227649 2314325 2410530 2521220 2647565 2791228 2957284 3149611 3367342
61004 3367342 3609872 3882184 4191916 4545668 4953074 5430390 5994535 6658132 7437798
60995 7437798 8363752 9473496 10800698 12381064 14264399 16502984 19122575 22110888
60987 22110888 25414746 28891287 32223169 34924894 36541377 36932185 36386287 35445788
60979 35445788 34605591 34150666 34183426 34667280 35367091 35804540 35410485 33833414 31143865
60970 31143865 27754431 24155765 20709077 17607250 14929323 12684644 10833024 9311221
60962 9311221 8061690 7039741 6204606 5518023 4951277 4484460 4098026 3771181 3488184
60953C488184k48067k20080j98665j80208j61540j44403j31289j20112j07483
60944A976337r4222q3105p3854o4907n7990n6173n8532o0916o1254o0524n9223
60933A245637n6462n2386m8329m4555m0324l5984l2618k9895k6564k2838k0094
60922H35588j8455j6888j5360j4704j4491j3332j1328j0018r776r349q257p608
60910F86022p949q263p724o858o242n569m660m174m566n359n997o453o639o234
60896E99335n426m966n079n301n414n604n583m812l776l704m660n273m838m344
60882E30555m696n222m868l810k882k218j451o17L4O63J488K217K549K746L149
60867E17637L538L574L470L596L826L824L631L437L199K932L045L813M858N597
$$ plain form
60953 3488184 3240117 3020037 2821372 2641164 2479624 2335221 2203932 2083820 1976337
60944 1976337 1882115 1799010 1725156 1660249 1602259 1546086 1487554 1426638 1365384 1304860 1245637
60933 1245637 1189175 1136789 1088460 1043905 1003581 967597 934979 905084 878520 855682 835588
60922 835588 817133 800245 784885 770181 755690 742358 731030 721012 711236 701887 693630 686022
60910 686022 678073 669810 662086 655228 648986 643417 638757 634583 630017 624658 618661 612208 605569 599335
60896 599335 593909 588943 583864 578563 573149 567545 561962 557150 553374 549670 545010 539737 534899 530555
60882 530555 525859 520637 515769 511959 509077 506859 505408 504791 504825 505488 506976 509193 511742 514488 517637
60867 517637 521175 524749 528219 531815 535641 539465 543096 546533 549732 552664 555709 559522 564380 569977
60853E69977N910N981N795N244M407L424K364J474J122J232J254R48O98P96R02
60838F11528N57l58j806l601m909m640k869j037j59M77K074M568O991Q965J0882
60823F26663J2958J5004J6938J8780K0323K1442K2500K3867K5274K6135K6228
60812H56112K5606K4244K2270K0067J7670J4549J0413N627M21n380j1238j5575
60800I64786j7676j8953k1093k3625k4735k3940k2413k1013j9543j7960j6825
60789G37010j6281j5742j4842j3748j2523j1118r996r680r747r273q372q100q773
60776E88815r480r475q992q381p551o566n924n901o275o861p529p745p033n953
60762D85149n592o011o213n823n549n791n938n481m736m054l292k516k202k327
$$ plain form
60853 569977 575887 581868 587663 592907 597314 600738 603102 604576 605698 606930 608184 609132 609830 610626 611528
60838 611528 612085 611727 609921 606320 601411 596771 593902 592865 592706 593183 595257 599825 606816 615781 626663
60823 626663 639621 654625 671563 690343 710666 732108 754608 778475 803749 829884 856112
60812 856112 881718 905962 928232 948299 965969 980518 990931 996558 996979 991599 980361 964786
60800 964786 947110 928157 907064 883439 858704 834764 812351 791338 771795 753835 737010
60789 737010 720729 704987 690145 676397 663874 652756 642760 633080 623333 614060 605688 597588 588815
60776 588815 579335 569860 560868 552487 544936 538370 532446 526545 520270 513409 505880 498135 491102 485149
60762 485149 479557 473546 467333 461510 455961 450170 444232 438751 434015 429961 426669 424153 421951 419624
60748D19624k154j449r33j062j237p98JN12N19Q0p30j531j747j410j135j133r89
60731D04428n33p6L91J190J970J922J188R30J506J922J539J025Q75L52j181k970
60715D14478l946m197m436m863n418o300p293p422o224m651l758l332k696k080
60701C47862k073k387k277j777j502j587j644j438r03N5J119J507J024N68Q74
60686C37421J451J547J434J773K341K379J786J123Q58J311K673M357N020M227
60672C69701L376L952N495O399O103N239M144K617J018K10L83Q49J071J097J103
60657D12757J245J848K978M039M477M574M890N320N495N627N961N897M715K900
60643D72723J583Q28l23k142l765m644n359o522p674p887p038o013n660n767n310
$$ plain form
60748 419624 417470 416021 415088 414026 412789 411991 411992 412504 413023 413103 412373 410842 409095 407685 406550 405417 404428
60731 404428 403895 403819 404210 405400 407370 409292 410480 411410 412916 414838 416377 417402 418277 418629 417448 414478
60715 414478 410532 406335 401899 397036 391618 385318 378025 370603 364379 359728 355970 352638 349942 347862
60701 347862 345789 343402 341125 339348 337846 336259 334615 333177 332274 332329 333448 334955 335979 336547 337421
60686 337421 338872 340419 341853 343626 345967 348346 350132 351255 352113 353424 356097 360454 365474 369701
60672 369701 373077 377029 382524 388923 395026 400265 404409 407026 408044 408254 408637 409486 410557 411654 412757
60657 412757 414002 415850 418828 422867 427344 431918 436808 442128 447623 453250 459211 465108 469823 472723
60643 472723 474306 475134 474811 472669 468904 464260 458901 452379 444705 436818 429780 423767 418107 412340 407030
60628D07030l807k198j731k186k110r54J53K34j75k31k23p27j261j059m07q1j
60611C90266K87M77R7k94J22Q83Q69K43K73J317K327K421J810R93J32o59j178
60594D00386j386j169j79J414K415J912O80J97O34J024J028J192J571J551J069
60579D12339P97J002J396K105L526N183N970N795N787O673Q061R544J1275J3138
60565D92591J4543J5547J7095J9526K1817K2826K2571K1577J9732J6434J1538
60554F95797N566o73o349j0725j3356j4186j3437j1520q936o048l009L6L025O327
60540F22512J0404J4914J8922K2252K5752K9777L3380L5706L7013L7360L5467
60529I23459L0277K2643J4152N176m318j2915j8650k1372k2438k2430k0909j8185
$$ plain form
60628 407030 403223 401025 399294 397108 394998 394044 394197 394431 394256 394025 393802 393075 391814 390755 390348 390267 390266
60611 390266 390553 391030 391127 390833 390955 391838 392707 392950 393223 394540 396867 399288 401098 402091 402223 401564 400386
60594 400386 399000 397831 397652 399066 401481 403393 404073 404270 404904 405928 406956 408148 409719 411270 412339
60579 412339 413136 414138 415534 417639 421165 426348 432318 438113 443900 450573 458634 468178 479453 492591
60565 492591 507134 522681 539776 559302 581119 603945 626516 648093 667825 684259 695797
60554 695797 701363 700690 694341 683616 670260 656074 642637 631117 622181 616133 613124 613160 616185 622512
60540 622512 632916 647830 666752 689004 714756 744533 777913 813619 850632 887992 923459
60529 923459 953736 976379 990531 995707 991389 978474 959824 938452 916014 893584 872675 854490
60517H54490j5496j3415j1643j0252r554q918p403n415m018k738k8M091P832J0334
60503G87867J2551J5200J7870K0689K4892L0904L7697M4711N2734O2019P1187
60492A178321P8968Q5499R1052R4812R5820R3825Q8582P9666O7764N4513M0259
60481B049081K3517L594j7789l8560n8327p7021r3016j04291j10497j12373j10128
60470A354190j03918r5191q5940p6931o7912n9083n1185m4337l8005l2055k6989
60459F72644k3161k0435j8475j6877j5186j3263j1477j0233r501q898q021o725
60447E10392n505n298o220o820n675l445k057j977j820q31J4p8m29k71m3l00o60
60430D68977p00p79j126j266j162j690l071m096l972l670m210m794m085k384j080
$$ plain form
60517 854490 838994 825579 813936 803684 794130 785212 777809 772394 768376 765638 765610 769701 777533 787867
60503 787867 800418 815618 833488 854177 879069 909973 947670 992381 1045115 1107134 1178321
60492 1178321 1257289 1342788 1433840 1528652 1624472 1718297 1806879 1886545 1954309 2008822 2049081
60481 2049081 2072598 2076192 2058403 2019843 1961516 1884495 1791479 1687188 1576691 1464318 1354190
60470 1354190 1250272 1155081 1069141 992210 924298 865215 814030 769693 731688 699633 672644
60459 672644 649483 629048 610573 593696 578510 565247 553770 543537 534036 525138 517117 510392
60447 510392 504887 499589 493369 486549 480874 477429 475372 473395 471575 470744 470758 470680 470251 469980 469937 469637 468977
60430 468977 468277 467498 466372 465106 463944 462254 459183 455087 451115 447445 443235 438441 434356 431972 430892
60415D30892n64q5P08J411J712J675J325P83N11P32R98Q75N61L89L12L26O78J198
60397D44437J234P53N67R75J235R53Q23J251J432Q30L82J080K277K648K063J432
60381D64372J335J770K570L164K667J117j95l86l7K21R55K623M197M569M374M987
60365D98303O330P135O866O037N076M118L457L174K704J736R27P71N79m06j702
60350E45105k572l304m220m393k936q26K96N11J163K525L694M380N014N306M583
60335E54326L451L360M325M745L806K566K269K873L705M384M646M190L074J667
60321F03387N5j909l983n743p122q084q070o685m631k972j794n90N38J248K162
60306E55807M276P345J0196J2505J4903J7465J9648K1757K4652K7523K7632K3226
$$ plain form
60415 430892 430328 430243 430951 432362 434074 435749 437074 437857 438368 439100 440098 440973 441534 441923 442235 442561 443239 444437
60397 444437 445671 446424 446991 447966 449201 450154 450977 452228 453660 454490 454872 455952 458229 460877 462940 464372
60381 464372 465707 467477 470047 473211 475878 476995 476800 476414 476377 476598 477553 480176 484373 488942 493316 498303
60365 498303 504633 511768 518634 524671 529747 533865 537322 540496 543200 544936 545863 546634 547213 546807 545105
60350 545105 542533 539229 535009 530616 527680 526854 527150 527661 528824 531349 535043 539423 544437 549743 554326
60335 554326 557777 561137 565462 570207 574013 576579 578848 581721 585426 589810 594456 598646 601720 603387
60321 603387 603442 601533 597550 591807 584685 576601 568531 561846 557215 554243 552449 551859 552397 553645 555807
60306 555807 560083 567428 577624 590129 605032 622497 642145 663902 688554 716077 743709 766935
60294G66935J5640P591K37p126j4993k2223k6831k7873k6348k4104k1861j8869
60282F00175j4748j0675q011o521n170m012l901m627m940m416l869l741l418k608
60268E19518k026k179k444k036j055n2P91J566K249K783L170L216K647J567L84
60253E28099p25j743k311k020j167n48m32m27l73n25q57r50q15r83j543j843j508
60236E09329j054j089j448j567j272p80k10M44J064J458J694K132L030M083M551
60221E20365L992K807J789J253J013J097J728K600K931K613K501L206M267M925
60207E57087N053M910M685M679N155N560M928L447K632L224M142M293M137M369
60193F18301M253K805O35r21j794k780l816m196m071m185m521m550m470m733m822
$$ plain form
60294 766935 782575 790166 790403 783277 768284 746061 719230 691357 665009 640905 619044 600175
60282 600175 585427 574752 566741 560220 555050 551038 547137 542510 537570 533154 529285 525544 522126 519518
60268 519518 517492 515313 512869 510833 509778 509726 510517 512083 514332 517115 520285 523501 526148 527715 528099
60253 528099 527374 525631 523320 521300 520133 519585 519153 518726 518353 517828 516971 516021 515206 514223 512680 510837 509329
60236 509329 508275 507186 505738 504171 502899 502119 501909 502353 503417 504875 506569 508701 511731 515814 520365
60221 520365 524357 527164 528953 530206 531219 532316 534044 536644 539575 542188 544689 547895 552162 557087
60207 557087 562140 567050 571735 576414 581569 587129 592057 595504 598136 601360 605502 609795 613932 618301
60193 618301 622554 625359 625994 625073 623279 620499 616683 612487 608416 604231 599710 595160 590690 585957 581135
60178E81135m045l123l408m696n444m996m002k806j160M04O25o07j928k376k339
60163E41234k395k467k463k558k589k175j548j212q33K86J651J989J340J185K168
60148E31613L168L245L115L907N530P039P881Q161Q213Q344Q484Q091O902N679
60134F19372N370N670N395M195K829J830J040M45K88K25m41j509k016j732j378
60119F39583j207o40M32J261J571K097L322M681N475N737N800N828O030O517O779
60104F93266O138M793L512K257K47k529m960o252o720o932p032p117p309p255
60090F54107o439n046l703k416q80M00N35j72m16K69J101J540J790J736Q39o33
60074F42612j693k239l185m667n626n586n444n923o526o608o280n750m958m305
$$ plain form
60178 581135 577090 573967 570559 565863 560419 555423 551421 548615 547455 547859 548484 547877 545949 543573 541234
60163 541234 538839 536372 533909 531351 528762 526587 525039 523827 522994 523280 524931 526920 528260 529445 531613
60148 531613 534781 538026 541141 545048 550578 557617 565498 573659 581872 590216 598700 606791 613693 619372
60134 619372 624742 630412 635807 640002 642831 644661 645701 646146 646434 646659 646218 644709 642693 640961 639583
60119 639583 638376 637736 638168 639429 641000 643097 646419 651100 656575 662312 668112 673940 679970 686487 693266
60104 693266 699404 704197 707709 709966 710213 707684 702724 696472 689752 682820 675788 668671 661362 654107
60090 654107 647668 642622 638919 636503 635623 636023 636558 636386 635970 636239 637340 638880 640670 642406 643245 642612
60074 642612 640919 638680 635495 630828 625202 619616 614172 608249 601723 595115 588835 583085 578127 573822
60060E73822m521n353n624n068m774n289n645m931l630k647k091j721j597j589
60046E19342j160j47J004K050L037L547K990J931J711K514L144K989K740K761
60032E48453K382J387N76J90o50k209l360l440l421m265n461o166o582p145p531
60017E02758p372o967o484n565m368l817m084m078l132j946j180n51l2l32j248
60002D51602j250K15J554J461Q89J185J820J631J009J045J460J277P42R00J780
59987D67320K558L068L727M384M542M364M326M194L456K360J605J308J145J047
59973E09404J016P82L47K76Q12J355J465J560J954K149J785J372J314J228J010
59958E27829J452K808L849L523K579K408L101L720L613K521L99j832k437j001
$$ plain form
60060 573822 569301 563948 558324 553256 548482 543193 537548 532617 528987 526340 524249 522528 520931 519342
60046 519342 518182 518035 519039 521089 524126 527673 530663 532594 534305 536819 539963 542952 545692 548453
60032 548453 550835 552222 552798 552988 552338 550129 546769 543329 539908 535643 530182 524016 517434 510289 502758
60017 502758 495386 488419 481935 476370 472002 468185 464101 460023 456891 454945 453765 453214 453182 452850 451602
60002 451602 450352 450567 452121 453582 454471 455656 457476 459107 460116 461161 462621 463898 464640 465540 467320
59987 467320 469878 472946 476673 481057 485599 489963 494289 498483 501939 504299 505904 507212 508357 509404
59973 509404 510420 511202 511549 511825 512637 513992 515457 517017 518971 521120 522905 524277 525591 526819 527829
59958 527829 529281 532089 535938 539461 542040 544448 547549 551269 554882 557403 557802 555970 553533 552532
59944E52532O12O88l3R6Q79P82n43j962k711l006l095k962k898l193l495l291
59928E28400k682j959j004J41Q48R05J135K107L159L558L683M009M037L454L217
59913E53008M111N241N443N187N464N782N068L856L584M196M345L613K821K217
59899F13936J143n13k027l082l964m575m487l913l428k822j473L25J520J768J665
59884E90073J738K106K874L826M118L372K599K875L634L541K644K150K346K313
59870F30209J641R79O95K54p58k005k963l371l112k404j960k244k757k752k246
59855F07206j674j030k89L4l47o93k53M92P70R95K035L572M635N369O776Q996
59839F36594J1190J3000J4634J5572J4566J1165O310J439k186l565k528j34K257
$$ plain form
59944 552532 553144 553832 553799 553895 554774 555556 555013 553051 550340 547334 544239 541277 538379 535186 531691 528400
59928 528400 525718 523759 522755 522896 523744 524649 525784 527891 531050 534608 538291 542300 546337 549791 553008
59913 553008 557119 562360 567803 572990 578454 584236 589304 593160 596744 600940 605285 608898 611719 613936
59899 613936 615079 614566 612539 609457 605493 600918 596431 592518 589090 586268 584795 585120 586640 588408 590073
59884 590073 591811 593917 596791 600617 604735 608107 610706 613581 617215 620756 623400 625550 627896 630209
59870 630209 631850 632829 633524 633778 633020 631015 628052 624681 621569 619165 617205 614961 612204 609452 607206
59855 607206 605532 604502 604213 604247 603900 603207 602954 603446 604216 605211 607246 610818 615453 620822 627598 636594
59839 636594 647784 660784 675418 690990 705556 716721 723031 724470 722284 718719 716191 716057 718314
59826G18314M022M656K885k075q777j4382j7274j7863j7147j5695j3861j1861
59814F10942r540o967m993m338m456m234l441k614j956j352j043j284j722k006
59800E60996k396k942k972k388k465m016n770o063n262m850m994m849m542m780
59786E02707n039m224k786k192k508k517k016j944k316k129j468j618k754l475
59772D65721l022k210j654q49M28J407J641J692J946J989J657J550K025K665L017
59757D78003K984K410J314M93P88J825K559K885L460M184M262L681L166K808K151
59742E16973J480J449J602Q84m07q71k48K75P9k53l93o92r87o92k08m95j067m00
59724E16029J342K084R96j85J20J094J207N19L2j34n44j173j430r86K4J210J973
$$ plain form
59826 718314 722336 726992 729877 727802 719025 704643 687369 669506 652359 636664 622803 610942
59814 610942 601402 594435 589442 585104 580648 576414 572973 570359 568403 567051 566008 564724 563002 560996
59800 560996 558600 555658 552686 550298 547833 543817 538047 531984 526722 521872 516878 512029 507487 502707
59786 502707 497668 493444 490658 488466 485958 483441 481425 479481 477165 475036 473568 471950 469196 465721
59772 465721 462699 460489 458835 457986 458414 459821 461462 463154 465100 467089 468746 470296 472321 474986 478003
59757 478003 480987 483397 484711 485204 485992 487817 490376 493261 496721 500905 505167 508848 512014 514822 516973
59742 516973 518453 519902 521504 522388 521981 521110 520862 521137 521216 520963 520570 519878 518891 518199 517991 517496 516429 516029
59724 516029 517371 519455 520451 520266 520386 521480 522687 523206 523238 523104 522560 521387 519957 518971 518995 520205 522178
59707E22178J905J407J352K026K969L739M163M022L328K686K558K519K173K219
59693E59244L393M958N542N015M108K826R09p50j046n44n59p81MJ290J342K02
59677E85153l01K77L47q15k006k479l061m069m438l786l285l531l443k238p60
59662E51565M1L21L81J32J10J190K782L251K663K929M584N735N204M324M397M584
59646E94193L813K685J928P98j343l436m344m599n120n602n593n715o365o604
59632E54696n744m702m315l748k066j32O94O38P06Q09K70o63j316j836k590l075
59616E27626k779k394k927m142m990n109m830m276l354k204r49M44J588J759J018
59601D94481L69K87J39m41p90m84j50k81l56P2M96M16J76J43O9k00l78n13r63
$$ plain form
59707 522178 524083 525490 526842 528868 531837 535576 539739 543761 547089 549775 552333 554852 557025 559244
59693 559244 562637 567595 573137 578152 582260 585086 585995 585245 584199 583655 583096 582315 582319 583609 584951 585153
59677 585153 584852 585129 585476 584661 582655 580176 577115 573046 568608 564822 561537 558006 554563 552325 551565
59662 551565 551606 551927 552308 552440 552550 553740 556522 559773 562436 565365 569949 575684 580888 585212 589609 594193
59646 594193 598006 600691 602619 603417 602074 598638 594294 589695 584575 578973 573380 567665 561300 554696
59632 554696 548952 544250 539935 536187 534121 533989 534683 535321 536027 536836 537106 536443 535127 533291 530701 527626
59616 527626 524847 522453 519526 515384 510394 505285 500455 496179 492825 490621 489672 490116 491704 493463 494481
59601 494481 494850 495137 495276 494835 494045 493561 493411 493130 492774 492846 493342 493758 493934 494077 494146 493946 493568 493055 492092
59582D92092j333q23N3k46j837l004k834k381k445k184r96Q6J70L1N00Q37Q8j213
59564D74561j928j776j009R2P23j6j455j787q39m03j050r29R83K848K843J945
59548D72803J895K334K086J590J904K632K897L214M537O565Q624J0962J3693J5898
59534E51634J7297J9012K0721J9057J1484M70q703j3343j4398j3359j0904q006
59522E70962n684l675j156J450L011L496L558K992J327o52j760k234l079m213
59508E64343m884n299o170p185p504p216o882o344n356m625m724m892m315l610
59494D85337l478l065j454K65M55m86r20n07lO14J775K781K693K140K319K864
59478D91330K691K201K543L325L279K650K748L481L557K866K537K768K697K310
$$ plain form
59582 492092 490759 489936 489989 489743 487906 484902 482068 479687 477242 475058 474062 474148 474318 474349 474849 475686 475774 474561
59564 474561 472633 470857 469848 469940 470663 470647 469192 467405 466566 466163 465113 464184 465167 468015 470858 472803
59548 472803 474698 477032 479118 480708 482612 485244 488141 491355 495892 502457 511081 522043 535736 551634
59534 551634 568931 587943 608664 627721 639205 639675 630972 617629 603231 589872 578968 570962
59522 570962 565278 561603 560447 561897 564908 568404 571962 574954 576281 575629 573869 571635 568556 564343
59508 564343 559459 554160 547990 540805 533301 526085 519203 512859 507503 502878 498154 493262 488947 485337
59494 485337 481859 478794 477340 477605 478060 477574 476654 476147 476144 476758 478533 481314 484007 486147 488466 491330
59478 491330 494021 496222 498765 502090 505369 508019 510767 514248 517805 520671 523208 525976 528673 530983
59464E30983K501L140K997J762N53K45O29J251J881K341K878M243O410P985Q095
59449E77894P824Q496R552R714R067Q223O641L782P93j083k672n261p901q819
59435F16250q532q879r725r431q054p248p189o339m295k391j331n11L83J244K783
59420E46735N711Q932J0852J1972J3920J6449J8100J9177K1200K3785K5247K5850
59408G47930K6731K5688J8292M432r916j8948k2057k1401j7970j2287o163j076
59396G13255L421P447Q514L732o422j8061k6936l0743k9666k5877k1833j8292
59384E58539j4630j0958q411p099n676l552j818j225r04l3Q71J219J505K204K905
59369E12937L342M120N515O788P356P467P209O223N010M991O411P674P635P222
$$ plain form
59464 530983 533484 536624 539621 541383 541936 542181 542810 544061 545942 548283 551161 555404 561814 569799 577894
59449 577894 585718 594214 603766 613480 622547 630770 637411 641193 641986 640903 638231 632970 625069 616250
59435 616250 607718 598839 589114 579683 571629 564381 557192 550853 546558 544167 542836 542325 542708 543952 546735
59420 546735 552446 561378 572230 584202 598122 614571 632671 651848 673048 696833 722080 747930
59408 747930 774661 800349 818641 823073 813157 794209 772152 750751 732781 720494 714331 713255
59396 713255 716676 724123 732637 736369 729947 711886 684950 654207 624541 598664 576831 558539
59384 558539 543909 532951 524540 517441 511765 508213 506395 505170 504266 504233 505104 506323 507828 510032 512937
59369 512937 516279 520399 525914 532702 540058 547525 554734 560957 565967 570958 577369 585043 592678 599900
59355E99900P754Q923R628R770J0076J0757J1417J1850J2234J2795J3676J4807
59343G33587J5882J6795J7898J9167J9583J8366J6259J4463J2789J0322P426N230
59331I07767L472Q42k519m983o136p447r775j2141j3638j4672j5569j5627j4564
59318G95010j3358j2842j2658j2281j1841j1376j0506r347q523p883o616m877
59306F72902l817l548k798j094L58P25Q71J770L007L799M310N097O331Q271J1337
59291G07521J5114J8285K0354K2322K5039K7621K7943K3994J4889J861j1390k0724
59279H72829k4563k4314k1931j8344j4180j0365p384n003l059j574j29J687L308
59266G46978L928L964M393M887M313K799J432R1k334n571p999r264j0669j2560
$$ plain form
59355 599900 607654 616577 626205 635975 646051 656808 668225 680075 692309 705104 718780 733587
59343 733587 749469 766264 784162 803329 822912 841278 857537 872000 884789 895111 902537 907767
59331 907767 911239 912081 909562 904579 898443 890996 881221 869080 855442 840770 825201 809574 795010
59318 795010 781652 768810 756152 743871 732030 720654 710148 700801 692278 684395 677779 672902
59306 672902 669085 665537 662739 661645 662003 662728 663599 665369 668376 672175 676485 681582 687913 696184 707521
59291 707521 722635 740920 761274 783596 808635 836256 864199 888193 903082 904943 893553 872829
59279 872829 848266 823952 802021 783677 769497 759132 751748 746745 743686 742112 741983 743670 746978
59266 746978 750906 754870 759263 764150 768463 771262 772694 772785 770451 764880 756881 747617 736948 724388
59252G24388j3630j3332j2834j2771j2131j0306q392p493p309p204p086o595n019
59239F00286k701j001l19L02J281J956K298L180M459M740L749K938L009K770J322
59224F28269m80j617k304k976l503m034n010n821n223l559k670l119l537l164
59210E81252k858k935k303o10Q64J375J729K403K710K598L030L920M003L419L917
59195F02514N577O116M562K883K662K895K563K678L977N198N430N844P186P988
59181F68073P173O126O134O111M934L786L841L820K343P10P33J547J230R5j55
59166G16501O32J423K132L157L859L633L419M153M816M063K546J576O93j223l496
59151G47884m594m696n229o436p345p585p480o955n897m937m586m281l557l049
$$ plain form
59252 724388 710758 697426 684592 671821 659690 649384 640992 633499 626190 618986 611900 605305 600286
59239 600286 597585 596584 596265 596567 597848 599804 602102 605282 609741 614481 618230 621168 624177 626947 628269
59224 628269 627789 626172 623868 620892 617389 613355 608345 602524 597301 593742 591072 587953 584416 581252
59210 581252 578394 575459 573156 572546 573410 574785 576514 578917 581627 584225 587255 591175 595178 598597 602514
59195 602514 608091 614207 618769 621652 624314 627209 629772 632450 636427 641625 647055 652899 660085 668073
59181 668073 675246 681372 687506 693617 698551 702337 706178 709998 712341 713051 713784 715331 716561 716656 716501
59166 716501 717133 718556 720688 723845 727704 731337 734756 738909 743725 747788 750334 751910 752603 751380 747884
59151 747884 743290 738594 733365 726929 719584 711999 704519 697564 691667 686730 682144 677863 674306 671257
59137F71257l156k885j548l08n38j655k106j455j57J562L218L729K915K192K559
59122F73624L276L647M318N526N956N066M547N671P044O996O396O796P532P071
59108G53466N794N037M575L470K241J894J831R18l50r11j240k354l666m055l978
59093G62672m494n203n161m776m771m412k928j498j616k551k684k292k746l940
59079G13600m889n871p640r341r550q741q481q856q757q019p296o534n410m498
59065F09717m220l703k367j370j597j797q33j08j247k889k653r96j60m33m13p6
59049E84855m71j047k69J466K316K008J723J564P13l77n17p9k27m97K84J333R38
59032E93716m32q24j23J47j18L55J452J900K042L482O034P852Q554R425J0577
$$ plain form
59137 671257 668101 665216 663668 663360 662822 661167 659061 657606 657449 659011 662229 665958 668873 671065 673624
59122 673624 676900 680547 684865 690391 696347 701413 705960 711631 718675 725671 732067 738863 746395 753466
59108 753466 759260 764297 768872 772342 774583 776477 778308 779226 778876 777965 776725 774371 770705 766650 762672
59093 762672 758178 752975 747814 743038 738267 733855 730927 729429 727813 725262 722578 720286 717540 713600
59079 713600 708711 702840 695200 685859 676309 667568 659087 650231 641474 633455 626159 619625 614215 609717
59065 609717 605497 601794 599427 598057 596460 594663 593830 593722 592475 589586 586933 585937 585777 585344 584931 584855
59049 584855 584384 583337 583068 584534 586850 588858 590581 592145 592858 592481 591964 591885 591658 591161 591445 592778 593716
59032 593716 593284 592460 592337 592484 592366 592721 594173 596073 598115 601597 607631 615483 624037 633462 644039
59017F44039J0696R751R141Q935P700N259L055J497m35k615l434k527j418r84
59003F88660n04L61R69J395K569M303N188M918M720N138N324M770L944K988J583
58988G36326J36n77r39j905l241m079m764o121p365p019n501m522m204l187j333
58973F81705J59J216K980N438P291Q283R437J0953J1976J2350J2609J2453J1336
58960G88186J0107R956J0163R218P500O365N273K632j067l919n967q818j2257
58947H17372j4364j4888j5393j6079j5624j4114j3027j2227j0222p570o594p408
58935F69862p587o258n165n122m719l383k452k334j714m79l27j545k175j392p07
58920F24503q30m07R81J548M08p99o92l4L71J046J997K064J325J611L513N290
$$ plain form
59017 644039 654735 664486 673627 682562 690262 695521 698576 700073 699638 697023 693589 691062 689644 688660
59003 688660 688156 688517 689486 690881 693450 697753 702941 707859 712579 717717 723041 727811 731755 734743 736326
58988 736326 736462 735885 734946 733041 729800 725721 720957 714836 707471 700452 694951 690429 686225 683038 681705
58973 681705 681864 683080 686060 691498 698789 707072 716509 727462 739438 751788 764397 776850 788186
58960 788186 798293 808249 818412 827630 835130 841495 846768 849400 848333 844414 838447 829629 817372
58947 817372 803008 788120 772727 756648 741024 726910 713883 701656 691434 683864 677270 669862
58935 669862 662275 656017 650852 645730 641011 637628 635176 632842 631128 630649 630322 628777 626602 625210 624503
58920 624503 623673 623266 624247 625795 626203 625404 624712 624678 625049 626095 628092 630156 631481 633092 636605 641895
58904F41895N889O496P968R345J0124J1417J3550J4958J4850J4570J5009J5050
58892G81121J3936J2929J3148J3899J4520J5754J7971K0006K1019K1638K2147
58881I68088K1529J9322J6543J3802J0407O242K438o57m116q246j1854j4459j6909
58868A002130j9127j9690j8449j7230j6934j6379j4873j3529j2929j2110j0862
58857H30018j0602j1758j2674j2370j1981j2361j2609j2131j1888j2339j2374
58846F96931j1374j0201r254p815o141n651o227n982m595m088n206n993n251m506
58832F04647n031n677n236m440m000l193j841j252j764j814p46K8j06K69J582
58817E71426K051R87M55J811L425L688L553M158M608M108L716M126M137L163K637
$$ plain form
58904 641895 647784 654280 662248 671593 681717 693134 706684 721642 736492 751062 766071 781121
58892 781121 795057 807986 821134 835033 849553 865307 883278 903284 924303 945941 968088
58881 968088 989617 1008939 1025482 1039284 1049691 1055933 1058371 1057714 1053598 1045352 1033498 1019039 1002130
58868 1002130 983003 963313 944864 927634 910700 894321 879448 865919 852990 840880 830018
58857 830018 819416 807658 794984 782614 770633 758272 745663 733532 721644 709305 696931
58846 696931 685557 675356 666102 658287 652146 646495 640268 634286 629691 625603 620397 614404 609153 604647
58832 604647 599616 593939 588703 584263 580263 577070 575229 573977 572213 570399 569653 569681 569575 569844 571426
58817 571426 573477 574464 574919 576730 580155 583843 587396 591554 596162 600270 603986 608112 612249 615412 618049
58802F18049L130K811P30j168j373j347k523l531k945k109k678l625l364k663
58788E97394k855l192k417j121k68P63K432L358K605J743K481M056N014N586O242
58773F21821N916L922J716O78l6j540l098l870m619n813o202n276m771n659o083
58758E87086m570k876l119m306m334l324k446j344O01K247K424K074K450K872
58744E73435K432K120L071M454N122N556O299O449N611N218O042O630O096N952
58730F44487P079P584N989L993L577L904L553L272L937M346L703L638N060N759
58716G09881M154K631L863O367P169O547O524O772N640L537J878K09k388m830
58702G57954n921p019r739j2810j4278j4888j6280j7673j7481j6416j5903j5331
$$ plain form
58802 618049 621179 623990 624720 623552 622179 620832 618309 614778 611833 609724 607046 603421 600057 597394
58788 597394 594539 591347 588930 587809 587541 588304 590736 594094 596699 598442 600923 604979 609993 615579 621821
58773 621821 627737 631659 633375 634053 634017 632477 629379 625509 620890 615077 608875 603599 598828 593169 587086
58758 587086 582516 579640 576521 572215 567881 564557 562111 560767 561368 563615 566039 568113 570563 573435
58744 573435 575867 577987 581058 585512 590634 596190 602489 608938 614549 619767 625809 632439 638535 644487
58730 644487 651566 659150 665139 669132 672709 676613 680166 683438 687375 691721 695424 699062 704122 709881
58716 709881 714035 716666 720529 726896 734065 740612 747136 753908 759548 763085 764963 765172 762784 757954
58702 757954 752033 745014 735275 722465 708187 693299 677019 659346 641865 625449 609546 594215
58690E94215j3767j2403j2225j1528q888o321o097o776n934m497m614n403m892
58677D90870m037m700n498l922r49O74J101K217L403K915K052L486O451P950P831
58662E09844Q392R752R800Q189O386M397J278j774k763k596l665n485n655m453
58648E31647m467o050p013o585o039n662m618l472l475l805k763j008l81k65J245
58633D77289L475M173L680M305O013O499N231L884K956J469k65q04l52k65l02
58618E16986P60K398L300M106O140Q323Q676P849P825Q170O978M596K859J620
58604E90586m51k599l103k648l052l690k817j308j312k291k182j379j654k276
58590E59824j243P24J444J452K792M831N521N695P645J0518J1561J1031J1251
$$ plain form
58690 594215 580448 568045 555820 544292 535404 529083 522986 516210 510276 505779 501165 495762 490870
58677 490870 486833 482133 476635 472713 471764 472438 473539 475756 479159 482074 484126 487612 494063 502013 509844
58662 509844 518236 527988 537788 545977 552363 556760 558038 556264 553501 550905 547240 541755 536100 531647
58648 531647 527180 521130 514117 507532 501493 495831 491213 487741 484266 480461 477698 476690 476309 476044 477289
58633 477289 480764 484937 488617 492922 498935 505434 510665 514549 517505 518974 518709 517905 517553 517288 516986
58618 516986 517746 520144 523444 527550 533690 542013 550689 558538 566363 574533 581511 586107 588966 590586
58604 590586 590135 587536 584433 581785 578733 575043 572226 570918 569606 567315 565133 563754 562100 559824
58590 559824 558581 559305 560749 562201 564993 569824 575345 581040 588685 599203 610764 621795 633046
58577F33046J1741J0074O841M912M437L252J696K093L941M534M083N362Q491J0955
58563G15458J2561J5457J9247K1025K0490K0304K1086K0594J8122J5285J2388
58552I12017Q295L780P59j525n090q631r099p301o863p995p578n353m546o163
58538H54707p906r073j1373j4426j5617j4925j4982j5990j5503j3503j2560j2646
58526F96203j1020p656n581n329m272j958q37j172m84J330J596K07P9J656K208
58511F64970J233J223K468K487J255J498L098K768Q6j710j706k425m177m158k157
58496F64753j348k387k426j038j141k932k990p20L98n85l84K010L310K254K012
58481F58786M240O471P345Q815J1381J2678J2412J3128J4641J3600R964P691P522
$$ plain form
58577 633046 644787 654861 661702 666614 671051 674303 675999 678092 682033 686567 690650 696012 704503 715458
58563 715458 728019 743476 762723 783748 804238 824542 845628 866222 884344 899629 912017
58552 912017 920312 924092 924851 923326 918236 909605 900506 893205 886342 878347 870769 865416 860870 854707
58538 854707 846801 837728 826355 811929 796312 781387 766405 750415 734912 721409 708849 696203
58526 696203 685183 677527 671946 666617 662345 660387 659550 658378 657894 659224 660820 661027 661106 662762 664970
58511 664970 666203 667426 669894 672381 673636 675134 678232 681000 681086 679376 677670 675245 671068 666910 664753
58496 664753 663405 661018 658592 657554 656413 653481 650491 649771 650169 649584 649200 651210 654520 656774 658786
58481 658786 663026 669497 676842 685657 697038 709716 722128 735256 749897 763497 773461 781152 788674
58468G88674N596R73k173k078k345m933o698n623m268m253l388r26L45k13O63
58453G59353L799N612M895N152P609Q446N796L012K083K98l571o270o347o961
58439G82906r339r945p346n237n416m480q92J569R83R93L562N022L357K505N082
58424G63324P622P519P860J0732J2431J0247P625P575P258M148J290J320J213
58411H50164j745m613m543m172o141p868o855n664o603o949m422j989k295k701
58397G83604n37J965K544L165N070N354K820J307K814L564J236m37J107K236L68
58382H16180p51J663L740K176M52K110M336M134M374P741J0980J1101J1039J3322
58368H92597J4627J2406J0378J1541J2391J0095Q477J0655J2728J1194R701J1827
$$ plain form
58468 788674 794270 795243 793070 790992 788647 783714 777016 771393 767125 762872 759484 758558 758903 758690 759353
58453 759353 763152 768764 773659 778811 786420 794866 800662 803674 805757 806055 802484 796214 789867 782906
58439 782906 773567 763622 756276 751039 745623 741143 740251 741820 742803 743796 747358 752380 755737 758242 763324
58424 763324 770946 778465 786325 797057 809488 819735 827360 834935 842193 846341 847631 848951 850164
58411 850164 848419 843806 839263 835091 828950 821082 814227 808563 801960 795011 790589 788600 786305 783604
58397 783604 783067 785032 787576 790741 795811 801165 803985 805292 808106 811670 812906 812469 813576 815812 816180
58382 816180 815429 817092 820832 823008 823460 825570 829906 834040 838414 846155 857135 868236 879275 892597
58368 892597 907224 919630 930008 941549 953940 964035 972512 983167 995895 1007089 1016790 1028617
58356A028617J4164J3179J1978J3394J3522R139M540L975M385K551J943N187P466
58343A134040N113L048N772Q841P488N798Q591J1987J1151R775J2581J5845J4804
58330A254834J3190J5689J8259J5839J2506J3902J6504J4581J0977J0800J1219
58319A408300P848M431N816Q112O200M065P054J1040J0188Q344J1466J5853J5345
58306A524062J3218J5293J8238J6632J4530J7879K2422K1510J8982K1701K6263
58295A730730K5901K3705K5917K9068K6998K3780K6117K9911K8021K4294K5960
58284B020402K9307K7289K4082K7212L2391L1442K8158L0673L5212L3524K9554
58273B349246L2263L8597M0154M0069M6353N5131N7718N7677O3514P1213P1787
$$ plain form
58356 1028617 1042781 1055960 1067938 1081332 1094854 1103993 1108533 1112508 1116893 1119444 1121387 1126574 1134040
58343 1134040 1139153 1142201 1147973 1156814 1164302 1170100 1178691 1190678 1201829 1211604 1224185 1240030 1254834
58330 1254834 1268024 1283713 1301972 1317811 1330317 1344219 1360723 1375304 1386281 1397081 1408300
58319 1408300 1416148 1420579 1426395 1434507 1440707 1444772 1451826 1462866 1473054 1481398 1492864 1508717 1524062
58306 1524062 1537280 1552573 1570811 1587443 1601973 1619852 1642274 1663784 1682766 1704467 1730730
58295 1730730 1756631 1780336 1806253 1835321 1862319 1886099 1912216 1942127 1970148 1994442 2020402
58284 2020402 2049709 2076998 2101080 2128292 2160683 2192125 2220283 2250956 2286168 2319692 2349246
58273 2349246 2381509 2420106 2460260 2500329 2546682 2601813 2659531 2717208 2780722 2851935 2923722
58262B923722O9252P2879P8734P7572P3902P7893Q5525Q6516Q4636Q9744R7257
58251C817632R6687R3120R8337J07969J09953J08237J14834J25832J29380J30101
58241D932082J40605J56146J63328J66645J79795J98125K07388K12402K28277
58232F584793K50464K63376K71527K91124L17966L35896L49875L77046M12292
58223I454359M37903M60182M99427N50727N93615O33544O92699P66554Q33098
58214A4922108Q98783R89312J100951J209791J324106J475838J665333J869641
58206B5455863K101267K399490K767102L179035L650368M226530M908499N664409
58198E4352563O516475P535074Q748592J0155782J1831907J3910705J6441829
$$ plain form
58262 2923722 2992974 3065853 3144587 3222159 3296061 3373954 3459479 3545995 3630631 3720375 3817632
58251 3817632 3914319 4007439 4105776 4213745 4323698 4431935 4546769 4672601 4801981 4932082
58241 4932082 5072687 5228833 5392161 5558806 5738601 5936726 6144114 6356516 6584793
58232 6584793 6835257 7098633 7370160 7661284 7979250 8315146 8665021 9042067 9454359
58223 9454359 9892262 10352444 10851871 11402598 11996213 12629757 13322456 14089010 14922108
58214 14922108 15820891 16810203 17911154 19120945 20445051 21920889 23586222 25455863
58206 25455863 27557130 29956620 32723722 35902757 39553125 43779655 48688154 54352563
58198 54352563 60869038 68404112 77152704 87308486 99140393 113051098 129492927
58191A29492927J9377153K2699136K6391173L0211711L3627378L5974251L6421345
58184C34195074L3692849K6323177J3879826j870413j7355908k9129160l5616501
58177C24118944l7284367l5565129l1833577k7098110k2105244j7388763j3216402
58170A39627352r658399o847922n168327n033301o357092q316043r816423j0256106
58162G8173739r774965q830783p727487o581643n503017m600099l874289l257012
58154B8024444k731631k325602k017351j747502j504132j315477j173341j038115
58146A4171293r08023q14505p55974o98190o34677n89358n63013n30276m87449
58137H189828m54201m29861l93923l48307l15629k96707k70783k36650k13938
$$ plain form
58191 129492927 148870080 171569216 197960389 228172100 261799478 297773729 334195074
58184 334195074 367887923 394211100 408090926 406220513 388864605 359735445 324118944
58177 324118944 286834577 251269448 219435871 192337761 170232517 152843754 139627352
58170 139627352 129968953 123121031 117952704 112919403 106562311 98246268 88429845 78173739
58162 78173739 68398774 59567991 51840504 45258861 39755844 35155745 31281456 28024444
58154 28024444 25292813 22967211 20949860 19202358 17698226 16382749 15209408 14171293
58146 14171293 13263270 12448765 11692791 10994601 10359924 9770566 9207553 8677277 8189828
58137 8189828 7735627 7305766 6911843 6563536 6247907 5951200 5680417 5443767 5229829
58128E229829k04499j90919j73149j69292j78994j81568j72062j65702j65084
58119C628560j55930j37613j26188j23911j15783r9449q9651q9665q6196p6189
58109B527985p1871p5297p3786o4673n9837o1656n8575m8511m3292m5632m4478
58098A880377l7410l5416m0897m2607l7317l5586m0970m3564l9386l6912l9196
58087A451116l8201l1961k9320l2596l2944k7730k5407k8534k8757k3450k0781
58076A131435k3380k3250j7817j5244j8648k0323j6852j5005j7582j7927j3642
58065I31765j1620j4367j5091j1261r509j2216j2600q164n861q873j0995r159
58053H02049q997j2882j4763j1979j0305j2304j2362q213n806p738q199m436k131
$$ plain form
58128 5229829 5025330 4834411 4661262 4491970 4312976 4131408 3959346 3793644 3628560
58119 3628560 3472630 3335017 3208829 3084918 2969135 2869686 2780035 2690370 2604174 2527985
58109 2527985 2456114 2380817 2307031 2242358 2182521 2120865 2062290 2013779 1970487 1924855 1880377
58098 1880377 1842967 1807551 1766654 1724047 1686730 1651144 1610174 1566610 1527224 1490312 1451116
58087 1451116 1412915 1380954 1351634 1319038 1286094 1258364 1232957 1204423 1175666 1152216 1131435
58076 1131435 1108055 1084805 1066988 1051744 1033096 1012773 995921 980916 963334 945407 931765
58065 931765 920145 905778 890687 879426 869917 857701 845101 836937 831076 822203 811208 802049
58053 802049 793052 780170 765407 753428 743123 730819 718457 710244 704438 696700 688501 684065 681934
58040F81934m380o183m796m891q555j0602q645p607r687j0105p284o825j0658
58027E81716j2638r783p620r479j0640q257o994r367j0392p380n525q012r794
58014D65835o990l677l625l855j935j365m047n532l205j333k754l548j044Q18
58000D23743n31j002K152M834M039L615O483Q612O512L613L481L507R46j410j027
57985D67567o88k550l542j750q62l224m997l375k044m179o411n267l343l633l716
57970D17986j151J107K33j069O0J320L04n68Q18J767L22l04K092L783J674q64
57954D27510p9J610O98r97o01P2j376k686j258P74R11J203L689N550M074J944
57938D41038K381L383K113O23J830L968M310M377O190P350N234K231J522J466
$$ plain form
58040 681934 677554 671371 666575 661684 653129 642527 633882 626275 616588 606483 599199 592374 581716
58027 581716 569078 559295 551675 542196 531556 523299 516305 506938 496546 489166 483641 475629 465835
58014 465835 458845 455168 451543 447688 445753 444388 440341 434809 431604 430271 427517 423969 422925 423743
58000 423743 423212 422210 424362 429196 433235 436850 443333 451945 458457 462070 465551 469058 470004 468594 467567
57985 467567 466879 464329 460787 459037 458175 454951 449954 446579 444535 440356 433945 428678 425335 421702 417986
57970 417986 416835 417942 418175 417106 417166 418486 418790 418222 419040 420807 421129 420825 422917 426700 428374 427510
57954 427510 427431 429041 429739 428742 428141 428213 426837 424151 422893 423667 424578 425781 429470 435020 439094 441038
57938 441038 443419 446802 448915 449538 451368 455336 459646 464023 470213 477563 482797 485028 486550 488016
57924D88016n80k663j955n08j748m345m988m317m923o207o162n789p012q727r137
57909D18955r365j0681j1056q531n081l267k248q17p82l216n071l877k159k854
57895C49950m070k987j245j508k161n51J718J761O80R06J318p6j524n85R89L53
57879C42968j164p67N53L22n71k14j33k398m870m499k804l084m520m310l232l803
57863C07474n000m195k479k705l996l376j388q75j568j006M41M34n12J05K056
57848B83410L029L089M101N708O040N466N624N886M750L367L731M772M251K913
57834C46137K691K526L41k446k934j780j712k422j577L01P30K5N55K116K517K027
57818C47095K762M319M348K902K089K096J526R19J786K946J999k66j108o81j496
$$ plain form
57924 488016 487436 484773 482818 482310 480562 476217 471229 466912 461989 455782 449620 443831 436819 428092 418955
57909 418955 409590 398909 387853 379322 374241 370974 368726 367909 367127 363911 358840 354963 352804 349950
57895 349950 345880 342893 341648 340140 337979 337428 339146 340907 341587 342493 343811 343735 342211 341626 342615 342968
57879 342968 341804 341037 341590 341912 341341 341127 340994 338596 333726 329227 326423 323339 318819 314509 311277 307474
57863 307474 302474 298279 295800 293095 289099 285723 284335 283460 281892 280886 281327 281761 281249 281354 283410
57848 283410 286439 289528 293629 299337 305377 310843 316467 322353 327103 330470 334201 338973 343224 346137
57834 346137 348828 351354 351695 349249 346315 344535 342823 340401 338824 339125 339855 339880 340435 342551 345068 347095
57818 347095 349857 354176 358524 361426 363515 365611 367137 368056 369842 372788 374787 374521 373413 372732 371236
57803C71236l679n046n374o318p537p107n588n536p180q322q314q387q359o870
57789B77619m594l544l469k446n74M75R06K139L408K901J637K241M384N388M910
57774B91381N039O105O450O100O653P696P225N562N017N728N564M038K631J516
57760C66705l49k229k564k431m151o890p769o988p389r128r438p876p183q292
57746B84028q875p706o305n351l488o65J121J429K143L751M409L526K841L050
57732B73908K756J655J377K325K855K382K184K492J982P16L95J100J050L5k18
57717B96994M86L64p39r10J16L22p64j207m30k85j379j887r93j69K3R45K691L262
57699B96440K201J729K997M345M512M445M732M335L041K197J884M17k311m131
$$ plain form
57803 371236 367557 362511 357137 350819 343282 336175 330587 325051 317871 309549 301235 292848 284489 277619
57789 277619 273025 269481 266012 263566 262992 263467 264373 266512 269920 272821 274458 276699 281083 286471 291381
57774 291381 296420 302525 308975 315075 321728 329424 336649 342211 347228 352956 358520 362558 365189 366705
57760 366705 366356 364127 361563 359132 354981 348091 340322 333334 325945 316817 307379 299503 292320 284028
57746 284028 275153 267447 261142 255791 252303 251638 252759 254188 256331 260082 264491 268017 270858 273908
57732 273908 276664 278319 279696 282021 284876 287258 289442 291934 293916 294632 295027 296127 297177 297212 296994
57717 296994 297480 297844 297105 296195 296311 296633 295869 294662 294232 293947 292568 290681 289688 289519 289542 290487 293178 296440
57699 296440 298641 300370 303367 307712 312224 316669 321401 325736 328777 330974 332858 333275 330964 326833
57685C26833m226m244m768m100j789M0M21J271L800O476Q206J0421J4181J8264
57671C70786K1936K6696L3435M0637M7173N4012O1281O6176O5512N7872M2090
57660H87606J7252j3377m1485n9763o7244o7150o2180n4123m5358l7595l0481
57649D26102k3572j8163j5249j3395j0665p261m574k949k007j741j899j546m87
57636C22594K48J66N8K84J84j59L09J309J081n61j492o89J61l66j349j748k146
57619C17884k814k583j270p41j919l027k512j406j108j124p82q65j725j903n31
57604B93574J003J421J463J776J295m12j557q26M55P73P91J291J148m01j703j286
57588B98805m39q76j867k033j960k531k632j218J90k29j453j458p12r82j992k156
$$ plain form
57685 326833 322607 318363 313595 309495 307706 307746 308167 309438 313238 319714 327920 338341 352522 370786
57671 370786 392722 419418 452853 493490 540663 594675 655956 722132 787644 845516 887606
57660 887606 904858 891481 849996 790233 722989 655839 593659 539536 494178 456583 426102
57649 426102 402530 384367 369118 355723 345058 337797 333223 330274 328267 326526 324627 323081 322594
57636 322594 322842 323008 323066 323350 323534 323375 323684 324993 326074 325513 324021 323332 323493 323127 321778 320030 317884
57619 317884 315070 312487 311217 310476 308557 305530 303018 301612 300504 299380 298598 297733 296008 294105 293574
57604 293574 294577 295998 297461 299237 300532 300120 298563 297737 298192 298965 299756 301047 302195 301794 300091 298805
57588 298805 298366 297490 295623 293590 291630 289099 286467 285249 285439 285210 283757 282299 281587 280605 278613 276457
57572B76457j617j767k484k403j410o09l40k58o36j726k560k165j175n38J96J579
57556B58544K536J958Q93J030K032K451K258K369K613K378K341L357M368L664
57542B92792J653L07L20P61J104J681K412K819K941K921K308J125P24J929L279
57527C19076K833R93l17m51l14m05m04k79k66j47K26L56J63O26K136L361L166
57510C30353K484K688L352L350K912K716K149N09j061j051j04j7r00j421j193
57495C44766q93o22l8L55o5n67j57O06O31L87J029K139K401J966K018K522K463
57478C58941J969K188L221M039M196L913K905R01j057j558q71k69J38J138K427
57463C82221K873K513K414K714K553J866J537J861K330K792L384L621K981K098
$$ plain form
57572 276457 274840 273073 270589 268186 266776 266167 265827 265569 264933 263207 260647 258482 257307 256769 256965 258544
57556 258544 261080 263038 263931 264961 266993 269444 271702 274071 276684 279062 281403 284760 289128 292792
57542 292792 294445 294752 295072 295833 296937 298618 301030 303849 306790 309711 312019 313144 313868 315797 319076
57527 319076 321909 322902 322585 322134 321820 321415 321011 320732 320466 320319 320545 320901 321064 321690 323826 327187 330353
57510 330353 332837 335525 338877 342227 345139 347855 350004 350513 349452 348401 348297 348280 347380 345959 344766
57495 344766 343873 343251 343213 343568 343503 342936 342779 343385 344016 344403 345432 347571 349972 351938 353956 356478 358941
57478 358941 360910 363098 366319 370358 374554 378467 381372 382273 381216 379658 378787 378518 378656 379794 382221
57463 382221 385094 387607 390021 392735 395288 397154 398691 400552 402882 405674 409058 412679 415660 417758
57449D17758J931K267K270K016J999J897J358J231K281L526L647L232L645M473
57435D53531M355L663L975N207N652M727L600L093K991L299M164M638L557J614
57421E08066P14J319K256K880L520L980L667L119L401M053L601K097J176J648
57407E45497K881M352N875O531N571M203M293N449N669M698M214M728M964M584
57393F13509M792N709N796M682M068M882N827N801N631O299P329P997Q476Q804
57379F99602Q356P189O361O224N952N331N208N658N576M835M831O016O920O636
57365G84695O341P104Q064Q123P856Q152Q456P886O970O793P253P539P609Q016
57351H90857Q803R496R806R724R423R337R663R699Q651P195O913P954Q689Q088
$$ plain form
57449 417758 419689 421956 424226 426242 428241 430138 431496 432727 435008 438534 442181 445413 449058 453531
57435 453531 457886 461549 465524 470731 476383 481110 484710 487803 490794 494093 498257 502895 506452 508066
57421 508066 508780 510099 512355 515235 518755 522735 526402 529521 532922 536975 540576 542673 543849 545497
57407 545497 548378 552730 558605 565136 570707 574910 579203 584652 590321 595019 599233 603961 608925 613509
57393 613509 618301 624010 629806 634488 638556 643438 649265 655066 660697 666996 674325 682322 690798 699602
57379 699602 707958 715147 721508 727732 733684 739015 744223 749881 755457 760292 765123 771139 778059 784695
57365 784695 791036 798140 806204 814327 822183 830335 838791 846677 853647 860440 867693 875232 882841 890857
57351 890857 899660 909156 918962 928686 938109 947446 957109 966808 975459 982654 989567 997521 1006210 1014298
57337A014298P044O796P400Q381R454J0051R497Q344Q164R297J0229R922R318
57324A128195R655J0651J1397J1826J2192J2217J1747J1408J1698J2177J2244
57313A255407J1944J1466J0790J0288J0614J1526J1976J1836J2229J3568J4663
57302A386307J4574J4053J4237J5063J5833J6266J6191J5303J4092J3944J5461
57291A551324J7588J9148K0211K1285K2136K2349K2194K2223K2642K3434K4269
57280A788803K4188K2634K0855K0816K2378K3359K2741K1849K1664K1214J9705
57269B030206J8224J7771J7434J6221J5022J5007J5495J5286J4764J4879J5156
57258B205465J4695J4139J4661J5753J6044J5710J6141J7640J9243K0475K1569
$$ plain form
57337 1014298 1021342 1028138 1035538 1043919 1053373 1063424 1072921 1081265 1089429 1098726 1108955 1118877 1128195
57324 1128195 1137850 1148501 1159898 1171724 1183916 1196133 1207880 1219288 1230986 1243163 1255407
57313 1255407 1267351 1278817 1289607 1299895 1310509 1322035 1334011 1345847 1358076 1371644 1386307
57302 1386307 1400881 1414934 1429171 1444234 1460067 1476333 1492524 1507827 1521919 1535863 1551324
57291 1551324 1568912 1588060 1608271 1629556 1651692 1674041 1696235 1718458 1741100 1764534 1788803
57280 1788803 1812991 1835625 1856480 1877296 1899674 1923033 1945774 1967623 1989287 2010501 2030206
57269 2030206 2048430 2066201 2083635 2099856 2114878 2129885 2145380 2160666 2175430 2190309 2205465
57258 2205465 2220160 2234299 2248960 2264713 2280757 2296467 2312608 2330248 2349491 2369966 2391535
57247B391535K2253K1986K1305K1388K2278K2873K2652K2169K1978K2153K2784
57236B635354K3798K4519K4486K4403K5198K6491K7200K7339K7806K8571K8572
57225B923737K7521K6453K6189K6361K6277K5863K5392K5108K5319K6154K7118
57214C211492K7494K7246K6939K6859K6774K6603K6525K6444K5980K5088K4139
57203C501583K3319K2485K1632K1027K0807K0873K1175K1783K2612K3420K4028
57192C744744K4401K4629K4917K5367K5732K5641K5125K4486K3741K2762K1955
57181D013500K1921K2306K1976K0657J9380J8884J8641J8068J7587J7594J7482
57170D227996J6729J6008J6026J5991J4729J2764J1799J2279J2865J2485J1677
$$ plain form
57247 2391535 2413788 2435774 2457079 2478467 2500745 2523618 2546270 2568439 2590417 2612570 2635354
57236 2635354 2659152 2683671 2708157 2732560 2757758 2784249 2811449 2838788 2866594 2895165 2923737
57225 2923737 2951258 2977711 3003900 3030261 3056538 3082401 3107793 3132901 3158220 3184374 3211492
57214 3211492 3238986 3266232 3293171 3320030 3346804 3373407 3399932 3426376 3452356 3477444 3501583
57203 3501583 3524902 3547387 3569019 3590046 3610853 3631726 3652901 3674684 3697296 3720716 3744744
57192 3744744 3769145 3793774 3818691 3844058 3869790 3895431 3920556 3945042 3968783 3991545 4013500
57181 4013500 4035421 4057727 4079703 4100360 4119740 4138624 4157265 4175333 4192920 4210514 4227996
57170 4227996 4244725 4260733 4276759 4292750 4307479 4320243 4332042 4344321 4357186 4369671 4381348
57159D381348J1465J1782J1592J0164P865N801M760M399L677K103K09j308k449
57146D451408l616m976o499q062r199r253q107o260m000j147K083M859O931R088
57132D413250J1846J4434J5879J6325J6447J6260J5402J3996J2378J0443Q272
57121D564932O931P730J0913J5843K2105K9576L7828M6404N5518O5691P6839Q8459
57109E028769J00701J14634J31639J53057J80219K14224K55709L05382L64754
57100F849088M36153N22147O25113P46972Q89039J052341J238123J447466J680099
57091A5486541J933652K203613K482849K760735L023467L255754L442155L567064
57083C8155830L613742L562538L389683L071403K596005J976649J252234M73994
$$ plain form
57159 4381348 4392813 4404595 4416187 4426351 4434216 4440017 4444777 4449176 4452853 4454956 4455165 4453857 4451408
57146 4451408 4447792 4442816 4436317 4428255 4419056 4409803 4401696 4395436 4391436 4390289 4392372 4397231 4404162 4413250
57132 4413250 4425096 4439530 4455409 4471734 4488181 4504441 4519843 4533839 4546217 4556660 4564932
57121 4564932 4571863 4579593 4590506 4606349 4628454 4658030 4695858 4742262 4797780 4863471 4940310 5028769
57109 5028769 5129470 5244104 5375743 5528800 5709019 5923243 6178952 6484334 6849088
57100 6849088 7285241 7807388 8432501 9179473 10068512 11120853 12358976 13806442 15486541
57091 15486541 17420193 19623806 22106655 24867390 27890857 31146611 34588766 38155830
57083 38155830 41769572 45332110 48721793 51793196 54389201 56365850 57618084 58092078
57075E8092078l10273j062779j753995k360126k862452l246901l504524l634118
57067C9356910l644437l552538l379810l149217k883549k602826k322132k052127
57059A5770274j800635j572568j369227j189616j032580q96972p80579o80538
57051F447559n94681n21471m59042m05453l59554l20614k87428k58655k33591
57042C007070k11746j92282j74674j59235j45972j33675j21199j08934r7901q8114
57032A573338p8926p0377o2938n6398n0019m3348l6142k8047j8928q843K734J6545
57020A138651L2249M8972O7404Q9278J14287J39689J62362J76566J68758J22473
57010B260689L5912o7533j53247k00944k13681k05047j85127j59453j33172j10219
$$ plain form
57075 58092078 57781805 56719026 54965031 52604905 49742453 46495552 42991028 39356910
57067 39356910 35712473 32159935 28780125 25630908 22747359 20144533 17822401 15770274
57059 15770274 13969639 12397071 11027844 9838228 8805648 7908676 7128097 6447559
57051 6447559 5852878 5331407 4872365 4466912 4107358 3786744 3499316 3240661 3007070
57042 3007070 2795324 2603042 2428368 2269133 2123161 1989486 1868287 1759353 1661452 1573338
57032 1573338 1494412 1424035 1361097 1304699 1254680 1211332 1175190 1147143 1128215 1119372 1122106 1138651
57020 1138651 1170900 1219872 1287276 1376554 1490841 1630530 1792892 1969458 2138216 2260689
57010 2260689 2296601 2229068 2075821 1874877 1661196 1456149 1271022 1111569 978397 868178
57000H68178r0961p4244o0278m9537m0839l2772k5610k0214j6356j3446j1511
56989D32410j0271q654o294m169k866j622Q6J479J790J070j047n533j1889j7530
56975C66960k0414k0945k0343j8780j6214j3555j1560r707p318m787k681p14J456
56962B21398L482N267P517J0477J3253J5199J6716J7718J6473J1307K666p266
56950C34207j6208k2433k5017k4467k2358j9710j6444j2685r304o617l887p63
56938A54314K077M412P170J0842J4596J7829K1213K5154K8407K9230K6712K0254
56926C62210R421m332j7180k5749k9715l0684k9764k7475k4739k2224j9460j6003
56914A24306j2770j0949j0216r391q219p322o848o368n735n059m172k978j884
$$ plain form
57000 868178 777217 702973 642695 593158 552319 519547 493937 473723 457367 443921 432410
56989 432410 422139 413485 407191 403022 400156 398534 398620 400099 401889 402959 401912 396379 384490 366960
56975 366960 346546 325601 305258 286478 270264 256709 245149 235442 228124 223337 220656 219942 221398
56962 221398 224880 230147 237664 248141 261394 276593 293309 311027 327500 338807 341473 334207
56950 334207 317999 295566 270549 246082 223724 204014 187570 174885 165581 158964 155077 154314
56938 154314 156391 160803 167973 178815 193411 211240 232453 257607 286014 315244 341956 362210
56926 362210 371631 367299 350119 324370 294655 263971 234207 206732 181993 159769 140309 124306
56914 124306 111536 100587 90371 80980 72761 65439 58591 52223 46488 41429 37257 34279 32395
56901C2395j177n79M1K31n3R6J265K796M015N453P902J1058J4198J7422K1070
56886A16133K4541K6841K7735K7292K4763J9186J1034K437m253p817q499p551
56874B51842o103m224j459J880M866P465J0657J4735J8809K2479K6649L1983L7792
56861D17371M3214M8208N2562N4920N3547M6950L3670J3546r805k9695m1334m5104
56849F38050m4097m0198l4031k6759j9593j2412m717K884R764J6853K5363L4789
56837E45896M3910N2933O2806P2992Q1564Q6698Q6178P6339N4192K1245j6039
56826A168714m9752p4030q6427q8120q2944p4624o4638n3180m1231l0273k0616
56815E02879j1635l230M459J2289K1383L1308M0523M8397N5238O0336O1290N5404
$$ plain form
56901 32395 31218 30639 30680 30911 30858 30954 32219 35015 39030 44483 52385 63443 77641 95063 116133
56886 116133 140674 167515 195250 222542 247305 266491 277525 279962 275709 267892 259393 251842
56874 251842 245739 241515 240056 241936 246802 254267 264924 279659 298468 320947 347596 379579 417371
56861 417371 460585 508793 561355 616275 669822 716772 750442 763988 754183 724488 683154 638050
56849 638050 593953 553755 519724 492965 473372 460960 456243 459127 468891 485744 511107 545896
56837 545896 589806 642739 705545 778537 860101 946799 1032977 1109316 1163508 1184753 1168714
56826 1168714 1118962 1044932 958505 870385 787441 712817 648179 594999 553768 523495 502879
56815 502879 491244 488014 492473 504762 526145 557453 597976 646373 701611 761947 823237 878641
56803H78641M1016J8249r866l7348n8182o9845p3472p1160o4586n5614m6282l7613
56791D13938k9486k1774j4696q248k278K978P414J1782J6923K2529K7552L1262
56779D57896L2871L0745K3422J1251l749j9149l2331m0686m3341m2200l9859l6957
56767B97913l2860k8013k3773k0426j7285j4344j2154j0324q044n846n032n468
56755A14344n688n122m449l896k960j890j643k224k670k726k918k990k086n94
56741G2488no21j143q82o82j229j960k137j667n33J218K635K440R00k28M4J002
56724F9640J765K352K807K710K114J853K323K884K779J962Q33K3J95J208J722
56709I7170Q24m56n31L17M71l87j019q90p92j059j007m22LQ3M18J000J007L07
$$ plain form
56803 878641 919657 937906 928040 890692 832510 762665 689193 618033 553447 497833 451551 413938
56791 413938 384452 362678 347982 339734 337456 340434 347848 359630 376553 399082 426634 457896
56779 457896 490767 521512 544934 556185 552436 533287 500956 460270 416929 374729 334870 297913
56767 297913 265053 237040 213267 192841 175556 161212 149058 138734 130690 124844 119812 114344
56755 114344 108656 103534 99085 95189 92229 90339 88696 86472 83802 81076 78158 75168 73082 72488
56741 72488 72483 71862 70719 69837 69155 67926 65966 63829 62162 61629 62847 65482 67922 68822 68594 68638 69640
56724 69640 71405 73757 76564 79274 81388 83241 85564 88448 91227 93189 94022 94045 94240 95448 97170
56709 97170 97994 97538 97007 97324 97795 97408 96389 95499 94707 93648 92641 92219 92222 92305 92723 93723 94730 95037
56691I5037k62k90k12j88k6m2n71q13K27J767K196J709J973L146L575K643J671
56674A11540J519J507J285J565K321K411J708J487J994J846P35L60J550K582J842
56659A36252J52q98j289j666j764j239p63r04j079p97o99j308j916j802j398j285
56643A17597j195r24r90j537j799j469j274j471j291o33o12j494j821p18P05J412
56627A02486K174L794N194M975L559K255J373P18P92J871K899K797K036J639J557
56612A40119J257J014J230J338O96j70m02j65m2J42Q05J610J966J898J585P88
56596A53669m29j219j013k94K52N21M40l00j433k100k144k211k248j473k40r2
56580A39686j224j788p10O47P75K24J95O02R20J453K386K963K834K817L274L317
$$ plain form
56691 95037 94775 94485 94273 94085 94059 94017 93446 92633 92860 94627 96823 98532 100505 103651 107226 109869 111540
56674 111540 113059 114566 115851 117416 119737 122148 123856 125343 127337 129183 129918 130278 131828 134410 136252
56659 136252 136404 135506 134217 132551 130787 129548 128785 127881 126802 126005 125306 123998 122082 120280 118882 117597
56643 117597 116402 115478 114488 112951 111152 109683 108409 106938 105647 105014 104402 102908 101087 100369 101074 102486
56627 102486 104660 108454 113648 118623 122182 124437 125810 126528 127320 129191 132090 134887 136923 138562 140119
56612 140119 141376 142390 143620 144958 145654 145484 145082 144917 144875 145017 145822 147432 149398 151296 152881 153669
56596 153669 153240 152021 151008 150714 150966 151487 151927 151627 150194 148094 145950 143739 141491 140018 139778 139686
56580 139686 138462 136674 135964 136611 137386 137610 137805 138407 139327 140780 143166 146129 148963 151780 155054 158371
56564A58371K789L119M923O622P033P353Q816J0244R978Q548P272N725K897l62
56550B43328k288k688k450j744n88j18j167k478k320j087l88m41k81K60O18Q08
56534B26976R76M84r16j978j656r11j078j630j384q12j077j814j930j801k522
56519B08927l736m239m078m167m462m300l834l533l066k241j938k490k467r97
56505A63379K76k92j365p27R97J492N58j19j56n26r97m02Q56J250Q26R14J516
56488A67480J485R49R72J141J50j428j660m69L09O2JN07N24j84n64m11p29j550
56470A66585j681q71k10q1L06J129J605J567J586J593J192J048J986L081K744
56455A81579J414Q32J106R43M74R89K079J922O02K03J203J683P49KN87J312Q30
$$ plain form
56564 158371 161160 164279 169202 175824 182857 190210 199026 209270 219248 227796 235068 240793 243690 243328
56550 243328 241040 238352 235902 234158 233570 233452 232285 229807 227487 226400 226012 225571 225290 225550 226168 226976
56534 226976 227952 228436 227520 225542 223886 222975 221897 220267 218883 218071 216994 215180 213250 211449 208927
56519 208927 205191 200952 196874 192707 188245 183945 180111 176578 173512 171271 169333 166843 164376 163379
56505 163379 163655 163363 161998 161271 162268 163760 164318 164199 164043 163517 162520 162118 162974 164224 165050 165964 167480
56488 167480 168965 169914 170886 172027 172177 170749 169089 168620 168929 168991 168992 169499 170023 169839 169275 168864 168135 166585
56470 166585 164904 164033 163823 163742 164048 165177 166782 168349 169935 171528 172720 173768 175754 178835 181579
56455 181579 182993 183825 184931 185874 186348 187337 189416 191338 191940 192143 193346 195029 195778 195780 196367 197679 198509
56438A98509m28j444j951j788o92O63J138R52J352K231K154R29O6K44N00K79J78
56421B02892J95n46j788k011r14L3R3K34R47J178L02p38j103j275j847k563l074
56404A90015l378l176k211j216j092j307p00N28J396K198L805N428N592M891N199
56389B05972O326O365N182M590M939M596L203K276K119J162q86k206j926j159
56375B40553l62J296L171L031Q44n06L76J251N1k037l023l001k819k223j075l67
56359B35160n20n21K8J37k95K78K222L504K707J085L04K51L67R99K074K445J795
56342B52020J309J484J384Q95J326K705L027J345p79k030l006l954l576j540L68
56327B50978J073J721K958L356K194J194J683K498K382K145K645K997K506K135
$$ plain form
56438 198509 198081 196637 194686 192898 192206 192869 194007 194959 196311 198542 200696 201625 201691 201935 202435 202714 202892
56421 202892 203087 202541 200753 198742 197828 197861 197954 198188 199135 200313 200615 199877 198774 197499 195652 193089 190015
56404 190015 186637 183461 181250 180034 178942 177635 176935 177463 178859 181057 184862 190290 195882 200773 205972
56389 205972 212298 218663 223845 228435 233374 237970 241173 243449 245568 246730 245844 243638 241712 240553
56375 240553 240191 241487 244658 247689 248533 248027 248403 249654 249705 247668 244645 241644 238825 236602 235527 235160
56359 235160 234640 234119 234147 234284 233989 234267 236489 239993 242700 243785 244089 244340 244707 245706 247780 250225 252020
56342 252020 253329 254813 256197 257092 258418 261123 264150 265495 264716 262686 259680 255726 252150 250610 250978
56327 250978 252051 253772 256730 260086 262280 263474 265157 267655 270037 272182 274827 277824 280330 282465
56313B82465K393K105R30O65K184L594L222K164J960K207K316L212N130O137M969
56298C25653L299L082L771M018L946L768K553L75n84P44K272K058J325J940L203
56283C61423L642L848M913N964N731N019N276O237O991P718Q477Q235O921O523
56269D46918Q188J0242J1003J1337J2403J3224J2820J2492J3657J5386J6407J7528
56257F01605J9804K2371K4355K6911L1067L5608L9328M3273M8596N4331N9587
56246A006836O5604P3251Q0742Q6347R1090R6310J00792J02954J03659J04071
56236A911656J02844R8056R0019P9638O6179M9262L0928J3217m310k2207l8669
56225B376613n1985o3131p3334q1371q5943q8332r0061r0370q8626q6464q4847
$$ plain form
56313 282465 284858 286963 287893 288558 290742 294336 297558 299722 301682 303889 306205 309417 314547 320684 325653
56298 325653 328952 332034 335805 339823 343769 347537 350090 350465 349881 350625 352897 354955 356280 358220 361423
56283 361423 365065 368913 373826 379790 385521 390540 395816 402053 409044 416762 425239 433474 440395 446918
56269 446918 455106 465348 476351 487688 500091 513315 526135 538627 552284 567670 584077 601605
56257 601605 621409 643780 668135 695046 726113 761721 801049 844322 892918 947249 1006836
56246 1006836 1072440 1145691 1226433 1312780 1403870 1500180 1600972 1703926 1807585 1911656
56236 1911656 2014500 2112556 2202575 2282213 2348392 2397654 2428582 2441799 2437489 2415282 2376613
56225 2376613 2324628 2261497 2188163 2106792 2020849 1932517 1842456 1752086 1663460 1576996 1492149
56214A492149q1756p5817o9412o5000o1195n5823n0098m6170m3194l9464l5930
56203H68290l3974l2085k8449k4478k2216k0632j8020j5534j4669j3901j1567
56192F32765r410r384r666p932n811n761o270m706k357j955k581j801o05j358
56178E63168k941k742j544j686k413j703o71j337k135n32J940K273J452K226L598
56163E56953K916J488K484M976N643M839N392O880O749N754O580Q378Q253O995
56149F34280P691R881J0722J0723J2550J5310J5952J5306J6857K0400K2724K3706
56137H16102K5981K9557L2656L6838M5161N6077O5264P2680Q1547R1157R7153
56126A450173R8386R7011R2360Q1591O6485N3017M3783L6716L1133K8624K7723
$$ plain form
56214 1492149 1410393 1334576 1265164 1200164 1138969 1083146 1033048 986878 943684 904220 868290
56203 868290 834316 802231 773782 749304 727088 706456 688436 672902 658233 644332 632765
56192 632765 623355 613971 604305 596373 590562 584801 578531 573825 571468 569513 566932 565131 564526 563168
56178 563168 560227 557485 555941 554255 551842 550139 549468 548131 545996 545464 547404 549677 551129 553355 556953
56163 556953 559869 561357 563841 568817 574460 579299 584691 591571 598320 604074 610654 619032 627285 634280
56149 634280 641971 651852 662574 673297 685847 701157 717109 732415 749272 769672 792396 816102
56137 816102 842083 871640 904296 941134 986295 1042372 1107636 1180316 1261863 1353020 1450173
56126 1450173 1548559 1645570 1737930 1819521 1886006 1939023 1982806 2019522 2050655 2079279 2107002
56115B107002K3942J5846N825m802j5904k4517k7054k5399k5103k8078l2795m0149
56103A928814n2157o5701p4717p8233p9496p8141p0894n9417m9534m2467l4532
56092A243525k5563j9745j7594j4963j0713p975p139n011j458M11R54L429O728
56079A144886O500L675L656O815Q170O878P388J0425J1723J0659J1461J4630J5879
56066A262745J4741J5533J8669J9779J8603J9728K3315K4266K1980K1656K4491
56055A485506K5872K4712K5093K7272K6718K3542K3013K5267K4681K0808J9489
56044A751973K1561K1373J8292J8379K2640K4953K3938K5237K9679L1141K8867
56033B018033K9714L5268L9009L9280M2380M9544N3878N3727N5916O2014O4929
$$ plain form
56115 2107002 2130944 2146790 2152615 2147813 2131909 2107392 2080338 2054939 2029836 2001758 1968963 1928814
56103 1928814 1876657 1810956 1736239 1658006 1578510 1500369 1429475 1370058 1320524 1278057 1243525
56092 1243525 1217962 1198217 1180623 1165660 1154947 1146972 1139833 1134822 1133364 1133775 1134729 1138158 1144886
56079 1144886 1151386 1155061 1158717 1165532 1173702 1180580 1187968 1198393 1210116 1220775 1232236 1246866 1262745
56066 1262745 1277486 1293019 1311688 1331467 1350070 1369798 1393113 1417379 1439359 1461015 1485506
56055 1485506 1511378 1536090 1561183 1588455 1615173 1638715 1661728 1686995 1711676 1732484 1751973
56044 1751973 1773534 1794907 1813199 1831578 1854218 1879171 1903109 1928346 1958025 1989166 2018033
56033 2018033 2047747 2083015 2122024 2161304 2203684 2253228 2307106 2360833 2416749 2478763 2543692
56022B543692O3031O3737O8832P0592O7091O6736P2549P6881P7019Q0696R0236
56011C341092R6808R6923R9019J07003J13045J13638J16687J25469J31937J33377
56001D474998J38901J51696J62172J66579J74551J89832K02302K07999K17787
55992F086817K36502K53350K63138K76695K99519L21054L36438L57136L88262
55983H818911M17894M41280M72179N17211N63472O05240O56925P25047P94904
55974A4013063Q60782R40403J042684J152278J264345J401699J577641J777205
55966B4030100J997266K267325K606538L000916L449342L987036M633669N368281
55958E1340473O190978P157108Q314515R671346J1272624J3235147J5643510J8481320
$$ plain form
56022 2543692 2606723 2670460 2739292 2809884 2876975 2943711 3016260 3093141 3170160 3250856 3341092
56011 3341092 3437900 3534823 3633842 3740845 3853890 3967528 4084215 4209684 4341621 4474998
56001 4474998 4613899 4765595 4927767 5094346 5268897 5458729 5661031 5869030 6086817
55992 6086817 6323319 6576669 6839807 7116502 7416021 7737075 8073513 8430649 8818911
55983 8818911 9236805 9678085 10150264 10667475 11230947 11836187 12493112 13218159 14013063
55974 14013063 14873845 15814248 16856932 18009210 19273555 20675254 22252895 24030100
55966 24030100 26027366 28294691 30901229 33902145 37351487 41338523 45972192 51340473
55958 51340473 57531451 64688559 73003074 82674420 93947044 107182191 122825701 141307021
55950A41307021K1718561K5347268K9204447L2825903L5542406L6530178L4590174
55943C57065958K8221087J6640893J116830j4999968k8021359l5924950l8851716
55936B85246775l8121247l5139351l1023973k6625091k2483309j8809221j5638031
55929I7406552j2982936j0823747r067021p613709o424093n472572m696415m037196
55921C6288863l485133l039712k667802k337497k054070j826678j633683j452631
55913A7791657j292294j164796j055311r47353q50687p77344p15121o49919n90817
55904I748015n49065n14165m73400m34399m06872l81622l48455l16330k95684
55895F028023k78293k53895k30016k16425k05699j87581j67961j55921j45771
$$ plain form
55950 141307021 163025582 188372850 217577297 250403200 285945606 322475784 357065958
55943 357065958 385287045 401927938 403044768 388044800 360023441 324098491 285246775
55936 285246775 247125528 211986177 180962204 154337113 131853804 113044583 97406552
55929 97406552 84423616 73599869 64532848 56919139 50495046 45022474 40326059 36288863
55921 36288863 32803730 29764018 27096216 24758719 22704649 20877971 19244288 17791657
55913 17791657 16499363 15334567 14279256 13331903 12481216 11703872 10988751 10338832 9748015
55904 9748015 9198950 8684785 8211385 7776986 7370114 6988492 6640037 6323707 6028023
55895 6028023 5749730 5495835 5265819 5049394 4843695 4656114 4488153 4332232 4186461
55886D186461j28946j10688r8627q7145o8614m8253l3061j7704M101K5645L8552
55875C661721M6582N4260N3197L4305L426k9024o3939j05146j44765j71242j84311
55864C155064j89345j85082j69611j50503j36165j23991j08475r3634q5727q1147
55854A831384p3467o5688o3746o4306o0589n4418n1411m9824m5064l9879l9400
55843A223592m1005l9140l5385l4100l3120k8325k2534k0441j9594j5568j1182
55832I23198j1371j3628j2744j0429j1125j2853j1370r143j0949j4547j4655j2499
55820G77885j2695j4231j3248j1280j2199j4152j2856r864r522j0687r471p034
55808F40646o901p439m832p26P45O85K712N376M909K814L166M848L888J146L55
$$ plain form
55886 4186461 4057515 3946827 3848200 3761055 3692441 3644188 3611127 3593423 3597524 3623169 3661721
55875 3661721 3708303 3762563 3815760 3850065 3853491 3824467 3760528 3655382 3510617 3339375 3155064
55864 3155064 2965719 2780637 2611026 2460523 2324358 2200367 2091892 1998258 1912531 1831384
55854 1831384 1757917 1692229 1628483 1564177 1503588 1449170 1397759 1347935 1302871 1262992 1223592
55843 1223592 1182587 1143447 1108062 1073962 1040842 1012517 989983 969542 949948 934380 923198
55832 923198 911827 898199 885455 875026 863901 851048 839678 830535 819586 805039 790384 777885
55820 777885 765190 750959 737711 726431 714232 700080 687224 677360 667838 657151 647680 640646
55808 640646 633745 626306 621474 620748 621493 622178 624890 630266 635175 637989 641155 646003 649891 651037 651392
55793F51392P17j250m639n970n930p454r228q066n677o099q286q171o352o930
55779E68057j0204j3030j4898j7348j8936j7112j3621j2007j1330q319l928j562
55767D25762o36J786M526L867K83k482l750n481o927n736l127k285k813k208j252
55752C99527k350m348m719m969p881j1300j1101q542q072r323q178m669k865l488
55738C07722l415k191k451l974l754k018k028l660l350p23N68q46k462l009l801
55723B70608m656l808k192k636m538m494k354j390k236k085k90O25J70P63K643
55708B44130L057J476P12J784K392J478Q06R33J1k394m334n150o166p224o585
55693B24926m745m211m972m408k171q41j208j209k21r8j150j276qO40J45L17J458
$$ plain form
55793 651392 652109 650859 646220 640250 634320 626866 617638 609572 603895 597796 589510 581339 574987 568057
55779 568057 557853 544823 529925 512577 493641 476529 462908 450901 439571 431252 427324 425762
55767 425762 425126 426912 431438 435305 435588 433106 429356 423875 416948 411212 408085 405800 402987 400779 399527
55752 399527 397177 392829 388110 383141 375260 363960 352859 344317 336245 326922 318744 314075 311210 307722
55738 307722 304307 302116 299665 295691 291937 289919 287891 284231 280881 280158 280726 279880 277418 274409 270608
55723 270608 265952 262144 259952 257316 252778 248284 245930 244540 242304 240219 239929 240554 240724 241487 244130
55708 244130 247187 248663 249375 251159 253551 255029 255835 256768 256779 254385 250051 244901 238735 231511 224926
55693 224926 220181 215970 210998 206590 204419 203578 202370 201161 200940 200842 199692 198416 198408 199048 199193 199510 200968
55676B00968J634M83k03l52j951m838o291n788n936p594q152o034l084j171Q9
55661A51780R85O71l63j67J246J668P52Q15K667M176M116L883M302M149L126K856
55645A86662L639L408J256j037k182l012l938l863k825k650l829m654m460m726
55631A57789n857n933l917j389R1O90N93o25k038j615N55K048J795J301J461J220
55615A46169J75m97n66j321k769l241k542k478l393l430k074j258j835k153j290
55600A17497o13q31o21N05R22r7r12n00n6m06n08J29K42o12r49j3R98J452K320
55581A17947L681M063L389L616N183N894M738L788M694O149O667P046Q269R465
55567A94589R835J0147J0618R682O587K979K60k403n789q713j0067j0662j1449
$$ plain form
55676 200968 202602 203085 202882 202530 200579 195741 189450 183662 177726 170132 161980 155946 152862 151691 151780
55661 151780 152765 153436 153073 152906 154152 155820 156572 157387 160054 164230 168346 172229 176531 180680 183806 186662
55645 186662 190301 193709 194965 193928 191746 188734 184796 180933 178108 175458 171629 166975 162515 157789
55631 157789 151932 145999 142082 140693 140784 141474 142067 141442 139404 137789 138344 140392 142187 143488 144949 146169
55615 146169 146344 145847 145281 143960 141191 137950 135408 132930 129537 126107 124033 122775 120940 118787 117497
55600 117497 116884 116053 115432 115937 116859 116762 115850 115350 115294 114888 114380 114509 114751 114139 113190 113177 114175 115627 117947
55581 117947 121628 125691 129080 132696 137879 143773 148511 152299 156993 163142 169809 176855 185124 194589
55567 194589 204424 214571 225189 234871 241458 244437 244697 242294 236505 227792 217725 207063 195614
55554A95614j1907j1648j1524j1728j0871q344n624l943k826j936k030k877k735
55541A07621j193r3k93k27R44J549N33m26J22R23N94K11J056K030J652O53L40
55524A15996J98o65j434j169q63j729k873k809k050k136l163m067m460m600m383
55509G9793l731l127k807k397j940k038k397j864l91Q27J617L075N016N667M712
55494H0015M017M328L989K232Q93J180J480L56q73o86j43q70k169k466j923j562
55478H7798j301o97j75j4L75Q88L52j075j462l64Lj510k825k200j149j456j861
55461G3327n60J300J610Q57P62J064N86j7N44J493J306M91M22N57m50j892k037
55444G9363j146q88j381j353o92n10r87j193p54m8P55J394J159J61j53Q06J476
$$ plain form
55554 195614 183707 172059 160535 148807 137936 129592 123968 120025 117199 115263 113233 110356 107621
55541 107621 106428 106335 106042 105815 106759 108308 108841 108415 108537 109460 110054 110265 111321 113351 115003 115656 115996
55524 115996 116194 115529 114095 112926 112063 110334 107461 104652 102602 100466 97303 93236 88776 84176 79793
55509 79793 76062 72935 70128 67731 65791 63753 61356 59492 59101 59928 61545 64620 69636 75303 80015
55494 80015 84032 88360 92349 94581 95474 96654 98134 98490 97617 96931 96788 95918 93749 91283 89360 87798
55478 87798 86497 85800 85625 85611 85986 86874 87226 86151 84689 84325 84328 82818 79993 77793 76644 75188 73327
55461 73327 72767 74067 75677 76534 77296 78360 78946 78929 79473 80966 82272 82763 83185 83742 83292 81400 79363
55444 79363 78217 77329 75948 74595 73903 73393 72406 71213 70459 70411 71166 72560 73719 73880 73727 74533 76009
55427G6009O42m22j54O71P38Q74K401M192M180K731J812J662R55l63j040q73p84
55410I3231q77n82k33n07q26l24K41m06j678k048j602j586j970j732r72n91l17
55393G7221O69J672J280r8p66n36p49j673k116j632j073q04k72M74O43K19P0M07
55375G2936N58K73q9n04j158j626j423j034j168j477j221o20k55J98J185K034
55359F6609J975J628J899K218J577M69Q9K86J98J21Q62J865J970J438J269J103
55343H5576q6j728k244j588j124j239j064m14n7j13oJ71n5j74N78J481J190R0
55325G9194k09M69O97j05r82j229j056m26R35K272K306J162K54J48N8n09j125
55308H1854j508j767j624p21M10R44J013J153R80m6j190j370r79j066j336q33
$$ plain form
55427 76009 76651 76229 76075 76746 77484 78358 80759 84951 89131 91862 93674 95336 96291 95928 94888 94015 93231
55410 93231 92354 91772 91539 91032 90206 89882 90123 89717 88039 85991 84389 82803 80833 79101 78129 77538 77221
55393 77221 77890 79562 80842 80744 79978 79442 78693 77020 74904 73272 72199 71395 71123 71597 72240 72459 72529 72936
55375 72936 73494 73767 73678 73174 72016 70390 68967 67933 66765 65288 64067 63447 63192 63390 64575 66609
55359 66609 68584 70212 72111 74329 75906 76375 76464 76750 76948 77069 77931 79796 81766 83204 84473 85576
55343 85576 85490 83762 81518 79930 78806 77567 76503 76089 76032 75919 75913 76084 76029 75855 76433 77914 79104 79194
55325 79194 78985 79454 80151 80046 79064 77835 76779 76353 77288 79560 81866 83028 83282 83430 83488 82979 81854
55308 81854 80346 78579 76955 76234 76644 77588 78601 79754 80734 80688 79498 78128 77149 76083 74747 73914
55292G3914n1k48j097j148l71pr1N46J773K010R27J05N16J308J532J350J040M69
55274H2477kL76J330J698J144M37k8n00p52k58M69L41n16j024j058j379j767j188
55256G9800J32P24J99k92j07J14k7j32k20p86j429j166k07K36O0L22J068J164
55238G9453N29M98J445K039J445M33k41q87j645j890j466j035p17Q1J152J461
55222H0655J019J011J687J854R64l2m17n71n90J15J242J417L23o81p21m79n30
55205H6266l36K66L54m63j289j545j753j991j358J59J020L56p08r17n62k90J35
55188G7344Q24R77K95k17O5K68k85o90m3Q85R88O18O79Q99M81k48k56N82J436
55169H4602J706J391P04kk98k60m01o98m99K70P02L39o9J80N83L01n59j264j424
$$ plain form
55292 73914 73863 73615 72518 71370 70999 70992 70901 71447 73220 75230 76157 76262 76778 78086 79618 80968 82008 82477
55274 82477 82475 82851 84181 85879 87023 87460 87432 86932 86180 85922 86391 86732 86216 85192 84134 82755 80988 79800
55256 79800 79932 80656 80855 80563 80456 80570 80543 80411 80191 79405 77976 76810 76603 76839 76899 77221 78289 79453
55238 79453 79982 80480 81925 83964 85409 85842 85601 84714 83069 81179 79713 78678 77961 78042 79194 80655
55222 80655 81674 82685 84372 86226 87190 87158 86741 86170 85580 85695 86937 88354 88677 87996 87275 86796 86266
55205 86266 85930 86196 86550 86087 84798 83253 81500 79509 78151 78310 79330 79686 78978 78061 77499 77209 77344
55188 77344 78168 79145 79440 79223 79288 79556 79271 78581 78538 79423 80411 81029 81708 82607 83088 82840 82584 83166 84602
55169 84602 86308 87699 88403 88401 88103 87843 87442 86744 86245 86515 87217 87556 87487 87667 88250 88551 87992 86728 85304
55150H5304j053k67N70R81R93J046J132P39j73r23j055p43k07M05O05O8n27k70
55132H6625M31L62m80q84m41J4J36M86R96P82r1l57L15O80O4n73m54j79k25M7
55112H7254R24J426R49L39L02J88n49j105p40j39r7q0O38J469J459Q58N04M33
55094I4033K32Q2L52P29O63J68m29r77j221q22q2K34J33M21J201J506Q62k3o21
55075I6441j246j848j624n46J60j73p17p02m83k90L93J432J578M69n13m77m20
55058I1434j165j620n74J103J707J028K9p56j163q39rK48m20r11n62k85o41n30
55040H6074O93J501N74o46k1J804K405J212j48o43p35o97j50O51Q40L90J07K00
55022I3411J55n2P5M79N87L19Q7K8J09N60J254J255J09j071r65K7N10J83j47j56
$$ plain form
55150 85304 84251 83984 84554 85535 86528 87574 88706 89445 89272 88349 87294 86551 86344 86749 87354 87422 86895 86625
55132 86625 87056 87418 86938 86054 85613 85627 85763 86249 87245 88027 87936 87579 87894 88574 88638 88065 87611 87432 87207 87254
55112 87254 88178 89604 90553 90892 91194 91382 90833 89728 88988 88849 88752 88672 89310 90779 92238 93096 93600 94033
55094 94033 94265 94347 94699 95428 96091 96259 95830 94853 93632 92810 92728 92962 93095 93516 94717 96223 97085 97062 96441
55075 96441 95195 93347 91723 91177 91337 91164 90447 89745 89262 88972 89365 90797 92375 92844 92331 91854 91434
55058 91434 90269 88649 88075 89178 90885 91913 91942 91186 90023 89184 89175 89423 89003 88092 87530 87245 86604 86074
55040 86074 86767 88268 88842 88196 88175 89979 92384 93596 93448 92805 92070 91373 91223 91874 92714 93104 93211 93411
55022 93411 93566 93514 93589 94068 94655 94974 95061 95089 95198 95758 97012 98267 98376 97305 96340 96367 96877 97060 96913 96757
55002I6757k31l63j63K17L81O00J326K105K105J488J050P96J13q71j276q37k41
54985A02956o3k27m59o01n13k73j90k33P1O77P45n2p73o00n2P8R7O62J403J533
54965A04186J113O94K97k13m22j39m1n24p33R2J150J306R08R56J289J072M19K3
54947A11433k12o80q78k24N20L15k66O1J019J208M44j33r3m7p3L98J109J122N87
54928A15610P25J811K653K426J735J542K142L401M901N796N545M827M752N269
54914A63135N435M965M352L611K209J89j844l742n653p003p003o009n145m639
54900A42858l886k987k774l242l383k770k057j743j611j498j489j288n50K87O11
54885A14478Q81J919L197L391K572K217K902L643L820M118N038N921O157O062
$$ plain form
55002 96757 96526 96163 96000 96217 96598 97198 98524 100629 102734 104222 105272 106068 106181 105310 104034 103197 102956
54985 102956 102893 102666 102207 101606 101093 100820 100630 100397 100468 101145 101890 101838 101065 100465 100413 100491 100588 101250 102653 104186
54965 104186 105299 105993 106290 106077 105655 105516 105475 104951 104218 104310 105460 106766 107674 108630 109919 110991 111410 111433
54947 111433 111221 110541 109663 109439 109959 110274 110008 110069 111088 112296 112740 112607 112514 112467 112394 112792 113901 115023 115610
54928 115610 116335 118146 120799 123225 124960 126502 128644 132045 136946 142742 148287 153114 157866 163135
54914 163135 168570 173535 177887 181498 183707 183896 182052 178310 172657 165654 158651 152642 147497 142858
54900 142858 138972 135985 133211 129969 126586 123816 121759 120016 118405 116907 115418 114130 113580 113867 114478
54885 114478 115359 117278 120475 123866 126438 128655 131557 135200 139020 143138 148176 154097 160254 166316
54871A66316N970N516M445L164J887J75k183m570o230o911o660n723m801m567
54857A45828m810m763m234l650l075k239j426j279j679j903j848k026k398k332
54843A08166j757j215p77o4O63O81J25j18Q9M8l16k54L54O83M29K55M65N15K06
54824A08178Q1K71J66l56n38o1M06L87K27J39k44r52j359j238j051r40n36p7m09
54805A02094j435j867j072O8O93J142J854K321K007J359R71N93j69q41o20M46
54789A07544J456J547N08j023j865j366k46K69J6j61J30N26R82J830K663K540
54773A15350J533Q57J097J592J913K582L805M841N264N594O095O219N901O070
54759A68713O998P407O149L738J294r73l255n111o056o412o569o195n056l951
$$ plain form
54871 166316 172286 177802 182247 185411 187298 187473 185290 180720 174490 167579 160919 155196 150395 145828
54857 145828 141018 136255 132021 128371 125296 123057 121631 120352 118673 116770 114922 112896 110498 108166
54843 108166 106409 105194 104417 104353 105016 105697 105822 105704 105793 105841 105525 105271 105625 106308 106737 106992 107457 107972 108178
54824 108178 108259 108530 108696 108340 107802 107741 108147 108534 108761 108900 108656 107704 106345 105107 104056 103116 102580 102503 102094
54805 102094 100659 98792 97720 97788 98481 99623 101477 103798 105805 107164 108135 108728 108559 107718 107098 107544
54789 107544 109000 110547 111055 110032 108167 106801 106555 106824 106840 106679 106809 107335 108317 110147 112810 115350
54773 115350 116883 117740 118837 120429 122342 124924 128729 133570 138834 144428 150523 156742 162643 168713
54759 168713 175711 183118 189267 193005 194299 193326 190071 184960 178904 172492 165923 159728 154672 150721
54745A50721l725l949l575k504j519j010o16JO64R68O40k07j031j335j231j134
54729A31158j002n02J81N88R61K000L554M631M874M901N060N062N079N723O476
54714A78744N747L174M62j044k205m323o819q032p550o373n334m563m057l712
54700A34115l090j954q62n38r73j611k024j989j458q19o12o90l46M13O91J07o19
54683A17741r33j218j609j331k5J280J492Q70J98m71j263j599j050l90n78j285
54667A09829j464q99j49N34J194J517J173N65L04K51j14o85r30q43r13j330j746
54650A06294j690q81N43J838K149J487O41K0n70q57p8J491K252J364k7n62m94
54633A12920o79q61l05O54J084Q77N24M6o32q83j94O45M37o42j345j143o20k75
$$ plain form
54745 150721 146996 143047 139472 136968 135449 134439 133823 133824 134488 135456 136096 135889 134858 133523 132292 131158
54729 131158 130156 129654 129835 130423 131384 133384 136938 141569 146443 151344 156404 161466 166545 172268 178744
54714 178744 184491 187665 188127 187083 184878 180555 173736 165704 158154 151781 146447 141884 137827 134115
54700 134115 131025 129071 128209 127671 126698 125087 123063 121074 119616 118797 118185 117495 117149 117562 118253 118360 117741
54683 117741 116808 115590 113981 112650 112625 113905 115397 116267 116465 115994 114731 113132 112082 111692 111114 109829
54667 109829 108365 107466 107317 107851 109045 110562 111735 112300 112604 112855 112741 112056 111126 110283 109370 108040 106294
54650 106294 104604 103723 104266 106104 108253 109740 110381 110401 109831 108974 108896 110387 112639 114003 113976 113414 112920
54633 112920 112241 111380 111075 111729 112813 113690 114214 114260 113628 112745 112551 113196 113633 112991 111646 110503 109883 109608
54615A09608m4J41K46M13O52N65N8j30N07J252J117L14k30k98k54n3M32N59l21
54596A14534j523j681o14N72J121J192R43K35o62j090q61l24L34J049J345P82
54580A15352j37m79k09j05m70q69j088j305j315o15O09J440J388Q49L26p2k66
54563A13034q7L10N60O21P10P67O00L97M75O20L95j0k5L11L84K1l06l26k74k79
54543A17898j24K26N06O88J017J445J511R95K58k14k66o4J39K53M52Q76J168P94
54525A27558n7n00k40j04p62j666j942j677j473j341r20l64k8K37O46P49J26o05
54507A17637n14K18O61O11N97O62K76n44j049q75l65J64O59Q54M00m37r60r72
54489A17023q09o06k52N7K9l9L51R76J152Q48O89R65J403J820K148J971R77j97
$$ plain form
54615 109608 109564 109705 109951 110364 111016 111581 111639 111509 112016 113268 114385 114699 114469 114171 113917 113864 114296 114855 114534
54596 114534 113011 111330 110716 111288 112409 113601 114544 114779 114117 113027 112166 111842 112176 113225 114570 115352
54580 115352 115215 114736 114527 114422 113952 113083 111995 110690 109375 108760 109369 110809 112197 113046 113372 113300 113034
54563 113034 112947 113257 113817 114438 115148 115915 116515 116912 117387 118007 118402 118392 118367 118678 119062 119083 118777 118451 118177 117898
54543 117898 117774 118000 118506 119194 120211 121656 123167 124162 124420 124206 123940 123876 124015 124268 124720 125596 126764 127558
54525 127558 127501 127001 126761 126657 125895 124229 122287 120610 119137 117796 116876 116512 116484 116721 117367 118116 118242 117637
54507 117637 117123 117341 118002 118613 119210 119872 120148 119604 118555 117680 117315 117479 118138 118992 119392 118955 117995 117023
54489 117023 116214 115608 115356 115413 115442 115403 115754 116730 117882 118730 119419 120384 121787 123607 125755 127726 128703 128506
54471A28506n60j72jl44m11L33J311J626J092K20l11j29M33N44n6n64k49L87M66
54452A32121J66K53N91L39n00j039r74q49q56o31l21n65j155r70L22J605J778
54435A29315J021J29m12m15P3M82J49o49q95l10K73K74J38L96Q14R60Q34N73K89
54416A33039L77J215K211K140P34q77j680j784j540p44N97J616J564Q31K70P1
54400A38040m5l8K57N52M29R3J41P25J299J259N46k57m09K11Q75P87M7n99q51
54381A43062j053j319j223n85M8P3m43j009j279j156o52J50J084J927K335K007
54365A41967J181N39L02j16j017j602j102j66k1o31r03m93j18n8K33Q37R38J47
54347A39917q09j150q74k33O68J387J340Q30R39J951K868K892K399J939J410Q18
$$ plain form
54471 128506 127946 127774 127773 127429 127018 127351 128662 130288 131380 131600 131289 131160 131593 132137 132081 131517 131268 131655 132121
54452 132121 132287 132540 133131 133470 132970 131931 130957 130108 129252 128621 128300 127735 126580 125610 125932 127537 129315
54435 129315 130336 130465 130053 129638 129711 130193 130342 129693 128798 128488 128761 129035 129173 129569 130383 131343 132177 132750 133039
54416 133039 133416 134631 136842 138982 139716 138839 137159 135375 133835 133091 133688 135304 136868 137699 137969 138040
54400 138040 137995 137957 138214 138766 139195 139288 139429 140154 141453 142712 143258 143001 142592 142803 143678 144465 144512 143913 143062
54381 143062 142009 140690 139467 138882 138930 139003 138560 137551 136272 135116 134464 134614 135698 137625 139960 141967
54365 141967 143148 143687 143989 143873 142856 141254 140152 139986 139965 139334 138431 137938 137820 137762 137995 138832 139770 139917
54347 139917 139108 137958 137084 136851 137519 138906 140246 141076 142015 143966 146834 149726 152125 154064 155474 156292
54331A56292Q37J643K114J134q17k309k688k494k359k316k054j409o56l92q49
54316A43677j375j131l27p2q04j676j744j007k8P38Q92K01q58j383j206j087j402
54299A31408j544j040l80j69k02n0J59J33P8L14P37J047J053N46m57j163o08P78
54281A30640J275J97r72n66R47J764J196K01j40K59Q60J160R75N75M69P54R16
54264A40510N20j74n99n21m6N86J002R01M88K36J52j19m25j36P11J204P82o8o80
54245A44324q95o44J38Q17L66j036j810j042L02Q85O87K98l09j230j797j499j009
54228A36546j145j472j092k03K87J89o4m75j188j590r27L37R70O06J2j58J18O90
54210A31441J313J370N36m95q24o42p58j105q68QO25N72M78R19J610J972J743
$$ plain form
54331 156292 157129 158772 160886 162020 161203 158894 156206 153712 151353 149037 146983 145574 144918 144526 143677
54316 143677 142302 141171 140844 140772 139968 138292 136548 135541 135513 136251 137143 137344 136486 135103 133897 132810 131408
54299 131408 129864 128824 128444 128275 128073 128023 128182 128315 128393 128707 129444 130491 131544 132090 131633 130470 129862 130640
54281 130640 131915 132112 131140 130574 131521 133285 134481 134682 134542 134801 135661 136821 137796 138371 138840 139594 140510
54264 140510 141030 140856 140257 139736 139690 140276 141278 142179 142667 142903 143055 142936 142511 142375 143086 144290 145072 145004 144324
54245 144324 143429 142785 142923 143740 144106 143070 141260 140218 140520 141405 142092 142390 142081 140851 139054 137555 136546
54228 136546 135401 133929 132837 132634 132921 133110 133046 132571 131383 129793 128866 129203 130173 130779 130791 130633 130751 131441
54210 131441 132754 134124 134660 134165 133341 132699 131941 130836 129968 129976 130601 131173 131651 132570 134180 136152 137895
54193A37895R05k30q06j11J300J979J287J09m59l79l15n67q07o13O2P43P86Q2
54175A40861o90r31r60j441k111j942p08M41L92n68j308j317j055r40o91R6J116
54158A28244J526R50j8n35m39j74N6N02J199J631J335N08k18l65Q5O62O55k02
54140A35402j225j404n92L97R41J162J254R52J11q09j210r21j33O71P35k61j355
54123A33715j122L61J446J191N76P23J172R53L24K33O42P52M42L35O07P67N42
54106A43659J45j59k07J44O46O50No01p48r68j608j877j070M9L82K88Q24J715
54088A41269J662N04m84n13p9K84P19J213J327J050R78J262J387J232J303J619
54072A54733J412L91n63n66J58Q59J271J546J704J652J453J217R65P54O52N19
$$ plain form
54193 137895 138800 138570 137764 137653 138953 140932 142219 142328 141869 141490 141175 140608 139801 139188 139250 139993 140779 140861
54175 140861 140171 139240 138280 136839 134728 132786 132078 132519 132911 132343 131035 129718 128663 127723 127032 127128 128244
54158 128244 129770 130720 130702 130167 129728 129554 129610 130112 131311 132942 134277 134785 134567 134202 134287 134949 135604 135402
54140 135402 134177 132773 132181 132578 133519 134681 135935 136887 136998 136189 134979 134058 133925 134596 135331 135070 133715
54123 133715 132593 132954 134400 135591 136167 136890 138062 139015 139339 139572 140214 140966 141408 141743 142350 143117 143659
54106 143659 143804 143645 143438 143582 144228 144878 144883 144282 143534 142566 140958 139081 138011 138060 138442 138730 139554 141269
54088 141269 142931 143435 142951 142438 142359 142643 143362 144575 145902 146952 147930 149192 150579 151811 153114 154733
54072 154733 156145 156536 155973 155407 155565 156424 157695 159241 160945 162597 164050 165267 166232 166986 167638 168157
54056A68157J87j13J1M35N29m3r35j493j230q7J375K182J962J546J990L180M057
54039A81710M103L847L911M265M574M704M861N571P375R986J2019J2353J1544
54026B70823J1015J0933R906P000L073k55k260l267l763l879l561k897k240j974
54012B88654k075k160k107k282k793l097k859k660l131l891m157l992l956l974
53998B45520l636l281l564m042l594k270j455j863k666k977l010l210l202k446
53984B04304j234l99m32j279k499l372l327k557j748j124l60N37R58N51k84r77
53968A86758j283j064k87O41J169J318J518J702J438R50J062J824K156J261l35
53953A98828j518j695q69O27K097K805K667K164J550Q73P14J789L613M629M230
$$ plain form
54056 168157 168344 168231 168242 168677 169206 169163 168228 166735 165505 165418 166793 168975 170937 172483 174473 177653 181710
54039 181710 185813 189660 193571 197836 202410 207114 211975 217546 224921 234907 246926 259279 270823
54026 270823 281838 292771 302677 309677 312750 312495 310235 306968 303205 299326 295765 292868 290628 288654
54012 288654 286579 284419 282312 280030 277237 274140 271281 268621 265490 261599 257442 253450 249494 245520
53998 245520 241884 238603 235039 230997 227403 225133 223678 221815 219149 216172 213162 209952 206750 204304
53984 204304 203070 202671 202239 200960 198461 195089 191762 189205 187457 186333 185973 186510 187468 188019 187735 186758
53968 186758 185475 184411 184124 184765 185934 187252 188770 190472 191910 192860 193922 195746 197902 199163 198828
53953 198828 197310 195615 194746 195373 197470 200275 202942 205106 206656 207529 208243 210032 213645 218274 222504
53938B22504L534L619M022L755K922K359K293K305K279K454K782K900K646K163
53924B62537J664J375J543K148K896L582M203M613M648M644N226O319P043O909
53910C19350O425O268O480O857P403P936P916P169O227N462M524L161J952J502
53896C98632J448R59q7j107j735k127k521l025l732m623n488o192o806p284p307
53881C49005o695n702m692l817l123k601j948p33R92K623L700M250M302L555J788
53866C40904q38m011p300r883j0969j0703j0089r727r258q251o969n857m963m226
53852B37860l751l472l096k679k614k730k213q38M20N38l93j549k318k404j721
53837B09040p25k41m71p22n76n23r83j472j401j039q83p78m18j27l24o92o83m67
$$ plain form
53938 222504 226038 229657 233679 237434 240356 242715 245008 247313 249592 252046 254828 257728 260374 262537
53924 262537 264201 265576 267119 269267 272163 275745 279948 284561 289209 293853 299079 305398 312441 319350
53910 319350 325775 332043 338523 345380 352783 360719 368635 375804 382031 387493 392017 395178 397130 398632
53896 398632 400080 401039 400952 399845 398110 395983 393462 390437 386705 382082 376594 370402 363596 356312 349005
53881 349005 342310 336608 331916 328099 324976 322375 320427 319694 320686 323309 327009 331259 335561 339116 340904
53866 340904 340066 336055 328755 318872 307903 297200 287111 277384 268126 259875 252906 247049 242086 237860
53852 237860 234109 230637 227541 224862 222248 219518 217305 216467 216887 217425 217032 215483 213165 210761 209040
53837 209040 208315 208074 207603 206881 206305 205782 204799 203327 201926 200887 200004 199226 198808 198681 198357 197665 196982 196515
53819A96515o08j146j637j798j483n17Q41J742J712J375J545K102K456K623K896
53804B06618K927K171J056P62J742L225M239M535M521M685N124N403N058M388
53790B56454M278M846N070M235L114K804K991K515J240K40J32K89n1p82j354j568
53774B84453j665j927k513l375m254m843m933m408l340k190j555j555j827k265
53760B43803l136m249m760m291l560l270l084k411j598j368j589j557j194j027
53746B06709j209j422j615j965k179j714o93J74O18R92J440J597J300R42Q82R78
53730B04835Q60L48m32j072j137o49k19l53q60j233j268j000l93M03R01Q62O76
53713B00269O40L43n67j464j437o21J8J06J83O09R85Q79N55O74J507K568L021
$$ plain form
53819 196515 195907 194761 193124 191326 189843 189326 190167 191909 193621 194996 196541 198643 201099 203722 206618
53804 206618 209545 211716 212772 213534 215276 218501 222740 227275 231796 236481 241605 247008 252066 256454
53790 256454 260732 265578 270648 274883 277997 280801 283792 286307 287547 287787 287919 288208 288157 287375 286021 284453
53774 284453 282788 280861 278348 274973 270719 265876 260943 256535 253195 251005 249450 247895 246068 243803
53760 243803 240667 236418 231658 227367 223807 220537 217453 215042 213444 212076 210487 208930 207736 206709
53746 206709 205500 204078 202463 200498 198319 196605 195912 196086 196704 197696 199136 200733 202033 202975 203857 204835
53730 204835 205695 206043 205611 204539 203402 202753 202534 202181 201321 200088 198820 197820 197427 197830 198731 199593 200269
53713 200269 200909 201252 200685 199221 197784 197163 197181 197287 197470 198079 199064 199943 200498 201172 202679 205247 208268
53696B08268K550J807J621J828J567Q08O03J381K084J728Q72N43N92K82j86j26
53680B26222J74j78j086j584j398j150j072p77l38l08o26n85j00P7l69q49q38
53663B15215m97j50Pk90j024j347m92Q43J131J16q78r65o64o15n55j95K7j60j91
53644B09316L48Q63P03K69M30J182J693J435P36K45K58M68L97R3K53J245K318
53627B22252K447J734J208J325J577J579J611J835J966J952K180K680K891K531
53613B49768J984J582J270J173J663K565L105L016K846K900K697J944J183R48
53599B78644J046J120J304J721K003J772J110K01q74j723j707q84k12l98j147
53584B81976j773j904j356j54R79J067K45k88m0P4n95j249j007l74k92n51l22
$$ plain form
53696 208268 210818 212625 214246 216074 217641 218449 219052 220433 222517 224245 225117 225660 226252 226534 226348 226222
53680 226222 226396 226218 225132 223548 222150 221000 219928 219151 218813 218505 217879 217294 217194 217271 216902 216053 215215
53663 215215 214718 214568 214575 214285 213261 211914 211422 212265 213396 213512 212634 211669 211005 210390 209835 209640 209667 209507 209316
53644 209316 209664 210527 211230 211499 211929 213111 214804 216239 216975 217220 217478 217946 218343 218436 218689 219934 222252
53627 222252 224699 226433 227641 228966 230543 232122 233733 235568 237534 239486 241666 244346 247237 249768
53613 249768 251752 253334 254604 255777 257440 260005 263110 266126 268972 271872 274569 276513 277696 278644
53599 278644 279690 280810 282114 283835 285838 287610 288720 288921 288047 286324 284617 283733 283521 283123 281976
53584 281976 280203 278299 276943 276789 277768 278835 279080 278792 278752 278826 278231 276982 275975 275601 275309 274758 274436
53567B74436M03R71J231J453J523J200Q27Q47R37N35j06k95o1Pj78k11p0r0j71
53548B83188Q8O36J153J775K770L638L596K908K713L403M161M311M136M073M024
53533C26573L925M257N301O480P028O946O791O894P220P775Q557R277R647R917
53519D26588J0655J1927J3140J3858J4382J5196J6179J6807J7013J7247J7629
53508E90621J7740J7578J7973J9425K1006K1297K0090J8385J6878J5554J4614
53497G91161J4621J5344J5667J5149J4627J4654J4417J3183J1820J1723J2746
53486I45112J3462J3199J2604J2292J2104J1852J1790J1930J1655J0464Q659P010
53474A082133N949N263M343K688L39k136m224n866p238q488r956j2074j4609j6393
$$ plain form
53567 274436 274839 275810 277041 278494 280017 281217 282044 282891 283828 284363 284257 283962 283901 283908 283730 283519 283449 283359 283188
53548 283188 283276 283912 285065 286840 289610 293248 296844 299752 302465 305868 310029 314340 318476 322549 326573
53533 326573 330498 334755 340056 346536 353564 360510 367301 374195 381415 389190 397747 407024 416671 426588
53519 426588 437243 449170 462310 476168 490550 505746 521925 538732 555745 572992 590621
53508 590621 608361 625939 643912 663337 684343 705640 725730 744115 760993 776547 791161
53497 791161 805782 821126 836793 851942 866569 881223 895640 908823 920643 932366 945112
53486 945112 958574 971773 984377 996669 1008773 1020625 1032415 1044345 1056000 1066464 1075123 1082133
53474 1082133 1088082 1093345 1097688 1100376 1100715 1098579 1094355 1088489 1081251 1072763 1062807 1050733 1036124 1019731
53460A019731j6586j5842j5626j6464j7612j8253j8297j8009j7575j7270j7354
53449H30843j7619j7478j6635j5374j4137j3192j2634j2309j1819j1046j0450
53438F78150j0243r539p284m023j688j304j864j865j047N9J403L211M980N847
53424F54793N958O542Q411J0990J3173J4560J5545J6563J7659J8717J9685K0622
53412H23218K1604K2635K3618K4482K5361K6510K7971K9455L0708L1835L3086
53401A120483L4459L5808L7190L8788M0436M1727M2617M3464M4209M4157M3086
53390A566424M2007M2038M2753M2630M1083L9066L7441L5794L3461L0805K8579
53379A982081K6534K3735K0049J6363J3222J0149O615K964k25l173o740j1278
$$ plain form
53460 1019731 1003145 987303 971677 955213 937601 919348 901051 883042 865467 848197 830843
53449 830843 813224 795746 779111 763737 749600 736408 723774 711465 699646 688600 678150
53438 678150 667907 658368 651084 647061 645373 644069 642205 640340 639293 639352 640755 643966 648946 654793
53424 654793 660751 667293 675704 686694 699867 714427 729972 746535 764194 782911 802596 823218
53412 823218 844822 867457 891075 915557 940918 967428 995399 1024854 1055562 1087397 1120483
53401 1120483 1154942 1190750 1227940 1266728 1307164 1348891 1391508 1434972 1479181 1523338 1566424
53390 1566424 1608431 1650469 1693222 1735852 1776935 1816001 1853442 1889236 1922697 1953502 1982081
53379 1982081 2008615 2032350 2052399 2068762 2081984 2092133 2098748 2101712 2101487 2098314 2091574 2080296
53367B080296j6280k1227k6258l1612l6746m0632m2992m4682m6489m8005m8258
53356A677115m7194m5837m4980m4423m3737m3072m2754m2473m1490l9596l7494
53345A204065l6098l5627l5418l4632l3123l1505l0292k9222k7786k6080k4612
53334H59670k3402k1965k0112j8180j6347j4448j2565j1116j0146r178q031p072
53322F87108o413n612m459l269k114n98J122K123K155K341L655N529O910P824
53308F96302Q833R704R898R873J0601J2100J3607J4895J6249J7433J7990J8403
53296H55888J9575K1266K2362K2729K3276K4076K4001K2747K1605K1521K1692
53285A100738K1015J9731J8495J6854J3973J0297P206N260L721J785o14l054n130
$$ plain form
53367 2080296 2064016 2042789 2016531 1984919 1948173 1907541 1864549 1819867 1773378 1725373 1677115
53356 1677115 1629921 1584084 1539104 1494681 1450944 1407872 1365118 1322645 1281155 1241559 1204065
53345 1204065 1167967 1132340 1096922 1062290 1029167 997662 967370 938148 910362 884282 859670
53334 859670 836268 814303 794191 776011 759664 745216 732651 721535 711389 702211 694180 687108
53322 687108 680695 675083 670624 667355 665241 664643 665765 667888 670043 672384 676039 681568 688478 696302
53308 696302 705135 714839 724737 734610 745211 757311 770918 785813 802062 819495 837485 855888
53296 855888 875463 896729 919091 941820 965096 989172 1013173 1035920 1057525 1079046 1100738
53285 1100738 1121753 1141484 1159979 1176833 1190806 1201103 1208309 1213569 1217290 1219075 1218461 1215407 1210277
53272A210277o695q045r676j1484j2686j2982j3365j4987j7586j9876k1278k2362
53260A039255k3604k4628k4961k4833k4793k5010k5258k5310k5074k4612k4186
53249G66986k3991k3752k2897k1329j9729j8808j8523j8360j8174j8315j8882
53238E44226j9280j8764j7277j5516j4224j3543j3054j2291j1141r893q897q204
53226C82142p520o618n687n139n010m913m668m699n429o487o941o373n317m590
53212C02751m442m557m563m299l822l395l369l770m099l806l013k451k547k870
53198B51748k763k250j943k091k284k136j842j697j574j287j100j316j653j649
53184B26163j456j471j428p43J44Oj312k339j943q96n55q74q08j53K50j9m52o31
$$ plain form
53272 1210277 1203582 1195537 1185861 1174377 1161691 1148709 1135344 1120357 1102771 1082895 1061617 1039255
53260 1039255 1015651 991023 966062 941229 916436 891426 866168 840858 815784 791172 766986
53249 766986 742995 719243 696346 675017 655288 636480 617957 599597 581423 563108 544226
53238 544226 524946 506182 488905 473389 459165 445622 432568 420277 409136 399243 390346 382142
53226 382142 374622 368004 362317 357178 352168 347255 342587 337888 332459 325972 319031 312658 307341 302751
53212 302751 298309 293752 289189 284890 281068 277673 274304 270534 266435 262629 259616 257165 254618 251748
53198 251748 248985 246735 244792 242701 240417 238281 236439 234742 233168 231881 230781 229465 227812 226163
53184 226163 224707 223236 221808 221065 221209 221215 219903 217564 215621 214725 214170 213296 212488 212335 212585 212566 212114 211483
53166B11483p34r29j056j075j109r51k85N42P32J85l48m85p01j350j994k215k245
53149A97465k299j962r33J92O25M39K28J01k18n44l87J05J76l63p31k42P78J505
53131A93935J657J541J346R09J96m22o03l98q3J95L33J04n24r68m87Q36K018K298
53113B01883J882J333P16j14q34r48o12m54n75m58M2K89l03j449k315k342j599
53096A94142o32j13k49n27l47Q1j3p61j379j290q68p04o95l59L06Q96J205J292
53078A89985J176Q97O81N89K19p17j712j898j147k26J75P6k11n84j018j257j061
53061A83967o24m34o79j012r71n38k11m19r78j246q88k57Q2J33M14J126J711J523
53043A80699Q01M63Q21R70o1j812k735k112r48n77r99j207p62k58l19q95j586
$$ plain form
53166 211483 210749 209820 208764 207689 206580 205629 205344 205886 206618 206803 206455 205970 205269 203919 201925 199710 197465
53149 197465 195166 193204 192271 192463 193088 193527 193755 193856 193638 193094 192707 192812 192988 192625 191894 191652 192430 193935
53131 193935 195592 197133 198479 199388 199584 199162 198559 198161 198078 198273 198606 198710 198186 197218 196731 197567 199585 201883
53113 201883 203765 205098 205814 205700 204866 203918 203306 202852 202277 201819 201861 202150 201847 200398 198083 195741 194142
53096 194142 193510 193397 193148 192621 192274 192355 192342 191581 190202 188912 188044 187340 186645 186286 186592 187488 188693 189985
53078 189985 191161 192058 192739 193328 193547 192830 191118 189220 188073 187847 188022 188098 187887 187303 186285 185028 183967
53061 183967 183343 182909 182230 181218 180247 179709 179498 179079 178101 176855 175967 175710 175792 175925 176339 177465 179176 180699
53043 180699 181500 181963 182784 183754 183693 181881 179146 177034 176086 175509 174510 173303 172541 172283 171964 171069 169483
53026A69483k075k083j516q03n20n24n7J002J722J368M41q3q3m9K7N89J432J652
53008A69923R03J6j62Q3j02q36j380j203n69L5M75P25N33j84r28j109q54p59q17
52989A63790l46Q25J701J297lq81o98J2N77Q83R73P06K18J52Q73J801K029J444
52971A75353P79O03P93R90J192J576K018K096J616Q60K33k01o34j071j270j155
52955A83778j035j242j747k245k523k526k298k010j901j995j978j533p08K31J051
52940A61319J523J380O52j67n08k40M44J285J921J869R94k40j254j841j895j209
52924A64033o3M98k12j418j687p22L98O70R6p41j249r25K68J538J948J482Q45
52907A64759K84m72j174j130m41j04m71o66p8O75Q36O20M83J53o35j220p97K79
$$ plain form
53026 169483 167408 165325 163809 163006 162486 161962 161905 162907 164629 165997 166438 166355 166272 166223 166250 166839 168271 169923
53008 169923 170826 170842 170680 170763 170661 169825 168445 167242 166673 166708 167183 167908 168441 168257 167329 166220 165366 164607 163790
52989 163790 163444 164269 165970 167267 167264 166383 165685 165697 166274 167157 168130 168836 169054 169206 170079 171880 173909 175353
52971 175353 176132 176735 177528 178518 179710 181286 183304 185400 187016 187876 188109 187908 187274 186203 184933 183778
52955 183778 182743 181501 179754 177509 174986 172460 170162 168152 166251 164256 162278 160745 160037 160268 161319
52940 161319 162842 164222 164874 164707 164199 163959 164403 165688 167609 169478 170472 170232 168978 167137 165242 164033
52924 164033 163970 164468 164256 162838 161151 160429 160827 161497 161593 160852 159603 158678 158946 160484 162432 163914 164759
52907 164759 165043 164571 163397 162267 161826 161722 161251 160585 160507 161182 162018 162638 163121 163274 162639 161419 160622 160901
52889A60901R50Q50M77K16J3j54j39J4J34J93J40k38q98j214o38N82J706K296
52871A65191K315J830J059M43K71M37R26J978L360M105L625K664K371K828L182
52856A96585K901K117J028k51j322j825j952k071k029j589j253j793l007l850
52842A81689l799l266k654j959j371j412k071k585k371j646q43j4Q18J323J320
52827A61159J137J197J511J859K123K192J852J039J5q55j314j231o93j59j13m62
52811A69257n94j62N74J269J917K588L044K980K372J403K23j051k187k898k985
52796A75750k508j804j259q89l80K25K12r52k600l356k694j486p65n68l12J78
52780A56792N30N93P32J229J689J388K42q37q12K66J275J306O01K9PK24J90l01
$$ plain form
52889 160901 161851 162701 163178 163394 163407 163253 163114 163128 163262 163455 163595 163357 162459 161245 160607 161189 162895 165191
52871 165191 167506 169336 170395 170838 171109 171546 172472 174450 177810 181915 185540 188204 190575 193403 196585
52856 196585 199486 201603 202631 202380 201058 199233 197281 195210 193181 191592 190339 188546 185539 181689
52842 181689 177890 174624 171970 170011 168640 167228 165157 162572 160201 158555 157712 157698 158516 159839 161159
52827 161159 162296 163493 165004 166863 168986 171178 173030 174069 174084 173229 171915 170684 169991 169832 169719 169257
52811 169257 168663 168501 169075 170344 172261 174849 177893 180873 183245 184648 184871 183820 181633 178735 175750
52796 175750 173242 171438 170179 169290 168910 169135 169347 168395 165795 162439 159745 158259 157494 156926 156614 156792
52780 156792 157322 157915 158647 159876 161565 162953 163195 162358 161546 161812 163087 164393 164994 165023 165030 165254 165444 165143
52762A65143j034j372p11P09J735J510M62l03l45n4K12L87L22j49p29r32p88o94
52744A63369o30k42L20N43N85J256K638L620L307K192J367J217J368J417J067
52729A83394R6j207j922j466m69j0k12k89Q0K48l97j466k016j603o23J95L28l16
52711A72345j348k012j694n91L26K98l17n30k4M95M18N1r7k45q40j556j628j037
52693A62014n41m92m82l08l93q72j090n03M26Q25N21M9j19J08O11J106J224R13
52675A62997N73N22M83M0o24q21j38J062J916J741O83k83k94L81P03K90m6M42
52657A69627J297J550J142Q74J165J613J796J887K202K673K978K894K250R05r46
52642A93907k622l431l275k620j856r53J52J076J202N10k20k15M02R21J025J089
$$ plain form
52762 165143 164109 162737 162026 162735 164470 165980 166442 166139 165794 165740 165952 166339 166661 166512 165783 164851 164063 163369
52744 163369 162739 162497 162817 163360 163945 165201 167839 171459 174766 176958 178325 179542 180910 182327 183394
52729 183394 183490 182283 180361 178895 178426 178416 178204 177915 177995 178243 177846 176380 174364 172761 172138 172333 172661 172345
52711 172345 170997 168985 167291 166700 167026 167324 167007 166477 166453 166948 167366 167417 167320 167075 166235 164679 163051 162014
52693 162014 161473 160981 160499 160191 159798 158926 157836 157333 157759 158584 159105 159154 159035 159143 159754 160860 162084 162997
52675 162997 163570 164092 164575 164615 163991 163170 163032 164094 166010 167751 168434 168151 167857 168238 168941 169231 169185 169627
52657 169627 170924 172474 173616 174490 175655 177268 179064 180951 183153 185826 188804 191698 193948 194853 193907
52642 193907 191285 187854 184579 181959 180103 179150 179302 180378 181580 182090 181870 181655 182057 182978 184003 185092
52626A85092J456J936K202K227K065J524M59p98j694k099k321k529k472j905j100
52611A82043o52p77j039r42o15n78q57q02q3O33M97l29r29q77n86m36l35k12j86
52592A72938kR01K278K851J814J08o00J18J215J656J409R32M63M4k26k51r4J35
52574A85689L70N20M65K65J94N28J202J734J582O78m33j179j505j646j490p39
52558A86235L11P60K09o75j036q47o26n31l71k22l91p69q30l56K98P79J166J541
52540A84645J570Q51l39j095q18P4P14R04J244J959K268J496L43J19Q58J224M82
52523A96499m98p17m31l29j72O25J630J801J055L79L40M93M01L37O86J331J965
52506B05395K448K637K322J642J025O08O7p46j564k190k719l020k647j672r79
$$ plain form
52626 185092 186548 188484 190686 192913 194978 196502 196961 196163 194469 192370 190049 187520 185048 183143 182043
52611 182043 181391 180614 179575 178633 178018 177440 176583 175781 175698 176331 176828 176499 175570 174693 174107 173671 173336 173124 172938
52592 172938 172936 173837 176115 178966 180780 180888 180288 180406 181621 183277 184686 185618 186081 186125 185899 185648 185554 185689
52574 185689 186059 186579 187044 187309 187503 188031 189233 190967 192549 193227 192794 191615 190110 188464 186974 186235
52558 186235 186546 187306 187515 186840 185804 184957 184331 183800 183429 183207 182816 182047 181217 180861 181159 181938 183104 184645
52540 184645 186215 187066 186727 185632 184814 184888 185602 186506 187750 189709 191977 193473 193816 193935 194793 196017 196499
52523 196499 196001 195284 194853 194524 194352 194977 196607 198408 199463 199842 200182 200675 201076 201413 202099 203430 205395
52506 205395 207843 210480 212802 214444 215469 216077 216144 215398 213834 211644 208925 205905 203258 201586 200607
52491B00607j204j768j613o40K42L86J14N0K78M70M57M07N37Q88J338J658J620
52474B03827J187O84O03J111J856K375K610K778K826K449J712J246J436J789J559
52459B30048Q01L17N26Q75N78m46j548k081k009j881k244l046l608l374k514j694
52443B08700j364j505j833j938j403k87O45P12K38J49O01P96K85l11l57k45o92
52426B02191j468j673j070m12l15m48p1J016K243K776K219J054L80Q61J964K534
52410B11781K195J745J998K752L228L242L428M283N452O140O008N359M502L263
52396B65376J337j044l111m366n021n453n556n018m069l312k829k118j063l46
52382B23407l89n48pQ85J040L38q5O05J797K361K093J666J580J762K051K443K804
$$ plain form
52491 200607 199403 197635 196022 195382 195624 196010 196124 196174 196452 196922 197379 197786 198323 199211 200549 202207 203827
52474 203827 205014 205698 206301 207412 209268 211643 214253 217031 219857 222306 224018 225264 226700 228489 230048
52459 230048 230849 231166 231692 232567 233145 232699 231151 229070 227061 225180 222936 219890 216282 212908 210394 208700
52443 208700 207336 205831 203998 202060 200657 200370 201015 201727 201965 202114 202715 203511 203796 203485 203128 202883 202191
52426 202191 200723 199050 197980 197568 197253 196805 196734 197750 199993 202769 204988 206042 206422 207283 209247 211781
52410 211781 213976 215721 217719 220471 223699 226941 230369 234652 240104 246244 252252 257611 262113 265376
52396 265376 266713 265669 262558 258192 253171 247718 242162 237144 233075 229763 226934 224816 223753 223407
52382 223407 223018 222470 222463 223348 224388 224726 224641 225246 227043 229404 231497 233163 234743 236505 238556 240999 243803
52365B43803K821K382J674Q66q4j123j908k094j734j272j089j085q15j45M18L21
52349B40936j77j74O74J627J831J333P49L57J33L42J224K219K393J784J521K277
52333B59049L287L429K692K048K146K787L514M169M812N452O034O483O699O609
52319C19210O259N823N470N198M785M049L140K488K283K246K078J824J621J430
52305C67904J356J830K896L748L680L230L457M291M676M273L841L726L254K172
52291D14334J352J320J191Q9j358k056k165k499k810k168p39K48L21K50N66Q45
52275D06721P87R14J666K624L166L320L477L742L938L925L729L627M093N161N916
52260D56806N336L662K246J906K225K654L305M213M745M494M161M651N694O155
$$ plain form
52365 243803 246624 249006 250680 251546 251462 250339 248431 246337 244603 243331 242242 241157 240342 240197 240615 240936
52349 240936 240759 240585 241259 242886 244717 246050 246799 247156 247289 247631 248855 251074 253467 255251 256772 259049
52333 259049 262336 265765 268457 270505 272651 275438 278952 283121 287933 293385 299419 305902 312601 319210
52319 319210 325469 331292 336762 341960 346745 350794 353934 356422 358705 360951 363029 364853 366474 367904
52305 367904 369260 371090 373986 377734 381414 384644 388101 392392 397068 401341 405182 408908 412162 414334
52291 414334 415686 417006 418197 418286 416928 414872 412707 410208 407398 405230 404491 404739 405060 405310 405876 406721
52275 406721 407508 408422 410088 412712 415878 419198 422675 426417 430355 434280 438009 441636 445729 450890 456806
52260 456806 462142 465804 468050 469956 472181 474835 478140 482353 487098 491592 495753 500404 506098 512253
52246E12253N505M295L225K466J907J477J045M28k42m05L60J742K856L116K886
52231E42914L039L872M699M741M155L731L718L547K811J937J596J887K406K835
52217E87888L174L568M163M917N476N471N074M875N065N159M750M177M040M445
52203F52242N039N471N503M905L801K872K722L130L390L312L380L921M572M816
52189G09076M673M613M869N145N013M460L843L254K201K50k147l966m859n509
52175G30916o496p356p298o448n635n178m646l820l116k799k414j504m12J78K95
52160F74267O99J859L310M201M163L474K563J610O58j52o32q24j028j488k033
52145F90647k171j565m00P14J220J051O44M93O27O04M1r07j704j980j776j333
$$ plain form
52246 512253 517758 522053 525278 527744 529651 531128 532173 532601 532359 531954 532314 534056 536912 540028 542914
52231 542914 545953 549825 554524 559265 563420 567151 570869 574416 577227 579164 580760 582647 585053 587888
52217 587888 591062 594630 598793 603710 609186 614657 619731 624606 629671 634830 639580 643757 647797 652242
52203 652242 657281 662752 668255 673160 676961 679833 682555 685685 689075 692387 695767 699688 704260 709076
52189 709076 713749 718362 723231 728376 733389 737849 741692 744946 747147 747397 745250 741284 736425 730916
52175 730916 724420 717064 709766 703318 697683 692505 687859 684039 680923 678124 675710 674206 673794 673972 674267
52160 674267 674966 676825 680135 684336 688499 691973 694536 696146 696804 696652 696020 695196 694168 692680 690647
52145 690647 688476 686911 686511 687225 688445 689496 690140 690633 691260 691864 691905 690998 689294 687314 685538 684205
52129F84205q01k33M20J421L140N572Q124J0170J1678J2923J3659J3222J1661
52116G75161J0100R486R344Q524O865N275M182K928J013r13j976k272k474k661
52102H22582k413j775j239q31l6J160J983J976J768K289L497M373L999K279k58
52087H39354l009n528p426q320q053o985n839n071m532l843k929j983j127m26
52073G74283l0O1K20P20J264J408J346J727K654L507L756L427K647J386o5r77
52057G97334r63n08l35m77m03J54P93Q85K05q92j862k581l412m550n571o008o068
52040G65741o224o310n757m694l912l605l017j708k79O38J337K281L073L030K369
52025G42963J946K048K177J992J740J713J827J824J590J235J063J328J863K161
$$ plain form
52129 684205 683404 683171 683591 685012 688152 693724 701848 712018 723696 736619 750278 763500 775161
52116 775161 785261 794747 804091 812615 819480 824755 828937 831865 832878 831965 829989 827717 825243 822582
52102 822582 820169 818394 817155 816324 816288 817448 819431 821407 823175 825464 828961 833334 837333 839612 839354
52087 839354 836345 830817 823391 815071 807018 800033 794194 789123 784591 780748 777819 775836 774709 774283
52073 774283 774253 774314 774534 775254 776518 777926 779272 780999 783653 787160 790916 794343 796990 798376 798311 797334
52057 797334 796371 795863 795528 795051 794648 794802 795595 796480 796685 795793 793931 791350 787938 783388 777817 771809 765741
52040 765741 759517 753207 747450 742756 738844 735239 732222 730514 730235 730873 732210 734491 737564 740594 742963
52025 742963 744909 746957 749134 751126 752866 754579 756406 758230 759820 761055 762118 763446 765309 767470
52011G67470K063J902J759J066n40k487l943m907n956p300q761j0412j2400j4253
51997G03301j5191j5163j4820j4456j3666j2268j0812r885r421r001q427p774
51985E62417p233p073p406p906q107q029q070q291q323q145q300r078r897r859
51971D46700q663o750m776l178j909n38J214L056M544N873P600R534J0624J0300
51957D73631R327Q824Q808Q274O429L414K2k827m475m881m564m012l195j881j94
51942D92700J504L078M669O308P884R412J0993J2501J3545J3780J3155J1862J0186
51929F11577Q278N991L025o15m454p954j0916j3354j5257j6651j7645j8125j7699
51916E06201j6357j4877j4071j3690j2704j0639q155o168m903m016l177k126n25
$$ plain form
52011 767470 769533 771435 773194 774260 773720 771233 767290 762383 756427 749127 740366 729954 717554 703301
51997 703301 688110 672947 658127 643671 630005 617737 606925 597040 587619 578618 570191 562417
51985 562417 555184 548111 540705 532799 524692 516663 508593 500302 491979 483834 475534 466456 456559 446700
51971 446700 438037 431287 426511 423333 421424 420886 422100 425156 429700 435573 443173 452707 463331 473631
51957 473631 482958 491782 500590 508864 515293 518707 518729 515902 511427 506546 501982 497970 494775 492894 492700
51942 492700 494204 497282 501951 508259 516143 525555 536548 549049 562594 576374 589529 601391 611577
51929 611577 619855 625846 628871 628256 623802 615848 604932 591578 576321 559670 542025 523900 506201
51916 506201 489844 474967 460896 447206 434502 423863 415708 409540 404637 400621 397444 395318 394793
51903C94793J804M488O788Q205Q822R107R491R990J0125R236P105M166J174j275
51889D84019k801l142k237l13K256N056P441Q413P125L624j030n442q561r839
51875D84569r163o894l811p90J633L340M367M615L882K127l57l083n662p791r107
51860D57875r403r070q842q791q059o099l732k279j841j404n43kk97r07j401k315
51844C92890l999n444n476m496l875l967m002l760l855m217l736j994j96L98Q8
51829C44359R9J091K847M656N417M155J360r45j327n45k18o38r59r27j025j111
51813C56289m09J052K146K150J567J183J179J423J718J511K13j819l349l736l505
51798C57613l157k408j118p0K5l77m53k85m78r62j193j228j621k294k489j895
$$ plain form
51903 394793 396597 401085 407873 416078 424900 434007 443498 453488 463613 472849 479954 484120 485294 484019
51889 484019 481218 478076 475839 475526 477782 482838 490279 498692 505817 509441 508411 502969 494408 484569
51875 484569 475406 468512 464701 463911 465544 468884 473251 477866 481748 483875 483518 480435 474773 466982 457875
51860 457875 448472 439402 430560 421769 413710 407611 403879 401600 399759 398355 397812 397810 397513 396606 395205 392890
51844 392890 388891 383447 377971 373475 369600 365633 361631 357871 354016 349799 346063 344069 343873 344271 344359
51829 344359 344458 345549 348396 353052 358469 362624 363984 363039 361712 361167 360949 360311 359352 358425 357400 356289
51813 356289 355880 356932 359078 361228 362795 363978 365157 366580 368298 369809 370022 368203 364854 361118 357613
51798 357613 354456 352048 350930 350860 350885 350508 350055 349770 349292 348330 347137 345909 344288 341994 339505 337610
51782C37610j103p55q68j169j501j716j678j528j486j341n97P83K271L514M674
51767C35110N864O838P492Q220R324J0458J1002J0686R569P702N186K261q90m221
51753D24601p346r469j0102r667q889p927o588n106m050l569l338l176l080k652
51739C39642j304P98K676L731M409N362O564P748R028J0460J1334J0707Q543N793
51725D25491L423J923J533K265L602M679M962M302K482o60m458p421q405p538
51711D26180n813m175l199l161l898m784n258n301n149m746l786k262o66L97O40
51696C75019J70p20j721k503k676j986p08M27Q73P20K53o35k047l422l920l540
51680C53584l069k840k234q15Q30J919K521L188L932M270M044L598L289L319L901
$$ plain form
51782 337610 336507 335752 334884 333715 332214 330498 328820 327292 325806 324465 323868 324651 326922 330436 335110
51767 335110 340974 347812 355304 363524 372848 383306 394308 404994 414563 422265 427451 429712 428822 424601
51753 424601 417255 407786 397684 388017 379128 371201 364613 359507 355457 351888 348550 345374 342294 339642
51739 339642 338338 339136 341812 345543 349952 355314 361878 369626 378654 389114 400448 411155 419698 425491
51725 425491 428914 430837 432370 434635 438237 442916 447878 452180 454662 454002 449544 442123 433718 426180
51711 426180 420367 416192 412993 409832 405934 401150 395892 390591 385442 380696 376910 374648 373982 374379 375019
51696 375019 375189 374469 372748 370245 367569 365583 364875 365302 366175 366895 367148 366513 364466 361044 357124 353584
51680 353584 350515 347675 345441 344626 345456 347375 349896 353084 357016 361286 365330 368928 372217 375536 379437
51665C79437N116O739Q524J0459J2327J3293J2468R708N532N10m745r318j2383
51652D37667j3748j3555j1660q034l571L09K880M318M778L968J808j240m594p782
51638C91544j0133j1029j0668r918r220q174o517m753l502k777k334k165k229
51625C08125k121j501m98O19J784K795L141K635J815J246Q11J30p46j554k328
51610C14353l057l232k512j613j694k787l550k819r15Q20J464J248J160J930L342
51595C02138M572N242N876P046Q434R287R494R489R124P566M647J528n16j457
51581C82470k073k517k136o05J455L214M518N816P464R373J1130J2231J2356J1664
51567D54360J0878J0877J1977J3585J4592J4360J3408J3110J4540J7608K1391
$$ plain form
51665 379437 384553 391292 399816 410275 422602 435895 448363 458071 463603 464113 459368 450050 437667
51652 437667 423919 410364 398704 390670 387099 387408 390288 394606 399384 403352 405160 403920 399326 391544
51638 391544 381411 370382 359714 349796 340576 332402 325885 321132 317630 314853 312519 310354 308125
51625 308125 306004 304503 304005 304624 306408 309203 312344 314979 316794 318040 318851 318981 318235 316681 314353
51610 314353 311296 308064 305552 303939 302245 299458 295908 293089 292174 292994 294458 295706 296866 298796 302138
51595 302138 306710 311952 317828 324874 333308 342595 352089 361578 370702 378268 382915 384443 383927 382470
51581 382470 380397 377880 375744 375139 376594 379808 384326 390142 397606 406979 418109 430340 442696 454360
51567 454360 465238 476115 488092 501677 516269 530629 544037 557147 571687 589295 610686
51556F10686K5190K8917L2560L5532L6750L5112L0053K2025J2622L716l950j1015
51544H58198j8112k4730k9952l3739l6590l8316l8156l6223l3671l1203k8375
51533E09131k4785k1014j7687j4534j1208q394p016o801o581n840m972m240l456
51520C72603k708k458k709k886k694k499k579k698k588k327k010j602j208j015
51506C40622q91n95m87j235k637l494l073k005j305j087q43m54k44k87k69j0L76
51489C22082Q32J476K339L148L481L189K637K442K765L078K803J937P34q27k625
51474C49491l883l918l264l112l607l788l254k788k961l242l101k941l231l568
51460C02833l426l036k775k381j640j120j237j248k46J287K079J879J640J989
$$ plain form
51556 610686 635876 664793 697353 732885 769635 804747 834800 856825 869447 873163 869213 858198
51544 858198 840086 815356 785404 751665 715075 676759 638603 602380 568709 537506 509131
51533 509131 484346 463332 445645 431111 419903 411509 404493 397692 391111 385271 380299 376059 372603
51520 372603 369895 367437 364728 361842 359148 356649 354070 351372 348784 346457 344447 342845 341637 340622
51506 340622 339731 339136 338649 337414 334777 331283 328210 326205 324900 323813 322970 322516 322272 321985 321716 321706 322082
51489 322082 322914 324390 326729 329877 333358 336547 339184 341626 344391 347469 350272 352209 352943 352116 349491
51474 349491 345608 341690 338426 335314 331707 327919 324665 321877 318916 315674 312573 309632 306401 302833
51460 302833 299407 296371 293596 291215 289575 288455 287218 285970 285724 287011 289090 290969 292609 294598
51446B94598K636L281M141N421O979Q633J0202J1322J1740J1678J1290J0036P445
51433C99402M286K075J460J890K699L413L073N66l752p755r573r344q493p918
51419C72029p505o980o451o103n823n236m076k638j664j547j695j117L22J709
51405C23225K145J619Q09L96O32J229J657J880K530L926N226N384M694M529N475
51390C65356O727P499Q013Q740R579J0335J1328J2911J5015J7605K0961K5014
51378E19083K9041L2489L5500L8198M0236M1681M3393M5454M5893M2288L4464
51367I47720K4509J4286M107o152j5888k4378l1654l8050m3364m7005m8707m8692
51355F86732m7307m4801m1364l7145l2351k7425k2945j9207j6091j3443j1315
$$ plain form
51446 294598 297234 300515 304656 310077 317056 325689 335891 347213 358953 370631 381921 391957 399402
51433 399402 403688 405763 407223 409113 411812 415225 418298 418864 415112 407357 397784 388440 379947 372029
51419 372029 364524 357544 351093 344990 339167 333931 329855 327217 325553 324006 322311 321194 321516 323225
51405 323225 325370 326989 327798 328194 328826 330055 331712 333592 336122 340048 345274 350658 355352 359881 365356
51390 365356 372083 379582 387595 396335 405914 416249 427577 440488 455503 473108 494069 519083
51378 519083 548124 580613 616113 654311 694547 736228 779621 825075 870968 913256 947720
51367 947720 972229 986515 990622 984470 968582 944204 912550 874500 831136 784131 735424 686732
51355 686732 639425 594624 553260 516115 483764 456339 433394 414187 398096 384653 373338
51344C73338r669q081o149m125k837k783l509m020l750k971k249j806j563j569
51330C18257j930k390k397j776r98n11j66L34P05L28p90j765j802j108o89j294
51314C02008k634l666l565k489j351q18o50j83P10J424J443R72N76M14J42m10
51298B91923q37o33J09P32P67L94J00J04K83M63N72O12P62J335K352L271L495
51281C05804L139K852K810K440J395K98K5N15P55Oj427k580k737j895o28L97Q77
51264C12046R44Q44P40P99J133J402Q23q44k617l161k420j718k036k857l056k460
51248B97562j840j662j560j069l02L56P83J078J248J214R97O91L43L7p2K7L5l36
51230B97530r90j529j655j277m11P75J860K427K442K173J782J266P47M36K98J54
$$ plain form
51344 373338 363669 355588 349439 345314 342477 339694 336185 332165 328415 325444 323195 321389 319826 318257
51330 318257 316327 313937 311540 309764 308766 308255 308089 308423 309128 309456 308666 306901 305099 303991 303302 302008
51314 302008 299374 295708 292143 289654 288303 287485 286835 286652 287362 288786 290229 291201 291777 292191 292333 291923
51298 291923 291086 290453 290562 291294 292061 292455 292555 292659 292942 293405 293977 294589 295351 296686 299038 302309 305804
51281 305804 308943 311795 314605 317045 318440 318738 318763 319278 320033 320039 318612 316032 313295 311400 310772 311169 312046
51264 312046 312990 313834 314574 315373 316506 317908 318731 317887 315270 312109 309689 307971 305935 303078 300022 297562
51248 297562 295722 294060 292500 291431 291129 291485 292268 293346 294594 295808 296805 297496 297839 297876 297804 297831 297866 297530
51230 297530 296540 295011 293356 292079 291668 292443 294303 296730 299172 301345 303127 304393 305140 305576 305874 306028
51214C06028R5L91Q50Q09M8p24p42j19N27R55J334J659J792J942K421K974K955
51197C23195K329J811J825J898J453P36M37O84Q88N79l2l77k05J94L40J05j41
51180C35719k3K50Pj099k583l571l692l302k921k652k300j880j727j966k114j579
51164C04567n08K43J81j58J40J258K555L322L341K808K099J633J583J711J667
51149C26442J435J240J152J057Q99O41N3j005k170k790k621k021j485j243j278
51134C18306j368j205p88n38o05l81O98J998K264J397Q05J556K974L548K707J139
51118C32507k10q68q62n65l78k46K92J329K195K225J581R53O79O66Q80J360J869
51101C43407K015J763J460J371J432J483J467J353J094O51K3o96j245j338j029
$$ plain form
51214 306028 306123 306514 307364 308173 308221 307497 306755 306636 307163 308118 309452 311111 312903 314845 317266 320240 323195
51197 323195 325524 327335 329160 331058 332511 333247 333684 334368 335256 335835 335803 335426 335221 335415 335755 335860 335719
51180 335719 335696 335946 335953 334854 332271 328700 325008 321706 318785 316133 313833 311953 310226 308260 306146 304567
51164 304567 304059 304302 304483 304325 304465 305723 308278 311600 314941 317749 319848 321481 323064 324775 326442
51149 326442 327877 329117 330269 331326 332225 332866 332919 331914 329744 326954 324333 322312 320827 319584 318306
51134 318306 316938 315733 314945 314407 313802 313421 314119 316117 318381 319778 320583 322139 325113 328661 331368 332507
51118 332507 332297 331429 330567 330002 329624 329378 329670 330999 333194 335419 337000 337953 338632 339298 340178 341538 343407
51101 343407 345422 347185 348645 350016 351448 352931 354398 355751 356845 357496 357519 356823 355578 354240 353211
51086C53211p30p48r88j195j239j076p41n21p50j241j318p60k43m48j066j224
51070C38923o29J96P61J133J645K480L518M390M733M618M610N161O171P449R198
51055C94357J1405J2976J2326R137N062K355K032L517N777Q298J0887J2909J3372
51042E04410J2005R952Q677Q154O854L779p8k745l287k293r60m58j804n321j0035
51027E26850j4232j6781j7532j6676j4468j1628r124p223n293k900n76Q37J229
51014D12483J233J477K197L315M552N498N778N214L972K703K335L264M829N949
51000D64799O356O662P224P597P375O896O645O473N977N307M979N094N340N599
50986E52323N881N781M763L171K289K895M226M915M654M315M413M067J853k556
$$ plain form
51086 353211 352481 351733 350745 349550 348311 347235 346494 345973 345223 343982 342664 341904 341661 341213 340147 338923
51070 338923 338294 338490 339251 340384 342029 344509 348027 352417 357150 361768 366378 371539 377710 385159 394357
51055 394357 405762 418738 431064 440201 445263 447618 449650 453167 458944 467242 478129 491038 504410
51042 504410 516415 526367 535044 543198 550052 553831 553753 551008 547721 545428 544468 544010 542206 536885 526850
51027 526850 512618 495837 478305 461629 447161 435533 426409 419186 413893 410993 410417 411254 412483
51014 412483 413716 415193 417390 420705 425257 430755 436533 441747 445719 448422 450757 454021 458850 464799
51000 464799 471155 477817 485041 492638 500013 506909 513554 520027 526004 531311 536290 541384 546724 552323
50986 552323 558204 563985 568748 571919 574208 577103 581329 586244 590898 595213 599626 603693 605546 602990
50972F02990p898j2397j5067j6005j5717j4411j1997q618m887j524J195L327M779
50959E03770N300N137N211O218P796R104J0047J1312J3179J4950J5915J6347J7030
50946F41316J8198J9442K0558K1962K4134K7002L0036L2812L5191L6784L6447
50935I43882L2886K6175J8351J1877P532M286J169j633l657n294p402j0398j4183
50922A003591j8397k2220k4552k5131k5034k5339k5701k5035k3233k1241j9648
50911G48060j8223j6835j5783j5028j3976j2419j0987j0310j0207j0116r829r544
50899E94803r460r529r320q187o023l829k831l006l153k609k094k452l291l537
50885E25482k950k319k268k497k276j406m42j4r4j09J35J28l73n36O28K702M124
$$ plain form
50972 602990 595092 582695 567628 551623 535906 521495 509498 500880 495993 494469 495664 498991 503770
50959 503770 509070 514207 519418 525636 533432 542536 552583 563895 577074 592024 607939 624286 641316
50946 641316 659514 678956 699514 721476 745610 772612 802648 835460 870651 907435 943882
50935 943882 976768 1002943 1021294 1033171 1040703 1044989 1046158 1044525 1040868 1035574 1028172 1017774 1003591
50922 1003591 985194 962974 938422 913291 888257 862918 837217 812182 788949 767708 748060
50911 748060 729837 713002 697219 682191 668215 655796 644809 634499 624292 614176 604347 594803
50899 594803 585343 575814 566494 558307 552284 548455 545624 542618 539465 536856 534762 532310 529019 525482
50885 525482 522532 520213 517945 515448 513172 511766 511324 511310 511216 511107 511242 511370 510997 510461 511089 513791 517915
50868E17915M126L506L313L664M234M993N739N755M780L824M085N389O548P031
50854E84902P389Q094Q878R388R776J0385J1244J2228J3284J4324J5248J6143
50842G21283J7200J8278J8894J8871J8682J8921J9638K0512K1507K2961K5014
50831I41761K7285K9342L1242L3314L5565L7702L9790M2345M5495M8478N0492
50820A362811N1772N3216N4935N5759N4292N0022M3300L4780K5090J4755M136
50809A804868o363j6137k4762l2523l9938m6705n1761n4548n5526n5099n2956
50798A368550m9018m4384m0374l7048l3512k9446k5462k2002j8780j5446j2064
50787A041014q724n270j828Q77K144K087J532J171R69L44j071k817l933m060m034
$$ plain form
50868 517915 522041 525547 528860 532524 536758 541751 547490 553245 558025 561849 565934 571323 577871 584902
50854 584902 592291 600385 609263 618651 628427 638812 650056 662284 675568 689892 705140 721283
50842 721283 738483 756761 775655 794526 813208 832129 851767 872279 893786 916747 941761
50831 941761 969046 998388 1029630 1062944 1098509 1136211 1176001 1218346 1263841 1312319 1362811
50820 1362811 1414583 1467799 1522734 1578493 1632785 1682807 1726107 1760887 1785977 1800732 1804868
50809 1804868 1798505 1782368 1757606 1725083 1685145 1638440 1586679 1532131 1476605 1421506 1368550
50798 1368550 1319532 1275148 1234774 1197726 1164214 1134768 1109306 1087304 1068524 1053078 1041014
50787 1041014 1032290 1027020 1025192 1026069 1028213 1030300 1031832 1033003 1033972 1034316 1033245 1030428 1026495 1022435 1018401
50772A018401m975o872q584r351r795j1067j3373j5870j7867j9497k0980k1756
50760H58414k0975j8796j6560j5371j4920j4177j2868j1631j0830r885q090n550
50748F98761k972r22M60J363K253L652N632P682R294J0461J1482J2606J4100J6234
50734G90086J8866K1242K2610K2857K2344K1432K0394J9398J8187J6141J3101
50723A006658R833P234N359L719K146Q27k64j283k005k028j432n60P67L107O381
50708A038459R696J2438J5017J8206K2131K6167K9496L1607L2489L2541L2079
50697A300326L0851K8266K4179J9170J4057R350N187J447k106n474q154r455r197
50684A398447p873o266n126m999n935p356q636r713j0727j1221j0365p943m473
$$ plain form
50772 1018401 1013426 1006554 997970 988619 978824 967757 954384 938514 920647 901150 880170 858414
50760 858414 837439 818643 802083 786712 771792 757615 744747 733116 722286 712401 704311 698761
50748 698761 695789 694867 695327 696690 698943 702595 708227 715909 725203 735664 747146 759752 773852 790086
50734 790086 808952 830194 852804 875661 898005 919437 939831 959229 977416 993557 1006658
50723 1006658 1016491 1023725 1029084 1032803 1034949 1035776 1035512 1034229 1032224 1030196 1028764 1028204 1028971 1032078 1038459
50708 1038459 1048155 1060593 1075610 1093816 1115947 1142114 1171610 1203217 1235706 1268247 1300326
50697 1300326 1331177 1359443 1383622 1402792 1416849 1426199 1431386 1432833 1430727 1425253 1417099 1407644 1398447
50684 1398447 1390574 1384308 1379182 1374183 1368248 1360892 1352256 1342543 1331816 1320595 1310230 1302287 1297814
50671A297814k56M912J0763J6024J9418K0858K1150K0899K0142J8883J7457J6280
50659A484344J5560J5184J4869J4527J4434J4850J5445J5492J4687J3468J2465
50648A645325J2059J2534J4118J6593J9379K2262K5568K9317L2836L5647L8235
50637A903873M1169M3925M5289M4670M2354L8713L3897K8339K2728J7490J2787
50626B275234Q966O371M742L564K818K238k88p854k0852l4921m4011m5369m0720
50613B109918l3177k4488j5341o601P48O173R234R210N817j68p729j6635k6884
50600B010077l7590m7303n5315o1664o6012o7618o6708o4749o2839o0592n7118
50589A362569n2385m6947m1136l5306l0264k6447k3019j8737j3608q830n168k243
$$ plain form
50671 1297814 1297558 1302470 1313233 1329257 1348675 1369533 1390683 1411582 1431724 1450607 1468064 1484344
50659 1484344 1499904 1515088 1529957 1544484 1558918 1573768 1589213 1604705 1619392 1632860 1645325
50648 1645325 1657384 1669918 1684036 1700629 1720008 1742270 1767838 1797155 1829991 1865638 1903873
50637 1903873 1945042 1988967 2034256 2078926 2121280 2159993 2193890 2222229 2244957 2262447 2275234
50626 2275234 2284200 2290571 2295313 2298877 2301695 2303933 2303645 2295791 2274939 2240018 2196007 2150638 2109918
50613 2109918 2076741 2052253 2036912 2030311 2031059 2037232 2046466 2055676 2061493 2061325 2053596 2036961 2010077
50600 2010077 1972487 1925184 1869869 1808205 1742193 1674575 1607867 1543118 1480279 1419687 1362569
50589 1362569 1310184 1263237 1222101 1186795 1156531 1130084 1107065 1088328 1074720 1065890 1060722 1058479
50577A058479N87L468O212Q514R895J0128R878J0127J0899J1257J0679R657Q653
50564A168433P444N907M597L932L587L383M054O315R738J3371J7071K1185K5351
50551A294368K8687L1160L3557L5911L6974L5785L2983L0036K7751K6214K5727
50540A639153K6869K9667L3382L7442M2092M7777N4131O0150O5413P0575P6389
50529B183040Q2617Q8377R3395R8194J03070J07547J11166J14086J16379J17209
50519C215080J15391J10480J02679R1949P7921O0715M1155K0154j544k3011m3249
50508C767720o1884p9111r4580j06874j14564j17316j15591j09663r9685q6423
50498B782029p1158n4702l7079j8408K64J7314L1397M1729M7651M8417M3445L2668
$$ plain form
50577 1058479 1059066 1062534 1068746 1077260 1087155 1097283 1107161 1117288 1128187 1139444 1150123 1159780 1168433
50564 1168433 1175877 1181784 1186381 1190313 1193900 1197283 1201337 1207652 1217390 1230761 1247832 1269017 1294368
50551 1294368 1323055 1354215 1387772 1423683 1460657 1496442 1529425 1559461 1587212 1613426 1639153
50540 1639153 1666022 1695689 1729071 1766513 1808605 1856382 1910513 1970663 2036076 2106651 2183040
50529 2183040 2265657 2354034 2447429 2545623 2648693 2756240 2867406 2981492 3097871 3215080
50519 3215080 3330471 3440951 3543630 3635579 3713500 3774215 3815370 3835524 3833980 3810969 3767720
50508 3767720 3705836 3626725 3532145 3425271 3310707 3193391 3077800 2968137 2868452 2782029
50498 2782029 2710871 2656169 2619090 2600682 2600946 2618260 2649657 2691386 2739037 2787454 2830899 2863567
50486B863567J6597l640k6205m8785o9297q6487r9773j08696j13017j13379j11269
50475B099616j07911j03473r7770r1393q5484q0374p5199o9085o2227n5459m9204
50464A222037m3333l7829l3071k9329k6281k3176j9455j5283j1464q693o842n139
50452I62142l125j144L33J521L084N196P224Q384Q573Q491R076J0767J3061J4996
50438A048579J6112J6803J7450J7588J6426J4053J1478R443P816O448N853O536
50426A194585Q031R380J0417J1958J4606J7887K0857K3219K5553K8622L2716L7655
50414A435486M3065M8450N3189N6773N9272O1333O3366O4833O4629O2323N8645
50403B071364N4681N0824M6780M2112L6382K8985J9479Q142m164j6760k9534m2451
$$ plain form
50486 2863567 2880164 2876524 2850319 2801534 2732237 2645750 2545977 2437281 2324264 2210885 2099616
50475 2099616 1991705 1888232 1790462 1699069 1613585 1533211 1458012 1388927 1326700 1271241 1222037
50464 1222037 1178704 1140875 1107804 1078475 1052194 1029018 1009563 994280 982816 974123 967281 962142
50452 962142 959017 957873 958206 959727 962811 968007 975231 983615 992188 1000679 1009755 1020522 1033583 1048579
50438 1048579 1064691 1081494 1098944 1116532 1132958 1147011 1158489 1167932 1175748 1182196 1188049 1194585
50426 1194585 1202616 1211996 1222413 1234371 1248977 1266864 1287721 1310940 1336493 1365115 1397831 1435486
50414 1435486 1478551 1527001 1580190 1636963 1696235 1757568 1820934 1885767 1950396 2012719 2071364
50403 2071364 2126045 2176869 2223649 2265761 2302143 2331128 2350607 2358749 2354585 2337825 2308291 2265840
50391B265840n5002o6140p4605p9414q0368p8126p3519o6865n8288m8560l8869
50380A546084k9665k0337j0517j113O502J1956J5800J8180J8300J5419R752K126
50368A582487o866j6819k6852l5571m1977m6202m9068n0944n1387m9995m7301
50357A159505m4390m1762l9005l5698l2184k9203k6974k5089k3160k1407k0354
50346H20279k0027j9566j7869j4832j1676r747r069q482p098n102l196j783q81
50333F90951k80M23J446K251K018R12K46R04K303L475M473N958P890R631J1026
50318G43627J2402J3699J4495J4829J5056J4894J3518J0738P273L670l9l321m842
50305H55999l960j873m48k21j87O29K141L605M560N051N309N537N894O393O615
$$ plain form
50391 2265840 2210838 2144698 2070093 1990679 1910311 1832185 1758666 1691801 1633513 1584953 1546084
50380 1546084 1516419 1496082 1485565 1484452 1490954 1502910 1518710 1536890 1555190 1570609 1580361 1582487
50368 1582487 1575621 1558802 1531950 1496379 1454402 1408200 1359132 1308188 1256801 1206806 1159505
50357 1159505 1115115 1073353 1034348 998650 966466 937263 910289 885200 862040 840633 820279
50346 820279 800252 780686 762817 747985 736309 726562 717493 709011 701913 696811 693615 691832 690951
50333 690951 690671 691094 692540 694791 696809 697721 697967 698871 701174 704649 709122 715080 722970 732601 743627
50318 743627 756029 769728 784223 799052 814108 829002 842520 853258 860531 864201 864162 860841 855999
50305 855999 852039 850166 849718 849497 849310 849939 852080 855685 860245 865296 870605 876142 882036 888429 895044
50290H95044N841L953K111J856L382N472P449J0291J5136K1668K8862L5955M0829
50277A077849L8501K4458N86k4223m0952m7017m5573m0429l3530k6014j9109j3473
50265H51074r053n833l910k866j992j106m47J26J004K001K463K145J309Q8j414
50250H33589k609k883k574k656l373m005m024l639l131k489j918j816j944j399
50236G95129K06K164L679M759N754O642P273P821Q490R145R748J0688J2209J3768
50222H97475J4412J3721J1988R730P369N260L717K949L013L623L946L059Q38j846
50208I79254m193o438r406j3310j7344k0374k1785k1644k0385j8464j6201j3824
50196G95886j1513r297o938m210j378O53P59j715o425j1917j6237j8147j7791
$$ plain form
50290 895044 900885 904838 906949 908805 912187 917659 925108 935399 950535 972203 1001065 1037020 1077849
50277 1077849 1116350 1140808 1141394 1117171 1076219 1029202 983629 943200 909670 883656 864547 851074
50265 851074 842021 836188 832278 829412 827420 826314 825867 825993 826997 828998 831461 833606 834915 835003 833589
50250 833589 830980 828097 825523 822867 819494 815489 811465 807826 804695 802206 800288 798472 796528 795129
50236 795129 795335 797499 801178 805937 811691 818333 825606 833427 841917 851062 860810 871498 883707 897475
50222 897475 911887 925608 937596 947326 954695 959955 963672 966621 969634 973257 977203 980262 981100 979254
50208 979254 975061 968623 959217 945907 928563 908189 886404 864760 844375 825911 809710 795886
50196 795886 784373 775076 768138 763928 762550 763203 763962 762247 755822 743905 727668 709521 691730
50183F91730j6110j3812j1279r113p885p264o183m300k618k187k650k698j668
50170F03963j63Q46R70N36J02j5O4M4p8L0N33J162J660K160K851L485L657L355
50152F25162K947K691K629K912L742M897N593N089L374J207n54j648k424l199
50138F52418l744l635k922k089j366n15N83J632K432L239M192M830M661L985L610
50123F67311L927M716N745O936Q038Q710R136J0025J1740J3850J5783J7624J9846
50110H03387K2530K5274K7824L0324L2757L4437L4496L2841L0316K7798K5466
50099A127450K3179K1242K0168J9813J9286J7811J5164J1149N373k000r808j6734
50087A252093k2315k6693k9871l1860l3143l4137l4341l2843k9784k6472k3900
$$ plain form
50183 691730 675620 661808 650529 641416 633531 626267 620084 615784 613166 610979 608329 605631 603963
50170 603963 603800 604646 605616 606152 606254 606239 606303 606347 606269 606299 606832 607994 609654 611814 614665 618150 621807 625162
50152 625162 628109 630800 633429 636341 640083 644980 650573 655662 659036 660243 659689 658041 655617 652418
50138 652418 648674 645039 642117 640028 638662 638147 638730 640362 642794 646033 650225 655055 659716 663701 667311
50123 667311 671238 675954 681699 688635 696673 705383 714519 724544 736284 750134 765917 783541 803387
50110 803387 825917 851191 879015 909339 942096 976533 1011029 1043870 1074186 1101984 1127450
50099 1127450 1150629 1171871 1192039 1211852 1231138 1248949 1264113 1275262 1280635 1278635 1268827 1252093
50087 1252093 1229778 1203085 1173214 1141354 1108211 1074074 1039733 1006890 977106 950634 926734
50076I26734k1845j9660j7194j4593j1849r098o925n770n364n125m856m682m578
50063G95195m433m295m235m133l992m086m373m164l013j688j462k433l350l305
50049G46233k797k794l294l472k926k207k029k383k528j777k42J238J961K105
50035G25088K429L296M339N118N685O249O666O645O279N962N869N796N482M807
50021G99710L724K309Q38l96j372k235l003l597m118m776n643o686p958r366j0309
50006G47122j0084q745p146n962n079m052k760j259N77K890N536Q361J1466J4800
49992G45665J7653J9075J8850J7781J6967J6985J7593J7941J7121J4802J1355
49981I31788P330L069r60l945n321n449n135m701m135m028n459q733j2852j6634
$$ plain form
50076 926734 904889 885229 868035 853442 841593 832495 825570 819800 814436 809311 804455 799773 795195
50063 795195 790762 786467 782232 778099 774107 770021 765648 761484 758471 756783 755321 752888 749538 746233
50049 746233 743436 740642 737348 733876 730950 728743 726714 724331 721803 720026 719784 721022 722983 725088
50035 725088 727517 730813 735152 740270 745955 752204 758870 765515 771794 777756 783625 789421 794903 799710
50021 799710 803434 805743 806581 806185 804813 802578 799575 795978 791860 787084 781441 774755 766797 757431 747122
50006 747122 737038 728293 721147 715185 710106 706054 703294 702035 702612 705502 711038 719399 730865 745665
49992 745665 763318 782393 801243 819024 835991 852976 870569 888510 905631 920433 931788
49981 931788 939118 942187 941227 937282 931961 926512 921377 916676 912541 908513 903054 894321 881469 864835
49967H64835j9768k2457k4521k5509k5313k4213k2397j9927j7080j4276j1653
49956F37721r011o235l471r58J195L031M730O528Q410R917J0422R669Q000O040
49942F85988M200K431M98j511l003l472l238l300m332o193q431j0848j3251j5094
49928F20444j5859j5625j4826j3579j1686r246o899n300m571m212l463j937j17
49915E13124J058J390J782K978M287M429L419K707L251M401N151N690O890Q822
49901E69379J0607J1649J2176J2564J2751J2575J2141J1507J0339Q326N836L780
49889F93630K645J863L36k463o034r458j2175j4025j4820j4466j3405j2436j1860
49876E87332j1215j0189r260q958q843p939o098m253l159k546j796r02k87M6N73
$$ plain form
49967 864835 845067 822610 798089 772580 747267 723054 700657 680730 663650 649374 637721
49956 637721 628710 622475 619004 618046 619241 622272 627002 633530 641940 651857 662279 671948 679948 685988
49942 685988 690188 692619 693117 691606 688603 685131 681893 678593 674261 668068 659637 648789 635538 620444
49928 620444 604585 588960 574134 560555 548869 539623 532724 527424 522853 518641 515178 513241 513124
49915 513124 514182 515572 517354 520332 524619 529048 532467 535174 538425 542826 547977 553667 560557 569379
49901 569379 579986 591635 603811 616375 629126 641701 653842 665349 675688 684014 689850 693630
49889 693630 696275 698138 698474 696011 689977 680519 668344 654319 639499 625033 611628 599192 587332
49876 587332 576117 565928 556668 547710 538867 530928 524830 520577 517418 514872 513076 512174 511887 511933 512506
49861E12506J610K942M061M555M405M204M924P051R960J2508J4123J4949J5036
49848F12834J4083J2097R740P577N526L361J420J39p80k118m069o029p466q452
49834F37863r205r576r301q455p409o481n767n129m318l285k382j912j532n46
49820E62565J121K758L865M774N945P256Q431R589J0703J1051J0054Q423P434
49807F53969P196O621N225L809K960J929j78k901n026o225p075p740p679o810
49793F38075o050o333p659r337j0700j1275j0833r685q536p711o781n342l769
49780E34064k718k154j519p09k10k16k19K19Q56J310J848L090N051O993Q226Q707
49764E62619Q788Q640Q122P081N667M396L815L938M086L486K016J39j807l951
$$ plain form
49861 512506 514116 517058 521119 525674 530079 534283 539207 546258 556218 568726 582849 597798 612834
49848 612834 626917 639014 648754 656331 661857 665218 666638 666777 665997 663879 659810 653781 646315 637863
49834 637863 628658 619082 609781 601326 593917 587436 581669 576540 572222 568937 566555 564643 563111 562565
49820 562565 563686 566444 570309 575083 581028 588284 596715 606304 617007 628058 638112 646535 653969
49807 653969 661165 667786 673011 676820 679780 681709 681531 678630 673604 667379 660304 652564 644885 638075
49793 638075 632025 625692 618033 608696 597996 586721 575888 566203 557667 549956 543175 537833 534064
49780 534064 531346 529192 527673 526964 526754 526538 526319 526538 527394 528704 530552 533642 538693 545686 553912 562619
49764 562619 571407 580047 588169 595250 600917 605313 609128 613066 617152 620638 622654 622793 620986 617035
49750F17035o387q760j0498j1285j1067r935q232o581n400m466l314k010j161
49737E27939j113j486j696j597j356r55r9J364L131M596N185M639L222J720J075
49722E44569J715L275N048O766Q713J0984J2945J3813J3636J3244J2966J1990
$$ plain form
49750 617035 610648 601888 591390 580105 569038 559103 550871 544290 538890 534424 531110 529100 527939
49737 527939 526826 525340 523644 522047 520691 519736 519637 521001 524132 528728 533913 538552 541774 543494 544569
49722 544569 546284 549559 554607 561373 570086 581070 594015 607828 621464 634708 647674 659664
$$ [...]
##END NTUPLES=NMR SPECTRUM
##END=
