
##TITLE=AC1358_CPIAH12177_6945607_7a2jvQsBHC
##JCAMPDX= 6.0         $$ Bruker NMR JCAMP-DX V2.0
##DATA TYPE= NMR SPECTRUM
##DATA CLASS= NTUPLES
##ORIGIN= BRUKER
##OWNER= Administrator
$$ 1.72 TOPSPIN		Version 2.1
$$ 2012-10-18 13:47:09.913 -0700  Administrator@X
$$ Compression mode = diff/dup
##.OBSERVE FREQUENCY= 400.02188249412
##.OBSERVE NUCLEUS= ^1H
##.ACQUISITION MODE= SIMULTANEOUS (DQD)
##.ACQUISITION SCHEME= undefined
##.AVERAGES= 8
##.DIGITISER RES= 22
##SPECTROMETER/DATA SYSTEM= spect
##.PULSE SEQUENCE= zg30
##.SOLVENT NAME= COFFEE_meoh
##.SHIFT REFERENCE= INTERNAL, COFFEE_meoh, 1, 14.98509
##AUDIT TRAIL= $$ (NUMBER, WHEN, WHO, WHERE, PROCESS, VERSION, WHAT)
$$ ##TITLE= Audit trail, TOPSPIN		Version 2.1
$$ ##JCAMPDX= 5.01
$$ ##ORIGIN= Bruker BioSpin GmbH
$$ ##OWNER= Administrator
$$ $$ C:\Bruker\TOPSPIN/data/COFFEE/nmr/AC1358_CPIAH12177_6945607_7a2jvQsBHC/10/pdata/1/auditp.txt
$$ ##AUDIT TRAIL=  $$ (NUMBER, WHEN, WHO, WHERE, PROCESS, VERSION, WHAT)
(   1,<2012-10-13 22:14:23.359 -0500>,<Administrator>,<TOPSPIN>,<go>,<TOPSPIN 2.1>,
      <created by zg
	started at 2012-10-13 22:13:16.796 -0500,
	POWCHK enabled, PULCHK disabled,
       configuration hash MD5:
       6B 1B 68 BB D9 2E 58 E2 7F 35 AD 54 07 DF 0E 41
       data hash MD5: 64K
       60 D6 F3 40 FE C8 FD 90 6C 9E 3F C8 6C 66 89 A6>)
(   2,<2012-10-13 22:14:25.968 -0500>,<Administrator>,<TOPSPIN>,<proc1d>,<TOPSPIN 2.1>,
      <Start of raw data processing
       efp LB = 0 FT_mod = 6 PKNL = 1 PHC0 = 0 PHC1 = 0 SI = 32K 
       data hash MD5: 32K
       CF 4C 57 4A 3F 50 84 A6 7F 80 67 2C F2 0E CF 3D>)
(   3,<2012-10-13 22:14:26.375 -0500>,<Administrator>,<TOPSPIN>,<proc1d>,<TOPSPIN 2.1>,
      <pk PHC0 = 184.1968 PHC1 = 0 
       data hash MD5: 32K
       C2 F1 9C 63 70 92 4F CB 20 A1 39 F8 B8 CA 69 A9>)
(   4,<2012-10-13 22:14:26.468 -0500>,<Administrator>,<TOPSPIN>,<proc1d>,<TOPSPIN 2.1>,
      <abs ABSG = 1 
       data hash MD5: 32K
       9B C5 B9 0F 6C 32 3F 12 20 3C F1 38 E9 C6 ED FD>)
(   5,<2012-10-13 22:14:26.515 -0500>,<Administrator>,<TOPSPIN>,<proc1d>,<TOPSPIN 2.1>,
      <abs ABSG = 2 
       data hash MD5: 32K
       CA BB 08 83 E5 80 F9 92 D7 C9 1F 17 92 5B 4D 77>)
(   6,<2012-10-13 22:14:26.546 -0500>,<Administrator>,<TOPSPIN>,<proc1d>,<TOPSPIN 2.1>,
      <abs ABSG = 3 
       data hash MD5: 32K
       B5 24 A1 03 23 EF EF 19 E5 80 0B E4 16 72 28 89>)
(   7,<2012-10-13 22:14:26.578 -0500>,<Administrator>,<TOPSPIN>,<proc1d>,<TOPSPIN 2.1>,
      <abs ABSG = 4 
       data hash MD5: 32K
       D2 34 59 E2 39 DF F7 50 8E D0 B3 7E A2 1D A4 BD>)
(   8,<2012-10-13 22:14:26.609 -0500>,<Administrator>,<TOPSPIN>,<proc1d>,<TOPSPIN 2.1>,
      <abs ABSG = 5 
       data hash MD5: 32K
       C7 D0 A1 69 41 A8 D0 7E B5 86 8A 8D C7 27 EA 6D>)
(   9,<2012-10-13 22:14:30.218 -0500>,<Administrator>,<TOPSPIN>,<audit>,<TOPSPIN 2.1>,
      <user comment:
       ICON-NMR User ID: COFFEE
       data hash MD5: 32K
       C7 D0 A1 69 41 A8 D0 7E B5 86 8A 8D C7 27 EA 6D>)
$$ ##END=
$$ [...]
150 150 150 150 150 150 150 150
##$TP07= 0
##$TPNAME0= <>
##$TPNAME1= <>
##$TPNAME2= <>
##$TPNAME3= <>
##$TPNAME4= <>
##$TPNAME5= <>
##$TPNAME6= <>
##$TPNAME7= <>
##$TPOAL= (0..7)
0.5 0.5 0.5 0.5 0.5 0.5 0.5 0.5
##$TPOFFS= (0..7)
0 0 0 0 0 0 0 0
##$TUNHIN= 0
##$TUNHOUT= 0
##$TUNXOUT= 0
##$USERA1= <user>
##$USERA2= <user>
##$USERA3= <user>
##$USERA4= <user>
##$USERA5= <user>
##$V9= 5
##$VALIST= <valist>
##$VCLIST= <CCCCCCCCCCCCCCC>
##$VD= 0
##$VDLIST= <DDDDDDDDDDDDDDD>
##$VPLIST= <PPPPPPPPPPPPPPP>
##$VTLIST= <TTTTTTTTTTTTTTT>
##$WBST= 2048
##$WBSW= 25
##$XGAIN= (0..3)
0 0 0 0
##$XL= 0
##$YL= 0
##$YMAX_a= 505185
##$YMIN_a= -649149
##$ZGOPTNS= <>
##$ZL1= 120
##$ZL2= 120
##$ZL3= 120
##$ZL4= 120
##$ABSF1= 14.98509
##$ABSF2= -5.573092
##$ABSG= 5
##$ABSL= 3
##$ALPHA= 0
##$AQORDER= 0
##$ASSFAC= 0
##$ASSFACI= 0
##$ASSFACX= 0
##$ASSWID= 0
##$AUNMP= <proc_prof1d_extract_pilot.lims>
##$AXLEFT= 0
##$AXNAME= <>
##$AXNUC= <1H>
##$AXRIGHT= 0
##$AXTYPE= 0
##$AXUNIT= <>
##$AZFE= 0.1
##$AZFW= 0.1
##$BCFW= 0
##$BC_mod= 0
##$BYTORDP= 0
##$COROFFS= 0
##$CY= 15
##$DATMOD= 1
##$DC= 0
##$DFILT= <>
##$DTYPP= 0
##$F1P= 0
##$F2P= 0
##$FCOR= 0.5
##$FTSIZE= 32768
##$FT_mod= 6
##$GAMMA= 0
##$GB= 0
##$INTBC= 1
##$INTSCL= 1
##$ISEN= 128
##$LB= 0
##$LEV0= 0
##$LPBIN= 0
##$MAXI= 10000
##$MC2= 0
##$MEAN= 0
##$ME_mod= 0
##$MI= 0
##$NCOEF= 0
##$NC_proc= -8
##$NLEV= 6
##$NOISF1= 0
##$NOISF2= 0
##$NSP= 0
##$NTH_PI= 0
##$NZP= 0
##$OFFSET= 14.98509
##$PC= 1
##$PHC0= 184.1968
##$PHC1= 0
##$PH_mod= 1
##$PKNL= yes
##$PPARMOD= 0
##$PPDIAG= 0
##$PPIPTYP= 0
##$PPMPNUM= 2147483647
##$PPRESOL= 1
##$PSCAL= 4
##$PSIGN= 0
##$PYNMP= <proc.py>
##$REVERSE= no
##$SF= 400.02
##$SI= 32768
##$SIGF1= 0
##$SIGF2= 0
##$SINO= 400
##$SIOLD= 32768
##$SPECTYP= <>
##$SREGLST= <1H.CDCl3>
##$SSB= 0
##$STSI= 32768
##$STSR= 0
##$SW_p= 8223.68421052631
##$SYMM= 0
##$S_DEV= 0
##$TDeff= 65536
##$TDoff= 0
##$TI= <>
##$TILT= no
##$TM1= 0
##$TM2= 0
##$TOPLEV= 0
##$USERP1= <user>
##$USERP2= <user>
##$USERP3= <user>
##$USERP4= <user>
##$USERP5= <user>
##$WDW= 1
##$XDIM= 32768
##$YMAX_p= 450143620
##$YMIN_p= -678848
##$CURPLOT= <Network HP LaserJet P1505>
##$CURPRIN= <$Network HP LaserJet P1505>
##$DFORMAT= <normdp>
##$LAYOUT= <+/1D_H.xwp>
##$LFORMAT= <normlp>
##$PFORMAT= <normpl>
##$SURQMSG= 1
$$ End of Bruker specific parameters
$$ ---------------------------------
##NTUPLES= NMR SPECTRUM
##VAR_NAME=  FREQUENCY,     SPECTRUM/REAL,   SPECTRUM/IMAG
##SYMBOL=    X,             R,               I
##VAR_TYPE=  INDEPENDENT,   DEPENDENT,       DEPENDENT
##VAR_FORM=  AFFN,          ASDF,            ASDF
##VAR_DIM=   32768,         32768,           32768
##UNITS=     HZ,            ARBITRARY UNITS, ARBITRARY UNITS
##FACTOR=    0.250966925370066, 1,           1
##FIRST=     8223.43324360094, -15696,       -51378
##LAST=      0,             18479,           -157893
##MIN=       0,             -678848,         0
##MAX=       8223.43324360094, 450143620,    0
$$ Real data points
##PAGE= N=1
##DATA TABLE= (X++(R..R)), XYDATA
$$ [...]
19573c72114a32214L0400G5238f4570A35171a74928M9113c4205j87095i1357E4819
$$ -372114 -132214 -101814 75238 -64570 135171 -174928 -125815 -34205 -221300 -91357 54819
19561A80916J98489a46131A11073e07583a94605O9400j10480A20417a89304A99303
$$ 180916 379405 -146131 111073 -507583 -194605 -125205 -235685 120417 -189304 199303
19550h8809l23192A58347n9053a2022n3155a8355A26053K71555j26156a75784
$$ -88809 -412001 158347 99294 -12022 -65177 -18355 126053 397608 271452 -175784
19539e4136j17594B89975b23408A82876M6600b03703I8832a43501l1483a3011
$$ -54136 -171730 289975 -223408 182876 229476 -203703 98832 -143501 -174984 -13011
19528d9898k30768J30757J3555A64821a80517k56730J93172O514B5097M4029a51393
$$ -49898 -280666 -149909 -136354 164821 -180517 -437247 -244075 -237561 25097 69126 -151393
19516i42o9986p5732b7548j08213A35144l4826b1659F2598g3689j13615K1334
$$ -942 -70928 -146660 -27548 -135761 135144 100318 -21659 62598 -73689 -187304 -165970
19505a65970k7916Q0960q7493R4617m7966N7546E4833M2130b50077A2427a30005
$$ -165970 -193886 -112926 -200419 -105802 -153768 -96222 54833 96963 -250077 12427 -130005
19493b99221c1942A9075a18796k13394J60105j41824e2857A30611O880a5392G6817
$$ -299221 -31942 19075 -118796 -332190 -172085 -313909 -52857 130611 137491 -15392 76817
19481i2292a0818F1469O3288l5318a89436A47052K3000a86686f790m1425B69820
$$ -92292 -10818 61469 124757 89439 -189436 147052 170052 -186686 -6790 -48215 269820
19469H1827a30543B3472L9O8450a09807A03966g0185E7834O7778l6595a93562
$$ 81827 -130543 23472 23511 91961 -109807 103966 -70185 57834 125612 89017 -193562
19457a00294k22857c6175B4167J39661d0686k53747C0331e6883b2866l022A09565
$$ -100294 -323151 -36175 24167 163828 -40686 -294433 30331 -56883 -22866 -25888 109565
19445I218P8460j5653K73659b0786B79275j30773D5256c18544J02031b8213F7297
$$ 9218 87678 72025 345684 -20786 279275 148502 45256 -318544 -216513 -28213 67297
19433b00575b5711p660A51278a64915o7140p4894p7298a90754L7730A8050M2011
$$ -200575 -25711 -33371 151278 -164915 -232055 -306949 -384247 -190754 -153024 18050 60061
19422F0061B4312i1674a2331F2014J6709f1580j93882I882a51236e7600p2688
$$ 60061 24312 -91674 -12331 62014 78723 -61580 -255462 9882 -151236 -57600 -130288
19411a30288A70851O0885G7726b10769B45019J29017a88429d5954r0687C20798
$$ -130288 170851 231736 77726 -210769 245019 374036 -188429 -45954 -136641 320798
19400A16858B475b01838A8788a06584f36A48269e6517A98079b44171B68969b395
$$ 116858 2475 -201838 18788 -106584 -636 148269 -56517 198079 -244171 268969 -2395
19388g4682i409J028l90553A25384J81126A45770p0724F08b8180k25466d5587
$$ -74682 -9409 -8381 -398934 125384 306510 145770 75046 608 -28180 -253646 -45587
19376i3782j66669n6199a11674A9308J7538b53394M6181A26250k3578k1873c08173
$$ -93782 -260451 -316650 -111674 19308 36846 -253394 -207213 126250 102672 80799 -308173
19364A88443C3401a77112k5145L0564h0943j09133j8685A8078q351N4693a56645
$$ 188443 33401 -177112 -202257 -171693 -80943 -190076 -208761 18078 9727 64420 -156645
19352B157b53839j21961a46662g899A25287J23271b72725k29450A06112b58283
$$ 2157 -253839 -375800 -146662 -7899 125287 248558 -272725 -502175 106112 -258283
19341b93424B22398h8899p7865A41778A2610g680j91070g8108k27715J07943B1447
$$ -293424 222398 -88899 -166764 141778 12610 -7680 -198750 -78108 -305823 -197880 21447
19329d9377k62427a3526I1331m3709b11829k771P9450j278o8606j52131A12328
$$ -49377 -311804 -13526 91331 47622 -211829 -214600 -135150 -136428 -205034 -357165 112328
19317e9811R838j21377r0654F8909P3293b35024e2537e152n7831l8242B9676a22717
$$ -59811 -49973 -171350 -262004 68909 142202 -235024 -52537 -5152 -62983 -101225 29676 -122717
19304b60976e3914j34583B46338B1524J26777k5704c0083H1367K5083b16000A99525
$$ -260976 -53914 -188497 246338 21524 148301 122597 -30083 81367 106450 -216000 199525
19292a65658A14244a81237A99732D5491J72569a87371N2150B7975A0140m876a28632
$$ -165658 114244 -181237 199732 45491 218060 -187371 -135221 27975 10140 5264 -128632
19280B42148a23001C4385K2279O4058a13418l04985C0454a66190J0601o9443D2757
$$ 242148 -123001 34385 56664 120722 -113418 -418403 30454 -166190 -155589 -225032 42757
19268e0950j98133f0873k9701D5035J19495a19299N9592j26219k70258B24175
$$ -50950 -249083 -60873 -90574 45035 164530 -119299 -59707 -185926 -456184 224175
19257b77574C9871b77517C06867d95m48447B42519c6070R710D812P6124B6684
$$ -277574 39871 -277517 306867 -495 -448942 242519 -36070 -26360 4812 80936 26684
19245d64708A46759b73766a6620r3457j44122p114M594J20390D4641L5213a20264
$$ -464708 146759 -273766 -16620 -110077 -254199 -261313 -256719 -136329 44641 79854 -120264
19233a061A10587J82557b96808C79839b29778j38339A72680F6367j1075a57958
$$ -1061 110587 293144 -296808 379839 -229778 -368117 172680 66367 55292 -157958
19222A19139h7424C87817j53415b01011A97701a05645A23628k0785c2395H4159
$$ 119139 -87424 387817 234402 -201011 197701 -105645 123628 102843 -32395 84159
19211E7054a55238m786e2843j78985J03945K9634B3982Q6391c12564g7216q3013
$$ 57054 -155238 -160024 -52843 -231828 -127883 -98249 23982 110373 -312564 -77216 -160229
19200a60229A75787B8372b72892A28639i8819j59559A1966k688a72676j08642
$$ -160229 175787 28372 -272892 128639 -98819 -258378 11966 9278 -172676 -281318
19190b81318o2586d3069o9416o5235n539g4286B98908c9207k08494g2938H6106
$$ -281318 -343904 -43069 -112485 -177720 -183259 -74286 298908 -39207 -247701 -72938 86106
19178a52673L7148A81950g1490k90291a11047L3117B46818f3563A37552a14027
$$ -152673 -115525 181950 -71490 -361781 -111047 -77930 246818 -63563 137552 -114027
19167b66277k15697D0485b62208J9410j08615J38666M0185L1215B2250h3735j61037
$$ -266277 -481974 40485 -262208 -242798 -351413 -212747 -172562 -141347 22250 -83735 -244772
19156b44772k628g9457A66132f4262E9411a14077I4544K8744l9405K63855d4324
$$ -244772 -247400 -79457 166132 -64262 59411 -114077 94544 123288 83883 347738 -44324
19144A16076E5623d8790j2553j05752J4103A91903c19530A65983O5897b54212
$$ 116076 55623 -48790 -61343 -167095 -152992 191903 -319530 165983 231880 -254212
19133F9324c90807e0722A44917a71777I4373h1167G1186B1965e1400q2859A70165
$$ 69324 -390807 -50722 144917 -171777 94373 -81167 71186 21965 -51400 -134259 170165
19121c2947m2061K9668a2472l9535B7491Q4929b84335h2838E9550B804d75875
$$ -32947 -75008 -45340 -12472 -52007 27491 112420 -284335 -82838 59550 2804 -475875
19109E3962K0788f718k4089j54338n3800J5747B2603K17114b52562B57394c79317
$$ 53962 74750 -6718 -30807 -185145 -238945 -223198 22603 239717 -252562 257394 -379317
19097A26874B8446K5687b73040A6613n316d77400B51776e8273J0791j11776A67201
$$ 126874 28446 54133 -273040 16613 11297 -477400 251776 -58273 -47482 -159258 167201
19085C0126a49090B11148m5914J40503a2460G5527a40657j14841G7547d0482F3043
$$ 30126 -149090 211148 165234 305737 -12460 75527 -140657 -255498 77547 -40482 63043
19073d6106A13891c63216a38196N4484B855g9515k07951A00363A1560a06818D08571
$$ -46106 113891 -363216 -138196 -83712 2855 -79515 -287466 100363 11560 -106818 408571
19061b79409g2116E6715a07298A21853K9952b42663A39156a28013k4684C5194
$$ -279409 -72116 56715 -107298 121853 151805 -242663 139156 -128013 -152697 35194
19050A28241d7070J325I9347a19359N1982A8454K2444d972I6102h2992A21213
$$ 128241 -47070 -45745 99347 -119359 -67377 18454 40898 -4972 96102 -82992 121213
19038c00135r517B93642C4323a49627d020n6108F4226J01484P354a38562B32808
$$ -300135 -309652 293642 34323 -149627 -4020 -60128 64226 165710 173064 -138562 232808
19026i9309q000A61597b8435j57762d7885B88536a43885B07555h9895H4343c1064
$$ -99309 -107309 161597 -28435 -186197 -47885 288536 -143885 207555 -89895 84343 -31064
19014A30114b2459j14993A02269i7803d4238k98216C7644g7565l1804r218e567
$$ 130114 -22459 -137452 102269 -97803 -44238 -342454 37644 -77565 -109369 -118587 -5567
19002A36441b19980A68333c4742B3746a70520P1611b8813B8386d38801J78797
$$ 136441 -219980 168333 -34742 23746 -170520 -98909 -28813 28386 -438801 -260004
18992b60004D5815c4176a031A50354f6413l95607B31784f0414K8629j15046d8790
$$ -260004 45815 -34176 -1031 150354 -66413 -462020 231784 -60414 -31785 -146831 -48790
18980c19367f5945b2168A0038a49600L4897F7100a8295P505G6588B5967O8310
$$ -319367 -65945 -22168 10038 -149600 -114703 67100 -18295 -10790 76588 25967 94277
18969I4277F087J16610N153b76485C69541j70566a67978J7243D0533b43661L7995
$$ 94277 6087 122697 127850 -276485 369541 198975 -167978 -150735 40533 -243661 -205666
18958b05666J7753j15194c1561B5156a74149D3999d8712h365l10418F454a82792
$$ -205666 -187913 -303107 -31561 25156 -174149 43999 -48712 -8365 -318783 6454 -182792
18946a11756a4773r3452C0323O5363a36020n228D035J70535h3520a4590C39069
$$ -111756 -14773 -108225 30323 95686 -136020 -141248 4035 174570 -83520 -14590 339069
18934c783H5123C676e075r0838l17989a94036H6650C2614f6972n1314k46307A33600
$$ -3783 85123 3676 -5075 -95913 -413902 -194036 86650 32614 -66972 -118286 -364593 133600
18921a9442A61915b83663b214k01006L8260e8317j30274M2231E1230J45627a1989
$$ -19442 161915 -283663 -2214 -203220 -164960 -58317 -188591 -146360 51230 196857 -11989
18909A94358q654a43103F8239E02c24512J17727c6190B60146a85060M2930E5990
$$ 194358 185704 -143103 68239 502 -324512 -206785 -36190 260146 -185060 -142130 55990
18897d6655A63593D2603a88351G115J05662k6429c12474J08042B00313H9034J3371
$$ -46655 163593 42603 -188351 7115 112777 86348 -312474 -204432 200313 89034 102405
18886A02405J10168J47226a77399A60765i8261j52554A35186c40246h7651H5342
$$ 102405 212573 359799 -177399 160765 -98261 -250815 135186 -340246 -87651 85342
18875c38952c2766f313m6991j1373K1665B2996a05924C2271i2376D7483h5608
$$ -338952 -32766 -6313 -53304 -64677 -43012 22996 -105924 32271 -92376 47483 -85608
18863g1851F9534L976J35761b43879B51167a55613c4297j92463A12587b62617
$$ -71851 69534 73510 209271 -243879 251167 -155613 -34297 -226760 112587 -262617
18852D9750k2926j1253J98973G5913j7957P8006a42291r5827A75225a93601A84595
$$ 49750 26824 15571 214544 75913 57956 135962 -142291 -238118 175225 -193601 184595
18840A1536c07756d4794r023j6547a7682j56684A22147b5202m8536j25930j8766
$$ 11536 -307756 -44794 -53817 -70364 -17682 -174366 122147 -25202 -73738 -199668 -218434
18829b18434d4523k41227A89761h6389A09735a39763b3227j99210E6659J17674
$$ -218434 -44523 -285750 189761 -86389 109735 -139763 -23227 -222437 56659 174333
18819A74333L6434a28178j74380I9805A8755c4688C40117F4126J30819J70521
$$ 174333 210767 -128178 -302558 99805 18755 -34688 340117 64126 194945 365466
18809C65466A36426B8756M3205c0404j25639d7575C39309I3376c8591A06102b5950
$$ 365466 136426 28756 71961 -30404 -156043 -47575 339309 93376 -38591 106102 -25950
18797a93593E3931c45868f6900c720A27755L9301d4386a1627n0604j41297G7236
$$ -193593 53931 -345868 -66900 -3720 127755 167056 -44386 -11627 -62231 -203528 77236
18785a3830I3157L7488d0576l33858A09610E909O8934a39216B00912a79375A8681
$$ -13830 93157 130645 -40576 -374434 109610 5909 74843 -139216 200912 -179375 18681
18773G4319b83861a19830B229d6858B0133e1758k51198J24965d6555A9197i1484
$$ 74319 -283861 -119830 2229 -46858 20133 -51758 -302956 -177991 -46555 19197 -91484
18761c72723d3072m0246B7382A850K2131K0551J14132p3140m0508i9495q8303
$$ -372723 -43072 -83318 27382 1850 23981 44532 158664 85524 45016 -99495 -187798
18750a87798N8386A35947g2832F8903N20c09696A85889c45854a63289k43339a10645
$$ -187798 -129412 135947 -72832 68903 69423 -309696 185889 -345854 -163289 -406628 -110645
18738a55415b5070j66244N1274E3413b1011k09828j77695h6125I7242C7791K06240
$$ -155415 -25070 -191314 -140040 53413 -21011 -230839 -408534 -86125 97242 37791 244031
18727B44031A19255H359c12476A66543q2969J25048l5794b0751A02439J91906
$$ 244031 119255 8359 -312476 166543 83574 208622 172828 -20751 102439 294345
18717B94345a89249E1414g6189k9321I4630f3190G9837K40495D8606c0315k31988
$$ 294345 -189249 51414 -76189 -105510 94630 -63190 79837 320332 48606 -30315 -262303
18706b62303R9071J8771j17392Q1980c13l6270C8270a17370k29817M0167c0453
$$ -262303 -163232 -144461 -261853 -179873 -313 -36583 38270 -117370 -347187 -307020 -30453
18694B249J77514a85158J5949e7005p6079A76904b20165a02544A24928b67676
$$ 2249 179763 -185158 -169209 -57005 -133084 176904 -220165 -102544 124928 -267676
18683b15301M3422N1045n454c6535A64685F3218c00872E9314b97076B72387h9555
$$ -215301 -171879 -120834 -126288 -36535 164685 63218 -300872 59314 -297076 272387 -89555
18671A27745D8619d4591p8121A74417f8487j09466n9043c0536G3717d2252o9451
$$ 127745 48619 -44591 -122712 174417 -68487 -177953 -236996 -30536 73717 -42252 -111703
18660a11703j3517H8989b43440f2248j38161F603J54763a4045A5644J66993E9367
$$ -111703 -125220 88989 -243440 -62248 -200409 6603 161366 -14045 15644 182637 59367
18648H0416B7344M3914a88397o892B38256b50161B237d00672G0183L0477J75989
$$ 80416 27344 71258 -188397 -195289 238256 -250161 2237 -400672 70183 100660 276649
18637B76649j36078C915K46037a73136P900e7665o1780o3417l6156b1319A88034
$$ 276649 140571 3915 249952 -173136 -165236 -57665 -119445 -182862 -219018 -21319 188034
18625b73441A1939g8132j3397J1951C9236K2590b15600C11072R667l4077k4513
$$ -273441 11939 -78132 -91529 -79578 39236 61826 -215600 311072 320739 286662 262149
18614B62149a04545o7282C07308B9116a23173K903m9083d7659j89324H9542a18015
$$ 262149 -104545 -171827 307308 29116 -123173 -120270 -169353 -47659 -236983 89542 -118015
18602a45449k63458g2139H1323c504m1758r1588D8239f519j03122m4904B8390
$$ -145449 -408907 -72139 81323 -3504 -45262 -136850 48239 -6519 -109641 -154545 28390
18590A61072c13703a37946i923m6125l94274A1808g4585q89A0261a34072E1051
$$ 161072 -313703 -137946 -9923 -56048 -450322 11808 -74585 -75474 10261 -134072 51051
18578C9811c36986J06445P6977N030r5019h200k34521A39034D0520c8112C4146
$$ 39811 -336986 -230541 -153564 -148534 -243553 -8200 -242721 139034 40520 -38112 34146
18566b71359f023q1501l6884E2517e604k16829e8899B23897b05930j43435h0516
$$ -271359 -6023 -87524 -124408 52517 -5604 -222433 -58899 223897 -205930 -349365 -80516
18554d7054A52801a2457o279j51708K0821g4403K5045j05035C8569c11546B95250
$$ -47054 152801 -12457 -18736 -170444 -149623 -74403 -49358 -154393 38569 -311546 295250
18542F0522J87717a33614a1153A26796J58736J24983b37020l2789B18362D189
$$ 60522 248239 -133614 -11153 126796 285532 410515 -237020 -269809 218362 4189
18531B12715G4692a20173m709B3774i1016K2077j0762c5562A32268C8819a26736
$$ 212715 74692 -120173 -124882 23774 -91016 -68939 -79701 -35562 132268 38819 -126736
18519B0228Q9440a14850A13060C6711L0579a27410H6555h0826C544L42634A0426
$$ 20228 109668 -114850 113060 36711 67290 -127410 86555 -80826 3544 346178 10426
18507a13470H8688K4192D2836K3622a12008J2355l07509C08513F2782b5416k86088
$$ -113470 88688 112880 42836 66458 -112008 -99653 -407162 308513 62782 -25416 -311504
18496c11504P6743C51344a09588A3158b7783n606k80829H8670J66446I74a56388
$$ -311504 -234761 351344 -109588 13158 -27783 -33389 -314218 88670 255116 974 -156388
18484a26521I8645a06820Q122A16032A3872e093k01710J8165A55287a31297I6458
$$ -126521 98645 -106820 -98698 116032 13872 -5093 -206803 -188638 155287 -131297 96458
18472H9253b1421j66791A88311n8619h0718G9283b36297A05193a59879l10859
$$ 89253 -21421 -188212 188311 129692 -80718 79283 -236297 105193 -159879 -470738
18462d70738a15564N5267k99838A19850b68068g2650q7804B8619c87964C2778
$$ -470738 -115564 -60297 -360135 119850 -268068 -72650 -160454 28619 -387964 32778
18451H4105c80671g1525j01033k20951a26715A08597a51922B62285a69306k25294
$$ 84105 -380671 -71525 -172558 -393509 -126715 108597 -151922 262285 -169306 -394600
18441c94600A05792b7026j8018j41891A23978d6110J8744I6089K1406d3316k87923
$$ -394600 105792 -27026 -45044 -186935 123978 -46110 -27366 96089 117495 -43316 -331239
18430c31239B09716b20706H0250a32436j43729G1135a99538N2086r018H6023J53452
$$ -331239 209716 -220706 80250 -132436 -276165 71135 -199538 -147452 -156470 86023 239475
18419B39475C3271K11457b50313a23903o982I1660a86590B20643H6858f3634n4757
$$ 239475 33271 244728 -250313 -123903 -130885 91660 -186590 220643 86858 -63634 -118391
18408a18391E32858b17396A60632M4464r8237b38357j8011G2889Q4166a67440
$$ -118391 532858 -217396 160632 205096 106859 -238357 -256368 72889 157055 -167440
18397a27867J1259E01a95397B13400G3347J78479a82853a50n5406A03524a38375
$$ -127867 -116608 501 -195397 213400 73347 251826 -182853 -150 -55556 103524 -138375
18385a3679p954n6085H2577a32230L1270N060c2239j93679A03127c7341j73979
$$ -13679 -21633 -77718 82577 -132230 -100960 -95900 -32239 -225918 103127 -37341 -211320
18374b11320a04200k19266a19241B69985c19859B33742j07867M7102a17951l7513
$$ -211320 -104200 -323466 -119241 269985 -319859 233742 125875 172977 -117951 -155464
18364a55464A04335b32496J07479l32393H526b92216D178a08925k49639a7435
$$ -155464 104335 -232496 -125017 -457410 8526 -292216 4178 -108925 -358564 -17435
18353c23208I9782g1597k02975G7215J06748a12024G1871N0440a584B07279E8575
$$ -323208 99782 -71597 -274572 77215 183963 -112024 71871 122311 -1584 207279 58575
18341G993J25367e6845j24526P2706c9333j56050Q5976b4309k23935e5846k26684
$$ 7993 133360 -56845 -181371 -108665 -39333 -195383 -109407 -24309 -248244 -55846 -282530
18330b82530A0888K9621b25504F8570J136J26309k2233a60316j21j88059c4641
$$ -282530 10888 40509 -225504 68570 69706 196015 173782 -160316 -160437 -348496 -34641
18318i0687m3998L8793k2032j65311m2367B19923b26030P2684A10379B6055a49481
$$ -90687 -134685 -95892 -117924 -283235 -325602 219923 -226030 -153346 110379 26055 -149481
18306B02007g5986A15169K3595C3976b53192A00724j2059c11286A22917b21350
$$ 202007 -75986 115169 138764 33976 -253192 100724 88665 -311286 122917 -221350
18295G1985C4422K2145B2769b81143N4466a5485A54089a31560L1466B48130B782
$$ 71985 34422 56567 22769 -281143 -226677 -15485 154089 -131560 -100094 248130 2782
18283B40488p0044a08371q2259h2377B26060d241j08797B22918e1876A18278b44747
$$ 240488 170444 -108371 -190630 -82377 226060 -4241 -113038 222918 -51876 118278 -244747
18271d1871J9468B08717L4400c7833j20133n2637f6765k64274A7417a79363d983
$$ -41871 -22403 208717 243117 -37833 -157966 -210603 -66765 -331039 17417 -179363 -4983
18259a15345E177b97340g8188A42641a673j92544A05558f4356n2203D7084K53735
$$ -115345 5177 -297340 -78188 142641 -1673 -194217 105558 -64356 -116559 47084 300819
18248C00819I823a31397j66757N9302K5485A6720K8387d65747d9651l8586a8537
$$ 300819 9823 -131397 -298154 -238852 -213367 16720 45107 -465747 -49651 -88237 -18537
18236b17399B05568E9722c47602b8777j48635A76684F2161J09903G1329a58206
$$ -217399 205568 59722 -347602 -28777 -177412 176684 62161 172064 71329 -158206
18225C6909M065a18792K5429E8945b41925m70J14334D3658j0263f4120B4686a42196
$$ 36909 40974 -118792 -93363 58945 -241925 -242395 -128061 43658 33395 -64120 24686 -142196
18212A73105d1774j4315p3302A61678E1336c1590p411B0932J0059f3333K7290
$$ 173105 -41774 -56089 -129391 161678 51336 -31590 -39001 20932 30991 -63333 -36043
18201c6043F4300P8051g2237b9839o8420B27862a06180A09987k9271O751D2599
$$ -36043 64300 142351 -72237 -29839 -98259 227862 -106180 109987 80716 87467 42599
18189c90552a11007B30818d4552k76961H1510f0158D8619a09036A5418P2286e0946
$$ -390552 -111007 230818 -44552 -321513 81510 -60158 48619 -109036 15418 87704 -50946
18177d10221a23581G7104l6974j8864J08215a18437B60574C8519J15116F2809
$$ -410221 -123581 77104 40130 21266 129481 -118437 260574 38519 153635 62809
18166i2825A07844a36248A14957a6100k80838m7613G3870O4776e19115B50880
$$ -92825 107844 -136248 114957 -16100 -296938 -344551 73870 138646 -519115 250880
18155A45713b57275A3168a52665d4192F8586b27690j42711J83503D362b0727A20461
$$ 145713 -257275 13168 -152665 -44192 68586 -227690 -370401 -186898 4362 -20727 120461
18143A21784Q7508b18461G2580b29246E2303a74287j19235q5675j79052D74580
$$ 121784 209292 -218461 72580 -229246 52303 -174287 -293522 -379197 -558249 474580
18132F6430l0962g4854H3121A2288f4221K3521P878A77026H8431a35692A1100
$$ 66430 35468 -74854 83121 12288 -64221 -40700 -32822 177026 88431 -135692 11100
18120A84988G8073b59527A38124Q4167a55151D7768A5593Q9850b32605b4964m6495
$$ 184988 78073 -259527 138124 222291 -155151 47768 15593 105443 -232605 -24964 -71459
18109g1459j05399e328j58901g5184C53894c47367d9919j9028D57522a58604k6331
$$ -71459 -176858 -5328 -164229 -75184 353894 -347367 -49919 -68947 457522 -158604 -184935
18098a84935B25840J14379c21228B83513D0353J06453O5053c55437J16167R3903
$$ -184935 225840 340219 -321228 283513 40353 146806 211859 -355437 -239270 -145367
18088a45367A87396n1795C6981K89483f0890p8352A50966N0428a41858J088J916
$$ -145367 187396 135601 36981 326464 -60890 -139242 150966 201394 -141858 -140770 -138854
18077a38854D02098e8048A187Q2857c10109F9586a24552q812j3892A1638K19765
$$ -138854 402098 -58048 1187 84044 -310109 69586 -124552 -133364 -147256 11638 231403
18066B31403C8530e0282o0467B01641D8922O5720d8403A88228c9905j66220k51241
$$ 231403 38530 -50282 -110749 201641 48922 114642 -48403 188228 -39905 -206125 -457366
18055d57366a86420e8375n0255H7493l1006P0188n8951J00384c5471o092k10229
$$ -457366 -186420 -58375 -108630 87493 56487 126675 67724 168108 -35471 -41563 -251792
18044b51792j64064a55382f6868I783J39023n1338K7956n7685c11327I6963J02473
$$ -251792 -415856 -155382 -66868 9783 148806 97468 125424 67739 -311327 96963 199436
18033A99436a16042O065r137o695b6260k44614Q6345o0137A84776a48997A17343
$$ 199436 -116042 -109977 -119114 -125809 -26260 -270874 -184529 -244666 184776 -148997 117343
18021H651c2269r5296H298a30920G048d4244q2797A78354K8347i3141l5368A13833
$$ 8651 -32269 -127565 8298 -130920 7048 -44244 -127041 178354 206701 -93141 -128509 113833
18008A11370a2434G4846J99586c58860a35294r6619i4515G9579b01519B0280i1502
$$ 111370 -12434 74846 274432 -358860 -135294 -231913 -94515 79579 -201519 20280 -91502
17996a10878n3157j2880J7710j90361a24359A51204L5786F5341c2167G9068a655
$$ -110878 -164035 -176915 -159205 -349566 -124359 151204 186990 65341 -32167 79068 -1655
17984B93753E1631N1652C3797J43807a97912h7992j89429R2639A17944Q7476B1817
$$ 293753 51631 103283 33797 177604 -197912 -87992 -277421 -184782 117944 205420 21817
17972A09821a41868e5309A49061E2043k1861a41000E3627l659a98423B68827c9223
$$ 109821 -141868 -55309 149061 52043 30182 -141000 53627 49968 -198423 268827 -39223
17960A3946b87203E9367K95645d933l680G1553a04157B36910H8628L7814l5529
$$ 13946 -287203 59367 355012 -4933 -8613 71553 -104157 236910 88628 126442 90913
17949I0913J95238d1396j3799q9033I1269P7921R983H2214Q0182k6613b1147j87395
$$ 90913 286151 -41396 -55195 -144228 91269 169190 179173 82214 162396 135783 -21147 -208542
17937b08542A51220c09838g1788B23242C8367b87253A5932P4323B5199b21492
$$ -208542 151220 -309838 -71788 223242 38367 -287253 15932 90255 25199 -221492
17926E7172h3610F3704L7578a66460A35115i7976p5747R277K6620k1963H8098
$$ 57172 -83610 63704 101282 -166460 135115 -97976 -173723 -164446 -137826 -159789 88098
17914C39959g4820E6306A8302g0927E9154J16663F5746e7544A8076f5210D08707
$$ 339959 -74820 56306 18302 -70927 59154 175817 65746 -57544 18076 -65210 408707
17902a12117B65452c3629A5398O6321J0405l8264A4102P23h9661E825P4213d657
$$ -112117 265452 -33629 15398 81719 92124 53860 14102 14825 -89661 5825 80038 -4657
17889F7898O4735a85995B17808a55337a4504B59498Q079a28317C1382J56069q9977
$$ 67898 132633 -185995 217808 -155337 -14504 259498 267577 -128317 31382 187451 97474
17878I7474K5449c07608J2125B9660c17279l6501J29499h9261l56403a61508A08080
$$ 97474 122923 -307608 -295483 29660 -317279 -353780 -224281 -89261 -445664 -161508 108080
17866B30296a52792A25676b57714k27722e5925l46400B16883l0856a9366G0264
$$ 230296 -152792 125676 -257714 -485436 -55925 -402325 216883 186027 -19366 70264
17855A82210m5324L42917A27510a48596j14733a1221j12432A93282O514P7636
$$ 182210 136886 479803 127510 -148596 -263329 -11221 -123653 193282 199796 277432
17845B77432a9714n3108J436a5060C8018d1219A74811g2997l9817d0712j94765
$$ 277432 -19714 -72822 -71386 -15060 38018 -41219 174811 -72997 -112814 -40712 -235477
17834b35477f2879C76768c1575A47922D1174f9257r8264G8833b3894D1384K99472
$$ -235477 -62879 376768 -31575 147922 41174 -69257 -167521 78833 -23894 41384 340856
17823C40856a00071a75j3393A78885k6658E999J7891f0261A36249a34195L9982
$$ 340856 -100071 -175 -13568 178885 152227 5999 23890 -60261 136249 -134195 -94213
17812i4213j87543g2653K7137j02945A58080L3904c2495j89467d2074j52717P8745
$$ -94213 -281756 -72653 -45516 -148461 158080 191984 -32495 -221962 -42074 -194791 -116046
17801a16046L9745I0053b8008E9235J5088K7281a00064C08962d10535a06181k31729
$$ -116046 -76301 90053 -28008 59235 74323 101604 -100064 308962 -410535 -106181 -337910
17790c37910A04072m8620g2379p9634B34807r1560K8689n0883l9387f9842J0550
$$ -337910 104072 55452 -72379 -152013 234807 143247 171936 121053 81666 -69842 -59292
17779e9292B58425g6822r2753h1025n8746A65602d9579C78753d4506r9770B93652
$$ -59292 258425 -76822 -169575 -81025 -139771 165602 -49579 378753 -44506 -144276 293652
17767b27947a06951I2833a00744F7555a2810D18011b09572i8130m8521C71806
$$ -227947 -106951 92833 -100744 67555 -12810 418011 -209572 -98130 -146651 371806
17756c8993J7248k23253d2516j82381B91517a25689k33304B02210E6600b17749
$$ -38993 -21745 -244998 -42516 -224897 291517 -125689 -358993 202210 56600 -217749
17745h1651K8144H2723b9424B7132b37953H6497e5412j75873j1561k15052I9277
$$ -81651 -53507 82723 -29424 27132 -237953 86497 -55412 -231285 -242846 -457898 99277
17733b1488l32987A91907j0112C6035b03655F0220a58956A17565Q0959d1406l74952
$$ -21488 -354475 191907 181795 36035 -203655 60220 -158956 117565 198524 -41406 -416358
17722d16358a28194C00041j38850K04337D8770L18273e1226A3064e6201k01289
$$ -416358 -128194 300041 161191 365528 48770 367043 -51226 13064 -56201 -257490
17712b57490e5847E7608P3060b30839e6544p5700A8095J47783d5908G4932r188
$$ -257490 -55847 57608 130668 -230839 -56544 -132244 18095 165878 -45908 74932 65744
17701F5744d9423A5571a28451B12770A01650b24841D276J9761b73448B34545b28483
$$ 65744 -49423 15571 -128451 212770 101650 -224841 4276 24037 -273448 234545 -228483
17689C2169b94343A67007d627n4290J271A52349o8231P0614E5637a34218A86615
$$ 32169 -294343 167007 -4627 -58917 -57646 152349 84118 154732 55637 -134218 186615
17677G5019b13470g8831A73029d60804A37394b96770A47380a19087B15949a47452
$$ 75019 -213470 -78831 173029 -460804 137394 -296770 147380 -119087 215949 -147452
17666e5327q9342D3073L70175A22757J33273A11675b60352f3697B25840E5150
$$ -55327 -144669 43073 413248 122757 256030 111675 -260352 -63697 225840 55150
17655A40397i95E5021b44407A47747N869l5813b34576f6401m22709J25576a14142
$$ 140397 -995 55021 -244407 147747 153616 117803 -234576 -66401 -489110 -363534 -114142
17643C5601g5721a9524l7065B04459a00042A91023O2277r7835a68767K7252D06526
$$ 35601 -75721 -19524 -56589 204459 -100042 191023 253300 155465 -168767 -141515 406526
17631B51526J33585f2462A14038E6484i4350A70473b45877h4662R04B77918I0405
$$ 251526 385111 -62462 114038 56484 -94350 170473 -245877 -84662 -83758 277918 90405
17619I6087J45573f7893B04333c08375a01346a5650B38091b07836C41144G7174
$$ 96087 241660 -67893 204333 -308375 -101346 -15650 238091 -207836 341144 77174
17608a22396j18450E03847j99515I2862d33239a83936D371L5773K9378j2795e383
$$ -122396 -240846 503847 304332 92862 -433239 -183936 4371 40144 69522 56727 -5383
17596a96042n0123B0810d0093j1708B66437o8916G5712a80573B55237c2268A2053
$$ -196042 -246165 20810 -40093 -51801 266437 197521 75712 -180573 255237 -32268 12053
17584G9142a48209L7601F7830a26900B42557H0475N7358B8538b7466A69857N86
$$ 79142 -148209 -110608 67830 -126900 242557 80475 137833 28538 -27466 169857 170443
17573A70443a26761G3076c5002a1226G7270K59982c41858A84556b6965B78640
$$ 170443 -126761 73076 -35002 -11226 77270 337252 -341858 184556 -26965 278640
17562A65132n1771J97416j50920p8327L83422j08465q2256F8827C1799M2009J08548
$$ 165132 113361 310777 159857 81530 464952 356487 274231 68827 31799 73808 182356
17551A82356i284C1421J98594f4498j86676A61017a86484L1841A49215N3897c5775
$$ 182356 -9284 31421 230015 -64498 -251174 161017 -186484 -154643 149215 203112 -35775
17539e209B44471I5912C9484b6768A1451P0640K0738i6957A26540J2273o2391
$$ -5209 244471 95912 39484 -26768 11451 82091 102829 -96957 126540 138813 76422
17528G6422J71861M1541c6648A52692d6887E5889e0960G2518J60279a10891k3751
$$ 76422 248283 289824 -36648 152692 -46887 55889 -50960 72518 232797 -110891 -134642
17517a34642L5502A26527K73990A0419b60069j79227a23285a1880A91860q5083
$$ -134642 -99140 126527 400517 10419 -260069 -439296 -123285 -11880 191860 106777
17507A06777J30498L1491J23404A02081J4494c0417Q293l2857B37469j07368m0895
$$ 106777 237275 268766 392170 102081 116575 -30417 -22124 -54981 237469 130101 89206
17496H9206J18579I3192a04581B67483K9072R382D2567c37991B73846l0055a51445
$$ 89206 207785 93192 -104581 267483 296555 305937 42567 -337991 273846 243791 -151445
17484D29908C8232a26230B11083A4491K56937N9674e7241D3774J99563O9539a26634
$$ 429908 38232 -126230 211083 14491 271428 331102 -57241 43774 243337 312876 -126634
17472f8098E2089c34428B47885J013q0074p5031K06353b64373B9077O2861M0841
$$ -68098 52089 -334428 247885 248898 168824 93793 300146 -264373 29077 91938 132779
17461A32779K41251G1632k5401M8748k5604a73578I6329C943R3469J70963g4588
$$ 132779 374030 71632 46231 94979 69375 -173578 96329 3943 97412 268375 -74588
17449F5138O9849O6175J15363J05128j90979N7780P8280n6345e6450B06343K85092
$$ 65138 134987 201162 316525 421653 230674 288454 366734 310389 -56450 206343 491435
17438D91435j88371n4704b2741A32122K21431a29416B96333K9929l4064j2476
$$ 491435 303064 248360 -22741 132122 353553 -129416 296333 326262 292198 279722
17428B79722J74452B23804N6185R6699C8141L61577j75016J79182C4385J56820
$$ 279722 454174 223804 279989 376688 38141 399718 224702 403884 34385 191205
17418A91205n2892J16852F4267N4959P2113O0121n1930L4654d974q945B28297
$$ 191205 138313 255165 64267 119226 191339 251460 199530 234184 -4974 -13919 228297
17406b15815A19033a17818A73346H999a78936A34327J05481A02968b38516C11470
$$ -215815 119033 -117818 173346 8999 -178936 134327 239808 102968 -238516 311470
17395E7910O4641c8399J5771G9064f1255i996j91378f3382B31662A96L13588a73580
$$ 57910 122551 -38399 -22628 79064 -61255 -9996 -201374 -63382 231662 196 313784 -173580
17382a54515B31360a83892A56934B1912M85082B26118b0989D21615k03047A3731
$$ -154515 231360 -183892 156934 21912 506994 226118 -20989 421615 218568 13731
17371f5711A83964E4693J36234K20853A16265b4431B12526l0521D120K53401A6336
$$ -65711 183964 54693 190927 411780 116265 -24431 212526 182005 4120 257521 16336
17359B5018K9661N5275J34545I4553e2261A68287q3537M5448Q8262r9308l7050
$$ 25018 54679 109954 244499 94553 -52261 168287 84750 130198 218460 119152 82102
17348H2102c4652j2721C15323n0319N112N5975A20964g1452B14473l9614d2298
$$ 82102 -34652 -47373 315323 265004 270116 326091 120964 -71452 214473 174859 -42298
17336b2099A44147P3749F982J65315K20187g1283B62022a43431A79620Q6742N212
$$ -22099 144147 217896 6982 172297 392484 -71283 262022 -143431 179620 266362 271574
17325B71574h964B16665G1499J97900H6043K41006j46391J23050J05270j68236
$$ 271574 -8964 216665 71499 269399 86043 327049 180658 303708 408978 240742
17315B40742e0031D97120r7994A7019L26579A54698E3816Q5316j3595K4430F7091
$$ 240742 -50031 497120 399126 17019 343598 154698 53816 139132 125537 149967 67091
17303H7522C0022K08207F5782f5654j1151G2464J27482H5019N22353B84688j00392
$$ 87522 30022 238229 65782 -65654 -76805 72464 199946 85019 607372 284688 184296
17292A84296L3051b2314B0562K5655L11595A41359o9463d0438E0867J1960a15578
$$ 184296 217347 -22314 20562 46217 357812 141359 71896 -40438 50867 62827 -115578
17280A76280j7288M7318J24159l2499K6080j21747d6774A99558M0354A05534N4338
$$ 176280 158992 206310 330469 297970 324050 202303 -46774 199558 239912 105534 159872
17269A59872J40355p1734l7807o5165j726J63172g6436F09860j15146B30760A13805
$$ 159872 300227 228493 190686 125521 123795 286967 -76436 609860 494714 230760 113805
17257g6791A18440J09493J06720a74261A16649m7585J17311o5690O8246e3400
$$ -76791 118440 227933 334653 -174261 116649 69064 186375 120685 188931 -53400
17246a0086A02161N3607M0606K2810a16198C36935j23639o9783J64497K7017H0846
$$ -10086 102161 155768 196374 219184 -116198 336935 213296 143513 308010 335027 80846
17234C18494H4417J11529n4756K73391f1815A12273L60040j80037A03868O8683
$$ 318494 84417 195946 141190 414581 -61815 112273 472313 292276 103868 172551
17224A72551N19919A97527N18054d243A60993J09702L7620j1062b8302C64282
$$ 172551 692470 197527 715581 -4243 160993 270695 308315 297253 -28302 364282
17213d6691B41620O1893l9416F6136J83275j8735K90781A50069K4679k1370K70520
$$ -46691 241620 303513 264097 66136 249411 230676 521457 150069 174748 153378 423898
17202D23898B10279Q5702l3556E1300K4560e5170H1336J45887q695J09308Q397
$$ 423898 210279 295981 262425 51300 75860 -55170 81336 227223 218528 327836 336233
17191C36233d4561j9257A03463N2596J66998L5996C736N37078j58565j50950K70277
$$ 336233 -44561 -63818 103463 156059 323057 359053 3736 540814 382249 231299 501576
17180E01576A76113J45194N6600L3363j94324P429J54119J03485p4721J0071k4544
$$ 501576 176113 321307 377907 411270 216946 224375 378494 481979 407258 417329 392785
17169C92785g1354B53240J7286g0437C95451F4693K5887C3548K86579J25021A58444
$$ 392785 -71354 253240 270526 -70437 395451 64693 90580 33548 320127 445148 158444
17157B51304p9387L32306a26761C70493k497J14218B19477H793L18518n7421L19797
$$ 251304 171917 504223 -126761 370493 367996 482214 219477 8793 327311 269890 589687
17146E89687k91238J52781j41080A27932A2349N11000j27001A67601K5580N7492
$$ 589687 298449 451230 310150 127932 12349 523349 396348 167601 193181 250673
17136B50673G4525L67434A8980L15813A60472K43312A98141J56656J87474I3349
$$ 250673 74525 441959 18980 334793 160472 403784 198141 354797 542271 93349
17125A48222B1354O36029j83193A89990j5492K20567j22627n3773J13817J9907
$$ 148222 21354 657383 474190 189990 174498 395065 272438 218665 332482 352389
17115C52389A58235J44339N4872J98084j11315o4950n8177M5388j2998J55358
$$ 352389 158235 302574 357446 555530 444215 379265 321088 366476 353478 508836
17105E08836j53306L45489a5348C74010O0419q0584l180G7983N54197B66066M33363
$$ 508836 355530 701019 -15348 374010 434429 353845 350665 77983 632180 266066 699429
17094F99429B13060J08373k6203J13175O3265Q3082B24950J80338L08181c8545
$$ 699429 213060 321433 295230 408405 471670 554752 224950 405288 713469 -38545
17083A86398J85989l6059N3539J12544K6373k4843L1844R1814j64192p3143L1456
$$ 186398 372387 336328 389867 502411 528784 503941 535785 627599 463407 390264 421720
17072D21720n4720A10859N50700j56493J95645j70848q6834K57132A69293K18214
$$ 421720 367000 110859 661559 505066 700711 529863 443029 700161 169293 387507
17062C87507J80908j34560J07443j34885j5246J13964K58213A61929K02604J93641
$$ 387507 568415 433855 541298 406413 391167 505131 763344 161929 364533 558174
17052E58174k48009N6504j44285J52764J02531P6667j32786O0829J22265o8773
$$ 558174 310165 366669 222384 375148 477679 554346 421560 482389 604654 535881
17042E35881p1660K42453l41254L37762k28399r2974L36460k9902j28088J59640
$$ 535881 464221 706674 365420 703182 474783 381809 718269 688367 560279 719919
17032G19919o7200k00736K96581C23196K36395P1965B63217M23762j89868K82519
$$ 719919 652719 451983 748564 323196 559591 631556 263217 686979 497111 779630
17022G79630L35956m59314J04379l0319m2198j34810K44757l46013K19087q9552
$$ 779630 1115586 656272 760651 730332 688134 553324 798081 452068 671155 581603
17012E81603J43887j83570M1537L16055k79784j36494M11921C70307L21744j03351
$$ 581603 725490 541920 583457 899512 619728 483234 895155 370307 692051 588700
17002E88700l8997L48135J10949k96578N9904J97769n8808j34387J2509n4218
$$ 588700 549703 897838 1008787 712209 772113 969882 911074 776687 789196 734978
16992G34978L54653l03366m4865k55039K06162L7947K22115j71498k10843K87654
$$ 734978 1089631 786265 741400 486361 692523 730470 952585 781087 570244 857898
16982H57898J78098l41306K34987j65455p081K24928o2593j83552K86330j23302
$$ 857898 1035996 694690 929677 764222 757141 982069 919476 735924 1022254 898952
16972H98952k29065J59650J25498K57435k06661Q5181j91922K25964j97762m9109
$$ 898952 669887 829537 955035 1212470 1005809 1090990 899068 1125032 927270 878161
16962H78161J50941K34973l18427j15716N3893J11752J64725l7165j311J71187
$$ 878161 1029102 1264075 945648 829932 883825 995577 1160302 1123137 1121826 1293013
16952A293013m46594K73330q7945k57088L34382o8630J13109k4902K83740k95105
$$ 1293013 846419 1119749 1031804 774716 1109098 1040468 1153577 1128675 1412415 1117310
16942A117310J51729j03872J70996k17200k9278j18688K14212l22944L33209Q4447
$$ 1117310 1269039 1165167 1336163 1118963 1089685 970997 1185209 862265 1195474 1279921
16932A279921k91350L72514j07743J1672M8720m4555k26195M94688o43405N10801
$$ 1279921 988571 1361085 1253342 1265014 1313734 1269179 1042984 1537672 894267 1405068
16922A405068J26484k58024M01637j08140j89841J59202k43574J44775K4132o525
$$ 1405068 1531552 1273528 1675165 1567025 1377184 1536386 1292812 1437587 1461719 1455194
16912A455194M16494l34237P3578J92889m39659L56648j01045l39149O96791k7404
$$ 1455194 1871688 1537451 1611029 1803918 1364259 1720907 1619862 1280713 1977504 1950100
16902A950100J21125j71138l17965J79722R8374q2084J6285J22428J37986j41376
$$ 1950100 2071225 1900087 1582122 1761844 1860218 1778134 1794419 1916847 2054833 1913457
16892A913457M10268m08129L45037p0949l14025Q1048J11366J35404j58328o5089
$$ 1913457 2323725 1915596 2260633 2189684 1875659 1956707 2068073 2203477 2045149 1980060
16882A980060J21511j48846L2247M00307K4799J61750n30210M17509l54962J70376
$$ 1980060 2101571 1952725 1984972 2385279 2410078 2571828 2041618 2459127 2104165 2274541
16872B274541k6925L15563j50184r1467K4268L73994K3332l05869J51584K00690
$$ 2274541 2247616 2563179 2412995 2321528 2345796 2719790 2743122 2437253 2588837 2789527
16862B789527k36138M13857j80408K5834L12052j20335n7633J15522n4948K95924
$$ 2789527 2553389 2967246 2786838 2812672 3124724 3004389 2946756 3062278 3007330 3303254
16852C303254N9136p8457j8466R1780J40594L07534n29929N24027l8975l07959
$$ 3303254 3362390 3283933 3265467 3357247 3497841 3805375 3275446 3799473 3760498 3452539
16842C452539J71866K02056K66685j99761j16375Q8424K83971Q6135J01681j02775
$$ 3452539 3624405 3826461 4093146 3893385 3777010 3865434 4149405 4235540 4337221 4234446
16832D234446j0964K49169J50613P7275j48538Q1285J05898L3140L58351Q8882
$$ 4234446 4223482 4472651 4623264 4700539 4552001 4633286 4739184 4772324 5130675 5219557
16822E219557j8792J21476M4305O9365P8827Q6063J79706J37009N00621m11937
$$ 5219557 5200765 5322241 5366546 5435911 5514738 5600801 5780507 5917516 6418137 6006200
16812F006200J50956N65031l17336K09847J69466o2405J93494L18149n0031M57204
$$ 6006200 6157156 6722187 6404851 6614698 6784164 6721759 6915253 7233402 7183371 7640575
16802G640575J45309J24396J34736L1304M41266M89637k03545J93589L49901N34757
$$ 7640575 7785884 7910280 8045016 8076320 8517586 9007223 8803678 8997267 9347168 9881925
16792I881925j65928J63856M03353M54645K68012J95366K66530M04115N34444
$$ 9881925 9715997 9879853 10283206 10737851 11005863 11201229 11467759 11871874 12406318
16783A2406318K29406N6837L62577O23777L05256K03024O67085M70101L65088
$$ 12406318 12635724 12692561 13055138 13678915 13984171 14187195 14854280 15324381 15689469
16774A5689469O84142L24773O78272P27532M08058Q00053P74388O03111P15454
$$ 15689469 16373611 16698384 17376656 18104188 18512246 19312299 20086687 20689798 21405252
16765B1405252P04953J212761M41930R46819J165298R57934J258778Q68100J204032
$$ 21405252 22110205 23322966 23764896 24711715 25877013 26834947 28093725 28961825 30165857
16756C0165857J397067J137810J867708J382169J712031J785331J934782J718096
$$ 30165857 31562924 32700734 34568442 35950611 37662642 39447973 41382755 43100851
16748D3100851K263226K258436K343528K867324K502042K816602L292228L289440
$$ 43100851 45364077 47622513 49966041 52833365 55335407 58152009 61444237 64733677
16740F4733677L808610L910525L695658M790411M371268N026223N092013N095568
$$ 64733677 68542287 72452812 76148470 80938881 85310149 90336372 95428385 100523953
16732A00523953N349300O351507N620847O367152O492400O517957O231618O314035
$$ 100523953 105873253 112224760 117845607 124212759 130705159 137223116 143454734 149768769
16724A49768769N915451O312105N186178M852644M064253L311361K330961J649702
$$ 149768769 155684220 161996325 167182503 172035147 176099400 179410761 181741722 183391424
16716A83391424N12382j406097j591418l221751l624490m646293n182737n845786
$$ 183391424 183903806 182497709 180906291 177684540 174060050 169413757 164231020 158385234
16708A58385234o236428o276261o532050o384274o317783o352763n816921o102237
$$ 158385234 152148806 145872545 139340495 132956221 126638438 120285675 114468754 108366517
16700A08366517n356892n578239m750301m931868m467388l837494m224447m273808
$$ 108366517 103009625 97431386 92681085 87749217 83281829 79444335 75219888 70946080
16692G0946080l322445l382949k959603l083693k752537k723689k287619k635478
$$ 70946080 67623635 64240686 61281083 58197390 55444853 52721164 50433545 47798067
16684D7798067j941247k120831k049066j712061k093006j365415j652478j353561
$$ 47798067 45856820 43735989 41686923 39974862 37881856 36516441 34863963 33510402
16676C3510402j410631j447405j215024p50887j620267q40330r04487j003196
$$ 33510402 32099771 30652366 29437342 28686455 27066188 26225858 25321371 24318175
16668B4318175j118438q40082q17233q44918r20152m61870o88538o46604m99206
$$ 24318175 23199737 22359655 21542422 20697504 19777352 19315482 18626944 17980340 17481134
16659A7481134p59373q18465k67790m19958n27807l85989o28064l9151p51296
$$ 17481134 16721761 15903296 15635506 15215548 14687741 14301752 13673688 13634537 12883241
16650A2883241j20196o10030l79926k20032l04361n96548k11395l38932l11461
$$ 12883241 12763045 12153015 11773089 11553057 11248696 10652148 10440753 10101821 9790360
16641I790360J23829l59912m20865l29756k42644l07797n606m02578l43030m8896
$$ 9790360 9914189 9554277 9133412 8803656 8561012 8253215 8247609 7845031 7502001 7453105
16631G453105j74388J73840l59502l84030k63262j1571Q568M6770n20568j49702
$$ 7453105 7278717 7452557 7093055 6709025 6445763 6434192 6442760 6489530 5968962 5819260
16621E819260j37080k83474K26097k54607k65400K55279k82286m02743J37946
$$ 5819260 5682180 5398706 5624803 5370196 5104796 5360075 5077789 4675046 4812992
16612D812992R2133k15501J28661j67246l24067p2030n04657L30202p4918j22109
$$ 4812992 4905125 4689624 4818285 4651039 4326972 4254942 3750285 4080487 4005569 3883460
16602C883460O3974j50918J02117j8030l62312K14458k74075j90764m7150j07250
$$ 3883460 3947434 3796516 3898633 3880603 3518291 3732749 3458674 3267910 3220760 3113510
16592C113510K46058k18116l0179K3830k29336P1689Q2683k06099j06270j98566
$$ 3113510 3359568 3141452 3111273 3135103 2905767 2977456 3060139 2854040 2747770 2549204
16582B549204J46671L127J4409j56703L0132M3578M141j54215J3499k88615J6157
$$ 2549204 2695875 2699002 2713411 2556708 2586840 2630418 2634559 2480344 2493843 2205228 2221385
16571B221385M2640j43232J1361J99250J079q1467r7673l89173L47781r4939l81992
$$ 2221385 2264025 2120793 2132154 2331404 2332483 2251016 2153343 1764170 2111951 2017012 1635020
16560A635020N09837j39357l1278j36495q8307K74239m68625J40041Q4702P0847
$$ 1635020 2144857 2005500 1974222 1837727 1749420 2023659 1555034 1695075 1779777 1850624
16550A850624m39763K37549n3983K14769l35288J49151j79036K07164k52037m1883
$$ 1850624 1410861 1648410 1594427 1809196 1473908 1623059 1444023 1651187 1399150 1357267
16540A357267M6363n2359N5617j37548k90311M56068r1151K00366q7332q0883
$$ 1357267 1403630 1351271 1406888 1269340 979029 1435097 1343946 1544312 1456980 1376097
16530A376097M089k8487j13687K4897J12525l21946j06749K46603j31143L19694
$$ 1376097 1380186 1351699 1238012 1262909 1375434 1053488 946739 1193342 1062199 1381893
16520A381893k89162r4954m8358K18381l01252M30922k18064o1217L00072j33022
$$ 1381893 1092731 997777 949419 1167800 866548 1297470 1079406 1018189 1318261 1185239
16510A185239l22801L37492l27698k20339M76991j81674M156l59075O54066m62184
$$ 1185239 862438 1199930 872232 651893 1128884 947210 951366 592291 1246357 784173
16500G84173L36939l63960K38289J26393n19153M71071j57787k16227M875M24995
$$ 784173 1121112 757152 995441 1121834 602681 1073752 915965 699738 704613 1129608
16490A129608l85550p0147q67J98598O8915m9211l37277L38493p9416q9728K06788
$$ 1129608 744058 673911 673044 871642 940557 891346 554069 892562 813146 723418 930206
16479I30206l06557K16448l98523N33695l23624o1772J18512j76900N14662m27481
$$ 930206 623649 840097 441574 975269 651645 589873 708385 531485 1046147 618666
16469F18666j7805o0842Q367j8638K34048k7239B68314K87516J92579l61511q146
$$ 618666 600861 540019 548386 529748 763796 736557 268314 555830 748409 386898 378752
16458C78752l7629L06963j3699J19239J0943o3399k35170J63665J07875j68761
$$ 378752 341123 648086 634387 753626 764569 701170 466000 629665 737540 568779
16448E68779K27336k27087J00851j75553K01293j10914J64921l19972q4231J29633
$$ 568779 796115 569028 669879 494326 695619 584705 749626 429654 345423 475056
16438D75056A55013K75059L10612l26944K59383j87217j49085m5839J96756L17729
$$ 475056 155013 430072 740684 413740 673123 485906 336821 290982 487738 805467
16428H05467C71522o1612J46789j97626Q6845M2853o635Q0685r2601J06505P6591
$$ 805467 371522 309910 456699 259073 345918 388771 382136 462821 370220 476725 553316
16417E53316l0332A34609K17147j24657M37940C08800P0729m758a9347D64957
$$ 553316 522984 134609 351756 227099 665039 308800 379529 374771 -19347 464957
16406B08720N41773k63626r6267R4961a53096D97894K98183A90116A9587L56001
$$ 208720 750493 486867 390600 485561 -153096 497894 796077 190116 19587 375588
16396C75588qO3385n6222j30545a153B93406J46347A65146K44617a07045B17546
$$ 375588 375580 438965 382743 252198 -1153 293406 439753 165146 409763 -107045 217546
16384C10843m1367p6157K36216M373i7495m8528B83390F1923k3347J54201K04337
$$ 310843 269476 193319 429535 433908 -97495 -146023 283390 61923 38576 192777 397114
16373C97114j91093P3491K26825B32140r1747E2640J37102K4878g2427D48599
$$ 397114 206021 279512 506337 232140 140393 52640 189742 214620 -72427 448599
16362h9990B40283M7635J16917o0292c54C39870K62865B56961K1569d7045E8072
$$ -89990 240283 287918 404835 344543 -354 339870 602735 256961 278530 -47045 58072
16350B73749d2608A42521K2337k1518n6688R9102Q3842J56925A949K94685A41187
$$ 273749 -42608 142521 164858 143340 86652 185754 269596 426521 1949 296634 141187
16338B46632j358Q9572O2454j78560L06763j95916j34670C449J07355l18J60139
$$ 246632 245274 334846 397300 218740 525503 329587 194917 3449 110804 110486 270625
16327B70625J1753A25999L06531G8825K8243b75376B61058p6110m3418L03469
$$ 270625 282378 125999 432530 78825 107068 -275376 261058 184948 141530 444999
16317D44999B13480A0027R3441R5495b18794B80864Q63m6941r1216a66208C39431
$$ 444999 213480 10027 103468 198963 -218794 280864 281727 234786 143570 -166208 339431
16305A41645l3992O0927J80464A1502K6258M9282M19797b50505F8231K6781Q9183
$$ 141645 107653 168580 349044 11502 37760 87042 506839 -250505 68231 95012 184195
16294A84195J22067A46122J3933J80378C6974K68123A45026F1480K80070K09075
$$ 184195 306262 146122 160055 340433 36974 305097 145026 61480 341550 550625
16284E50625A30589K37415c6743H8801P0469P0080p9058f4964A1374M6712K7590
$$ 550625 130589 368004 -36743 88801 159270 229350 150292 -64964 11374 58086 85676
16273H5676B8275a12682A38519E2924J16790a23124G1414M6391o784J27206c25882
$$ 85676 28275 -112682 138519 52924 169714 -123124 71414 117805 111021 238227 -325882
16261A91658d5869E1029g2758E0408M18931I1158f0048C13252j34327j3122G5954
$$ 191658 -45869 51029 -72758 50408 469339 91158 -60048 313252 178925 165803 75954
16249A0818K30021o0042H7083a67502c280j50923G0102k4117R3488Q8473a94965
$$ 10818 240839 180797 87083 -167502 -3280 -154203 70102 45985 139473 227946 -194965
16237A71524h4986C2682J77439F3211f4551b7701A03595c33111A79322D4475J29147
$$ 171524 -84986 32682 210121 63211 -64551 -27701 103595 -333111 179322 44475 173622
16226A73622b7259k21017C34620r1214j04195a41009e3471A55229G1974G943Q9977
$$ 173622 -27259 -248276 334620 243406 139211 -141009 -53471 155229 71974 7943 97920
16215I7920J3223a6840C06075D1731D327b27880B27905K17940D9474i3937c6916
$$ 97920 111143 -16840 306075 41731 4327 -227880 227905 445845 49474 -93937 -36916
16203a35471G9061R7873R9617E1801b4922A384L11095R6872C9124J15292J1627
$$ -135471 79061 176934 276551 51801 -24922 1384 312479 409351 39124 154416 166043
16192A66043c01949l0808G7682h8935n668C8650b36074d656n8123C8573b91097
$$ 166043 -301949 -332757 77682 -88935 -94603 38650 -236074 -4656 -62779 38573 -291097
16180b2466m0409B54999A7025K29688J6703a26280k05272H5593f6859p2196E5191
$$ -22466 -62875 254999 17025 246713 263416 -126280 -331552 85593 -66859 -139055 55191
16168b37759A73101d0924A6915K9235Q9137L9205b50721B59879A04875L0901n8587
$$ -237759 173101 -40924 16915 46150 135287 174492 -250721 259879 104875 135776 77189
16157G7189B2608i3263j86708A41616D868c684j01440d4496B345Q7474e4751A93353
$$ 77189 22608 -93263 -279971 141616 4868 -3684 -105124 -44496 2345 89819 -54751 193353
16144E8882a61940r2225I475J82763a28267D50768b88703B47924B2210J83216
$$ 58882 -161940 -254165 9475 192238 -128267 450768 -288703 247924 22210 205426
16134B05426I1091a36843A89959l4317o7118a90494A97756e7380B82739d3527
$$ 205426 91091 -136843 189959 155642 88524 -190494 197756 -57380 282739 -43527
16123b89482F2870P3574O6687a5270j63422a217m6673J2890l8349C522f1055r2270
$$ -289482 62870 136444 203131 -15270 -178692 -1217 -47890 -35000 -73349 3522 -61055 -153325
16111a53325A63443J4900K95891e3229o0096p6342c335A59172D2301O4130c99905
$$ -153325 163443 178343 474234 -53229 -113325 -189667 -3335 159172 42301 106431 -399905
16099H9724e3722C25099a37523J6591f408B51780K08008A77920a10144K507B58310
$$ 89724 -53722 325099 -137523 -120932 -6408 251780 459788 177920 -110144 -107637 258310
16087B91945g7739A93012q1177n0906L3351a27454j37792A69312k7524P2019f5476
$$ 291945 -77739 193012 111835 60929 94280 -127454 -265246 169312 141788 213807 -65476
16075a40732O9714b6328B78672Q8918G6670I110b20332g2965j18854f087n1435
$$ -140732 -71018 -26328 278672 367590 76670 9110 -220332 -72965 -191819 -6087 -57522
16064e7522q4610C7843b6049c536B10848d6320G9569c53886J64381l4618Q2568
$$ -57522 -142132 37843 -26049 -3536 210848 -46320 79569 -353886 -189505 -224123 -141555
16053a41555P0270A71136l7980R9171I3836d87290A24812p891l5350a87503L1046
$$ -141555 -71285 171136 133156 232327 93836 -487290 124812 116921 81571 -187503 -156457
16042a56457o0601K0918a1996o7868n3005C6542L7446O9836R4268D338J49544
$$ -156457 -217058 -196140 -11996 -79864 -132869 36542 73988 143824 238092 4338 153882
16031A53882a4491j97977A5524b09161B84568b08493B47486j0354k9587b91348
$$ 153882 -14491 -212468 15524 -209161 284568 -208493 247486 237132 207545 -291348
16020h3173j4188A07356c8260n5669F821d99698f4228o6280F3775L0237M1483
$$ -83173 -97361 107356 -38260 -93929 6821 -499698 -64228 -130508 63775 94012 135495
16009A35495E6506N8691c12680A4675b57864K7362A39656a4614j31417r8971R6757
$$ 135495 56506 115197 -312680 14675 -257864 -230502 139656 -14614 -146031 -245002 -148245
15998a48245B19561p8937a79838F5239K78964a11357M1782o980o9657K6484A25660
$$ -148245 219561 140624 -179838 65239 344203 -111357 -69575 -76555 -146212 -119728 125660
15986a22976H1617a37339C42275L82108B01023L45802B63550I2122R3313F2874
$$ -122976 81617 -137339 342275 724383 201023 546825 263550 92122 185435 62874
15975A90017a09488l9125k13877a5058r6416B24997a29643L0088A87905a31399
$$ 190017 -109488 -148613 -362490 -15058 -111474 224997 -129643 -99555 187905 -131399
15964F6538J49801r7924D958J5198N6306K17993j07957a17078J7312L491m2437
$$ 66538 216339 118415 4958 20156 76462 294455 186498 -117078 -99766 -96275 -138712
15953a38712A08125N8905A0122e6958B9807A1688D221i6720l02622a97805b5521
$$ -138712 108125 167030 10122 -56958 29807 11688 4221 -96720 -399342 -197805 -25521
15941b6701C12836A29237b31589A50492J5721D2643a13874k27443E0621a34395
$$ -26701 312836 129237 -231589 150492 166213 42643 -113874 -341317 50621 -134395
15930g5632A45478n8995C2437a34088n6778A17550e6479j79177B32562c75230
$$ -75632 145478 86483 32437 -134088 -190866 117550 -56479 -235656 232562 -375230
15919a37526A18404b7276I7608a20736b0913B27262a42047d8751o8222a9277A84436
$$ -137526 118404 -27276 97608 -120736 -20913 227262 -142047 -48751 -116973 -19277 184436
15907a41828k078A08423d6544r009j13422o9303F5536c2193j34421g559r6085
$$ -141828 -143906 108423 -46544 -55553 -168975 -238278 65536 -32193 -166614 -7559 -103644
15896a03644b8019j23724B9506a87724k86026i3353K5138B06156o3416a71230
$$ -103644 -28019 -151743 29506 -187724 -473750 -93353 -68215 206156 142740 -171230
15885E5691a09174b6896k161j83180Q8584e3267A70a52047r2771g3066j35989
$$ 55691 -109174 -26896 -29057 -212237 -123653 -53267 170 -152047 -244818 -73066 -209055
15874b09055g9687q0475B36551c91433a12874N4694B15124a34827A0403c49854
$$ -209055 -79687 -160162 236551 -391433 -112874 -58180 215124 -134827 10403 -349854
15863b5270q3303B8544L6275a68557J8620I8314a59802k75436c566k23411B84445
$$ -25270 -108573 28544 64819 -168557 -149937 98314 -159802 -435238 -3566 -226977 284445
15851H354K8518K26768d08130i8367A05546b62740A58351R3810q5786k0772b2751
$$ 8354 36872 263640 -408130 -98367 105546 -262740 158351 252161 166375 145603 -22751
15839b07122Q3093k47482J80854A36084c39809e8864m52991b54771c8292A86768
$$ -207122 -124029 -371511 -190657 136084 -339809 -58864 -511855 -254771 -38292 186768
15828a83779d4466B03453k5391g1067C40680E4284a0000q4628d3821G0470P174
$$ -183779 -44466 203453 178062 -71067 340680 54284 -10000 -94628 -43821 70470 77644
15817G7644a7326B8822J85485B6924b4614n4065l928B22035c12150g1687A85579
$$ 77644 -17326 28822 214307 26924 -24614 -78679 -82607 222035 -312150 -71687 185579
15805B6810G020b3472l9466j48755F251M1334a9066j31661A75657b59533A0845
$$ 26810 7020 -23472 -62938 -211693 6251 47585 -19066 -150727 175657 -259533 10845
15793a31710p7351A71131a11695F252i1298K725F3146a55345B02534f3688a8632
$$ -131710 -209061 171131 -111695 6252 -91298 -88573 63146 -155345 202534 -63688 -18632
15781a36781G575L41986b29228d0881A2900c70619C9672R8482a92515A61539K6149
$$ -136781 7575 349561 -229228 -40881 12900 -370619 39672 138154 -192515 161539 187688
15770A87688i2017K1365k756A79262b53767J02245A11084N458P5262J65515A40960
$$ 187688 -92017 -70652 -73408 179262 -253767 -151522 111084 116542 191804 357319 140960
15758B0510J27830D2891a5762B81005E4218b6405I9034h5138A00376e570E8434
$$ 20510 148340 42891 -15762 281005 54218 -26405 99034 -85138 100376 -5570 58434
15746C6011d8106D181J67271F7934b06732D9586R3202C6415i9809K1722m5427
$$ 36011 -48106 4181 171452 67934 -206732 49586 142788 36415 -99809 -78087 -123514
15735a23514l2221G1114b39861B76779c82741A76574a99812E4422b76724E4480
$$ -123514 -155735 71114 -239861 276779 -382741 176574 -199812 54422 -276724 54480
15724b40170A02947a55884A08353b38930g3060l72295D1594b1699o2537j6109
$$ -240170 102947 -155884 108353 -238930 -73060 -445355 41594 -21699 -84236 -100345
15714a00345B65686c87597e4235d358l28142D4655d02062g1944k04277f243A29688
$$ -100345 265686 -387597 -54235 -4358 -332500 44655 -402062 -71944 -276221 -6243 129688
15702h3536A58872c3993j51485d9236c890m9120E3718a7305j00813D5959J85061
$$ -83536 158872 -33993 -185478 -49236 -3890 -53010 53718 -17305 -118118 45959 231020
15691B31020d6148p3305B81295b72366P9010n3867e0664A68762i9893k68052Q1456
$$ 231020 -46148 -119453 281295 -272366 -193356 -247223 -50664 168762 -99893 -367945 -286489
15680b86489P3784C25581a27812j2955L5050K6023A35088K3708A6363J85628m7387
$$ -286489 -212705 325581 -127812 -140767 -105717 -79694 135088 158796 16363 201991 154604
15669A54604f6207B25370b42261P6785C07119j12554q0025g412k38983m3190A32174
$$ 154604 -66207 225370 -242261 -165476 307119 194565 114540 -7412 -246395 -289585 132174
15657a91050c6565B75169c59664h0776A94558B5982a01715k83811B08396h3918
$$ -191050 -36565 275169 -359664 -80776 194558 25982 -101715 -385526 208396 -83918
15646a18472k67514f6928C3800R0226E7948b01085P0384c3010q8941e7049A73854
$$ -118472 -385986 -66928 33800 124026 57948 -201085 -130701 -33010 -121951 -57049 173854
15634b35647d4930F7631c63739B13443c4288C6025b23057f0928J1741D328c61797
$$ -235647 -44930 67631 -363739 213443 -34288 36025 -223057 -60928 -49187 4328 -361797
15622A75116e9526a4268I8528f0684D8767I084N961L07910G7627J50206d5681
$$ 175116 -59526 -14268 98528 -60684 48767 9084 15045 322955 77627 227833 -45681
15610c37929J07112C2085K33264b39989h5120C5963O3872N9298j1233f6457j94732
$$ -337929 -230817 32085 265349 -239989 -85120 35963 99835 159133 147900 -66457 -261189
15599b61189A11464R0156a55157l08921f5325A0543g2914K7647G5257C3097b8835
$$ -261189 111464 201620 -155157 -464078 -65325 10543 -72914 -45267 75257 33097 -28835
15587H5826J47811d76946F2214J13200h4766R844B73732a42418j75150A45199
$$ 85826 233637 -476946 62214 175414 -84766 -74922 273732 -142418 -317568 145199
15576D5854J233d7468j802n7695A30910h9925q2360p0296P1144B5229b6987B45104
$$ 45854 47087 -47468 -49270 -106965 130910 -89925 -172285 -242581 -171437 25229 -26987 245104
15563a42394n36454c10054C9787J61236a80080Q0538L8331b0080k02047L9253
$$ -142394 -678848 -310054 39787 201023 -180080 -99542 -61211 -20080 -222127 -182874
15553a82874A41462K47333a08335k4089A08003d2377A69090e9865l32442f6706
$$ -182874 141462 388795 -108335 -132424 108003 -42377 169090 -59865 -392307 -66706
15542B0341N5938k6571i1618n1004q1662K581B35066L3718a87335Q1989j35016
$$ 20341 76279 49708 -91618 -142622 -224284 -221703 235066 268784 -187335 -105346 -240362
15531b40362d790p3472j19294a7711B46376p426b48029i0823C29990a30006d0846
$$ -240362 -4790 -78262 -197556 -17711 246376 238950 -248029 -90823 329990 -130006 -40846
15519a42579A7872a3779F0661K650L04787d0890A37396E6527R5600b27141A33088
$$ -142579 17872 -13779 60661 63311 368098 -40890 137396 56527 152127 -227141 133088
15507c02492B99965I6194m1037b3302G5863a04240k00691g700m97B26513I0359
$$ -302492 299965 96194 55157 -23302 75863 -104240 -304931 -7700 -8197 226513 90359
15495a11592C18519c11985A10467b93825F5662b31405d5485j77250d6021j70796
$$ -111592 318519 -311985 110467 -293825 65662 -231405 -45485 -222735 -46021 -216817
15485b16817H8396b17121K0613r873c0227j5622J0140j13698k7036A97047F2595
$$ -216817 88396 -217121 -196508 -206381 -30227 -45849 -35709 -149407 -176443 197047 62595
15473B92637b40772D6150K5649c02726G4706a68454P2399A49451a69849A186J17000
$$ 292637 -240772 46150 71799 -302726 74706 -168454 -96055 149451 -169849 1186 118186
15462A18186E4123J27497a24641A56451E2506a5125k1989G6101J12936F7867J14930
$$ 118186 54123 181620 -124641 156451 52506 -15125 -37114 76101 189037 67867 182797
15451A82797c78490f8088l64040b5559k87360C22343b70158Q0633A72364b19259
$$ 182797 -378490 -68088 -432128 -25559 -312919 322343 -270158 -189525 172364 -219259
15440a91901h5534j10840d9130G3168a7939H4409b29429b5767j5709p3543C7710
$$ -191901 -85534 -196374 -49130 73168 -17939 84409 -229429 -25767 -41476 -115019 37710
15428a71264k32619J15471B20016C2458a53658B7927a06655b2581l345B0347f379
$$ -171264 -403883 -288412 220016 32458 -153658 27927 -106655 -22581 -25926 20347 -6379
15416c2502F667b62101M9771B11682i7763E3581b25761A19090L3930n3110a59643
$$ -32502 6667 -262101 -212330 211682 -97763 53581 -225761 119090 153020 99910 -159643
15404a85182d6077k6550k55128d5065j58053A80127i5401J2644r902b3764l9397
$$ -185182 -46077 -72627 -327755 -45065 -203118 180127 -95401 -82757 -92659 -23764 -63161
15393f3161k79756a61679B9701R628M11906D3746J04131i8395B4385f9594a4820
$$ -63161 -342917 -161679 29701 39329 451235 43746 147877 -98395 24385 -69594 -14820
15381b25520D5832K0577J76756a76596A20982m0608a99064B71579i3946j81716
$$ -225520 45832 66409 243165 -176596 120982 80374 -199064 271579 -93946 -275662
15371b75662A62061d8689K0459B30764A13123a20714F8823J5650b9832A26834
$$ -275662 162061 -48689 -28230 230764 113123 -120714 68823 84473 -29832 126834
15360E3180c88065H0842r228J16441H7835l1030L40c9082A88771i3185F8363b67113
$$ 53180 -388065 80842 71614 188055 87835 56805 57145 -39082 188771 -93185 68363 -267113
15347b4892A46466p0395g1820B17587K6268b3266A61395a00697B59296j17179
$$ -24892 146466 76071 -71820 217587 243855 -23266 161395 -100697 259296 142117
15337A42117I693g703A6852a30018C62961f5199B9304g5074B51382a12194o2781
$$ 142117 9693 -7703 16852 -130018 362961 -65199 29304 -75074 251382 -112194 -174975
15326a74975N2917D7713J20996k7662M4976c1382A87117k3526a96180D0001K06065
$$ -174975 -122058 47713 168709 141047 186023 -31382 187117 163591 -196180 40001 246066
15315B46066I1307C9123K75613k6796o7068i0031B6368a72224A09818b10777A79320
$$ 246066 91307 39123 314736 287940 220872 -90031 26368 -172224 109818 -210777 179320
15303A09935l2068a69928A2754L04740i5290B75111B6614a66708I7269b13261
$$ 109935 77867 -169928 12754 317494 -95290 275111 26614 -166708 97269 -213261
15292a6143A56481G7466e8831A37083F797Q1895K09358r8241n5703j0874E4787
$$ -16143 156481 77466 -58831 137083 6797 88692 298050 199809 144106 133232 54787
15280c22055J33574M3208G6840o541i2036D6023J27995p5011i7041B43108g8944
$$ -322055 -188481 -145273 76840 70299 -92036 46023 174018 99007 -97041 243108 -78944
15268D0836J17890K62328r9028A35008e5046A37772a38776A13949K26373L9072
$$ 40836 158726 421054 322026 135008 -55046 137772 -138776 113949 340322 379394
15258C79394H032N9694J0370h6771B49729k5682i4404C01101J36871K06432N78297
$$ 379394 8032 67726 78096 -86771 249729 224047 -94404 301101 437972 644404 1222701
15247A222701k33564q4893k5033C10894l5283f731j01739B89641j34059M0204
$$ 1222701 989137 904244 879211 310894 275611 -6731 -108470 289641 155582 195786
15237A95786a28913N3194A53911a70842K5795F9536A0281g3272D4060Q278h6317
$$ 195786 -128913 -75719 153911 -170842 -145047 69536 10281 -73272 44060 52338 -86317
15225b15808A70037B5417c9015q273p749B39382n505F2921a82804B90734F6003
$$ -215808 170037 25417 -39015 -47288 -55037 239382 233877 62921 -182804 290734 66003
15213A86381K05001f09E2408P096a08518A34564k3224R4964B9453a02444B4721
$$ 186381 391382 -609 52408 59504 -108518 134564 111340 206304 29453 -102444 24721
15201A33682b08830A78654b34077C6720K57386A39737o2965b8115l11144B39569
$$ 133682 -208830 178654 -234077 36720 294106 139737 76772 -28115 -339259 239569
15190I0258a72670A85969h1586C4153a8060p3173J3505j18284A66766a41485C05898
$$ 90258 -172670 185969 -81586 34153 -18060 -91233 -77728 -196012 166766 -141485 305898
15178a3318j22262B42229B9381K1807M48824A29486J08J7159a78r6463A8018K76975
$$ -13318 -135580 242229 29381 51188 500012 129486 129594 146753 -178 -96641 18018 294993
15166B94993c3553C10891a53804B14830n197g7305E05129c9334l8182A92659B7997
$$ 294993 -33553 310891 -153804 214830 209633 -77305 505129 -39334 -77516 192659 27997
15154b8768j7585C00731c72217F4330h0971c6947B78416C2019K71497a91852B27345
$$ -28768 -46353 300731 -372217 64330 -80971 -36947 278416 32019 303516 -191852 227345
15142B17991k3623F2138J2406J05905b96152A42631b65282E9313q371B1937b24822
$$ 217991 194368 62138 74544 180449 -296152 142631 -265282 59313 50942 21937 -224822
15130A31062n7433R4740J73147f1148K2904n4091d0410D22776F1454R538A8278
$$ 131062 73629 168369 341516 -61148 -38244 -92335 -40410 422776 61454 70992 18278
15118B35138p5700C9385a05697E9661a78919A53987K2152P6571H621L1211M7919
$$ 235138 159438 39385 -105697 59661 -178919 153987 176139 252710 8621 39832 87751
15107H7751L2195n5546J71459p0801f4722B25550K11546j45793F2027M5782a05646
$$ 87751 119946 64400 235859 165058 -64722 225550 437096 291303 62027 107809 -105646
15095D5309K42472h3632A56227k9018O1566M626J3918A03582J1499Q5865E3621
$$ 45309 287781 -83632 156227 127209 188775 193401 207319 103582 115081 200946 53621
15083B50755j7292j09069K49347Q2400A49637P255j9983J40722d7307A01921m7110
$$ 250755 233463 124394 373741 456141 149637 156892 136909 277631 -47307 101921 54811
15072E4811R1999j0138k0633M9083P8369A04801j5199K5229e0355C46526A63825
$$ 54811 146810 136672 116039 165122 243491 104801 89602 114831 -50355 346526 163825
15060B41444k2047I8726a10220C09021k2958M3151A20641J32809A8832J15050
$$ 241444 219397 98726 -110220 309021 286063 329214 120641 253450 18832 133882
15050A33882J39730G6781J91284r0406n8702K10327h1175B18557J46717h9731
$$ 133882 273612 76781 268065 177659 118957 329284 -81175 218557 365274 -89731
15039C65184G2451L5059Q2887J54827j39535M195D8979I535K07538m4641J73901
$$ 365184 72451 107510 190397 345224 205689 209884 48979 9535 217073 172432 346333
15028C46333E3322I308B851a589I8188J41079C4638K19513m1925n7252b5750B23782
$$ 346333 53322 9308 2851 -1589 98188 239267 34638 254151 212226 154974 -25750 223782
15015A61766o3069J94195j02289J18471n4160J38090b10003G1605K32189E917
$$ 161766 98697 292892 190603 309074 254914 393004 -210003 71605 303794 5917
15004B12044A641L50151l9804b0368C40738j10862K85074j86354q0061a37369
$$ 212044 1641 351792 311988 -20368 340738 229876 514950 328596 248535 -137369
14993C4792L46040A82946A1598K15233m9153K5639K9233J8843a38380c2109C49994
$$ 34792 380832 182946 11598 226831 177678 203317 232550 251393 -138380 -32109 349994
14981B34138E0002Q1028b5C66194j53461J32114G5261K25025P4948o7245O220
$$ 234138 50002 131030 -25 366194 212733 344847 75261 300286 375234 307989 314209
14970C14209G2850K07163K07287b3142B14741l8939D3556N6783M32391A01080
$$ 314209 72850 280013 487300 -23142 214741 175802 43556 100339 532730 101080
14959C54648E2756K3388K09098E4841a73779A70651K41854m9912j0516m1452Q4254
$$ 354648 52756 76144 285242 54841 -173779 170651 412505 362593 352077 310625 394879
14948C94879A75554O7770l7076J30446J6798L26568j93366K79082a22239E62691
$$ 394879 175554 243324 206248 336694 353492 680060 486694 765776 -122239 562691
14937A28935Q5589J74611L9205j51357K33371A5401L85198b0867C44437J48097
$$ 128935 214524 389135 428340 276983 510354 15401 400599 -20867 344437 492534
14927D92534r2493p7990N2900A20472q533L41507J28627A62984K71809f8191D5888
$$ 492534 400041 322051 374951 120472 111939 453446 582073 162984 434793 -68191 45888
14915B66824J94839j29808L41182B14426L3888J33107B3397J14876J48627K71626
$$ 266824 461663 331855 673037 214426 248314 381421 23397 138273 286900 558526
14905E58526k14633Q0525A40696m8121N21616e7394A28031R9514o6058J16767
$$ 558526 343893 424418 140696 92575 614191 -57394 128031 227545 161487 278254
14895B78254L9362H6787O05524k49493L06526A66268R5363e6161D4204O10252
$$ 278254 317616 86787 692311 442818 749344 166268 261631 -56161 44204 654456
14885F54456B25202l95J65826A75828J11205K46811A39441L16765J72740F8686
$$ 654456 225202 224807 390633 175828 287033 533844 139441 456206 628946 68686
14874D21482j0069j91627J1382C5810K66433L10634k40564c4496E87125j34998
$$ 421482 411413 219786 231168 35810 302243 612877 372313 -34496 587125 452127
14864D52127B07723J47703K2823K08276r2645l5957m0218P6023B18164J73462
$$ 452127 207723 355426 378249 586525 493880 457923 417705 493728 218164 391626
14854C91626j78078L70358n5642l7542J73740k28259j6765K3667A88620K358J85684
$$ 391626 213548 583906 528264 490722 664462 436203 419438 443105 188620 190978 376662
14843C76662L04473m6016j33226J8660J86646k48059j81130M07329A69845M39341
$$ 376662 681135 635119 501893 520553 707199 459140 278010 685339 169845 609186
14833F09186k75947J81651L272j19962J25526O4321k72924P438j40863K96765
$$ 609186 333239 514890 518162 398200 523726 588047 315123 322561 181698 478463
14823D78463J84523k43189p3228M682J83009l5872k46412J30731j57531N88275
$$ 478463 662986 419797 346569 351251 534260 498388 251976 382707 225176 813451
14813H13451C40442J03767q5542L63985j97366P1046M1835o1022k38467L88860
$$ 813451 340442 444209 358667 722652 525286 596332 638167 577145 338678 727538
14803G27538l28033j0388l253K02002j7724P101n8844j60811L03914l0251j41750
$$ 727538 399505 389117 385864 587866 570142 577243 518399 357588 661502 631251 489501
14792D89501j96134O4660J61554j06076m5418K20202N1403J01346O440k90790
$$ 489501 293367 358027 519581 413505 368087 588289 639692 741038 747478 456688
14782D56688M1460L09300j25247o4393p7335J08374j53073K75361j07692p1005
$$ 456688 498148 807448 682201 617808 540473 648847 495774 771135 663443 592438
14772E92438k01670K34032P0562K7290J23500k35193B82014M00230k74771J85771
$$ 592438 390768 624800 695362 722652 846152 610959 282014 682244 407473 593244
14762E93244q3175j04275M06J57113K13251l17126N98212E16739K35064j28576
$$ 593244 510069 405794 406200 563313 776564 459438 1057650 516739 751803 623227
14752F23227o7474J05426o6676G3837O47679m4647p4904K59183r4529o9452n0717
$$ 623227 555753 661179 594503 73837 721516 676869 601965 861148 766619 697167 646450
14741F46450M739J16244K76969m16407J99365k45290K54937k93488J34368k76007
$$ 646450 651189 767433 1044402 627995 827360 582070 837007 543519 677887 401880
14731D01880J67063K54782l39332K96123o4443J34344k439j64802j67801J79999
$$ 401880 568943 823725 484393 780516 716073 850417 847978 683176 515375 695374
14721F95374Q9739K58514m72560N21967l71405q72L57149j95430j29180O8933
$$ 695374 785113 1043627 571067 1093034 721629 720757 1077906 882476 753296 822229
14711H22229J78093k55418k17827K53630l42309O23571j94290r7132P9994J14981
$$ 822229 1000322 744904 527077 780707 438398 1061969 867679 770547 850541 965522
14701I65522O1439j10216k89408K29838P5061j8728J5613j38010M42127j64993
$$ 965522 1026961 916745 627337 857175 932236 913508 929121 791111 1233238 1068245
14691A068245k10434r5412J20740J44956M7352j21796k1295L6776J15734m7554
$$ 1068245 857811 762399 883139 1028095 1075447 953651 932356 969132 1084866 1037312
14681A037312j16233K89110k49776q9589J19090R6747N4517R492j05865K35659
$$ 1037312 921079 1210189 960413 870824 989914 1086661 1141178 1150670 1044805 1280464
14671A280464j45480j00958K22836k72687J29163K01818o11036O13764k83571
$$ 1280464 1134984 1034026 1256862 984175 1113338 1315156 704120 1317884 1034313
14662A034313j37130J65122k1672R1901j61680L00184k65993l3960N9120M9864
$$ 1034313 897183 1062305 1040633 1132534 970854 1271038 1005045 971085 1030205 1080069
14652A080069K42865j11828n7235R6537j10562j41192n1200k7966N12180l36768
$$ 1080069 1322934 1211106 1153871 1250408 1139846 998654 947454 919488 1431668 1094900
14642A094900O5599O6363k70741M31243j18690J84317l76138L02518k8219Q8555
$$ 1094900 1160499 1226862 956121 1387364 1268674 1452991 1076853 1379371 1351152 1439707
14632A439707j39825k61799J41357L12011j25146j5633j73178r8347J44519M1855
$$ 1439707 1299882 1038083 1179440 1491451 1366305 1350672 1177494 1079147 1223666 1265521
14622A265521J40422q2899L12894k19767K80129l25787n0084k03222L03687J40181
$$ 1265521 1405943 1323044 1635938 1416171 1696300 1370513 1320429 1117207 1420894 1561075
14612A561075l18626K27018L4368Q9779l10708M34572l40156L53048N0606j67165
$$ 1561075 1242449 1469467 1503835 1593614 1282906 1717478 1377322 1730370 1780976 1613811
14602A613811k0210k15606L30508j77476J64266J73105k81394J18136K74049l89184
$$ 1613811 1593601 1377995 1708503 1531027 1695293 1868398 1587004 1705140 1979189 1590005
14592A590005j22878N84611l26303l45640L68140l7175L84320j24846l9102k25119
$$ 1590005 1467127 2051738 1725435 1379795 1747935 1710760 2095080 1970234 1931132 1706013
14582A706013K80572j47632K74439J24928m81609M50991m50757J94868N84506
$$ 1706013 1986585 1838953 2113392 2238320 1756711 2207702 1756945 1951813 2536319
14573B536319m74709J03064J46253o6468p5919N14607n22887K31004J08678K12345
$$ 2536319 2061610 2164674 2310927 2244459 2168540 2683147 2160260 2391264 2499942 2712287
14563B712287K228J16293j21032L1359N55195k27127N69503p254L33233M61731
$$ 2712287 2714515 2830808 2709776 2741135 3296330 3069203 3638706 3631452 3964685 4426416
14553D426416N84783J35851Q44952Q97951J957408L113874P306192J0630487M080471
$$ 4426416 5011199 5147050 5992002 6889953 8847361 11961235 19267427 29897914 33978385
14544C3978385j5566973p786563m631842j963679l36921q60615l2524N2784q0958
$$ 33978385 18411412 10624849 5993007 4029328 3692407 2831792 2799268 2852052 2771094
14535B771094l3348j39347O7026J67481k29664J32804j52283j05114n1856l022
$$ 2771094 2737746 2598399 2665425 2832906 2603242 2736046 2583763 2478649 2426793 2423771
14525B423771K6192N2794n950m0907J49042m3028N6775L49537m64033p2938L26672
$$ 2423771 2449963 2502757 2496807 2455900 2604942 2561914 2618689 2968226 2504193 2431255 2757927
14514B757927j76411J21046K12382P3734n16342O08196l38580M2022J42795J00129
$$ 2757927 2581516 2702562 2914944 2988678 2472336 3080532 2741952 2783974 2926769 3026898
14504C026898O3858l30800M94764j37858L9720K72258l4756j52649K85437l08238
$$ 3026898 3090756 2759956 3254720 3116862 3156582 3428840 3394084 3241435 3526872 3218634
14494C218634j8485L72378J2333j85355J69943J07976j44475q1030L39951j33796
$$ 3218634 3200149 3572527 3584860 3399505 3569448 3677424 3532949 3451919 3791870 3658074
14484C658074K5078j6212K34510j44651K19823j71753K97592o768J55836k87838
$$ 3658074 3683152 3666940 3901450 3756799 3976622 3804869 4102461 4095693 4251529 3963691
14474C963691J4006N01555m44924O4270K25111j45112L74351K15527k52814L44949
$$ 3963691 3977697 4479252 4034328 4098598 4323709 4178597 4552948 4768475 4515661 4860610
14464D860610l98091Q7119O28948l04064J82856o72011M11758N4181R2875J72496
$$ 4860610 4462519 4549638 5178586 4874522 5057378 4385367 4797125 4851306 4944181 5116677
14454E116677J10464o5984N58598L4728l88553J82039j47150J63906j25158K36512
$$ 5116677 5227141 5161157 5719755 5754483 5365930 5547969 5400819 5564725 5439567 5676079
14444E676079M6133K34052Q629L42685j85501j95011K31775N68443l74824L57602
$$ 5676079 5722212 5956264 5964893 6307578 6122077 5927066 6158841 6727284 6352460 6710062
14434F710062r8242k43174O20982m07169L04901K8256j02092M80503M47290m02308
$$ 6710062 6611820 6368646 6989628 6582459 6887360 6915616 6813524 7294027 7741317 7339009
14424G339009Q7923J97632l10690O40928j82760M23663m36210N48359N0806j03230
$$ 7339009 7426932 7624564 7313874 7954802 7772042 8195705 7759495 8307854 8358660 8255430
14414H255430K93533J09055N07841r5273n6302K55332K65351l3241K73400k08224
$$ 8255430 8548963 8658018 9165859 9070586 9014284 9269616 9534967 9501726 9775126 9566902
14404I566902L81397M13549j44631J9556P21134k40116K45805j09736K94495M13606
$$ 9566902 9948299 10361848 10217217 10236773 10957907 10717791 10963596 10853860 11148355 11561961
14394A1561961k25916M14385K61641J85972J74199J50138K67280K37692j81958
$$ 11561961 11336045 11750430 12012071 12198043 12372242 12522380 12789660 13027352 12845394
14385A2845394O44773K12688N15221l4929M84106J73323R8330M05688L23512K07442
$$ 12845394 13490167 13702855 14218076 14183147 14667253 14840576 14938906 15344594 15668106 15875548
14375A5875548J75152L91689K68745J82083N33007O40106k4853M74007K58174
$$ 15875548 16050700 16442389 16711134 16893217 17426224 18066330 18041477 18515484 18773658
14366A8773658L26449R26284J92205L46271L76289N34173J40059R13699N96138
$$ 18773658 19100107 20026391 20218596 20564867 20941156 21475329 21615388 22529087 23125225
14357B3125225L92227N76051N31096M86835P88247L46973P26072P30397O56480
$$ 23125225 23517452 24093503 24624599 25111434 25899681 26246654 26972726 27703123 28359603
14348B8359603Q31467L67130R82199P71088J102664N38182O90622J171596J048475
$$ 28359603 29191070 29558200 30540399 31311487 32414151 32952333 33642955 34814551 35863026
14339C5863026R44903J170661P65545J020108J189615J396872J090932J127523
$$ 35863026 36807929 37978590 38744135 39764243 40953858 42350730 43441662 44569185
14331D4569185J510018R74934K064825J224445J804390J585438J839184J866669
$$ 44569185 46079203 47054137 49118962 50343407 52147797 53733235 55572419 57439088
14323E7439088J955045J879170K021131K323746K538127K602224K594139K580793
$$ 57439088 59394133 61273303 63294434 65618180 68156307 70758531 73352670 75933463
14315G5933463K610852L629214L037099L222146L760675M021714M089114M155106
$$ 75933463 78544315 82173529 85210628 88432774 92193449 96215163 100304277 104459383
14307A04459383M741004M485388N446296N367797N847976N778792O362866P024239
$$ 104459383 109200387 113685775 119132071 124499868 130347844 136126636 142489502 149513741
14299A49513741P014964P808273Q040983Q260156Q779453R933208R761903J0856593
$$ 149513741 156528705 164336978 172377961 180638117 189417570 199350778 209112681 219969274
14291B19969274J0726014J1960857J2766408J3029525J2969976J2895473J2595282
$$ 219969274 230695288 242656145 255422553 268452078 281422054 294317527 306912809
14284C06912809J2407879J1569300J1119303J1422667J0877396J0788475R791699
$$ 306912809 319320688 330889988 342009291 353431958 364309354 375097829 384889528
14277C84889528R968615J0292328J0322350J0331472R962629P447649M476161
$$ 384889528 394858143 405150471 415472821 425804293 435766922 443214571 447690732
14270D47690732K452888q8693m561851n631432m064666j0879723j2789695j3556697
$$ 447690732 450143620 450054927 445493076 439861644 435796978 424917255 412127560 398570863
14262C98570863j3878184j3661168j3663135j2756051j2534454j2523025j2270621
$$ 398570863 384692679 371031511 357368376 344612325 332077871 319554846 307284225
14255C07284225j2313177j1912811j1485150j1148556j1232046j0586106r752215
$$ 307284225 294971048 283058237 271573087 260424531 249192485 238606379 228854164
14248B28854164r411106r358963r308833p995725p916816p517133p272140p061113
$$ 228854164 219443058 210084095 200775262 192779537 184862721 177345588 170073448 163012335
14240A63012335o276622o841016n623544n717084n173869n645751m690260m570034
$$ 163012335 156735713 149894697 144271153 138554069 133380200 127734449 123044189 118474155
14232A18474155m703427m175730m067755m167076l924669l869096k979402l375746
$$ 118474155 113770728 109594998 105527243 101360167 97435498 93566402 90587000 87211254
14224H7211254k842585l170251l045594k710522k493822k229231k672821k511343
$$ 87211254 84368669 81198418 78152824 75442302 72948480 70719249 68046428 65535085
14216F5535085j925945k215904j978366j473112j591204k310312j341263j683618
$$ 65535085 63609140 61393236 59414870 57941758 56350554 54040242 52698979 51015361
14208E1015361j660210r83834j688995j256662j546787j071691j760250r50616
$$ 51015361 49355151 48371317 46682322 45425660 43878873 42807182 41046932 40096316
14200D0096316o80777j510432p78474j160975j118592m03128q68249j253614j056084
$$ 40096316 39415539 37905107 37126633 35965658 34847066 34443938 33575689 32322075 31265991
14191C1265991p20149q36757o01116r43850n34328q29099o37511n63650m11880
$$ 31265991 30545842 29709085 29107969 28164119 27629791 26800692 26163181 25599531 25187651
14182B5187651p82074n18670k6359j114687l35704n16364n07997m61964m25400
$$ 25187651 24405577 23886907 23860548 22745861 22410157 21893793 21385796 20923832 20498432
14173B0498432m18838l83310n16958n49198o8905p11168l70781l15170j55059
$$ 20498432 20079594 19696284 19179326 18630128 18561223 17850055 17479274 17164104 17009045
14164A7009045n00914K9771k31592k73760p45247j50845J06673m62067j78647
$$ 17009045 16508131 16537902 16306310 16032550 15287303 15136458 15243131 14781064 14602417
14155A4602417n25694O3644j98515l42634j14915m46566k83285k87026J29381
$$ 14602417 14076723 14140367 13941852 13599218 13484303 13037737 12754452 12467426 12596807
14146A2596807n93885J4116m41102k33686j09222N9757j42601L2582k43626l41252
$$ 12596807 12002922 12017038 11575936 11342250 11233028 11292785 11150184 11182766 10939140 10597888
14136A0597888q6292l60400K49695l37265L9747m59081l70625O459o6867J63457
$$ 10597888 10511596 10151196 10400891 10063626 10103373 9644292 9273667 9280126 9213259 9376716
14126I376716l32711j50304k78144J89316n2838m63347Q1602k24682M0772j80292
$$ 9376716 9044005 8893701 8615557 8804873 8752035 8288688 8370290 8145608 8186380 8006088
14116H006088J44997m33601l79190M85601j41609k88054j25963k47978P7898m11860
$$ 8006088 8151085 7717484 7338294 7823895 7682286 7394232 7268269 7020291 7098189 6686329
14106F686329J14811J2658J26056n71035N202J59347j27768j60196j35609q0781
$$ 6686329 6801140 6813798 6939854 6368819 6374021 6533368 6405600 6245404 6109795 6029014
14096F029014n0743J77656r9631l07857K29816k35458o5528l60844K83748j89967
$$ 6029014 5978271 6155927 6056296 5748439 5978255 5742797 5677269 5316425 5600173 5410206
14086E410206k60840J60373j22435P6449K48127j21672j65770p3046R3113Q399
$$ 5410206 5149366 5309739 5187304 5263753 5511880 5390208 5224438 5151392 5244505 5252904
14076E252904k14393n24054N27206k47745j79702n8178q2890l6635K03600L42556
$$ 5252904 5038511 4514457 5041663 4793918 4614216 4556038 4473148 4436513 4640113 4982669
14066D982669l33649p1130k3202K62140l40717j12806j27743J07800j304n4037
$$ 4982669 4649020 4577890 4554688 4816828 4476111 4363305 4235562 4343362 4342058 4288021
14056D288021l53879j13533K64677j96264L09722k13519j57845j88157K07739
$$ 4288021 3934142 3820609 4085286 3889022 4198744 3985225 3827380 3639223 3846962
14047C846962m74234K05294J60665k20686j40762K9106k9290L34322m62072L50522
$$ 3846962 3372728 3578022 3738687 3518001 3377239 3406345 3377055 3711377 3249305 3599827
14037C599827l28050k21564K32672P8318k17747L3465Q5248R2244j31327P8425
$$ 3599827 3271777 3050213 3282885 3361203 3143456 3176921 3262169 3354413 3223086 3301511
14027C301511m38939J47488n7033L28347o73456K28492p8205J18989R4723l19651
$$ 3301511 2862572 3010060 2953027 3281374 2607918 2836410 2758205 2877194 2971917 2652266
14017B652266N4021J12333k3298k48348O9458K3927j83440j51221J47697k1974
$$ 2652266 2706287 2818620 2795322 2546974 2616432 2640359 2456919 2305698 2453395 2431421
14007B431421K09342j29019P9336J8447k94046N2258L3060K15553K90637j66332
$$ 2431421 2640763 2511744 2591080 2609527 2315481 2367739 2400799 2616352 2906989 2740657
13997B740657k13797N85111k01229K22016L65619J60637M30751O16911Q68931
$$ 2740657 2526860 3111971 2910742 3132758 3498377 3659014 4089765 4706676 5575607
13988E575607K466470N760933J1333134R633631j2735960q089560m553089k587477
$$ 5575607 8042077 13803010 25136144 34769775 22033815 13944255 9391166 6803689
13980F803689j173681j004577o31424J84757l19070l74873j12233J74547k67561
$$ 6803689 5630008 4625431 3994007 4178764 3859694 3484821 3372588 3547135 3279574
13971C279574k15108k41649R2422n0014r8304J48945j19033n70783J22816J3180
$$ 3279574 3064466 2822817 2915239 2865225 2766921 2915866 2796833 2226050 2348866 2362046
13961B362046j70974J28295J23397j33715K80625m16556K35671p9967K65954n85126
$$ 2362046 2191072 2319367 2442764 2309049 2589674 2173118 2408789 2328822 2594776 2009650
13951B009650p5562k3575J29425J36770l00414J78582k1813m3896j02413J40121
$$ 2009650 1934088 1910513 2039938 2176708 1876294 2054876 2033063 1989167 1886754 2026875
13941B026875m6569p3003J00414j69684q5070P9405L32327l7495k92294k13821
$$ 2026875 1980306 1907303 2007717 1838033 1752963 1832368 2164695 2127200 1834906 1621085
13931A621085J96680l50037j04674L34437O6104j11743K18633o1884q2780j01123
$$ 1621085 1817765 1467728 1363054 1697491 1763595 1651852 1870485 1808601 1725821 1624698
13921A624698J15915n3648N0935n5137K32565k34340M800r1194K96292l92534
$$ 1624698 1740613 1686965 1737900 1682763 1915328 1680988 1685788 1594594 1890886 1498352
13911A498352N0461j75015K2423L44785m34293J41043n9961n490j18603p3818
$$ 1498352 1548813 1373798 1396221 1741006 1306713 1447756 1387795 1382305 1263702 1189884
13901A189884M10035l08656M79967l83006P7814J2731j90160K70150k19396l6939
$$ 1189884 1599919 1291263 1771230 1388224 1466038 1478769 1288609 1558759 1339363 1302424
13891A302424J11610j50751n241K71422j53159l55898J70825l4966K26175r5447
$$ 1302424 1414034 1263283 1258042 1529464 1376305 1020407 1191232 1156266 1382441 1286994
13881A286994M8342k58721J72909K7731r5938K00092k46493j04669K11684j15272
$$ 1286994 1335336 1076615 1249524 1277255 1181317 1381409 1134916 1030247 1241931 1126659
13871A126659P98O656J70031k61202p9054R7780K5525M1812r6726n5141L7604
$$ 1126659 1127457 1134113 1304144 1042942 963888 1061668 1087193 1129005 1032279 977138 1014742
13860A014742k51962Q61908F85214L80749J06584j88716L9531M17475l34495k3825
$$ 1014742 762780 1624688 685214 1065963 1172547 983831 1023362 1440837 1106342 1082517
13850A082517J14123j15118J24551m7480l6042k31794q3042M82023l43940K4299
$$ 1082517 1196640 1081522 1206073 1158593 1122551 890757 807715 1289738 945798 970097
13840I70097j01482M9364J80839J50294m09593L54383k30469J54470k58716J81029
$$ 970097 868615 917979 1098818 1249112 839519 1193902 963433 1117903 859187 1040216
13830A040216j22487L38123n13097L56344q1518n06654P11366l36554O5206j93939
$$ 1040216 917729 1255852 742755 1099099 1017581 510927 1222293 885739 950945 757006
13820G57006J65749L38070k78097j70070K65272l56121m7035L52028j8200j91847
$$ 757006 922755 1260825 982728 812658 1077930 721809 674774 1026802 1008602 816755
13810H16755K27930p9992n9444L2453k82318K20754L4046j25879m8123M14152
$$ 816755 1044685 964693 905249 937702 655384 876138 910184 784305 736182 1150334
13800A150334E45666L32049J15168m4489l0966L5656K7470j66105p5121L76053
$$ 1150334 545666 877715 992883 948394 917428 953084 980554 814449 739328 1115381
13790A115381l51208j90809M3568Q4793K40055j62409j40092J28013n4984K81050
$$ 1115381 764173 573364 616932 701725 941780 779371 639279 767292 712308 993358
13780I93358n2008R3343k14967l17416K16668K20222j57870N7549J85008k67502
$$ 993358 941350 1034693 819726 502310 718978 939200 781330 838879 1023887 756385
13770G56385K32227m64641L66121j68001r3523K1710J97702k15044j25030L08565
$$ 756385 988612 523971 890092 722091 628568 650278 847980 632936 507906 816471
13760H16471k31020R0531Q0705k81562K51829R5429r4143K486j00265j09410R3490
$$ 816471 585451 675982 756687 475125 726954 822383 728240 730726 630461 521051 614541
13749F14541L23230k55498j35922J65045j5341j63776j28640O58707n04917K00381
$$ 614541 937771 682273 546351 711396 696055 532279 403639 1062346 557429 757810
13739G57810J28429C03193K56029j44049N2188L8197M47245D12959J86467J44244
$$ 757810 886239 303193 559222 415173 467361 505558 952803 412959 599426 743670
13729G43670C67543K44139L68875m59719J84741C20423J23853L11001j82258K3223
$$ 743670 367543 611682 980557 520838 705579 320423 444276 755277 573019 596242
13719E96242J18461L5745o2551k29906J81932l15162J10469N3206K29591l00628
$$ 596242 714703 750448 687897 457991 639923 324761 435230 488436 718027 417399
13709D17399N3349K75038j83968j22902K27704k2044r7558l9278m4900K67464
$$ 417399 470748 745786 561818 438916 666620 644576 547018 507740 462840 730304
13699G30304l32081J51607B26046N03678l35579K33244k85127J59856J5950J69261
$$ 730304 398223 549830 226046 729724 394145 627389 342262 502118 518068 687329
13689F87329k06209A83936l384M17009k57176K6544L33740k72572P5240o245N4679
$$ 687329 481120 183936 180552 597561 340385 366929 700669 428097 503337 497092 551771
13678E51771J02096k9822k91850r949J78160J43504L0199K60533B55580M70239
$$ 551771 653867 624045 332195 322246 500406 643910 674109 934642 255580 725819
13668G25819C40517J60860R6009j71553J63678N2273B59806m951L31973k84841
$$ 725819 340517 501377 597386 425833 589511 641784 259806 254855 586828 301987
13658C01987L73533l10133K07488Q7554j15731p5848n2602A85719J17567K87789
$$ 301987 675520 365387 572875 660429 544698 468850 416248 185719 303286 591075
13648E91075l6162B74911k8021K61392L1810A54142N3488K97575K52975j77442
$$ 591075 554913 274911 246890 508282 540092 154142 207630 505205 758180 580738
13638E80738B75055m6839M49618j18325J94381k22667N8953j48336j93955J80228
$$ 580738 275055 228216 677834 559509 753890 531223 590176 441840 247885 428113
13628D28113K30060l04727o2128M31544A89594J74219j614J27150J36042k61365
$$ 428113 658173 353446 291318 722862 189594 363813 362199 489349 625391 364026
13618C64026M5025B01925K13567k635A44022O8714J57484L41326B24437L45666
$$ 364026 409051 201925 415492 412857 144022 212736 370220 711546 224437 570103
13608E70103B01325J38726f1993B87021R8194p5124g8464D37543J7094q9083J98643
$$ 570103 201325 340051 -61993 287021 385215 310091 -78464 437543 454637 365554 564197
13597E64197A67382M63592B52867M37278j73452A51925J58504A40357C8807M18223
$$ 564197 167382 630974 252867 690145 516693 151925 310429 140357 38807 457030
13587D57030q4946C7805M85290M0411k5183n2730J45124A80547K37285l099J5117
$$ 457030 372084 37805 523095 563506 538323 485593 630717 180547 417832 414733 429850
13576D29850o1004A13473L50525N5966k49397j12856E8918K80734l3493l2256
$$ 429850 368846 113473 463998 519964 270567 157711 58918 339652 306159 273903
13566B73903J07019J44951j38259K6324j64455K85254k29186L31867k92409j31711
$$ 273903 380922 525873 387614 413938 249483 534737 305551 637418 345009 213298
13556B13298J18162M27061B94287C4296O37819l08152J4571j03785D2273K76764
$$ 213298 331460 758521 294287 34296 672115 363963 378534 274749 42273 319037
13546C19037j251j44N0200j31099J35408J06901k14304m2924P6089J39930j26934
$$ 319037 317786 317642 367842 236743 372151 479052 264748 221824 297913 437843 310909
13535C10909L8043A58382J37365l11j0156L5572H0658J21208J62756F5334K29591
$$ 310909 348952 158382 295747 295436 285280 320852 80658 201866 364622 65334 294925
13524B94925j7575L06748k26883R0994J22538r1671q5244L9398G327K65137J26105
$$ 294925 277350 584098 357215 448209 570747 479076 393832 433230 7327 272464 398569
13513C98569j32840l4384r257a39559A7632M21291n6388A60219J74610A58466
$$ 398569 265729 231345 222088 -139559 17632 438923 382535 160219 334829 158466
13502F24430A21842L52094F5034R4654J19946k9261L44131G7548K89369J15154
$$ 624430 121842 473936 65034 159688 279634 250373 594504 77548 366917 482071
13492D82071j88954E9537J7666L27965a9600B85544G724J80023J67203G0071a6590
$$ 482071 293117 59537 77203 405168 -19600 285544 7724 187747 354950 70071 -16590
13480B32980O3437J881P1069A09612C4228L30418Q5009F1960J27417q2928k5914
$$ 232980 296417 298298 369367 109612 34228 364646 449655 61960 189377 106449 80535
13469H0535M16194B19485I1403N94493C38174a6715A74709p5042K99841N2947
$$ 80535 496729 219485 91403 685896 338174 -16715 174709 99667 399508 452455
13459D52455j30418j26918H7348j9445K88237j41037o4088J04885k8237K27352
$$ 452455 322037 195119 87348 67903 356140 215103 151015 255900 227663 455015
13449D55015O0739k02261o5562n1821E6218K03505K84366E7698R5728K03542j42615
$$ 455015 515754 313493 247931 196110 56218 259723 544089 57698 153426 356968 214353
13438B14353r4469L57993A4539J57457e0025A28207J45776n0669G47M75664j64451
$$ 214353 119884 477877 14539 171996 -50025 128207 273983 223314 747 476411 311960
13427C11960C2088J59996K33006D0119L38396j78080K23425A3563J36235G0936
$$ 311960 32088 192084 425090 40119 378515 200435 423860 13563 149798 70936
13416B56043j02536J7488J27722A15111L67953A86957p8366J27897E3343j3544
$$ 256043 153507 170995 298717 115111 483064 186957 108591 236488 53343 39799
13406C9799K80389A6088h9766E7124M49797e7800G7079J98215a21327F81788k74887
$$ 39799 320188 16088 -89766 57124 506921 -57800 77079 275294 -121327 681788 406901
13395D06901A28293c4735D12901N1015k03308A15640k63l634L13710j11878H6723
$$ 406901 128293 -34735 412901 463916 260608 115640 115377 111743 425453 313575 86723
13383A11282J41007f4384A29574B5363K68976j32867E7203N1506K47796Q2081
$$ 111282 252289 -64384 129574 25363 294339 161472 57203 108709 356505 438586
13373D38586k04118K16805A87822R715J44326m0177r2420k5323K69274J5217A44587
$$ 438586 234468 451273 187822 197537 341863 301686 209266 183943 453217 468434 144587
13361c281A61565L12706j43470j63982K84093A80784L5877A2043K12773g6800
$$ -3281 161565 474271 330801 166819 450912 180784 216661 12043 224816 -76800
13350A79012q5802j0007O5016J85821B867P11314l29286j68554a8883C26053l420
$$ 179012 93210 83203 148219 334040 2867 714181 384895 216341 -18883 326053 322633
13339C22633A09057L38484j07040A31198L07558j56413m1319E817L52927J6344
$$ 322633 109057 447541 340501 131198 438756 282343 241024 5817 358744 375088
13329C75088J05309l1505B17295o8084a95316D17890H2720M5960Q3010o9404n378
$$ 375088 480397 448892 217295 149211 -195316 417890 82720 128680 211690 142286 136908
13318A36908K63008a38722B24768H9477m2363E678J67280h0329A53626c52476
$$ 136908 399916 -138722 224768 89477 47114 5678 172958 -80329 153626 -352476
13307A65738J60150j56630Q1586j5788P050I8481L89196e1719A24090J48363p9178
$$ 165738 325888 169258 250844 235056 242106 98481 487677 -51719 124090 272453 193275
13296A93275a7125A45185o0220K38134C7169K80134o2306C5811J32969J57204
$$ 193275 -17125 145185 84965 323099 37169 317303 254997 35811 168780 325984
13286C25984a41956C49865o9171a14111C15715d59486D10145A17798N4381i384
$$ 325984 -141956 349865 280694 -114111 315715 -459486 410145 117798 172179 -9384
13275i1050e791A85784a03157B31080K65638k36068r1035b30660A79229H0006
$$ -91050 -5791 185784 -103157 231080 496718 260650 169615 -230660 179229 80006
13264A11314K4467J08410G3869l1180b1280A03010E0616J43270k4396N1276K5202
$$ 111314 135781 244191 73869 42689 -21280 103010 50616 193886 169490 220766 245968
13253B45968O5453e3609A68267J7701j3570P8667h6574G14655d3085N884A66797
$$ 245968 311421 -53609 168267 185968 172398 251065 -86574 714655 -43085 -37201 166797
13241a5847C15650g6794C5199L03300J5946j12139B5875K93735A19679e4978A14517
$$ -15847 315650 -76794 35199 338499 354445 242306 25875 319610 119679 -54978 114517
13229B60657b94691P9685E3854P7007J83159n8627f36A84374J29071F9251P5810
$$ 260657 -294691 -215006 53854 130861 314020 255393 -636 184374 313445 69251 145061
13218A45061N8739A1095M651b75626B34950i8640d0954A38776b62238d4437k1085
$$ 145061 203800 11095 15746 -275626 234950 -98640 -40954 138776 -262238 -44437 -65522
13207f5522d061F3235J00304B3057g6074J3431B40353j8649N1694q6116c1651
$$ -65522 -4061 63235 163539 23057 -76074 -62643 240353 221704 273398 187282 -31651
13195B75178l7342j5329J25463j38297a82043Q1548M8460A0254J86116R7654J25386
$$ 275178 237836 222507 347970 209673 -182043 -100495 -52035 10254 196370 294024 419410
13184D19410A68066M4793b29077A80390D2597J0078M8639b55681A89916n6683
$$ 419410 168066 212859 -229077 180390 42597 52675 101314 -255681 189916 133233
13174A33233h5739m4687n0359C96115a36478A59381J17757b37A95461g042r6467
$$ 133233 -85739 -130426 -180785 396115 -136478 159381 277138 -237 195461 -7042 -103509
13163a03509B87736A38339o5996g1069F184J53440K66916I1334L8052J89275f9947
$$ -103509 287736 138339 72343 -71069 6184 159624 426540 91334 129386 318661 -69947
13151A64514l5732J55425j06921B553M32432b86057A43793b5691A37383h3251
$$ 164514 128782 284207 177286 2553 434985 -286057 143793 -25691 137383 -83251
13140A06330a24504k1734C47558A11960a69484B42477O6559a63242A64295a64473
$$ 106330 -124504 -146238 347558 111960 -169484 242477 309036 -163242 164295 -164473
13129b94943A55117F3055a24932a9454A98414g3506I6971K33726b72800f5010
$$ -294943 155117 63055 -124932 -19454 198414 -73506 96971 330697 -272800 -65010
13118C60357C4441K19923a14393c505E2427L47827i3303A19134a01068j18348
$$ 360357 34441 254364 -114393 -3505 52427 400254 -93303 119134 -101068 -219416
13108b19416A22500N4190P8499b9576C5337J34286a59764E9866M00470I7063f1375
$$ -219416 122500 176690 255189 -29576 35337 169623 -159764 59866 460336 97063 -61375
13096a5071C14937H8139C9817A8922J8987c9517A14115J74992c9328D10427c68239
$$ -15071 314937 88139 39817 18922 37909 -39517 114115 289107 -39328 410427 -368239
13084A8193J15899P0520n8646o7390h1069I8634M1913Q2036J38422j51265a2088
$$ 18193 134092 204612 145966 78576 -81069 98634 140547 222583 361005 209740 -12088
13072A06088P7524J31173a0794A77391b65163L8322B51394j0909B798J05464k3875
$$ 106088 183612 314785 -10794 177391 -265163 -226841 251394 240485 2798 108262 84387
13061H4387J68619L5386L0223C2741L06082a7369k1175C22142f2033C25121f7204
$$ 84387 253006 288392 318615 32741 338823 -17369 -38544 322142 -62033 325121 -67204
13049C8821a35641A74502O6832p6254F1953b152l3440G482O6854j696K73539a9873
$$ 38821 -135641 174502 241334 165080 61953 -2152 -35592 7482 74336 72640 346179 -19873
13036H3823a16701D22326j88369c9787k4140C47141A62950a63212A87603n3243
$$ 83823 -116701 422326 233957 -39787 -63927 347141 162950 -163212 187603 134360
13026A34360K2556a10405A95279R4420a47085A78284k4874J70261A07591g6461
$$ 134360 156916 -110405 195279 289699 -147085 178284 153410 323671 107591 -76461
13015B35045h5412B31309a65324O1760A03260i4100C73950A66004o1683b9113
$$ 235045 -85412 231309 -165324 -103564 103260 -94100 373950 166004 104321 -29113
13004d8885B37449m2921L86353d4680C0256a36188M2108c9791A72269b0580h943
$$ -48885 237449 194528 580881 -44680 30256 -136188 -94080 -39791 172269 -20580 -8943
12992a50185B5416J9968K46792a38522A49074b01767a4705A41133n2590B7463
$$ -150185 25416 45384 292176 -138522 149074 -201767 -14705 141133 88543 27463
12981a24459k36282B86282H4358A1018R1279b29223H6458J27962O8012G1869b80144
$$ -124459 -360741 286282 84358 11018 102297 -229223 86458 214420 282432 71869 -280144
12969B33242I3110a50351b9798J4090p012A3390L16375e01963A27493K9029c9460
$$ 233242 93110 -150351 -29798 -15708 -22720 13390 329765 -501963 127493 156522 -39460
12957a80072B14041r7258C9795c1526k8458b3279j33393A20180J61178g5074B10277
$$ -180072 214041 116783 39795 -31526 -59984 -23279 -156672 120180 281358 -75074 210277
12945A99393P5875j10422k5246o5152M1170K61239a10486d5278I6838j8672c08937
$$ 199393 275268 164846 139600 74448 115618 376857 -110486 -45278 96838 78166 -308937
12933A26444m4002d59045a75677D8093J23924b7342k17859B72778A34411a12073
$$ 126444 82442 -459045 -175677 48093 172017 -27342 -245201 272778 134411 -112073
12922C08936n2953H1505l7303J2308p005a67046A88235a37536A91447n9325E854
$$ 308936 255983 81505 44202 56510 49505 -167046 188235 -137536 191447 132122 5854
12910B82860L177H0594J24414A7763J23326a55311E9605C67Q9868b21371j00526
$$ 282860 286037 80594 205008 17763 141089 -155311 59605 367 90235 -221371 -321897
12899c21897h3659D10830A2974a43331D65841A91281b95017e9304B87912j32509
$$ -321897 -83659 410830 12974 -143331 465841 191281 -295017 -59304 287912 155403
12889A55403K338J42610j36219g8422j29717C09153c575k45498h9059B6733b09676
$$ 155403 157741 300351 164132 -78422 -208139 309153 -3575 -249073 -89059 26733 -209676
12877A49452F1319M8209J0957n0163a85237C21914a19234B43112d37295R3677
$$ 149452 61319 109528 120485 70322 -185237 321914 -119234 243112 -437295 -343618
12867c43618I1588M0143J37772A12715J64881b97771i9620j68055B01902b48147
$$ -343618 91588 131731 269503 112715 277596 -297771 -99620 -267675 201902 -248147
12856C19108A34854a29172L3145L421k6237b3811A80337l308L879h5073n4755
$$ 319108 134854 -129172 -96027 -92606 -118843 -23811 180337 177029 180908 -85073 -139828
12845a39828l1381G8764A8121N39522B38622E8692J88534e9443A88566j7553l1514
$$ -139828 -171209 78764 18121 557643 238622 58692 247226 -59443 188566 171013 139499
12834A39499J6661r521b4957A87625O5384n9089F3332J30526q9268J44413f297
$$ 139499 156160 146639 -24957 187625 253009 193920 63332 193858 104590 249003 -6297
12822H1262K8891e8059A27848A6372L17404n2569a99637E08942k53525a29976
$$ 81262 110153 -58059 127848 16372 333776 281207 -199637 508942 255417 -129976
12811b22096i5574A8987J89107g047B04247b00271B9527K671L43311I6312H099
$$ -222096 -95574 18987 208094 -7047 204247 -200271 29527 32198 375509 96312 8099
12799e355r5895L0183b3349k2699A55148a72964C05401d59599A01810a46201o6624
$$ -5355 -101250 -71067 -23349 -46048 155148 -172964 305401 -459599 101810 -146201 -212825
12788b12825m8038a0744j12889k90977E7329b49312b4937A41140k1502I578J58170
$$ -212825 -260863 -10744 -123633 -414610 57329 -249312 -24937 141140 119638 9578 167748
12777A67748a74586B65421j6502f1462G8242c2705C6632a97193B9161a31122B58818
$$ 167748 -174586 265421 248919 -61462 78242 -32705 36632 -197193 29161 -131122 258818
12765G4622a40917e0748F2805L8390a58722b0207j65681C0673c5189j18275E6532
$$ 74622 -140917 -50748 62805 101195 -158722 -20207 -185888 30673 -35189 -153464 56532
12753a88693A38484E5011N037K1716d2135A0244L10571o3275c3657H6193K12334
$$ -188693 138484 55011 60048 81764 -42135 10244 320815 257540 -33657 86193 298527
12742B98527J53926j98498F5947g7403A98043j8512J51220j24197b28368A48187
$$ 298527 452453 253955 65947 -77403 198043 179531 330751 206554 -228368 148187
12731a07325B71208C3393h7442A62296g2498A98084J68809b09366O316A16156
$$ -107325 271208 33393 -87442 162296 -72498 198084 366893 -209366 -203050 116156
12720A55301P6396J85750A51675e0073J8509A48196a92117A51468l2739J23971
$$ 155301 231697 417447 151675 -50073 -31564 148196 -192117 151468 118729 242700
12710B42700A02919C4856a64806E7980F378L47857A46546J80188d7627D3427M3823
$$ 242700 102919 34856 -164806 57980 6378 354235 146546 326734 -47627 43427 87250
12699H7250K91309e2346A49435e3183a1450B96294a83611J3271A25349A6863R1928
$$ 87250 378559 -52346 149435 -53183 -11450 296294 -183611 -170340 125349 16863 108791
12688A08791J24366lB5325J55106D5115J92117r7873n3640C3713N9060k943J46049
$$ 108791 233157 233154 25325 180431 45115 237232 139359 85719 33713 92773 89830 235879
12676B35879r2921C7476E873M7770J35498F7336a08408A4922K00422l1615b09829
$$ 235879 142958 37476 5873 53643 189141 67336 -108408 14922 215344 183729 -209829
12664b00699A57J289K99255J45600B18197c30073A10367c7369n0541j7945B18170
$$ -200699 157 1446 300701 446301 218197 -330073 110367 -37369 -87910 -105855 218170
12652D5759f1000C34229j07126E0458i6010d5416C26684a3821B84960g686C3823
$$ 45759 -61000 334229 227103 50458 -96010 -45416 326684 -13821 284960 -7686 33823
12640i1900l5877L9296C14898j27350c28011b7670j0717C22322r4466A08032M12766
$$ -91900 -127777 -88481 314898 187548 -328011 -27670 -38387 322322 227856 108032 520798
12629E20798B19651R5687O0333h1067A70600e8295j9617n6811A40161m3649b1903
$$ 520798 219651 315338 375671 -81067 170600 -58295 -77912 -134723 140161 96512 -21903
12617b56694f0997B72191j00460b4804j62237D78736C1740o495J40634O8074a43551
$$ -256694 -60997 272191 171731 -24804 -187041 478736 31740 25245 165879 233953 -143551
12605E2106q907a14133A04871K7104D1208P8188J53059j04615n922f5283p2315
$$ 52106 43199 -114133 104871 131975 41208 119396 272455 167840 161918 -65283 -137598
12594a37598A32555J18543B4659K4511L16156A9836Q6645J64641A31505g1483
$$ -137598 132555 251098 24659 49170 365326 19836 106481 271122 131505 -71483
12583a56698G5117N2608f861A28835a91628A11826a9093C17964a34890b8535N848
$$ -156698 75117 127725 -6861 128835 -191628 111826 -19093 317964 -134890 -28535 -22687
12572b2687I9918C9052e8019r9075a1872A90731C9820J02824Q7794A8360P2366
$$ -22687 99918 39052 -58019 -157094 -11872 190731 39820 142644 230438 18360 90726
12561I0726e0107A02522J21423n1488a01665H3412a08060A31312C821K26082d22096
$$ 90726 -50107 102522 223945 172457 -101665 83412 -108060 131312 3821 229903 -422096
12549B33944A9909P3608J84371b87265B644b57491a02265M7197A59321A1963L5781
$$ 233944 19909 93517 277888 -287265 2644 -257491 -102265 -55068 159321 11963 47744
12538D7744J27191E5295L55287A47891l1314a62271J6260I133J1276b0105G8357
$$ 47744 174935 55295 410582 147891 116577 -162271 -146011 9133 20409 -20105 78357
12526A00769J38177b5883C01475g0409C69914e220n3456J165F5156J83365b0741
$$ 100769 238946 -25883 301475 -70409 369914 -5220 -58676 -57511 65156 248521 -20741
12514a98952E1326N6949m8424l224J02352b5558j07422C2391M2302a0598A33178
$$ -198952 51326 108275 59851 56627 158979 -25558 -132980 32391 74693 -10598 133178
12502B85476b11634C8097K50971b02423B00845f4190m4211A28882f2094B40241
$$ 285476 -211634 38097 289068 -202423 200845 -64190 -108401 128882 -62094 240241
12491B32817a61593G2495L4583D9276a45856A6800K86883a08891B93984e70D2977
$$ 232817 -161593 72495 107078 49276 -145856 16800 303683 -108891 293984 -570 42977
12479a87286b212A54838Q0635A11860n5429A8387J66544D1600J2435b31109F1692
$$ -187286 -2212 154838 235473 111860 56431 18387 184931 41600 54035 -231109 61692
12467I1237b15482o80C66205e7780A32041a72228M6972o5404Q8005L1852J9341
$$ 91237 -215482 -216162 366205 -57780 132041 -172228 -125256 -190660 -102655 -70803 -51462
12456e1462h679n5522p2894L7568J6250E8480a91121e7963A00946a48125J8673
$$ -51462 -8679 -64201 -137095 -99527 -83277 58480 -191121 -57963 100946 -148125 -129452
12445a29452A03315p915e0090j0359j57953a2048A44581a25170m8245A6163a0194
$$ -129452 103315 95400 -50090 -60449 -218402 -12048 144581 -125170 -173415 16163 -10194
12433A54341l2259A1857b03038A1548a30888j5286B49463A9968a02548j39589
$$ 154341 122082 11857 -203038 11548 -130888 -146174 249463 19968 -102548 -242137
12423b42137g8905A07492a5525j4827k68513f0307F4424b1966B12793j05402b8871
$$ -242137 -78905 107492 -15525 -30352 -298865 -60307 64424 -21966 212793 107391 -28871
12411A31189J00500B4716N1434C5344g5499A5160a0890j1503F5885a95801B41924
$$ 131189 231689 24716 76150 35344 -75499 15160 -10890 -22393 65885 -195801 241924
12399A05827j7515a44861o3411O95B4529a19113B13449k7811b48862B6941a0625
$$ 105827 88312 -144861 -208272 -207577 24529 -119113 213449 185638 -248862 26941 -10625
12387D0404K55099i8484A36583a9618o421A52524a28313k8057k69K0448j4192
$$ 40404 295503 -98484 136583 -19618 -26039 152524 -128313 -156370 -156639 -136191 -150383
12376a50383D0339Q3773a50813K7453L9017j84308a4394G3056k6869J33790b29836
$$ -150383 40339 124112 -150813 -123360 -84343 -268651 -14394 73056 46187 179977 -229836
12364B2359J74228r5041a7515A72750h0899A52613J25362H8788M0122a55215l1997
$$ 22359 196587 101546 -17515 172750 -80899 152613 277975 88788 128910 -155215 -187212
12353a87212I76K0541K12596C4983i7968J6919A1064b11929D87397a74406B73079
$$ -187212 976 21517 234113 34983 -97968 -81049 11064 -211929 487397 -174406 273079
12341c414A14459g7421E2888b08281i7479A7111J31221a59823I279g3058r5242
$$ -3414 114459 -77421 52888 -208281 -97479 17111 148332 -159823 9279 -73058 -168300
12330a68300H734a17187G1737K699g1858j04921A32133b72516A62698b26046D0919
$$ -168300 8734 -117187 71737 74436 -71858 -176779 132133 -272516 162698 -226046 40919
12318b89410B79590p91j9971a2126j77050A39493A3013K70944j6961A06029f259
$$ -289410 279590 278799 258828 -12126 -189176 139493 13013 283957 266996 106029 -6259
12306D06437A00937C1554J35040F4150a44301O812E8060R9724c83567A8245i2173
$$ 406437 100937 31554 166594 64150 -144301 -137489 58060 157784 -383567 18245 -92173
12294A7056J22235o8448j9333F238P5407a81151C388K61929b61203O2768j63600
$$ 17056 139291 70843 51510 6238 81645 -181151 3388 265317 -261203 -198435 -362035
12283c62035a0713A23885N8011C6204e3992A09233A0872J89254a73911A7943J82756
$$ -362035 -10713 123885 181896 36204 -53992 109233 10872 200126 -173911 17943 200699
12272B00699E5560J22413A5726M4855d04221C14207h5596A10969i8085A83424
$$ 200699 55560 177973 15726 60581 -404221 314207 -85596 110969 -98085 183424
12261B29094k9081K5140I2455J43160a35354E4183j0032J17984C9622f9988C65103
$$ 229094 200013 225153 92455 235615 -135354 54183 44151 162135 39622 -69988 365103
12249A85577b09916O6175G9600a02858L3032B3230o395N9447O7437D3802a384
$$ 185577 -209916 -143741 79600 -102858 -69826 23230 16835 76282 143719 43802 -1384
12237c5537C17176q2295j01342Q4705a62403A19182K8413K48118C1864a51933
$$ -35537 317176 234881 133539 218244 -162403 119182 147595 395713 31864 -151933
12226C72367A2639J68817q3987a32659C7683J8816R1244J75931A15515f8154A55713
$$ 372367 12639 181456 97469 -132659 37683 56499 147743 323674 115515 -68154 155713
12214c0897B2040O2523J22382C0799J46186a67433A38702n7982K99932I4892a447
$$ -30897 22040 84563 206945 30799 176985 -167433 138702 80720 380652 94892 -1447
12202C2349N26827A47935i7439A22368A4510d6456C47620j60863a66979A31247
$$ 32349 559176 147935 -97439 122368 14510 -46456 347620 186757 -166979 131247
12191A76695J75075c00620B16712c6647A96690a1691A1471Q9646k3762f1643I7686
$$ 176695 351770 -300620 216712 -36647 196690 -11691 11471 101117 77355 -61643 97686
12179e3600B4696b8017H6639c5214j6032B67408a43970B93748C306K41411Q4276
$$ -53600 24696 -28017 86639 -35214 -51246 267408 -143970 293748 3306 244717 328993
12168C28993I5177b88270D8821J13622p2171P8571F8211i3235A41356m8290a70000
$$ 328993 95177 -288270 48821 162443 90272 168843 68211 -93235 141356 93066 -170000
12156C35131P4292F4553a36612J1907B24316r6213N1924H2251K104a06358o5906
$$ 335131 409423 64553 -136612 -124705 224316 128103 180027 82251 84355 -106358 -172264
12145a72264D52700k5824a27858B64412Q9567a30199d1225A27865a39310a6064
$$ -172264 452700 426876 -127858 264412 353979 -130199 -41225 127865 -139310 -16064
12134B49651n6019k754b73130B94668C1924C085K31068f0066B22249K34304a76036
$$ 249651 193632 190878 -273130 294668 31924 3085 234153 -60066 222249 456553 -176036
12122F7969f141p614C76387A49487a95159h1737G7310f1162q4333B09540b91716
$$ 67969 -6141 -13755 376387 149487 -195159 -81737 77310 -61162 -145495 209540 -291716
12110A09604D6941J0782c2827n3104D6466a86653I1973b61454h6873A6100a98321
$$ 109604 46941 57723 -32827 -85931 46466 -186653 91973 -261454 -86873 16100 -198321
12098A21969C4636K25481a89977B16841I4132a26176A731K7135J05254E7796O6576
$$ 121969 34636 260117 -189977 216841 94132 -126176 1731 28866 134120 57796 124372
12087A24372D2337J51732j601a52585A69295J04568j00300j516M05509N68344
$$ 124372 42337 194069 192468 -152585 169295 273863 173563 172047 577556 1145900
12077A145900O69125G54592k31292A57962F6924O2293e6966J0435A2927a11824
$$ 1145900 1815025 754592 523300 157962 66924 129217 -56966 -46531 12927 -111824
12066B19457E2936K0223a25274B11364G0920p13L56585A24152a23137M584b8105
$$ 219457 52936 73159 -125274 211364 70920 70207 426792 124152 -123137 -118553 -28105
12054H2910l0950b8843C18591F7954C0257K29447f2200J9456l83291c9770F487
$$ 82910 51960 -28843 318591 67954 30257 259704 -62200 -42744 -426035 -39770 6487
12042H9717b50302c311H132J55147d29294h2608F6377b78548h6958C6676M12007
$$ 89717 -250302 -3311 8132 163279 -429294 -82608 66377 -278548 -86958 36676 448683
12031D48683i1829L8605l17728J59639H4673a7776j06446e6749b8082C31299o4638
$$ 448683 -91829 -53224 -370952 -211313 84673 -17776 -124222 -56749 -28082 331299 266661
12020B66661d30219J54343k0174B25790p1562i622j74653A61210m478h1037J5265
$$ 266661 -430219 -275876 -296050 225790 154228 -9622 -184275 161210 156732 -81037 -65772
12009f5772G9221O7246a85589A85372J40998e6302B45754c5428E3583a74236O6809
$$ -65772 79221 146467 -185589 185372 326370 -56302 245754 -35428 53583 -174236 -107427
11998a07427I7784j7946g5044J4726k4176B42226C146e60750N712B02452D5889
$$ -107427 97784 79838 -75044 -60318 -84494 242226 3146 -560750 -555038 202452 45889
11986a57143K968b8371j28493L3120j94790b3582A6539c09860B83777G3651K2927
$$ -157143 -154175 -28371 -156864 -123744 -318534 -23582 16539 -309860 283777 73651 96578
11975I6578i5656A82825a22050A72423a72221P5615j35096A7901c90993h1506
$$ 96578 -95656 182825 -122050 172423 -172221 -96606 -231702 17901 -390993 -81506
11964f1457k96162B91930A17832d9989q333A7010j304b49944Q3324H3749a26258
$$ -61457 -357619 291930 117832 -49989 -58322 17010 15706 -249944 -166620 83749 -126258
11952B62442E7442a88282o4708E5809c19907I1083Q5515d13611A42599f9510j12394
$$ 262442 57442 -188282 -252990 55809 -319907 91083 176598 -413611 142599 -69510 -181904
11941a81904E4489g7174b0066n0511q1269a5561B69322c31690G152d0714j06095
$$ -181904 54489 -77174 -20066 -70577 -151846 -15561 269322 -331690 7152 -40714 -146809
11930a46809k27645E20087h2538k57773B4010a6954l9911C20856b06828G8852
$$ -146809 -374454 520087 -82538 -340311 24010 -16954 -56865 320856 -206828 78852
11919A57676a35711l05087A08669c7C9579E703g2741g599C02742D8102b31276
$$ 157676 -135711 -440798 108669 -37 39579 5703 -72741 -7599 302742 48102 -231276
11907c30790B57626a23361B1286b53350I3079a42292B27038r1383B2630Q7227
$$ -330790 257626 -123361 21286 -253350 93079 -142292 227038 135655 22630 109857
11897A09857i8082A84773G9334a5131D0719e754k30138A15683i1677B7507b44809
$$ 109857 -98082 184773 79334 -15131 40719 -5754 -235892 115683 -91677 27507 -244809
11885A167a17285M2723j60283i2017B52314d10j91502Q9271r2859H6136a52034
$$ 1167 -117285 -74562 -234845 -92017 252314 -410 -191912 -102641 -195500 86136 -152034
11873a5825A73311b31093n688A52927d9928A85231C615d5750A70087a549m2126
$$ -15825 173311 -231093 -236781 152927 -49928 185231 3615 -45750 170087 -1549 -43675
11862d3675o2568A1488J90117D3114c16986J41751A60337a73124A20410f8797
$$ -43675 -106243 11488 201605 43114 -316986 -175235 160337 -173124 120410 -68797
11851F9790a78510k9274A60676J7142f5299A4513J01200b64774K8238f5567k08370
$$ 69790 -178510 -207784 160676 177818 -65299 14513 115713 -264774 -236536 -65567 -273937
11840b73937H6575a63504r8391Q0430O0659M6940I8544b4306c409l4406k2041
$$ -273937 86575 -163504 -261895 -181465 -120806 -73866 98544 -24306 -3409 -37815 -59856
11829e9856l22270h8187A49373L0926c2236k42709G4455b65961A035Q5834k6574
$$ -59856 -382126 -88187 149373 180299 -32236 -274945 74455 -265961 1035 86869 60295
11818F0295i8390A84146a72106A48240a80026g875g54q588C7682K1464j92K11925
$$ 60295 -98390 184146 -172106 148240 -180026 -7875 -754 -9342 37682 59146 58954 270879
11806B70879G3901j009A6481d5651r5255p7884B97833f8188k38098j7214a25360
$$ 270879 73901 72892 16481 -45651 -140906 -218790 297833 -68188 -306286 -323500 -125360
11794a06790B20542b98531A46398c8505B18594B6933i3281B91873A08700a715
$$ -106790 220542 -298531 146398 -38505 218594 26933 -93281 291873 108700 -1715
11783e5899j03788M2941B78936a82850e618A80530E9338j3750f6802B64660a21718
$$ -55899 -159687 -116746 278936 -182850 -5618 180530 59338 45588 -66802 264660 -121718
11771F5627b56334c7374B07362F9063d661B65594a62668c5583k19799D9178d9698
$$ 65627 -256334 -37374 207362 69063 -4661 265594 -162668 -35583 -255382 49178 -49698
11759i9553E5258b32793A82746E3845Q3551O3987E88i5348j11237A51951j1736
$$ -99553 55258 -232793 182746 53845 137396 201383 588 -95348 -206585 151951 140215
11748A40215C1802K11574g5088j1183J6418B5482i5038A97915H3571a95857C9481
$$ 140215 31802 243376 -75088 -86271 -69853 25482 -95038 197915 83571 -195857 39481
11736b09126e5203A60444j1073a62228G5951B9147e8780A0234c69521a29800D0817
$$ -209126 -55203 160444 149371 -162228 75951 29147 -58780 10234 -369521 -129800 40817
11724c28907Q9447k08235a00813h655l1326J2150B67198a1863A4173K09775i8238
$$ -328907 -239460 -447695 -100813 -8655 -39981 -27831 267198 -11863 14173 223948 -98238
11712C6944R6236d2556k46531C49233B2980O1139a69520G8537a78081h3132q7727
$$ 36944 133180 -42556 -289087 349233 22980 84119 -169520 78537 -178081 -83132 -170859
11701a70859n093O6945k34238C66906j69525n4750o8807b49632D55063j65175
$$ -170859 -175952 -109007 -343245 366906 197381 142631 73824 -249632 455063 289888
11691B89888H5494j8594B8293a6665B69723A10057a2334A47572A4045c57p914
$$ 289888 85494 66900 28293 -16665 269723 110057 -12334 147572 14045 -357 -8271
11680h271A925J97866p485B3245a78883A73180H0667a5463F9901N40283G1522
$$ -8271 1925 199791 192306 23245 -178883 173180 80667 -15463 69901 610184 71522
11668f5042J6972P036C7240J99424B5577K57060F5296r470L48125b22166O7761
$$ -65042 -48070 -41034 37240 236664 25577 282637 65296 55826 403951 -222166 -154405
11657a54405F1633a31010p0439e9128b3947A748J76733a79518A27669g7415j28200
$$ -154405 61633 -131010 -201449 -59128 -23947 1748 178481 -179518 127669 -77415 -205615
11646b05615p2244A70899h3254m5616n1414D7921c0673A06662f9435a8122k13626
$$ -205615 -277859 170899 -83254 -128870 -180284 47921 -30673 106662 -69435 -18122 -231748
11635b31748o2022O4397g2776K1717p9631m4183D612L44232j59665E4636a57077
$$ -231748 -293770 -229373 -72776 -51059 -130690 -174873 4612 348844 189179 54636 -157077
11623B14353b2283B35725b47212A54437A3557b55527b2240D5768g2201J5909A27211
$$ 214353 -22283 235725 -247212 154437 13557 -255527 -22240 45768 -72201 -56292 127211
11611H823b80495E861b00626N9216a4242m6540B7808b72813g1417A85309p3226
$$ 8823 -280495 5861 -200626 -141410 -14242 -60782 27808 -272813 -71417 185309 112083
11600A12083A2994e1811l9470j1851a4363H4113j0234a49982A68423G396b75586
$$ 112083 12994 -51811 -91281 -103132 -14363 84113 73879 -149982 168423 7396 -275586
11588b56887b3066B09513e614k04348C28759A31718J3205A2084K88435b47065
$$ -256887 -23066 209513 -5614 -209962 328759 131718 144923 12084 300519 -247065
11577i621j14703B72361a2342j08208E4397I875K42170q3914H2896k5954K85034
$$ -9621 -124324 272361 -12342 -120550 54397 9875 252045 168131 82896 56942 341976
11566C41976o2706C2085K11593b35105K2300a3637A26352K5855a3525A38204a31801
$$ 341976 279270 32085 243678 -235105 -212805 -13637 126352 152207 -13525 138204 -131801
11554H7951a4023B66456a33531A46829b63664C21575b6160D16190B06087a13964
$$ 87951 -14023 266456 -133531 146829 -263664 321575 -26160 416190 206087 -113964
11543G6849J87255f6367F4836J3351C4977N1678R763M2417j7815c3772B09270
$$ 76849 264104 -66367 64836 78187 34977 86655 96418 138835 121020 -33772 209270
11531f9978H4770a74679B52070G7212i2257k4371B27652A1495K92517i848B47334
$$ -69978 84770 -174679 252070 77212 -92257 -116628 227652 11495 304012 -9848 247334
11519E0880L3062b98310M9132C03643b0657j87654A8824M3468Q7272a40927B21613
$$ 50880 83942 -298310 -249178 303643 -20657 -208311 18824 62292 149564 -140927 221613
11507b02667B15862b05759D8719i2632j87991B63624F1549b78759F560J53489
$$ -202667 215862 -205759 48719 -92632 -280623 263624 61549 -278759 6560 160049
11497A60049J33592H3987a1861A46317n3545L15516C9819L1723B6230b47861I8092
$$ 160049 293641 83987 -11861 146317 92772 408288 39819 71542 26230 -247861 98092
11485B17342n29K0797a11169G6363J47848N4249j34125b6971B0734e0647B22880
$$ 217342 216813 237610 -111169 76363 224211 278460 144335 -26971 20734 -50647 222880
11473g9952m1865A17374a93256E3615K97837E2746b02009M1738d1141n8401A56925
$$ -79952 -121817 117374 -193256 53615 351452 52746 -202009 -160271 -41141 -99542 156925
11461c9302k7951b7742B3052b45725D25010A58463K05509F5194O4940a47180e6113
$$ -39302 -67253 -27742 23052 -245725 425010 158463 363972 65194 130134 -147180 -56113
11449F9006K7454J0877a11017A43965m6344b29254a1703C03129A40580b332B37303
$$ 69006 96460 107337 -111017 143965 97621 -229254 -11703 303129 140580 -2332 237303
11437g6442A64242o0520E1056b18173f9388D0028L7283d22746J43380Q8450M7740
$$ -76442 164242 103722 51056 -218173 -69388 40028 77311 -422746 -279366 -190916 -143176
11426a43176A45578a34822A39895D740a0469n9402B0555a06790A30845J04444
$$ -143176 145578 -134822 139895 4740 -10469 -69871 20555 -106790 130845 235289
11416B35289g63k52933C69795l9208a05945j43918a07935A8944G0a70244j35103
$$ 235289 -763 -253696 369795 330587 -105945 -249863 -107935 18944 70 -170244 -305347
11405c05347a14044N2088A82091A4330a73503f8790k5970A39185a27190C3811
$$ -305347 -114044 -61956 182091 14330 -173503 -68790 -94760 139185 -127190 33811
11394a18355A28404e8750n1270I6515C4636c0718A36788N1298c84580E0344P826
$$ -118355 128404 -58750 -110020 96515 34636 -30718 136788 188086 -384580 50344 58170
11383E8170c3643B42932J88E2300J35843R876B8836J42013E3442k6529a32432
$$ 58170 -33643 242932 243120 52300 188143 198019 28836 170849 53442 26913 -132432
11371g2017I4392K50704A20773a42777O4162r9668B80667d31387A5359a16041
$$ -72017 94392 345096 120773 -142777 -78615 -178283 280667 -431387 15359 -116041
11360E7125P2884B3352N2578c5886k08996A21926C5781b23773A97390n2320K06098
$$ 57125 130009 23352 75930 -35886 -244882 121926 35781 -223773 197390 145070 351168
11349C51168b05129A77036J0665A6571D261L96M05767E454e8696p6769e92p0737
$$ 351168 -205129 177036 187701 16571 4261 4657 410424 5454 -58696 -135465 -592 -71329
11337g1329I2570B4558J189M8779a20439B87894a89205A04553Q7076D5132f1309
$$ -71329 92570 24558 25747 74526 -120439 287894 -189205 104553 191629 45132 -61309
11325F4647n322a23770B13209m4432b51058d2252k02191B97701c97093B66482
$$ 64647 59325 -123770 213209 168777 -251058 -42252 -244443 297701 -397093 266482
11314B19662a07070B2054a10107A15946m1000J28760J70823A09828d0013m7465
$$ 219662 -107070 22054 -110107 115946 74946 203706 374529 109828 -40013 -87478
11304h7478A28058b45751i3562l38553A41190a99820k64981b1995q279a741E2486
$$ -87478 128058 -245751 -93562 -432115 141190 -199820 -464801 -21995 -30274 -1741 52486
11292A46897a35519L1979H7157c32967a03747H1632K1514J01648E6558a51818
$$ 146897 -135519 -103540 87157 -332967 -103747 81632 103146 204794 56558 -151818
11281b21060D8183c30356L6886A43444i6882k95492R5372a3310A69126c18688
$$ -221060 48183 -330356 -293470 143444 -96882 -392374 -297002 -13310 169126 -318688
11270e4864d928A1634L18143e0574D0703j2655M3584c3244j07905G4290J0696
$$ -54864 -4928 11634 329777 -50574 40703 28048 71632 -33244 -141149 74290 84986
11259H4986B1339K47019j18388b01325O935j13698L022B6367c9754l55509B49010
$$ 84986 21339 268358 149970 -201325 -194390 -308088 -305066 26367 -39754 -395263 249010
11247a71703M3267b3645j23854j42860E9934P9069b03027k0783G0991E536b63152
$$ -171703 -128436 -23645 -147499 -290359 59934 139003 -203027 -223810 70991 5536 -263152
11235b78646Q0724f5963C49522B2481J4878p148B844a14129J7680L7264f735j73769
$$ -278646 -197922 -65963 349522 22481 37359 30211 2844 -114129 -96449 -59185 -6735 -180504
11223a80504A8833a60304C8640a10063n1873J6373o9688h3745A5793J2843a15683
$$ -180504 18833 -160304 38640 -110063 -161936 -145563 -215251 -83745 15793 28636 -115683
11211a35069F8438b7638j10326q1702E8590e1465j12329B3682L34953g7236K1599
$$ -135069 68438 -27638 -137964 -219666 58590 -51465 -163794 23682 358635 -77236 -55637
11200e5637B80395A04932b20845e0272k22048E50828F3546b05262E4511k3983
$$ -55637 280395 104932 -220845 -50272 -272320 550828 63546 -205262 54511 30528
11190C0528g0616l050k88729J62449I5517L2176a17220A06891b04018f8474j66172
$$ 30528 -70616 -73666 -362395 -199946 95517 127693 -117220 106891 -204018 -68474 -234646
11179b34646B20312G0750e4687H4766R9630c17607a12027G7093O6759g5370K1600
$$ -234646 220312 70750 -54687 84766 184396 -317607 -112027 77093 143852 -75370 -53770
11168e3770r7090o205f9240B6755c3049A58031b08174D0392b66260i6432p3866
$$ -53770 -150860 -157065 -69240 26755 -33049 158031 -208174 40392 -266260 -96432 -170298
11157a70298C5120c7000b39k75079J9905P0016l2099A9302b86959A08261m281
$$ -170298 35120 -37000 -239 -275318 -255413 -185397 -217496 19302 -286959 108261 103980
11146A03980K6846h6143E91a21735L6684C9622a81618A10233l5010c7556b463
$$ 103980 130826 -86143 591 -121735 -85051 39622 -181618 110233 75223 -37556 -2463
11134c84668A21654P921A1929P9356a52887A977g7440K8864C07246j47602a56091
$$ -384668 121654 129575 11929 91285 -152887 1977 -77440 -48576 307246 159644 -156091
11122F5136K90J51701j08105C7818d3776C73178b6191I7469a75212a4920j08750
$$ 65136 65426 217127 109022 37818 -43776 373178 -26191 97469 -175212 -14920 -123670
11111a23670A43Q8246K51416H5260b3784C52839m8640a06146F245J37387B8674
$$ -123670 143 88389 339805 85260 -23784 352839 304199 -106146 6245 143632 28674
11099g3789A16025M3391N7299J80560e4469E7987b87025F147L90993a4400G2656
$$ -73789 116025 159416 216715 397275 -54469 57987 -287025 6147 397140 -14400 72656
11087c6091D37511B6133K45877J9464a32988N3416C59055P9900Q9399A08271p207
$$ -36091 437511 26133 272010 291474 -132988 -79572 359055 438955 528354 108271 101064
11076A01064K86491N5704j89201a4572B05608J57996F9464J49364J50903J02061
$$ 101064 387555 443259 254058 -14572 205608 363604 69464 218828 369731 471792
11066D71792A71456D4543L63862J13370j57928K1850J93055b6213B91366J47969
$$ 471792 171456 44543 408405 521775 363847 385697 578752 -26213 291366 439335
11056D39335j91685J40517J77182O7363J92989j17425q6713k64837K22542R7494
$$ 439335 247650 388167 565349 632712 825701 708276 621563 356726 579268 676762
11046F76762J40705j08781L8801J22136C00995M20936l3941l37423j13905L66498
$$ 676762 817467 708686 747487 869623 300995 721931 687990 350567 236662 603160
11036F03160J75632j7822N7716P7776k15339j70304k55237L30131o8586Q7221
$$ 603160 778792 760970 818686 896462 681123 510819 255582 585713 517127 604348
11026F04348k14867Q1431J41376j36522J95725j37627M7127N4978J18951l08791
$$ 604348 389481 470912 612288 475766 671491 533864 580991 635969 754920 446129
11016D46129R9575O7344j11103K3788k12967K66997j06017L59806A40695M79510
$$ 446129 545704 613048 501945 525733 312766 579763 473746 833552 140695 620205
11006F20205J2095J2244j68781P7637p0650J79861l6725q2796J0641J8814j69591
$$ 620205 632300 644544 475763 553400 482750 662611 625886 543090 553731 572545 402954
10995D02954L1153L95440C89656J75452K84934j48534m5316L48899k36122L8260
$$ 402954 434107 829547 389656 565108 850042 701508 656192 1005091 768969 807229
10985H07229J45988K59675N2371j00648J28833o3758l53137N44250q3856N5050
$$ 807229 953217 1212892 1265263 1164615 1293448 1229690 876553 1420803 1336947 1391997
10975A391997L46317j77031L12736N01365m71409J29972k53609N4566j00155j30372
$$ 1391997 1738314 1561283 1874019 2375384 1903975 2033947 1780338 1834904 1734749 1604377
10965A604377j53345j48173j19986L62520k35794J34129r3428k09989J48036L84077
$$ 1604377 1451032 1302859 1182873 1545393 1309599 1443728 1350300 1140311 1288347 1672424
10955A672424k50196k07611q348K09179m50837k69484o6807J0284q9396k66970
$$ 1672424 1422228 1214617 1206269 1415448 964611 695127 628320 638604 549208 282238
10945B82238K97184A47491J79708F5730J46656j7318C5345L31321C207a0819j28865
$$ 282238 579422 147491 327199 65730 212386 195068 35345 366666 3207 -10819 -139684
10934a39684A03577K49001D7788J79840e3106B32416G7107A5075J94887n4754
$$ -139684 103577 352578 47788 227628 -53106 232416 77107 15075 209962 155208
10924A55208a56056l2936B02907b16923C74540a94194D4618A721g3856B7119Q1087
$$ 155208 -156056 -188992 202907 -216923 374540 -194194 44618 1721 -73856 27119 108206
10913A08206L81367a07773p2999B84836a39218A45010b45056a5872B92532K5267
$$ 108206 489573 -107773 -180772 284836 -139218 145010 -245056 -15872 292532 317799
10903C17799a88398f9780A75197J53289d3096H7682B2431h9370B09627A0695P0353
$$ 317799 -188398 -69780 175197 328486 -43096 87682 22431 -89370 209627 10695 81048
10892H1048a20834F0046b06617f5559l1708n2735c8565j40118N2639C7639b1819
$$ 81048 -120834 60046 -206617 -65559 -97267 -150002 -38565 -178683 -126044 37639 -21819
10880c8944J7895C1992b16989A21202e6885H5016M2501g1987j97636A3774d3370
$$ -38944 -21049 31992 -216989 121202 -56885 85016 127517 -71987 -269623 13774 -43370
10868E6073a06061A4989M7828a38750B20297f8778B86595g9875j0252a8415l2575
$$ 56073 -106061 14989 62817 -138750 220297 -68778 286595 -79875 -90127 -18415 -50990
10857e0990A8461b48070f8221c0804i290j66458O4897c9329A23816k5700B0654
$$ -50990 18461 -248070 -68221 -30804 -9290 -175748 -110851 -39329 123816 98116 20654
10845g009D2410L109P0201f8487j82872A70155a39401A29457A6088J27150a42483
$$ -7009 42410 45519 115720 -68487 -251359 170155 -139401 129457 16088 143238 -142483
10833b31403G1224a68047j96861H214b6856j08962A05737b58641I5130J08900
$$ -231403 71224 -168047 -364908 8214 -26856 -135818 105737 -258641 95130 204030
10823B04030i8170Q937o86A05481k4634A2955P0236g1625k9587j93380B11366
$$ 204030 -98170 -89233 -89919 105481 80847 12955 83191 -71625 -101212 -294592 211366
10811c49773A83645h3519b0884A59107b5513l6593B14247F8158J69000D0209K01806
$$ -349773 183645 -83519 -20884 159107 -25513 -62106 214247 68158 237158 40209 242015
10800B42015f7643A26932e0046j48537F9063c99023C1798a55645C0797M499J8025
$$ 242015 -67643 126932 -50046 -198583 69063 -399023 31798 -155645 30797 35296 53321
10789E3321a65214A52168c3894A58668Q1448H7969a24506r3854C3501b39523B4376
$$ 53321 -165214 152168 -33894 158668 240116 87969 -124506 -218360 33501 -239523 24376
10777a04080B18515c78280q6143A48063G2740c748l88828A49078E9054h6459b0423
$$ -104080 218515 -378280 -464423 148063 72740 -3748 -392576 149078 59054 -86459 -20423
10765E5349J80869a43396L8228M5537c092l0204C08127G292P9399c18477B80442
$$ 55349 236218 -143396 -105168 -59631 -3092 -33296 308127 7292 86691 -318477 280442
10753c8440L710j57210A1003c64974D1571h780m13631i505j04355k20529j41184
$$ -38440 -34730 -191940 11003 -364974 41571 -8780 -422411 -9505 -113860 -334389 -475573
10742d75573b03588B23253h9965B22688F1326i8990F1536J6103a54905q6678d9993
$$ -475573 -203588 223253 -89965 222688 61326 -98990 61536 77639 -154905 -241583 -49993
10730b48389a03989J9007A27297c76453a7604m07762F3380a36988q1333c0094
$$ -248389 -103989 -84982 127297 -376453 -17604 -425366 63380 -136988 -218321 -30094
10719B33350i3840A56509A437K80659A721a83751p6638g6805o305J7907C9070
$$ 233350 -93840 156509 1437 282096 1721 -183751 -260389 -76805 -83110 -65203 39070
10707c10632g7882j51641H6167l942K78015d3902E1788d30037A62165K2633J10185
$$ -310632 -77882 -229523 86167 82225 360240 -43902 51788 -430037 162165 184798 294983
10696B94983e2242m4950j4565a4192k02448f0720l1547j09073O8204k6184A76285
$$ 294983 -52242 -97192 -111757 -14192 -216640 -60720 -92267 -201340 -133136 -159320 176285
10684b49004R2337I75Q909d28199A9679e485j94762O009c825E673R9095h9849
$$ -249004 -156667 975 9884 -428199 19679 -5485 -200247 -194238 -3825 5673 104768 -89849
10671b01887j60828a51095m2327A7757b69922C91363f5335B01838a34237k66754
$$ -201887 -362715 -151095 -193422 17757 -269922 391363 -65335 201838 -134237 -400991
10661d00991g0405D9541d1193D4622f1297j84020Q2972B90423b94853e2676L325
$$ -400991 -70405 49541 -41193 44622 -61297 -245317 -162345 290423 -294853 -52676 -49351
10650d9351q5598A3499a09149K8940B43162I9395c15802A14292c59132E831N9123
$$ -49351 -134949 13499 -109149 -80209 243162 99395 -315802 114292 -359132 5831 64954
10639F4954K56031j29989h730C0928g8826c1761B61602a6207m4887A9418K51952
$$ 64954 320985 190996 -8730 30928 -78826 -31761 261602 -16207 -61094 19418 271370
10628B71370c448k04184b2750j33027K1492A73424b4562j64543J0997j2420A6150
$$ 271370 -3448 -207632 -22750 -155777 -134285 173424 -24562 -189105 -178108 -190528 16150
10616b27093E5036b161A50440d5744E0143P975a14830G8631a2912D2253a30770
$$ -227093 55036 -2161 150440 -45744 50143 58118 -114830 78631 -12912 42253 -130770
10604A69577a27809A95315a79830m8875Q7274O9023b9442p8065K2665n4479B2305
$$ 169577 -127809 195315 -179830 -228705 -141431 -72408 -29442 -107507 -84842 -139321 22305
10592b07862H3092K0154e0971j19960o1430A27294g8337B46263b72477A1120a29119
$$ -207862 83092 103246 -50971 -170931 -232361 127294 -78337 246263 -272477 11120 -129119
10580a77962A83964c50824a38858A484O8232P1440g730B04879i0241E1114a31017
$$ -177962 183964 -350824 -138858 1484 69716 141156 -7730 204879 -90241 51114 -131017
10568a66712A12232i5287j88405a16326A62443N9820b15590D0344h191A26218
$$ -166712 112232 -95287 -283692 -116326 162443 222263 -215590 40344 -8191 126218
10557H5009a92620r7410B7924a4047F3152K83867a51199j99787g0341K1976k697
$$ 85009 -192620 -290030 27924 -14047 63152 347019 -151199 -350986 -70341 -48365 -51062
10546e1062h208o312A54008J16094a68477E8756c48277a69635f3298n5964M5045
$$ -51062 -8208 -14520 154008 270102 -168477 58756 -348277 -169635 -63298 -119262 -74217
10535g4217E2666b42979n3983C30600A18284j0311L6369a43423A76792h8011K9894
$$ -74217 52666 -242979 -296962 330600 118284 107973 144342 -143423 176792 -88011 -58117
10524e8117k4530L5846A56230J1558E2982h4322j03536J8525q045B04556a88405
$$ -58117 -82647 -46801 156230 167788 52982 -84322 -187858 -169333 -177378 204556 -188405
10512B39623A01451b66630i0799A49242Q9539j00816J94828b9636a602A37664
$$ 239623 101451 -266630 -90799 149242 238781 137965 332793 -29636 -1602 137664
10501a07000j84110n98d2005B6652K37385A19676c7344E1327a4594k64735A37295
$$ -107000 -291110 -291708 -42005 26652 264037 119676 -37344 51327 -14594 -279329 137295
10489A14636B0604m481J99844j03724b9120A81808a91465b8065C28943a78926
$$ 114636 20604 16123 215967 112243 -29120 181808 -191465 -28065 328943 -178926
10478B86533b4970n0020A03332J31368b84256B04687b57107F8619j6066J41325
$$ 286533 -24970 -74990 103332 234700 -284256 204687 -257107 68619 52553 193878
10468A93878M4104j06730b6944C1033p437a46836c5156C6623a21333n541J3366
$$ 193878 237982 131252 -26944 31033 23596 -146836 -35156 36623 -121333 -126874 -113508
10457a13508A23270E0207a35288C67761H716f2045p3042j7278c945j71083P0577
$$ -113508 123270 50207 -135288 367761 8716 -62045 -135087 -152365 -3945 -175028 -104451
10446a04451B6861J82713D649a64379e8644B23345a98913j19188f973j1364m46091
$$ -104451 26861 209574 4649 -164379 -58644 223345 -198913 -318101 -6973 -18337 -464428
10435d64428a12012D901K744P4422m132B1734a56810k6894L9638b8129A30783
$$ -464428 -112012 4901 7645 82067 77935 21734 -156810 -183704 -144066 -28129 130783
10423c4135J5250A49366c0664k39748E2794g4034k22286A99199a07515l21421
$$ -34135 -18885 149366 -30664 -270412 52794 -74034 -296320 199199 -107515 -428936
10413d28936J7166e5676H140a29104k1069I1021f8382G8484b15353b3698a1277
$$ -428936 -411770 -55676 8140 -129104 -150173 91021 -68382 78484 -215353 -23698 -11277
10401A70994j4042A9733J34671l8082a63203a5936j18558C3805F206J71044b9440
$$ 170994 156952 19733 154404 116322 -163203 -15936 -134494 33805 6206 177250 -29440
10389A42127G394K58772j27681c3554J1798A41847M9439D8393J99565c8020H1010
$$ 142127 7394 266166 138485 -33554 -21756 141847 191286 48393 247958 -38020 81010
10377b0787j46404C50497l8287A03079k8402J68250J02822A60561J26863A21669
$$ -20787 -167191 350497 312210 103079 74677 242927 345749 160561 287424 121669
10366B35970L02465B28712L0823C781L38630A37559L13712J06450B14598Q2888
$$ 235970 538435 228712 259535 3781 342411 137559 451271 557721 214598 297486
10356B97486j20736n4585J43725G031O43732k93131C6732L57446j22553r0513
$$ 297486 176750 122165 265890 7031 650763 357632 36732 394178 271625 181112
10346A81112J86124Q7714q3688A18056J43403G4831J08653p7564K22691j32386
$$ 181112 367236 454950 371262 118056 261459 74831 183484 105920 328611 196225
10336A96225c3996j76254A32991a9607C99602A25293n1759C2391K82361j16379
$$ 196225 -33996 -210250 132991 -19607 399602 125293 73534 32391 314752 198373
10326A98373L4932a32172J8882A51976a22959c3789A88366a60140A53691a9878
$$ 198373 233305 -132172 -113290 151976 -122959 -33789 188366 -160140 153691 -19878
10315B1050J11951i8025J7544A70738r557B580f7832H4545l8098J30990K2515
$$ 21050 133001 -98025 -80481 170738 161181 2580 -67832 84545 46447 177437 199952
10304A99952b14079F5299a76310e7901j2127J5689A07887j0767c8148r8156N8224
$$ 199952 -214079 65299 -176310 -57901 -70028 -54339 107887 97120 -38148 -136304 -78080
10293g8080l7380c7564k01621O5029e6969a9694l27778G7731a56378C61532c88469
$$ -78080 -115460 -37564 -239185 -174156 -56969 -19694 -347472 77731 -156378 361532 -388469
10281b65988r6666J38136L3011A21318N3612e3579A61397b75843B35917h133C64432
$$ -265988 -362654 -224518 -191507 121318 174930 -53579 161397 -275843 235917 -8133 364432
10269c65964D8160M2023n25J20634p4924a24294b8654p6830A09106M24345k41924
$$ -365964 48160 90183 89658 210292 135368 -124294 -28654 -105484 109106 533451 291527
10258B91527K8637J72379A55501A8433h0292j42106M2129b1093m7722A43480P4292
$$ 291527 320164 492543 155501 18433 -80292 -222398 -180269 -21093 -68815 143480 217772
10247B17772b40866B30944d7592o5000C21515j26670G4315d57478e6499I0937
$$ 217772 -240866 230944 -47592 -112592 321515 194845 74315 -457478 -56499 90937
10236g590B17791r1109o2943J65135i2185B4214N1184c2634A90810a34347c1460
$$ -7590 217791 126682 63739 228874 -92185 24214 75398 -32634 190810 -134347 -31460
10224e2792j05278P5278j58326H4446l5342f9824A95719C4211a77174a2246A09863
$$ -52792 -158070 -82792 -241118 84446 49104 -69824 195719 34211 -177174 -12246 109863
10212g5945B21467f8219j13966M6295B26014h8811j04599A53426g5399A28420
$$ -75945 221467 -68219 -182185 -135890 226014 -88811 -193410 153426 -75399 128420
10201c6060Q308f996G616a94953j20243D8956J04434c24193R6219F8160a50561
$$ -36060 -27752 -6996 7616 -194953 -315196 48956 153390 -324193 -227974 68160 -150561
10189B35303j3882H0265c58312a64297j23696f0130k46149H5177l5184c93160
$$ 235303 221421 80265 -358312 -164297 -287993 -60130 -306279 85177 49993 -393160
10178b20174g5596j45554A2754a72222e7281b6510I9112a76015e425j21950b8038
$$ -220174 -75596 -221150 12754 -172222 -57281 -26510 99112 -176015 -5425 -127375 -28038
10166B9966f4804H1249N9663A5867a6009j51743h2360n5195C07411a09403j10448
$$ 29966 -64804 81249 140912 15867 -16009 -167752 -82360 -137555 307411 -109403 -219851
10155b19851M7250k82903b10061i8565D98525F1299d16520J65694M8439Q577O8444
$$ -219851 -172601 -455504 -210061 -98565 498525 61299 -416520 -250826 -202387 -193810 -125366
10144a25366E8031b76100A95096d09009a77040f6829p4088e4266C5479c2482n5020
$$ -125366 58031 -276100 195096 -409009 -177040 -66829 -140917 -54266 35479 -32482 -87502
10133h7502j07418C6069J08029b34614H0106J17461F9516i2501C31861a54546
$$ -87502 -194920 36069 144098 -234614 80106 197567 69516 -92501 331861 -154546
10122b3278j61130A66599p8336d70733I4708a19503M927j81707B05271b11960
$$ -23278 -184408 166599 88263 -470733 94708 -119503 -114576 -296283 205271 -211960
10111A14184A8202c16788a21847C0332i1508n1027k14112a68796A98701n7241
$$ 114184 18202 -316788 -121847 30332 -91508 -142535 -356647 -168796 198701 141460
10101A41460a52124L3067k9017a9604B04655a58958C1353J4540K87735A43790
$$ 141460 -152124 -119057 -148074 -19604 204655 -158958 31353 45893 333628 143790
10090G5377c26839F5194J21526d27839E6600N7729K6520J05347g9871B47980k8653
$$ 75377 -326839 65194 186720 -427839 56600 114329 140849 246196 -79871 247980 219327
10079B19327a37556C79258c82214J52333B7549O6445D276b7384C2555J93524j09457
$$ 219327 -137556 379258 -382214 -229881 27549 93994 4276 -27384 32555 226079 116622
10068A16622A5768d5473n210F1252J29771b17025d1862B78887b11345a1415n6852
$$ 116622 15768 -45473 -50683 61252 191023 -217025 -41862 278887 -211345 -11415 -68267
10057f8267E8265a13106B67409i602o1880A31398o2264b72675F5689h0968A37594
$$ -68267 58265 -113106 267409 -9602 -71482 131398 69134 -272675 65689 -80968 137594
10045a77608l6911R702d4964m1554j42718K5041M2640M3854F3987a8573k07027
$$ -177608 -214519 -204817 -44964 -86518 -229236 -204195 -161555 -117701 63987 -18573 -225600
10034b25600O6897a7886q8618A0173i7987B343b41497d126A70963J4314a57664
$$ -225600 -158703 -17886 -106504 10173 -97987 2343 -241497 -4126 170963 185277 -157664
10022A35841J29516b74063D1248O6280b123A39595F6864a3692q2701m2331n9111
$$ 135841 265357 -274063 41248 107528 -2123 139595 66864 -13692 -96393 -138724 -197835
10011a97835a1537k14492q3479a27148f1799b8814A86059a65834N9789j02505
$$ -197835 -11537 -226029 -309508 -127148 -61799 -28814 186059 -165834 -106045 -208550
10001b08550A05573D1416Q730b04864o923b0112j78266G4507j328a87211a7968
$$ -208550 105573 41416 50146 -204864 -211787 -20112 -198378 74507 73179 -187211 -17968
9989H2130l4555b96156a32938l6558B26275o4837a92047b1678C8829J06693n1609
$$ 82130 47575 -296156 -132938 -169496 226275 161438 -192047 -21678 38829 145522 93913
9978I3913Q629a92686g2459d495I9637c11983H6579a36287C0270b17318h7032
$$ 93913 102542 -192686 -72459 -4495 99637 -311983 86579 -136287 30270 -217318 -87032
9966c23879C52818b40946c1283j24201B3201c0485B50832A9476a8827k31603J25076
$$ -323879 352818 -240946 -31283 -155484 23201 -30485 250832 19476 -18827 -250430 -125354
9955a25354A63659o500F2437a31425f267H1099k9664g2522j81630E3897f0321
$$ -125354 163659 157159 62437 -131425 -6267 81099 51435 -72522 -254152 53897 -60321
9943A07968c8651N252p6426C4211c23820J13573h347j47424N7098M3359k6831
$$ 107968 -38651 -33399 -109825 34211 -323820 -210247 -8347 -155771 -98673 -55314 -82145
9932h2145F8557b73503k960j03597d7777B0105a80920o8028b6382B18839b60889
$$ -82145 68557 -273503 -276463 -380060 -47777 20105 -180920 -248948 -26382 218839 -260889
9920B4984a16472C8041c4152A16658b2811I0106A9141c9353A43556c20286a26850
$$ 24984 -116472 38041 -34152 116658 -22811 90106 19141 -39353 143556 -320286 -126850
9908C4089b89429J37399j64761g8319o7140m53n1487A09035h475k17312l0186
$$ 34089 -289429 -152030 -316791 -78319 -145459 -145912 -197399 109035 -8475 -225787 -255973
9897b55973H1356b36515H3723J32452A00756c37529B16640a3797G3115d1841A18498
$$ -255973 81356 -236515 83723 216175 100756 -337529 216640 -13797 73115 -41841 118498
9885A53920a24799C24243b69838a25996j23078a5362j54207A72h4163k14536M9164
$$ 153920 -124799 324243 -269838 -125996 -249074 -15362 -169569 172 -84163 -298699 -249535
9874b49535J22415A8844b13316I6411A4395d6286H800f4210B7866b44850A23932
$$ -249535 -127120 18844 -213316 96411 14395 -46286 8800 -64210 27866 -244850 123932
9862c6543a7767k9455F2744a84761f3683J1752A4647g0248J9469m9384j27429
$$ -36543 -17767 -47222 62744 -184761 -63683 -51931 14647 -70248 -50779 -100163 -227592
9851b27592B39233D0259i9958k54119J24387A68230f5280G3229h9310A52621d7339
$$ -227592 239233 40259 -99958 -354077 -229690 168230 -65280 73229 -89310 152621 -47339
9839b58881A57766a59419F7150b04942j09922a51285o0337A81581b4323k90492
$$ -258881 157766 -159419 67150 -204942 -314864 -151285 -211622 181581 -24323 -314815
9829c14815P0363M3895M5466m7756e7729A62156B5549e3970A20071K7386C6302
$$ -314815 -244452 -200557 -155091 -202847 -57729 162156 25549 -53970 120071 147457 36302
9817c9161A04232J41059b9551A17838c97376b9925D7140b16284f3052A1542b29555
$$ -39161 104232 245291 -29551 117838 -397376 -29925 47140 -216284 -63052 11542 -229555
9805i0961l4294L6408m317k33900A03112b43440A25744a30548j58492E3068J10846
$$ -90961 -125255 -88847 -93164 -327064 103112 -243440 125744 -130548 -289040 53068 163914
9794A63914B3416f2796j48391h7228k89043a4568A93119b84442b4606B83550h9864
$$ 163914 23416 -62796 -211187 -87228 -376271 -14568 193119 -284442 -24606 283550 -89864
9782a23440h396A00299c06097B6203O2978J48365d71635b25052D0593J26272J80330
$$ -123440 -8396 100299 -306097 26203 89181 237546 -471635 -225052 40593 166865 347195
9771C47195b4132j23829C4998D778K15207a20026A1473c120G9798e7536A20695
$$ 347195 -24132 -147961 34998 4778 219985 -120026 11473 -3120 79798 -57536 120695
9759c13733A33977m3632J47963b63309A12389a79374p2099N5216J757i2256j19162
$$ -313733 133977 90345 238308 -263309 112389 -179374 -251473 -196257 -194500 -92256 -211418
9748b11418e1262B9388d57333D6645F311a24665G4781c33183L553J58326l11338
$$ -211418 -51262 29388 -457333 46645 6311 -124665 74781 -333183 -329630 -171304 -482642
9737d82642J05033A3349e8832E6266N9560c3905A49633k7564a95658C38124g9
$$ -482642 -377609 13349 -58832 56266 115826 -33905 149633 122069 -195658 338124 -79
9725b32209l8140g9374c8752j82200Q1063F4000i1995p1872e3793B77930d069
$$ -232209 -270349 -79374 -38752 -220952 -139889 64000 -91995 -163867 -53793 277930 -4069
9713F5112a15153A08638a66886j75086a04937H2829E302b06584g8053J6821I9115
$$ 65112 -115153 108638 -166886 -341972 -104937 82829 5302 -206584 -78053 -61232 99115
9701a20136A24888a01584k7629A13949i2797E9710A4454a29768B42895h5020F7333
$$ -120136 124888 -101584 -129213 113949 -92797 59710 14454 -129768 242895 -85020 67333
9689A04890B7645d1338A90660H7553a15637B30447b5345D7790c45598a50202C9500
$$ 104890 27645 -41338 190660 87553 -115637 230447 -25345 47790 -345598 -150202 39500
9677B07409G982a37614P19j89680h6036L3905I0948d8862A50004a98171p9317
$$ 207409 7982 -137614 -136895 -326575 -86036 -52131 90948 -48862 150004 -198171 -277488
9666b77488H3877a8005a065o6730j28012j90442I5139h5265m6761l0895e1163
$$ -277488 83877 -18005 -1065 -67795 -195807 -386249 95139 -85265 -132026 -162921 -51163
9654G3904K2865m7738a24841B74128c3628A43133a92393m407A37449b57513m0631
$$ 73904 96769 49031 -124841 274128 -33628 143133 -192393 -196800 137449 -257513 -298144
9643b98144a3796B13761b1591P803r4338I8656n282a11057r0447f3815I1344I625
$$ -298144 -13796 213761 -21591 -13788 -108126 98656 93374 -111057 -201504 -63815 91344 9625
9630c5717R382p4376D2892e1299j89897I3132a22570K2624K3934A52526B367b44851
$$ -35717 -26335 -100711 42892 -51299 -241196 93132 -122570 -99946 -76012 152526 2367 -244851
9617c00814A3739e8706A27188a67486O1854A17186g2973j44873n9068B31081b20292
$$ -300814 13739 -58706 127188 -167486 -105632 117186 -72973 -217846 -276914 231081 -220292
9605A171b39938h6846L5936d602m082n4522C2345e621D6298b45584k37100B2477
$$ 1171 -239938 -86846 -50910 -4602 -8684 -63206 32345 -5621 46298 -245584 -482684 22477
9592B3032B719b5468j32714H1684h4471B97513F2120i7860c9021F3735a7348p2904
$$ 23032 2719 -25468 -158182 81684 -84471 297513 62120 -97860 -39021 63735 -17348 -90252
9580i0252p9957B96993D5747f1583A02818J5494a6987A63883a71206F290b6731
$$ -90252 -170209 296993 45747 -61583 102818 118312 -16987 163883 -171206 6290 -26731
9568B4355a51000A52325e4593i881b994r3254A58423b35450A28160k5431b30041
$$ 24355 -151000 152325 -54593 -9881 -2994 -96248 158423 -235450 128160 102729 -230041
9556c98639J98552A05887L5022b02102I0243b2071m2028j0639j18209k954O0709
$$ -398639 -200087 105887 140909 -202102 90243 -22071 -64099 -74738 -192947 -195901 -135192
9545a35192j76315a6137k70115K7777A8083b53923O971n7542i2605m9994f0128
$$ -135192 -311507 -16137 -286252 -258475 18083 -253923 -246952 -304494 -92605 -142599 -60128
9533c7405p2488d126I4994b36934k8155M0236J9763i8764j17009B6038b11844
$$ -37405 -109893 -4126 94994 -236934 -265089 -224853 -205090 -98764 -215773 26038 -211844
9521b81965J25776H6381a4665A04066a27415H4073J1330J68338J6263H4871b5393
$$ -281965 -156189 86381 -14665 104066 -127415 84073 95403 263741 280004 84871 -25393
9509c86926B27271J6661a55618O4762c2930A01816b37919I1395a78572E5653J07145
$$ -386926 227271 243932 -155618 -90856 -32930 101816 -237919 91395 -178572 55653 162798
9498A62798c22699a51888D6379c50411B1840a42705l20405a92698f3038l5267
$$ 162798 -322699 -151888 46379 -350411 21840 -142705 -463110 -192698 -63038 -98305
9488i8305A44768h73k18010C1408L0462J60242b82777B63428a20181c0727A9667
$$ -98305 144768 -873 -218883 31408 61870 222112 -282777 263428 -120181 -30727 19667
9476A96720n4096d4099l27176J06397a09945p0881I1755c11580d3593a02j29221
$$ 196720 142624 -44099 -371275 -264878 -109945 -180826 91755 -311580 -43593 -102 -129323
9465a29323M9647c0695k5015m9724A15084c1484q9069M2709A10599K9337a30474
$$ -129323 -79676 -30695 -55710 -105434 115084 -31484 -120553 -77844 110599 139936 -130474
9453A74007a73698j08037J34847A49051L7912g910C82139B8072a05556k1693N7151
$$ 174007 -173698 -281735 -146888 149051 186963 -7910 382139 28072 -105556 -127249 -70098
9442g0098A74777e3651j85997J3686L9595g7165l0751M7319b8053j96024A49315
$$ -70098 174777 -53651 -239648 -225962 -186367 -77165 -107916 -60597 -28053 -224077 149315
9430A22805G816b96948J06874A97600R1289a26380k07415a42412l0716j01133
$$ 122805 7816 -296948 -190074 197600 288889 -126380 -333795 -142412 -173128 -274261
9420b74261A7942b45644R7468A6166c8779k02720c9836l56428C0409b74483F9493
$$ -274261 17942 -245644 -148176 16166 -38779 -241499 -39836 -396264 30409 -274483 69493
9408a8634A85094b17826j18539e7061k08694J27368k4826a7291B32535d3003A38851
$$ -18634 185094 -217826 -336365 -57061 -265755 -138387 -163213 -17291 232535 -43003 138851
9396A65882A6155K56269C1227J6517R3074b82830L2058e4339G5048h068n2172
$$ 165882 16155 272424 31227 47744 140818 -282830 -250772 -54339 75048 -8068 -60240
9385f0240A38114b55448i0529o0273l8662E3662a02383l79l216K7757j5837r6961
$$ -60240 138114 -255448 -90529 -150802 -189464 53662 -102383 -102762 -105978 -78221 -94058 -191019
9373a91019a9483G1918c03348B2762b18609n9581D9112a42502j75170G7572a27216
$$ -191019 -19483 71918 -303348 22762 -218609 -278190 49112 -142502 -317672 77572 -127216
9361a26709N9416b3984A00147a75693H5824b82605a01978F895a00125M346B4730
$$ -126709 -67293 -23984 100147 -175693 85824 -282605 -101978 6895 -100125 -95779 24730
9349c15236c7611k01943a09191A35514b39874C0915a15907I8632A7918b65851
$$ -315236 -37611 -239554 -109191 135514 -239874 30915 -115907 98632 17918 -265851
9338I5754O5340A9353N88a90251b406l3208A03458M8270c15976A7379c007j09726
$$ 95754 161094 19353 19941 -190251 -2406 -35614 103458 151728 -315976 17379 -3007 -112733
9326a12733m9586A64163a28964n0063n5660f704m6B98653a50761l05843A1120
$$ -112733 -162319 164163 -128964 -179027 -234687 -6704 -6750 298653 -150761 -456604 11120
9314B08265D4961a08506j30982a01239c6542h441F7847b6740q7568H9088a50491
$$ 208265 44961 -108506 -239488 -101239 -36542 -8441 67847 -26740 -114308 89088 -150491
9302a70271D5639d44228a52358c6981l20047B7477L48019f2188j31394E8833b46451
$$ -170271 45639 -444228 -152358 -36981 -357028 27477 375496 -62188 -193582 58833 -246451
9290B72109b55489D93127H5290b00725j52795A13967i9576c4260q0574B42409
$$ 272109 -255489 493127 85290 -200725 -353520 113967 -99576 -34260 -114834 242409
9279B11579a09717j23478m1726e4789D6795a48313C8546L3092L5271K25494e24429
$$ 211579 -109717 -233195 -274921 -54789 46795 -148313 38546 71638 106909 332403 -524429
9267g5642M378L247j73377o6553C966a92437B48687l8630m6613b18077A36103
$$ -75642 -71264 -68017 -241394 -307947 3966 -192437 248687 210057 163444 -218077 136103
9255b89210N0994A84928b94681A94703i4613f712n6228j75179i7519n077d4847
$$ -289210 -238216 184928 -294681 194703 -94613 -6712 -62940 -238119 -97519 -102596 -44847
9243c01592m2197J15856M5055k26387J43123B98902E6968e7669j22821D2621a19169
$$ -301592 -343789 -227933 -182878 -409265 -266142 298902 56968 -57669 -180490 42621 -119169
9231A0615a92458k8945E2553K00860l7237j05496i0265l19542a02692d9275j58235
$$ 10615 -192458 -221403 52553 253413 216176 110680 -90265 -409807 -102692 -49275 -207510
9220b07510A7863P2957D106M15718B9793J41445D0272b10775d8958B58386D700
$$ -207510 17863 90820 4106 419824 29793 171238 40272 -210775 -48958 258386 4700
9208B84634o4923f2011A39767i7497o0365E2021h205B113J32492k9086A0221c30773
$$ 284634 219711 -62011 139767 -97497 -157862 52021 -8205 2113 134605 105519 10221 -330773
9195F4551a08402B15321C9378Q8680e8201A01665j4540a92727D1108a68657K1368
$$ 64551 -108402 215321 39378 128058 -58201 101665 87125 -192727 41108 -168657 -147289
9184a47289j29861G7775a50097f7225k29059i1229A32288J76751A7163K925a34946
$$ -147289 -277150 77775 -150097 -67225 -296284 -91229 132288 309039 17163 20088 -134946
9172a35688j43261J9291B14156E9196b0308C5643b58693G2654j7361N2728g95
$$ -135688 -278949 -259658 214156 59196 -20308 35643 -258693 72654 55293 108021 -795
9160a24663B42726D0596M8321c14682Q6507g2417A47856F2283j1860e0213A11223
$$ -124663 242726 40596 88917 -314682 -228175 -72417 147856 62283 50423 -50213 111223
9148B1779M3873L13894F8033c22098h814A52010a21178A2137b29811A83034b1530
$$ 21779 65652 379546 68033 -322098 -8814 152010 -121178 12137 -229811 183034 -21530
9136B2072e0232A59687p730a82738J5383j37307g4013B34088I7481f0824m7096
$$ 22072 -50232 159687 151957 -182738 -167355 -304662 -74013 234088 97481 -60824 -107920
9125a07920j85420A0598L2462a65607A93286q6830J03323A5160o327a76437c8847
$$ -107920 -293340 10598 43060 -165607 193286 106456 209779 15160 8833 -176437 -38847
9113c12930M2106B0768a24624j52398d3588A18152i1186B10360c48032b8167B91447
$$ -312930 -270824 20768 -124624 -277022 -43588 118152 -91186 210360 -348032 -28167 291447
9101a81377C995g8369l2480j20591A15058c38341i7068A42051b65505E7469N84
$$ -181377 3995 -78369 -110849 -231440 115058 -338341 -97068 142051 -265505 57469 58053
9090E8053h7975A58205a77362j5811k1042g6122j27570D619f8363k57904B2879
$$ 58053 -87975 158205 -177362 -193173 -214215 -76122 -203692 4619 -68363 -326267 22879
9078A84573j4422a07882j73574G8446i5096H3358P537J6627e2075C07907A09848
$$ 184573 170151 -107882 -281456 78446 -95096 83358 90895 107522 -52075 307907 109848
9066I9187b57505H8677c21768C2493f9465D0178a11095p9693C01926a50835j17735
$$ 99187 -257505 88677 -321768 32493 -69465 40178 -111095 -190788 301926 -150835 -268570
9055b68570K3588E2465a44997p2616b4221A30762A7087K10721i6327k48883A60544
$$ -268570 -244982 52465 -144997 -217613 -24221 130762 17087 227808 -96327 -345210 160544
9043a05942A08427c57556D9401K19831j32010a61288L3158I9285M0483C1812a44078
$$ -105942 108427 -357556 49401 269232 137222 -161288 -128130 99285 139768 31812 -144078
9031H2388b96939i8938k1315A23455h4078j67969R5806A22268b12824E8205e1305
$$ 82388 -296939 -98938 -120253 123455 -84078 -252047 -156241 122268 -212824 58205 -51305
9019a60878j05993K5431a01167b8078l4617j92998J23373k3021I6870c80824Q925
$$ -160878 -266871 -241440 -101167 -28078 -62695 -255693 -132320 -155341 96870 -380824 -371899
9008c71899j25866b14865R0151j12010H0369b37424i8573k6651E7748J4741a81852
$$ -371899 -497765 -214865 -124714 -236724 80369 -237424 -98573 -125224 57748 72489 -181852
8996c19511C1267L9932O8449c06316a09894l9687b3033j02296B73570m8138m0147
$$ -319511 31267 71199 139648 -306316 -109894 -149581 -23033 -125329 273570 225432 185285
8985A85285b54373B44707c12219J19583m3473A14444a78998n543O5915A22653
$$ 185285 -254373 244707 -312219 -192636 -236109 114444 -178998 -184541 -118626 122653
8974B03735J70310F865g2271j66879f4936G6169J65548a75983I1494K87318a33082
$$ 203735 374045 6865 -72271 -239150 -64936 76169 241717 -175983 91494 378812 -133082
8962a08904D9007b02533h4174a9922j4160k18261A608N1116N3891Q6561d46226
$$ -108904 49007 -202533 -84174 -19922 -34082 -252343 1608 52724 106615 193176 -446226
8950B84454q3328o4905m7502a38006M4644A87824H5774a23535C38268a25362q7205
$$ 284454 201126 136221 88719 -138006 -93362 187824 85774 -123535 338268 -125362 -212567
8939b12567P2023C77173j59498M2076L23179j13918H5226l6135M38208A42576
$$ -212567 -140544 377173 217675 259751 582930 469012 85226 49091 487299 142576
8928F19212j65927J71127J42638K39876J32903J288771L197878L000635C369642
$$ 619212 453285 624412 767050 1006926 1139829 2428600 5626478 8627113 3369642
8918A888594H52338k28992k68523J17601A60759L59661B21084a14543A60357D9685
$$ 1888594 852338 623346 354823 472424 160759 520420 221084 -114543 160357 49685
8907D40129n4213D9581a5730I0817b39336A46913G3381c13436C6396d8094C2515
$$ 440129 385916 49581 -15730 90817 -239336 146913 73381 -313436 36396 -48094 32515
8895b0819j51980A38727h6980n1072j53558A44565J5189b74892H7096L1071M2161
$$ -20819 -172799 138727 -86980 -138052 -291610 144565 159754 -274892 87096 118167 160328
8884A60328a07437B25138A1491M1540b05303B92652b07073i9592k27717D8717
$$ 160328 -107437 225138 11491 53031 -205303 292652 -207073 -99592 -327309 48717
8873D7141J87244r8975F6551J88209c41474a70266F666J11518N4950B3958a51055
$$ 47141 234385 135410 66551 254760 -341474 -170266 6666 118184 173134 23958 -151055
$$ [...]
##END NTUPLES=NMR SPECTRUM
##END=
