
##TITLE=AC1360_QARH12182_6945679_ntEdPbxQv1
##JCAMPDX= 6.0         $$ Bruker NMR JCAMP-DX V2.0
##DATA TYPE= NMR SPECTRUM
##DATA CLASS= NTUPLES
##ORIGIN= BRUKER
##OWNER= Administrator
$$ 1.72 TOPSPIN		Version 2.1
$$ 2012-10-18 13:47:24.100 -0700  Administrator@X
$$ Compression mode = diff/dup
##.OBSERVE FREQUENCY= 400.02188249412
##.OBSERVE NUCLEUS= ^1H
##.ACQUISITION MODE= SIMULTANEOUS (DQD)
##.ACQUISITION SCHEME= undefined
##.AVERAGES= 8
##.DIGITISER RES= 22
##SPECTROMETER/DATA SYSTEM= spect
##.PULSE SEQUENCE= zg30
##.SOLVENT NAME= COFFEE_meoh
##.SHIFT REFERENCE= INTERNAL, COFFEE_meoh, 1, 14.98509
##AUDIT TRAIL= $$ (NUMBER, WHEN, WHO, WHERE, PROCESS, VERSION, WHAT)
$$ ##TITLE= Audit trail, TOPSPIN		Version 2.1
$$ ##JCAMPDX= 5.01
$$ ##ORIGIN= Bruker BioSpin GmbH
$$ ##OWNER= Administrator
$$ $$ C:\Bruker\TOPSPIN/data/COFFEE/nmr/AC1360_QARH12182_6945679_ntEdPbxQv1/10/pdata/1/auditp.txt
$$ ##AUDIT TRAIL=  $$ (NUMBER, WHEN, WHO, WHERE, PROCESS, VERSION, WHAT)
(   1,<2012-10-13 22:50:22.515 -0500>,<Administrator>,<TOPSPIN>,<go>,<TOPSPIN 2.1>,
      <created by zg
	started at 2012-10-13 22:49:15.593 -0500,
	POWCHK enabled, PULCHK disabled,
       configuration hash MD5:
       6B 1B 68 BB D9 2E 58 E2 7F 35 AD 54 07 DF 0E 41
       data hash MD5: 64K
       CB F4 39 06 B6 CA 27 F6 22 8A 57 F1 C2 10 C3 BE>)
(   2,<2012-10-13 22:50:25.109 -0500>,<Administrator>,<TOPSPIN>,<proc1d>,<TOPSPIN 2.1>,
      <Start of raw data processing
       efp LB = 0 FT_mod = 6 PKNL = 1 PHC0 = 0 PHC1 = 0 SI = 32K 
       data hash MD5: 32K
       97 C5 C2 0B 9A 4F C1 25 58 73 BB B4 F0 07 2C 07>)
(   3,<2012-10-13 22:50:25.515 -0500>,<Administrator>,<TOPSPIN>,<proc1d>,<TOPSPIN 2.1>,
      <pk PHC0 = 181.3953 PHC1 = 0 
       data hash MD5: 32K
       46 0E 3D 7C 20 03 07 11 A7 09 5F 68 A8 38 EF 4A>)
(   4,<2012-10-13 22:50:25.625 -0500>,<Administrator>,<TOPSPIN>,<proc1d>,<TOPSPIN 2.1>,
      <abs ABSG = 1 
       data hash MD5: 32K
       07 68 6C 8A D2 7A 20 F7 5F 0D 52 C7 A5 E1 84 47>)
(   5,<2012-10-13 22:50:25.656 -0500>,<Administrator>,<TOPSPIN>,<proc1d>,<TOPSPIN 2.1>,
      <abs ABSG = 2 
       data hash MD5: 32K
       5F 64 B4 F9 1C 55 49 A5 86 9F 19 46 E1 5E 8B A7>)
(   6,<2012-10-13 22:50:25.687 -0500>,<Administrator>,<TOPSPIN>,<proc1d>,<TOPSPIN 2.1>,
      <abs ABSG = 3 
       data hash MD5: 32K
       CC 7C B0 12 73 5A 38 37 45 87 A5 0F 76 ED C6 F5>)
(   7,<2012-10-13 22:50:25.718 -0500>,<Administrator>,<TOPSPIN>,<proc1d>,<TOPSPIN 2.1>,
      <abs ABSG = 4 
       data hash MD5: 32K
       33 CB 73 0E 27 CC 6E CF 12 9C 7D EC 35 CC 87 73>)
(   8,<2012-10-13 22:50:25.750 -0500>,<Administrator>,<TOPSPIN>,<proc1d>,<TOPSPIN 2.1>,
      <abs ABSG = 5 
       data hash MD5: 32K
       23 70 35 0F 67 30 3C 47 78 D8 F7 EB 5A D1 D2 90>)
(   9,<2012-10-13 22:50:29.375 -0500>,<Administrator>,<TOPSPIN>,<audit>,<TOPSPIN 2.1>,
      <user comment:
       ICON-NMR User ID: COFFEE
       data hash MD5: 32K
       23 70 35 0F 67 30 3C 47 78 D8 F7 EB 5A D1 D2 90>)
$$ ##END=
$$ 
$$ [...]
150 150 150 150 150 150 150 150
##$TP07= 0
##$TPNAME0= <>
##$TPNAME1= <>
##$TPNAME2= <>
##$TPNAME3= <>
##$TPNAME4= <>
##$TPNAME5= <>
##$TPNAME6= <>
##$TPNAME7= <>
##$TPOAL= (0..7)
0.5 0.5 0.5 0.5 0.5 0.5 0.5 0.5
##$TPOFFS= (0..7)
0 0 0 0 0 0 0 0
##$TUNHIN= 0
##$TUNHOUT= 0
##$TUNXOUT= 0
##$USERA1= <user>
##$USERA2= <user>
##$USERA3= <user>
##$USERA4= <user>
##$USERA5= <user>
##$V9= 5
##$VALIST= <valist>
##$VCLIST= <CCCCCCCCCCCCCCC>
##$VD= 0
##$VDLIST= <DDDDDDDDDDDDDDD>
##$VPLIST= <PPPPPPPPPPPPPPP>
##$VTLIST= <TTTTTTTTTTTTTTT>
##$WBST= 2048
##$WBSW= 25
##$XGAIN= (0..3)
0 0 0 0
##$XL= 0
##$YL= 0
##$YMAX_a= 502602
##$YMIN_a= -640976
##$ZGOPTNS= <>
##$ZL1= 120
##$ZL2= 120
##$ZL3= 120
##$ZL4= 120
##$ABSF1= 14.98509
##$ABSF2= -5.573092
##$ABSG= 5
##$ABSL= 3
##$ALPHA= 0
##$AQORDER= 0
##$ASSFAC= 0
##$ASSFACI= 0
##$ASSFACX= 0
##$ASSWID= 0
##$AUNMP= <proc_prof1d_extract_pilot.lims>
##$AXLEFT= 0
##$AXNAME= <>
##$AXNUC= <1H>
##$AXRIGHT= 0
##$AXTYPE= 0
##$AXUNIT= <>
##$AZFE= 0.1
##$AZFW= 0.1
##$BCFW= 0
##$BC_mod= 0
##$BYTORDP= 0
##$COROFFS= 0
##$CY= 15
##$DATMOD= 1
##$DC= 0
##$DFILT= <>
##$DTYPP= 0
##$F1P= 0
##$F2P= 0
##$FCOR= 0.5
##$FTSIZE= 32768
##$FT_mod= 6
##$GAMMA= 0
##$GB= 0
##$INTBC= 1
##$INTSCL= 1
##$ISEN= 128
##$LB= 0
##$LEV0= 0
##$LPBIN= 0
##$MAXI= 10000
##$MC2= 0
##$MEAN= 0
##$ME_mod= 0
##$MI= 0
##$NCOEF= 0
##$NC_proc= -8
##$NLEV= 6
##$NOISF1= 0
##$NOISF2= 0
##$NSP= 0
##$NTH_PI= 0
##$NZP= 0
##$OFFSET= 14.98509
##$PC= 1
##$PHC0= 181.3953
##$PHC1= 0
##$PH_mod= 1
##$PKNL= yes
##$PPARMOD= 0
##$PPDIAG= 0
##$PPIPTYP= 0
##$PPMPNUM= 2147483647
##$PPRESOL= 1
##$PSCAL= 4
##$PSIGN= 0
##$PYNMP= <proc.py>
##$REVERSE= no
##$SF= 400.02
##$SI= 32768
##$SIGF1= 0
##$SIGF2= 0
##$SINO= 400
##$SIOLD= 32768
##$SPECTYP= <>
##$SREGLST= <1H.CDCl3>
##$SSB= 0
##$STSI= 32768
##$STSR= 0
##$SW_p= 8223.68421052631
##$SYMM= 0
##$S_DEV= 0
##$TDeff= 65536
##$TDoff= 0
##$TI= <>
##$TILT= no
##$TM1= 0
##$TM2= 0
##$TOPLEV= 0
##$USERP1= <user>
##$USERP2= <user>
##$USERP3= <user>
##$USERP4= <user>
##$USERP5= <user>
##$WDW= 1
##$XDIM= 32768
##$YMAX_p= 445649981
##$YMIN_p= -691090
##$CURPLOT= <Network HP LaserJet P1505>
##$CURPRIN= <$Network HP LaserJet P1505>
##$DFORMAT= <normdp>
##$LAYOUT= <+/1D_H.xwp>
##$LFORMAT= <normlp>
##$PFORMAT= <normpl>
##$SURQMSG= 1
$$ End of Bruker specific parameters
$$ ---------------------------------
##NTUPLES= NMR SPECTRUM
##VAR_NAME=  FREQUENCY,     SPECTRUM/REAL,   SPECTRUM/IMAG
##SYMBOL=    X,             R,               I
##VAR_TYPE=  INDEPENDENT,   DEPENDENT,       DEPENDENT
##VAR_FORM=  AFFN,          ASDF,            ASDF
##VAR_DIM=   32768,         32768,           32768
##UNITS=     HZ,            ARBITRARY UNITS, ARBITRARY UNITS
##FACTOR=    0.250966925370066, 1,           1
##FIRST=     8223.43324360094, -102063,      -186019
##LAST=      0,             -232118,         -142550
##MIN=       0,             -691090,         0
##MAX=       8223.43324360094, 445649981,    0
$$ Real data points
##PAGE= N=1
##DATA TABLE= (X++(R..R)), XYDATA
$$ [...]
$$ plain form
19557 -122755 -172413 -211627 190665 186822 163281 -75570 -178573 -105816 -207954 -101479 -224777
19546 -224777 98928 253426 -172178 -79556 77829 1904 284085 154366 18334 -247527 16988
19534 -100855 -82663 170747 -96983 85712 28059 126029 -94973 154835 -105584 59726 -142439
19522 60559 79536 39833 -7635 -274240 22809 -278660 -108788 78325 -152228 -178128 -154057
19511 -154057 -269435 -23634 -132082 -199989 -401121 188861 -227272 -175033 -94452 145008
19500 51137 -317531 -539139 -41896 -18418 -34315 -457931 48676 12596 -170365 48033 94454
19489 94454 -42609 84576 -161633 -199368 46655 -128601 -5072 -158418 69173 -37568 -148223
19478 -148223 170334 -166648 -20447 -317164 29249 -219647 5751 -74356 363144 98320 64541
$$ packed form
19557a22755m9658l9214A90665l843k3541g5570j03003P2757j02138a01479j23298
19546b24777I8928J54498a72178g9556G7829A904K82181j29719A8334b47527A6988
19534a00855J8192A70747i6983H5712B8059R7970i4973A54835a05584E9726a42439
19522F0559J8977l9703g635k66605B2809b78660a08788G8325a52228k5900K4071
19511a54057j15378b3634j08448o7907k01132A88861b27272N2239Q0581A45008
19500E1137c17531k21608d1896a8418j5897m23616D8676A2596a70365D8033M6421
19489I4454d2609H4576a61633l7735D6655a28601e072j53346F9173c7568j10655
19478a48223A70334a66648b0447k96717B9249b19647E751g4356C63144I8320l3779
$$ plain form
19467 64541 -170876 -285138 -174779 -407739 -54414 -155357 60278 -77652 -58619 -116716 116496
19455 -203960 264426 -87123 -12483 150376 5127 -134192 233025 83059 33736 11522 -56383
19443 42827 169394 -118341 -323436 20939 76036 127998 -49153 27187 -35790 -193249 -148187
19432 -148187 255345 32134 -148849 24210 -114535 -85167 5979 -196945 -110797 -224877 51771
19420 -211208 110934 -59935 93070 59577 -169780 -261530 -30848 -62892 -159655 -303091 47417
19408 -5979 -14842 -61120 -8747 26445 -152353 -51341 -95533 -121900 -263162 -338566 -157632 -357192
19396 -357192 -206584 -393502 168240 182089 -37976 -128678 -55617 -19479 -9150 225479 209010
19385 209010 -110885 -270571 83069 -197050 -163282 -174905 -162688 -151871 -181147 63710 146832
$$ packed form
19467F4541a70876j14262J10359k32960e4414j00943F0278g7652J9033n8097A16496
19455b03960B64426h7123a2483A50376E127a34192B33025H3059C3736A1522e6383
19443D2827J26567a18341k05095B0939N5097N1962d9153B7187c5790j57459M5062
19432a48187B55345C2134a48849B4210a14535K9368E979a96945Q6148j14080E1771
19420b11208A10934e9935I3070l3493a69780r1750c0848l2044r6763j43436D7417
19408e979q863m6278h747B6445a52353e1341m4192k6367j41262p5404a57632j99560
19396c57192J50608j86918A68240J3849c7976r0702e5617a9479i150B25479j6469
19385B09010a10885j59686H3069a97050L3768j1623J2217J0817k9276F3710Q3122
$$ plain form
19374 146832 -49964 118835 113328 -377797 88786 -116355 50088 -300437 -12219 -50711 -69000
19363 -69000 -12798 -12255 -300288 -236205 -41964 62194 219586 218017 -195329 130617 -61276
19351 38238 -151967 275113 -460826 132394 -257375 -121954 -95599 -116333 -64901 -146332
19341 -146332 -37207 30751 -82168 208562 102468 277238 9681 -114183 -260484 -180281 -148846
19330 -148846 4959 -173653 -279879 93179 -8115 38048 215130 -58945 33036 -297002 -193655
19319 -193655 921 -190760 -23594 136838 109619 74707 69082 -347502 59784 -217198 209861
19307 -511331 -70872 -98098 159458 -75162 157296 -181151 -101872 -433329 -222250 -153824
19297 -153824 105107 -210709 80553 -178682 223557 -132635 93344 -236760 76873 12140
$$ packed form
19374A46832d9964A18835n507c77797H8786a16355E0088c00437a2219l8492j8289
19363f9000a2798N43k88033O4083d1964F2194J57392j569a95329A30617f1276
19351C8238a51967B75113d60826A32394b57375a21954K6355k0734N1432q1431
19341a46332c7207C0751h2168B08562A02468J74770I681a14183j46301Q0203L1435
19330a48846D959a73653j06226I3179h115C8048J77082e8945C3036b97002J03347
19319a93655I21a90760b3594A36838k7219l4912n625c47502E9784b17198B09861
19307e11331g0872k7226A59458g5162A57296a81151P9279l31457K11079O8426
19297a53824A05107b10709H0553a78682B23557a32635I3344b36760G6873A2140
$$ plain form
19286 39526 181549 -140491 87978 -122790 -216028 -153837 -382060 9575 -128859 -248884 -132525
19275 -132525 -99295 149714 -369024 -101567 -43848 22095 -312428 -394284 -124266 -162444
19265 -162444 127031 195228 -70738 12522 134390 -509397 -364849 -27198 -155428 5458 98389
19254 98389 202981 173898 117857 -69743 129322 95977 -289808 80188 18889 80965 -18658
19242 -303346 -458572 -95441 12944 118670 -51687 95335 -176854 57889 -147951 167291
19231 86986 -74662 -61590 319554 -2110 -168530 1467 198560 -346594 -119101 -92812 -271850
19220 -271850 -429562 -96926 4139 -40633 -67473 -219482 -80856 -289388 30185 -124953 -66409
19209 -66409 44919 33222 -101958 -94560 -320172 -295682 -217909 -279005 -85931 -141601 88309
$$ packed form
19286C9526J42023a40491H7978a22790r3238O2191k28223I575a28859j20025J16359
19275a32525L3230A49714c69024a01567d3848B2095c12428q1856a24266l8178
19265a62444A27031O8197g0738A2522J21868e09397J44548b7198j28230E458R2931
19254I8389J04592k9083n6041f9743A29322l3345b89808H0188A8889O2076a8658
19242c03346j55226i5441A2944J05726e1687I5335a76854E7889a47951A67291
19231H6986g4662J3072C19554b110j66420A467J97093c46594a19101K6289j79038
19220b71850j57712i6926D139d0633k6840j52009h0856k08532C0185a24953N8544
19209f6409D4919j1697a01958P398k25612K4490P7773o1096h5931n5670H8309
$$ plain form
19197 -3309 -122140 109213 -88784 121887 36337 46070 -323921 -12881 -180727 -10967 -89813
19186 -89813 -66142 -347688 -36626 -119388 73189 19563 160896 -57035 -93724 -157334 53523
19174 -73064 -58375 -111355 152721 -113893 -233584 106454 -115128 -29235 -5526 -72223 -275746
19163 -275746 66988 -4299 -126869 41282 49650 -176777 47532 36385 -19098 -91210 -441663
19152 -441663 -176631 204665 411879 -315302 24657 -158718 -160130 -259722 114902 -304178
19141 -343824 60175 -43442 123623 223397 102193 -341042 -195073 -26920 -52747 50009 -137912
19129 -338648 306626 -226894 -205464 167341 -58680 -205841 32119 -18070 63348 -69985 -192551
19118 -192551 -106886 -161024 62435 -29571 313361 -193763 -29872 76157 -1752 -161892 -188004
$$ packed form
19197c309j18831A09213h8784A21887C6337R733c23921a2881j67846a0967p8846
19186h9813K3671k81546c6626q2762G3189A9563J41333e7035l6689o3610E3523
19174g3064J4689n2980A52721a13893j19691A06454a15128b9235e526o6697k03523
19163b75746F6988d299j22570D1282Q368a76777D7532j1147a9098p2112l50453
19152d41663a76631B04665K07214c15302B4657a58718j412r9592A14902c04178
19141c43824F0175d3442A23623R9774A02193c41042J45969b6920k5827E0009a37912
19129c38648C06626b26894K1430A67341e8680j47161C2119a8070F3348f9985j22566
19118a92551Q5665n4138F2435b9571C13361a93763b9872G6157a752j60140k6112
$$ plain form
19107 -188004 -500434 33830 132661 -119957 -152004 -45269 159049 -43856 -144531 -3676 -182477
19096 -182477 32958 42315 -128398 -43436 -282268 79040 44220 104101 -599042 -412148 254617
19084 -12099 -250353 91952 37183 -184880 -18169 -259421 -36413 410792 235390 166309 -4955
19072 144228 -321708 59839 -189467 -198150 196643 200809 53407 107353 23615 7072 126852
19061 126852 23802 -13843 -90643 3267 153202 -34730 -113191 -109476 95236 -448265 -82822
19049 -40011 275775 52079 -327446 49486 -99556 -30507 -109367 351542 95180 -138539 13938
19037 57552 219447 98499 -32583 -280980 252815 -258051 -318321 -70880 -2582 -46737 -55196
19026 -55196 97066 -50812 323581 259586 96242 -135419 -72777 110800 -438542 78170 44856
$$ packed form
19107a88004l12430C3830R8831a19957l2047d5269A59049d3856j00675c676j78801
19096a82477C2958R357a28398d3436k38832G9040l4820N9881e99042J86894B54617
19084a2099k38254I1952C7183a84880a8169k41252c6413D10792j75402o9081d955
19072A44228c21708E9839a89467q683A96643M166E3407N3946B3615G072J19780
19061A26852B3802a3843p6800C267J49935c4730p8461L715I5236d48265h2822
19049d0011B75775E2079c27446D9486i9556c0507p8860C51542I5180a38539A3938
19037E7552J61895I8499c2583k48397B52815b58051o0270g0880b582m4155q459
19026e5196I7066e0812C23581o3995I6242a35419O2642A10800d38542G8170l3314
$$ plain form
19015 44856 37939 -71435 -45525 -4925 -142206 -101206 -9703 -58091 -127773 -242572 -149902 -237927
19003 -237927 125872 241575 19042 44740 317817 -20875 149432 29912 -17078 110334
18992 -31060 233422 -233277 -288918 -123349 117438 18960 -164809 -356841 -34322 -34360 -303585
18981 -303585 -43156 31746 -306184 -409520 -96025 -158368 -129747 122952 -101271 -171463 -130520
18970 -130520 95831 -64963 -10023 -292105 -335649 -143858 -171007 -372729 -412799 154919 200102
18959 200102 17624 -151706 127961 156548 95988 -159037 -476328 -85961 -64367 29172 49957
18948 49957 157695 136812 -245366 -69456 194155 -177585 -186157 102041 -79067 -17955 -298640
18937 -298640 244651 180458 61865 -241390 1282 -15132 -69044 -73065 -329190 -177494 159400
$$ packed form
19015D4856o917g1435K5910d925j37281M1000i703m8388o9682j14799R2670q8025
19003b37927A25872J15703A9042K5698K73077b0875A49432B9912a7078A10334
18992c1060B33422b33277n5641a23349A17438A8960a64809j92032c4322l8k69225
18981c03585d3156C1746c06184j03336i6025o2343K8621A22952a01271p0192M0943
18970a30520I5831f4963a0023k82082m3544a43858k7149k01722m0070A54919M5183
18959B00102A7624a51706A27961K8587o0560a59037l17291h5961K1594B9172K0785
18948D9957J07738k0883b45366f9456A94155a77585q572A02041g9067a7955k80685
18937b98640B44651o4193F1865b41390A282a5132n3912m021k56125J51696A59400
$$ plain form
18925 -136299 -176512 22016 151996 11593 -194056 65301 17358 148501 -79723 -20220 -225415
18914 -225415 -347826 -113601 998 -321080 -257441 -137091 -54234 181967 185212 107971 398196
18903 398196 23055 -17762 -144886 -43331 177464 133272 154865 -242123 18945 196471 -146569
18891 -75595 -61236 140313 -197010 -8843 -114899 10035 -211853 22040 -64748 -339444 -208684
18880 -208684 78239 -127233 -289176 185573 92850 39339 -136937 -9 114402 169417 112178
18869 112178 -104815 -157615 -63346 12887 -146485 162134 -146012 237395 -61925 244332
18858 -163978 -229009 -242767 15456 -170486 -36093 -82672 -98594 -94774 -204786 -45695 -63581
18847 -63581 185883 90371 -85441 -89809 95735 -202171 -217375 -144805 -16514 -168997 -151630
$$ packed form
18925a36299m0213B2016J29980A1593a94056F5301A7358J31143g9723b0220k05195
18914b25415j22411a13601I98c21080O3639J20350e4234A81967L245p7241K90225
18903C98196B3055a7762j27124d3331A77464m4192K1593b42123A8945J77526a46569
18891g5595J4359A40313a97010h843j06056A0035b11853B2040f4748k74696J30760
18880b08684G8239a27233j61943A85573r2723C9339a36937iA14402N5015n7239
18869A12178a04815n2800f3346A2887a46485A62134a46012B37395f1925B44332
18858a63978o5031j3758A5456a70486c6093m6579j5922L820j10012d5695j7886
18847f3581A85883I0371h5441m368I5735b02171j5204P2570a6514j52483J7367
$$ plain form
18836 -151630 -216929 -113502 -99245 96425 49487 23710 -74565 -9466 -62634 -457797 -232188
18825 -232188 322497 60712 104586 -260467 130721 245067 -39681 171941 10042 -123381
18814 116591 -215977 60534 66642 33457 214506 -50369 140558 -74682 -3702 -162077 -236423
18803 -236423 -12038 152029 -173266 46033 -2862 -125520 56063 -78796 -162058 -120400 -276940
18792 -276940 -140404 -45089 -36543 204616 -118218 -178993 268877 133974 53880 -327117
18781 -149360 145138 221455 -136518 268165 -7746 -95866 66139 -81839 -13239 -27893 -147203
18770 -147203 -123117 -75331 -4892 -62734 -309770 -102481 -109489 79194 -66492 -482615 83111
18758 -244677 -167537 -295347 -218427 -230566 -212087 650 -75153 -289966 247438 -129320 -174004
$$ packed form
18836a51630o5299J03427J4257I6425m6938B3710g4565i466n3168l95163K25609
18825b32188C22497F0712M3874b60467A30721J14346c9681A71941A0042a23381
18814A16591b15977F0534O108l3185J81049e0369A40558g4682c702j58375p4346
18803b36423a2038A52029a73266D6033b862j22658E6063g8796q3262M1658j56540
18792b76940J36536d5089Q546B04616a18218o0775B68877A33974E3880c27117
18781a49360A45138P6317a36518B68165g746q8120F6139h1839a3239j4654j19310
18770a47203K4086M7786d892n7842k47036a02481p008G9194f6492m16123H3111
18758b44677P7140j27810P6920j2139J8479F50g5153k14813B47438a29320m4684
$$ plain form
18747 -174004 -218929 195329 -98413 -4010 -116758 -252329 -330365 -144241 -150898 -173151 86143
18735 -153953 -63000 -77590 107425 -32088 -38941 -218344 -187587 -226365 -207751 97609 -21693
18723 13319 -200713 -249684 -145314 117386 54699 -150674 124198 -99979 -425445 79360
18712 -66862 -161992 -164394 -144920 -90423 51811 92915 -145067 -118722 -281585 211829 324320
18701 324320 -366807 103534 -251466 -347644 120603 -204377 -39416 13356 -211824 253126
18690 -97415 -271619 10736 -313428 9762 69403 127082 -241593 -161468 63925 52622 -157618
18678 -73469 -95651 -65373 -110968 -59656 106608 -135452 146269 -285231 -165115 336185
18667 79216 -223024 -334637 -122022 323888 -47606 -152335 242640 121872 -207402 -132996
$$ packed form
18747a74004m4925A95329i8413d010j12748j35571p8036a44241o657k2253H6143
18735a53953f3000j4590A07425c2088o853j79403L0757l8778J8614I7609b1693
18723A3319b00713m8971J04370A17386E4699a50674A24198i9979l25466G9360
18712f6862r5130k402J9474N4497E1811M1104a45067K6345j62863B11829J12491
18701C24320c66807A03534b51466r6178A20603b04377c9416A3356b11824B53126
18690i7415j74204A0736c13428I762N9641N7679b41593Q0125F3925j1303a57618
18678g3469k2182L0278m5595N1312A06608a35452A46269b85231J20116C36185
18667G9216b23024j11613a22022C23888d7606j04729B42640j20768b07402P4406
$$ plain form
18657 -132996 -57489 -115558 110857 -298936 182663 101178 -47715 -390664 -413709 103597
18646 -387526 -91390 -439275 -42837 -143755 -71673 -108276 67071 -140391 -46137 -115953 156003
18634 -31665 -74704 39839 84341 41973 -382653 -103597 23560 -214394 121774 -91497 -57307
18623 -57307 219311 -55662 -159867 71305 -132415 -86199 -233288 274916 -138299 -139026 -64377
18611 -311363 44974 -105979 331366 -11766 -42824 134545 164831 313822 -331733 196675
18600 -157879 -118735 -218953 90101 115369 -128238 191032 -96724 2730 23832 25604 70397
18589 70397 3053 -29179 -171923 -198421 -136650 17089 399956 77392 164430 -223430 -97871
18577 -281993 -351303 -197249 29867 156983 -297519 -122215 -165853 -75228 -83278 -37750 -220411
$$ packed form
18657a32996e7489n8069A10857b98936A82663q1485d7715l42949k3045A03597
18646c87526i1390l47885d2837j00918g1673l6603F7071a40391d6137o9816A56003
18634c1665m3039C9839M4502D1973c82653a03597B3560b14394A21774i1497L4190
18623e7307B19311e5662j04205G1305a32415M6216j47089B74916a38299p27f4377
18611c11363D4974a05979C31366a1766l1058A34545L0286J48991c31733A96675
18600a57879L9144j00218I0101K5268a28238A91032i6724B730K1102J772M4793
18589G0397C053b9179j42744k6498O1771A7089L82867G7392Q7038b23430i7871
18577b81993o9310J54054B9867J27116b97519a22215m3638g5228q050c7750j82661
$$ plain form
18566 -220411 -206167 -287858 -360733 6020 -187565 138128 -166485 -166888 -376231 -41875 146909
18554 188799 326278 -394907 -180529 81242 -305445 -16377 -245999 158759 -388907 -33028
18543 -292224 -116636 -88391 124156 155620 -562913 1305 95971 -144351 -102104 78732 -67325
18531 -288356 57162 -305321 21236 -141091 158060 -196363 -201882 -183064 -119891 -159070 21359
18519 -93509 44242 128820 -129741 82617 225855 -8328 110265 -276904 -198808 -143145 -31998
18507 117053 -190745 -112908 -16876 -236192 43747 -41221 43123 -86372 -40806 -162233 -289243
18496 -289243 157876 -23598 -349731 96291 -268888 -155391 -190318 -114322 -37548 -104064 -20743
18484 25714 31684 -118198 -350291 152183 -113801 149622 -106614 -143812 36778 -154313
$$ packed form
18566b20411J4244q1691p2875F020a87565A38128a66485m03k09343d1875A46909
18554A88799J37479c94907a80529H1242c05445a6377k29622A58759c88907c3028
18543b92224a16636K8245A24156L1464e62913A305R4666a44351M2247G8732f7325
18531b88356E7162c05321B1236a41091A58060a96363n519J8818O3173l9179B1359
18519i3509D4242Q4578a29741H2617J43238h328A10265b76904P8096N5663c1998
18507A17053a90745P7837a6876k19316D3747d1221D3123h6372d0806j21427j27010
18496b89243A57876b3598l26133I6291b68888J13497l4927P5996c7548o6516b0743
18484B5714N970a18198k32093A52183a13801A49622a06614l7198C6778a54313
$$ plain form
18473 2080 24347 1155 78845 -216343 -255104 165056 -56730 -3958 -167020 -32937 25133 -394288
18460 -186619 -247582 92518 -11632 -494430 -189736 92850 -47355 -10373 9772 -5652 -77728
18449 -77728 -85473 -318518 -162550 100493 242664 118251 -13764 -216067 21058 -116553
18438 -100649 104745 98341 -125628 -21768 88726 -51139 39454 240721 -138005 -81524 42060
18426 -96477 -51056 -148737 -75280 -165121 95977 -302448 -266385 -13384 34992 -24164 317795
18414 -197979 -173663 -177280 -152834 -116736 121191 9193 96754 -190681 -49772 -231015 223095
18402 -66830 -87192 46948 93537 85435 -21029 -267651 -176817 114060 54913 264286 146990
18391 146990 13040 -34247 -94762 62414 -124143 41037 -14921 -59965 467 128273 133347 -131934
$$ packed form
18473B080K2267A155P7690b16343l8761A65056e6730c958j63062c2937B5133c94288
18460a86619o0963I2518a1632m82798a89736I2850d7355a0373I772e652p2076
18449g7728p745k33045J55968A00493J42171A18251a3764k02303B1058a16553
18438a00649A04745o404a25628b1768H8726e1139C9454K01267a38005N6481D2060
18426i6477M5421r7681P3457q9841I5977c02448L6063a3384C4992b4164C17795
18414a97979K4316l617K4446L6098A21191I193Q7561a90681d9772j81243B23095
18402f6830k0362D6948M6589q102b1029k46622R0834A14060E4913K09373j17296
18391A46990A3040c4247o0515F2414a24143D1037a4921m5044D67J27806N074a31934
$$ plain form
18378 -28558 264960 -109191 -11046 -293459 40356 208148 140532 -245400 49762 10211 36638
18367 36638 121529 291596 234336 -376840 63808 234928 -87221 -224503 2376 -182078 92415
18355 24797 287874 -32031 37697 33177 18455 -140475 64326 -204294 40731 180767 -34915
18343 -386323 112499 -207031 -110188 65118 75810 201389 -31296 -238028 174735 -347696
18332 189446 303743 -107507 -69442 196282 -256628 208696 -38307 -381991 -45609 -289259
18322 -289259 56626 8279 -137826 -297213 10929 -166955 217449 -101495 -93103 -43291 16184
18310 59719 -34631 -196997 10363 83978 37154 113928 51144 -359409 -134335 -32952 -157538
18299 -157538 241622 64436 95985 41881 -9761 38037 375673 -56133 -416017 -276977 88081
$$ packed form
18378b8558B64960a09191a1046k82413D0356J67792o7616b45400D9762A0211K6427
18367C6638Q4891J70067n7260c76840F3808J71120h7221j37282B376a82078I2415
18355B4797K63077c2031C7697m520j4722a40475F4326b04294D0731J40036c4915
18343c86323A12499b07031R6843F5118J0692J25579c1296k06732A74735c47696
18332A89446J14297a07507L8065A96282b56628B08696c8307l43684d5609k43650
18322b89259E6626H279a37826j59387A0929a66955B17449a01495Q392d3291A6184
18310E9719c4631j62366A0363P3615C7154P6774E1144c59409a34335c2952j24586
18299a57538B41622F4436L1549D1881i761C8037L37636e6133l59884J39040H8081
$$ plain form
18287 203202 132701 -55867 130110 411699 132256 -249794 -295574 -132393 -306952 -138204
18276 -61173 -9736 81494 -85512 -185039 -159592 154305 -51879 231028 31356 -15262 54137
18264 -79003 182306 -253736 149653 160739 74585 -267492 -160675 -202144 -335704 16887
18253 -108457 -215692 -84727 169861 -314199 -73669 -139872 -121567 -155992 -355063 -1624 -204362
18242 -204362 76870 1400 -176223 -91906 -354501 -245436 -330445 21952 -50051 115845 -30177
18230 -294769 -24671 12952 3741 -132717 -170306 -125721 167473 179164 10459 -8077 -326232
18219 -326232 -344540 105665 -206870 91777 -53492 178680 31575 -8540 43774 54823 89434
18208 89434 8005 377444 -118692 132803 -185519 80231 -195459 -12939 -266450 -84628 -203566
$$ packed form
18287B03202p0501e5867A30110K81589A32256b49794m5780a32393j74559a38204
18276f1173i736H1494h5512r9527K5447A54305e1879B31028C1356a5262E4137
18264g9003A82306b53736A49653J1086G4585b67492J06817m1469j33560A6887
18253a08457j07235h4727A69861c14199g3669o6203J8305l4425j99071a624k02738
18242b04362G6870A400a76223Q4317k62595J09065q5009B1952e0051A15845c0177
18230b94769b4671A2952C741a32717l7589M4585A67473J1691A0459h077l18155
18219c26232j8308A05665b06870I1777e3492A78680C1575h540D3774J1049L4611
18208H9434H005L69439a18692A32803a85519H0231a95459a2939k53511h4628j18938
$$ plain form
18197 -203566 104238 -356284 25339 -265406 -118891 20744 -193899 -145766 42501 76614
18187 76614 99273 387372 -148157 -41760 206972 -239648 -169683 -147773 -19219 -25764 -105839
18176 -105839 202783 -181356 10028 -79390 -19004 -50064 -201152 129774 -123524 5195 -39216
18164 -230147 -210861 33784 -249558 -225537 -10327 157940 -188035 -138683 -103100 -176590 -219758
18153 -219758 -228704 4841 148107 -36509 5433 46535 138946 182353 24881 183822 -39547 197237
18140 85826 83413 -152099 -46134 -173833 67345 -5369 97575 122435 -64603 -313006 -175119
18129 -175119 -42146 58828 225027 127546 -145260 648 -65044 114907 158879 -110912 -199312
18118 -199312 210004 150896 -207725 -69923 -304020 39061 45219 -229129 74050 -19723 180186
$$ packed form
18197b03566A04238c56284B5339b65406a18891B0744a93899M8133D2501L4113
18187G6614K2659K88099a48157d1760B06972b39648O9965K1910a9219o545q0075
18176a05839B02783a81356A0028g9390a9004l1060j51088A29774a23524E195c9216
18164b30147J9286C3784b49558K4021a0327A57940a88035M9352L5583p3490m3168
18153b19758q946D841J43266c6509E433M1102R2411M3407B4881J58941c9547A97237
18140H5826k413a52099d6134j27699F7345e369I7575K4860f4603k48403J37887
18129a75119d2146E8828J66199r7481a45260F48f5044A14907M3972a10912q8400
18118a99312B10004n9108b07725f9923k34097C9061O158b29129G4050a9723A80186
$$ plain form
18106 91515 -38766 14238 37167 88155 191259 -44382 -88294 373920 120954 12880 119359
18095 119359 -115714 -117761 68538 63448 -118094 18998 156650 54506 -34750 13908 -47993
18083 -76572 -207225 100809 359496 -215752 316616 172718 -7836 -125452 -39928 -385957
18073 -385957 -228272 -377219 -102460 -253922 -46846 -267611 57394 -231845 233083 37230
18062 -26588 28474 -4965 -185882 126375 -56288 -165704 29568 -171610 332774 99000 196322
18051 196322 -500417 -110839 -73282 -508571 -284664 -104465 115145 247628 -128955 -47836
18040 -151522 187454 62970 -337469 56360 -49440 175778 105634 83668 62410 132701 -64061
18028 -28102 12346 -109075 -53506 -82075 -118282 -108550 398083 -42895 -110851 14247 144154
$$ packed form
18106I1515c8766A4238K2929N0988J03104d4382m3912C73920A20954A2880J06479
18095A19359a15714k047F8538n090a18094A8998J37652E4506c4750A3908d7993
18083g6572j30653A00809K58687b15752C16616j43898g836j17616c9928l46029
18073c85957J57685j48947a02460j51462d6846k20765E7394b31845B33083C7230
18062b6588B8474d965j80917A26375e6288j09416B9568a71610C32774I9000R7322
18051A96322e00417a10839L7557m35289K23907a04465A15145J32483a28955d7836
18040a51522A87454F2970c37469E6360d9440A75778p0144k1966k1258P0291f4061
18028b8102A2346a09075e3506k8569l6207R732C98083d2895o7956A4247J29907
$$ plain form
18017 144154 29797 -158761 -96237 -225080 -47690 -17134 -139154 36618 208293 -223494
18006 -173968 -206881 -8746 -95056 139021 -202404 37144 21619 84240 122650 13405 -191638
17994 -225309 -80320 -83429 -237801 -101387 -120901 -236785 -30668 -82643 23939 -44079 -132040
17983 -132040 264077 284688 120655 499355 52512 47463 -85644 90955 -110129 -106275 -193782
17972 -193782 327683 -235443 85444 -360358 61914 -80280 -193504 257157 206158 -146794
17961 267976 -89808 -123076 -235300 -34303 -9345 -211685 -139233 19301 -34121 20762 271742
17950 271742 -134841 -316840 99116 220609 92263 135821 184554 -16391 -157453 235556
17939 -211585 128897 41133 16028 -131546 26144 -212992 130996 64414 9915 -148509 -175812
$$ packed form
18017A44154B9797a58761O2524j28843d7690a7134j22020C6618J71675b23494
18006a73968l2913h746q6310A39021b02404C7144j5525O2621L8410A3405a91638
17994b25309h0320l109j54372a01387j9514j15884c0668n1975B3939d4079q7961
17983a32040B64077K0611A20655L78700E2512n049h5644I0955a10129L854q7507
17972a93782C27683b35443H5444c60358F1914h0280j13224B57157n0999a46794
17961B67976h9808l3268j12224c4303i345k02340P2452A9301c4121B0762K50980
17950B71742a34841j81999I9116J21493I2263M3558M8733a6391j41062B35556
17939b11585A28897D1133A6028a31546B6144b12992A30996F4414I915a48509k7303
$$ plain form
17928 -175812 -105863 -373888 193527 -68269 47087 -152825 50171 128064 -103897 -23248 -107580
17917 -107580 -42026 -29785 -75054 195292 134666 -16970 -185853 82007 -588652 119493 -354019
17905 153402 553 -289754 38870 56317 -60546 -41416 -51796 62855 -370260 -123560 -39704
17893 -47587 141900 -30397 15437 -132306 137911 -91757 176522 -174652 -136928 -383575
17883 -383575 -138713 -52084 82411 -231585 33571 -321187 349151 -128331 -18084 -248649
17873 -248649 121380 101941 -73430 -122485 -173806 -114932 -130085 -174914 156337 270193 -211230
17861 22044 -138342 -7942 10576 238336 -134320 109560 179781 -140846 134569 306069
17851 306069 -141005 104766 -331908 -36244 347040 79799 -309420 30754 441355 -408143
$$ packed form
17928a75812O9949k68025A93527f8269D7087a52825E0171P7893a03897b3248q4332
17917a07580d2026J2241m5269A95292o0626a6970j68883H2007e88652A19493c54019
17905A53402E53b89754C8870J7447f0546J9130j0380F2855c70260a23560c9704
17893d7587A41900c0397A5437a32306A37911i1757A76522a74652L7724k46647
17883c83575a38713e2084H2411b31585C3571c21187C49151a28331a8084k30565
17873b48649A21380j9439g3430m9055n1321N8874j5153m4829A56337J13856b11230
17861B2044a38342g942A0576K27760a34320A09560P0221a40846A34569J71500
17851C06069a41005A04766c31908c6244C47040G9799c09420C0754M10601d08143
$$ plain form
17840 -153903 -73728 -64768 -28419 -459954 -139353 159100 10460 440113 323781 -27365 -116785
17829 -116785 80334 177138 8983 -499490 -1438 39781 -57737 -466276 -33880 464822 -223211
17817 25324 213007 -77861 -182582 -368628 164257 -133372 -115222 151000 -232085 -148948
17807 -148948 74939 -184221 -84452 -188892 -301382 -94233 15580 100386 -320607 -224075 -107814
17795 -53495 -82955 -89553 -283855 110233 72064 177567 -101188 54999 -280949 -59103 323738
17783 -167192 -123795 256328 55530 -208699 195242 -34749 234607 275715 -35912 151713
17772 -133234 21878 -95271 234727 -153452 16152 73958 -361701 69403 -142204 79566 -176720
17760 -252907 -287751 -15390 -258806 -152452 247932 223505 169656 -167626 -76177 14582 -122436
$$ packed form
17840a53903g3728Q960b8419m31535a39353A59100A0460M29653j16332b7365q9420
17829a16785H0334R6804H983d99490a438C9781e7737m08539c3880D64822b23211
17817B5324J87683g7861j04721j86046A64257a33372J8150A51000b32085Q3137
17807a48948G4939a84221h4452j04440j12490i4233A5580Q4806c20607R6532a07814
17795e3495k9460o598j94302A10233l8169J05503a01188E4999b80949e9103C23738
17783a67192M3397B56328E5530b08699A95242c4749B34607M1108c5912A51713
17772a33234B1878i5271B34727a53452A6152N7806c61701F9403a42204G9566a76720
17760b52907l4844a5390k43416J06354B47932k4427n3849a67626g6177A4582a22436
$$ plain form
17748 -20094 128059 -185193 -106442 107904 -115995 279685 -45420 27652 263847 -112529
17737 -320926 266160 -52939 -52882 -124686 170035 -30983 81650 110301 -68208 -203394 63432
17725 -57336 30072 107330 101807 195538 175997 51214 -194940 35883 -8795 57469 -26858 -69918
17713 -69918 155026 -406937 280173 15072 126641 69833 223151 37273 -174736 149474
17702 -242790 164177 68790 28597 100683 113379 -24934 92827 20073 126067 -75306 -69025
17691 -69025 -97425 265873 -60600 -93961 36138 -24312 47591 103210 504 35628 136534 208875
17679 208875 -131231 329703 81702 349330 -55459 -17205 -110124 -134529 370201 -245090
17668 131060 -152488 347091 15157 269161 -14583 207256 63174 233981 -237599 100068
$$ packed form
17748b0094A28059a85193P8751A07904a15995B79685d5420B7652K36195a12529
17737c20926B66160e2939N7p1804A70035c0983H1650K8651f8208j35186F3432
17725e7336C0072P7258n523R3731j9541E1214a94940C5883h795E7469b6858m3060
17713f9918A55026d06937B80173A5072J11569n6808J53318C7273a74736A49474
17702b42790A64177F8790B8597P2086J2696b4934I2827B0073J05994g5306O281
17691f9025k8400B65873f0600l3361C6138b4312D7591N5619E04L5124J00906P2341
17679B08875a31231C29703H1702K67628e5459a7205r2919k4405C70201b45090
17668A31060a52488C47091A5157K54004a4583B07256F3174J70807b37599A00068
$$ plain form
17657 -71242 -3355 -193776 -27420 -243288 -119155 -190123 -280686 -117285 -207840 327286 207888
17646 207888 186308 61764 257098 -33353 -141160 -102522 189957 -182355 526581 165461
17635 -70439 174510 -146454 70894 -57124 -217023 -139151 156774 -170621 -396641 10527
17624 -97592 148049 -297136 -109628 -156052 201465 -389080 5704 -111912 8362 99599 -25963
17612 109385 -22596 140706 -6229 6571 12918 -136994 -174058 125961 55598 54870 -13671 275938
17599 12548 -295595 33679 26311 462393 -88928 107668 322734 3071 297920 -34362 -113461
17588 -113461 53621 154380 51981 55223 -239917 -58997 100014 241731 68041 -73470 -14497
17576 3393 235975 3890 -160410 439526 -165260 -42261 42717 63955 152916 -107980 213304
$$ packed form
17657g1242c355j90421b7420k15868a19155p0968r0563a17285r0555C27286j19398
17646B07888k1580F1764J95334c3353j07807L8638A89957a82355E26581A65461
17635g0439A74510a46454G0894e7124j59899P7872A56774a70621k26020A0527
17624i7592A48049b97136a09628m6424B01465c89080E704a11912H362R1237b5963
17612A09385b2596A40706f229F571O347a36994l7064A25961E5598p28a3671B75938
17599A2548b95595C3679p368M36082h8928A07668K15066C071K94849c4362p9099
17588a13461E3621J00759E1981L242b39917e8997A00014J41717F8041g3470a4497
17576C393K32582C890a60410D39526a65260d2261D2717K1238Q8961a07980B13304
$$ plain form
17564 -32698 183291 16300 172592 -43381 -27964 90492 -170789 153074 87900 41366 51987
17553 51987 191565 37504 75101 74922 -28745 -91710 -13765 193716 -233738 105201 -38129
17541 -204996 166305 -11528 33114 313940 255984 66221 362870 57824 30890 35148 -117355
17529 -339759 -121702 -94893 59991 173830 341014 190876 259151 47448 387491 138670
17518 -256849 -233861 -144585 -222093 -179679 152973 17844 162221 1876 185903 -79698 59460
17506 -48909 13398 7560 52588 -19518 -138973 560301 121452 271302 334568 241842 -41037
17494 147858 275281 -74127 -170666 -70047 184102 -191454 299601 153619 -281347 244111
17483 177679 482913 38725 388432 58158 36063 -185351 245672 42480 -51556 67569 -168605
$$ packed form
17564c2698A83291A6300J56292d3381J5417I0492a70789A53074o5174D1366J0621
17553E1987J39578C7504L7597j79b8745o2965a3765A93716b33738A05201c8129
17541b04996A66305a1528C3114K80826n7956F6221K96649E7824k6934M258a17355
17529c39759a21702K6809E9991J13839J67184j50138O8275D7448L40043A38670
17518b56849K2988Q9276p7508M2414A52973A7844J44377A876J84027g9698E9460
17506d8909A3398n838M5028a9518j19455E60301A21452J49850O3266r2726d1037
17494A47858J27423g4127r6539g0047A84102a91454B99601j45982b81347B44111
17483A77679L05234C8725L49707E8158k2095a85351B45672D2480e1556F7569a68605
$$ plain form
17471 272199 164807 27176 353923 69796 -89955 42866 41794 428526 -63951 -123063 -208331
17460 -208331 -38334 -126848 -186409 230430 470945 220425 -12256 249202 291167 74344 152823
17449 152823 104811 204090 88080 495364 219268 410702 2293 97924 109585 187212 312294
17438 312294 195431 -5143 41806 43016 330824 298735 15909 118756 191370 203329 199836
17427 199836 158025 322442 -5676 261268 191346 -3448 148887 475442 356925 212785 97058
17415 180581 72143 -30262 245251 297632 165940 296976 63204 253368 53938 31141 4874
17403 -6462 117343 96564 52532 301640 47525 310009 -235985 -85623 445412 -230107 170287
17391 88146 23985 -46681 231379 344098 30875 -91566 -27223 -24203 -91426 416427 250987
$$ packed form
17471B72199j07392B7176L26747F9796h9955D2866j072L86732f3951n9112q5268
17460b08331c8334q8514n9561B30430K40515B20425a2256B49202M1965G4344P8479
17449A52823m8012R9279H8080M07284B19268J91434B293R5631J1661P7627J25082
17438C12294j16863e143D1806J210K87808l2089A5909J02847P2614J1959l493
17427A99836m1811J64417e676B61268o9922c448A48887L26555j18517j44140I7058
17415A80581G2143c0262B45251N2381j31692J31036F3204J90164E3938k2797D874
17403f462A17343k0779m4032K49108D7525K62484b35985h5623D45412b30107A70287
17391H8146B3985d6681B31379J12719C0875i1566b7223L020o7223D16427j65440
$$ plain form
17380 250987 -13427 274341 -47568 354888 68698 200704 70734 12247 552 76518 166672
17369 166672 386098 95888 317695 71645 222007 715907 104347 170619 148374 96118
17359 96118 -61451 -210234 94048 -339165 282239 105308 -28364 -19794 430436 508104 225357
17347 505386 298754 155948 338340 1424 193259 227309 -5988 156537 87610 -69445 183962
17335 65702 300939 134751 298907 26618 -166395 41781 106924 81996 -98162 94525 269132
17324 269132 12222 141330 118939 -61638 73222 150920 320671 45296 146988 194175 110554
17313 110554 221043 361917 119023 173939 35705 -13267 -8202 187533 382804 173105
17302 311644 24010 256958 127776 19405 103909 194734 189865 82458 231086 291915 -66651
$$ packed form
17380B50987a3427B74341d7568C54888F8698J32006G0734A2247E52P5966R0154
17369A66672K19426I5888K21807G1645J50362M93900A04347O6272k2245n2256
17359I6118f1451j48783I4048c39165B82239A05308b8364Q570D30436P7668B25357
17347E05386k06632j42806J82392A424J91835L4050e988A56537o8927f9445A83962
17335F5702K35237A34751J64156B6618a66395D1781O5143k4928i8162I4525J74607
17324B69132A2222J29108k2391f1638G3222P7698J69751D5296J01692M7187q3621
17313A10554J10489J40874A19023N4916C5705a3267N065A87533J95271A73105
17302C11644B4010K32948A27776A9405Q4504R0825m869H2458J48628O0829f6651
$$ plain form
17290 393153 221837 386097 5341 -259702 246521 -194354 346014 -231853 119313 -60592
17279 -18867 104604 73873 177820 363394 55559 54428 63497 123818 75230 -57815 126814
17267 161391 259530 349577 31531 351564 -201125 124280 -42544 75097 231367 168713 -206732
17255 337216 403122 235906 71789 148574 295433 2867 142677 -85346 297796 -209528 33439
17243 140936 110870 218732 375480 57225 248649 374473 213052 335889 20970 119942
17233 119942 14120 275691 -55025 240851 122654 147798 71069 -13517 345458 241746
17223 241746 495886 -160415 354988 256448 378517 242439 304338 -84183 220137 -105831
17212 -79596 -32480 -62718 200761 169859 131957 170090 192358 346584 186611 175818 337535
$$ packed form
17290C93153j71316J64260E341b59702B46521a94354C46014b31853A19313f0592
17279a8867A04604l0731J03947J85574E5559j131R069O0321m8588e7815A26814
17267A61391R8139R0047C1531L20033b01125A24280d2544G5097J56270o2654b06732
17255C37216O5906j67216G1789P6785J46859B867J39810h5346B97796b09528C3439
17243A40936l0066J07862J56748E7225J91424J25824j61421J22837B0970R8972
17233A19942A4120K61571e5025B40851j18197K5144G1069a3517C45458j03712
17223B41746K54140a60415C54988r8540J22069j36078O1899h4183B20137a05831
17212g9596c2480l0238B00761l0902l7902L8133K2268J54226j59973j0793J61717
$$ plain form
17201 337535 65027 412263 79923 4644 590496 374544 308226 145714 251017 88546 36768
17189 1105 446524 495442 84488 184400 156202 424454 265546 -32165 238304 450844 175744
17177 384855 451357 338027 -15753 208463 171362 237012 446083 277228 283137 147550 -24926
17165 223371 288858 253953 -13390 168285 220956 227574 279204 -133522 151720 280938 145553
17154 145553 -41237 148047 55796 472662 339543 495329 209157 -53851 188727 263413
17144 263413 267908 397425 -31103 57144 321192 187542 328648 138568 75690 305748
17134 305748 266166 435298 494849 73301 458597 211848 438680 8215 278417 15848 155244
17123 155244 72971 349530 492730 308103 375791 658456 468014 254990 228435 357283
$$ packed form
17201C37535F5027L47236G9923D644N85852k15952o6318A45714J05303H8546C6768
17189A105M45419M8918H4488R9912k8198K68252j58908c2165B38304K12540A75744
17177C84855O6502j13330a5753B08463l7101O5650K09071j68855N909j35587b4926
17165B23371O5487l4905a3390A68285N2671O618N1630a33522A51720J29218j35385
17154A45553d1237A48047E5796M16866j33119J55786B09157e3851A88727P4686
17144B63413M495J29517c1103E7144K64048j33650J41106A38568o2878K30058
17134C05748l9582J69132N9551G3301L85296B11848K26832H215K70202A5848J39396
17123A55244G2971K76559J43200j84627O7688K82665j90442k13024k6555J28848
$$ plain form
17113 357283 221115 96150 168149 312699 -70033 311705 266794 375975 207857 355423
17103 355423 -105892 367185 307242 80844 75441 153810 231174 207676 38100 394226 275613
17092 275613 373158 259928 449047 392722 339215 290134 237970 -66441 3072 505924 419713
17081 419713 233382 284899 564192 354042 362228 754680 595840 709869 151942 388958
17071 388958 377546 366734 325531 337367 150024 385283 435582 417655 390187 598882 398273
17060 398273 291433 352970 365968 531527 396357 219051 377808 248413 543413 42862
17049 370674 780762 20756 411558 541514 293247 240276 639128 348468 753411 502200
17039 502200 329089 653268 309338 402406 553184 724433 326911 365209 365626 559118
$$ packed form
17113C57283j36168I6150P1999J44550g0033C11705m4911J09181j68118J47566
17103C55423a05892C67185n9943H0844n403P8369P7364k3498C8100L56126j18613
17092B75613R7545j13230J89119n6325n3507m9081n2164f6441C072N02852q6211
17081D19713j86331N1517K79293k10150Q186L92452j58840J14029A51942K37016
17071C88958j1412j0812m1203J1836A50024K35259N0299j7927k7468K08695k00609
17060C98273j06840O1537J2998J65559j35170j77306J58757j29395K95000D2862
17049C70674M10088B0756L90802J29956k48267n2971L98852k90660M04943k51211
17039E02200j73111L24179C09338R3068J50778J71249C26911L8298M17J93492
$$ plain form
17029 559118 553569 389509 518531 596745 139820 341928 296752 517282 753545 362778
17018 784918 419480 566641 660237 341020 686275 551783 588430 712762 444970 456232
17008 456232 718650 678541 475266 572389 577967 749136 568089 786801 450917 890018
16998 890018 675806 627616 680752 521717 698140 580407 423437 984184 810967 571133
16988 571133 623366 656975 698187 722779 687730 707385 637543 873262 967062 499871 699074
16977 699074 549339 778273 924047 843561 652925 670588 877809 665059 718905 725284
16967 725284 672906 766952 848801 610595 863952 836779 824852 796601 948684 844819 790219
16956 790219 1008045 758138 838618 576800 1022386 915120 966214 1014878 935368 812629
$$ packed form
17029E59118n549j64060J29022P8214A39820K02108m5176K20530K36263C62778
17018G84918l65438J47161R3596l19217L45255j34492L6647J24332k67792J1262
17008D56232K62418m0109k03275R7123N578J71169j81047K18712l35884M39101
16998H90018k14212m8190N3136j59035J76423j17733j56970N60747j73217k39834
16988E71133N2233L3609M1212K4592l5049J9655o9842K35719R3800m67191J99203
16977F99074j49735K28934J45774q0486j90636J7663K07221k12750N3846O379
16967G25284n2378R4046Q1849k38206K53357k7173j1927k8251J52083j03865n4600
16956G90219K17826k49907Q0480k61818M45586j07266N1094M8664p9510j22739
$$ plain form
16946 812629 1271710 807495 1014903 1139833 776665 1201031 1005583 1081434 1120135 1032012
16936 1032012 1160862 1019499 1006790 1044186 1021774 1028265 1045251 1159320 1201424 1252217 1081086
16925 1081086 1329995 1237983 1379545 748224 1005813 1395350 888681 768426 1457017 1076001
16915 1076001 1348766 906143 1055026 1554744 1003544 977049 1292367 1178871 1200779 1609009
16905 1609009 1121841 980136 1423966 1455916 1512318 1127455 1508103 1401101 1549610 1819068
16895 1819068 1542564 1595392 1935435 1694603 1488393 1374396 1599425 1486082 1517926 1482747
16885 1482747 1658815 1707514 1884111 1704616 1882529 1877411 1771244 1794799 1913762 1852634
16875 1852634 2069940 1957165 2249486 2112244 2046923 1904442 2176754 2004570 1905742 2233631
$$ packed form
16946H12629M59081m64215K07408J24930l63168M24366j95448P5851L8701q8123
16936A032012J28850j41363j2709L7396k2412O491J6986J14069M2104N0793j71131
16925A081086K48909r2012J41562o31321K57589L89537n06669j20255O88591l81016
16915A076001K72765m42623J48883M99718n51200k6495L15318j13496K1908M08230
16905A609009m87168j41705M43830L1950N6402l84863L80648j07002J48509K69458
16895A819068k76504N2828L40043k40832k06210j13997K25029j13343L1844l5179
16885A482747J76068M8699J76597j79495J77913n118j06167K3555J18963o1128
16875A852634K17306j12775K92321j37242o5321j42481K72312j72184r8828L27889
$$ plain form
16865 2233631 2305340 2314597 1855542 2225932 2174377 2298303 2167291 2601544 2657797 2398186
16855 2398186 2269503 2455090 2601878 3036779 2848878 2844405 2695396 2583530 2984058 2803782
16845 2803782 2947350 3026721 2988236 3590389 3170184 3226358 3328241 3325723 3215500 3378765
16835 3378765 3439194 3717871 3655805 3528872 3827951 3965046 3902739 4090551 4042631 4005389
16825 4005389 4273481 4398997 4189047 4531783 4518881 4368837 4428592 4919078 5179176 4822619
16815 4822619 4583985 5510972 4871830 5274514 5431666 5391994 5763278 6009011 6100931 6004510
16805 6004510 6355645 6685703 6411124 6665982 6951178 6660631 7029455 7405412 7601385
16796 7601385 7992239 7859829 8273816 8339476 8841534 8760951 9360987 9267017 9460846 9918567
$$ packed form
16865B233631P1709R257m59055L70390n1555J23926j31012M34253N6253k59611
16855B398186j28683J85587J46788M34901j87901m473j49009j11866M00528j80276
16845B803782J43568P9371l8485O02153m20205N6174J01883k518j10223J63265
16835C378765O0429K78677o2066j26933K99079J37095o2307J87812m7920l7242
16825D005389K68092J25516k09950L42736j2902j50044N9755M90486K60098l56557
16815D822619k38634R26987o39142M02684J57152l9672L71284K45733R1920r6421
16805F004510L51135L30058k74579K54858K85196k90547L68824L75957J95973
16796G601385L90854j32410M13987O5660N02058q0583O00036r3970J93829M57721
$$ plain form
16786 9918567 10024029 10265492 10758992 11249261 11572068 11641377 12242146 12335694 12938350 13461486
16776 13461486 13976095 14407923 14696345 15002489 15822830 15816103 16799472 17441543 18193169 18608030
16766 18608030 19385488 20091573 20800287 22000995 22968223 23902623 24732760 26259282 27325782
16757 27325782 28202645 29643814 30976036 32521214 34356420 36275153 37786266 39962284
16749 39962284 42218396 44740618 47228364 49668230 52333825 55779999 59101844 62402423
16741 62402423 66603980 71077406 74925362 79837493 84936196 90373862 96393204 102389514
16733 102389514 109350769 116245136 123143820 130696497 138275866 146210055 154470198 162593027
16725 162593027 170603559 178649395 185799776 192800529 198428579 203157585 206664040 208323426
$$ packed form
16786I918567J05462K41463M93500M90269L22807O9309O00769R3548O02656N23136
16776A3461486N14609M31828K88422L06144Q20341o727R83369O42071P51626M14861
16766A8608030P77458P06085P08714J200708R67228R34400Q30137J526522J066500
16757B7325782Q76863J441169J332222J545178J835206J918733J511113K176018
16749C9962284K256112K522222K487746K439866K665595L446174L321845L300579
16741F2402423M201557M473426L847956M912131N098703N437666O019342N996310
16733A02389514O961255O894367O898684P552677P579369P934189Q260143Q122829
16725A62593027Q010532Q045836P150381P000753N628050M729006L506455J659386
$$ plain form
16717 208323426 208222714 206806342 203164353 198683198 192198052 185038732 177345230 169257518
16709 169257518 161004816 152583011 143896797 136032431 128077770 120715230 113550961 106973897
16701 106973897 100733123 94600302 89208390 84248893 79461481 74848445 70629414 66513878
16693 66513878 63029131 59530839 56349768 53429839 50478115 48194150 45700991 43247979
16685 43247979 41157174 38970616 37275332 35664012 34049706 32443317 30807846 29850362
16677 29850362 28394616 26909213 25789590 25018824 23779948 23237741 22174353 21000603
16669 21000603 19995609 19298893 18721742 17865338 17226951 16777521 16099915 15309749 14904038
16660 14904038 14580379 13688487 13577131 12822426 12463887 11736109 11778920 11151569 10948098
$$ packed form
16717B08323426j00712j416372l641989m481155o485146p159320p693502q087712
16709A69257518q252702q421805q686214p864366p954661p362540p164269o577064
16701A06973897o240774o132821n391912m959497m787412m613036m219031m115536
16693F6513878l484747l498292l181071k919929k951724k283965k493159k453012
16685D3247979k090805k186558j695284j611320j614306j606389j635471r57484
16677B9850362j455746j485403j119623p70766j238876n42207j063388j173750
16669B1000603j004994o96716n77151q56404o38387m49430o77606p90166m05711
16660A4904038l23659q91892j11356p54705l58539p27778M2811o27351k03471
$$ plain form
16651 10948098 10843465 9909723 9634256 9737453 9165478 8930027 8476077 8775730 8359210
16642 8359210 8009071 7756724 7496736 7413253 7197994 6597780 6659436 6602288 6313121 6310359
16632 6310359 6106162 5868175 5842413 5939286 5778898 5322517 5239530 5410253 4946654 4762869
16622 4762869 4788700 4563257 4623461 4442728 4010981 4336644 4347665 3988748 3904158 4033193
16612 4033193 3590849 3760465 3631564 3739164 3754614 3651410 3648443 3274234 3404650 3188154
16602 3188154 3031764 3110768 3016876 2882279 3043874 2927716 2758102 2728565 2643223 2798087
16592 2798087 2570367 2567604 2459383 2596141 2373539 2405059 2399098 1897715 2065840 2348420
16582 2348420 2261141 2328978 2326244 2107110 2174386 2137686 1907079 1731651 1841101 1720877
$$ packed form
16651A0948098j04633r33742k75467J03197n71975k35451m53950K99653m16520
16642H359210l50139k52347k59988q3483k15259o00214O1656n7148k89167k762
16632F310359k04197k37987k5762R6873j60388m56381q2987J70723m63599j83785
16622D762869K5831k25443O0204j80733m31747L25663J1021l58917q4590J29035
16612D033193m42344J69616j28901J07600J5450j03204k967l74209J30416k16496
16602C188154j56390P9004r3892j34597J61595j16158j69614k9537q5342J54864
16592B798087k27720k763j08221J36758k22602L1520n961n01383J68125K82580
16582B348420q7279O7837k734k19134O7276l6700k30607j75428J09450j20224
$$ plain form
16572 1720877 2025669 1676212 1906693 2027416 1633290 1847824 1564819 1792168 1766881 1646835
16562 1646835 1708809 1623955 1485218 1990071 1373228 1326102 1594754 1585922 1283321 1587213
16552 1587213 1670038 1323111 1506987 1525799 1366415 1199935 1369906 1356404 1403711 1245411
16542 1245411 1069461 1010118 1265793 1125628 1308685 931006 1161710 1419686 967061 867732
16532 867732 918557 902850 1183113 1072382 881265 1102526 895046 1053066 828495 883674
16522 883674 1020428 653805 690536 925220 798991 905084 773528 766821 849282 944562
16512 944562 984187 902950 959990 1176386 467411 790861 931341 684709 574142 755991
16502 755991 670594 1026370 434987 1132933 683799 622461 591063 660404 798623 964141
$$ packed form
16572A720877L04792l49457K30481J20723l94126K14534k83005K27349k5287j20046
16562A646835O1974q4854j38737N04853o16843m7126K68652q832l02601L03892
16552A587213Q2825l46927J83876J8812j59384j66480J69971j3502M7307j58300
16542A245411j75950n9343K55675j40165J83057l77679K30704K57976m52625r9329
16532H67732N0825j5707K80263j10731j91117K21261k07480J58020k24571N5179
16522H83674J36754l66623L6731K34684j26229J06093j31556o707Q2461R5280
16512I44562L9625q1237N7040K16396D67411L23450J40480k46632j10567J81849
16502G55991q5397L55776D34987O97946m49134o1338l1398O9341J38219J65518
$$ plain form
16492 964141 596625 665970 614341 433026 574678 921598 584833 628679 606828 731153
16482 731153 439728 392140 641073 503118 777703 780508 630995 801484 335251 740600
16472 740600 203652 346604 654242 559921 454584 394908 535053 513056 454003 688872
16462 688872 665363 697937 255667 418427 800246 421725 508670 471513 755189 496679
16452 496679 416431 283118 304073 494338 708676 452399 499881 380957 482530 302742
16442 302742 340995 299076 369398 234053 518377 436370 397641 408357 387802 850831 265844
16430 107672 433469 65697 456139 386570 465068 420835 480980 386484 193468 590472 400473
16419 400473 296834 463329 158078 492429 559602 118449 433766 121203 408109 463805
$$ packed form
16492I64141l67516O9345n1629j81315J41652L46920l36765M3846k1851J24325
16482G31153k91425m7588K48933j37955K74585K805j49513J70489C35251M05349
16472G40600B03652J42952L07638r4321j05337n9676J40145k1997n9053K34869
16462F88872k3509L2574B55667J62760L81819l78521Q6945l7157K83676k58510
16452D96679q0248j33313K0955J90265K14338k56277M7482j18924J01573j79788
16442C02742L8253m1919P0322j35345K84324q2007l8729J0716k0555M63029B65844
16430A07672L25797F5697L90442o9569P8498m4233O0145r4496j93016L97004j89999
16419D00473j03639J66495A58078L34351O7173A18449L15317A21203K86906N5696
$$ plain form
16409 463805 -13640 375487 714545 123326 22848 70916 199214 345825 314577 660511
16399 660511 626335 56734 400768 180517 524824 521346 55163 342541 196194 514532
16389 514532 240760 487296 84219 558381 137395 292568 166597 126034 360327 -44690
16378 194884 59026 487340 404872 61507 529828 238596 280692 413581 229882 423226
16368 423226 91141 -82442 -130063 203080 346997 92724 172509 51661 136956 83126 194845
16357 194845 276062 272278 184490 -38469 61002 480173 173731 192212 457859 13431 394556
16346 394556 -142042 -14492 185502 72307 204861 -40964 236363 253529 274244 -113511
16335 52193 438226 212117 99359 166225 -77235 -36319 133390 318776 339366 172826 325113
$$ packed form
16409D63805a3640C75487L39058A23326B2848M8068J28298J46611l1248L45934
16399F60511l4176E6734L44034A80517L44307l478E5163K87378j46347L18338
16389E14532B40760K46536H4219M74162A37395J55173j25971m0563K34293d4690
16378A94884E9026M28314q2468F1507M68321B38596M2096J32889j83699J93344
16368D23226I1141h2442m7621B03080J43917I2724P9785E1661Q5295n3830J11719
16357A94845Q1217l784q7788c8469F1002M19171A73731J8481K65647A3431L81125
16346C94556a42042a4492A85502G2307J32554d0964B36363J7166K0715a13511
16335E2193L86033B12117I9359O6866g7235c6319A33390J85386K0590j66540J52287
$$ plain form
16324 325113 87641 83746 18683 223677 -85866 -176377 263485 414869 -51003 126350 426931
16313 426931 226081 -47859 204373 223588 129970 132482 8387 406987 124562 216188 16075
16301 272755 138233 310405 216562 158085 183146 -263605 150597 36201 91784 -77622 118289
16289 -82260 -45083 389103 140266 238427 283067 -69766 230356 -179844 212065 -75097 431504
16277 115097 263844 171162 210127 37313 248099 415222 229956 136370 -158039 3740 266565
16266 266565 16120 131343 -265877 14008 68362 8154 109468 130817 402000 211326 161865
16255 161865 181590 297906 141828 297553 -76281 -146110 -6359 160237 205324 119610 -127703
16243 177419 17094 56061 233764 244017 248865 -90592 -91962 102852 39796 158621 7384
$$ packed form
16324C25113H7641l895A8683K04994h5866r0511B63485J51384e1003A26350L00581
16313D26931k00850d7859B04373J9215r3618K512H387L98600A24562R1626A6075
16301B72755j34522J72172r3843n8477K5061b63605A50597C6201N5583g7622A18289
16289h2260L7177C89103A40266R8161M4640f9766B30356a79844B12065g5097D31504
16277A15097J48747r2682L8965C7313K10786J67123j85266r3586a58039C740K62825
16266B66565A6120J15223b65877A4008N4354H154J01314K1349K71183j90674m9461
16255A61865J9725J16316A41828J55725g6281o9829f359A60237M5087q5714a27703
16243A77419A7094L8967J77703J0253M848i0592j370A02852C9796J18825G384
$$ plain form
16231 -210748 27249 -117751 -97824 310777 411898 -105890 47278 -246862 117592 81396
16221 81396 234777 275203 135967 -263090 206926 -40761 126789 248630 302816 -107110
16210 159577 199031 -171027 126169 -373633 9491 260240 211247 165452 -88873 248663 -239319
16198 -13783 14004 153379 -27968 131344 165252 -171892 -83255 5287 225445 26227 6743
16186 -87990 -121704 442745 -40021 -1486 -171618 123563 364785 30060 11412 -97651 -281413
16175 -281413 255164 18539 173970 -72121 18074 -44576 -106384 -79973 271223 235464 -88235
16163 -209990 -264920 10823 248380 48558 28817 131975 196398 -333678 58851 -79375 -209271
16152 -209271 68744 120193 65451 116888 -103910 219965 -143382 17303 -73863 72352 -136337
$$ packed form
16231b10748B7249a17751J9927C10777J01121a05890D7278b46862A17592l6196
16221H1396J53381M0426A35967b63090B06926d0761A26789J21841N4186a07110
16210A59577L9454a71027A26169c73633I491K50749m8993m5795h8873B48663b39319
16198a3783A4004J39375b7968A31344L3908a71892h3255E287K20158B6227F743
16186h7990l3714D42745d0021a486j70132A23563K41222C0060A1412i7651j83762
16175b81413B55164A8539J55431g2121A8074d4576o1808K6411B71223l5759h8235
16163b09990n4930A0823K37557D8558j9741J03158O4423c33678E8851g9375j29896
16152b09271F8744N1449n4742N1437a03910B19965a43382A7303g3863G2352a36337
$$ plain form
16140 -42380 -161219 254733 -67570 -113284 -40593 179664 74708 -105335 280247 78327 181473
16129 181473 99016 -24230 -23403 -174634 91578 -44327 197602 24755 -321705 71193 65267
16118 65267 -1298 -89116 -74737 33622 301122 -613 154917 231792 123175 17252 40596 -100656
16105 132830 73667 377682 -142774 -56433 78673 -219393 217240 219977 125981 47924 -2270
16093 64493 -361587 -136505 -135473 -84123 -193447 91726 -357111 27959 -234285 -83780 42336
16081 200545 -29261 17928 -10119 147468 281234 139216 -33524 136946 -128905 36775
16070 122369 193171 51336 -198361 -187435 -96542 -691090 64238 88452 48171 -320205 114233
16058 -6295 -124009 -68518 79091 -74238 -137487 -31680 93156 256537 -61851 -240719 19562
$$ packed form
16140d2380j18839B54733f7570m5714d0593A79664G4708a05335B80247G8327J03146
16129A81473q2457b4230Q27j51231I1578d4327A97602B4755c21705G1193n926
16118F5267a298q7818J4379C3622K67500f13A54917P6875j08617A7252K3344a00656
16105A32830n9163L04015a42774e6433G8673b19393B17240K737r3996D7924b270
16093F4493c61587a36505J032N1350j09324I1726c57111B7959b34285h3780D2336
16081B00545b9261A7928a0119A47468J33766A39216c3524A36946a28905C6775
16070A22369P0802E1336a98361J0926R0893n94548F4238K4214m0281c20205A14233
16058f295j17714N5491G9091g4238o3249c1680I3156J63381f1851j78868A9562
$$ plain form
16046 -382893 -220249 -89881 72911 -145821 103667 60701 -24269 -33582 123709 -17565 -110668
16035 -110668 -281558 216076 -196614 93725 -175083 -120015 83721 -108551 303605 -147482
16024 193058 196508 -134659 22287 -221158 132467 -257050 -160921 -168749 328021 -204838 93145
16012 -176613 52293 30089 295797 -80429 -89959 166082 329490 -239749 161483 -164452
16001 11942 223824 -364405 182010 -38102 34733 97176 23892 50551 101872 337872 -76093
15989 63063 -243775 118764 157553 -204234 -3860 -22627 102252 374387 280926 135689 89372
15978 89372 -60871 173521 -95757 -265579 24382 -321128 63982 516474 539043 168795 -148154
15966 -123444 102549 -5497 -218662 -77393 222009 84595 -120948 8406 145459 112820 -272092
$$ packed form
16046c82893J62644h9881G2911a45821A03667m2966b4269r313A23709a7565r3103
16035a10668j70890B16076a96614I3725a75083N5068H3721a08551C03605a47482
16024A93058L450a34659B2287b21158A32467b57050R6129p828C28021b04838I3145
16012a76613E2293k2204K65708h0429r530A66082J63408b39749A61483a64452
16001A1942K11882c64405A82010c8102C4733O2443B3892K6659N1321K36000g6093
15989F3063b43775A18764L8789b04234c860j8767A02252K72135r3461A35689m6317
15978H9372f0871A73521i5757j69822B4382c21128F3982M52492K2569A68795a48154
15966a23444A02549e497k13165g7393B22009H4595a20948H406J37053l2639b72092
$$ plain form
15954 55090 -72198 174043 -183437 -190818 19241 11884 86948 -151947 37868 -279206 283390
15942 95294 -89228 42936 12808 105616 -122994 -248658 146172 -30296 37176 15912 -127345
15930 -87168 -183714 30376 -217602 255729 34348 -186446 67160 -131515 -31624 -419571 -6507
15918 -78973 -365312 -148094 -30611 -141214 56081 -27035 258720 15731 -83087 -325916 -93575
15906 -28498 -27244 -161945 158951 -90690 28097 54933 -19690 92246 -3035 69068 116972 -344967
15893 126264 -369238 130792 238427 -149871 222785 9844 62046 224497 86043 -120749
15882 -176400 -386439 -138989 -100554 -85263 -85849 -11234 62089 -280430 3756 -234741 86925
15870 -260152 -40994 -131379 -80066 -65461 89862 -172196 -74761 14332 62057 -270008 18005
$$ packed form
15954E5090g2198A74043a83437p381A9241p357P5064a51947C7868b79206B83390
15942I5294h9228D2936A2808R2808a22994j25664A46172c0296C7176A5912a27345
15930h7168r6546C0376b17602B55729C4348a86446F7160a31515c1624l87947f507
15918g8973k86339a48094c0611j10603E6081b7035B58720A5731h3087k42829i3575
15906b8498J254j34701A58951i0690B8097K6836a9690I2246c035F9068M7904c44967
15893A26264c69238A30792J07635a49871B22785I844N2202J62451H6043a20749
15882a76400k10039a38989L8435J5291n86a1234F2089b80430C756b34741H6925
15870b60152d0994r0385N1313J4605H9862a72196g4761A4332M7725b70008A8005
$$ plain form
15858 11073 271338 -29185 13865 -151343 127293 -159459 -283261 53792 -306417 117356
15847 45900 69726 -127116 -114086 -524653 -96183 -239569 -96294 -136284 -268704 -204459 -194382
15836 -194382 -82852 284087 -160734 229521 59861 -68694 -216521 70380 -34290 -108316 -41791
15824 -35619 90052 -141299 -251255 -259841 -371194 -454536 -309588 -138546 -130068 87904 -53119
15812 -113798 -14401 -1789 -73277 217951 -150621 47869 -103914 -249531 26285 -161387 -217457
15801 -217457 207350 -80775 219729 250336 134220 78258 -261843 -169604 54689 -82675 -22595
15789 -86532 -171859 13062 -123148 -50744 -178789 -74493 8985 260144 -155405 -66282 -541794
15778 -541794 159373 -166180 115154 106964 99895 -411081 164313 -188666 -304320 572494
$$ packed form
15858A1073K60265b9185A3865a51343A27293a59459j23802E3792c06417A17356
15847D5900K3826a27116J3030m10567i6183j43386i6294l9990j32420O4245J0077
15836a94382h2852B84087a60734B29521E9861f8694j47827G0380c4290p4026d1791
15824c5619I0052a41299j09956q586j11353q3342J44948a38546Q478H7904e3119
15812a13798a4401a789p1488B17951a50621D7869a03914j45617B6285a61387n6070
15801b17457B07350h0775B19729L0607j16116n5962b61843R2239E4689h2675b2595
15789h6532q5327A3062a23148e0744j28045g4493H985K51159a55405f6282m75512
15778e41794A59373a66180A15154q190p069d11081A64313a88666j15654E72494
$$ plain form
15767 441585 74404 -6440 -53155 319553 266850 301568 71554 -94558 7571 142159 226272
15756 226272 -114725 159483 249599 11136 25284 195593 -101851 93320 56860 59576 -107284
15744 -12634 256248 33183 -224053 -106906 86894 -204222 -135784 -120912 -126418 -97816 85523
15732 -185739 11218 142889 -20847 -42545 -133646 -318220 282509 34297 92330 23108 -447733
15720 94521 -11551 180419 -199124 -247858 -156187 -223423 -71302 -206553 -121023 -34412 9448
15708 67523 -336559 -32755 111214 -122019 -320745 419585 -10844 -114562 141428 6555
15697 -116146 -15270 218410 23034 132010 183975 -6008 58685 75378 228162 204483 2759
15685 427296 84254 -46046 300576 56966 -145338 -155361 46428 -146763 -104655 -17018 -108987
$$ packed form
15767D41585G4404f440m6715C19553n2703L4718G1554i4558G571J34588Q4113
15756B26272a14725A59483R0116A1136J4148J70309a01851I3320l6460K716a07284
15744a2634B56248C3183b24053a06906H6894b04222O8438J4872n506K8602H5523
15732a85739A1218J31671b0847k1698r1101j84574B82509C4297N8033B3108d47733
15720I4521a1551A80419a99124m8734R1671o7236g1302j35251Q5530c4412I448
15708F7523c36559c2755A11214a22019j98726D19585a0844j03718A41428F555
15697a16146a5270B18410B3034J08976N1965f008E8685J6693J52784k3679B759
15685D27296H4254d6046C00576E6966a45338j0023D6428a46763M2108a7018r1969
$$ plain form
15674 -108987 168760 -153717 236884 -16606 -24592 329999 -157893 9006 32579 185752 -132619
15662 -167718 36737 -43773 88687 60854 -226154 107038 -281081 -261681 -171086 51664 186473
15651 186473 -485218 -72365 140115 -146952 98444 -32055 -199717 148593 -155360 37333
15640 -155517 6373 132207 -22918 -159143 -351510 -284768 69292 74387 -76938 -208137 -395643
15629 -395643 -461918 69149 320010 -38702 127243 29331 -113551 2505 28282 77288 -12354
15617 144680 77994 118955 304095 -160163 180221 -236605 -21308 203501 -351826 -264311
15607 -264311 -252826 -217055 -87491 -225062 -275562 -73136 161481 -2040 -210825 -46813 -289913
15596 -289913 -211739 -51899 -375091 -79547 -158008 -161801 102476 11582 94478 -101650 1704
$$ packed form
15674a08987A68760a53717B36884a6606p986C29999a57893I006K3573J53173a32619
15662a67718C6737d3773H8687k7833b26154A07038b81081J9400R0595E1664J34809
15651A86473d85218g2365A40115a46952I8444c2055j67662A48593a55360C7333
15640a55517F373J25834b2918j36225j92367O6742F9292N095g6938j31199j87506
15629c95643o6275F9149K50861c8702A27243B9331a13551B505K5777M9006a2354
15617A44680o6686M0961J85140a60163A80221b36605b1308B03501c51826Q7515
15607b64311J1485L5771h7491j37571n0500g3136A61481b040k08785d6813k43100
15596b89913P8174e1899l23192g9547p8461l793A02476A1582Q2896a01650A704
$$ plain form
15584 449429 -101254 59873 433384 -61369 -169544 207607 -224004 401185 -426814 91070
15573 236759 62672 1168 -129214 -282703 -430288 66514 -371059 -163559 -431999 -1829 28324
15561 47041 -13650 -466667 318025 436617 -114265 54447 -381161 264578 34391 276237
15551 276237 -1432 -123646 -70532 29046 -41407 -53267 220477 25067 32579 -197437 178524
15539 169276 20314 -30942 151997 -16443 -257943 -72293 -130809 228927 -19304 16712 -165830
15527 27683 -50457 -176286 -50075 160660 -207419 -143112 63673 178723 165940 -6966 -263557
15516 -263557 32943 -87002 -151895 -83008 -150352 -80934 -8309 -58540 -161429 344940 209333
15505 209333 -104919 171233 172964 5290 -393625 102859 -323407 -293516 126699 186613 -92387
$$ packed form
15584D49429a01254E9873L73511f1369j08175B07607b24004D01185d26814I1070
15573B36759F2672A168a29214j53489j47585F6514c71059a63559k68440a829B8324
15561D7041a3650m53017C18025J18592a14265E4447c81161B64578C4391K41846
15551B76237a432j22214N3114B9046d1407j1860B20477B5067P512a97437A78524
15539A69276B0314c0942A51997a6443k41500g2293n8516B28927a9304A6712a65830
15527B7683e0457j25829e0075A60660b07419O4307F3673J15050j2783f966k56591
15516b63557C2943h7002o4893O8887o7344O9418h309n0231j02889C44940j35607
15505B09333a04919A71233J731E290c93625A02859c23407K9891A26699N9914i2387
$$ plain form
15493 -484719 212389 60159 -106200 44678 -294299 -117748 -80455 -89238 347231 62552 7368
15481 -380247 37595 110911 10910 133893 230741 -23457 321309 73918 80297 -16020 -51182
15470 -51182 -138105 -154607 -219283 115677 -759 -64949 -27565 169279 210972 -12117 253659
15458 -18449 263643 100061 78825 -371845 -64950 -1692 -15216 -290301 -39570 25347 -44385
15446 -175928 56601 -56659 272517 -29125 131257 -325941 62932 -169344 69898 120143 -266772
15434 -59120 80629 -108017 119715 -203304 78294 -198741 -260357 -105675 101726 135321
15424 135321 83186 -71464 -417194 -142743 -116236 69152 -132511 335149 -164498 211397
15413 18823 -163384 -38026 -269408 -281339 24718 190484 -19854 371572 -231017 -246001 160554
$$ packed form
15493d84719B12389F0159a06200D4678b94299a17748L7293q783C47231F2552G368
15481c80247C7595P3316A0910J22983R6848b3457C21309G3918O379a6020l5162
15470e1182q6923j6502o4676A15677g59o4190b7565A69279M1693a2117B53659
15458a8449B63643A00061k1236c71845f4950a692j3524k75085c9570B5347d4385
15446a75928E6601e6659B72517b9125A31257c25941F2932a69344F9898N0245b66772
15434e9120H0629a08017A19715b03304G8294a98741o1616a05675A01726L3595
15424A35321n2135g1464l45730a42743K6507F9152a32511C35149a64498B11397
15413A8823a63384c8026k31382j1931B4718J65766a9854C71572b31017j4984A60554
$$ plain form
15401 -39572 -17683 12198 107305 -155154 46969 -169133 -145939 -267934 11307 261715 93427
15389 38130 -190663 -86460 -306981 269583 -3949 149619 183019 -316531 96659 45464 -151587
15377 -123808 34222 230123 58286 -176152 61865 -171506 92629 -64438 -264217 -50616 -186110
15366 -186110 160517 427961 -16032 -116412 -100278 -118521 -60103 323278 89354 416754
15356 416754 38186 -281501 90991 152375 92883 -21567 251662 421631 195841 113578 -278737
15344 40984 274886 59381 79110 196015 177221 -116910 -5517 126746 -251563 -77518 258960
15332 -1936 -66409 106133 41314 -211046 54024 -13891 -147936 -311112 -201952 121287 -125114
15320 -68689 83596 -158962 61681 141497 61274 -71095 -186086 -73703 235668 -136133 -11201
$$ packed form
15401c9572a7683A2198R5107a55154D6969a69133K3194j21995A1307K50408I3427
15389C8130a90663h6460k20521B69583c949A49619L3400c16531I6659D5464a51587
15377a23808C4222J95901E8286a76152F1865a71506I2629f4438j99779e0616j35494
15366a86110A60517K67444a6032j00380J6134j8243N8418C23278H9354L27400
15356D16754C8186b81501I0991O1384n9492b1567B51662J69969A95841q2263b78737
15344D0984K33902E9381J9729J16905j8794a16910e517A26746b51563g7518B58960
15332a936o4473A06133D1314b11046E4024a3891j34045j63176J09160A21287a25114
15320f8689H3596a58962F1681P9816F1274g1095j14991g3703B35668a36133a1201
$$ plain form
15308 -149897 89994 -260881 187558 93767 52424 320276 107150 149453 165921 -127048
15297 326740 -76109 172877 -174865 29396 24205 371662 152117 -158275 79894 95548 -136840
15285 -100837 84552 -17463 16737 -138998 67967 91290 148785 -134304 260523 -157939 -254603
15274 -254603 55782 -88311 64482 172546 279088 46837 409118 93927 -235423 73296 -161516
15262 53369 21313 355439 232288 107400 37497 -89451 26957 -133759 -14829 -162319 298394
15250 145582 231281 615682 925326 549080 906736 896111 397136 400058 385952 377091 -159304
15238 389486 540220 -79799 61870 -154213 -236307 -26907 145408 224139 275050 209180 -150963
15226 33440 36033 225748 -255794 -144562 335730 -319649 178983 178930 268632 -62067 369375
$$ packed form
15308a49897H9994b60881A87558I3767m1343K67852A07150M2303J6468a27048
15297C26740g6109A72877a74865B9396n191L47457A52117a58275G9894J5654a36840
15285a00837H4552a7463A6737a38998F7967K3323N7495a34304B60523a57939r6664
15274b54603E5782h8311F4482J08064J06542D6837L62281I3927b35423G3296a61516
15262E3369B1313L34126j23151A07400C7497h9451B6957a33759a4829j47490B98394
15250A45582Q5699L84401L09644l76246L57656j0625C97136K922j4106q861a59304
15238C89486J50734g9799F1870a54213q2094b6907A45408P8731N0911o5870a50963
15226C3440K593J89715b55794J11232C35730c19649A78983n3Q9702f2067C69375
$$ plain form
15214 143707 176970 113356 150432 51221 28318 -4742 276154 -111546 11559 293777 62883
15202 227495 111023 257144 -342545 -35081 208082 211846 -18342 -38464 368191 -10323 40734
15190 81063 -188770 -38959 281181 -86062 268915 154913 249549 69748 -59957 366598 -47479
15178 -88842 -30384 123469 179229 204558 190483 -149800 -353838 469669 -28324 258296 228415
15167 228415 -198060 33940 -251068 110246 -301414 479484 115628 20681 242296 114200
15156 240867 9054 -224643 36410 -196918 139189 72271 -231494 308214 246396 156596 -119348
15144 90095 281254 -162211 29909 119125 232192 212005 18333 132825 147442 168960 57532
15132 63352 389467 -30312 361840 -137844 -55740 143010 424061 74181 64452 110679 318582
$$ packed form
15214A43707L3263o3614L7076E1221k2903d742B76154a11546A1559K82218F2883
15202B27495A11023J46121c42545c5081B08082L764a8342k0122C68191a0323D0734
15190H1063a88770c8959B81181h6062B68915j14002R4636F9748e9957C66598d7479
15178h8842c0384A23469N5760K5329j4075a49800k04038D69669b8324B58296k9881
15167B28415a98060C3940b51068A10246c01414D79484A15628B0681K21615A14200
15156B40867I054b24643C6410a96918A39189o6918b31494C08214o1818q9800a19348
15144I0095J91159a62211B9909Q9216J13067k0187A8333J14492J4617K1518E7532
15132F3352L26115c0312C61840a37844e5740A43010K81051G4181r729M6227K07903
$$ plain form
15121 318582 202033 170778 -143028 7977 141073 -59796 44680 318121 -212677 -39032 44153
15109 177779 -117757 27067 137879 335982 468294 176193 95209 181828 1908 136754
15099 136754 192250 219627 34040 436580 -56317 -51326 74352 165251 109598 -8597 9262 160865
15087 160865 66314 4900 76004 254305 299659 -345397 54593 89084 -167759 -26325 -78343
15076 -78343 -18548 103579 130155 35099 257848 7245 -107089 -270655 -102224 -12369 270130
15064 28200 191821 126814 320770 33132 20572 -299887 638133 41868 106633 230140 127441
15053 127441 391205 192431 36555 296471 225007 80225 64919 157778 -120228 297535
15042 138317 160644 237450 -34516 -39217 319508 434573 64541 483679 -78677 267086 212076
$$ packed form
15121C18582j16549l1255a43028G977J33096e9796D4680K73441b12677c9032D4153
15109A77779a17757B7067J10812J98103J32312A76193q0984Q6619A908J34846
15099A36754N5496K7377C4040M02540e6317M991G4352R0899n5653h597I262J51603
15087A60865F6314D900P1104J78301M5354c45397E4593L4491a67759b6325n2018
15076g8343a8548A03579K6576C5099K22749G245a07089j63566a02224a2369B70130
15064B8200J63621o5007J93956C3132j2560b99887F38133D1868O4765J23507j02699
15053A27441K63764A92431C6555K59916p1464H0225j5306R2859a20228B97535
15042A38317K2327P6806c4516m701C19508J15065F4541M19138g8677B67086n5010
$$ plain form
15031 212076 148019 34034 303459 -158872 297454 201017 184025 426579 55219 307228
15021 307228 -119437 -29954 -39381 140712 415899 215226 -157121 193192 -260079 274960
15010 188073 -135695 -45180 214386 444272 158729 50835 181343 34011 523788 -59370
14999 94090 141352 297064 198886 133578 -71651 432218 296606 321439 39820 333146 254720
14988 254720 -49439 -74472 213776 118895 431704 117085 268688 296280 146101 -93099
14977 -279301 71622 24428 221772 180241 105357 203787 356759 378345 -81596 264090 345005
14966 345005 479142 563861 273361 362224 177328 85329 372774 432627 268553 -188661
14955 -3657 459147 457951 330340 234513 434518 454538 120603 109374 544216 383725 76165
$$ packed form
15031B12076o4057C4034K69425a58872B97454r6437j6992K42554E5219K52009
15021C07228a19437b9954r427A40712K75187k00673a57121A93192b60079B74960
15010A88073a35695d5180B14386K29886A58729E0835J30508C4011M89777e9370
14999I4090M7262J55712r8178o5308g1651D32218j35612K4833C9820K93326p8426
14988B54720d9439k5033B13776r4881L12809A17085J51603K7592A46101i3099
14977b79301G1622B4428J97344m1531p4884R8430J52972K1586h1596B64090Q0915
14966C45005J34137Q4719B73361Q8863A77328H5329K87445N9853j64074a88661
14955c657D59147j196j27611r5827K00005K0020A20603j1229M34842j60491G6165
$$ plain form
14943 182593 350856 347440 247650 397300 155764 516834 256721 460334 -7015 365458
14932 264519 3456 276081 308319 548403 291060 374316 -104528 137664 613670 92429
14921 567868 363981 11114 36831 72180 224823 480882 157644 210001 84586 448305
14911 448305 315133 418111 216545 248518 126734 490983 422541 413274 347486 206369
14901 206369 568639 320385 251265 419658 412973 240250 190551 270501 312064 541570 425629
14890 425629 599671 454584 252467 189120 463780 286036 450665 367531 388208 281751
14880 281751 292100 248391 190142 250983 447314 507835 289110 543672 171518 442540
14870 442540 242293 520142 171647 409238 352425 539014 380927 125308 -162213 470572
$$ packed form
14943A82593J68263l416r9790J49650A55764L61070B56721K03613g015C65458
14932B64519C456K72625L2238K40084k57343Q3256a04528A37664M76006I2429
14921E67868k03887A1114K5717L5349J52643K56059A57644N2357H4586L63719
14911D48305j33172J02978k01566L1973j21784L64249o8442r267o5788j41117
14901B06369L62270k48254o9120J68393o685j72723m9699P9950M1563K29506j15941
14890D25629J74042j45087k02117o3347K74660j77744J64629q3134K0677j06457
14880B81751J0349m3709n8249O0841J96331O0521k18725K54562A71518K71022
14870D42540k00247K77849A71647K37591n6813J86589j58087A25308a62213D70572
$$ plain form
14859 117649 598798 301059 380412 505415 427355 472351 312254 460028 295297 600740
14849 600740 161667 280419 368238 304868 192491 385294 381545 325758 423942 405697 109940
14837 415854 205840 294310 262101 369779 716386 360310 534269 258845 517187 431695
14827 431695 463174 308134 468777 224285 368402 718436 365298 354060 378085 184120
14816 507353 517213 575498 301077 968999 492714 432051 135337 645847 364566 234491
14806 234491 524859 418790 571211 483374 555928 286729 729207 323437 373275 296097
14796 296097 696879 685329 625547 541064 493266 309834 431970 383701 467415 823383 490084
14785 490084 269185 650363 592759 397077 666089 836951 649332 593042 645812 468868
$$ packed form
14859A17649M81149k97739P9353J25003p8060M4996j60097J47774j64731L05443
14849F00740A61667J18752Q7819o3370j12377J92803l749n5787R8184j8245A09940
14837D15854B05840Q8470l2209J07678L46607l56076J73959B58845K58342q5492
14827D31695L1479j55040J60643B24285J44117L50034l53138j1238K4025A84120
14816E07353R860N8285k74421O67922m76285o0663A35337N10510k81281j30075
14806B34491K90368j06069J52421q7837P2554k69199M42478C23437M9838p7178
14796B96097M00782j1550n9782q4483m7798j83432J22136m8269Q3714L55968l33299
14785D90084k20899L81178n7604j95682K69012J70862j87619n6290N2770j76944
$$ plain form
14775 468868 444075 366104 349188 384336 699171 772374 333861 698687 829692 1058130
14765 1058130 666481 687270 712349 527059 713520 887254 619936 633207 785581 331781
14754 539547 639196 246323 376066 761706 915621 425671 913184 707748 542085 634161
14744 634161 707914 582665 599730 517820 623541 760338 971188 569074 746611 742293
14734 742293 591205 611368 603305 653463 761192 679724 805009 955404 1038629 653077 616107
14723 616107 1051985 695179 852443 642802 732785 1144530 850620 595960 775003 548797
14713 548797 522145 1114051 1116383 986173 1088143 550502 722342 934459 988403 790694
14703 790694 771917 786517 755874 834877 861943 487561 959653 683081 988571 1027699 865790
$$ packed form
14775D68868k4793p7971j6916L5148L14835P3203C33861L64826J31005K28438
14765A058130l91649K0789K5079j85290J86461J73734k67318J3271J52374C31781
14754E39547R9649B46323J29743L85640J53915D25671M87513k05436j65663R2076
14744F34161P3753j25249J7065q1910J05721J36797K10850m02114J77537m318
14734G42293j51088K0163q063N0158J07729q1468J25285J50395Q3225l85552l6970
14723F16107M35878l56806J57264k09641Q9983M11745k93910k54660J79043k26206
14713E48797k6652N91906K332j30210J01970n37641J71840K12117N3944j97709
14703G90694j8777J4600l0643P9003K7066l74382M72092k76572L05490L9128j61909
$$ plain form
14692 865790 809078 1177823 750911 914688 617643 1078362 924208 767582 976473 873695
14682 873695 842623 1090198 858769 917308 1081904 1226361 1178114 832342 879910 1080194
14672 1080194 1048807 1075025 1117510 802042 953440 977391 1240383 1106406 870793 1193217
14662 1193217 1307398 982269 1024367 964736 1093950 902140 1116737 1242864 1066219 1131197
14652 1131197 1156695 1549210 942501 1547681 1242906 972013 1527321 1054433 1014147 1225765
14642 1225765 1288126 1136102 1431989 1134813 1343646 1279006 1296199 1079493 1336883 1605751
14632 1605751 1305034 1726530 1310514 1108640 1380409 1384261 1412863 1128590 1447375 1412261
14622 1412261 1306684 1354749 1166660 1466332 1643553 1576093 1267870 1389185 1405467 1877770
$$ packed form
14692H65790n6712L68745m26912J63777k97045M60719j54154j56626K08891j02778
14682H73695l1072K47575k31429N8539J64596J44457m8247l45772M7568K00284
14672A080194l1387K6218M2485l15468J51398K3951K62992j33977k35613L22424
14662A193217J14181l25129M2098n9631J29214j91810K14597J26127j76645O4978
14652A131197K5498L92515o06709O05180l04775k70893N55308m72888m0286K11618
14642A225765O2361j52024K95887k97176K08833o4640J7193k16706K57390K68868
14632A605751l00717M21496m16016k01874K71769L852K8602k84273L18785l5114
14622A412261j05577M8065j88089K99672J77221o7460l08223J21315J6282M72303
$$ plain form
14612 1877770 1647843 1538729 1638121 1404079 1348456 1241682 1624627 1437727 1136556 1506788
14602 1506788 1779343 1381273 1658400 1372919 1591652 1432213 1636036 1696038 1735129 1584475
14592 1584475 1966939 1524377 1734648 1784127 1976846 1739246 1784844 1630475 1614425 1849177
14582 1849177 2098443 1905983 1946676 2125103 1891020 1919162 1961951 2358603 2140501 2430900
14572 2430900 2243467 2355094 2610801 2760888 2574377 2543981 2745520 2578890 2703158 2854343
14562 2854343 3024441 2829022 2841558 3610676 3653169 3618876 3780181 4247086 4650358 5082936
14552 5082936 5605737 6288562 7181558 8956570 12174970 17900428 25908179 31369380 19651636
14543 19651636 11034024 6819873 4798164 4104784 3613900 3497182 3381258 2623389 2698223
$$ packed form
14612A877770k29927j09114R9392k34042n5623j06774L82945j86900l01171L70232
14602A506788K72555l98070K77127k85481K18733j59439K03823O0002L9091j50654
14592A584475L82464m42562K10271M9479J92719k37600M5598j54369j6050K34752
14582A849177K49266j92460M0693J78427k34083K8142M2789L96652k18102K90399
14572B430900j87433J11627K55707J50087j86511l0396K01539j66630J24268J51185
14562B854343J70098j95419J2536P69118M2493l4293J61305M66905M03272M32578
14552E082936N22801O82825Q92996J775012L218400N725458Q007751N461201j1717744
14543A9651636q617612m214151k021709o93380m90884j16718j15924p57869P4834
$$ plain form
14534 2698223 2784117 2640502 2716297 2606304 2630576 2610831 2653697 2591728 2577840 2399314 2587163
14523 2587163 2494690 2569437 2712053 2554495 2960586 2615755 2799906 2746924 3034914 2934325
14513 2934325 2626379 2685285 2815299 2740622 2925868 2659603 2880477 2829443 3183739 3121115
14503 3121115 3303514 2797228 3269921 3358928 3351456 3090613 3262864 3149078 3200956 3165122
14493 3165122 3150948 3131318 3466058 3765522 3501901 3296683 3763069 3204127 3609471 3692367
14483 3692367 4017496 3739566 3542781 3846104 4064588 4034027 4047363 3815491 4278676 3723900
14473 3723900 4365648 4399855 4327167 4298806 4398438 4389945 4578403 4198540 4453490 4323377
14463 4323377 4610279 4877490 4674257 4798812 4547769 4929183 4877229 4885746 5012951 5094902
$$ packed form
14534B698223Q5894j43615P5795j09993K4272j9745M2866o1969j3888j78526J87849
14523B587163r2473P4747J42616j57558M06091l44831J84151n2982K87990j00589
14513B934325l07946N8906J30014p4677J85246k66265K20874n1034L54296o2624
14503C121115J82399n06286M72693Q9007p472k60843J72251j13786N1878l5834
14493C165122j4174j9630L34740K99464k63621k05218M66386n58942M05344Q2896
14483C692367L25129k77930j96785L03323K18484l0561J3336k31872M63185n54776
14473C723900O41748L4207p2688k8361R9632q493J88458l79863K54950j30113
14463D323377K86902K67211k03233J24555k51043L81414n1954Q517J27205Q1951
$$ plain form
14453 5094902 5238249 5296221 5647406 5544294 5564836 5512556 5570434 6032413 5710342 5794532
14443 5794532 5720054 6183182 6040479 6236945 6354141 6474812 6401653 6274237 6194974 6501957
14433 6501957 6321591 6653347 7038456 6528457 7033899 7013977 7341273 7062494 7441562 7518864
14423 7518864 7257853 7882341 8066460 8096542 8091809 8214420 8370587 8554437 8723824 8689823
14413 8689823 8404827 8924789 8789062 9205207 9485988 9275366 9533765 9738510 9872843
14404 9872843 9894501 10203008 10707332 10358065 10781914 10775903 11021728 11320581 11445162 11794974
14394 11794974 11591676 12150258 12296232 12420805 12772207 12627901 12603963 13260306 13467809
14385 13467809 13709436 13892611 14119357 14182409 14565547 14935656 15069277 15642607 15535977
$$ packed form
14453E094902J43347N7972L51185j03112K0542n2280N7878M61979l22071Q4190
14443E794532p4478M63128j42703J96466J17196J20671p3159j27416p9263L06983
14433F501957j80366L31756L85109n09999N05442j9922L27296k78779L79068P7302
14423G518864k61011O24488J84119L0082m733J22611J56167J83850J69387l4001
14413H689823k84996N19962j35727M16145K80781k10622K58399K04745J34333
14404I872843K1658L08507N04324l49267M23849o011K45825K98853J24581L49812
14394A1794974k03298N58582J45974J24573L51402j44306k3938O56343K07503
14385A3467809K41627J83175K26746O3052L83138L70109J33621N73330j06630
$$ plain form
14376 15535977 16246875 16585696 16787436 17201219 17462800 17691462 18192811 18349048 18836024
14367 18836024 19233394 19515959 20030333 20698469 20901604 21420072 21724069 22477756 23088485
14358 23088485 23115726 23810983 24195304 25031278 25675756 26201147 26848053 27324710 27995311
14349 27995311 28615856 29636887 30744506 31375624 31802964 32771743 33349877 34229864 35562032
14340 35562032 36292197 37726923 38252467 39343284 40412693 42143287 43302483 44407644
14332 44407644 45877330 47241810 48647855 49984962 52065447 53243028 55233369 57066942
14324 57066942 58875973 61140424 63160833 65547503 67867700 70482551 73306870 75690009
14316 75690009 78504702 82024812 85191143 88668473 92130052 95909063 99862091 104197357
$$ packed form
14376A5535977P10898L38821K01740M13783K61581K28662N01349J56237M86976
14367A8836024L97370K82565N14374O68136K03135N18468L03997P53687O10729
14358B3088485K7241O95257L84321Q35974O44478N25391O46906M76657O70601
14349B7995311O20545J021031J107619O31118M27340R68779N78134Q79987J332168
14340C5562032P30165J434726N25544J090817J069409J730594J159196J105161
14332D4407644J469686J364480J406045J337107K080485J177581J990341J833573
14324E7066942J809031K264451K020409K386670K320197K614851K824319K383139
14316G5690009K814693L520110L166331L477330L461579L779011L953028M335266
$$ plain form
14308 104197357 109129865 114078317 118867730 124298288 129865132 136131238 142446077 148832524
14300 148832524 156090535 163489245 171271627 179626646 188733197 198025724 208216507 218263969
14292 218263969 229802967 241219577 253389880 265993331 278297615 289561750 300618516
14285 300618516 311328516 322149753 333218636 343881423 354994439 366006005 376181471
14278 376181471 386547673 396092946 405837713 415926883 425207665 433498001 439303788 442920418
14270 442920418 445240414 445649981 441865379 435428187 427435275 415900683 402968289 389772597
14262 389772597 376632801 364065428 351215902 338398503 326005762 313747161 302070993
14255 302070993 290564308 278499504 267402621 257016346 246357012 235878400 225647846
$$ packed form
14308A04197357M932508M948452M789413N430558N566844O266106O314839O386447
14300A48832524P258011P398710P782382Q355019R106551R292527J0190783J0047462
14292B18263969J1538998J1416610J2170303J2603451J2304284J1264135J1056766
14285C00618516J0710000J0821237J1068883J0662787J1113016J1011566J0175466
14278C76181471J0366202R545273R744767J0089170R280782Q290336N805787L616630
14270D42920418K319996M09567l784602o437192p992912j1534592j2932394j3195692
14262C89772597j3139796j2567373j2849526j2817399j2392741j2258601j1676168
14255C02070993j1506685j2064804j1096883j0386275j0659334j0478612j0230554
$$ plain form
14248 225647846 216235149 206930250 198249539 189799601 182315088 174922811 167450071 160727272
14240 160727272 154042525 148024742 142458656 136648718 131063844 126190281 121418564 116580357
14232 116580357 111929370 107859667 103667367 99739766 95725577 92319932 89267844 86224522
14224 86224522 82603598 79744495 76988080 74045369 71906082 69471211 66928584 64914599
14216 64914599 62762126 60717103 58799610 57264653 54913622 53563590 51663948 50084558
14208 50084558 48794472 47509962 46336758 44992215 43404584 41613751 40540811 39805987
14200 39805987 38623308 37404566 36548180 35624668 34436200 33528858 32787198 31940338 30963355
14191 30963355 30071362 29275570 28741102 27713982 27351251 26592736 25961499 25503481 24740783
$$ packed form
14248B25647846r412697r304899q680711q449938p484513p392277p472740o722799
14240A60727272o684747o017783n566086n809938n584874m873563m771717m838207
14232A16580357m650987m069703m192300l927601m014189l405645l052088l043322
14224H6224522l620924k859103k756415k942711k139287k434871k542627k013985
14216F4914599k152473k045023j917493j534957k351031j350032j899642j579390
14208E0084558j290086j284510j173204j344543j587631j790833j072940p34824
14200C9805987j182679j218742q56386r23512j188468r07342p41660q46860r76983
14191C0963355q91993p95792n34468j027120l62731p58515o31237m58018p62698
$$ plain form
14182 24740783 24218639 23573419 23129822 22495464 22055346 21784297 21260269 20454406 20405585
14173 20405585 20086053 19243973 19391030 18806310 18666874 18168391 17818046 17559799 16917025
14164 16917025 16610837 16322114 16043326 15794079 15542897 15272309 14861460 14527191 14394501
14155 14394501 14219440 14114747 13788877 13606023 13353826 12787217 12802075 12494522 12677249
14146 12677249 11831749 12099542 11512167 11854554 11194890 11425809 11167586 11310918 10947983
14137 10947983 10595780 10442085 10183436 10131941 9845354 9687002 9608789 9597890 9602846 9297808
14127 9297808 9034187 8868626 9078288 8796384 8758744 8520959 8557340 8370419 8098651 7905499
14117 7905499 7648005 7713827 7826163 7815118 7747885 7113761 7529832 7116552 6981978 6944503
$$ packed form
14182B4740783n22144o45220m43597o34358m40118k71049n24028q05863m8821
14173B0405585l19532q42080J47057n84720j39436m98483l50345k58247o42774
14164A6917025l06188k88723k78788k49247k51182k70588m10849l34269j32690
14155A4394501j75061j04693l25870j82854k52197n66609J4858l07553J82727
14146A2677249q45500K67793n87375L42387o59664K30919k58223J43332l62935
14137A0947983l52203j53695k58649n1495k86587j58352p8213j0899M956l05038
14127I297808k63621j65561K09662k81904l7640k37785L6381j86921k71768j93152
14117G905499k57494O5822J12336j1045o7233o34124M16071m13280j34574l7475
$$ plain form
14107 6944503 6762295 6777822 6773709 6790067 6678918 6418141 6568729 6673111 6189788 6165327
14097 6165327 6476440 6274005 5778838 6494326 5843055 5878189 5821539 6005904 5716255 5637146
14087 5637146 5387635 5521737 5270504 5422009 5530901 4821827 5196417 5244705 5363977 5082416
14077 5082416 5021237 5074842 4742488 4829935 4893909 4658645 5051468 4765136 4630852 4500771
14067 4500771 4602375 4333384 4210473 4368190 4296131 4323504 4341088 4383116 3994794 4282336
14057 4282336 4340638 4255543 3946703 3843517 3775796 3823112 3679499 4002134 3858134 3986029
14047 3986029 3702548 3839434 3558661 3708532 3235422 3288494 3639657 3589703 3258196 3424156
14037 3424156 3136735 3515018 3379435 3271340 2936597 3290579 3521832 3365546 3131885
$$ packed form
14107F944503j82208J5527m113J6358j11149k60777J50588J04382m83323k4461
14097F165327L11113k02435m95167P15488o51271L5134n6650J84365k89649p9109
14087E637146k49511J34102k51233J51505J08892p09074L74590M8288J19272k81561
14077E082416o1179N3605l32354Q7447O3974k35264L92823k86332j34284j30081
14067D500771J01604k68991j22911J57717p2059K7373J7584M2028l88322K87542
14057D282336N8302q5095l08840j03186o7721M7316j43613L22635j44000J27895
14047C986029k83481J36886k80773J49871m73110N3072L51163m9954l31507J65960
14037C424156k87421L78283j35583j08095l34743L53982K31253j56286k33661
$$ plain form
14028 3131885 3219886 3085609 2976372 3151186 3027330 2891441 2994272 2966617 3069636 2669786
14018 2669786 2729912 2644454 2542867 2860829 2662248 2515974 2615701 2790045 2877866 2654348
14008 2654348 2681975 2528363 2497580 2553948 2475059 2620159 2558762 2640224 3034988 2739809
13998 2739809 2840503 2958207 2842323 3003604 3395280 3611170 3867281 4261801 4598877
13989 4598877 6167358 8293491 13793137 22296117 30470787 21771539 13916523 9779031
13981 9779031 7271478 5983090 5277445 4698474 4210696 3965281 4067918 3727225 3552851
13972 3552851 3302840 3036180 2897179 2778008 2951391 2726124 2742001 2928221 2537994 2671515
13962 2671515 2677818 2495809 2433657 2322829 2349993 2504028 2380373 2222817 2315336 2119340
$$ packed form
14028C131885Q8001j34277j09237J74814j23856j35889J02831k7655J03019l99850
14018B669786O0126q5458j01587L17962j98581j46274R9727J74344Q7821k23518
14008B654348K7627j53612l0783N6368p8889J45100o1397Q1462L94764k95179
13998B739809J00694J17704j15884J61281L91676K15890K56111L94520L37076
13989D598877J568481K126133N499646Q502980Q174670q699248p855016m137492
13981I779031k507553j288388p05645n78971m87778k45415J02637l40693j74374
13972C552851k50011k66660j39001j19171J73383k25267J5877J86220l90227J33521
13962B671515O303j82009o2152j10828K7164J54035j23655j57556R2519j95996
$$ plain form
13952 2119340 2062177 1883173 2027041 2303718 2002167 1957686 2246729 1742225 1758615 1737830
13942 1737830 2118630 1978636 1749264 1972856 2206336 2116546 1624806 1928339 1608775 1934692
13932 1934692 1656427 1939986 2170108 1948056 1822326 1678634 1803548 1730802 1583484 1659286
13922 1659286 1838724 1885926 1335244 1509192 1696042 1564161 2003678 1597764 1615905 1367988
13912 1367988 1627530 1394908 1523248 1584292 1256813 1325526 1466892 1521945 1941203 1440363
13902 1440363 1089967 1521182 1385541 1315443 1421810 1564134 1395361 1452076 1451788 1358094
13892 1358094 1447067 1341772 1188194 1412062 1280973 1432521 1555874 1036019 1223700 1247270
13882 1247270 1340737 1004492 1373004 1367716 1246658 1422720 1170601 1440913 1170517 1281572
$$ packed form
13952B119340n7163j79004J43868K76677l01551m4481K89043n04504J6390k0785
13942A737830L80800j39994k29372K23592K33480q9790m91740L03533l19564L25917
13932A934692k78265K83559K30122k22052j25730j43692J24914p2746j47318P5802
13922A659286J79438M7202n50682J73948J86850j31881M39517m05914J8141k47917
13912A367988K59542k32622J28340O1044l27479O8713J41366N5053M19258n00840
13902A440363l50396M31215j35641p0098J06367J42324j68773N6715k88r3694
13892A358094Q8973j05295j53578K23868j31089J51548J23353n19855J87681K3570
13882A247270R3467l36245L68512n288j21058J76062k52119K70312k70396J11055
$$ plain form
13872 1281572 1112613 1029803 1163157 1586685 1287767 1258970 1091648 1335065 1155244 1233605
13862 1233605 1016142 1129239 1123581 1093159 1078454 1216971 823498 1041843 1260934 852403
13852 852403 1162932 1023549 1181573 997906 1223957 910506 916242 900222 1215402 987347
13842 987347 993943 1002899 1086098 1179001 1297772 1169184 824878 1029607 902281 1049151 994024
13831 994024 957602 1131094 1000070 1050467 1004323 747788 829598 915548 798288 1113680
13821 1113680 625075 1140830 1127292 931434 1002187 722722 803379 712925 1027617 866389
13811 866389 1141607 941190 955188 678117 761558 854203 1023334 1026518 1326977 1100961
13801 1100961 935187 747804 677127 772929 933051 1146579 1066838 859073 939180 620182
$$ packed form
13872A281572j68959q2810J33354M23528k98918k8797j67322K43417j79821P8361
13862A233605k17463J13097n658l0422j4705J38517l93473K18345K19091m08531
13852H52403L10529j39383J58024j83667K26051l13451N736j6020L15180k28055
13842I87347O596Q956Q3199R2903J18771j28588l44306K04729j27326J46870n5127
13831I94024l6422J73492j31024N0397m6144k56535Q1810Q5950j17260L15392
13821A113680m88605N15755j3538j95858P0753k79465Q0657r0454L14692j61228
13811H66389K75218k00417J3998k77071Q3441R2645J69131L184L00459k26016
13801A100961j65774j87383p0677R5802J60122K13528p9741k07765Q0107l18998
$$ plain form
13791 620182 1031855 586836 499910 706001 1106500 904719 997971 1036352 731639 709810
13781 709810 882496 964025 467508 956786 941186 625840 879619 925454 997072 587521
13771 587521 697961 1014581 580723 679537 721298 971531 540804 642659 659923 1100669
13761 1100669 916505 748051 645938 616679 847789 628120 667780 556895 833271 957620
13751 957620 979986 915467 910861 898178 781432 531779 325317 853295 759804 951248 735682
13740 735682 744379 686880 754857 886633 504589 734823 715189 669850 687132 772559 826107
13729 826107 188890 444668 635238 469715 598331 721808 563704 481624 585850 385862
13719 385862 279529 583144 654021 802584 552959 276208 557686 690998 558794 605847
$$ packed form
13791F20182M11673m45019q6926K06091M00499k01781R3252L8381l04713k1829
13781G09810J72686Q1529D67508M89278j5600l15346K53779M5835P1618m09551
13771E87521J10440L16620m33858R8814M1761K50233m30727J01855J7264M40746
13761A100669j84164j68454j02113k9259K31110k19669L9660j10885K76376J24349
13751I57620K2366o4519m606j2683j16746k49653k06462N27978r3491J91444k15566
13740G35682Q697n7499O7977J31776l82044K30234j9634m5339J7282Q5427N3548
13729H26107A88890K55778J90570j65523J28616J23477j58104q2080J04226j99988
13719C85862j06333L03615P0877J48563k49625B76208K81478J33312j32204M7053
$$ plain form
13709 605847 903702 504900 395932 614181 327932 681310 880255 877890 735635 456113
13699 456113 608632 507450 586554 547924 674578 730781 383849 525237 733263 363511
13688 358669 424081 557968 260739 682884 735187 773917 328956 254052 503950 326754
13678 326754 595123 750793 548685 451330 406991 369626 476215 616310 742942 376975
13668 376975 308183 321585 730372 486691 345858 525596 736336 288690 204036 591495
13658 591495 561164 340480 705969 641043 437966 748866 444902 561923 542952 570328
13648 570328 284594 663844 428430 186188 321203 550629 132197 628024 444430 550408
13638 550408 283435 334308 216260 422796 388819 391692 298788 565071 477117 768012 515979
$$ packed form
13709F05847K97855l98802j08968K18249k86249L53378J98945k365j42255k79522
13699D56113J52519j01182P9104l8630J26654N6203l46932J41388K08026C63511
13688C58669O5412J33887B60739M22145N2303L8730C28956p4904K49898j77196
13678C26754K68369J55670k02108r7355m4339l7365J06589J40095J26632l65967
13668C76975o8792J3402M08787k43681j40833J79738K10740B88690q4654L87459
13658E91495l0331k20684L65489o4926k03077L10900l03964J17021j8971K7376
13648E70328B84594L79250k35414A86188J35015K29426A32197M95827j83594J05978
13638E50408k66973N0873j18048K06536l3977K873r2904K66283q7954K90895k52033
$$ plain form
13627 515979 570407 170794 627215 293567 278784 726064 325747 522305 302405 640710
13617 640710 331432 269535 384543 371717 691829 309119 557811 607973 358582 473313
13607 473313 266637 321950 578780 480553 633948 274076 226613 275955 504417 233583
13596 493605 377017 432510 345024 444427 218298 401554 491108 302037 492974 199668
13585 409976 575143 348547 217010 292868 174928 338195 705833 458176 92942 274178
13575 274178 309961 221171 495831 277137 268321 465189 219966 178126 465100 510778 253249
13563 148639 247793 365449 623267 310737 644556 445224 299704 450918 453562 397695
13553 397695 535189 165007 523331 449842 569943 309998 337033 233990 632454 67799
$$ packed form
13627E15979N4428A70794M56421B93567j4783M47280C25747J96558k19900L38305
13617F40710l09278o1897J15008j2826L20112C09119K48692N0162k49391J14731
13607D73313k06676N5313K56830r8227J53395B74076m7463M9342K28462B33583
13596D93605j16588N5493q7486R9403B18298J83256Q9554j89071J90937A99668
13585D09976J65167k26596j31537P5858j17940J63267L67638k47657I2942J81236
13575B74178L5783q8790K74660k18694q816J96868B19966m1840K86974M5678B53249
13563A48639R9154J17656K57818C10737L33819j99332j45520J51214K644n5867
13553C97695J37494A65007L58324p3489J20101k59945K7035j03043L98464F7799
$$ plain form
13542 432994 439508 203566 407922 341485 256244 428599 443512 333211 234336 405158 262894
13531 262894 100179 136423 442060 125315 282008 544856 421035 420365 116576 398589
13521 398589 41860 285759 182836 232559 269882 64438 399510 202719 331324 378999
13511 378999 181576 119765 325981 585433 16793 505310 356994 125901 125561 110630 -54735
13499 397181 329536 104520 253973 432669 224147 264854 400012 353913 164298 163362 334531
13488 334531 435999 375240 296948 101897 413185 351240 130512 174961 25595 382175
13478 382175 242446 46497 235176 266874 242137 359574 302694 204338 181581 363591 20108
13466 205004 100427 514070 465340 336319 58089 453501 230340 122189 196387 -132174
$$ packed form
13542D32994O514B03566K04356o6437q5241J72355J4913j10301r8875J70822j42264
13531B62894A00179L6244L05637A25315J56693K62848j23821o70A16576K82013
13521C98589D1860K43899j02923M9723L7323F4438L35072j96791J28605M7675
13511C78999A81576o1811K06216K59452A6793M88517j48316A25901l40j4931e4735
13499C97181o7645A04520J49453J78696k08522M0707J35158m6099A64298r36J71169
13488C34531J01468o0759p8292A01897L11288o1945A30512M4449B5595L56580
13478C82175j39729D6497J88679L1698k4737J17437n6880r8356k2757J82010B0108
13466B05004A00427M13643m8730j29021E8089L95412k23161j08151P4198a32174
$$ plain form
13455 -133464 100275 382952 703895 302633 111415 69088 252515 341321 209867 427593
13445 427593 268097 139613 276507 91804 353765 88440 109928 318050 -102266 94642
13434 522657 107347 -33882 192092 -254856 204438 299686 89542 419430 493240 133653
13423 217032 -5688 533374 449147 56739 192714 135610 95687 450172 331055 148736 336420
13412 336420 110951 253778 306096 207164 158135 89286 364744 -163194 140355 169240
13402 169240 57710 177346 109674 -41650 168888 219752 355483 142677 434081 519256
13392 519256 216179 249607 275593 197915 643337 -42184 20999 -10187 208551 107690 194912
13381 194912 517216 552410 509028 351228 187008 276070 -104086 80812 286366 239690
$$ packed form
13455a33464A00275K82677L20943C02633A11415m2327J83427Q8806j31454K17726
13445D27593j59496j28484J36894I1804K61961H8440K1488K08122a02266I4642
13434E22657A07347c3882A92092b54856B04438R5248H9542L29888P3810A33653
13423B17032e688E33374q4227E6739J35975n7104l9923L54485j19117A48736J87684
13412C36420A10951J42827N2318r8932m9029o8849K75458a63194A40355K8885
13402A69240E7710J19636o7672d1650A68888N0864J35731A42677K91404Q5175
13392E19256B16179L3428K5986p7678M45422d2184B0999a0187B08551j00861Q7222
13381A94912L22304L5194m3382j57800j64220Q9062a04086H0812K05554m6676
$$ plain form
13371 239690 328737 571812 487607 497378 300179 208037 228287 341310 21354 569636 226536
13359 198814 -171440 176870 155540 151222 582660 129385 505126 172436 137402 152837
13349 152837 449431 245242 288038 59093 411283 222790 319016 322369 84359 24759 464064
13338 464064 498815 -36550 150689 215955 158944 174509 231203 318762 266555 132236 92072
13327 92072 8601 43617 84724 368346 93931 -16661 285374 81361 234247 296690 219325
13316 219325 200568 -71830 387550 284048 117018 -6043 287997 -187905 192823 181567
13306 181567 274932 410722 145719 377817 164097 91410 356065 50185 194871 105763
13296 105763 -71960 76841 -33043 37497 210274 223763 -9245 63701 198424 -32174 69579
$$ packed form
13371B39690Q9047K43075q4205R771j97199r2142K0250J13023B1354N48282B26536
13359A98814a71440A76870k1330m318M31438A29385L75741A72436l5034J5435
13349A52837K96594k04189M2796E9093L52190j88493R6226L353H4359B4759M39305
13338D64064L4751c6550A50689O5266n7011J5565N6694Q7559n2207A32236m0164
13327I2072H601L5016M1107K83622I3931a6661B85374H1361J52886O2443p7365
13316B19325j8757g1830C87550j03502A17018f043B87997a87905A92823j1256
13306A81567R3365J35790A45719K32098A64097p2687K64655E0185J44686q9108
13296A05763g1960G6841c3043C7497J72777J3489i245F3701J34723c2174F9579
$$ plain form
13284 -122914 58550 262914 -50908 332638 153395 165526 112781 -88532 40335 161495 211016
13273 211016 -74712 307141 197597 63689 288856 333890 146903 114199 125007 128635 397212
13262 397212 97167 181296 490696 226748 -207887 13966 147839 145163 59151 78573 71332
13251 71332 177140 229686 154564 79412 425792 -7471 119885 -225135 307394 153587 174377
13240 174377 55710 258137 291047 32335 279246 249933 161030 59750 41937 285108 257327
13229 257327 108273 187111 -257804 44900 -102058 456103 7019 -60635 14383 151305 287407
13218 287407 -247584 -166356 -44319 207043 7265 -7967 226066 158704 406622 -82996 441689
13206 209117 403058 455344 76415 76635 -97819 302992 140306 93141 104784 25730 156730
$$ packed form
13284a22914E8550K04364e0908C32638A53395J2131n2745h8532D0335J21160M9521
13273B11016g4712C07141j09544F3689K25167M5034A46903l2704J0808L628K68577
13262C97212I7167Q4129L09400B26748b07887A3966J33873k676E9151J9422p241
13251G1332J05808N2546p5122p5152L46380g471A19885b25135C07394A53587K0790
13240A74377E5710K02427L2910C2335K46911k9313q8903E9750j7813K43171k7781
13229B57327A08273P8838b57804D4900a02058D56103G019f0635A4383J36922J36102
13218B87407b47584Q1228d4319B07043G265g967B26066o7362K47918h2996D41689
13206B09117J93941N2286G6415K20i7819C02992A40306m7165J1643B5730J31000
$$ plain form
13195 156730 44006 -91820 8272 115732 164498 110925 87517 226019 97834 -11750 192853
13183 62635 219681 63526 -324810 189609 8051 -75027 91408 119587 224359 364098 321184
13172 321184 128747 263834 116330 -162529 80653 230203 140043 99294 -90001 192713
13161 -85037 78149 443988 -118866 124664 48040 124427 90944 140719 185254 141379 9432
13149 170270 193663 166162 356322 -25361 59706 386826 174461 33451 449557 138396
13138 228719 85161 21854 231356 -107653 185284 229030 -134910 171434 55108 348746
13128 348746 -42125 -108181 -66007 381295 7713 82708 131561 -139789 -24866 57634 74884
13117 74884 11051 108980 -76318 114204 -79906 -407948 266812 418113 -397617 131343
$$ packed form
13195A56730D4006i1820H272J07460M8766n3573k3408J38502I7834a1750A92853
13183F2635J57046F3526c24810A89609H051g5027I1408K8179J04772J39739m2914
13172C21184A28747J35087A16330a62529H0653J49550r0160m0749i0001A92713
13161h5037G8149L65839a18866A24664D8040P6387l3483M9775M4535m3875I432
13149A70270K3393k7501J90160b5361E9706L27120A74461C3451M16106A38396
13138B28719H5161B1854K09502a07653A85284M3746a34910A71434E5108K93638
13128C48746d2125o6056M2174C81295G713P4995M8853a39789b4866E7634J7250
13117G4884A1051R7929g6318A14204g9906l28042B66812J51301c97617A31343
$$ plain form
13106 -35078 -45135 -58390 240026 -3055 389087 432317 38943 7020 218472 -168461 -112381
13095 -112381 -40043 282306 145705 118225 -42913 171760 4818 181337 215327 115781 -64217
13083 471864 -363470 134534 233699 124218 58830 25733 -158436 218899 438213 374908
13073 374908 362057 -65797 37718 94739 202257 126986 -295962 202092 168916 -63557 103550
13061 26349 -153453 64345 -17605 169218 5409 -91195 -53828 327546 109221 42265 168149
13050 168149 47675 226586 -274713 135789 248880 232844 72612 -264941 124476 74384
13040 74384 159814 -94354 68309 304998 46886 -46336 76243 283694 251058 171426 -57748
13028 14897 -13284 154904 165658 -21753 214954 -13439 161286 204002 306323 293958 185393
$$ packed form
13106c5078j0057j3255B40026c055C89087M3230C8943G020K11452a68461N6080
13095a12381d0043B82306j36601k7480d2913A71760D818J76519L3990r9546f4217
13083D71864c63470A34534R9165j09481E8830B5733a58436B18899K19314o3305
13073C74908j2851f5797C7718N7021J07518p5271b95962B02092l3176f3557A03550
13061B6349a53453F4345a7605A69218E409i1195L7367C27546A09221D2265J25884
13050A68149D7675J78911b74713A35789J13091j6036G2612b64941A24476n0092
13040G4384Q5430i4354F8309K36689D6886d6336G6243K07451l2636p9632e7748
13028A4897a3284A54904J0754b1753B14954a3439A61286M2716J02321j2365j08565
$$ plain form
13017 185393 294126 102079 106307 242507 47502 106824 89991 394226 241983 124717
13007 124717 101977 -36270 309804 276685 -169025 149937 34048 231521 296865 44850 129470
12996 129470 75563 -82312 251707 233742 -85525 151731 150811 42170 263383 247001 -44009
12984 318627 426293 -173326 135566 -83913 166042 251223 -44485 234693 104184 182310
12974 182310 -136047 -26698 215247 375684 338430 -248842 154986 70056 114925 265166
12964 265166 48778 -22545 243944 220160 80072 -55618 -162251 -194215 441255 353288 265848
12953 265848 127668 206251 249173 247734 93751 4875 103656 -91626 -152684 370067 -268010
12941 -92155 131325 56620 141051 -67319 -24462 -247675 104281 392799 88656 183774 -99553
$$ packed form
13017A85393J08733A02079M228J36200D7502N9322j6833L04235j52243j17266
13007A24717k2740c6270C09804l3119a69025A49937C4048J97473O5344D4850Q4620
12996A29470n3907h2312B51707j7965h5525A51731r20D2170K21213j6382d4009
12984C18627J07666a73326A35566h3913A66042Q5181d4485B34693A04184P8126
12974A82310a36047b6698B15247J60437l7254b48842A54986G0056M4869J50241
12964B65166D8778b2545B43944k3784H0072e5618j06633l1964D41255q7967q7440
12953B65848A27668P8583M2922j439I3751D875R8781i1626o1058C70067b68010
12941i2155A31325E6620Q4431f7319b4462k23213A04281K88518H8656R5118i9553
$$ plain form
12929 -65336 247927 -137516 -255903 32206 -299059 133001 244037 -141322 -210873 11229
12918 89797 123398 450727 -62526 86633 178630 -17481 251277 123097 89157 -64468 406472
12906 -388792 107162 3728 248362 297875 100182 311131 25516 162464 476853 -19171
12895 -101216 -115077 -43901 252081 229948 -27113 64285 278557 -328515 82220 112727 242182
12884 242182 273891 -11142 133359 7248 -48016 398693 69623 29029 -107008 -225437 83141
12872 488063 113822 16728 86067 -226678 -88536 -155678 -58357 369765 -112272 5372 -78739
12860 -33162 27192 -132900 -168460 85953 54230 -88940 -143576 -96559 -205821 125460 13137
12848 37977 -92684 86919 52190 172076 -146960 193302 -27547 -106681 237056 -26533 49090
$$ packed form
12929f5336B47927a37516j18387C2206b99059A33001J11036a41322o9551A1229
12918H9797L3601L27329f2526H6633R1997a7481B51277A23097l3940f4468D06472
12906c88792A07162C728K44634M9513A00182K10949B5516J36948L14389a9171
12895a01216j3861d3901B52081k2133b7113F4285K14272c28515H2220L0507J29455
12884B42182L1709a1142A33359G248d8016C98693F9623B9029a07008j18429H3141
12872D88063A13822A6728O9339b26678h8536o7142e8357C69765a12272E372g8739
12860c3162B7192a32900l5560H5953l1723h8940n4636M7017j09262A25460A3137
12848C7977i2684H6919l4729J19886a46960A93302b7547p9134B37056b6533D9090
$$ plain form
12836 146036 -28996 -209641 118181 -143053 28897 234566 104632 182794 -302134 99295
12825 -26227 177506 178093 -114742 -295103 -285265 62913 -115014 112065 280825 -30993 -139290
12814 -139290 217282 86225 135894 29066 -171686 -64119 -183753 10497 308884 106532
12803 62285 52425 -339499 -151716 81825 -116695 14565 -310244 -39826 86558 170776 5726
12791 191772 110872 63084 163980 -45886 273509 20142 -81173 163194 -194062 63953 382996
12780 382996 -103892 -53083 130181 171498 158432 19862 -159520 76163 42030 106304 175014
12769 175014 19201 -65130 -7297 -120640 -122432 -206662 227254 -57108 127680 48137 -174286
12757 33537 204203 138897 71690 70256 -12515 -20158 1356 92054 199510 -265396 121796
$$ packed form
12836A46036b8996j80645A18181a43053B8897K05669A04632P8162c02134I9295
12825b6227A77506N87a14742j80361R838F2913a15014A12065J68760c0993j08297
12814a39290B17282H6225M9669B9066a71686f4119j19634A0497K98387A06532
12803F2285r860c39499a51716H1825a16695A4565c10244c9826H6558Q4218E726
12791A91772q0900m7788J00896d5886B73509B0142h1173A63194a94062F3953L19043
12780C82996a03892N0809A30181M1317j3066A9862a59520G6163l4133O4274O8710
12769A75014A9201f5130g297j13343j792q4230B27254e7108A27680D8137a74286
12757C3537J70666o5306o7207j434a2515p643A356R0698J07456b65396A21796
$$ plain form
12745 -79547 -36957 -180936 -37433 69222 150128 96491 102057 235595 77209 161143 206610
12734 206610 -141060 103865 -105598 -16144 -261341 38774 547292 142673 -45377 147571
12723 219151 113261 349526 92104 230434 -38752 -16614 -375096 -136109 222401 150352
12713 150352 194072 -92841 114064 542867 -260481 102283 230591 295887 195200 108719
12703 108719 191309 280703 -508624 29230 231910 -58378 37788 48283 198624 62388 482818
12692 482818 78837 -138872 432266 14188 245956 -44472 177829 54852 116859 385727
12682 385727 132400 -172616 112219 73135 178181 196785 -52753 -110405 228727 109406
12671 252761 -75095 162112 143109 288280 55707 106558 124182 75274 114189 298753 409021
$$ packed form
12745g9547c6957j43979c7433F9222Q0906n3637N566J33538G7209Q3934M5467
12734B06610a41060A03865a05598a6144k45197C8774N08518A42673d5377A47571
12723B19151j05890K36265I2104J38330c8752a6614l58482a36109B22401p2049
12713A50352M3720i2841A14064M28803b60481A02283J28308O5296j00687q6481
12703A08719Q2590Q9394e08624B9230K02680e8378C7788J0495J50341F2388M20430
12692D82818G8837a38872D32266A4188K31768d4472A77829E4852O2007K68868
12682C85727A32400a72616A12219l9084J05046J8604e2753n7652B28727A09406
12671B52761g5095A62112j9003J45171E5707N0851J7624m8908L8915J84564J10268
$$ plain form
12660 409021 95327 158920 323565 229475 107295 41605 232236 191824 99063 121069 -172732
12648 -79244 -11448 59400 -21287 153981 -70370 -75786 -248241 -164396 -55649 8371 -26803 -34358
12636 -34358 -86741 35418 431155 122022 75397 -188264 495964 287767 453369 568773
12626 568773 -45087 -185262 97866 344613 -164081 376871 181195 175702 162084 458192
12616 458192 142740 -122073 43339 -135615 -74383 27731 -18464 230616 -154104 186697
12605 53306 157027 120276 9794 -41183 274100 58436 274016 171380 224106 154465 205871
12594 205871 -46914 -2586 361510 441666 268276 -250700 7449 199325 87374 88585 249752
12583 249752 -140521 237755 -109582 58215 11445 19751 342041 -29076 46858 200937 -47355
$$ packed form
12660D09021I5327O3593J64645r4090A07295D1605J90631m0412r2761K2006a72732
12648g9244a1448E9400b1287A53981g0370n416j72455Q3845e5649H371b6803p555
12636c4358n2383C5418L95737A22022m6625a88264D95964k08197J65602J15404
12626E68773d5087j40175I7866K46747a64081C76871A81195n493j3618K96108
12616D58192A42740a22073D3339a35615O1232B7731a8464B30616a54104A86697
12605E3306J03721l6751I794d1183B74100E8436K15580j02636N2726o9641N1406
12594B05871d6914b586C61510Q0156j73390b50700G449J91876H7374J211J61167
12583B49752a40521B37755a09582E8215A1445Q306L22290b9076D6858J54079d7355
$$ plain form
12571 94548 90193 60655 -176668 -3819 327607 134047 254666 -197423 240882 146666 7183
12559 134143 317 -425633 30345 -305199 24029 162691 -239140 -130486 -43696 25345 40479
12548 40479 76615 6825 -69892 -38093 119873 102178 -201833 42987 -112877 -141838 -18573
12536 -33271 33840 152818 -62546 68959 180635 8171 -408 126205 34052 -54924 190361
12524 245748 -39157 98514 -313385 125134 17110 152551 195235 285309 -78555 25891 75988
12513 75988 -4701 242478 130315 230476 42328 205939 49926 -14107 -153491 -171454 385908
12501 46576 -42818 -33315 -95045 219611 209777 -121145 188208 -312125 -53646 -76286 -74174
12490 -74174 -153083 -148946 369230 102777 -301410 -200179 -62638 303133 357148 -136243 -122764
$$ packed form
12571I4548m355k9538a76668c819C27607A34047J20619a97423B40882r4216G183
12559A34143C17d25633C0345c05199B4029J38662b39140J08654d3696B5345J5134
12548D0479L6136F825f9892L1799A19873j7695b01833D2987a12877k8961a8573
12536c3271C3840J18978f2546F8959J11676H171d08A26205C4052e4924A90361
12524B45748c9157I8514c13385A25134A7110J35441M2684R0074g8555B5891N0097
12513G5988d701B42478j12163J00161D2328J63611D9926a4107j39384j7963C85908
12501D6576d2818R503o1730B19611r834a21145A88208c12125e3646k2640K112
12490g4174p8909M137C69230A02777c01410J01231f2638C03133N4015a36243J3479
$$ plain form
12479 -122764 -211281 310200 234937 -143765 276195 -112856 57346 295124 -76847 110627
12468 -130629 -75090 -175229 444542 73185 -352366 208862 -97968 -12418 120084 -142149
12457 -92788 112680 523682 -75562 -47025 -93256 -126251 13165 174400 64525 28870 74403
12446 74403 74718 157718 -153334 25322 205404 -66313 68332 269491 -41418 4751 99367 26602
12433 -173577 -36383 -14095 -118040 -112504 -179891 -170950 406682 -342469 -103115 42121 -24019
12421 178724 -403677 -92987 37299 128822 -300477 -170191 91124 -136581 83201 52832 48468
12410 48468 -64583 59089 -73661 -143172 160114 91662 -117296 -242807 -6841 -424007 76696
12398 -79096 197257 -312051 137235 25271 103158 155347 385713 185225 134472 -122521
$$ packed form
12479a22764q8517C10200p5263a43765B76195a12856E7346K37778g6847A10627
12468a30629N5539j00139D44542G3185c52366B08862i7968a2418A20084a42149
12457i2788A12680M11002g5562K8537m6231l2995A3165J61235F4525B8870M5533
12446G4403L15Q3000a53334B5322J80082f6313F8332K01159d1418D751R4616B6602
12433a73577c6383a4095j03945N536o7387Q941D06682c42469a03115D2121b4019
12421A78724d03677i2987C7299R1523c00477J30286I1124a36581H3201l0369m364
12410D8468f4583E9089g3661o9511A60114o8452a17296j25511f841m17166G6696
12398g9096A97257c12051A37235B5271P7887N2189K30366A85225n0753a22521
$$ plain form
12387 261870 15332 -108263 141277 161824 163163 -189503 -20915 110668 -383105 84398 25567
12375 56597 15081 65997 -44636 157417 2834 -224954 -240183 63706 -89121 -82233 -2030 -52661
12363 -52661 -58742 -131922 -467219 -211897 -58811 12987 165377 -203820 8041 328857 -130292
12351 46799 -94232 -189642 -225195 -58562 -66215 -8197 -75358 -57642 -83791 58264 44099 -27706
12338 108928 2106 -120710 28036 20475 -107046 -261806 -162750 -185201 48480 23811 129448
12327 129448 162857 226816 190126 156741 252581 99350 -233459 36311 6019 -212362 -59783
12315 29208 -98871 357121 20621 -30103 -500347 299524 214200 153176 -135124 193591 191823
12304 191823 -13562 -22132 -77707 255295 225363 80907 43535 3210 126853 268692 297493
$$ packed form
12387B61870A5332a08263A41277K0547J339a89503b0915A10668c83105H4398B5567
12375E6597A5081N0916d4636A57417B834b24954j5229F3706h9121O888b030n0631
12363e2661o081p3180l35297b11897e8811A2987J52390b03820H041L20816a30292
12351D6799i4232r5410l5553e8562p653h197o7161J7716k6149E8264j4165b7706
12338A08928B106a20710B8036p561a07046j54760R9056k2451D8480B3811J05637
12327A29448L3409O3959l6690l3385R5840I9350b33459C6311F019b12362e9783
12315B9208i8871C57121B0621c0103m70244B99524q5324o1024a35124A93591j768
12304A91823a3562q570n5575B55295k9932H0907l7372C210J23643J41839K8801
$$ plain form
12293 297493 213647 -125610 85410 30893 195616 -93557 134566 98187 97453 452502 -41327
12281 -707 -136492 39278 -363722 165378 58664 242617 140614 49474 80405 388490 94722
12269 142979 67563 -119281 331346 -95599 -167548 148099 132442 59941 145229 167617 -175130
12257 5550 60424 53151 5736 171469 76849 -79579 327625 178816 -145504 112705 -22628
12245 4372 106132 353171 220073 57443 355365 114135 101220 -10612 186978 -51258 47424
12233 154812 -129116 -47266 24316 353006 92843 83734 64274 143233 -67196 13354 292738
12222 292738 98408 163810 461530 142167 393299 261328 243688 139199 86429 -146186
12211 -83498 186000 363271 -38826 104440 11971 -95773 157779 468606 260004 -18322
$$ packed form
12293B97493q3846a25610H5410C0893J64723i3557A34566l6379p34L55049d1327
12281g07j35785C9278c63722A65378E8664J83953j02003D9474L0931L08085I4722
12269A42979F7563a19281C31346i5599p1949A48099j5657E9941Q5288K2388a75130
12257E550N4874p273E736J65733G6849g9579C27625j48809a45504A12705b2628
12245D372J01760K47039j33098E7443K97922A14135j2915a0612A86978e1258D7424
12233A54812a29116d7266B4316L28690I2843r109j9460P8959f7196A3354K79384
12222B92738I8408O5402K97720A42167K51132j31971j7640j04489n2770a46186
12211h3498A86000J77271c8826A04440A1971i5773A57779L10827k08602a8322
$$ plain form
12200 41343 152229 134095 264627 -79710 -88122 -127036 43775 -54594 320484 -53492 64414
12188 425128 218258 251367 -189375 147970 331228 211979 -7749 406986 47461 161857
12178 161857 -4953 116411 152780 -198157 138033 -143577 421986 427311 29315 246246 231495
12167 231495 305892 -123274 260481 56509 98782 111110 -48769 44486 221155 18051 -71209
12155 -45190 247954 -150745 179121 -76767 -39982 11818 -27423 412908 60232 126165 211888
12144 211888 -96149 57118 277848 345458 82893 166980 18327 3518 150899 -232507 -1305
12132 192462 26456 18281 -243171 282857 187685 -34079 -196685 124893 -318220 -303514 -387164
12121 -387164 -677015 9666 177043 -92473 226287 20831 -43040 -125633 -1833 133643 164778
$$ packed form
12200D1343J10886j8134J30532g9710q412l8914D3775e4594C20484e3492F4414
12188D25128k06870L3109a89375A47970J83258j19249g749D06986D7461J14396
12178A61857d953A16411L6369a98157A38033a43577D21986N325B9315K16931j4751
12167B31495P4397a23274B60481E6509M2273J2328d8769D4486J76669A8051g1209
12155d5190B47954a50745A79121g6767L6785A1818b7423D12908F0232O5933Q5723
12144B11888i6149E7118K20730O7610H2893Q4087A8327C518J47381b32507a305
12132A92462B6456q175b43171B82857r5172c4079j62606A24893c18220J4706q3650
12121c87164k89851I666J67377i2473B26287B0831d3040q2593a833A33643L1135
$$ plain form
12110 164778 -168316 -148356 156956 -216107 254931 -246723 -122392 71420 59805 -138755
12099 -188789 -29888 31857 -315240 53868 -117367 77277 -82992 -205716 -260585 -177449 53117
12087 292595 -59348 61639 -270944 226236 -235161 -52661 -57609 -8506 -197192 -129593 -40034
12075 -151619 172788 114183 142393 143042 -56574 -147703 232419 338252 -104744 223000 33813
12063 78158 157631 761 193478 -22143 501127 666993 889875 396401 185532 -43066 -13499
12051 80886 -196567 330427 46755 114079 279881 62542 6672 -58490 135024 -297566 -193353
12040 -193353 -153723 69451 20436 1778 -10629 84300 -111638 115557 215030 60360 -74136
12028 16331 138370 -35104 102983 195434 265192 -308688 63924 9739 -216584 -270262 -344490
$$ packed form
12110A64778a68316J9960A56956b16107B54931b46723a22392G1420j1615a38755
12099a88789b9888C1857c15240E3868a17367G7277h2992j22724n4869Q3136E3117
12087B92595e9348F1639b70944B26236b35161e2661m948h506j88686O7599d0034
12075a51619A72788n8605K8210O49e6574r1129B32419J05833a04744B23000C3813
12063G8158P9473G61J92717b2143E01127J65866K22882C96401A85532d3066a3499
12051H0886a96567C30427D6755O7324J65802F2542F672e8490A35024b97566J04213
12040a93353L9630F9451B0436A778a0629H4300a11638A15557R9473F0360g4136
12028A6331J22039c5104A02983R2451O9758c08688F3924I739b16584n3678p4228
$$ plain form
12017 -344490 -333625 -365305 41431 -42256 -277293 225700 14813 -14303 176003 101610 -104385
12005 288320 -17248 275715 -186242 167230 81290 -38074 -235946 118665 -215379 -159758
11995 -159758 -18605 -166125 -86471 6215 -149258 -108574 -193232 -120581 437554 -134831 249706
11983 -277435 215093 -62248 -87732 151435 207526 -32511 106850 -200940 27067 -202126
11972 -23973 -34056 -42100 -458284 -74811 154821 252692 130466 134679 318590 -60393 -85790
11961 -85790 -295204 -203155 552304 37695 213308 -81119 -55170 -44034 -21372 -204588 27668
11949 -35984 78947 18047 -350972 91730 117544 11870 9839 17520 -69402 -5646 -377835 -85183
11936 114645 158414 -21163 181231 -29850 -9180 -213169 -101698 149956 49633 -22491 -151194
$$ packed form
12017c44490J0865l1680D1431d2256k35037B25700A4813a4303A76003p4393a04385
12005B88320a7248B75715a86242A67230H1290c8074j97872A18665b15379N5621
11995a59758a8605j47520P9654F215a49258M0684q4658P2651D37554a34831B49706
11983b77435B15093f2248k5484A51435N6091c2511A06850b00940B7067b02126
11972b3973j0083q044m16184g4811A54821R7871j22226M213J83911f0393k5397
11961h5790k09414R2049E52304C7695J75613h1119K5949J1136b1372j83216B7668
11949c5984G8947A8047c50972I1730K5814A1870k031P681f9402e646l72189h5183
11936A14645M3769b1163A81231b9850i180k03989a01698A49956D9633b2491j28703
$$ plain form
11925 -151194 63337 174757 -139464 50755 102942 116396 -260218 -40401 -289377 32958 -72170
11913 -116681 255130 348742 -137721 -60893 -67927 -149220 -265627 69061 1333 21497 166314
11902 166314 -441857 106505 376646 65515 159005 97713 15247 76814 -24572 88777 -228519
11890 -167260 180868 -52779 -37117 -15517 1160 -238061 102229 259965 -245120 -67116 -197381
11879 -197381 241021 -110221 -55010 -157831 -182402 -63526 -59859 -165003 17736 -384698 -58053
11867 -74335 98703 -54069 -151354 -64881 115378 18380 -320261 -345661 -223040 -50766 138563
11855 -237545 -51373 -123693 -185516 -90573 -132702 277762 -167585 -79584 -106059 146841 43867
11843 -19048 217768 -1519 -384028 56189 164299 -28786 -22078 66446 -343428 201144 12109
$$ packed form
11925a51194F3337J11420a39464E0755N2187J3454b60218d0401k48976C2958g2170
11913a16681B55130R3612a37721f0893p034q1293j16407F9061A333K0164J44817
11902A66314d41857A06505K70141F5515R3490o1292A5247O1567b4572H8777b28519
11890a67260A80868e2779J5662a5517A160b38061A02229J57736b45120f7116j30265
11879a97381B41021a10221e5010j02821k4571f3526L667j05144A7736c84698e8053
11867g4335I8703e4069r7285f4881A15378A8380c20261k5400J22621e0766A38563
11855b37545e1373p2320o1823i0573m2129B77762a67585g9584k6475A46841D3867
11843a9048B17768a519l82509E6189J08110b8786O708F6446c43428B01144A2109
$$ plain form
11831 -202976 6991 -108851 -34754 -33137 155261 128056 61939 -216030 55374 -349602 8761
11819 34411 151210 166050 -141655 -88107 -132196 -83950 -143381 33214 720 -250067 131972
11807 371114 -78336 -291046 225529 -63088 -178910 181271 75003 -90232 138577 -241958
11796 186844 -17523 131214 231242 -9824 -141975 10857 97581 33108 -293048 -12074 74550
11784 126896 17402 -78305 167126 106752 -35544 -165728 313830 -33941 -298253 -286872 -310096
11773 -310096 -146600 -48944 -305027 -261636 -46631 211194 -44862 64384 -243929 -108476
11762 -48803 -130751 -26686 -32557 134656 -39615 -73885 -161033 385763 201194 491609 -243711
11750 81718 21608 -7708 151189 -187548 10829 -159390 -42934 217356 19818 -392788 257593
$$ packed form
11831b02976F991a08851c4754J617A55261k7205F1939b16030E5374c49602H761
11819C4411J16799J4840a41655N3548m4089M8246n9431C3214G20b50067A31972
11807C71114g8336k12710B25529f3088j15822A81271G5003i0232A38577b41958
11796A86844a7523A31214J00028i824j32151A0857Q6724C3108b93048a2074G4550
11784A26896A7402g8305A67126o0374c5544j30184C13830c3941k64312J1381k3224
11773c10096a46600d8944k56083M3391d6631B11194d4862F4384b43929a08476
11762d8803q1948b6686n871A34656c9615l4270q7148C85763j84569K90415b43711
11750H1718B1608g708A51189a87548A0829a59390d2934B17356A9818c92788B57593
$$ plain form
11738 -101819 29324 -15025 122072 -44902 5110 205346 -6845 -72299 317200 -91765 25605
11726 -162627 59485 287145 38877 145777 52871 228669 -45578 -134049 -228124 -36492 136409
11714 -197488 -99837 429861 -44938 -108769 -97592 -143517 -36094 -34346 -51511 193499 253297
11703 253297 57151 -33916 159497 -270630 144408 161846 6012 328103 102406 205393
11693 205393 184685 168202 -105094 15593 320518 -29656 -122439 145120 -137339 6354 181056
11682 181056 -106574 263199 199212 433297 273267 198478 25901 80798 229491 45687
11671 493331 43349 65106 -202040 148624 14943 56790 -92886 167611 356119 -400901
11660 38823 101682 -68363 -165297 320581 -53862 343372 7341 138390 -144222 37795 268050
$$ packed form
11738a01819B9324a5025A22072d4902E110K00236f845o5454C17200i1765B5605
11726a62627E9485K27660C8877J06900E2871J75798d5578q8471r4075c6492A36409
11714a97488R7651D29861d4938o3831J1177m5925c6094J748j7165A93499N9798
11703B53297E7151c3916A59497b70630A44408J7438F012L22091A02406J02987
11693B05393k0708j6483a05094A5593L04925b9656r2783A45120a37339F354J74702
11682A81056a06574B63199o3987K34085j60030p4789B5901N4897J48693D5687
11671D93331D3349K1757b02040A48624A4943M1847i2886A67611J88508d00901
11660C8823O2859f8363r6934C20581e3862C43372G341J31049a44222C7795K30255
$$ plain form
11649 268050 23290 29257 -11181 351739 104005 -32218 208681 -140545 63955 -169382 97821
11637 -27238 -4837 98816 237103 -121006 -237121 18057 258500 -85117 236458 -28753 -183777
11626 -183777 -345155 297511 78186 137812 39115 91110 173774 376071 67639 167270 242973
11615 242973 -29122 77413 -154220 -75540 -114373 -124900 326991 320914 43938 36408 10927
11603 85952 221425 57709 -163174 -25938 128424 76680 325460 14097 228232 67274 -203081
11591 180429 -89381 115080 -25118 120890 -42831 -121579 -20533 100547 300523 83526 58292
11580 58292 162873 211498 86648 416572 425616 158975 68254 211925 213516 45031 -93270
11568 396767 132978 -52566 -102736 -153633 318890 135883 -80828 -123351 -387083 26930 184348
$$ packed form
11649B68050B3290N967a1181C51739A04005c2218B08681a40545F3955a69382I7821
11637b7238d837I8816J38287a21006j16115A8057K40443h5117B36458b8753j55024
11626a83777j61378B97511G8186N9626C9115N1995Q2664K02297F7639R9631P5703
11615B42973b9122G7413a54220g5540l8833j0527C26991o077D3938p530A0927
11603H5952J35473E7709a63174b5938A28424n1744K48780A4097K14135F7274b03081
11591A80429h9381A15080b5118A20890d2831p8748b0533A00547J99976H3526k5234
11580E8292J04581M8625H6648L29924R044A58975F8254J43671J591D5031i3270
11568C96767A32978e2566n0170n0897C18890A35883h0828m2523k63732B6930J57418
$$ plain form
11557 184348 334824 -162830 -153541 9590 74265 -302243 71735 -121416 -22352 277691 214730
11546 214730 -359811 252434 149076 15175 118609 195382 99136 -132554 294891 -302701
11535 269911 242826 372116 150603 88209 133859 4641 127867 287489 410888 -234413
11524 274296 -108792 -21503 282398 346664 -87012 -168307 -16944 -24107 294783 423836 -133329
11512 106704 -346555 -52815 -235969 90904 96175 -207760 68395 62020 117322 -86740 505591
11500 -12099 -111075 133554 243105 331765 181573 24707 -59603 27723 61973 -37562 273828
11488 374916 16137 173329 -29873 53184 21772 241332 300008 104557 46621 383166 198206
11477 198206 206722 251953 18988 -102095 285088 213257 69869 100915 460356 138901 184544
$$ packed form
11557A84348J50476a62830R289I590O4675c02243G1735a21416b2352B77691o2961
11546B14730c59811B52434j03358A5175J03434P6773r6246a32554B94891c02701
11535B69911k7085J29290A50603o2394M5650D641J23226J59622J23399b34413
11524B74296a08792b1503B82398O4266h7012q1295a6944p163B94783J29053a33329
11512A06704c46555e2815j83154I0904N271b07760F8395o375N5302h6740E05591
11500a2099r8976A33554J09551Q8660j50192B4707e9603B7723L4250c7562B73828
11488C74916A6137J57192b9873E3184B1772K19560N8676A04557D6621L36545j84960
11477A98206Q516M5231A8988a02095B85088p1831F9869L1046L59441A38901M5643
$$ plain form
11466 184544 41266 274008 218572 225456 12711 93545 26207 -345487 204341 210674 34630
11454 255803 18722 -49430 105323 155537 -26004 96264 225615 235883 151181 231373 83067
11442 82755 -12575 260547 193528 137090 173441 -24379 298376 172944 -213699 136431 54405
11430 88633 -244953 -198096 -47131 34247 120844 73647 -176795 -116250 59749 -19272 216662
11418 19884 242451 78952 -12038 -183620 71589 -117266 115179 61011 96709 100417 -318749
11406 -178843 -178796 -207638 358634 79437 -276564 -4303 -220225 17235 146609 16500 -230434
11394 55312 184941 -42649 70726 189503 -25698 77498 103254 30877 -131955 -91954 81265
11382 -218367 -413212 15443 33677 240870 -174443 -279641 90153 775 355503 -16617 244927
$$ packed form
11466A84544D1266K32742n5436O884A2711Q0834B6207c45487B04341O333C4630
11454B55803A8722d9430A05323N0214b6004I6264J29351J0268q4702Q0192H3067
11442H2755a2575B60547o7019n6438L6351b4379B98376j25432b13699A36431E4405
11430H8633b44953M6857d7131C4247Q6597m7197a76795O0545E9749a9272B16662
11418A9884K22567G8952a2038j71582G1589a17266A15179n4168L5698L708c18749
11406a78843M7k8842C58634G9437b76564d303k15922A7235J29374A6500b30434
11394E5312J29629d2649G0726J18777b5698G7498K5756C0877a31955M0001H1265
11382b18367j94845A5443J8234K07193a74443j05198I0153G75L54728a6617B44927
$$ plain form
11370 -200843 189855 21702 107450 140333 115373 -105839 -174402 114293 -74579 275772 108784
11358 -461597 -94322 302324 17370 -24643 284329 18196 68116 -71557 -72817 -237167 -58445
11346 57857 -233952 321385 60943 354429 -237202 95814 79144 -260188 241123 35655
11335 -33802 -190764 31988 122256 -192573 -76787 -78906 149616 -215506 -359335 151567 -262229
11323 -20274 327167 284375 -55379 306084 268272 402764 103548 1139 181998 62475 -65599
11311 -72614 124865 353731 -74847 -80473 19670 -178852 -167701 -212873 -106480 -165079 -140842
11300 -140842 263354 -322497 160139 -122434 -169794 -22295 -223452 -140283 110638 -24441
11289 278363 -65498 179995 -139437 138143 10016 -57742 184831 1801 191418 -2593 -288068
$$ packed form
11370b00843A89855B1702Q5748L2883k4960a05839o8563A14293g4579B75772A08784
11358d61597i4322C02324A7370b4643B84329A8196M9920g1557j260j64350e8445
11346E7857b33952C21385F0943K93486b37202I5814j6670b60188B41123C5655
11335c3802j56962C1988R0268a92573g6787k119A49616b15506j43829A51567b62229
11323b0274C27167m2792e5379C06084l7812J34492A03548A139J80859F2475f5599
11311g2614A24865K28866g4847n626A9670a78852J1151m5172J06393n8599K4237
11300a40842B63354c22497A60139a22434m7360b2295k01157Q3169A10638b4441
11289B78363f5498A79995a39437A38143A0016e7742A84831A801J89617b593k85475
$$ plain form
11278 -288068 -166987 -253271 -121303 -444785 -98130 128317 -145761 -204764 137153 456558
11268 456558 -115823 -117970 -292171 -214028 -299857 -370509 134259 -46968 124402 -158211 245085
11256 -130473 305958 123753 202077 55124 -96723 -97849 152535 148474 317378 144346 28022
11244 13639 282550 -168180 -42265 306352 -53136 -105212 -656483 -320750 22196 -73125 127738
11232 -332183 -59193 -229727 -218908 -132438 -166351 -119229 151921 30363 -475422 234158 85526
11220 22558 -240562 -3019 -47879 63116 204226 -98153 15975 128145 47891 270243 62878
11208 68384 27553 9782 -152058 -74 106501 284404 -259853 -122638 166411 -294191 -215811
11197 -215811 -36244 142096 68719 146436 61663 136091 -411606 127983 45042 -93624 31667
$$ packed form
11278b88068J21081q6284a21303l23482i8130A28317a45761n9003A37153L19405
11268D56558a15823k147j74201P8143q5829p0652A34259d6968A24402a58211B45085
11256a30473C05958A23753P8324E5124i6723j126A52535m061J68904A44346B8022
11244A3639K68911a68180d2265C06352e3136n2076n51271c20750B2196g3125A27738
11232c32183e9193j70534J0819Q6470l3913M7122A51921C0363d75422B34158H5526
11220B2558b40562c019m4860F3116J41110i8153A5975J12170D7891K22352F2878
11208F8384B7553I782a52058g4A06501J77903b59853a22638A66411b94191P8380
11197b15811c6244A42096F8719P7717F1663P4428d11606A27983D5042i3624C1667
$$ plain form
11185 17176 -60484 87779 -9269 -158950 -516417 -234952 -101161 88726 -177792 366619 59419
11173 -152210 29371 -36387 100288 -22560 -290422 -20649 142200 300558 239842 -141790
11162 92685 15160 -65529 -54667 156550 54715 -493590 52573 11025 42499 -110826 30065
11150 -84890 6939 149674 -33858 197886 -92463 205829 -60232 153427 95023 22469 8504
11138 118844 -36414 -12501 134362 -361831 153676 -178671 34684 39485 263923 199047 -161568
11126 -241600 133743 219055 -154950 228024 137486 4367 273270 -19419 65728 -215313 -144226
11115 -144226 82996 139102 -1491 -176905 136104 -8982 32874 -187801 94465 162371 60167
11103 244672 396748 409669 309660 -76985 82729 106465 154565 269598 67252 93192 -12142
$$ packed form
11185A7176f0484H7779i269j49681l57467b34952a01161H8726a77792C66619E9419
11173a52210B9371c6387A00288b2560k67862b0649A42200J58358o0716a41790
11162I2685A5160f5529J0862A56550E4715d93590E2573A1025L1474a10826C0065
11150h4890F939J42735c3858A97886i2463B05829f0232A53427n8404B2469H504
11138A18844c6414a2501A34362c61831A53676a78671C4684M801K24438o4876a61568
11126b41600A33743Q5312a54950B28024r0538D367K68903a9419F5728b15313P1087
11115a44226H2996N6106a491j75414A36104h982C2874a87801I4465O7906F0167
11103B44672J52076J2921j00009g6985H2729K3736M8100J15033F7252K5940a2142
$$ plain form
11091 136145 395940 522974 -203303 287760 -2094 152451 9619 67510 308755 209676 71228
11079 54500 140854 341481 602856 239674 86786 292953 291409 26405 558716 465974 404522
11068 404522 399826 645717 448478 553557 231276 88969 308269 190380 559127 265176
11057 703452 418749 683564 580480 855347 450638 590814 585184 467916 632759 655857
11047 655857 699410 672742 861768 936402 848233 520433 387212 638831 871652 701272
11037 701272 823503 673430 695976 651559 872355 483574 748468 837076 718669 670646
11027 670646 519055 478163 772328 781321 871013 450741 664863 763973 560168 783902
11017 783902 632037 381086 927733 417399 777271 542763 200983 516788 749016 962129
$$ packed form
11091A36145K59795J27034b03303B87760b094A52451I619N7891K41245r9079G1228
11079E4500Q6354K00627K61375B39674H6786K06167j544B6405N32311r2742o1452
11068D04522m696K45891j97239J05079B31276H8969K19300j17889L68747B65176
11057G03452k84703K64815j03084K74867m04709J40176n630j17268J64843K3098
11047F55857M3553k6668J89026P4634q8169l27800j33221K51619K32821j70380
11037G01272J22231j50073K2546m4417K20796l88781K64894Q8608j18407m8023
11027F70646j51591m0892K94165Q993Q9692m20272K14122R9110k03805K23734
11017G83902j51865k50951N46647D17399L59872k34508B00983L15805K32228K13113
$$ plain form
11007 962129 710680 536001 655954 717434 648625 570070 422067 663354 812846 630626
10997 630626 642093 449768 915267 461879 671920 745474 859612 659258 797714 1048702
10987 1048702 1059488 980909 1091500 957653 1002855 1097713 1071748 1339343 1570196 1840420
10977 1840420 1672863 2065611 2031309 2310974 2262855 2289516 2717541 2418326 2642604 2056172
10967 2056172 1974180 2129924 2184489 2500027 2042884 2029021 2027546 2002276 2014423 2647471 2133255
10956 2133255 1468464 1531990 1406264 825496 1059275 878857 821257 893189 683275 651868
10946 651868 542450 433536 490848 -5985 407342 -85114 373944 133060 467279 152844
10935 250721 276299 157248 266773 206383 120714 183538 -108563 4400 197395 128780 229839
$$ packed form
11007I62129k51449j74679J19953O1480o8809p8555j48003K41287J49492j82220
10997F30626J1467j92325M65499m53388K10041P3554J14138k00354J38456K50988
10987A048702J0786p8579J10591j33847M5202R4858k5965K67595K30853K70224
10977A840420j67557L92748l4302K79665m8119K6661M28025k99215K24278n86432
10967B056172q1992J55744N4565L15538m57143j3863j475k5270J2147O33048n14216
10956B133255o64791O3526j25726n80768K33779j80418n7600P1932k09914l1407
10946F51868j09418j08914N7312e985D07342h5114C73944A33060L34219A52844
10935B50721K5578j19051J09525o0390q5669O2824a08563D400J92995o8615J01059
$$ plain form
10924 229839 -17670 255066 -296963 95731 -14838 98362 42550 53467 42033 78790 113866
10913 113866 -27841 -362640 36296 -5374 188696 533 174881 78598 16371 -58279 168590
10901 71000 -26277 -83620 243569 -101258 -142295 -3873 308965 23082 -177274 293928 1070
10889 159394 125493 -63431 -336683 -129445 -72652 -356650 174150 8602 100808 166997 4044
10877 124281 -30969 -106471 -130596 -176860 165102 118556 236450 306681 99483 146632 58947
10865 -214980 -86386 44829 -20212 140891 -5324 -149895 161739 15562 218549 -253726 39802
10853 -215657 115655 206674 132787 -36522 -204088 254932 -98036 -341307 -46719 296297
10842 -15096 101804 303810 49590 130401 191565 -341752 -90312 -314848 57041 6687 127577
$$ packed form
10924B29839a7670B55066b96963I5731a4838I8362D2550J0917j1434L6757L5076
10913A13866b7841l34799C6296e374A88696E33J74348G8598A6371e8279A68590
10901G1000b6277n7343B43569a01258m1037c873C08965B3082a77274B93928A070
10889A59394l3901f3431k73252a29445N6793k83998A74150H602R2206O6189D044
10877A24281c0969p5502k4125m6264A65102m6546J17894P0231I9483M7149E8947
10865b14980h6386D4829b0212A40891e324j44571A61739A5562K02987b53726C9802
10853b15657A15655R1019p3887c6522j67566B54932i8036k43271d6719B96297
10842a5096A01804K02006D9590Q0811O1164c41752i0312k24536E7041F687J20890
$$ plain form
10831 127577 -285002 19998 -260030 -146110 -281376 -134111 195845 -249991 26202 111857
10821 111857 -190187 -18802 8264 -229602 201833 -66489 64700 -132639 -247873 -88119 31047
10809 153248 -173025 -282164 -185511 106162 -83382 -326111 -255808 -52434 -129443 28691 -26117
10797 -61082 -166401 -198023 -32114 -62780 -22995 48031 62731 155754 154049 -52968 -118864 -239084
10785 -239084 52926 71920 -107907 136045 -97608 90382 -40075 120118 -194396 -54158 159993
10773 -89071 -14660 -215049 43635 144261 -121167 172409 -222370 227082 182770 -95587
10762 -126722 -193068 -315810 -115778 53578 -53156 3299 -679 321364 155806 -71898 387506
10750 -18309 46711 -69140 210846 -28733 -106612 292476 6008 -81626 -307946 -124811 58927
$$ packed form
10831A27577b85002A9998b60030J13920j35266a34111A95845b49991B6202Q5655
10821A11857a90187a8802H264b29602B01833f6489F4700a32639j15234h8119C1047
10809A53248a73025j09139R6653A06162h3382k42729P0303e2434p7009B8691b6117
10797f1082j05319l1622c2114l0666b2995D8031J4700R3023j705e2968o5896j20220
10785b39084E2926J8994a07907A36045i7608I0382d0075A20118a94396e4158A59993
10773h9071a4660k00389D3635J00626a21167A72409b22370B27082m4312i5587
10762a26722o6346j22742a15778E3578e3156C299f79C21364A55806g1898C87506
10750a8309D6711f9140B10846b8733p7879B92476F008h1626k26320a24811E8927
$$ plain form
10738 -440291 -72400 -56260 -48088 116552 126514 -42234 -203805 236755 -283445 -293072 111608
10726 -88928 -234561 -146569 98879 80812 -18284 -55332 -74752 59715 -238297 -88500 -143926
10715 -143926 -110125 140255 -338591 -137 241107 -74482 18947 -80015 -1854 -33744 -108590
10704 -108590 3867 -394194 24860 227620 180497 60441 136605 34208 113646 -184831 -200366
10693 -200366 -378504 -152607 -302124 -24137 116599 -197984 -178650 -187367 191454 -31824
10682 -75514 155931 -328521 -520663 -84523 -270992 -226533 124379 -167960 -218061 -314496
10672 -314496 -136820 164934 289217 79940 -101766 44096 -255604 -155799 313528 -65145
10661 9438 -111859 2712 -133889 -270557 375993 -136536 -111429 -210944 -242120 196018 117834
$$ packed form
10738d40291g2400J6140Q172A16552R962d2234j61571B36755b83445r627A11608
10726h8928j45633Q7992I8879j8067a8284l7048j9420E9715b38297h8500n5426
10715a43926L3801A40255c38591a37B41107g4482A8947h0015a854l1890p4846
10704a08590C867c94194B4860K02760m7123F0441P6164C4208P9438a84831j5535
10693b00366j78138a52607j49517b4137A16599a97984J9334q717A91454c1824
10682g5514A55931c28521j92142h4523j86469M4459A24379a67960n0101r6435
10672c14496a36820A64934J24283G9940a01766D4096b55604R9805C13528f5145
10661I438a11859B712a33889j36668C75993a36536K5107r9515l1176A96018p8184
$$ plain form
10650 117834 170879 139006 -14402 -409487 267026 -150706 95547 -182721 101178 -328064
10639 141130 -132976 81104 40260 47806 21224 -194478 -95045 76132 -162258 196295 -261577
10627 77132 84384 -124185 71136 -128526 -59658 -149711 -17939 -140799 -74244 189267 -38068
10615 -169205 -255734 -44605 27261 -217084 -365205 119756 -276475 107840 -2618 -142529
10605 -142529 72719 -169405 23856 -182958 -287547 55990 -99371 -276453 -170283 -337505
10595 -337505 -25769 66819 -9863 -352737 -2218 -41657 -43919 64967 -52245 176700 -230168
10583 5365 7094 199732 -287880 -86107 -270595 289556 118207 -139716 -26236 -172737 72515
10571 45635 -5564 121691 225557 -267832 304751 40355 -35332 337286 222642 -208266
$$ packed form
10650A17834N3045l1873a4402l95085B67026a50706I5547a82721A01178c28064
10639A41130a32976H1104D0260P546B1224a94478i5045G6132a62258A96295b61577
10627G7132P252a24185G1136a28526e9658r0053a7939j22860O6555A89267c8068
10615a69205q6529d4605B7261b17084j48121A19756b76475A07840b618j39911
10605a42529G2719a69405B3856a82958j04589E5990i9371j77082J06170j67222
10595c37505b5769F6819i863l42874b218l9439k262F4967e2245A76700b30168
10583E365J729J92638b87880h6107j84488B89556A18207a39716b6236j46501G2515
10571D5635e564A21691J03866b67832C04751D0355c5332C37286j14644b08266
$$ plain form
10560 -93746 -136864 44474 -62551 263769 37099 -50700 -199749 28133 -128308 111190 179313
10549 179313 92659 -103342 -92466 -116168 66964 -8258 215447 -8428 -51438 -8809 82383 256402
10537 256402 104032 135522 -12677 -98658 -48382 -118933 306109 194753 153840 247324 -243849
10525 -354211 127215 29534 199129 87798 206638 -353853 444424 -216289 -136455 -70728
10515 -70728 -305913 87785 67010 -161104 -160016 -93279 -74165 190919 -142335 -534683 -107421
10503 -307404 -272213 -30527 36878 -38985 148454 228276 -138225 -258983 160685 -24898 137897
10491 140239 -65071 112585 11583 -336433 155781 222047 -15134 409354 165671 49212
10480 594455 263204 574702 54439 95609 -207950 123574 164656 66692 -58174 67241 -236800
$$ packed form
10560i3746m3118D4474f2551B63769C7099e0700j49049B8133a28308A11190O8123
10549A79313q6654a03342J0876k3702F6964h258B15447h428m3010h809H2383J74019
10537B56402A04032L1490a2677q5981d8382p0551C06109j11356m0913R3484b43849
10525c54211A27215B9534J69595H7798J18840c53853D44424b16289P9834O5727
10515g0728k35185H7785k0775a61104J088O6737J9114A90919a42335l92348a07421
10503c07404L5191c0527C6878c8985A48454P9822a38225j20758A60685b4898A37897
10491A40239f5071A12585A1583c36433A55781O6266a5134D09354A65671D9212
10480E94455B63204L11498E4439M1170b07950A23574M1082F6692e8174F7241b36800
$$ plain form
10468 -54095 88631 165253 201462 94112 -137081 325069 -114386 91418 -49227 74363 -209861
10456 120510 -382809 -67117 -60570 -189679 81367 -207903 -53936 242788 353883 -231964
10445 79365 324546 -34872 79115 -29106 36781 15262 272776 -133750 296316 61997 -10268
10433 -129274 -227562 -139312 -122223 -119327 54949 -130116 -201052 153353 -36988 37383 -10934
10421 -212143 -233212 59117 33760 -243716 377014 343653 -187711 -55613 -93110 -48001 -254995
10410 -254995 -397316 -119611 241959 -201297 161861 -477022 -13752 144898 -32512 84639
10399 -131397 23268 118116 -128238 80897 47330 -68479 -72534 194124 73758 112580 520563
10388 520563 -81445 193365 307220 -88873 -113871 -94014 -59358 -194230 121346 447814
$$ packed form
10468e4095H8631P6622L6209I4112a37081C25069a14386I1418d9227G4363b09861
10456A20510c82809f7117O547j29109H1367b07903e3936B42788J11095b31964
10445G9365K45181c4872G9115b9106C6781A5262K57514a33750B96316F1997a0268
10433a29274r8288Q8250J7089K896E4949a30116p0936A53353c6988C7383a0934
10421b12143k1069E9117k5357b43716C77014l3361a87711e5613l7497M5109k06994
10410b54995j42321a19611B41959b01297A61861d77022a3752A44898c2512H4639
10399a31397B3268R4848a28238H0897l3567f8479m055A94124G3758L8822M07983
10388E20563h1445A93365J13855h8873k4998J9857L4656j34872A21346L26468
$$ plain form
10378 447814 126153 331627 402504 413916 331557 538463 432508 332571 169342 128957
10368 128957 397306 320910 335930 343073 47123 261546 170110 263821 264682 115026 341355
10357 341355 -142958 29260 443772 414149 121683 509405 236843 895021 331982 245009
10347 245009 179674 103277 394030 670021 364983 414181 205141 428465 298972 220093
10337 220093 319374 448168 177299 212240 200736 27315 47441 10203 -4209 -50051 116940
10325 189934 -100644 278367 -23852 -183616 101850 74147 17025 11593 261192 -24517 -31450
10314 -31450 -215048 -144287 157467 29773 -46862 -127298 121194 352505 -134318 -145572 269722
10302 188090 -20221 -22887 -101593 85040 108108 -52741 -36108 114087 -120140 -2694 31319
$$ packed form
10378D47814A26153K05474P0877J1412q2359K06906j05955r9937j63229m0385
10368A28957K68349p6396J5020P143D7123K14423r1436R3711Q61A15026K26329
10357C41355a42958B9260M14512k9623A21683L87722B36843O58178C31982q6973
10347B45009o5335p6397K90753K75991l05038M9198B05141K23324j29493p8879
10337B20093R9281J28794A77299L4941j1504B7315K0126A0203d209m5842A16940
10325A89934a00644B78367b3852j59764A01850k7703A7025n432K49599b4517o933
10314c1450j83598P0761A57467B9773d6862q0436A21194K31311a34318j1254B69722
10302A88090b0221k666p8706H5040K3068e2741J6633A14087a20140b694C1319
$$ plain form
10290 -574356 -199228 -251449 134919 -96627 -87656 -280590 -205504 -38801 114386 16270 -115678
10278 -12447 -52647 112900 -206845 -220096 344066 48260 68561 -370708 30615 65122 -4391
10266 240178 173771 227680 125226 405424 306067 567086 300260 124290 286959 323355
10256 323355 462525 93439 354860 194469 113142 -257352 87707 165100 264956 -429070
10245 97981 -153914 -137958 257227 -270681 159592 -601334 86904 28340 220071 4334 -406457
10233 -109107 -284853 -45339 555 -223489 -266542 -94058 -78075 -92578 62501 -107341 25729
10221 -305323 -49823 153978 182824 -140925 171575 -31620 -42870 357062 -53259 73252 123067
10210 123067 -303768 -337785 -297320 -91738 -202833 -22227 97342 -8838 -57805 -156743 -107824
$$ packed form
10290e74356a99228n2221A34919i6627Q971j92934P5086c8801A14386A6270a15678
10278a2447m0200A12900b06845j3251C44066D8260K0301c70708C0615L4507d391
10266B40178o6407N3909j02454K80198r9357K61019k66826A24290J62669L6396
10256C23355J39170I3439K61421j60391q1327b57352H7707P7393R9856d29070
10245I7981a53914J5956B57227b70681A59592f01334H6904B8340J91731D334d06457
10233a09107j75746d5339E55b23489m3053i4058J5983j4503F2501a07341B5729
10221c05323d9823A53978K8846a40925A71575c1620j1250C57062e3259G3252M9815
10210A23067c03768l4017M0465i1738j11095b2227I7342h838m8967r8938M8919
$$ plain form
10199 -107824 -71012 -50065 -287767 -54762 -172699 -258857 -342734 -164994 -147220 -31504 97946
10187 73399 -207730 112147 107449 88541 201290 -174302 -189074 19316 -159509 -387562 31763
10175 -105119 39895 216722 26440 -184502 80365 -53175 -267851 113960 -404760 -18599
10164 12241 170919 231316 -48983 -312139 36933 -244153 -183992 -130350 -506651 -51986 -304108
10153 -304108 48984 -10799 66069 -58443 -108698 57740 -44205 214015 97911 -196360 -37107
10141 -102000 -70002 -336 -359014 -246062 -39033 -191663 -116804 284125 -100792 -67002 71094
10129 -161587 -196603 -53972 28277 67256 22059 26928 95582 -44773 35582 -171479 106667
10117 -36645 -209418 3258 147441 -119535 14958 -234791 -142022 103454 -35710 469104 -201061
$$ packed form
10199a07824L6812K0947k37702e4762j17937q6158q3877a64994J7774c1504I7946
10187G3399b07730A12147m698j8908J12749a74302j4772A9316a59509k28053C1763
10175a05119C9895J76827B6440a84502H0365e3175k14676A13960d04760a8599
10164A2241J58678O0397d8983k63156C6933b44153O0161N3642l76301e1986k52122
10153c04108D8984a0799F6069e8443n0255E7740d4205B14015I7911a96360c7107
10141a02000L1998c36l58678J12952c9033j52630P4859B84125a00792L3790G1094
10129a61587l5016e3972B8277L8979B2059M869O8654d4773C5582a71479A06667
10117c6645j72773C258J44183a19535A4958b34791R2769A03454c5710D69104b01061
$$ plain form
10105 102650 -57086 -58830 93938 -63877 -465305 127666 -98749 -115804 -102492 -318706 104608
10093 -65665 19610 -151598 -207006 140240 -6562 -58176 161532 55418 35377 -105335 209512
10081 -33665 92021 26520 -46381 232876 42964 89760 181873 -93111 92234 23392 150377
10070 150377 -158453 35651 106291 38898 -48789 -174103 -40953 229905 79465 -149123 -296756
10059 -296756 239093 99830 206981 70188 -59346 139583 28951 23431 163909 301812 -242729
10047 -23029 -179814 8990 146987 4652 -137634 -275697 183724 -309220 -193782 307596
10036 -36445 -23581 -18103 -42474 -185546 -123702 514229 75291 253947 -297454 -15205 21631
10024 67680 206408 -54815 -32694 118055 -37425 -49812 94295 -336939 -38944 -66661 -27427
$$ packed form
10105A02650e7086j744I3938f3877m01428A27666i8749j7055J3312k16214A04608
10093f5665A9610a51598n5408A40240f562n1614A61532E5418k0041a05335B09512
10081c3665I2021B6520d6381B32876D2964M6796R2113i3111I2234B3392J26985
10070A50377a58453C5651P0640C8898d8789j25314d0953B29905G9465a49123j47633
10059b96756B39093I9830J07151G0188e9346A39583B8951n520J40478J37903b42729
10047b3029j56785H990J37997D652a37634j38063A83724c09220J15438C07596
10036c6445J2864N478k4371j43072O1844E14229G5291J78656b97454a5205B1631
10024F7680J38728e4815K2121A18055c7425j2387I4295c36939c8944k7717b7427
$$ plain form
10012 192290 178260 -90633 -291623 -23638 127730 -224774 -2044 61679 -209850 -237995 282466
10000 -269656 91194 -115188 47549 -77122 -107821 379140 157693 -26931 -118809 -244384 -252075
9989 -252075 -160513 -39311 -440819 -22019 108973 -214395 -3409 -141542 -238068 -121746 180919
9977 158547 36156 -159075 -230650 -383992 326054 -75623 35592 107005 -157421 229359 86339
9965 -203747 -110879 -57612 -197060 -40770 -203669 -95262 12091 230779 -191768 101229 -283734
9953 -56688 18609 -244054 -106500 -168165 146505 -38486 -396287 -192637 -155384 158705 -18261
9941 7987 -204396 -384066 -145559 -248425 44341 -35143 -192988 71683 -134498 -87513 -89065
9930 -89065 241522 -37185 -92224 77383 18723 -84376 152458 -262852 -632 67378 -228099
$$ packed form
10012A92290j4030i0633k00990b3638A27730b24774b044F1679b09850k8145B82466
10000b69656I1194a15188D7549g7122l0699C79140A57693b6931r1878j25575p691
9989b52075R1562c9311m01508b2019A08973b14395c409j38133r6526J16322A80919
9977A58547C6156a59075p1575j53342C26054g5623C5592P1413a57421B29359H6339
9965b03747R2868N3267j39448d0770j62899i5262A2091K18688a91768A01229b83734
9953e6688A8609b44054a06500o1665A46505c8486l57801a92637L7253A58705a8261
9941G987b04396j79670a45559j02866D4341c5143j57845G1683a34498M6985j552
9930h9065B41522c7185n5039G7383A8723h4376A52458b62852f32F7378b28099
$$ plain form
9918 352405 93072 63865 -113638 -105020 -32729 219988 37581 -576203 -150344 -109203 -140552
9907 -140552 -74618 -208450 54351 131189 30342 -177932 -338258 -118405 106180 -33314 -321579
9896 -321579 -455539 31042 -63670 -87153 -189769 -300677 47959 -41213 131239 -245946 -44770
9884 -3246 -126361 -81574 -111814 -41750 -264430 -130467 -101349 -170885 -61898 -114516 292112
9872 -217853 -190741 -186030 -327893 -35485 -205095 126589 -33273 11392 2954 92861 157709
9861 157709 261539 -331826 46024 -93387 -148259 183532 14580 -246310 -168116 -117597 6009
9849 -36497 166905 130142 -27903 1518 132703 -448032 -50064 -141775 -100293 -73654 -147275
9838 -147275 -541897 143115 -182348 10955 101163 -91362 25586 -124001 51436 101708 47067
$$ packed form
9918C52405I3072k9207a13638Q618c2729B19988C7581e76203a50344M1141l1349
9907a40552O5934j33832E4351P6838C0342a77932j60326a18405A06180c3314k88265
9896c21579j33960C1042f3670k3483j02616j10908D7959d1213A31239b45946d4770
9884c246j23115M4787l0240d1750k22680a30467K9118o9536f1898n2618B92112
9872b17853K7112M711j41863c5485j69610A26589c3273A1392B954Q9907O4848
9861A57709J03830c31826D6024i3387n4872A83532A4580b46310P8194N0519F009
9849c6497A66905l6763b7903A518J31185d48032e0064r1711M1482K6639p3621
9838a47275l94622A43115a82348A0955R0208i1362B5586a24001E1436N0272D7067
$$ plain form
9826 -181980 -203886 -11747 -136466 -129316 -29969 162304 -162662 38027 55157 -100147 -195117
9815 -195117 -333948 26149 3183 -256114 -216431 13641 -79012 -37196 92205 -174588 7664
9803 -247996 -190160 56957 7769 109651 129355 -167047 -249883 -273673 -193121 -99797 -192554
9792 -192554 21166 44725 -346374 -162254 320199 -414913 -18539 62462 -187912 -193034 219937
9780 -204772 395044 24602 232804 76410 -144580 -507025 -44161 -356942 -151053 116444
9769 -74778 312667 -49966 -142724 59395 73284 -340269 31045 -197750 -222775 143733 -122031
9757 -534963 52523 208820 -230945 358169 -111837 129309 -23069 -23760 28359 -109723 224367
9745 -172375 32115 -239137 -12331 36717 56092 -62019 -16519 -204391 -87565 -102036 -245391
$$ packed form
9826a81980k1906a1747j24719P150b9969A62304a62662C8027J7130a00147r4970
9815a95117j38831B6149C183b56114L9683A3641g9012c7196I2205a74588G664
9803b47996N7836E6957G769J01882J9704a67047q2836k3790Q0552R3324r2757
9792a92554B1166K3559c46374a62254C20199d14913a8539F2462a87912n122B19937
9780b04772C95044B4602K08202G6410a44580l62445d4161l12781a51053A16444
9769g4778C12667d9966r2758E9395J3889c40269C1045a97750k5025A43733a22031
9757e34963E2523J56297b30945C58169a11837A29309b3069o91B8359a09723B24367
9745a72375C2115b39137a2331C6717J9375f2019a6519j87872h7565j4471j43355
$$ plain form
9734 -245391 -138665 70918 -130632 -56531 15910 -358 -301820 -264999 227871 -50959 65359
9722 -81142 -141270 37253 -121295 -291580 -217674 53728 64355 -573567 -173553 60426 38716
9711 38716 94969 -178391 -54663 271486 -177719 -72451 -177363 -109515 -23961 21353 67274
9700 67274 107091 22440 -174628 -40449 -117342 20504 -117062 -120622 -376334 -131883 6016
9688 251811 -83030 194136 155656 -218975 45727 85020 133644 -497841 -183882 -121125 100287
9676 98386 -427269 172470 15529 71647 148364 -140051 -127988 -10060 -234520 -265314 -248563
9665 -248563 52063 -127539 -213738 -108302 -391689 -34273 -180822 58148 -86065 -58289 10455
9653 2003 164641 -44826 -87070 -212638 -95497 39004 -640 -139758 -341663 -10977 29131 -336218
$$ packed form
9734b45391J06726G0918a30632e6531A5910c58l01462L6821B27871e0959F5359
9722h1142o0128C7253a21295j70285P3906E3728J0627e73567a73553F0426k1710
9711C8716N6253a78391e4663B71486a77719g2451j04912O7848b3961B1353M5921
9700F7274L9817B2440a74628d0449p6893B0504a17062l560k55712a31883F016
9688B51811h3030A94136l8480b18975D5727L9293M8624d97841a83882O2757A00287
9676I8386d27269A72470A5529N6118P6717a40051J2063a0060k24460l0794J6751
9665b48563E2063a27539q6199J05436k83387c4273j46549E8148h6065K7776A0455
9653B003J62638d4826m2244j25568i5497C9004f40j39118k01905a0977B9131c36218
$$ plain form
9640 54808 6783 300870 -114173 -196910 39364 -75748 -69101 -43804 -32363 -170174 -373167
9629 -373167 57184 -110166 58850 -134328 51360 -193734 18407 -150585 -187565 229066 -33128
9617 -234631 -143979 -139256 -173127 -209683 232880 -21258 -85939 -175658 -188756 81340 209386
9606 209386 -57744 -392499 -116604 7987 -236128 -106140 54790 131797 -193524 106280 193642
9595 193642 -250777 -36368 -33783 -116705 162985 -14185 -93622 -267349 124883 -286449 -423238
9584 -423238 200707 -99752 -174131 142103 -2206 239292 -229068 -500248 -44478 -141057 -188130
9573 -188130 8521 -103379 22808 13865 -296270 201631 9994 -116355 -271116 -16060 -36386
9562 -36386 -68660 128305 3681 -443929 -140192 -45823 -414595 62544 -70690 -147035 24739
$$ packed form
9640E4808F783K94087a14173q2737C9364g5748O647K5297J1441j37811k02993
9629c73167E7184a10166E8850a34328E1360a93734A8407a50585l6980B29066c3128
9617b34631R0652M723l3871l6556B32880b1258o4681q9719j3098H1340J28046
9606B09386e7744l34755a16604G987b36128a06140E4790P7007a93524A06280Q7362
9595A93642b50777c6368K585q2922A62985a4185p9437j73727A24883b86449j36789
9584d23238B00707i9752p4379A42103b206B39292b29068k71180d4478r6579m7073
9573a88130H521a03379B2808q943b96270B01631I994a16355j54761a6060k0326
9562c6386l2274A28305C681d43929a40192d5823l68772F2544g0690p6345B4739
$$ plain form
9550 19857 -17947 -112742 -233532 -210462 -272070 84561 141807 -58024 245889 58542 -281623
9538 -252137 291939 -145603 -218874 -567033 99601 -129054 -98794 119674 -378427 -24040
9527 7061 168253 -24482 -122370 -120522 165595 -72253 -84400 -112903 -350593 -192484 260231
9515 199592 22611 -34519 288341 -308335 334582 1900 -47603 -223581 -251982 123924 109920
9504 109920 -380990 -397790 33146 -201365 -423941 -171745 -133407 -420755 -53282 -334635
9494 -334635 -4452 163621 168886 -320858 16184 -140433 -51724 -142528 -348895 -138609 43526
9482 -77441 259529 -44000 104069 -262136 -11079 -11937 155551 79561 -23811 80863 -99832
9470 -187587 -207109 153159 85474 -6232 -24390 58222 188585 -174241 87333 -72761 -25286
$$ packed form
9550A9857a7947r4795j20790K3070o1608H4561N7246e8024B45889E8542b81623
9538b52137B91939a45603p3271l48159I9601a29054L0260A19674c78427b4040
9527G061J61192b4482r7888J848A65595g2253j2147k8503k37690J58109B60231
9515A99592B2611c4519B88341c08335C34582A900d7603j75978k8401A23924j4004
9504A09920c80990j6800C3146b01365k22576a71745L8338k87348e3282k81353
9494c34635d452A63621N265c20858A6184a40433e1724r0804k06367a38609D3526
9482g7441B59529d4000A04069b62136a1079q58A55551p5990b3811H0863i9832
9470a87587j9522A53159o7685f232j8158E8222J30363a74241H7333g2761b5286
$$ plain form
9458 -319184 14222 99976 -283583 -341328 86862 184026 247433 10212 -41828 157617 159517
9447 159517 -330009 -297482 -39708 -162047 144126 -179491 156668 87491 -33814 -171192
9437 -171192 -84212 -126341 -51216 -62900 -36658 -209745 -126072 -319254 -260743 -137788 304606
9425 -104178 -140829 44045 403033 -121096 130250 -157025 135993 -351602 -182607 -123590
9415 -123590 90670 -14472 28879 -54077 -99395 -65227 -264084 -121642 359157 70470 160509
9404 160509 -427209 -135745 -367299 -119197 -95753 254785 41693 -165926 -141662 -126701
9394 -126701 131973 -128107 -217323 -63345 -212312 -171907 -116406 -207127 -3292 -54902 -101536
9383 -101536 -369061 -101546 -247336 -107300 -126950 127672 96434 -121109 70940 253115
$$ packed form
9458c19184A4222Q5754b83583n7745H6862R7164O3407A0212d1828A57617J900
9447A59517c30009L2527c9708j22339A44126a79491A56668o9177c3814j37378
9437a71192h4212m2129e1216j1684K6242j73087Q3673j93182N8511J22955C04606
9425a04178l6651D4045L58988a21096A30250a57025A35993c51602J68995N9017
9415a23590I0670a4472B8879e4077m5318L4168j98857a21642C59157G0470R0039
9404A60509d27209a35745k31554a19197K3444B54785D1693a65926K4264J4961
9394a26701A31973a28107q9216f3345j48967M0405N5501r0721c292n1610m6634
9383a01536k67525a01546j45790a07300j9650A27672l1238a21109G0940J82175
$$ plain form
9373 253115 14854 123003 -148249 -43658 188841 -230422 -227170 -56871 355457 26052 431972
9362 431972 -93371 -266560 -138780 26798 -108242 -163406 -14435 -88275 291789 -103942 -222463
9351 -222463 -270472 -594592 -122818 7072 304279 138480 -236147 13642 57231 -70879 119046
9339 38389 20675 -184570 -452193 -256792 -261505 -189631 -67520 394262 -104486 37155 184372
9328 184372 192528 -373544 92338 -35738 -177217 -156008 130327 -54335 81872 87428 -111653
9316 174046 9684 -226955 -71023 332941 -272005 67205 -138867 33093 -151877 -53460 -139964
9305 -139964 -173204 -75524 27532 152553 227511 -7325 -197328 -220232 129281 -71395 -153018
9294 -153018 11332 217757 -118257 -158252 -316429 -79516 48280 -16657 213559 -295993 120612
$$ packed form
9373B53115A4854J08149a48249d3658A88841b30422L252e6871C55457B6052M05920
9362D31972i3371j73189J27780B6798a08242n5164a4435p3840B91789a03942j18521
9351b22463m8009l24120a22818G072K97207A38480b36147A3642M3589g0879A19046
9339C8389j7714a84570k67623J95401m713P1874f7520C94262a04486C7155J47217
9328A84372Q156c73544I2338c5738j41479K1209A30327e4335H1872N556a11653
9316A74046I684b26955g1023C32941b72005F7205a38867C3093a51877e3460q6504
9305a39964l3240g5524B7532J25021P4958g325j90003k2904A29281g1395q1623
9294a53018A1332K06425a18257l9995j58177g9516D8280a6657B13559b95993A20612
$$ plain form
9282 87378 77129 -290793 -282884 -94508 -91177 -429846 38228 -56339 128584 -21078 -201837
9271 -201837 -50743 -160048 -307690 -72351 -62067 109414 -144196 -253698 -90732 -164479 -166575
9260 -166575 -190463 -91391 21542 -93220 -224100 -48658 55785 88057 78701 22868 -184360
9248 -26115 89991 -152114 -105506 14200 -245812 -232305 -45288 136538 137485 1046 -75923 -4956
9235 166387 -311253 17415 160626 49749 93900 -54685 60478 -256702 141989 266237 -24402
9223 11476 -170131 -310005 35793 -30894 50814 62907 153717 151278 -222914 38928 -172932
9211 70061 112266 96304 -242098 230528 -214449 5559 -47544 -6603 100649 85533 204704
9200 204704 129633 101547 75125 -206366 340648 258527 14485 44547 281530 -221764 -155954
$$ packed form
9282H7378j0249b90793P909i4508L331l38669C8228e6339A28584b1078j80759
9271b01837e0743j09305j47642g2351J0284A09414a44196j09502i0732p3747k096
9260a66575k3888i1391B1542i3220j30880d8658E5785L2272r356B2868a84360
9248b6115H9991a52114M6608A4200b45812J3507d5288A36538R47A046g5923d956
9235A66387c11253A7415J43211D9749M4151e4685F0478b56702A41989J24248b4402
9223A1476a70131j39874C5793c0894E0814J2093R0810k439b22914C8928a72932
9211G0061M2205j5962b42098B30528b14449E559d7544f603A00649j5116J19171
9200B04704p5071k8086k6422b06366C40648q2121A4485L0062K36983b21764O5810
$$ plain form
9189 -155954 -216198 -75825 204956 -277130 95415 11253 -347069 84606 -125361 259734 -138502
9177 -78214 -230202 -366465 92541 -261471 237215 -8346 -165486 -90576 -252496 -173438 39952
9165 -122745 -10570 112421 -266402 -383082 -352111 -402489 8176 -390989 179542 -145914 -41048
9153 -96165 179962 215356 -175122 122236 -130802 35816 -125877 63864 -344027 21422 -254947
9141 -164067 -57645 -119727 -123374 -227271 -144574 319320 32048 76249 -104983 115550 229508
9130 229508 -109528 -100111 4086 -225464 3191 -368496 138657 -163205 110618 109789 56514
9119 56514 -17267 92908 181392 -62154 69668 333623 79420 -382427 57205 -152721 12074
9107 151689 -76355 -119933 -200057 138060 -36439 -91355 -32684 -137863 -54306 -139613 -266489
$$ packed form
9189a55954o0244g5825B04956b77130I5415A1253c47069H4606a25361B59734a38502
9177g8214j51988j36263I2541b61471B37215h346j57140P4910j61920P9058C9952
9165a22745a0570A12421b66402j16680L0971n0378H176c90989A79542a45914d1048
9153i6165A79962L5394a75122A22236a30802C5816a25877F3864c44027B1422b54947
9141a64067e7645o2082l647j03897Q2697C19320C2048M4201a04983A15550J13958
9130B29508a09528R417D086b25464C191c68496A38657a63205A10618q29n3275
9119E6514a7267I2908Q8484f2154F9668K63955G9420c82427E7205a52721A2074
9107A51689g6355m3578q0124A38060c6439n4916c2684j05179e4306q5307j26876
$$ plain form
9096 -266489 -38107 -64338 91114 -233327 132352 117610 -113411 -268032 -33816 -271739 -884
9084 -5062 -170795 72942 -180490 -101361 88465 176985 -62583 5927 -4831 54042 -406364 140926
9071 -182007 -136757 -185804 5352 179998 -224601 -26706 -97440 71239 -302196 -181206 180703
9059 -85860 113279 96955 -11372 -155226 -68301 58919 -244640 101950 -35069 92318 58861
9048 58861 -215182 188188 60027 18807 -297848 -165585 12845 -165333 -173981 -37794 14813
9036 -126375 72528 -234268 469901 -14440 219283 -152170 -117449 148841 -80607 45135 -105801
9024 297768 38199 -134966 186827 -344510 -228757 -99739 106280 263342 202018 -273844
9013 -37865 -282278 13808 -366643 -215200 -73759 47679 145606 500 131952 258111 -371447
$$ packed form
9096b66489c8107k6231I1114b33327A32352j4742a13411j54621c3816k37923h84
9084e062j65733G2942a80490P9129H8465Q8520f2583E927d831E4042d06364A40926
9071a82007M5250m9047E352J74646b24601b6706p0734G1239c02196J20990A80703
9059h5860A13279j6324a1372j43854f8301E8919b44640A01950c5069I2318l3457
9048E8861b15182A88188F0027A8807b97848J32263A2845a65333q648c7794A4813
9036a26375G2528b34268D69901a4440B19283a52170L4721A48841h0607D5135a05801
9024B97768C8199a34966A86827c44510J15753i9739A06280J57062o1324b73844
9013c7865k44413A3808c66643J51443g3759D7679R7927E00J31452J26159c71447
$$ plain form
9001 -125036 61492 -66367 141216 45042 -20146 -195960 -94788 75848 74215 155300 -180740
8989 73026 -1438 -9067 -43499 -311144 -177249 -207026 -333587 3532 -120590 77760 52387 96253
8977 96253 -165670 -170680 -90971 -52476 -140689 -159424 -215488 107159 -60381 -159634 27695 -60337
8964 -176832 145768 -195497 -47368 -308756 113212 46109 50327 77664 -217424 -22230 66193
8952 -3003 -108974 8331 -7693 -333114 -184515 -187207 307869 -15729 -10003 -52816 -120008 -31502
8939 52294 33879 31219 390688 55875 68926 -101680 446574 162094 240160 128083 461089
8928 461089 518440 595548 948723 1491363 2137245 4382525 9657454 4354216 1956896
8918 811966 516011 307374 98824 416017 89172 373967 303894 -18272 254533 130412
$$ packed form
9001a25036F1492f6367A41216D5042b0146j75814i4788G5848j633Q1085a80740
8989G3026a438p629l4432k67645J33895k9777j26561C532a20590G7760k5373M3866
8977I6253a65670n010P9709L8495q8213j8735n6064A07159f0381r9253B7695f0337
8964a76832A45768a95497d7368k61388A13212D6109M218K7337b17424b2230F6193
8952c003j05971H331g693l25421J48599k692C07869a5729N726m2813o7192c1502
8939E2294j8415k660L59469E5875J3051a01680D46574A62094P8066j12077L33006
8928D61089N7351P7108L53175N42640O45882K245280N274929D354216A956896
8918H11966k95955k08637I8824L17193H9172K84795p0073a8272B54533j24121
$$ plain form
8908 130412 212354 -171493 -214389 178733 155775 -21810 -1330 -46136 180920 -9711 -323796
8897 -323796 64558 -46652 219348 -22712 -108060 -72589 32633 48067 -34741 -47569 5958 186471
8885 186471 2830 -117791 -218488 151457 -195034 15184 32842 -63322 177378 178426 -230914
8873 -194199 175312 -44680 -68291 323996 -371836 -143598 -55442 -59370 -251211 -60168 162995
$$ packed form
8908A30412Q1942a71493m2896A78733k2958b1810a330m4806A80920i711l14085
8897c23796F4558d6652B19348b2712q5348L5471C2633J5434c4741j2828E958J80513
8885A86471B830a17791j00697A51457a95034A5184J7658f3322A77378J048b30914
8873a94199A75312d4680k3611C23996c71836a43598e5442l928j91841f0168A62995
$$ [...]
##END NTUPLES=NMR SPECTRUM
##END=
