
##TITLE=AC1362_CENAH12180_7155162_ooGzdNBeBk
##JCAMPDX= 6.0         $$ Bruker NMR JCAMP-DX V2.0
##DATA TYPE= NMR SPECTRUM
##DATA CLASS= NTUPLES
##ORIGIN= BRUKER
##OWNER= Administrator
$$ 1.72 TOPSPIN		Version 2.1
$$ 2012-11-29 19:28:52.671 -0500  Administrator@X
$$ Compression mode = diff/dup
##.OBSERVE FREQUENCY= 400.02188249412
##.OBSERVE NUCLEUS= ^1H
##.ACQUISITION MODE= SIMULTANEOUS (DQD)
##.ACQUISITION SCHEME= undefined
##.AVERAGES= 8
##.DIGITISER RES= 22
##SPECTROMETER/DATA SYSTEM= spect
##.PULSE SEQUENCE= zg30
##.SOLVENT NAME= COFFEE_meoh
##.SHIFT REFERENCE= INTERNAL, COFFEE_meoh, 1, 14.98509
##AUDIT TRAIL= $$ (NUMBER, WHEN, WHO, WHERE, PROCESS, VERSION, WHAT)
$$ ##TITLE= Audit trail, TOPSPIN		Version 2.1
$$ ##JCAMPDX= 5.01
$$ ##ORIGIN= Bruker BioSpin GmbH
$$ ##OWNER= Administrator
$$ $$ E:\/data/COFFEE/nmr/AC1362_CENAH12180_7155162_ooGzdNBeBk/20/pdata/1/auditp.txt
$$ ##AUDIT TRAIL=  $$ (NUMBER, WHEN, WHO, WHERE, PROCESS, VERSION, WHAT)
(   1,<2012-11-29 19:28:44.749 -0500>,<Administrator>,<X>,<go>,<TOPSPIN 2.1>,
      <created by zg
	started at 2012-11-29 19:27:38.687 -0500,
	POWCHK enabled, PULCHK disabled,
       configuration hash MD5:
       86 BA 57 50 F2 9D 5C 9B 26 00 A9 28 5F 66 2E 89
       data hash MD5: 64K
       85 94 F7 4B CF 96 48 18 3B A5 BC 67 D0 84 AB CE>)
(   2,<2012-11-29 19:28:51.015 -0500>,<Administrator>,<X>,<proc1d>,<TOPSPIN 2.1>,
      <Start of raw data processing
       efp LB = 0 FT_mod = 6 PKNL = 1 PHC0 = 0 PHC1 = 0 SI = 32K 
       data hash MD5: 32K
       2E DB ED 71 24 B0 0F D9 E2 10 2A E9 69 98 09 9D>)
(   3,<2012-11-29 19:28:51.499 -0500>,<Administrator>,<X>,<proc1d>,<TOPSPIN 2.1>,
      <pk PHC0 = 102.6013 PHC1 = 0 
       data hash MD5: 32K
       E2 44 08 71 E9 08 84 5D 91 63 CE 80 4A 9D 82 38>)
(   4,<2012-11-29 19:28:51.734 -0500>,<Administrator>,<X>,<proc1d>,<TOPSPIN 2.1>,
      <abs ABSG = 1 
       data hash MD5: 32K
       A5 9E 41 EF 62 8B 47 C1 35 1A 7B 4C D2 1B 39 D8>)
(   5,<2012-11-29 19:28:51.874 -0500>,<Administrator>,<X>,<proc1d>,<TOPSPIN 2.1>,
      <abs ABSG = 2 
       data hash MD5: 32K
       59 4E 45 8B 3A 38 7D A3 39 62 2F 8B D0 1A CB 98>)
(   6,<2012-11-29 19:28:52.015 -0500>,<Administrator>,<X>,<proc1d>,<TOPSPIN 2.1>,
      <abs ABSG = 3 
       data hash MD5: 32K
       13 12 89 C9 D5 72 00 D7 E4 9A 26 92 8B 2E 6A 45>)
(   7,<2012-11-29 19:28:52.171 -0500>,<Administrator>,<X>,<proc1d>,<TOPSPIN 2.1>,
      <abs ABSG = 4 
       data hash MD5: 32K
       5C B6 EB 20 A0 BD B7 C4 09 83 9A F7 E8 B3 06 B0>)
(   8,<2012-11-29 19:28:52.312 -0500>,<Administrator>,<X>,<proc1d>,<TOPSPIN 2.1>,
      <abs ABSG = 5 
       data hash MD5: 32K
       19 8E 58 00 29 63 8B B8 AE D7 80 25 24 B0 8F ED>)
$$ ##END=
$$ 
$$ $$ hash MD5
$$ $$ 31 D2 97 F0 BC 33 1E 1B FE 0B F0 B4 8E 52 83 57
##$RELAX= 
##$RELAX= 
##$RELAX= 
##$RELAX= 
##$RELAX= 
##$RELAX= 
##$RELAX= 
$$ Bruker specific parameters
$$ --------------------------
##$DU= <E:\>
##$EXPNO= 20
##$NAME= <AC1362_CENAH12180_7155162_ooGzdNBeBk>
$$ [...]
150 150 150 150 150 150 150 150
##$TP07= 0
##$TPNAME0= <>
##$TPNAME1= <>
##$TPNAME2= <>
##$TPNAME3= <>
##$TPNAME4= <>
##$TPNAME5= <>
##$TPNAME6= <>
##$TPNAME7= <>
##$TPOAL= (0..7)
0.5 0.5 0.5 0.5 0.5 0.5 0.5 0.5
##$TPOFFS= (0..7)
0 0 0 0 0 0 0 0
##$TUNHIN= 0
##$TUNHOUT= 0
##$TUNXOUT= 0
##$USERA1= <user>
##$USERA2= <user>
##$USERA3= <user>
##$USERA4= <user>
##$USERA5= <user>
##$V9= 5
##$VALIST= <valist>
##$VCLIST= <CCCCCCCCCCCCCCC>
##$VD= 0
##$VDLIST= <DDDDDDDDDDDDDDD>
##$VPLIST= <PPPPPPPPPPPPPPP>
##$VTLIST= <TTTTTTTTTTTTTTT>
##$WBST= 1024
##$WBSW= 4
##$XGAIN= (0..3)
0 0 0 0
##$XL= 0
##$YL= 0
##$YMAX_a= 663675
##$YMIN_a= -567113
##$ZGOPTNS= <>
##$ZL1= 120
##$ZL2= 120
##$ZL3= 120
##$ZL4= 120
##$ABSF1= 14.98509
##$ABSF2= -5.573092
##$ABSG= 5
##$ABSL= 3
##$ALPHA= 0
##$AQORDER= 0
##$ASSFAC= 0
##$ASSFACI= 0
##$ASSFACX= 0
##$ASSWID= 0
##$AUNMP= <proc_prof1d_extract_pilot.lims>
##$AXLEFT= 0
##$AXNAME= <>
##$AXNUC= <1H>
##$AXRIGHT= 0
##$AXTYPE= 0
##$AXUNIT= <>
##$AZFE= 0.1
##$AZFW= 0.1
##$BCFW= 0
##$BC_mod= 0
##$BYTORDP= 0
##$COROFFS= 0
##$CY= 15
##$DATMOD= 1
##$DC= 0
##$DFILT= <>
##$DTYPP= 0
##$F1P= 0
##$F2P= 0
##$FCOR= 0.5
##$FTSIZE= 32768
##$FT_mod= 6
##$GAMMA= 0
##$GB= 0
##$INTBC= 1
##$INTSCL= 1
##$ISEN= 128
##$LB= 0
##$LEV0= 0
##$LPBIN= 0
##$MAXI= 10000
##$MC2= 0
##$MEAN= 0
##$ME_mod= 0
##$MI= 0
##$NCOEF= 0
##$NC_proc= -9
##$NLEV= 6
##$NOISF1= 0
##$NOISF2= 0
##$NSP= 0
##$NTH_PI= 0
##$NZP= 0
##$OFFSET= 14.98509
##$PC= 1
##$PHC0= 102.6013
##$PHC1= 0
##$PH_mod= 1
##$PKNL= yes
##$PPARMOD= 0
##$PPDIAG= 0
##$PPIPTYP= 0
##$PPMPNUM= 2147483647
##$PPRESOL= 1
##$PSCAL= 4
##$PSIGN= 0
##$PYNMP= <proc.py>
##$REVERSE= no
##$SF= 400.02
##$SI= 32768
##$SIGF1= 0
##$SIGF2= 0
##$SINO= 400
##$SIOLD= 32768
##$SPECTYP= <>
##$SREGLST= <1H.CDCl3>
##$SSB= 0
##$STSI= 32768
##$STSR= 0
##$SW_p= 8223.68421052631
##$SYMM= 0
##$S_DEV= 0
##$TDeff= 65536
##$TDoff= 0
##$TI= <>
##$TILT= no
##$TM1= 0
##$TM2= 0
##$TOPLEV= 0
##$USERP1= <user>
##$USERP2= <user>
##$USERP3= <user>
##$USERP4= <user>
##$USERP5= <user>
##$WDW= 1
##$XDIM= 32768
##$YMAX_p= 573080281
##$YMIN_p= -1421933
##$CURPLOT= <Network HP LaserJet P1505>
##$CURPRIN= <$Network HP LaserJet P1505>
##$DFORMAT= <normdp>
##$LAYOUT= <+/1D_H.xwp>
##$LFORMAT= <normlp>
##$PFORMAT= <normpl>
##$SURQMSG= 1
$$ End of Bruker specific parameters
$$ ---------------------------------
##NTUPLES= NMR SPECTRUM
##VAR_NAME=  FREQUENCY,     SPECTRUM/REAL,   SPECTRUM/IMAG
##SYMBOL=    X,             R,               I
##VAR_TYPE=  INDEPENDENT,   DEPENDENT,       DEPENDENT
##VAR_FORM=  AFFN,          ASDF,            ASDF
##VAR_DIM=   32768,         32768,           32768
##UNITS=     HZ,            ARBITRARY UNITS, ARBITRARY UNITS
##FACTOR=    0.250966925370066, 1,           1
##FIRST=     8223.43324360094, -407831,      117738
##LAST=      0,             -291428,         -225200
##MIN=       0,             -1421933,        0
##MAX=       8223.43324360094, 573080281,    0
$$ Real data points
##PAGE= N=1
##DATA TABLE= (X++(R..R)), XYDATA
$$ [...]
19270f14734A82388D065a5285j39418f7196l20521A24206e40351C37111d10391
19259a24059l76791d321k83131a1045l51189A33926K3769c01395D77062A555J19322
19248A20877J94142a19014r5704A81577i7322F35023d48582b07751n20846g8788
19237c78244q3912P978N3463B79163h31296B04279b54686B49126i0126j74481
19227b64607h7531M2552q5305j26244C96429g89715C22673d86989b17664f9017
19216d44101C09037b87542C0582J51720a30715p3956p9152B08516J00088J75693
19206D84297A47447C8564e91661N024a55609A05786P0587M0757e59075q9172a444
19194d7852p76025K86222k66441J61795C10728J84474c20800Q8914d5705B32649
$$ plain form
19270 -614734 182388 4065 -15285 -154703 -67196 -387717 124206 -540351 337111 -410391
19259 -124059 -500850 -4321 -287452 -11045 -362234 133926 157695 -301395 477062 1555 120877
19248 120877 315019 -119014 -214718 181577 -97322 635023 -448582 -207751 -728597 -78788
19237 -378244 -462156 -454178 -400715 279163 -831296 204279 -254686 249126 -90126 -264607
19227 -264607 -87531 -44979 -130284 -256528 396429 -789715 322673 -486989 -217664 -69017
19216 -444101 309037 -287542 30582 182302 -130715 -204671 -283823 208516 308604 484297
19206 484297 147447 38564 -591661 -586637 -155609 105786 176373 217130 -559075 -648247 -1444
19194 -47852 -823877 -537655 -804096 -642301 310728 495202 -320800 -231886 -45705 232649
19183F8556L0240b42220k50186l72491M120C31627L40963C31357p9018a29016
19172d99101n720b50414R5957j58724l09551K88586a18595l83858C66375a97436
19161h47694D66398e72938b84893k08877b7412k93389R1828j17740P6717E32177
19150c9593k6743n3781C91747J7479b7621A95105a29925n18939a73956A27035
19139a093665A05612c46007k9259J79066A077010d27002O480F0277d08722Q5635
19129c23087B06165J03184p1685p8293f90821a15502D06109f5873m56316I2297
19118A31437b79926k46948B17679i98878E44614a63851j03432B78813J65650n5992
19108C88471b09420m33671o4350b90397A52486l0283b4461A06041L471h22329
$$ plain form
19183 68556 98796 -242220 -492406 -864897 -860777 331627 672590 331357 252339 -129016
19172 -499101 -504821 -250414 -154457 -313181 -622732 -334146 -118595 -502453 366375 -197436
19161 -847694 466398 -572938 -284893 -493770 -27412 -320801 -228973 -346713 -269996 532177
19150 -39593 -66336 -120117 391747 409226 -27621 195105 -129925 -648864 -173956 127035
19139 -1093665 105612 -346007 -375266 -196200 1077010 -427002 -420522 60277 -408722 -323087
19129 -323087 206165 309349 237664 159371 -690821 -115502 406109 -65873 -522189 92297
19118 131437 -279926 -526874 217679 -998878 544614 -163851 -267283 278813 444463 388471
19108 388471 -209420 -643091 -707441 -290397 152486 122203 -24461 106041 109512 -822329
19097A34729d4038A9100C929a89523k33532J11640A5113f79105a19610N8234l14634
19086c76010J14312B01849c54954a15889k8263D92365c16786m94818b45000I4934
19075B2522N40980a01949A79019c26990n97913C52893C0371J30709l7632e03644
19064B16521a4485B24209q2905L9176g33820I5471J40775a44174r76227D29885
19053c77016r331J61027j62883C64219j55553N53458A82413N1872b75910C3134
19042b75723R0711k1231B58718A24779d5134A8270b38028H2628d14260J97359
19032b16901N3685o937P5293B23834M3938b601B96131b84935a27932j86685e0867
19020A66623K82519h62621b11820k45992A66904M7915B0681a26905o7732Q1344
$$ plain form
19097 134729 -44038 19100 3929 -189523 -423055 -311415 15113 -679105 -119610 -61376 -376010
19086 -376010 -261698 201849 -354954 -115889 -144152 492365 -316786 -811604 -245000 94934
19075 22522 563502 -101949 179019 -326990 -924903 352893 30371 161080 123448 -503644
19064 216521 -14485 224209 141304 180480 -733820 95471 236246 -144174 -1120401 429885
19053 -377016 -386347 -225320 -388203 364219 208666 762124 182413 234285 -275910 33134
19042 -275723 -185012 -206243 258718 124779 -45134 18270 -238028 82628 -414260 -216901
19032 -216901 -163216 -170153 -94860 223834 267772 -2601 296131 -284935 -127932 -314617 -50867
19020 166623 449142 -862621 -211820 -457812 166904 214819 20681 -126905 -194637 -113293
19010a13293j4102c2288k08326Q7091n14895C62307a53021E3078K38898A45793
18999C5472L10521e56951b39085e6376m86008C63028L99232A52567a99607I7069
18988c682I76K33698b12377C4271e221m84288A8701L11389r017C2095M91200b02458
18975D35178b01712D5806K09706J26004I6454c84009C33161A38687K63890i45917
18964c75271c4961C25255b72063a31339j93838C53651d20748R9835O5037J16983
18954a38893a2302l9283m26683B40398M665c07815J15575i4893o27888C0218d79700
18942d12402C83882j42164m0285a9413C01832H0988L03208d1019k6121E29338
18931d18851J09941A50279c84003n4271D02283b72277H2643L7941e14015F4766
$$ plain form
19010 -113293 -127395 -32288 -240614 -153523 -668418 362307 -153021 53078 291976 145793
18999 35472 345993 -556951 -239085 -56376 -542384 363028 762260 152567 -199607 97069
18988 -3682 976 234674 -212377 34271 -5221 -489509 18701 330090 321073 32095 523295 -202458
18975 435178 -201712 45806 255512 381516 96454 -384009 333161 138687 402577 -945917
18964 -375271 -34961 325255 -272063 -131339 -325177 353651 -420748 -320913 -255876 -138893
18954 -138893 -12302 -51585 -478268 240398 245063 -307815 -192240 -94893 -722781 30218 -479700
18942 -412402 383882 241718 201433 -19413 301832 80988 384196 -41019 -67140 529338
18931 -418851 -308910 150279 -384003 -438274 402283 -272277 82643 120584 -514015 64766
18920C09852b77277j70208a91539o9015e7849m54675b05058k11050J22549l29314
18910f22873C32854c36654C61614c82848a54218B60305d74649C9053b8544k18623
18900b47167M6188J7740G4381a18134k98452A71086e81610b85306k9669J32208
18890a82767D09803g7180q33506i8099R791m32532B75N1101d24279C5649f3363
18878B708g7935k96868D64209I7931f2697A00173c73255J56295D80681C6405K85253
18867C21658f83950E45648A99407b19339j01982A2782f46709b22458n867o5473
18857b93798B61358c62851p0921L3804G03112A03498f07040i4250c9562a781C9745
18845c38768k61516a50868l1400K579C53039k47f1054m47676A73760f15388b16514
$$ plain form
18920 309852 -277277 -447485 -191539 -260554 -57849 -512524 -205058 -416108 -293559 -622873
18910 -622873 332854 -336654 361614 -382848 -154218 260305 -474649 39053 -28544 -247167
18900 -247167 -200979 -183239 74381 -118134 -416586 171086 -581610 -285306 -314975 -182767
18890 -182767 409803 -77180 -910686 -98099 -88308 -520840 275 51376 -424279 35649 -63363
18878 2708 -77935 -374803 464209 97931 -62697 100173 -373255 -216960 480681 36405 321658
18867 321658 -683950 545648 199407 -219339 -321321 12782 -646709 -222458 -228325 -293798
18857 -293798 261358 -362851 -433772 -399968 703112 103498 -607040 -94250 -39562 -1781 39745
18845 -338768 -600284 -150868 -182268 -179689 353039 352792 -61054 -508730 173760 -615388 -216514
18833g74644K01196a93j64675J4602k46356A98622a93790r5140A27235N95051
18823G22286c79572d37F2787K48706j31007a33262B93550A40547J95670c74555
18812a57995e9516a0192m25933D19965h6559n84839J62263l66054F18624b45690
18801A74034b96911l12729a19289A71272o6351b80682r806D28768b48371P8500
18791a69871B30532N6599a96335I8269f34300E81853c44483J13786P0817K1390
18781a38490j01606q9360m0446E013O54043b36413F6072a45586G7952c3042A06661
18769a84770A09433L0369J34701K27783B3386Q4584Q5230b31520A20615c431o03394
18758f06825b42449j63677A02814a33702H58654f46572J79511A5046L4045k249
$$ plain form
18833 -774644 -573448 -193 -164868 -150266 -396622 198622 -193790 -288930 127235 722286
18823 722286 -379572 -437 62787 311493 180486 -133262 293550 140547 336217 -374555
18812 -157995 -59516 -10192 -436125 419965 -86559 -671398 -509135 -875189 618624 -245690
18801 174034 -296911 -609640 -119289 171272 104921 -280682 -290488 428768 -248371 -169871
18791 -169871 230532 287131 -196335 98269 -634300 581853 -344483 -230697 -159880 -138490
18781 -138490 -240096 -329456 -369902 5013 659056 -236413 66072 -145586 77952 -33042 106661
18769 -184770 109433 139802 274503 502286 23386 107970 193200 -231520 120615 -3431 -606825
18758 -606825 -242449 -406126 102814 -133702 858654 -646572 -467061 15046 49091 46842
18748D6842J39866b17422J8919k23865F07224H2804e51604b55376A48e78674a94228
18736b80433E3323b12643n0338k03215F5628g67986c9232A62753O16883d99905
18725F7149e02869j4731n2387q1001J53536d2081B66035j2935b25494m15018R0377
18714e50135N1707K18744A7525b8245k75886h1956m23244b16823n1395E5904D376
18702c5474m5411A60797d41595B31236J65456g26618a18919j65654A85518F0533
18691I2404h64739h8986j48130k727K6407D01236a94072e5752m5335m07496q1388
18680e89971C17346b18643P7975B5109R944K55071A35277c28427a08472l86468
18670d94940a87538e8666C93048j34482h0224k45521j41224E09242j4646e56262
$$ plain form
18748 46842 186708 -217422 -198503 -422368 607224 82804 -551604 -255376 148 -578674 -194228
18736 -280433 53323 -212643 -262981 -466196 65628 -767986 -39232 162753 779636 -499905
18725 67149 -502869 -517600 -569987 -650988 -497452 -42081 266035 253100 -225494 -640512 -550135
18714 -550135 -498428 -279684 17525 -28245 -304131 -81956 -505200 -216823 -268218 55904 4376
18702 -35474 -80885 160797 -441595 231236 396692 -726618 -118919 -284573 185518 60533
18691 92404 -864739 -88986 -237116 -239843 -213436 401236 -194072 -55752 -101087 -508583 -589971
18680 -589971 317346 -218643 -140668 25109 35053 290124 135277 -328427 -108472 -494940
18670 -494940 -187538 -58666 393048 258566 -80224 -325745 -466969 509242 494596 -556262
18659f28354C75883c61565k86261A9195a27526C04574a43345L079I2328h3207
18648a95677B61590c34559C0028a34483H0409O2346g82548I2670J05406a98453
18637c17111J26314d0405B0186g07285A97878d40262J82696C86765c60329k99012
18627f59341q8666C826d95016k316A6764a57003D72804c35663a56701C00486a41172
18615d21054b00986D18326j28219M85664f3288j59225e8538C82597K12743A31317
18604d00866p7070a5310k71321j40104a6649m22084d3819C3845M47375E3010J69213
18593B22223c22285k52491C66830a95537A659d36325B94051f3003K8025o06674
18583f41652A10736c09412a35427A5069c0142j14863c091j84930C31927E3635
$$ plain form
18659 -628354 375883 -361565 -647826 19195 -127526 304574 -143345 -140266 92328 -83207
18648 -195677 261590 -334559 30028 -134483 80409 142755 -782548 92670 198076 -198453
18637 -317111 -190797 -40405 20186 -707285 197878 -440262 -257566 386765 -360329 -659341
18627 -659341 -748007 3826 -495016 -497332 16764 -157003 472804 -335663 -156701 300486 -141172
18615 -421054 -200986 418326 290107 775771 -63288 -222513 -58538 382597 595340 131317
18604 -400866 -477936 -15310 -286631 -426735 -16649 -438733 -43819 33845 481220 53010 222223
18593 222223 -322285 -574776 366830 -195537 1659 -436325 294051 -63003 -34978 -641652
18583 -641652 110736 -309412 -135427 15069 -30142 -145005 -3091 -188021 331927 53635
18572a15092j44910a14656A1814b78964A16059b26443B79405e98224d9698J1242
18562c8456C76202b33522A59515B9392f83325A62577a81670j9436h0098B8502
18551c04264B52150i3630L0293j56314r4324o2204B482e67136J64421r17a22809
18539D96565b57280o8459h5224C60370e06544J78834A04914L03935A9469c21676
18528E83369a66950A32968i2515F01486A40655J59930a96720n11355A32935c84781
18517B6704h00249a95889j80204n08124B93267c79446a76386n73226E19957A73107
18506f64010I2456b75793E5845J93909a4182j73737A75905f53617B98151b56429
18495A35726f22292a58271e8661k40781G9223L62495e05151J31990l6731p8087
$$ plain form
18572 -115092 -260002 -114656 11814 -278964 116059 -226443 279405 -598224 -49698 -38456
18562 -38456 376202 -233522 159515 29392 -683325 162577 -181670 -201106 -80098 28502
18551 -304264 252150 -93630 -63337 -219651 -313975 -376179 2482 -567136 -402715 -403632 -122809
18539 496565 -257280 -325739 -85224 360370 -506544 -327710 104914 408849 19469 -321676
18528 583369 -166950 132968 -92515 601486 140655 300585 -196720 -708075 132935 -384781
18517 26704 -800249 -195889 -376093 -884217 293267 -379446 -176386 -749612 519957 173107
18506 -664010 92456 -275793 55845 249754 -14182 -187919 175905 -653617 298151 -256429
18495 135726 -622292 -158271 -58661 -299442 79223 441718 -505151 -373161 -409892 -487979
18485d87979B3829J07559G078b12496g4123F2861g31546B88052e04944L0763m19791
18474h93972a33377D3107L7304M43344e48645a6936k59688j13150a13826F57643
18463A22443J47031j03190b78984j32553A53060b09225o7000k41406b36960I3009
18452e51623b62643e6327C36423b71081C07196f36490K92114D80335i0429E1866
18441H4776a85210B22992M72610i0991j85319E56527L4677i23471a82882D09595
18430C07961d45580d8682j71203P1229A54749J16488a80350N3169B7239b97261
18419A81384q4829a98835O1112q501E15634k43862Q7000c76160c1331k01996C22944
18407a78463l02968b02439D34665A15919b14235N3876r1299A30138a9992C82395
$$ plain form
18485 -487979 23829 131388 7078 -212496 -74123 62861 -731546 288052 -504944 -474181 -893972
18474 -893972 -133377 43107 80411 523755 -548645 -16936 -276624 -389774 -113826 657643
18463 122443 269474 166284 -278984 -411537 153060 -209225 -276225 -517631 -236960 93009
18452 -551623 -262643 -56327 336423 -271081 307196 -636490 -344376 480335 -90429 51866
18441 84776 -185210 222992 695602 -90991 -276310 556527 591204 -923471 -182882 409595
18430 307961 -445580 -48682 -219885 -148656 154749 271237 -180350 -127181 27239 -297261
18419 181384 96555 -198835 -137723 -146224 515634 271772 358772 -376160 -31331 -233327 322944
18407 -178463 -481431 -202439 434665 115919 -214235 -160359 -251658 130138 -19992 382395
18396A6092a95390k8089A00441P756b70573a0138A38533e2183D09349a58664N0106
18385a08558N3008A29496b42847D51231b52688B16813d99874G8128b44447o14207
18375h58654A81242g01443c31349A58195K44182A48112J531d51923B27464a64791
18364c61589B28720D2848J41006a09365k901A1037K48466g7965C88781A19521
18353c02499D66284b87276G3294J76411a96173J2629e9982A13571a214760D73536
18342b57836M3495E37023e996k74970A33843H722R340L25627d98394D56750b79960
18330a48174n70369F40139h0008H60849B66986C6621c69899B73179a45751n1546
18320a97297M2554k33804B65711j01938d58545J70543A58949L88613c91949K6996
$$ plain form
18396 16092 -195390 -223479 100441 108197 -270573 -10138 138533 -52183 409349 -158664 -108558
18385 -108558 -55550 129496 -242847 451231 -252688 216813 -499874 78128 -244447 -858654
18375 -858654 181242 -701443 -331349 158195 402377 148112 149643 -451923 227464 -164791
18364 -361589 228720 42848 183854 -109365 -112266 11037 259503 -77965 388781 119521
18353 -302499 466284 -287276 73294 249705 -196173 -183544 -59982 113571 -1214760 473536
18342 -257836 -214341 537023 -5996 -280966 133843 8722 18062 343689 -498394 456750 -279960
18330 -148174 -718543 640139 -80008 860849 266986 36621 -369899 273179 -145751 -197297
18320 -197297 -154743 -388547 265711 163773 -458545 -288002 158949 547562 -391949 -364953
18310c64953G7242i1177E02195i5027C78540O494g12452A34728f73228h819k37673
18299b46492G0204d34229r6552A24032f50665L10364E72783H6551b32005B9384
18288D59418b8761l18166c2968A33140a88640K7404I4846N17372q4235h88651
18277e61571H54937A44764e4783C27576a66398p8219F6355K99573J440c07283
18266H7041a55780C25194I2170b88611c5530A6210O45884c25615k88385A153b8874
18254b44455j49437B82146A14268a21494l42647C19479b23514F3778L31337d26305
18243G60384b77107F5511b96899h1558k97941J2920A72607e15185E27443d23232
18232D99288b88030C45953b10436E90516b37711k95596K53218d1524j20082A95311
$$ plain form
18310 -364953 77242 -91177 502195 -95027 378540 385034 -712452 134728 -673228 -8819 -246492
18299 -246492 70204 -434229 -530781 124032 -650665 -340301 572783 86551 -232005 29384
18288 459418 -28761 -346927 -32968 133140 -188640 -161236 94846 612218 527983 -888651
18277 -561571 854937 144764 -54783 327576 -166398 -244617 66355 365928 367368 -307283
18266 87041 -155780 325194 92170 -288611 -35530 16210 662094 -325615 -614000 1153 -28874
18254 -244455 -393892 282146 114268 -121494 -464141 319479 -223514 63778 395115 -426305
18243 760384 -277107 65511 -296899 -81558 -379499 -366579 172607 -515185 527443 -423232
18232 499288 -288030 345953 -210436 590516 -237711 -533307 -280089 -41524 -161606 195311
18221C23620i23477a3057k07265J00649G363J3755b13522J3222A13795C1977J2795
18210D4772A9078b87312H13855B2551O3439J32276e7653k16654A17399g5223j46890
18199b22113B58678d14949K01326D98766A16423d09235m5982b26068n97698K90585
18189e33181B04379e24753b20541C18505a02246A96945I5775J18030L77222k37654
18179C53373A27396a60891d4027D53455k12941b64228d3781n16461A75852e1151
18168D53169M99996A80133c20081B5750b83446D45116j13842j46284a87547j84158
18158c71705C82429A85282p1981J44960c62807b3354N047n00830K11897I9099
18147b3431A96564g7279F42030b53382m97111C39435I947K74617c70488a36156
$$ plain form
18221 323620 -923477 -13057 -220322 -119673 7363 21118 -213522 -200300 113795 31977 44772
18210 44772 19078 -287312 813855 22551 85990 218266 -57653 -274307 117399 -75223 -222113
18199 -222113 258678 -414949 -213623 498766 116423 -409235 -455217 -226068 -823766 -533181
18189 -533181 204379 -524753 -220541 318505 -102246 196945 95775 213805 591027 353373
18179 353373 127396 -160891 -44027 453455 240514 -264228 -43781 -560242 175852 -51151
18168 453169 953165 180133 -320081 25750 -283446 445116 331274 184990 -187547 -371705
18158 -371705 382429 185282 113301 258261 -362807 -23354 -18307 -519137 -307240 99099
18147 -23431 196564 -77279 642030 -253382 -750493 339435 9947 284564 -370488 -136156
18136a41522A13840Q9116J57964d2448k63176j55989a8212k16622j84715k55820
18126f75369a94553B59466f51318b08168A0905i04158C6954f08388G71258l08540
18116D62718B06384b43582k4548A65180a165148a44091J9243C43200A04911c97875
18105c26527k75702g9029l73875B3675h8995n3649C00051e03228B87739a99785
18094c37649A09098b61057B95070j7328a65483B00477b68143k3506k50673a91070
18083C05702e10656L1359H3819a18147b4356E7808g7580l53465B39556r8535m2076
18072I8945i7104k69120a58262d9854D20086e0479I4067b79548B94741b15588
18061i2034q3294B47296c76688D8198b4524m29232C3097c25627a55889A90050
$$ plain form
18136 -141522 113840 202956 360920 -42448 -305624 -461613 -18212 -234834 -419549 -675369
18126 -675369 -194553 259466 -651318 -208168 10905 -904158 36954 -608388 771258 462718
18116 462718 206384 -243582 -268130 165180 -1165148 -144091 -124848 343200 104911 -397875
18105 -326527 -602229 -79029 -452904 23675 -88995 -142644 300051 -503228 287739 -199785
18094 -337649 109098 -261057 295070 277742 -165483 200477 -268143 -291649 -542322 -191070
18083 305702 -510656 -479297 83819 -118147 -24356 57808 -77580 -431045 239556 141021 98945
18072 98945 -97104 -366224 -158262 -49854 420086 -50479 94067 -279548 294741 -215588
18061 -92034 -175328 247296 -376688 48198 -24524 -453756 33097 -325627 -155889 190050
18050f750k24557l0428B79799j08229h91880C41566q0570K40823H8320J52005
18040B40325a96943j97142B35492b14860G1281b47963B22681a16018C1513a37471
18029a51492m42230h0563B58777b5152n39537G3213a81766B37842a80207m6750
18019b26957D63125b91907J45222k67042M9022A72403L15242e2726k79177C42933
18008B69596b2840l22980o4390O7652O5737B3525K31567c1546C6146O6101K35902
17997C38149d68242A80806L32644f7776c0729m004o1111E00688A15093R6315i2940
17985c40916G173a27945I2178J57009f75654F02455d1986k97827h3956B81256
17974B78721f34089D35422c96814l82988C03695d18827d3636C95b77684n42374
$$ plain form
18050 -6750 -231307 -261735 279799 171570 -891880 341566 260996 501819 88320 240325
18040 240325 -196943 -394085 235492 -214860 71281 -247963 222681 -116018 31513 -137471
18029 -151492 -593722 -80563 258777 -25152 -564689 73213 -181766 237842 -180207 -226957
18019 -226957 463125 -291907 -146685 -413727 -364705 172403 487645 -52726 -331903 342933
18008 269596 -22840 -345820 -410210 -342558 -276821 23525 255092 -31546 36146 102247 338149
17997 338149 -468242 180806 513450 -67776 -30729 -34733 -95844 500688 115093 211408 -92940
17985 -340916 7173 -127945 92178 249187 -675654 602455 -41986 -339813 -83956 281256
17974 278721 -634089 435422 -396814 -779802 303695 -418827 -43636 395 -277684 -820058
17964h20058f351k97697a06609n0525n61471F73957b99583l53664n4984P0753
17954f37478C70484A81867M5656R3185A01066L92236H2382a36505B73177a56786
17943c08208m48484B26375A8323b55794C13174A6716J2218L80153b98250L112
17933b95138C53215o0788f2634E9899J90592b29540E32272b45422o4793O406B33327
17921F45318b53254j17227B8296g5315m51078G1509g53617B34709f03164C22269
17910A30963K75934D2609J1394J70287q8919a35416N9967H6753a08917C78178
17899d93274f8924j42101l64682A77171a39601l15526I5317k7854J72736q1610
17889A58589a31797A96157M60437c52925a38016A0898K22585J73756j91059b33769
$$ plain form
17964 -820058 -6351 -304048 -106609 -157134 -718605 673957 -299583 -653247 -708231 -637478
17954 -637478 370484 181867 227523 320708 101066 493302 82382 -136505 273177 -156786
17943 -308208 -756692 226375 18323 -255794 313174 16716 28934 409087 -298250 -295138
17933 -295138 353215 292427 -62634 59899 250491 -229540 532272 -245422 -310215 -303809 233327
17921 645318 -253254 -370481 28296 -75315 -526393 71509 -753617 234709 -603164 322269
17910 130963 406897 42609 54003 224290 135371 -135416 -75449 86753 -108917 378178
17899 -493274 -68924 -211025 -575707 177171 -139601 -455127 95317 67463 240199 158589
17889 158589 -131797 196157 656594 -352925 -138016 10898 233483 407239 216180 -233769
17878D5974a14307l76623d2694D24747b61161G95194d70686A69456E78J68891
17868A69469c11441D10874j05918a47270H6298R7209a06225E23157r0796j00737
17858C31624b7710F4394K55567d32063j61710B52926d02351J53471P6007A10534
17847g60666G5352d39B90813J81589A79040D613f53264K11339A69645a67812h3760
17835b74088I5539d68658j49968B60572f8825p7894p6108M2994B79032a14097
17824A58641Q9179L70717l02964O5521r3300a32322A66670J85952A58265O4060
17814B22325c61184C021c52477C12107f6900E89672I6972b49021B75553A09673
17803A85330O58857C43236c9868E66905a00324C36336j24401b21850n3974C24010
$$ plain form
17878 45974 -114307 -490930 -42694 424747 -261161 795194 -470686 169456 578 169469
17868 169469 -311441 410874 304956 -147270 86298 183507 -106225 523157 432361 331624
17858 331624 -27710 64394 319961 -432063 -593773 252926 -402351 -248880 -172873 110534
17847 -760666 75352 -439 290813 472402 179040 4613 -653264 -441925 169645 -167812 -83760
17835 -274088 95539 -468658 -618626 260572 -68825 -146719 -222827 -179833 279032 -114097
17824 158641 247820 618537 315573 381094 287794 -132322 166670 352622 158265 222325
17814 222325 -361184 3021 -352477 312107 -66900 589672 96972 -249021 275553 109673
17803 185330 844187 343236 -39868 566905 -100324 336336 211935 -221850 -275824 324010
17792A66368J98190f8884F9737d7061A26991n6476J45098N7902b7965n74067b00924
17780A46498b7061A90810c41721A95078E9903O1986a64823A30396c66912E39757
17769c36424p7376F4011N79577j00370a05724n02865A80912c24574A35484a03879
17758C00642A18438f46071g1131I6377b46229J17255N4271a8570A13671a75853
17747a18549J3117C07069e33021a98397E00070c84418G20845B8279K00529a39438
17736e9063l1242j13859I0438K52170j8406m6116b30005D23145b559B71301j03430
17725A67871c51244J37955C17072b46235C10002g57521E7322a01890k88457n6228
17715d46575a69475I7968N82610c56113O7866l15283K38559F39504b95684g0347
$$ plain form
17792 166368 364558 -68884 69737 -47061 126991 70515 215613 273515 -27965 -602032 -200924
17780 146498 -27061 190810 -341721 195078 59903 121889 -164823 130396 -366912 539757
17769 -336424 -413800 64011 643588 543218 -105724 -608589 180912 -324574 135484 -103879
17758 300642 118438 -646071 -71131 96377 -246229 -128974 -74703 -18570 113671 -175853
17747 -118549 -105432 307069 -533021 -198397 500070 -384418 720845 28279 228808 -139438
17736 -59063 -90305 -204164 90438 342608 324202 278086 -230005 423145 -2559 271301 167871
17725 167871 -351244 -213289 317072 -246235 310002 -757521 57322 -101890 -390347 -446575
17715 -446575 -169475 97968 680578 -356113 -288247 -603530 -364971 639504 -295684 -70347
17704H25620k82346B12861a45357A39826c7105H4750K41423j35052a93421A41779
17693c19234C15249d38767b5428i621l38172B07796g2703C1375a2875A52943a2746
17681F27716A44086J14001a52582K9383q032C5996K00074e66635B4580M9105N4128
17670A27813J42260J40003K73542J84050f2930m70335b47777B99058I9523i671
17659A90119L08686h35664a64665A38383i6224F15554j06326k36620p6180L95885
17649E92313k66240c48898B4175j0008i6543r9946A1762K293P62518E1606i4819
17637a00859l53089J30421A02304K6313J62226e7701j01506A37897M51752k41614
17627C48035f302o8080j19707l09587C02901b67851J32096F28184j61897J05931
$$ plain form
17704 825620 543274 212861 -145357 139826 -37105 84750 326173 191121 -193421 141779
17693 -319234 315249 -438767 -25428 -9621 -347793 207796 -72703 31375 -12875 152943 -12746
17681 627716 144086 258087 -152582 -123199 -131231 35996 236070 -566635 24580 73685 127813
17670 127813 270073 410076 683618 867668 -62930 -533265 -247777 299058 99523 -9671
17659 190119 498805 -835664 -164665 138383 -96224 615554 509228 272608 196428 592313
17649 592313 326073 -348898 24175 14167 -96543 -196489 11762 14055 776573 51606 -94819
17637 -100859 -453948 -323527 102304 128617 290843 -57701 -159207 137897 589649 348035
17627 348035 -6302 -74382 -194089 -503676 302901 -267851 -135755 628184 466287 572218
17617E72218B7399b27012e3653E34450a21044m71119D47276A11611b2527B1632
17606C71066L18568G4304M71122D4469a86065C41891K07245P2497j58799J16111
17596E78945A40177a34990M9837B33297H4842K53443A35699L10436q9189K80937
17586F37883m5838B89195d54411D39690a45745B2369g1460D16759j40198a24713
17575D32664j44200M04168J47919b57567C89665R852e7901l41997H33960D7891
17564f85531B99583L37999A06578M24936o1773K07423C01307J50891j28562j51617
17554A72019c7654B3759L81032A53097J89082M22990C9397N70124j91897g3280
17543A92551N46846A72994J165503D97531j13690R3064M4373k51250L7758b59622
$$ plain form
17617 572218 27399 -227012 -53653 534450 -121044 -592163 447276 111611 -22527 21632
17606 371066 689634 74304 545426 44469 -186065 341891 549136 621633 462834 578945
17596 578945 140177 -134990 -85153 233297 84842 338285 135699 446135 356946 637883
17586 637883 592045 289195 -454411 439690 -145745 22369 -71460 416759 276561 -124713
17575 432664 288464 692632 840551 -257567 389665 399517 -57901 -399898 833960 47891
17564 -685531 299583 637582 106578 531514 469741 677164 301307 452198 323636 172019
17554 172019 -37654 23759 404791 153097 342179 765169 39397 609521 417624 -73280
17543 192551 739397 172994 1338497 497531 383841 476905 521278 270028 307786 -259622
17532E44871R1718C10207N90213j22716l79369J28899K52222L91453m70760J9217
17522G19366j24332M18109k69875N4756o5864C62046L95901a06507M9875E7049
17511G11409j04395j59140O10990c20342B75188I2222N33848A25180h949B30240
17500H02579C16782j38664O71247J77094i3432F29625j06925B16399a10984C37236
17489H31451r0110B07799K72730b5018E83841R1426k33253M25374C50145o0819
17479B89326R7472K59944A85684M55343C12542J77528L41665A50576J73714M35146
17469G59436J82762e923C28903P52385C71139M2803N44729J8577m08005A459d6791
17457A25368M61200q1B82785P2919j01613A02281M26124J45937K96084b58293
$$ plain form
17532 544871 636589 310207 900420 777704 398335 527234 779456 1170909 700149 719366
17522 719366 595034 1013143 743268 798024 732160 362046 757947 -106507 -56632 57049
17511 711409 607014 447874 1058864 -320342 275188 92222 626070 125180 -8949 230240
17500 802579 316782 178118 849365 1026459 -93432 629625 522700 216399 -110984 337236
17489 831451 741341 207799 480529 -25018 583841 675267 442014 867388 350145 289326
17479 289326 386798 646742 185684 641027 312542 490070 831735 150576 324290 759436
17469 759436 942198 -5923 328903 1081288 371139 413942 958671 977248 569243 1459 -46791
17457 125368 586568 586487 282785 355704 254091 102281 528405 674342 970426 -258293
17446E81626j79277C3407P17456B13231i2989D33736a60949D45506K69189F2780
17435F3236M9077P11735l75861n63O7085n4619k17474L44254K23387C84127b31757
17423D26352K86585f8524I21533k25018Q2032j82591B91779M04244A50373K6146
17413A76519J3169B0897L63632j17477L43948B94047M44843A3518j742J76593
17403A88369K88514K85167G2148f71207b51655A50677E6966e2873E13768i9493
17392a73324C56662J46362k31223k1212J07232M63720A81124M14588g5125E94972
17381C36447k3374J08037r5288a61682D52097K64752b730C61760P93912n04428
17371F51244P22847C59873j16346b90136A55843G4265N34570C02375A02591J79924
$$ plain form
17446 581626 402349 33407 750863 213231 -92989 433736 -160949 445506 714695 62780
17435 63236 112313 824048 448187 447624 514709 460090 242616 586870 810257 384127 -231757
17423 426352 712937 -68524 921533 696515 778547 595956 291779 696023 150373 176519
17413 176519 189688 20897 384529 267052 611000 294047 738890 13518 11776 188369
17403 188369 476883 762050 72148 -671207 -251655 150677 56966 -52873 513768 -99493
17392 -173324 356662 503024 271801 250589 357821 821541 181124 595712 -75125 594972
17381 336447 313073 421110 325822 -161682 452097 716849 -2730 361760 1155672 651244
17371 651244 1374091 359873 243527 -290136 155843 74265 608835 302375 102591 282515
17361B82515K36673b921E16657B01022Q25800A79532K41809J7353P828m3745h1467
17349a00894G10258b8782A20631n2867L39174M89154g1214F58007A10401M7698
17339A58099a72809D27273J72416L58785l69499H2110M80843C9710K39440J27465
17329D06615j76969h2142B93101m7824c32974H47358B9845L51118A50409K61066
17319D11475k1126K39782j96968A7056J96817M23906B30499J8664k8105R7294
17309C18352C8812j5298M94481j94724A24162M87276N01384l24732c58371O2231
17299b96140H84404A39661J80855C5708P36523h9844D54426J92063f5558C69102
17288B57533K40804b36198G43027J21423A46343N3854L90293P1100j47880j23238
$$ plain form
17361 282515 519188 -2921 516657 201022 1026822 179532 421341 438694 446522 402777 -81467
17349 -100894 710258 -28782 120631 67764 406938 896092 -71214 658007 110401 158099
17339 158099 -172809 427273 599689 958474 588975 82110 562953 39710 279150 406615
17329 406615 229646 -82142 293101 245277 -332974 847358 29845 380963 150409 411475
17319 411475 390349 630131 433163 17056 213873 637779 230499 249163 221058 318352
17309 318352 38812 23514 517995 323271 124162 611438 1112822 788090 -358371 -296140
17299 -296140 884404 139661 320516 35708 772231 -89844 454426 646489 -65558 369102
17288 257533 498337 -236198 743027 864450 146343 200197 590490 661590 513710 390472
17278C90472M57166l37088O12652a14602F15716L60819b21184E43928a22858o88956
17268h11814A42661J26010J57661L55879j32425k87368M5350B6222K37641R27777
17258A191640C18927O99139l11969j21343L2716q8868N75200m69037j61356K98755
17248G72164A76809L10362Q1882B55886L57753R7321A98273M22701M17580C55892
17237b54555H52438l2856O7931C64008O83428m45412L34397I0427N59405q8770
17227E61062N11142j85693j20698K94723C88766J0955J47833q9354O02754B09185
17216F58784k62981N7116k320J9526K95089j41988M21422D66696J29366k27632
17206C68430a3688H78261C31364M05704M89170l61986D24642j26311m3442K02214
$$ plain form
17278 390472 847638 510550 1123202 -114602 615716 976535 -221184 543928 -122858 -811814
17268 -811814 142661 268671 426332 782211 649786 362418 407768 26222 263863 1191640
17258 1191640 318927 1018066 706097 584754 617470 528602 1103802 634765 473409 772164
17248 772164 176809 487171 569053 255886 613639 710960 198273 620974 1038554 355892
17237 -254555 852438 819582 887513 364008 1047436 602024 936421 90427 649832 561062
17227 561062 1072204 886511 765813 1060536 388766 399721 547554 458200 1060954 209185
17216 658784 395803 452919 450599 470125 765214 623226 1044648 466696 596062 368430
17206 368430 -13688 878261 331364 737068 1226238 864252 424642 298331 254889 457103
17196D57103j97360L23945K73975k00198B36415N39823Q8348C29294J10922K20891
17186F61107j14425G4422R83602L71205l13960J52G062Q27395P2288K63681l04611
17175H65815l54625L64757C36399P04871k15415A14870J041721m73197C04118
17165F24647j34508j04506P2209J92494O44056k47559E9069J209870k56315r8295
17155I14329J51276l35655A03383K86483K22958O2697j34387P64879E91373K19658
17145H11031C60416J096362m03866j17576J5564J98524m01579O43726F42872M94855
17135A137727n0622R17384q70861n43221b08204F48743M64943O5506j23988l59259
17125F95945K03293L38732k62607D36313M88279Q3111l0002K84517j52139k77906
$$ plain form
17196 457103 259743 583688 857663 657465 236415 776238 864586 329294 440216 661107
17186 661107 546682 74422 1058024 1429229 1115269 1115421 7062 834457 906745 1170426 865815
17175 865815 511190 875947 336399 1041270 825855 114870 1156591 683394 304118
17165 624647 490139 385633 457842 650336 1294392 1046833 59069 1268939 1012624 914329
17155 914329 1065605 729950 103383 389866 612824 675521 541134 1306013 591373 811031
17145 811031 360416 1456778 1052912 935336 950900 1149424 747845 1391571 642872 1137727
17135 1137727 1087105 2004489 1133628 590407 -208204 648743 1113686 1179192 1055204 695945
17125 695945 899238 1237970 975363 436313 924592 1007703 977701 1262218 1110079 832173
17115H32173J046229m40115j71455r4276K46240r9287k46689m52486O7523J051502
17105A739359o60981n37672M38391D85786L04718M86361j08749k29983M12349
17096A350482F26642K35870J05094L84152r3487j1147l51389l1404O59289k8658
17086A494962G18384L62840l65837r9394M27096N3150j29847a09789H64174L85946
17076A250120J56802n29413N79967k10092m19663P50388l64219M2780A068J535044
17066A536112m49808J46122m7277M46470m42114L21272r0139k88763N04754l50060
17056A286569K93388r6641k79272K61970M28542l52231m24500J27911P92597n95527
17046A442806n28335R35976p80973K30211L86029k59610j90183K52258j86219
$$ plain form
17115 832173 1878402 1438287 1266832 1172556 1418796 1319509 1072820 620334 687857 1739359
17105 1739359 1078378 540706 979097 485786 790504 1276865 1168116 938133 1350482
17096 1350482 626642 862512 967606 1351758 1258271 1247124 895735 864331 1523620 1494962
17086 1494962 718384 1081224 715387 615993 1043089 1096239 966392 -109789 864174 1250120
17076 1250120 1406922 877509 1457476 1247384 827721 1578109 1213890 1256670 1068 1536112
17066 1536112 1086304 1232426 1185149 1631619 1189505 1510777 1420638 1131875 1636629 1286569
17056 1286569 1579957 1483316 1204044 1466014 1894556 1542325 1117825 1245736 2038333 1442806
17046 1442806 914471 1850447 1069474 1299685 1685714 1426104 1235921 1488179 1301960
17037A301960K76281J5691j82019J30495L05713j65979p19756Q13758l77844n06722
17027H91578N67589J17196j03491N8397l11949M68969J63107M1827O98943K26020
17017B818186j052673L91757n67219J26975M87120M6881n65874O35027k10419
17008B109761k53219N30274l52499j03049K19318L27448p49454J93899l78069
16999A544410M66184M15067k90243k73330N94735k68782m51645L46708p3201N1658
16989B061561m93409J023343l22658J26658m75370O13399L20610k18489J12125
16980B747770j27814L46319o01047R6094j7851j46237J5291J95003M08861o71875
16970B244514K67465K73831n93219L19738L43446K72782j87616j70389j99779
$$ plain form
17037 1301960 1578241 1593932 1411913 1542408 1848121 1682142 962386 1776144 1398300 891578
17027 891578 1459167 1576363 1472872 1531269 1219320 1688289 1851396 1893223 2592166 2818186
17017 2818186 1765513 2157270 1590051 1717026 2204146 2251027 1685153 2320180 2109761
17008 2109761 1856542 2386816 2034317 1931268 2150586 2478034 1728580 1922479 1544410
16999 1544410 2010594 2425661 2135418 1862088 2456823 2188041 1736396 2083104 2009903 2061561
16989 2061561 1568152 2591495 2268837 2395495 1920125 2533524 2854134 2635645 2747770
16980 2747770 2619956 2966275 2365228 2461322 2443471 2297234 2312525 2507528 2916389 2244514
16970 2244514 2511979 2785810 2192591 2512329 2855775 3128557 2940941 2770552 2570773
16961B570773K47532K51885K64604m71452j5231O59354p18145O68721o27388K29186
16951C059839J09156o57344P78846k19458M22098p95509P76562k99304K30443
16942C405329M01350J14216r3545l92957J65428k47131L52585r9282N14977l16596
16932C804374l70044K07152L17749N19337k96235K83070J00071n37892L64754
16923D392336k62068j7413M08468M25467l61137m06494M14620l38634N08031l57266
16913D405910M93172J55590l89370k35135O67428J06804K454K64499Q3708j33699
16903E421361M87370m41090k3956J28814K21072M69766j234683J358012J47285
16894F533951n2098j45207k03292N52419J36032K72336K79893n39331J13615L14570
$$ plain form
16961 2570773 2818305 3070190 3334794 2863342 2848111 3507465 2789320 3458041 2830653 3059839
16951 3059839 3168995 2511651 3290497 3071039 3493137 2697628 3474190 3174886 3405329
16942 3405329 3806679 3920895 3827350 3434393 3599821 3352690 3705275 3605993 4120970 3804374
16932 3804374 3434330 3641482 3959231 4478568 4182333 4465403 4565474 4027582 4392336
16923 4392336 4130268 4112855 4521323 4946790 4585653 4179159 4593779 4255145 4763176 4405910
16913 4405910 4899082 5054672 4665302 4430167 5097595 5204399 5206853 5471352 5555060 5421361
16903 5421361 5908731 5467641 5443685 5572499 5793571 6263337 5028654 6386666 6533951
16894 6533951 6481853 6336646 6133354 6685773 6821805 7094141 7374034 6834703 6948318 7262888
16884G262888k02975J53953K12170Q2354K94546K26676L03555N65386j087039
16875G811514J011859N4442k78010j05427N72950k37239J329791l78901k33143
16866I547836K96135N25856N90162o6414k85035J79167N40518J86031O11335J2107
16856A2137698j71534P09630K09656j60163J036447K30691L23032p12159J554498
16847A5157796m27336N1072L83583L14493M48237N73044J165691q04300M51867
16838A7314147N69083Q31602P46011k09762O81630R29798p67299Q80257J058370
16829B2033837N88649R72051J87212L77357J29435J422570k22931P42712J006050
16820B7236942K72362J283583P32652R35777J035016M0031J509271Q32978K22514
$$ plain form
16884 7262888 7059913 7213866 7426036 7508390 7802936 8029612 8333167 8898553 7811514
16875 7811514 8823373 8877815 8599805 8494378 9067328 8830089 10159880 9780979 9547836
16866 9547836 9843971 10369827 10959989 10893575 10608540 10787707 11328225 11514256 12125591 12137698
16856 12137698 11966164 12675794 12885450 12725287 13761734 13992425 14315457 13603298 15157796
16847 15157796 14730460 14781532 15165115 15479608 15927845 16500889 17666580 16862280 17314147
16838 17314147 17883230 18714832 19460843 19251081 19932711 20862509 20095210 20975467 22033837
16829 22033837 22622486 23594537 23781749 24159106 24288541 25711111 25488180 26230892 27236942
16820 27236942 27509304 28792887 29525539 30461316 31496332 31536363 33045634 33878612 34101126
16811C4101126J198876J577877O4229J279256J286236R45633Q86312J136029K121277
16802D4596851J091418Q64938Q34133J789898K085968J043637Q84399K518946
16794E5710188K210885J072642J198450K489708K130905J340549K741877J913187
16786G0808391J852400K483000J786532J567496L302145J989103K218293K460276
16778H8467636K478647L023652K630422K697354K597548K392169K452653M003799
16770A10743880K352657K194159M176719L408988L078722K397814L885684K907800
16762A35146423L148459L331528L276185L028855L254857L087912K861608K923503
16754A60059330L363716L463543L133179K568203L100095J686276L498869K557994
$$ plain form
16811 34101126 35300002 36877879 36942108 38221364 39507600 40453233 41339545 42475574 44596851
16802 44596851 45688269 46553207 47387340 49177238 51263206 52306843 53191242 55710188
16794 55710188 57921073 58993715 60192165 62681873 64812778 66153327 68895204 70808391
16786 70808391 72660791 75143791 76930323 78497819 81799964 83789067 86007360 88467636
16778 88467636 90946283 93969935 96600357 99297711 101895259 104287428 106740081 110743880
16770 110743880 113096537 115290696 119467415 122876403 125955125 128352939 132238623 135146423
16762 135146423 138294882 141626410 144902595 147931450 151186307 154274219 157135827 160059330
16754 160059330 163423046 166886589 170019768 172587971 175688066 177374342 180873211 183431205
16746A83431205J981587K460819J503419J976138K362176Q26465P09176R80001
16738A96230986J828356M56440J089825K49664N16474Q9293P81703p68824N37963
16729B01011880O9041k04084o35165o19571k72581j214301j318186j049493j770321
16720A93997219j842966j887499l367874k672769l180904k739151m854934l669200
16712A69781922m634277m035338m538884m914284m904264l873316n722836m348393
16704A32810330n758960l073411n161509l801152l727766m582341l954044l955569
16696I8795578l667663m030931l415301l357803l242202k827034l914356k058640
16688G2281648k704191l104928k172784k985106k492508j983278k107107k341637
$$ plain form
16746 183431205 185412792 187873611 189377030 191353168 193715344 194541809 195250985 196230986
16738 196230986 198059342 198515782 199605607 199855271 200371745 200461038 201242741 200473917 201011880
16729 201011880 201080921 200876837 200241672 199622101 199349520 198135219 196817033 195767540 193997219
16720 193997219 192154253 190266754 186898880 184226111 181045207 178306056 173451122 169781922
16712 169781922 165147645 161112307 156573423 151659139 146754875 142881559 137158723 132810330
16704 132810330 127051370 123977959 118816450 115015298 111287532 106705191 102751147 98795578
16696 98795578 95127915 91096984 87681683 84323880 81081678 78254644 74340288 72281648
16688 72281648 69577457 66472529 64299745 61314639 58822131 56838853 54731746 52390109
16680E2390109k025212k092670j692393k036685r54162k154964j766898j974464
16672C7692661l06763j834934j348376q06131j442045j317170n65893j072795
16664B8998554l62299k190824l49223p40572j217327l83666j20823p88551j188546
16655B1656723r12945O43471o87763o41181j449277n0952q67731m86759K22127
16646A7425713j405532j54826M41494o18958m47602l13502R0754j414056N09887
16637A4113372n60870M1866p64310n45814K13241j29745r10880Q09011r03361
16628A1362510l20851j17787M82692n28671k5201l33107m11643j110726N68365
16619I565581O152l53813k1573k76351J25938j151973O12922J75829o79015o4130
$$ plain form
16680 52390109 50364897 48272227 46579834 44543149 43588987 41434023 39667125 37692661
16672 37692661 37385898 35550964 34202588 33396457 31954412 30637242 30071349 28998554
16664 28998554 28636255 26445431 26096208 25355636 24138309 23754643 23633820 22845269 21656723
16655 21656723 20743778 21387249 20699486 20058305 18609028 18558076 17690345 17203586 17425713
16646 17425713 16020181 15865355 16306849 15687891 15240289 14926787 15017541 13603485 14113372
16637 14113372 13552502 13594368 12830058 12284244 12497485 12367740 11456860 12265871 11362510
16628 11362510 11041659 10923872 11406564 10877893 10852692 10519585 10107942 8997216 9565581
16619 9565581 9571733 9217920 9196347 8919996 9045934 7893961 8506883 8682712 8003697 7939567
16609G939567m55134Q11066m90913q69924J216957r80643k06094k30229L58001
16600G092654p70199l03933P89530L01184q73717k7414k61435J6606J06944J37274
16590F207494m25117Q0013m13027J76444l76067J14057r23532Q09301j34708k26419
16580D888439J24811N31825m78169j63836k5898K6304J80262q0611l18242k06587
16570D478298O2718j10522m01637L62089J13729k29148L02093j59233p20331M77570
16560D175626L66912n36025k30254n75453P96863n48722j10765J49415l45232
16551C142365K22515l6014L45866k36112j02993l86644N58117k57256P8772l5261
16541C293355K51045J474m18703j7794J46573M69440p31865J53398l26J78018
$$ plain form
16609 7939567 7484433 8295499 7804586 6934662 8151619 7170976 6964882 6734653 7092654
16600 7092654 6322455 6018522 6808052 7109236 6235519 6208105 5946670 5963276 6070220 6207494
16590 6207494 5782377 5862390 5449363 5625807 5249740 5363797 4440265 5249566 5114858 4888439
16580 4888439 5013250 5545075 5066906 4903070 4877172 4903476 5083738 5003127 4684885 4478298
16570 4478298 4541016 4430494 4028857 4390946 4504675 4275527 4577620 4418387 3698056 4175626
16560 4175626 4542538 4006513 3776259 3200806 3997669 3448947 3338182 3487597 3142365
16551 3142365 3364880 3328866 3674732 3438620 3335627 2948983 3507100 3249844 3328616 3293355
16541 3293355 3544400 3545874 3127171 3109377 3255950 3725390 2993525 3146923 3146597 3324615
16531C324615j69547r86715P85993K13316p10288L75873j27485P10526n62770
16522B853518j7305j34321K29p16768K11272N37940m11007P43412n82486k77113
16512B207371M23813r7967K07581l21864o0043l10559m90355O94205k3187O0684
16502B289679L04869n85252J44692l54372J72411n10011j64104N13910m9110M93762
16492B256474m2360L83354j23778o15064L50613r90093M75721K05347L09479J5346
16482B225039o59635N40504l16858l50158L02820M38210l76079M0955L6885l35592
16472A546091Q6097m16282K52711M7427O26435n07442L76942m37530k64701p5419
16462A234329R97247K01584m12657l21375L62195k71175l22832L67978j23895
$$ plain form
16531 3324615 3155068 2168353 2954346 3167662 2457374 2833247 2705762 3416288 2853518
16522 2853518 2836213 2701892 2702121 1985353 2196625 2734565 2323558 3066970 2484484 2207371
16512 2207371 2631184 2533217 2740798 2418934 2358891 2048332 1557977 2252182 2228995 2289679
16502 2289679 2594548 2009296 2153988 1799616 1972027 1462016 1297912 1811822 1762712 2256474
16492 2256474 2214114 2597468 2473690 1858626 2209239 1219146 1694867 1900214 2209693 2225039
16482 2225039 1565404 2105908 1789050 1438892 1741712 2179922 1803843 1844798 1881683 1546091
16472 1546091 1632188 1215906 1468617 1516044 2142479 1635037 2011979 1574449 1309748 1234329
16462 1234329 2231576 2433160 2020503 1699128 2061323 1790148 1467316 1835294 1711399
16453A711399j81111Q3575n0175r0558o7354P1059n46202K23252M68319l65011
16443A257193k36750O1175L21254p0560j38388l1887P60251n14451L22247J68104
16433A898188K07324r60601R41442p54944R8300n33625J410122q19323m91590
16424I95293Q61011p11498j37570K47580L08275q1738l39014M29454n70108J13030
16414A114715K45369m58435O67979l27317L8073K64867l50064L14854J31443p5347
16404A566137R77110A216118O774k27001O62564G96519K75669P7658m02584r8810
16394F48452L53312m40463M76310N06080l38544M23201m71589L11069n58257O9158
16384I78729K6465l8864P5302J12968k08797N28182O06315o56081n66706N55274
$$ plain form
16453 1711399 1530288 1613863 1563688 1473130 1405776 1476835 930633 1153885 1622204 1257193
16443 1257193 1020443 1081618 1402872 1332312 1193924 1162037 1922288 1407837 1730084 1898188
16433 1898188 2105512 1144911 2086353 1331409 1429709 896084 2306206 1486883 995293
16424 995293 1856304 1144806 1007236 1254816 1563091 1481353 1142339 1571793 1001685 1114715
16414 1114715 1360084 901649 1569628 1242311 1280384 1545251 1195187 1510041 1641484 1566137
16404 1566137 2543247 1216118 1222892 995891 1658455 796519 1072188 1149846 747262 648452
16394 648452 1001764 561301 1037611 1543691 1205147 1628348 1156759 1467828 909571 978729
16384 978729 1005194 966330 1041632 1154600 945803 1473985 2080300 1424219 857513 1412787
16374A412787m08439M80217F71417O11538J96515o61209M23164N6869l60467K56885
16364A194712m67349M5370N56526k36844k59786j08431j68984L60674L31662E19114
16353A039928j89223J39622k22449k1223K88513C48249N45455J00203K86872M03023
16343A683802F77096j75178L90697P523m04577J55231L54414C37575J75461N6503
16333E69539a64276I55888O5991m82475P219M42454K14598o8173l66477J05722
16323H74747N2609l33983K44396j55062J36957k28396O69929C44433N70199K60732
16313A175364B45170N11833j71541j34891K90559M74259k92761o1958K20698n11493
16303E69875A97868r2237P71577k48375L46051k75433N24170m99030J20843j37998
$$ plain form
16374 1412787 1004348 1484565 671417 1282955 1479470 818261 1241425 1298294 937827 1194712
16364 1194712 727363 772733 1329259 1092415 832629 724198 555214 915888 1247550 519114
16353 1039928 850705 990327 767878 746655 1035168 348249 893704 993907 1280779 1683802
16343 1683802 677096 501918 892615 900138 495561 650792 1005206 337575 513036 569539
16333 569539 -164276 955888 1021879 539404 546623 989077 1203675 1135502 769025 874747
16323 874747 927356 593373 837769 682707 819664 591268 1261197 344433 914632 1175364
16313 1175364 245170 757003 585462 450571 741130 1215389 922628 860670 1081368 569875
16303 569875 197868 105631 877208 628833 974884 699451 1223621 724591 845434 707436
16293G07436K480B61080L65502k38374R55940E38786j4002k303M85868k19814
16283G88535K25234l66335j60052M59651m5007L38215A25657K06307O88308l85478
16273F34794k56688N14222j88284M91922n58664k56159J79053K37539K98633M9105
16263A145473D1124N37750b3788E0423J017770L6274l33366j39903j45293K93023
16253G78928K06759A91929N8602K42843r3549c57466H22044C25793K89043L01348
16243I16184K74415j99469D12195N14000A47605J22026O3565M23627l33321J19764
16233E43266M46782J29399B1119J009792C97021L52039B60011J10645K39194P1513
16223F81363B04813L46143j90294A03024h5415D95495k1365R0924K10123C36338
$$ plain form
16293 707436 709916 261080 626582 388208 1344148 538786 524784 522481 1008349 788535
16283 788535 1013769 647434 487382 947033 902026 1240241 125657 331964 1020272 634794
16273 634794 378106 892328 704044 1195966 637302 381143 560196 797735 1096368 1145473
16263 1145473 41124 578874 -23788 50423 1068193 1104467 771101 631198 485905 778928
16253 778928 985687 191929 250531 493374 399825 -357466 822044 325793 614836 916184
16243 916184 1190599 991130 412195 926195 147605 269631 333196 756823 423502 543266
16233 543266 990048 1119447 21119 1030911 397021 749060 260011 370656 609850 681363
16223 681363 204813 550956 360662 103024 -85415 495495 474130 565054 775177 336338
16212C97291j82906M19096j69602K15370k5377a0500F00798k43948M8787Q8692
16202D94329K91769j12928E1437L35855A28724N20845q760k63841N6512L27586
16192G61066j49319k82875j36869J797K91543K92999J03946B20842K94161P7959
16182E92962B54927l2947J90278P25842B2449N49917j67653K06107k4031B6072
16171A155702E08104m8647q1775B0552f58375a67576E83920j48554L97414a65261
16160B27957O15576B64798M01819C00628A04067L55347B08423J05476q3248L97403
16150F28054B00394N249K32853b10827F63808j69743L7683k39503L09714j60609
16140D41350C5102M59082k17532a49977I9773O28045c68889A023823A07249N18496
$$ plain form
16212 397291 214385 633481 463879 679249 653872 -10500 600798 356850 405637 494329
16202 494329 786098 673170 51437 387292 128724 649569 640809 376968 433480 761066
16192 761066 611747 328872 192003 193800 485343 778342 882288 220842 515003 592962
16182 592962 254927 221980 412258 1138100 22449 572366 404713 610820 586789 26072
16171 1155702 508104 459457 377682 20552 -658375 -167576 583920 435366 832780 -165261
16160 227957 843533 264798 666617 300628 104067 459414 208423 313899 230651 628054
16150 628054 200394 205643 438496 -210827 663808 494065 531748 292245 601959 441350
16140 441350 35102 494184 276652 -149977 99773 727818 -368889 1023823 107249 625745
16130F25745C0447N24831A28613M73481E3576d9087m21732B13231b39548C46648
16119F13898A48062b29467A93047M81513l33269e52713a01842D40340a25594B85773
16108a12601D59423j77727B6233M53085g9980F05135i113D80349A86310L35209
16098E21519a66319A24016F395K29656k3536H0548a35427E19196a33231A56220
16087A85248d50083K16962o51J3754m55219a28817D40387c5605B43502b67702
16076A60680m3458a44894l46023a77673j8028j25670A09198J03679c04981J31787
16066a73194d8367q6812f4341o1628j34603C84587n8025C765L40452j33548R0776
16055C01445m0755b80820j74230A31705e6081D13642a84869B39644K9984o0938
$$ plain form
16130 625745 30447 555278 128613 602094 53576 -49087 -470819 213231 -239548 346648
16119 613898 148062 -229467 193047 674560 341291 -552713 -101842 440340 -125594 285773
16108 -112601 459423 281696 26233 479318 -79980 605135 -9113 480349 186310 521519
16098 521519 -166319 124016 6395 236051 212515 80548 -135427 519196 -133231 156220
16087 185248 -450083 -233121 -233772 -220018 -675237 -128817 440387 -35605 243502 -267702
16076 160680 117222 -144894 -490917 -177673 -195701 -321371 109198 212877 -304981 -173194
16066 -173194 -48367 -135179 -64341 -125969 -260572 384587 326562 3765 344217 210669 301445
16055 301445 260690 -280820 -455050 131705 -56081 413642 -184869 239644 269628 208690
16045B08690h8041p03029C95995D1800J78274d22373k54421c32914B95971c53193
16034A03408b07457J03411o94404E05324A21395a5897B2659a86824E03798j56841
16024C46957n3374j00966J43083J1934L2583A54142a25022B8988J58485h0250
16013D00942d21921a03685E10166j15715b97283a0565A035283f04349H64001l98045
16003D65956K02510a44057C13530a89224F54167G5032P75589d76917e8073j46131
15993b04204k2578c3731l25909a06235B90875F9125K5288R188N28264A40907L16670
15982D57577j67247j41029a80397D47527E3057N75306A20817h4786m02036A68177
15971c04805a49972D74462G2036a51487m64205b26375p333I1655Q64417l32177
$$ plain form
16045 208690 -88041 -791070 395995 41800 220074 -422373 -676794 -332914 295971 -353193
16034 103408 -207457 -104046 -798450 505324 121395 -15897 22659 -186824 503798 346957
16024 346957 293583 192617 335700 347634 380217 154142 -125022 28988 187473 -80250
16013 400942 -421921 -103685 510166 394451 -297283 -10565 1035283 -604349 864001 465956
16003 465956 668466 -144057 313530 -189224 654167 75032 850621 -476917 -58073 -204204
15993 -204204 -226782 -33731 -359640 -106235 290875 69125 94413 103601 631865 140907 457577
15982 457577 290330 149301 -180397 447527 53057 628363 120817 -84786 -486822 168177
15971 -304805 -149972 474462 72036 -151487 -615692 -226375 -233708 91655 956072 623895
15961F23895k48515H1770b43985B37746H4394b7322n37552g1602O718D98255e75385
15949A94390A7925b87618B26607d04380D81148i52412e9782n79454b8846G8136
15938b44593R2683C12724b21480l90537c6582R232G3341N64311l03454a16886
15927c26613j14622a56858n24885C17419A16374N20168c65124A04725J40603d17448
15916i81515d63914d2928j62654c666H03588g5601n24443K46912D50746K65507
15906G16253B03295c04499o53495d2306j69306A83995K35106c23457A00237J50185
15896B50422c68334N5005J33576j78611A68408J38907m9175p1609a97518j38358
15886c35876a14643E13114A70813h6651A75170J33345c94340J35580P6414E2948
$$ plain form
15961 623895 375380 81770 -243985 237746 84394 -27322 -564874 -71602 -64884 498255 -575385
15949 194390 17925 -287618 226607 -404380 481148 -952412 -59782 -639236 -28846 78136
15938 -244593 -151910 312724 -221480 -612017 -36582 -27350 73341 637652 334198 -116886
15927 -326613 -441235 -156858 -681743 317419 116374 636542 -365124 104725 245328 -417448
15916 -981515 -463914 -42928 -205582 -3666 803588 -75601 -600044 -353132 450746 716253
15906 716253 203295 -304499 -957994 -42306 -211612 183995 419101 -323457 100237 250422
15896 250422 -368334 -313329 -179753 -358364 168408 307315 258140 186531 -197518 -335876
15886 -335876 -114643 513114 170813 -86651 175170 308515 -394340 -258760 -182346 52948
15875a5345C52686c85229J41595P9937k59737D5839e4770M88j44610m31671R020
15864f21543P3642D1728d83560A44142J02169c96507N6196A27390J76634b4780
15853A54999a52543n7409H0131d54603J37970H023J9691K36736J20482g6089B55515
15841g7067q1115n72556b10951a8009B05062a64511j84008N8384n128B26050a9039
15829c4735G24458D4744c00325L2493f8367k10202a18607C01710J73941I9478
15818d1638l28708k17233N1228a8838q0684j1630o69925d6146G08943b0122n29401
15807e49523b41182D13169A93533K58781H2538i99230a29408l05306a7411F9089
15796d49846j08322D6771c49150n8279C17058e40724K03333J57025j30367A333
$$ plain form
15875 -15345 352686 -385229 -243634 -163697 -423434 45839 -54770 -54282 -198892 -630563 -621543
15864 -621543 -547901 41728 -483560 144142 246311 -396507 -340311 127390 304024 -24780
15853 154999 -152543 -209952 80131 -454603 -316633 8023 27714 264450 384932 -76089 255515
15841 -77067 -158182 -730738 -210951 -18009 205062 -164511 -348519 -290135 -295263 226050 -19039
15829 -34735 724458 44744 -300325 -267832 -68367 -278569 -118607 301710 475651 99478
15818 -41638 -370346 -587579 -536351 -18838 -99522 -111152 -781077 -46146 708943 -20122 -549523
15807 -549523 -241182 413169 193533 452314 82538 -999230 -129408 -434714 -17411 69089
15796 -449846 -558168 46771 -349150 -407429 317058 -540724 -337391 -180366 -310733 1333
15785a52357J9414D57050J84399g41133C93133d7726F9102c0438E3851b76176
15774h109D92823b46211G6369b9554p93269C549g5798k80221o6834a67817k59157
15763d26974b11111A21226a92127C65041P366d75609m97065B14128B7184L7855
15753F5039J54947j3594a00755d9298o11443b27636O0736D88683j31577D0030
15742A39825C8389J58220a23416a3568n36951f2196m33891e6416B1510b6240G37454
15730C75772f7013k27729n4015j58402A00995N39958h1517p04594C5950b68337
15719b46069m51174K86780J58483B07405L8109J69716J60795g27802L28120C61443
15708a10238C55087h40005b16606a6833m17716o28956b50800E7164c4692m17506
$$ plain form
15785 -152357 -132943 457050 641449 -741133 393133 -47726 69102 -30438 53851 -276176
15774 -8109 492823 -246211 76369 -29554 -822823 3549 -75798 -356019 -422853 -167817 -426974
15763 -426974 -211111 121226 -192127 365041 372407 -475609 -972674 214128 27184 65039
15753 65039 219986 206392 -100755 -49298 -660741 -227636 -166900 488683 357106 40030
15742 139825 38389 196609 -123416 -13568 -550519 -62196 -496087 -56416 21510 -26240 737454
15730 375772 -67013 -294742 -348757 -507159 100995 640953 -81517 -786111 35950 -268337
15719 -246069 -697243 -410463 -251980 207405 245514 415230 576025 -727802 -399682 361443
15708 -110238 355087 -840005 -216606 -16833 -434549 -1063505 -250800 57164 -34692 -452198
15698d52198J73310C8095a36016N0586C8873O0696d3738k89199M5544A53791M88850
15687F42641a53691k43727M4852C01781o9981m5512d92999C1548M52727D0136
15676E9399d23825B9389b88755B82449c92875c1034l69210N9437R4535q6033l08802
15665f41107a90731e976o30188A59322c7503j81115G9259b18683D54c40851j15179
15654d56030d7833m99314g8849k64605o339G25414a4815j9691r20331C1465h46659
15642B03505d76911N3990a28125j66103A24922f03236b08666A32072e32136K11271
15632c20865F6128M1654c22862a15916M4155B5210i4191l08752a91024k54675
15622d45699A52981h17535c32233b3273l05824J52655K6819q7118k16853C905
$$ plain form
15698 -452198 -278888 38095 -136016 -85430 38873 99569 -43738 -332937 -287393 153791 642641
15687 642641 -153691 -397418 -352566 301781 231800 186288 -492999 31548 484275 40136
15676 59399 -423825 29389 -288755 282449 -392875 -31034 -400244 -340807 -246272 -332305 -641107
15665 -641107 -190731 -5976 -636164 159322 -37503 -218618 79259 -218683 454 -340851 -456030
15654 -456030 -47833 -547147 -78849 -343454 -349793 725414 -14815 -34506 -954837 31465 -846659
15642 203505 -476911 -422921 -128125 -294228 124922 -603236 -208666 132072 -532136 -320865
15632 -320865 66128 107782 -322862 -115916 -71761 25210 -94191 -402943 -191024 -445699
15622 -445699 152981 -817535 -332233 -23273 -329097 -176442 -149623 -236741 -453594 3905
15611A9082i4514m678C19130O55629F2635k7702a11152C84307A60075f07673G7290
15599h9301A64287o1477c22779j19547D27983J93944b6505C3557e10080D10563
15588c48995C20865a84331O9658A73271L30259k28184O10288E8525J32270J0216
15578B01011d24984B07922I2067K68087f09552J81871E9780d27523J02796F09760
15567A86597k8670J65442d72568j9633g9226E22363d04085N6828J69443E76707
15556a70853p565m6841r0957o6767b4386D2004c75851B64531A01959a02831k64038
15545c66869C52179K04542A20409b96170H742c91837J84165a196l61799J06617
15535b56378m02982D71001J18142J37888g5465E04560j54551F3474b3653G16556
$$ plain form
15611 19082 -94514 -99192 319130 974759 62635 34933 -111152 384307 160075 -607673 77290
15599 -89301 164287 102810 -322779 -442326 427983 621927 -26505 33557 -510080 410563
15588 -348995 320865 -184331 -114673 173271 503530 275346 885634 58525 190795 201011
15578 201011 -424984 207922 92067 360154 -609552 -427681 59780 -427523 -324727 609760
15567 186597 157927 323369 -472568 -492201 -79226 522363 -404085 -347257 -177814 576707
15556 -170853 -178418 -225259 -316216 -382983 -24386 42004 -375851 264531 101959 -102831 -366869
15545 -366869 352179 556721 120409 -296170 8742 -391837 -207672 -1196 -362995 -256378
15535 -256378 -659360 471001 589143 727031 -75465 504560 350009 63474 -23653 716556
15524D50298e73593B47708f656B37664J38589p0296c16730B03880a15835D90661
15513c90559D21037F1945L2846A7741b44289l43821a40568M851j07972L2225C66220
15501E10585N9336j10250B17886c30633D11835i6631E94499F316A102d7865j2772
15490f0637k62684B85654a37400A14515i7060f128E00160j53372a57189C26425
15479G10938K00023k83023A33111n7926O50878B17521J01023d52443C56081j07646
15469B48435K63287F1340K42821j7819J15223M5814D4212J76825K82722b91625
15458B21505c68659E29135A03962g4652B39050c4437A96581J2195J59937r0333
15448B78380J2936R9406A66607J12577B4570N45631a56459n1761A02890L46226
$$ plain form
15524 450298 -573593 247708 -6656 237664 376253 305957 -316730 203880 -115835 490661
15513 -390559 421037 61945 94791 17741 -244289 -588110 -140568 -135717 -243689 -211464 366220
15501 510585 569921 459671 217886 -330633 411835 -96631 594499 6316 1102 -47865 -60637
15490 -60637 -323321 285654 -137400 114515 -97060 -6128 500160 346788 -157189 326425
15479 710938 910961 627938 133111 75185 726063 217521 318544 -452443 356081 248435
15469 248435 511722 61340 304161 286342 401565 447379 44212 221037 503759 -291625
15458 221505 -368659 529135 103962 -74652 239050 -34437 196581 208776 368713 278380
15448 278380 291316 390722 166607 279184 24570 570201 -156459 -208220 102890 449116
15438D49116L76480j87712k56705f8915D43242A98714J1699n3574K49584P12785
15428A119208i0667B8807L50242J80006A61982n0925a18075k53333A52776A8195
15417A0619K69068a61j52047A76065L5222d19772B88728I3772k186c5559j03346
15406a38905o35849d3241o92719L22516A68503e81334C95598j84526K67286b0078
15395d38957C4983L17510E2403a02072c4783B4835Q5618K27800o4054n3058c4903
15383d28544j34390A26169J54519d07628B38872a89177l50943D16330J52505I0557
15372C55707A15427L29233f02046B07302a8894B4370J36287O91779d3042a4472
15361C1647J85799l6906L2292d09362D26796G1703L61814a06329l14643F88636
$$ plain form
15438 449116 825596 637884 381179 -68915 443242 198714 210413 156839 406423 1119208
15428 1119208 -90667 28807 379049 559055 161982 111057 -118075 -371408 152776 18195
15417 10619 279687 -161 -152208 176065 211287 -419772 288728 93772 91586 -35559 -138905
15406 -138905 -774754 -43241 -735960 -413444 168503 -581334 395598 211072 478358 -20078
15395 -438957 34983 352493 52403 -102072 -34783 24835 110453 338253 274199 221141 -34903
15383 -428544 -562934 126169 280688 -407628 238872 -189177 -540120 416330 568835 90557
15372 355707 115427 444660 -602046 207302 -18894 24370 160657 852436 -43042 -14472
15361 31647 217446 180540 212832 -409362 426796 71703 433517 -106329 -420972 688636
15350c13666r8512a7890D83143I7103L2668M63208B42095J18357I7089b53462
15339e3089D47637j79116K33901p9141L37387b18518D87622A03911a91407A41459
15328D08355J07995j32920c9578l6475B28040M68837d1171C61364a09455N1033
15318e8422B30102M89279c1814j78665f8407a3301F05920b32850A44162d22895
15307c48361E54578a201461D5647b56367E69933f0070k15120a33287A27451j50
15297A27301M50962A1984N81409c85534g249I73701B50005P17401e6492j25168
15287a81660A88511b67889P0765B56003L51193b97962F7358R8811M77783K86969
15277I30921l51460b37724a02900l1464E60408J31119l25295q2725N17119a02917
$$ plain form
15350 -313666 -412178 -17890 483143 97103 129771 592979 242095 360452 97089 -253462
15339 -53089 447637 268521 502422 423281 760668 -218518 487622 103911 -191407 141459
15328 408355 516350 383430 -39578 -76053 228040 696877 -41171 361364 -109455 -58422
15318 -58422 230102 719381 -31814 -210479 -68407 -13301 605920 -232850 144162 -422895
15307 -348361 554578 -1201461 45647 -256367 569933 -60070 -275190 -133287 127451 127301
15297 127301 578263 11984 593393 -385534 -7249 973701 250005 967406 -56492 -181660
15287 -181660 188511 -267889 -197124 256003 607196 -297962 67358 166169 643952 930921
15277 930921 579461 -237724 -102900 -134364 560408 691527 366232 283507 800626 -102917
15266B54424i7866n9105B26431J29743l1981M60104j53592A00318B8511L49996
15256C78507a43273C89995L3842J92426B0055c64605A05461L67724A50256P62471
15246I12727e5218C05123b22974a8913A159808A4497d67160H86762b3173C33537
15235g8590C65688j27766q3290K9837M07372c68449A70349K5319a58174k01772
15225c59946A8626K21957M5435e17351B92536l6430I677O75773j00528C9120d94567
15213D55686A62527P1279c38885I22091h12614A30732f8746A12586N91358A10931
15202D61870A21081N95717A94165O6552a94279E27987j74858F8672d79656J03706
15192c75950B59334L09883F496b65572G9145K6211a15178k46552D22465d471H66145
$$ plain form
15266 254424 -97866 -156971 226431 356174 324193 784297 630705 100318 28511 378507
15256 378507 -143273 389995 423837 616263 20055 -364605 105461 473185 150256 912727
15246 912727 -55218 305123 -222974 -18913 1159808 14497 -467160 886762 -23173 333537
15235 -78590 365688 237922 154632 184469 591841 -368449 170349 195668 -158174 -359946
15225 -359946 18626 240583 286018 -517351 292536 256106 9677 685450 584922 39120 -494567
15213 455686 162527 233806 -338885 922091 -812614 130732 -68746 112586 703944 110931
15202 461870 121081 716798 194165 260717 -194279 527987 353129 68672 -479656 -375950
15192 -375950 259334 569217 6496 -265572 79145 105356 -115178 -361730 422465 -4471 866145
15180A19530K17608j54740p8950R9406D8296c00605I1491Q9516K17356A43593
15169B9614J95580d9668m45400a03455k89900C67727d27899p25a01027A71422
15158a14839A33145b7920F82205G8795J55313K26612o4959c9963C54263J84280
15148E38543b931B05548a48319B97844A38979K44213m3712C4639K49827c13383
15137A30589f17531H73648C45204f8803G93210G2886L05284N75615B88716A21340
15126e39508B1350J8156i7846b7381D49750A05011J83930C6290G21J4213b07356
15114h2738C6405O21440B67256A05510k5616N07646G5026K76914j71934C0833
15103A85353N8117K06664A60497b24448h4653H36923l74225j34528K81487k39591
$$ plain form
15180 119530 337138 182398 103448 202854 48296 -300605 91491 181007 398363 143593
15169 29614 225194 -49668 -495068 -103455 -393355 367727 -427899 -428624 -101027 171422
15158 -114839 133145 -27920 682205 78795 234108 460720 395761 -39963 354263 538543
15148 538543 -2931 205548 -148319 297844 138979 383192 339480 34639 284466 -313383
15137 130589 -617531 873648 345204 -68803 793210 72886 378170 953785 288716 121340
15126 -539508 21350 39506 -97846 -27381 449750 105011 288941 36290 721 14934 -207356
15114 -82738 36405 657845 267256 105510 79894 587540 75026 351940 180006 30833
15103 185353 243470 450134 160497 -224448 -84653 836923 462698 328170 609657 370066
15093C70066G2075K1759N57242L9138a49929I23889B90289L84364J44604b21493
15082D9025R81167C57405H6926b21555P6963j15932B38684p80J3454c09738H47117
15070F45040r7755j33808L877K23400a53211D76685k35620L48010A55658L74418
15060E30076K61389B61327a85589G84836k79160N00079a29059F26865P5886j18465
15050E84286L88269l38089J71527L52073a68501F80046j81895K15918j49250L23609
15040H88428r8483c3489C81615R6671M34963B08312N49666k8712P6764k27810
15030E78220L88355D19666A97570Q20689q9060k46517k71303O3571K0263B15415
15019A160470m80655J04912q1947K60320C19726P97228j88963j82632k63500j43043
$$ plain form
15093 370066 72075 93834 651076 690214 -149929 923889 290289 674653 819257 -221493
15082 49025 1030192 357405 86926 -221555 -144592 -260524 238684 237904 251358 -309738 847117
15070 645040 547285 413477 417354 640754 -153211 476685 241065 589075 155658 530076
15060 530076 791465 261327 -185589 784836 505676 1005755 -129059 626865 702751 584286
15050 584286 972555 634466 805993 1158066 -168501 680046 498151 714069 564819 888428
15040 888428 789945 -33489 381615 478286 913249 208312 757978 729266 806030 578220
15030 578220 966575 419666 197570 1018259 929199 682682 411379 474950 495213 215415
15019 1160470 679815 784727 702780 963100 319726 1116954 927991 745359 481859 338816
15009C38816J075597k77601J46417F32995Q4305a97051A172364C75437m8279L43973
14999F71131L74754H0661L8356J376607o69737k40404O38360l35882J03353D40159
14988G10925j07264O30313E55332K43747P6839l33148K0840J93604K01738l99862
14978E59090J47308j72255O78759m64768Q6912A36651L28086J28138N52376E28085
14967A109284j61609l89711J35863P51452F07587M4282K38945j1384K16646j96855
14957H99221l95397J66583j46178P31331m05168L47350k53681k8546J27572D08989
14946I30143k80088O15445l40358P06471k80398k9785k04413P386n1571N5954
14936A128786K35772k56581K1460L05930j743F28912R85192n80513K78805k76660
$$ plain form
15009 338816 1414413 1136812 1283229 632995 717300 -197051 1172364 375437 327158 671131
14999 671131 1045885 80661 119017 1495624 825887 585483 1223843 887961 991314 440159
14988 710925 603661 1233974 555332 799079 875918 542770 563610 757214 958952 559090
14978 559090 706398 534143 1212902 748134 835046 136651 464737 592875 1145251 528085
14967 1109284 947675 557964 693827 1445279 607587 651869 890814 879430 1096076 899221
14957 899221 503824 670407 524229 1255560 850392 1197742 944061 915515 1043087 408989
14946 930143 650055 1265500 925142 1631613 1351215 1321430 1117017 1124403 1072832 1128786
14936 1128786 1364558 1107977 1129437 1435367 1433624 628912 1614104 1033591 1312396 1035736
14926A035736R72113q71566j48176j93881Q74732n01775n49388M73115L00253
14917A391163M58866k35748F26507N59956M45466l89936l04733N55113m23440
14908A068933L94903F19260k69396O43189K66706j91929C23147l4441J221698
14899A510404D04698M59045M71081k05890M1701q1418E22898J056913p55989m5047
14889G78775L56624E57404O87069D55087P68920m71183O34388D90164J60744K60606
14879I11514J84883m14104J90581O71823n75621l5711r7047L13005N82004j44259
14869A587068m43077J97908j59095l60169K88820r3603J13089J04403q7573j03302
14859A044469L6595J45333m83189J22302l9067j66495J51279K67513j482L55716
$$ plain form
14926 1035736 2007849 1136283 988107 794226 1668958 1167183 617795 1090910 1391163
14917 1391163 1850029 1614281 626507 1186463 1631929 1241993 937260 1492373 1068933
14908 1068933 1463836 619260 349864 993053 1259759 1067830 323147 288706 1510404
14899 1510404 404698 863743 1334824 1128934 1170635 1089217 522898 1579811 823822 778775
14889 778775 1135399 557404 1244473 455087 1224007 752824 1387212 490164 650908 911514
14879 911514 1096397 682293 872874 1544697 969076 933365 836318 1149323 1731327 1587068
14869 1587068 1143991 1341899 1182804 822635 1111455 1017852 1130941 1235344 1147771 1044469
14859 1044469 1081064 1226397 743208 865510 826443 659948 811227 1078740 1077258 1432974
14849A432974l81379O17578k3733L4025J52666n80369J46146Q7809n74177k75067
14839F36473J14155K48826N86427k41519n40245K98402j83703N58811m46345M03383
14829A434665C70943K98435O76666K88068q15269N01982j33140j2633E24179J24248
14819F48427J108255l37548m35250A62909J137010O50881o02000k72011K21709
14810A298498J95771n03021K93670Q258k55472K95346E49268M57065J65042j15418
14800A055957L97975m97823L23500j09553L87366D37735Q66447J21507k71775
14791A153914l56317l6693J091968I11402j82967J43236Q68625E16420J164573
14782A680993m98926q3181O93960n69690J02102K0324M06805p75922O50088K5150
$$ plain form
14849 1432974 1051595 1669173 1645440 1679465 1832131 1251762 1397908 1485717 911540 636473
14839 636473 750628 999454 1585881 1344362 804117 1102519 918816 1477627 1031282 1434665
14829 1434665 370943 669378 1346044 1634112 818843 1320825 1187685 1175052 524179 648427
14819 648427 1756682 1419134 983884 162909 1299919 1950800 1348800 1076789 1298498
14810 1298498 1494269 991248 1284918 1293176 1037704 1333050 549268 1006333 1171375 1055957
14800 1055957 1453932 956109 1279609 1170056 1557422 437735 1304182 1425689 1153914
14791 1153914 797597 760904 1852872 911402 728435 871671 1740296 516420 1680993
14782 1680993 1182067 1098886 1792846 1223156 1325258 1345582 1752387 976465 1626553 1651703
14772A651703m6254k68146O75216j90273o24870N13397k51035L4723l2191J14447
14762A576717p15002P27792r8015L61879k63306K03135k04201m80115L36077M7196
14752A492157P52334k82109m04966M32308Q7087k54260j70186N29267K4688k83586
14742A922734K2914l03342J26060M4254p57959P77155j3117O78555o29512J22636
14732A990378k39974O76969n62787J86260j20993L72532o23114K71339M64483
14723B415093o85250L49189J3230Q3760j45998m28336k60096J253854p90004R7561
14713A903003J075635j043239K42811q06003R85229K0322o76153N30539n16476
14704A715668j83018M79828L30428r16348N41331k59989N71794n42127j1646L94772
$$ plain form
14772 1651703 1605449 1337303 2012519 1822246 1197376 1710773 1459738 1494461 1462270 1576717
14762 1576717 861715 1589507 1491492 1853371 1590065 1793200 1588999 1108884 1444961 1492157
14752 1492157 2244491 1962382 1557416 1989724 2076811 1822551 1652365 2181632 2206320 1922734
14742 1922734 1945648 1642306 1768366 1812620 1054661 1831816 1818699 2497254 1867742 1990378
14732 1990378 1750404 2427373 1864586 2050846 1929853 2302385 1679271 1950610 2415093
14723 2415093 1729843 2079032 2092262 2176022 2030024 1601688 1341592 2595446 1805442 1903003
14713 1903003 2978638 1935399 2178210 1372207 2357436 2377758 1701605 2232144 1715668
14704 1715668 1532650 2012478 2342906 1426558 1967889 1707900 2279694 1737567 1725921 2120693
14694B120693J10613l532m52879P25113m35173N26552l03609k81025O97271A308867
14683B408193m91213k17715N72000K93454l47178N53811j90128l06654N17895
14674B792465l40790J61562n96545M6745q4222m6220O60729J92408p20362L54152
14664B419922k97065k62055M23135J00704N86396r54953L28342P87042k98985
14655B832483n11743O13040j63724k6227j12522N22833n97401O42079r07351O53030
14645B944497J77233j78199m5842p4882m35341L55839O62080n17910L12678N444
14635C205597M50283j215806M02480L37964n24874j51153Q07833l63920K40313
14626C188717L47788L11671p19495K88658J54423k62583N35296r34994J258965
$$ plain form
14694 2120693 2231306 2227774 1774895 2500008 2064835 2591387 2287778 2006753 2704024 1308867
14683 2408193 1916980 1699265 2271265 2564719 2217541 2771352 2581224 2274570 2792465
14674 2792465 2451675 2613237 2016692 2063437 1979215 1932995 2593724 2786132 2065770 2419922
14664 2419922 2122857 1860802 2283937 2384641 2971037 2016084 2344426 3131468 2832483
14655 2832483 2320740 2933780 2770056 2743829 2631307 3154140 2556739 3198818 2291467 2944497
14645 2944497 3121730 2943531 2897689 2822807 2387466 2743305 3405385 2887475 3200153 3205597
14635 3205597 3655880 2440074 2842554 3180518 2655644 2504491 3312324 2948404 3188717
14626 3188717 3536505 3848176 3128681 3417339 3571762 3309179 3844475 2909481 4168446
14617D168446l9756k59360q933j75957L23930M65887m37837j06646L03911O7762
14607D301447J33010l50572J026495m83315J40916r6672M14329j62238R03907
14598E827307m69987N1560K96657o12173N04480L59894N5786l92739N08148P8752
14588F207685P29926l14166J07373Q8762J2035K85599o5767J55534R08854j82690
14578G933145K2743m07240J117916L30715K99435k89178M99563J93261r14846
14569H785514K186904j584663J225947m80989l86785J035925p39971M57968J18060
14560A0617910m46111o30231M50017L51813m4220j94234O04245L86272l42726
14551A0752735l0898P0866j25308J191642p97076L69151p4532k62626p98308O46245
$$ plain form
14617 4168446 4128690 3869330 3860397 3684440 4008370 4474257 4036420 3929774 4233685 4301447
14607 4301447 4434457 4083885 5110380 4627065 4767981 4671309 5085638 4923400 5827307
14598 5827307 5357320 5408880 5705537 5093364 5597844 5957738 6013524 5620785 6128933 6207685
14588 6207685 6937611 6623445 6730818 6819580 6831615 7117214 7051447 7206981 8115835 7933145
14578 7933145 7955888 7548648 8666564 8997279 9296714 9007536 9507099 9700360 8785514
14569 8785514 10972418 9387755 10613702 10132713 9745928 10781853 10041882 10499850 10617910
14560 10617910 10171799 9541568 9991585 10343398 10299178 10104944 10709189 11095461 10752735
14551 10752735 10721837 10792703 10667395 11859037 11061961 11431112 11356580 11093954 10295646 10941891
14541A0941891j112390o93080j85377j258189N88374p65281l03934p71669J27865
14532F568210P45436r66502M54398K82425o29696K58176k19119J030546j244247
14523F279627R24069n69632o8744J111893j478870P41018J61857k04143M52799
14514G349874J91133l37069m12128J083137p90832M45686Q551n67752P71128m86193
14504G255535K37983J38159l01168N86092M97854l49495M42875j213666P13808
14495H007977j92961Q12019J05481l57191L13917o22844J129638j32366J20736
14486I184406K43237m66069N67037l57366M74943M25912p7036M4833K4989p6075
14476I988811p7324K84687N46252j09156N98339k21692J03495L86068M08192o50715
$$ plain form
14541 10941891 9829501 9136421 8951044 7692855 8281229 7515948 7212014 6440345 6568210
14532 6568210 7313646 6347144 6801542 7083967 6454271 6712447 6493328 7523874 6279627
14523 6279627 7203696 6634064 6565320 7677213 6198343 6939361 7101218 6897075 7349874
14514 7349874 7541007 7203938 6791810 7874947 7084115 7529801 7538352 6970600 7741728 7255535
14504 7255535 7493518 7631677 7330509 7916601 8414455 8064960 8507835 7294169 8007977
14495 8007977 7815016 8627035 8732516 8375325 8689242 8066398 9196036 9063670 9184406
14486 9184406 9427643 8961574 9528611 9171245 9646188 10072100 9995064 10039897 10064886 9988811
14476 9988811 9911487 10196174 10742426 10633270 11231609 11009917 11113412 11499480 11907672 11256957
14466A1256957Q39005O29813L18475k99799l72773Q63348M15083j250123Q02539
14457A3202525Q18255m36492R85577j055318J177312J71767P2107L36933j01463
14448A5171203K25279J37178M34682M10512K64711P83106n27602R31125L6703
14439A7866897J130075n73804K38955J093667J19881j72893K35047Q90475J36955
14430B0965255n7579K37328J70667J401474L51698P57394J98443L56355Q40896
14421B5221931o9228L43920N21481J434963Q0395N17630J227169O45017j39772
14412B9783506l5196J662464J35970R76556P59846J300205j02624J117339J341804
14403C6939870J33025Q19949J110626J607543m7624J036358Q62303J432749R45027
$$ plain form
14466 11256957 12095962 12725775 13044250 12744451 12371678 13235026 13650109 12399986 13202525
14457 13202525 14020780 13584288 14569865 13514547 14691859 14863626 14935733 15272666 15171203
14448 15171203 15396482 15533660 15968342 16378854 16643565 17426671 16899069 17830194 17866897
14439 17866897 18996972 18423168 18662123 19755790 19875671 19702778 19937825 20828300 20965255
14430 20965255 20907676 21145004 21315671 22717145 23068843 23826237 24024680 24381035 25221931
14421 25221931 25152703 25496623 26018104 27453067 27533462 28051092 29278261 29923278 29783506
14412 29783506 29748310 31410774 31546744 32523300 33283146 34583351 34480727 35598066 36939870
14403 36939870 37072895 37892844 39003470 40611013 40563389 41599747 42462050 43894799 44839826
14394D4839826J010789P38394J889262Q87859J115972J350744J619753O38331
14386E4090930J486998J895737K74147K171359J375462J888122J303356J494351
14378F5980462J925849J144209K325953J964281J890578J221041K477127J971639
14370H0901139K548321J963521J690329L367976J965226K369805K029391L529873
14362A00365581J717069L567445L097997K767908L192065K823095M044185L478232
14354A25053577L331409M711354L393801N184711L970563M456836O417352M932332
14346A61451935M714175N729771N341176N555066N699192O654151O530801N742766
14338B07419033N094311O969435P389581N676338O246818O093793P235620O222151
$$ plain form
14394 44839826 45850615 46589009 48478271 49366130 50482102 51832846 53452599 54090930
14386 54090930 55577928 57473665 57747812 59919171 61294633 63182755 64486111 65980462
14378 65980462 67906311 69050520 71376473 73340754 75231332 76452373 78929500 80901139
14370 80901139 83449460 85412981 87103310 90471286 92436512 94806317 96835708 100365581
14362 100365581 102082650 105650095 108748092 111516000 114708065 117531160 121575345 125053577
14354 125053577 128384986 133096340 136490141 141674852 145645415 150102251 156519603 161451935
14346 161451935 166166110 171895881 177237057 182792123 188491315 195145466 201676267 207419033
14338 207419033 212513344 219482779 226872360 232548698 238795516 244889309 252124929 258347080
14330B58347080O667358O387522P075991O612030P300514P357118P265400P274237
14322C14287250Q083497O765622R430582P811084P892489J0044557P028769O913543
14314C78257393O199987O380789M896555P261838Q011286M430804L348222N132532
14306D23919406Q492351J1596648J5296727M750290N160562Q369167R565959Q721025
14298D95872135O897856M198767K587030O67080o80385j33436J697476J268279
14290E12374802Q42491K153294o952420l819123J90644j450722k986193j636937
14282D98715836l84492j205480j669701o825833l573283K280552Q546769P487839
14274E03372207J3019912J3954087Q007299J0035543J1112347J2018064J560822
$$ plain form
14330 258347080 265014438 271401960 278477951 285089981 292390495 299747613 307013013 314287250
14322 314287250 322370747 329136369 338566951 346378035 354270524 364315081 371343850 378257393
14314 378257393 384457380 390838169 395734724 402996562 411007848 415438652 418786874 423919406
14306 423919406 432411757 444008405 459305132 464055422 469215984 477585151 487151110 495872135
14298 495872135 502769991 506968758 509555788 510222868 509542483 509409047 511106523 512374802
14290 512374802 513217293 515370587 508418167 504599044 504789688 503338966 500352773 498715836
14282 498715836 498331344 497125864 495456163 488630330 485057047 487337599 495884368 503372207
14274 503372207 516392119 530346206 538353505 548389048 559501395 571519459 573080281
14267E73080281m903939j927624o344168m796220o348495r513877j9428005k0078309
14259D99739644j9441340j8862713j8804782j8504709j9161248j6868094j6853718
14252C71243040j5791912j3892172j2926514j1285031j0203141p574395m285150
14245B95284725m680692n990131j1965579j2121877j0687907r422063r131644
14238B31284832q415353p649541j0233064q406790p834089p982238o623312q314739
14230A65825706p131897p994513q164540p512137o031170o223761n521461m832130
14222A12414097n032280m145084l927444m162670k777820l656159l247323l421545
14214H2043772k120245k670091k720499j863767j959342k541111k109567j504217
$$ plain form
14267 573080281 568176342 566248718 559904550 555108330 548759835 539245958 519817953 499739644
14259 499739644 480298304 461435591 442630809 424126100 404964852 388096758 371243040
14252 371243040 355451128 341558956 328632442 317347411 307144270 299569875 295284725
14245 295284725 290604033 284613902 272648323 260526446 249838539 240416476 231284832
14238 231284832 222869479 215219938 204986874 196580084 188745995 180763757 174140445 165825706
14230 165825706 158693809 150699296 142534756 135022619 128991449 122767688 117246227 112414097
14222 112414097 107381817 103236733 99309289 95146619 92368799 88712640 85465317 82043772
14214 82043772 79923527 77253436 74532937 72669170 70709828 68168717 66059150 64554933
14206F4554933k293737j374950o99547k433324j495429j200184j092927j958126
14198E2006709n45375j391660j318748j270610j117018j228849j102001o88783
14190D3343665o87367j876615n20076p58921j229986m64187l16465j219431j041216
14181C5229401n22783j68841m48662r59070q82626l22002l37350r62050p7025
14172C0548992q39280m80575j097490L84719n46235p53272o50306o16897k73965
14163B5675691l08569r89475J26176k54811K20384j157571q27804j78996M14046
14154B2719071j266397p65955k36576L22581j66943o43105m12034l62525p00672
14145A8487445R69987m50552j322061L44677k4530m32069m70282J35318j25175
$$ plain form
14206 64554933 62261196 60886246 60186699 57753375 56257946 55057762 53964835 52006709
14198 52006709 51461334 50069674 48750926 47480316 46363298 45134449 44032448 43343665
14190 43343665 42656298 40779683 40259607 39500686 38270700 37806513 37490048 36270617 35229401
14181 35229401 34706618 34537777 34089115 33130045 32247419 31925417 31588067 30626017 30548992
14172 30548992 29709712 29229137 28131647 28516366 27970131 27216859 26566553 25949656 25675691
14163 25675691 25367122 24377647 24503823 24249012 24469396 23311825 22484021 22305025 22719071
14154 22719071 21452674 20686719 20450143 20772724 20605781 19962676 19550642 19188117 18487445
14145 18487445 19457432 19006880 17684819 18029496 18004966 17572897 17102615 17237933 17112758
14136A7112758j67828k57425o00803m36237J48591k29697k04615k79452r5212
14127A4990080P3106M0043k60775L3695n65529K50281j059369k1592r3118J7892
14117A3404714K46194r16026j58377L3331m23979k59944Q36971o33488r3071k11989
14107A1824336p49892L02401k21701k32329M83222l33860j116582P2423J157610
14098A1185628o97129j67277l20358J23508j12410J38346j42043l37913l3773
14089I636579N53172q00594j98288L95046j057975K94187m5142K48076l54993
14080H670068K38737q20378N66575L55612o75640j28064M59068p61958M09497
14071H313517k83217l5181J30851j14674l73697J05970P74195k70271r81655L76092
$$ plain form
14136 17112758 16944930 16687505 16086702 15650465 15799056 15569359 15364744 15085292 14990080
14127 14990080 15063186 15103229 14842454 14876149 14310620 14560901 13501532 13479940 13386822 13404714
14117 13404714 13650908 12734882 12576505 12609836 12185857 11925913 12762884 12129396 12036325 11824336
14107 11824336 11074444 11376845 11155144 10922815 11406037 11072177 9955595 10028018 11185628
14098 11185628 10488499 10321222 10000864 10124372 10011962 10150308 10008265 9670352 9636579
14089 9636579 10189751 9389157 9190869 9585915 8527940 8822127 8776985 9025061 8670068
14080 8670068 8908805 8088427 8655002 9010614 8334974 8206910 8665978 7904020 8313517
14071 8313517 8030300 7995119 8125970 8011296 7637599 7743569 8517764 8247493 7265838 7641930
14061G641930J549p414k7663j14586l1843J72661n06286o80837J015878P6358
14051G539747n15595m4824K57778j71547K66374r46876L44121M30539j54379o5496
14041F939842K00858J62337l24258L31772o28886L52197M01630l69512j10531
14032F955449K17919j98900L41960M86123o92766N80531L5901j99025j4535q5574
14022G427083K73950K53993J1121j91661L75161O51055L91364l89245K25797O05144
14012I633762p98394M92895L72527M78843l76695l48214N30458M26524m77266
14003I934440p23536N15399L81876l79834k86534K60545j24270p713L07613k77322
13993I600664r91933R09404Q1148L46947j56873k62142J479278j42744J97613
$$ plain form
14061 7641930 7643479 7636065 7608402 7493816 7461973 7634634 7128348 6447511 7463389 7539747
14051 7539747 7024152 6979328 7237106 7065559 7331933 6385057 6729178 7159717 7005338 6939842
14041 6939842 7140700 7303037 6978779 7310551 6681665 7033862 7435492 7065980 6955449
14032 6955449 7173368 6974468 7316428 7802551 7109785 7690316 7726217 7527192 7512657 7427083
14022 7427083 7701033 7955026 7966147 7774486 8149647 8800702 9192066 8802821 9028618 9633762
14012 9633762 8835368 9328263 9700790 10179633 9802938 9454724 9985182 10411706 9934440
14003 9934440 9210904 9726303 10108179 9728345 9441811 9702356 9578086 9570373 9877986 9600664
13993 9600664 8608731 9518135 9599283 9946230 9789357 9527215 11006493 10863749 11061362
13984A1061362j297828J49742K52845j163621l33435l99459R5698N5623j402766
13975G018161k83996k19098j19360J70064j249924j34971o1117j71771j53897
13966D794091P0511J11536M42217q74206M42667l78400n23839M39171o4052K22519
13956D682215p6794J31735l18386o70010L8351q26610J344384r60068N79926o44532
13946C280211L48884j1057r979K71578q09863n7935N51785l4930l40321N86466
13936C774839k66490k6767l34972k94621M66734o54639m88391J172538j3025l73921
13926B961285M26400k31725l03410m48645O59473M39103j83341o09659K39552
13917B949033j67168k27411N09603p96927N74884R9402J69228m09205j08817n15862
$$ plain form
13984 11061362 9763534 9913276 10166121 9002500 8669065 8269606 8365304 8420927 7018161
13975 7018161 6734165 6515067 6395707 6565771 5315847 5180876 5119759 4947988 4794091
13966 4794091 4864602 4976138 5418355 4544149 4986816 4608416 4084577 4523748 4459696 4682215
13956 4682215 4605421 4737156 4418770 3748760 3787111 2960501 4304885 3344817 3924743 3280211
13946 3280211 3629095 3618038 3608059 3879637 3069774 3011839 3563624 3528694 3188373 3774839
13936 3774839 3508349 3481582 3146610 2851989 3318723 2664084 2175693 3348231 3335206 2961285
13926 2961285 3387685 3155960 2852550 2403905 3063378 3502481 3319140 2709481 2949033
13917 2949033 2781865 2554454 3064057 2267130 2842014 2941416 3110644 2701439 2592622 2076760
13907B076760N89421l75088K55290J69763n88890L01879J57674N16306p02151
13898B400964j5119L51076m75472l1843M49325K18520k92142K53308n31481O39183
13888B966319l93923m14279O7645L87321m27895J6802J29489j96105j78572j15818
13878A840984R32934q15085N58398p79144K59423n52837P60137L23939k76492
13869B252257q7358o79506N14659n7374K88228J05139l12012l01517L92495K34295
13859B349306N9451l19572K7297M3140j73787j54369p48716J232366q8279m27752
13849A799085N24949p05665M16439m80701m3785L93686l76398N0227J79331j63593
13839A593575M19764m7832k31109J07713l885L96454J27467o95974M55173n40213
$$ plain form
13907 2076760 2666181 2291093 2546383 2716146 2127256 2429135 2586809 3103115 2400964
13898 2400964 2385845 2736921 2261449 2229606 2678931 2897451 2605309 2858617 2327136 2966319
13888 2966319 2572396 2158117 2225762 2613083 2185188 2201990 2331479 2135374 1956802 1840984
13878 1840984 2773918 1958833 2517231 1738087 1997510 1444673 2204810 2528749 2252257
13869 2252257 2164899 1485393 2000052 1942678 2230906 2336045 2024033 1722516 2115011 2349306
13859 2349306 2408757 2089185 2116482 2159622 1985835 1831466 1082750 2315116 2226837 1799085
13849 1799085 2324034 1618369 2034808 1554107 1510322 1904008 1527610 1577837 1757168 1593575
13839 1593575 2013339 1965507 1734398 1842111 1838226 2234680 2362147 1666173 2121346 1581133
13829A581133J90648Q140n79725J020671J29316n88697J47498O01287r13586L54819
13819A951504J05460j76471l68771J78899N06437r97844O00239Q40650m32301
13810B207802l75806l54211K17767q4100o36083Q55776n25929J39733k49066k34956
13800I60927M47986J12519j55885M03311M43752q63365M93042R287l67143k08544
13790A275887K95211J6668j51837K62770j26810l9189F20766P21979Q63642q49096
13780A357291M16289K82450n79449n8577Q8469p41094Q20076m41485Q32392r87589
13770I88773l90033O38414O2686k93143J15360m65272Q88850m86589P97120l53462
13760A502704N05310p29117K42938F42148Q16454F55553R87502m77078K04522
$$ plain form
13829 1581133 1771781 1779921 1200196 2220867 2350183 1761486 1908984 2510271 1596685 1951504
13819 1951504 2056964 1880493 1511722 1690621 2197058 1199214 1799453 2640103 2207802
13810 2207802 1831996 1477785 1695552 1611452 975369 1831145 1305216 1444949 1195883 960927
13800 960927 1408913 1521432 1365547 1768858 2212610 1349245 1842287 1851574 1484431 1275887
13790 1275887 1571098 1587766 1435929 1698699 1571889 1532700 620766 1342745 2206387 1357291
13780 1357291 1773580 2056030 1476581 1418004 1506473 765379 1585455 1143970 1976362 988773
13770 988773 598740 1237154 1299840 1006697 1122057 656785 1545635 1059046 1856166 1502704
13760 1502704 2008014 1278897 1521835 642148 1458602 655553 1643055 1165977 1370499
13751A370499N48028q37354k03580P2887m8645J1415M09833r7124k06170M19665
13741A439454o09516P25082G52717O60716F64180N42415k50357J6162B99631L16146
13731F15777R72038n82646j83619Q0781K03826O52694p07665p0659J25724M53319
13721A559570n08437J90586j54807N4193n30721L41188k65759k75909M69001j53124
13711G25781M03844Q8733j08506J13114k81203J58466l59615O78875F06435N20449
13701A126884l16482K38358M31841N0633F65011j29152Q75603m2475B1743Q44550
13691H66293N66054D99760L04712R2127l91069L34433J26354K57726K17644j2914
13681A428773l26614D63103K54211L31023D43477L98639L18510k71239N53476
$$ plain form
13751 1370499 1918527 1081173 877593 950480 901835 913250 1323083 1225959 1019789 1439454
13741 1439454 829938 1555020 752717 1413433 664180 1206595 956238 972400 299631 615777
13731 615777 1587815 1005169 821550 902331 1106157 1758851 1051186 980527 1106251 1559570
13721 1559570 1051133 1241719 1086912 1141105 610384 951572 685813 409904 878905 725781
13711 725781 1129625 1218358 1109852 1222966 941763 1100229 740614 1419489 606435 1126884
13701 1126884 810402 1048760 1480601 1531234 665011 535859 1411462 1368987 21743 866293
13691 866293 1432347 499760 804472 896599 505530 839963 966317 1224043 1441687 1428773
13681 1428773 1102159 463103 717314 1048337 443477 842116 1160626 889387 1442863
13672A442863j68849B51034J119612k62634j45081J67180j90793o9861M79598
13663A349055K4193K8540E40269N91141r914o6456l77337J012558n26830l63971
13653G99460L20047m47441O77708E46739J27299L77083l80769R23455F73581M18233
13643A091814L4598D86748J89525J17583l95385M53388P84399o12129p5456l38869
13633F09804j28594L99980J30854D31867P6934R14057l31518n2957q9018m63657
13623D85708N76358m52024j9723K20172N78940j24945k09671k92483M0838J55556
13613I58726j28163k92777J34863M83808m68100l7019L39734K4300C72866O14688
13603I87554k04610r3477j98380J43860K23883L84528E75985j75823J28784n6078
$$ plain form
13672 1442863 1274014 251034 1370646 1108012 962931 1130111 939318 869457 1349055
13663 1349055 1373248 1401788 540269 1131410 1121496 1055040 677703 1690261 1163431 799460
13653 799460 1119507 672066 1349774 546739 674038 1051121 670352 1593807 673581 1091814
13643 1091814 1126412 486748 676273 793856 398471 851859 1636258 1024129 948673 609804
13633 609804 481210 881190 1012044 431867 508801 1422858 1091340 1038383 949365 485708
13623 485708 1062066 610042 590319 810491 1389431 1264486 1054815 762332 803170 958726
13613 958726 830563 537786 672649 1156457 688357 651338 991072 1015372 372866 987554
13603 987554 782944 689467 491087 634947 858830 1243358 575985 400162 528946 472868
13593D72868N67892o8135e236E0163J410778A01979P34114A00077P44502j90460
13583F54119L07793D41258K31590J40145l74383a04227I82376C93923M45625D00234
13572C52345P59645C74915O71986J40221m82709r2290r4412O65618n65930L83339
13562A000738L3829m86048K80837A56297Q90006D99751j73760M93030C95030M40920
13552H35950j41406J033444B80285O34747n8101C42958R7508K11100p4036k23676
13542C53854r4002Q44645D13396J81961r553j3279j62182J24875L78703c88844
13531A042740J99835n51619p2728B40530L54307O79400f81728I53023p9132D00167
13520C38965L85624r1666L22944L81079f410D44425a29288C80445L20340C06339
$$ plain form
13593 472868 1040760 972625 -5236 50163 1460941 101979 836093 100077 844579 654119
13583 654119 961912 441258 672848 812993 438610 -104227 982376 393923 839548 400234
13572 352345 1111990 374915 1046901 1187122 704413 612123 517711 1183329 617399 1000738
13562 1000738 1034567 548519 829356 156297 1046303 499751 325991 819021 395030 835950
13552 835950 694544 1727988 280285 915032 856931 342958 440466 651566 577530 353854
13542 353854 259852 1104497 413396 595357 585804 572525 410343 535218 913921 -388844
13531 1042740 1242575 690956 618228 240530 594837 1274237 -681728 953023 873891 400167
13520 338965 724589 632923 955867 1336946 -6410 444425 -129288 380445 700785 306339
13509A16423p115N56806C19988A11445O04283K69287D46675e303H40779B81862
13498I07341J18382B97545J30572J64780R2416D1708K81459K37818k50765A43841
13487I15291l75568p3717A74187J68442n2023f993C7980N05383J32473l33976
13477C41860g3706D07213c40171f4626G21834C60067L07849L0801j95812L83348
13467H86253k89773K40986B8144M18852A87612L14240B34050d2025m05980A402788
13456C77274L6580L32361J33497B74128J90566A95934C9265h883k15670E26038
13445A81913L45648M6187B5365L05705L67561P9088j22177A87882b24428C76322
13434C82363L59604a43795E35224b88582a07479F34807k04389L0405B02281D8734
$$ plain form
13509 116423 109308 666114 319988 111445 715728 985015 446675 -5303 840779 281862
13498 907341 1025723 297545 428117 592897 685313 41708 323167 560985 310220 143841
13487 915291 539723 466006 174187 342629 290606 -6993 37980 543363 675836 341860
13477 341860 -73706 407213 -340171 -64626 721834 360067 667916 698717 502905 886253
13467 886253 596480 837466 28144 446996 187612 501852 234050 -42025 -448005 1402788
13456 377274 413854 746215 879712 274128 464694 195934 39265 -8883 -224553 526038
13445 181913 527561 573748 25365 331070 698631 777719 655542 187882 -224428 376322
13434 382363 741967 -143795 535224 -288582 -107479 634807 430418 460823 202281 48734
13423B29962J15605K56054o1536H5271M45754B2288O94876M42363O9989n94055
13413F35461B71897H9301J31211L69022k72417I5288J93798L87462K63654D02838
13402E25835B17530a47317j80539j31603F62533K41395B32997f1729k07483G80806
13391E12799R2828L35633D57814J37087J22547N929A45648L79651L89665b94172
13380b47177m499B18219b2060A092638C07792J181225f8104H16764J3086k95178
13370E34672j11608N19376c41262I15478m47017D1173K81218M76703a34093E99971
13359h0805H3476K74589j48127F9879c39093D75850K54657C50083a15412E60073
13348F8013a9368E82708k05010K93892j52528B29960K60684j72566k871K77609
$$ plain form
13423 229962 345567 601621 540085 85271 531025 22288 717164 1159527 1229516 635461
13413 635461 271897 89301 220512 589534 317117 95288 289086 676548 940202 402838
13402 525835 217530 -147317 -327856 -459459 662533 903928 232997 -61729 -269212 780806
13391 512799 605627 941260 457814 594901 717448 723377 145648 525299 914964 -294172
13380 -247177 -251676 218219 -22060 1092638 307792 1489017 -68104 816764 829850 534672
13370 534672 423064 942440 -341262 915478 468461 41173 322391 799094 -134093 599971
13359 -80805 83476 358065 209938 69879 -339093 475850 730507 350083 -115412 560073
13348 68013 -19368 582708 377698 671590 519062 229960 490644 318078 315207 592816
13338E92816B07614P97472B02543K30750L11837J10465C63447k6668L02990o1406
13328E78363K0561B65855O9821n7741M04948b2395r3356G8719B0293Q94638k30216
13317F84715C00369p4749o7244K85144A32882L20958p6198j6960a67824J9395
13307a48429A177384a39321G51946B90561a94788E85246m1659A48999L90965a36909
13296C93038f8261I2455L90044n0145N26221k47142a76942E33476j9224A06896
13285E40867j95137A27826c3771N193C68429c13176a45160d6518C63289K81216
13275F44505d91956B70905o0391L13766d64570F96598D872L56406j63696r5452
13265A02130e5969k0340G47236B80111j33824a57815B42608g4316l21689C89088
$$ plain form
13338 592816 207614 1005086 202543 433293 745130 855595 363447 336779 639769 578363
13328 578363 598924 265855 335676 277935 682883 -22395 -115751 78719 20293 914931 684715
13317 684715 300369 225620 158376 443520 132882 453840 377642 360682 -167824 -148429
13307 -148429 1177384 -139321 751946 290561 -194788 585246 543587 148999 539964 -136909
13296 393038 -68261 92455 482499 432354 958575 711433 -176942 533476 514252 106896
13285 540867 345730 127826 -33771 -28578 368429 -313176 -145160 -46518 363289 644505
13275 644505 -491956 270905 210514 524280 -464570 696598 4872 361278 197582 102130
13265 102130 -55969 -76309 747236 280111 146287 -157815 242608 -74316 -396005 389088
13254E40824O6808k14610j09607f6466A42020O98468m19941p3003A39779O01097
13244G40876M8223o1106B60310D0231L35246M55344k19141J59194d6596B90504
13233E44703A25849E2929M51468k49772a28123A0323L86679c57963R3980E68919
13222G5993a49249k31539J28885C94096I7736J35287D9125a94243C71038f9319
13211b34877C16630e2582C86039L8099N48949d95817F5495c65166E54753J3963
13201E68716B3066L55858K70559k70190I7770L86592j14121J88990b58192C2800
13190f69786A50336h2831A012800c42276k44917A73443O4283L77871k67613A12284
13179a19892n15774C99280A77393p1207L04368O1278L85780e03222B08170e05253
$$ plain form
13254 540824 607632 393022 283415 -66466 142020 840488 420547 347544 139779 740876
13244 740876 789099 727993 260310 40231 375477 830821 611680 770874 -46596 290504
13233 544703 125849 52929 504397 254625 -128123 10323 397002 -357963 -263983 568919
13222 75993 -149249 -380788 -251903 394096 97736 233023 49125 -194243 371038 -69319
13211 -234877 316630 -52582 386039 424138 973087 -495817 65495 -365166 554753 568716
13201 568716 23066 378924 649483 379293 97770 484362 370241 559231 -258192 32800
13190 -669786 150336 -82831 1012800 -342276 -587193 173443 237726 615597 347984 112284
13179 -119892 -635666 399280 177393 106186 410554 471832 857612 -503222 208170 -505253
13168a09307A74945d19691J96594d118r0214B36067n0128c35901m2576a49026
13157b65476m3710A45409A6254d97901A83549M701f4285C15884J23901a5056j44728
13146a59784p8123I1596L69872p4020A8059L84238j61149K06193b84774A32689
13135D07280K23909c7556E51904B34274I636K215N3220M47448l6325D0515a52397
13123A6709L02720b87223D13423a87298G73199k55676o4680j14389j65017B2038
13112i7359k49763B74086M06341A39801a92678Q4334B73135K13210A60145p7885
13102H2260b22667G50997d9478k85175A89786h7413F45065B5143a68887D99764
13091c61132J77508H0202L86323l9248o6682b66710A37728J70969j50010g9611
$$ plain form
13168 -109307 174945 -419691 -223097 -4118 -94332 236067 185939 -335901 -378477 -149026
13157 -265476 -309186 145409 16254 -497901 183549 188250 -64285 315884 439785 -15056 -159784
13146 -159784 -237907 91596 461468 387448 18059 402297 241148 447341 -284774 132689
13135 407280 631189 -37556 551904 234274 9636 11851 65071 512519 476194 40515 -152397
13123 16709 319429 -287223 413423 -187298 773199 517523 452843 338454 173437 22038
13112 -97359 -347122 274086 680427 139801 -192678 -108344 273135 486345 160145 82260
13102 82260 -222667 750997 -49478 -334653 189786 -87413 645065 25143 -168887 499764
13091 -361132 -183624 80202 466525 427277 360595 -266710 137728 308697 158687 -79611
13080A16463M9758K11306L46023A12155O86980c73200F47818a40504F05600c00628
13069B44671Q696K91044c86633B22299b40536A69021o7519J29775a8460C66238
13058F77709j49906b59283C5533f66255B0065L2658N99504f6069B27559J74075
13048D01634C0695N74283A75680b6258B93192N30195A99253a01662E16603h4091
13037D53132c65455J24580c9362j03575E73074H5762K02488m4025q2893g5402
13026d33330A86631K22036L95413a52034C08349j10372I0611b70682B52026P33085
13016I85111d2691o5066F54328D0387Q1513L90422B02080D8117b83302A48955
13005D52374g7286A18655a6164D06552E9545N99347D0223K40544M52392A43872
$$ plain form
13080 116463 166221 377527 723550 112155 799135 -373200 647818 -140504 605600 -300628
13069 244671 253367 544411 -386633 222299 -240536 169021 101502 231277 -18460 366238
13058 677709 527803 -259283 35533 -666255 20065 52723 652227 -66069 227559 401634
13048 401634 30695 604978 175680 -26258 293192 823387 199253 -101662 516603 -84091
13037 453132 -365455 -240875 -39362 -142937 573074 85762 288250 244225 161332 -75402
13026 -433330 186631 408667 804080 -152034 308349 197977 90611 -270682 252026 985111
13016 985111 -42691 -107757 654328 40387 121900 512322 202080 48117 -283302 148955
13005 452374 -77286 118655 -16164 406552 59545 658892 40223 280767 733159 143872
12994B53868N30112C61271a24906c9102H1645b22511E95679f32784b7695D24348
12983C46022f959B4002d55234A86528L1888N66776C62938L2936h5965C27288b04318
12971d53146C51905j61211k424c67395D01442c56253F36151r5607e13178K53005
12961b60173F6268c54811B10217g5431C56411i4920C26943A53592G3996c89727
12950B69058d087C6963c7154q21095D06837j39974c79647D00662e1939k05717
12940b57656G62383B39998I0471M6712c1692m3547H8204K64741E5187a94992B44341
12928A56113f58221B15449a83350p5700k6747E5932K68787A43474a88323B08079
12917C75103A6968K97163f8972C44273J26801a94029A48651a41767B82839J15317
$$ plain form
12994 253868 783980 361271 -124906 -39102 81645 -222511 595679 -632784 -27695 424348
12983 346022 -6959 24002 -455234 186528 218416 785192 362938 395874 -85965 327288 -204318
12971 -453146 351905 190694 188270 -367395 401442 -356253 636151 540544 -513178 -260173
12961 -260173 66268 -354811 210217 -75431 356411 -94920 326943 153592 73996 -389727
12950 269058 -4087 36963 -37154 -858249 406837 266863 -379647 400662 -51939 -257656
12940 -257656 762383 239998 90471 137183 -31692 -75239 88204 352945 55187 -194992 244341
12928 156113 -658221 215449 -183350 -259050 -285797 55932 324719 143474 -188323 208079
12917 375103 16968 314131 -68972 344273 471074 -194029 148651 -141767 282839 398156
12907C98156h71913K97246d6472C3528K46441h80830A22376O67495a50548n23022
12897f73570A04173J75493K85527b63936C39249F5378d71563D37874B2972a4682
12886a96452E55493b51098D42027d04537J24641g5604k47583C24152J63459A92576
12875A33271J03553g5993E53962A49786a15269l25341C42867b43074D72160m3434
12865D28726a50786k30922D79588a76715B06020a08051E02168f32359a57833B09921
12854C64207R2543f17715n3820C74549A59150D8627f5737A9967b55064a4827m29932
12843d44759B31978a44312A130496i7357a0006l88359A66685J36602G5444A0857
12832A64769a35805B13520a027972C56358K81195c38455C28330N74284e75127
$$ plain form
12907 398156 -871913 -574667 -46472 33528 279969 -880830 122376 789871 -150548 -673570
12897 -673570 104173 279666 565193 -263936 339249 65378 -471563 437874 22972 -14682
12886 -196452 555493 -251098 442027 -404537 -279896 -75604 -323187 324152 487611 192576
12875 133271 236824 -75993 553962 149786 -115269 -440610 342867 -243074 472160 428726
12865 428726 -150786 -381708 479588 -176715 206020 -108051 502168 -632359 -157833 209921
12854 364207 456750 -617715 -671535 374549 159150 48627 -65737 19967 -255064 -14827 -444759
12843 -444759 231978 -144312 1130496 -97357 -10006 -398365 166685 303287 75444 10857
12832 164769 -135805 213520 -1027972 356358 637553 -338455 328330 902614 -575127
12822c24044B83791L66934f19634D3163b1520j82725F01616a87981C99555J08784
12812E08339a35184N7303k89490D5973N69242A20177L87656j81857A10960L6992
12802A47952j5429L09372k17775c86923A99086d07610J23230A34484a39899e5615
12791C62756n3233A43838f0736D27175J57408j85628d88325b0531F35123B0687
12780b99421k84779A28143d62D37960M35326d33140R5559j08938B89033b43780
12769a62607D0026J17089f5196C86506f56819F40794b86785B27702K39261A30737
12758B77627G446f3374D79168r0082j55377b77354g6767D52709D7636F852c06617
12746a21138q0019A60739h8636m58006C21273a10998I7148e2487j1948b2356F72329
$$ plain form
12822 -324044 283791 650725 -619634 43163 -21520 -204245 601616 -187981 399555 508339
12812 508339 -135184 -77881 -367371 45973 615215 120177 507833 325976 110960 147952
12802 147952 132523 441895 224120 -386923 199086 -407610 -284380 134484 -139899 -55615
12791 362756 309523 143838 -60736 427175 584583 398955 -488325 -20531 635123 20687
12780 -299421 -584200 128143 -462 437960 873286 -433140 -337581 -446519 289033 -243780
12769 -162607 40026 157115 -65196 386506 -656819 640794 -286785 227702 466963 130737
12758 277627 7446 -63374 479168 389086 233709 -277354 -76767 452709 47636 6852 -306617
12746 -121138 -201157 160739 -88636 -546642 321273 -110998 97148 -52487 -64435 -22356 672329
12734C47019i7056H2695O8663c06602e0564A53864g8481l807B90169b02298B14454
12722B72611a62788H1374a16848j00744D53856q5825J22424b81223J5406A50976
12711b22661k62455C03308e9803B18586J98070A59483a9719I6516P5651J2040
12701A84207M6468h694B45974d2433A18261a7547C97030b27856a12075I078K91351
12690C00429K7296c2234D8531a17959e0539F2647L04479r9993c69601D94540i5725
12678C2312J63804a58842j65387B0326K23419M59818A17586L41536K45446f34728
12667b67905A55066K62917B9753b75412J05904B83940A1814J34497N0909K49979
12657D47199p4557J69943f4652K4007j57941O8034C10509A07136i5230E7042A6823
$$ plain form
12734 347019 -97056 82695 151358 -306602 -50564 153864 -78481 -82288 290169 -202298 214454
12722 272611 -162788 81374 -116848 -217592 453856 368031 490455 -281223 -265817 150976
12711 -222661 -485116 303308 -59803 218586 416656 159483 -19719 96516 172167 184207
12701 184207 230675 -8694 245974 -42433 118261 -17547 397030 -227856 -112075 9078 300429
12690 300429 327725 -32234 48531 -117959 -50539 62647 367126 267133 -369601 494540 -95725
12678 32312 196116 -158842 -324229 20326 243745 703563 117586 459122 704568 -634728
12667 -267905 155066 417983 29753 -275412 -169508 283940 11814 146311 197220 447199
12657 447199 372642 542585 -64652 -40645 -198586 -130552 310509 107136 -95230 57042 16823
12645A76813M20331j90980A84375c31932a40931D81715a80303J0000o3755B37693
12634a7140D6871J89369P6496C8417P3668O08395E1094e2499D78801d85440P1830
12623d13610B0351N9792J84917a28905D17610K14091b54023g3633k13238A127805
12612G0023P0479M5497d93913K04198A48136d48388I1561b08200n3286I07547
12601C76133F2165a5201A93166a36135A65962e66l12013A17653J79911J40626
12591D38190D0759c1860F43058b56865N8392m23877D65825j75452n7944A5832
12580a4903H5620e00370K07181B38309K83587J52596b34089n7575q2669j93100
12570e67433b25246b8705A20839a3906l56955C06543e26817b45147I4603L8932
$$ plain form
12645 176813 597144 406164 184375 -331932 -140931 481715 -180303 -170303 -234058 237693
12634 -17140 46871 236240 312736 38417 112085 720480 51094 -52499 478801 -485440 -413610
12623 -413610 20351 80143 265060 -128905 417610 631701 -254023 -73633 -286871 1127805
12612 70023 140502 185999 -493913 -289715 148136 -448388 91561 -208200 -261486 907547
12601 376133 62165 -15201 193166 -136135 165962 -566 -312579 117653 297564 438190
12591 438190 40759 -31860 643058 -256865 -198473 -622350 465825 290373 232429 15832
12580 -14903 85620 -500370 -293189 238309 521896 674492 -234089 -291664 -374333 -567433
12570 -567433 -225246 -28705 120839 -13906 -370861 306543 -526817 -245147 94603 133535
12560A33535P2360L0304a3262B70084a71830E7918b81298l82231A99499J56482
12550C55981J29148A43791N43652a97975n6868N9480E5146g5613l4801B25702
12539a48858A55631a4659n49426B68341b9115j20528A21542d21137a94847C86479
12528c94277c0426F06640a34307m1988D97550J01046F7070a6734r2154F00450
12517C14771a36532D5309a14642B88959a022677F71603o2262B67177G3643J94861
12507B68504p2225d31059K2221B63155j21993e94239K34388K9935j01351g1534
12496E3465A8925J18890b2545l28019F96272a082816C904d06264C58424c76861
12485A34369f79853K52161B12939a974k06712l64073J90924a60297I2127K69539
$$ plain form
12560 133535 205895 236199 -13262 270084 -171830 57918 -281298 -663529 199499 355981
12550 355981 485129 143791 687443 -197975 -254843 -195363 55146 -75613 -110414 225702
12539 -148858 155631 -14659 -564085 268341 -29115 -149643 121542 -421137 -194847 386479
12528 -394277 -30426 606640 -134307 -176295 497550 598596 67070 -16734 -108888 600450
12517 314771 -136532 45309 -114642 288959 -1022677 671603 609341 267177 73643 268504
12507 268504 196279 -431059 -408838 263155 141162 -594239 -359851 -329916 -431267 -71534
12496 53465 18925 137815 -22545 -350564 696272 -1082816 3904 -406264 358424 -376861
12485 134369 -679853 -427692 212939 -1974 -208686 -572759 -381835 -160297 92127 361666
12475C61666o102q2754B9590K35837M62261g2991o63107A12722b71439m8674j20926
12464d41039Q4431B85940f4629A49970b16886H5791J16491k1094N8616f33071
12453B40646g84271R7111E58839k11290L7619j18994b37523D01919b16121n28344
12443g44465B05163i9651m0687l7949B01977b87824B61199Q6718r1115c03186
12432I3149b90537E9016K57474E4496N05966B3750b55158F55643g731p8865A28387
12420d20594G6014J56251L34322c11556B95513k4538E0231N7193B6127O13078
12410F39205I8498L7879R3200a09392b2657A67465J1276P3179P0035f23120G77800
12398c13208D23987K94096B35275c84675A11451O9332a32685j17715B62757c17701
$$ plain form
12475 361666 355564 272810 29590 265427 727688 -72991 -736098 112722 -271439 -320113 -441039
12464 -441039 -356608 285940 -64629 149970 -216886 85791 202282 181188 239804 -633071
12453 240646 -784271 -687160 558839 347549 385168 266174 -237523 401919 -216121 -744465
12443 -744465 205163 -99651 -140338 -178287 201977 -287824 261199 347917 256802 -303186
12432 93149 -290537 59016 316490 54496 560462 23750 -255158 655643 -7731 -86596 128387
12420 -420594 76014 232265 566587 -311556 295513 270975 50231 107424 26127 639205
12410 639205 98498 136377 229577 -109392 -22657 167465 178741 251920 321955 -623120 777800
12398 -313208 423987 718083 235275 -384675 111451 180783 -132685 -250400 262757 -317701
12387b20291B2608a02778p10882e0402k2949D94568q6689j39452e3226k54804
12377c08030J51532q1455C01126K38730J22724B89558J28308j54796d12254C40069
12366D54907b68956k26058J49857a05818A15196d94238A40929h69663D57632E2561
12355b92126D43924j34167A30723N59929k31183k06404J24089A71075e457B54108
12344A37871N29362a19503C34457a21483q0313A15021K48443D8512K29555a26973
12333g763j89282A32850L78698A57030a02857C47946j4904k2046b18336B21114
12322D99995B17628l3083G3351Q0360P25105A22442K39374A75317P5567a94441
12311A5995J80950L32259B39391O67802l75075j41264a72928C87500a50315F6211
$$ plain form
12387 -220291 22608 -102778 -813660 -50402 -73351 494568 407879 268427 -53226 -308030
12377 -308030 -156498 -237953 301126 539856 662580 289558 417866 263070 -412254 340069
12366 454907 -268956 -495014 -345157 -105818 115196 -494238 140929 -869663 457632 52561
12355 -292126 443924 309757 130723 690652 459469 253065 377154 171075 -5457 254108
12344 137871 667233 -119503 334457 -121483 -201796 115021 363464 48512 278067 -126973
12333 -7763 -197045 132850 511548 157030 -102857 347946 333042 310996 -218336 221114
12322 499995 217628 184545 73351 153711 878816 122442 361816 175317 250884 -194441
12311 15995 196945 529204 239391 907193 532118 390854 -172928 387500 -150315 66211
12300d0653A47032J81666d5046B2453M18237E9170B2571b67100q1061M959C63510
12288a34894A40293K38708b34636C0856N20121j39445c54633E021a15604G6203
12277D11066J8811l2575a22104F95666g9043E27064A21434O23417c06423a5888
12266b6647j09362D04900j12709j33751L28780A99780J18290g27093g1241A79459
12255D04957a12267n0365B95622M81521A49683K81223d03105B32433M05485a52615
12244D84602r5279b45364m96381B41160J7522d19018A010294D7245K60489K6855
12234C34589j41149e1005k29474g9628p32723A820e81827A83639d21566F55307
12223A31482N7703M6888J41360H6920K8178h1482k34010F02759B07061c03669
$$ plain form
12300 -40653 147032 328698 -45046 22453 440690 59170 22571 -267100 -348161 -343202 363510
12288 -134894 140293 379001 -234636 30856 550977 411532 -354633 5021 -115604 76203
12277 411066 429877 397302 -122104 695666 -79043 527064 121434 744851 -306423 -15888
12266 -26647 -136009 404900 292191 158440 487220 199780 318070 -727093 -71241 179459
12255 404957 -112267 -162632 295622 777143 149683 430906 -403105 232433 637918 -152615
12244 484602 389323 -245364 -741745 241160 258682 -419018 1010294 47245 307734 334589
12234 334589 193440 -51005 -280479 -79628 -812351 1820 -581827 183639 -421566 655307
12223 131482 189185 236073 377433 86920 115098 -81482 -315492 602759 207061 -303669
12212A09484h511A85211E3414L18430A24131c56433A69296M11383A38392k1059
12202A17333i2298A096458D57596f10636E028N18173e07205K04287B19068J79528
12192C98596j17412m9405o3411K52191K32997c32396E47581e5022E18206a70190
12181A41081J0941O01309O3720l70988a7179D8238J77186D9668k0003C803J39082
12170A42885N46051C13411e38450K43262F93665B7733e75200C9373J2012L87466
12160D38851k6039A81335J77301b59060G24732D4953K73032A05165J01099I6264
12149H1715R40494A38853O68861F9570b68132F9769L8500J008859c70641B71682
12138G33637c0019A88540K05212a53792j50328G87157C31566N10685A17821B3118
$$ plain form
12212 109484 -8511 185211 53414 371844 124131 -356433 169296 580679 138392 117333
12202 117333 -92298 1096458 457596 -610636 5028 523201 -507205 -302918 219068 398596
12192 398596 281184 231779 168368 420559 653556 -332396 547581 -55022 518206 -170190
12181 141081 152022 753331 817051 446063 -17179 48238 225424 49668 29665 3803 142885
12170 142885 688936 313411 -538450 -295188 693665 27733 -575200 39373 51385 438851
12160 438851 412812 181335 358636 -259060 724732 44953 317985 105165 206264 96264
12149 81715 1022209 138853 807714 69570 -268132 69769 108269 1117128 -370641 271682
12138 733637 -30019 188540 393752 -153792 -304120 787157 331566 842251 117821 23118
12127B26320b15809B31887b64657D36558q9353A50219K50380A25231a02259J4520
12117h7739I41096C84826A19803J61973j04477a13501E45791j03617f09497b73696
12106B65153M45243k27227J87227A17618K17957J87066A31861d53780A4908M17922
12096D32830A33073a49983C30379R662p5760j09015J12021J33352c38077l8316
12086c76393C63434d53407A57144L1992p4679M69397A85205c74754J60731M0526
12076a73497E17018e3266j80923D43585j79454h39067J28819K81449h826q4754
12066i3580C60608a84712F36343o3051f0785k0461k91346h7882A61475M24280
12056E85755C1992d78565A45169E187d09484H3802M48072F2443N99487a76642
$$ plain form
12127 226320 -215809 231887 -264657 436558 347205 150219 400599 125231 -102259 -87739
12117 -87739 941096 384826 119803 281776 177299 -113501 545791 442174 -609497 -273696
12106 265153 710396 483169 670396 117618 335575 522641 131861 -453780 14908 432830
12096 432830 133073 -149983 330379 340041 264281 155266 267287 400639 -338077 -376393
12086 -376393 363434 -453407 157144 189136 114457 583854 185205 -374754 -214023 -173497
12076 -173497 517018 -53266 -234189 443585 264131 -839067 -710248 -428799 -8826 -93580
12066 -93580 360608 -184712 636343 573292 -60785 -81246 -372592 -87882 161475 585755
12056 585755 31992 -478565 145169 5187 -409484 83802 531874 62443 661930 -176642
12045b51190E95832c54192l80505A82518J94428A49932b71218H526e319A81186
12034A64887e66938e0880B61821c57453a56383j8813n8914B62720P0810a18262
12023b58921j78266D85516B20367K54846j39685i3605a4672n6096o22312B58578
12012a53843F1609e7681B44018n9963c45428J29534k71910D52745j77099j21296
12002A54350M21846B48816q2450C7650D705b7787D19953A85164K05612K23612
11992F14388e16956A3073f3942F80525h4275D0164R5554a9852A90842e193A06593
11980f16994C16758K41965B09132m7466K00152G2575c91156F28253d65888a23647
11969B7696L50402e47549F8198K7661b75075k60914a23576C5578a76484L3019
$$ plain form
12045 -251190 595832 -354192 -734697 182518 376946 149932 -271218 8526 -5319 181186
12034 164887 -566938 -50880 261821 -357453 -156383 -175196 -234110 262720 333530 -118262
12023 -258921 -437187 485516 220367 475213 335528 -93605 -14672 -70768 -693080 258578
12012 -153843 61609 -57681 244018 184055 -345428 -215894 -487804 452745 275646 154350
12002 154350 576196 248816 166366 37650 4705 -27787 419953 185164 390776 614388
11992 614388 -516956 13073 -63942 680525 -84275 40164 135718 -19852 190842 -5193 106593
11980 -616994 316758 558723 209132 161666 361818 72575 -391156 628253 -465888 -123647
11969 27696 378098 -547549 68198 95859 -275075 -535989 -123576 35578 -176484 -143465
11959a43465m70234b23820k37574D49062c43774B8071a30311d5260k67783C66810
11948A44387J77772m022e56497K50836J01879C55257b47055p6465B66306h47529
11937d73983a26778l9110E29000I8597c51269B68508j4123a31041r2308k30875
11927d54224I7631L2374K3843c64903D24783b28363f4691H372d53470c0609q6170
11916a16779m4900m04176K28648J3573q1250B73738b12400m9740c2511C49991
11905d03493F9819a56987B88827j43235R5553d08900K00517l89039K42003n2460
11895d07879A05876N40534c60087N5629m4515D86357e32977a82910l1012A7254
11884G0878f92228a7885o4321n97429a85594A00751b29017d9865k3156F21642
$$ plain form
11959 -143465 -613699 -223820 -461394 449062 -343774 28071 -130311 -45260 -313043 366810
11948 144387 322159 318137 -556497 -305661 -203782 355257 -247055 -323520 266306 -847529
11937 -473983 -126778 -165888 529000 98597 -351269 268508 254385 -131041 -223349 -454224
11927 -454224 97631 130005 153848 -364903 424783 -228363 -64691 8372 -453470 -30609 -116779
11916 -116779 -161679 -565855 -337207 -323634 -404884 273738 -212400 -262140 -32511 349991
11905 -403493 69819 -156987 288827 145592 241145 -408900 -208383 -597422 -355419 -407879
11895 -407879 105876 646410 -360087 -304458 -348973 486357 -532977 -182910 -213922 17254
11884 70878 -692228 -17885 -82206 -679635 -185594 100751 -229017 -49865 -73021 621642
11873a11152j17221J9124m53757P52a74638k68566a77616C13058e73235A38467
11862F5199b79955B847c25107a41832B39641a20388B00674a65887B45836a82107
11851c16197C16230d4870k57526J2259J10294A47058a02790E9193a05072B98851
11840e44099B28662b12121i6044G4562b32845m30218K15713F589e3344r0893E29309
11828a88888B4762J48066a24229e7071C5842i0155B37783j11970M3884b7128m3876
11817g1004B6151J35250e16279E40353d04626B74042b56503j65787J45293B49974
11806D11021J7787f1829m65737A66113J61534f41134C49656b13471l4883o6967
11796c15321D19969b52171B50049a20221N4266k27078I9327c03595B64745q6309
$$ plain form
11873 -111152 -228373 -209249 -663006 -662254 -174638 -443204 -177616 313058 -573235 138467
11862 65199 -279955 2847 -325107 -141832 239641 -120388 200674 -165887 245836 -182107
11851 -316197 316230 -44870 -302396 -290137 -179843 147058 -102790 59193 -105072 298851
11840 -544099 228662 -212121 -96044 74562 -232845 -663063 -447350 6589 -53344 -144237 529309
11828 -188888 24762 172828 -124229 -57071 35842 -90155 237783 125813 169697 -27128 -71004
11817 -71004 26151 161401 -516279 540353 -404626 274042 -256503 -422290 -276997 249974
11806 411021 428808 -61829 -527566 166113 327647 -641134 349656 -213471 -248354 -315321
11796 -315321 419969 -252171 250049 -120221 -65955 -293033 99327 -303595 264745 178436
11786A78436f53255a41222k14894b2397p0190D26078n3855I0968L28963H9705
11775f83255a34205j17551c1041H1301e51109C5944a57448m8522C34954e28112
11764f975A88651J10069E1979M22789B31863k1611e76343b77255B88239A38307
11753a22312D96694a98974k53654B13912q3385J25897e65604P9553A11158A8512
11742C1270P00820G8171J58322i3206G6802b5419k0577q1816b5794A25820k3420
11731A02400a90362D78666J77037B09449a27432j21189C19097m3362l0559a54656
11720A19532c95208A54775g9518A74579E1258K20870C1515J75200R8834G9527
11709h3148F9684d04147r6971a71862B79225a56503f0258k64547D11723E403M30287
$$ plain form
11786 178436 -653255 -141222 -356116 -22397 -92587 426078 372223 90968 419931 89705
11775 -683255 -134205 -251756 -31041 81301 -551109 35944 -157448 -205970 334954 -528112
11764 -6975 188651 298720 51979 474768 231863 210252 -576343 -277255 288239 138307
11753 -122312 496694 -198974 -452628 213912 130527 256424 -565604 -486051 111158 18512
11742 31270 732090 78171 236493 -93206 76802 -25419 -45996 -127812 -25794 125820 102400
11731 102400 -190362 478666 655703 209449 -127432 -248621 319097 275735 245176 -154656
11720 119532 -395208 154775 -79518 174579 51258 272128 31515 206715 305549 79527
11709 -83148 69684 -404147 -501118 -171862 279225 -156503 -60258 -324805 411723 5403 435690
11698D35690b09688E79316b07155D338c68545J78759J4548L7706f3893A51667
11687f2982a6667j51614k09731j89719a44858A176184B54366d3870j70893j6237
11677b31000k55738B77667c00710C51452b63419C8591a19085j61962A12594N01585
11667F14179c14395I6124a17547n5125j37304E02089k26907G4897a21874k61326
11657c83200A12959H799e5078q68989a60490l7815D54888j21732h752B95605m3307
11646B52298a59627C29101b33508i3004k32495i404j96E03508k01978g1377B54949
11634G35439a85083a2426E4081e06917a81250m68033B82347b38100B74076J678
11624B75754n4502b5407G0871J19000e72695A94441a05470F23595c07828a51993
$$ plain form
11698 435690 -209688 579316 -207155 4338 -368545 -189786 -175238 -137532 -63893 151667
11687 -62982 -16667 -168281 -378012 -567731 -144858 1176184 254366 -43870 -214763 -231000
11677 -231000 -486738 277667 -300710 351452 -263419 38591 -119085 -281047 112594 614179
11667 614179 -314395 96124 -117547 -172672 -309976 502089 275182 74897 -121874 -383200
11657 -383200 112959 8799 -55078 -924067 -160490 -198305 454888 333156 -8752 295605 252298
11646 252298 -159627 329101 -233508 -93004 -325499 -9404 -9600 503508 301530 -71377 254949
11634 735439 -185083 -12426 54081 -506917 -181250 -649283 282347 -238100 274076 275754
11624 275754 221252 -25407 70871 189871 -572695 194441 -105470 623595 -307828 -151993
11613B42544J66592I9214P8653N08067O2436a39592A83377d20649A92771p1319
11603A21452a98666f6915j58253B05120G0821c17569g6666B89436a04926C76386
11592d60008A82369n2847O78906e95101b10091B61276c2303o02422C86903O0290
11582D47193d26303F1172N09450c24320O5537C50262a65701C38004J78831j72356
11572C44479b36199B11342D0321i3062C69743C4514L79511c0565m9919B29583
11561E12780H2881a57802B30707c87270d7156e223D65245q6696b99068h4259q19409
11550i03668b96840n9320C0990b00586D27368d50499K21566C7824a32232o7872
11540b00104h4751H08977a73499f5409k69987B06429a5440j16288A21605K8249
$$ plain form
11613 242544 409136 99214 177867 685934 748370 -139592 183377 -420649 192771 121452
11603 121452 -198666 -66915 -225168 205120 70821 -317569 -76666 289436 -104926 376386
11592 -460008 182369 129522 808428 -595101 -210091 261276 -32303 -634725 386903 447193
11582 447193 -426303 61172 570622 -324320 -258783 350262 -165701 338004 516835 344479
11572 344479 -236199 211342 40321 -93062 369743 34514 414025 -30565 -80484 229583
11561 512780 82881 -157802 230707 -387270 -47156 -5223 465245 378549 -299068 -84259 -903668
11550 -903668 -296840 -356160 30990 -200586 427368 -450499 -228933 37824 -132232 -200104
11540 -200104 -84751 808977 -173499 -65409 -335396 206429 -15440 -131728 121605 149854
11530A49854a21413A38234Q77077m93255B38672N67868C52435F0502J68406J11156
11520C40064a33569k3654C58671A12767J6529O7612P75742C86317L32979A45486
11509H05391a49067D18747d26123I2926D2617P80766l44656c02438j14284e0256
11498e87378C20512L86173i8577k90246a536A39141M90592a62697j59237D58123
11487A24857J11057b11306j51978A44839a13474j64521H16702k88783b72131C63067
11476B84138B9716L48165M135M6465j45988j35666P1455c54444A13276a73425
11465E9209O9904d350C96590K17068b78269B7557a11727A79784L90346j16959
11455D53171d02212B3702d3381j40550G6921J95199a88124E68940D791J7680d9092
$$ plain form
11530 149854 -121413 138234 1015311 522056 238672 806540 352435 60502 228908 340064
11520 340064 -133569 -157223 358671 112767 129296 196908 972650 386317 719296 145486
11509 805391 -149067 418747 -426123 92926 42617 823383 478727 -302438 -416722 -50256
11498 -587378 320512 706685 -98577 -388823 -1536 139141 629733 -162697 -321934 458123
11487 124857 235914 -211306 -363284 144839 -113474 -277995 816702 527919 -272131 363067
11476 284138 29716 377881 382016 428481 282493 146827 218282 -354444 113276 -173425
11465 59209 129113 -4350 396590 613658 -278269 27557 -111727 179784 570130 453171
11455 453171 -402212 23702 -43381 -183931 76921 272120 -188124 568940 4791 22471 -49092
11443c29358J32722B557J76925F3851K12073g3495B24434A09805b11137n1351
11433b62488A6144O3352d52779J2403a03109j95756h8902B13124e98492h6274
11422A33765b92452a5914m03478G9889c9315o09942C08567c0504k81912A19451
11411C36041b17883E807J40718b1195A13239M78758N0792j24702j98717e76190
11400D08473F8935N01353L648G0990J087037d25888b0957B51093d19646B72599
11389F8279Q1769A1984K87065a09038j26141C13914e17872H49735A20950L34937
11379D55887I5809b09424a7001l68478C88099g97999H5908L08849c5841n03830
11369e39671E11421q915h72596B11801K12271N6400j62855d67282a81738d0415
$$ plain form
11443 -329358 -196636 2557 179482 63851 275924 -73495 224434 109805 -211137 -262488
11433 -262488 16144 79496 -452779 -440376 -103109 -298865 -88902 213124 -598492 -86274
11422 133765 -292452 -15914 -419392 79889 -39315 -649257 308567 -30504 -312416 119451
11411 336041 -217883 5807 146525 -21195 113239 591997 642789 518087 319370 -576190
11400 408473 68935 570288 573936 70990 1158027 -425888 -20957 251093 -419646 272599
11389 68279 150048 11984 299049 -109038 -235179 313914 -517872 849735 120950 455887
11379 455887 95809 -209424 -17001 -385479 388099 -797999 85908 394757 -35841 -539671
11369 -539671 511421 502506 -872596 211801 424072 480472 317617 -467282 -181738 -40415
11358a75686l28844o1499g1623q4722C89515c29306f1866j71966p0857l22108
11348f26797D707a0549j9524l84370g7555m08584A19865c30717A18139b99874
11337B52974b5023D30030A25487J46932H9491g4218A5387a92523n54671c38802
11326c13207a56449K135A54457c28447J15181D0418d42675H4730c92027J59687
11316b32340G75559b33810B81049b62774m45790c40544B58604F6702f13984H9707
11305E5865c53448l91875a26190M5821q6746j19677B90822e407n69375N7055A36599
11293a97886P1117f3260k10476A7366b76763k98941p3290A50571b1089l19312
11283c40401M0675i534l64310J25631G7122M82019h9842A09176L76836c72171
$$ plain form
11358 -175686 -504530 -566029 -71623 -156345 389515 -329306 -61866 -233832 -304689 -626797
11348 -626797 4707 -10549 -30073 -414443 -77555 -486139 119865 -330717 118139 -299874
11337 252974 -25023 430030 125487 272419 89491 -74218 15387 -192523 -747194 -338802
11326 -313207 -156449 -154314 154457 -328447 -213266 40418 -442675 84730 -392027 -232340
11316 -232340 775559 -233810 281049 -262774 -708564 -340544 258604 66702 -613984 89707
11305 55865 -353448 -745323 -126190 -80369 -167115 -286792 290822 -5407 -574782 -517727 136599
11293 -197886 -126769 -63260 -273736 17366 -276763 -575704 -648994 150571 -21089 -340401
11283 -340401 -299726 -9534 -373844 -248213 77122 559141 -89842 109176 486012 -372171
11272a16052A36022d83504E98585g29997B80558b89142H5111O12800k55332c93094
11261c95544a86872F32806a11627H14496A78858c59988m6493j95131M5312C47211
11250a85653h3629A04784f1448l88418o19331H5712L14091c11934D14085b37392
11239a68539A20781J78354d57614J87717j6888j27360a46436E328h30539L43938
11229d86601B70414d01740a8442l05963j44848D68213b84301K5475B59523N0767
11219C10290a24713C41664N624a54860q6941m2538F03846E9060e42434p9774b38825
11207E93450A81120f4994E10252c39534k67101b40069l17838a58814m87117H6287
11196g0527j00036l93406N1213n9232B88902h5289H1474i47317D22239M6905Q2092
$$ plain form
11272 -116052 136022 -483504 598585 -729997 280558 -289142 85111 697911 442579 -393094
11261 -395544 -186872 632806 -111627 814496 178858 -359988 -406481 -601612 -556300 347211
11250 -185653 -83629 104784 -61448 -449866 -1069197 85712 399803 -311934 414085 -237392
11239 -168539 120781 299135 -457614 -269897 -286785 -414145 -146436 5328 -830539 -486601
11229 -486601 270414 -401740 -18442 -324405 -469253 468213 -284301 -258826 259523 310290
11219 310290 -124713 341664 347288 -154860 -241801 -284339 603846 59060 -542434 -622208 -238825
11207 593450 181120 -64994 510252 -339534 -606635 -240069 -557907 -158814 -645931 86287
11196 -70527 -170563 -563969 -512756 -571988 288902 -85289 81474 -947317 422239 469144 551236
11185E51236A93046e00480G51033A59115n7547f57365a31685I0705b9841D12145
11174b52806B27845M3850c43116F01650A39497a43013B30i0452k32181A64805
11163a15099A37708b46409h4300n14626A75236c36005l5857A58693c3788A36657
11152D42827b68513a13190j39891Q7909C16595D4925j0281J07381K98686E8067
11141A20704C7979a24975j99489A20661a0009E5500a49331k4600k22450a46842
11130E604L67649j71512c61181C03907J43702M3509j85263m5525E4705M78508
11120E33213K39797k57973k39253J54642d10712B38676K63573I9566l1841J168348
11110A236073b32833C44357e5852D40088a69162B66322N05427k52657B2521O5826
$$ plain form
11185 551236 193046 -500480 751033 159115 101568 -657365 -131685 90705 -29841 412145
11174 -252806 227845 271695 -343116 601650 139497 -143013 230 -90452 -322633 164805
11163 -115099 137708 -246409 -84300 -598926 175236 -336005 -371862 158693 -33788 136657
11152 442827 -268513 -113190 -253081 -165172 316595 44925 34644 142025 440711 58067
11141 120704 37979 -124975 -324464 120661 -10009 55500 -149331 -173931 -396381 -146842
11130 5604 373253 201741 -361181 303907 447609 491118 305855 260330 54705 533213
11120 533213 773010 515037 275784 430426 -410712 238676 502249 99566 67725 1236073
11110 1236073 -232833 344357 -55852 440088 -169162 266322 771749 519092 22521 88347
11100H8347M95386A57642L51360J16082K27449j4924D12635a35612E65711J47894
11090G13605l05391j22877L5597H6368L36838h0277A0309O98249B15949O42881
11080H58830C22884j57328K11109A44407L71673O04212m48651j35929o1884N19155
11070I92983l43290M0063N82980F11120k2841F8364N22600K66377B81829J260884
11060A542713j19586o13567C30701J118588m94246J93490l24616K74441n15826
11051E82532M71555J50998j96792K70420n47731O29635l41158n1746k11725P20856
11041A476844k5379m73007k12393L18355k78094j27371R11406F22806O7998L83006
11031A073810R0054j40046n05548L22679K38818P04399p37180k88865J03469j13969
$$ plain form
11100 88347 583733 157642 509002 625084 852533 837609 412635 -135612 565711 713605
11090 713605 408214 285337 320934 86368 423206 -80277 10309 708558 215949 858830
11080 858830 322884 165556 376665 144407 516080 1120292 671641 535712 473828 992983
11070 992983 649693 689756 1272736 611120 588279 68364 590964 857341 281829 1542713
11060 1542713 1423127 809560 330701 1449289 955043 1148533 823917 1098358 582532
11051 582532 1054087 1205085 1008293 1278713 730982 1360617 1019459 967713 755988 1476844
11041 1476844 1451465 978458 766065 1084420 806326 678955 1590361 622806 690804 1073810
11031 1073810 1163864 1023818 518270 840949 1079767 1784166 1046986 758121 861590 747621
11021G47621N56413m11549L28307E91026N24643Q8348J39672j613k83216P23402
11011A782262l0914H24373K55440L36353N02565o51790l75421N83836k81378K96248
11001A490226n62063K58226M65189k37018k24219R14569l60228k15186J680j9392
10991A511784R0579L24798j86843J07280l39889n20503P22687n464j37867K37255
10981A803817l55555R4370L26892l82188P52200o71927R8968o13478K22191P06679
10971A981969l38804j3096m16215k76342J52275O8011q7233M68290o55972M93237
10961A376120n41405j94488N44988k64531K23646k22586L31973A93439K25068
10952D18507L00006j69284r4861J8614p102h5091B93582n9416N15525l04758M64173
$$ plain form
11021 747621 1304034 892485 1220792 591026 1115669 1204017 1343689 1342076 1058860 1782262
11011 1782262 1751348 824373 1079813 1416166 1918731 1266941 891520 1475356 1193978 1490226
11001 1490226 928163 1186389 1651578 1414560 1190341 2104910 1744682 1529496 1531176 1511784
10991 1511784 1602363 1927161 1740318 1847598 1507709 987206 1709893 1704429 1566562 1803817
10981 1803817 1448262 1542632 1869524 1487336 2239536 1567609 1666577 1053099 1275290 1981969
10971 1981969 1643165 1630069 1213854 937512 1089787 1157798 1070565 1538855 882883 1376120
10961 1376120 834715 640227 1185215 920684 1144330 921744 1253717 193439 418507
10952 418507 718513 549229 454368 472982 465880 -85091 293582 234166 749691 444933 909106
10941I09106B56065F6787O93470l50878m5609n8842d54477K16028I23769l26954
10931E96815k73064b91985H59482C16262f69522F3686K01357K38756h3422F10208
10920d59955J81302B05279G1452N53599P0206f5924C54744A65962c11998D37143
10909E8655b83287B04073d03726a802k53208C23974C1294g74835a64479r5306
10899b59785r2174B18381g0442m6755A90816g6042l11389E25863c40586A10985
10888i09853B87052b67211h0352C08876q453J17449D8255P5025b66829f6802n17482
10877e84284K00587J13528R6607k76546A31278f61473a90148B65827M3972d99287
10866C10003g21328O5069c12696E39087k14470c24940j12111K7859L4524J66051
$$ plain form
10941 909106 256065 66787 760257 409379 363770 304928 -454477 -238449 923769 596815
10931 596815 323751 -291985 859482 316262 -669522 63686 265043 503799 -83422 610208
10920 -459955 -278653 205279 71452 625051 695257 -65924 354744 165962 -311998 437143
10909 58655 -283287 204073 -403726 -1802 -255010 323974 31294 -774835 -164479 -259785
10899 -259785 -351959 218381 -70442 -117197 190816 -76042 -387431 525863 -340586 110985
10888 -909853 287052 -267211 -80352 308876 300423 417872 48255 123280 -266829 -66802 -584284
10877 -584284 -383697 -270169 -173562 -450108 131278 -661473 -190148 265827 309799 -499287
10866 310003 -721328 -656259 -312696 539087 324617 -324940 -437051 -409192 -374668 -208617
10856b08617n2547a9564o17178D18182c85233B01663b00321k12762M6765a75576
10845H5471K41218f06913A89094d64151l92352b16619k09665j17955P8077J12625
10835c53537j57241H6028c74950l4368m4477E57424B1552K25543l2668a36861
10824C80288G9092d62992b635A06373K41314h9471j9015B24395e0704C59531H7886
10812d81327J97467a18922B50584I2455a82567A09066l7695g72089L76959Q3608
10802c11522B55178g8200m90756B37915D7411h19997c60795N0019j43457B4795
10791b56674D88560B27289i8411j95868l22409i9818m31838a73405g5865j99779
10781b75644m3938j86630C07975a76942j76003A41238f84727N0336a71776j22806
$$ plain form
10856 -208617 -261164 -19564 -636742 418182 -385233 201663 -200321 -413083 -366318 -175576
10845 85471 326689 -606913 189094 -464151 -856503 -216619 -426284 -544239 -466162 -353537
10835 -353537 -510778 86028 -374950 -409318 -453795 557424 21552 247095 214427 -136861
10824 380288 79092 -462992 -2635 106373 347687 -89471 -108486 224395 -50704 359531 87886
10812 -481327 -283860 -118922 250584 92455 -182567 109066 71371 -772089 -395130 -311522
10802 -311522 255178 -78200 -568956 237915 47411 -819997 -360795 -310776 -454233 24795
10791 -256674 488560 227289 -98411 -294279 -616688 -99818 -531656 -173405 -75865 -275644
10781 -275644 -319582 -506212 307975 -176942 -352945 141238 -684727 -634391 -171776 -294582
10771b94582D64219m8232A53144j8290c7377A90204N6908B6066g35837c2951E28677
10759H4067c59223j4770J00154l02236B43485i8086F26189d56507a31611A36485
10748B4559N33170i0627D76954b16182B92309d63037K23974l1982F7685N2201
10738A19886i2333k10565G4663a11298o2276n63335h7874E63857b87084j31987
10728d19071K3783d5265o25482B2899b32840D2789b07389A69844K11359n0875
10718C30328m5228g7191j9114q5790H8332b07300D56935a53540A03917g55083
10707h0123j216342A97640a84957C23568n9059K83714a44443N0400j08479D23790
10696c46724f0118F38520j84309h54493a07428B70779f57494b05362f2649C29139
$$ plain form
10771 -294582 464219 415987 153144 134854 -37377 190204 247112 26066 -735837 -32951 528677
10759 84067 -359223 -373993 -273839 -576075 243485 -98086 626189 -456507 -131611 136485
10748 24559 557729 -90627 476954 -216182 292309 -463037 -239063 -271045 67685 119886
10738 119886 -92333 -302898 74663 -111298 -173574 -736909 -87874 563857 -287084 -419071
10728 -419071 -395288 -45265 -670747 22899 -232840 42789 -207389 169844 381203 330328
10718 330328 285100 -77191 -96305 -182095 88332 -207300 456935 -153540 103917 -755083
10707 -80123 -1296465 197640 -184957 323568 264509 548223 -144443 -94043 -202522 423790
10696 -346724 -60118 638520 454211 -854493 -107428 270779 -657494 -205362 -62649 329139
10685a58552A15627b08298F3655a57432B65827C8060a51041j39466p8746C4707
10674e85982K81534k39345A88440K96906b25550n28297L34386J13385J7444a37303
10663e26035J93876h2168K3960k32823g8181m25218A17690h2711j99660k28648
10653e11019h3659b0947p84200a72978l96214m3072F04615g27097b67474d2817
10642b84445P9057c7166n3276A9649L5225a82705g0807N390C28293b58045q2802
10631c40847f4652I6164g16675a01q35012B29183J10408i09775e334p03618A5138
10619D7894c70049k85175I3977e0624m09847A75071k1848L13166d9247q2253m60266
10608e91766M982k66358b93428J23088C20807b15906B85701i1454G45261k46864
$$ plain form
10685 -158552 115627 -208298 63655 -157432 265827 38060 -151041 -290507 -369253 34707
10674 -585982 -304448 -543793 188440 485346 -225550 -753847 -419461 -306076 -288632 -137303
10663 -526035 -332159 -82168 -58208 -291031 -78181 -503399 117690 -82711 -282371 -511019
10653 -511019 -83659 -20947 -805147 -172978 -569192 -612264 604615 -727097 -267474 -42817
10642 -284445 -205388 -37166 -90442 19649 54874 -182705 -70807 -65417 328293 -258045 -340847
10631 -340847 -64652 96164 -716675 -101 -835113 229183 339591 -909775 -5334 -708952 15138
10619 47894 -370049 -655224 93977 -50624 -460471 175071 153223 466389 -49247 -131500 -591766
10608 -591766 -586784 -853142 -293428 -170340 320807 -215906 285701 -91454 745261 498397
10598D98397d18854a82088l53672P0052J85494p0920h1481l78987a34563E96096
10587A88878C2765O6352d11490B24417c78921P9331q834C74050L31186e90650
10576D18220j09423a36174j46550E02369a64836e86p55176C5383d97759A96001
10565b19026r0871B50270a79144B11012E1859d22678k43392b80735l14114K00373
10555c94476c4770F4488J39978d79143E45364a68266j51049Q8228C8604L33462
10545C72066e6856C81701F1900L03997a87442B1081N35303B42908a92978B95284
10534b84398j92543A43701f3261m81460B00595i0317F2779r458c12547D7837d55150
10522b56745m53841B52825c29876r6608f7559j17168L3992F10482c7259j13222
$$ plain form
10598 498397 -418854 -182088 -535760 -465708 -280214 -351134 -81481 -460468 -134563 596096
10587 188878 32765 99117 -411490 224417 -378921 -299590 -308424 374050 705236 -590650
10576 418220 308797 -136174 -282724 502369 -164836 -586 -755762 35383 -497759 196001
10565 -219026 -309897 250270 -179144 211012 51859 -422678 -666070 -280735 -594849 -394476
10555 -394476 -34770 64488 204466 -479143 545364 -168266 -319315 -231087 38604 372066
10545 372066 -56856 381701 61900 365897 -187442 21081 556384 242908 -192978 295284
10534 -284398 -476941 143701 -63261 -544721 200595 -90317 62779 53321 -312547 47837 -455150
10522 -256745 -710586 252825 -329876 -426484 -67559 -184727 -150735 610482 -37259 -150481
10512a50481n81591A76341g20178B20852a11040B62661j24027b23794d2057B87350
10501g26537e1821I00654a62301B19301c72589A72684K35859a55404a9190j14819
10491a34009j84070C1038b49485F30196d62728b2437C89430e47301b70705L2431
10481b38274l04240D05649b17225B69K44801j8529a10692k14575o4022A69473
10470I9621e5482l53798A51483p5433f7722D4556a21249j09134C2370a29623B3481
10458A35688d51580J27625C2144e09303b34936C95648A92563P3236L01754A06301
10447c32779D19985c14406E614J36644a68137G7670c60488m43940B53333a56317
10436D99343b52753o1163d0121j92331r3231C62800c99445J97202A99534g7323
$$ plain form
10512 -150481 -732072 176341 -720178 220852 -111040 262661 138634 -223794 -42057 287350
10501 -726537 -51821 900654 -162301 219301 -372589 172684 408543 -155404 -19190 -134009
10491 -134009 -318079 31038 -249485 630196 -462728 -22437 389430 -547301 -270705 -238274
10481 -238274 -542514 405649 -217225 269 245070 226541 -110692 -325267 -389289 169473
10470 99621 -55482 -409280 151483 76050 -67722 44556 -121249 -230383 32370 -129623 23481
10458 135688 -451580 -323955 32144 -509303 -234936 395648 192563 265799 567553 106301
10447 -332779 419985 -314406 5614 142258 -168137 77670 -360488 -804428 253333 -156317
10436 499343 -252753 -313916 -40121 -232452 -325683 362800 -399445 -202243 199534 -77323
10425B17151a32545D98457J7238k04808e25154A77764c30939B51126L00578h46535
10414A99232a77124B61465e41632a00382A84496K56161B18066h5301C11576a94526
10403A08119K06955j54442K9462K72574b6992m22330A09313L52791B29129b21314
10392d6684D42128q5692a78326q3126B61877h17643b22971F80385B32303H0384
10381C5362M60411P7327j51007A1473M1539a17068G34544A76878c5140A088682
10370A188M1066L98916L71317k00009h34791G65662A81471N83992A80203J70663
10360C50866i8359D63397o0255K81956j57745k6177b96240f2758H5199J92546
10350B77745C2197a59436A681f3140C31715L3320c87604B74559M27548j66641
$$ plain form
10425 217151 -132545 498457 515695 310887 -525154 177764 -330939 251126 551704 -846535
10414 199232 -177124 261465 -541632 -100382 184496 440657 218066 -85301 311576 -194526
10403 108119 315074 160632 190094 462668 -26992 -449322 109313 462104 229129 -221314
10392 -46684 442128 356436 -178326 -261452 261877 -817643 -222971 680385 232303 80384
10381 35362 495773 573100 422093 11473 53012 -117068 734544 176878 -35140 1088682
10370 1188 42254 441170 812487 612478 -834791 765662 181471 765463 180203 350866
10360 350866 -98359 463397 403142 685098 527353 501176 -296240 -62758 85199 277745
10350 277745 32197 -159436 1681 -63140 331715 365035 -387604 274559 702107 535466
10340E35466a20385A57153n6690R2348c86763J53579D04363a60766C50640e7360
10329e19579F30952a86624j4744L3333A43424B1948J14987c99166a38628E16555
10318d2743A17906n0793N00031H2717d09776D53114G1159a87888B26583n618F928
10306C03555b32573F9738K09207e88482J82047b544k35511N8474D70257b2699
10295F78252B54568J46071a49660C05809c05732p1639D06201b16496r5124o62040
10285i73660L62923b31418j49273f3173A52901B5464K13516p7469j9321m7309
10275I4881K44260c13477g9384l28894C81696B9103d15761k67972G8191K54823
10265C33014i6803k43691C42965b04850j14077a34080k90243G1681C5823e79827
$$ plain form
10340 535466 -120385 157153 100463 192811 -386763 -233184 404363 -160766 350640 -57360
10329 -519579 630952 -186624 -201368 -168035 143424 21948 136935 -399166 -138628 516555
10318 -42743 117906 67113 567144 82717 -409776 453114 71159 -187888 226583 220965 6928
10306 303555 -232573 69738 278945 -588482 -406435 -2544 -238055 -179581 470257 -22699
10295 678252 254568 400639 -149660 305809 -305732 -377371 406201 -216496 -311620 -973660
10285 -973660 -610737 -231418 -380691 -63173 152901 25464 238980 161511 142190 94881
10275 94881 339141 -313477 -79384 -408278 381696 29103 -415761 -683733 78191 333014
10265 333014 -96803 -340494 342965 -204850 -318927 -134080 -424323 71681 35823 -579827
10254a4568D19945b13338J8039E2413J334J74992l7697j653e72546g7418A42387
10242A31890c51546a14826A28584a71770n8225j77474j2218b8569k85612k8538
10232c42719J67298j06999p9324h1285E18143i943n24818K22256d5762q7952B34190
10220f68018a2091p5994D8774N18163a20907A05931j16L1049e73069b52934k29070
10209d82004K08682l02400b24361l44223j30594A69692a91918D062b43370J04429
10199a38941r3067l89046E5492b65389j72588a72421l32220C68207n8898H6184
10188F96810C13581A35191h9468a8626j62477I8246R8074d27800g6612l54844
10178d31456H0127d89717j68290F7900N37532A09049d9890B73002J63708c71116
$$ plain form
10254 -14568 419945 -213338 -195299 52413 53747 228739 191042 189389 -572546 -77418 142387
10242 131890 -351546 -114826 128584 -171770 -229995 -407469 -419687 -28569 -314181 -342719
10232 -342719 -175421 -282420 -361744 -81285 518143 -9943 -534761 -312505 -45762 -133714 234190
10220 -668018 -12091 -88085 48774 566937 -120907 105931 105815 136864 -573069 -252934 -482004
10209 -482004 -273322 -575722 -224361 -568584 -699178 169692 -191918 4062 -243370 -138941
10199 -138941 -232008 -621054 55492 -265389 -437977 -172421 -504641 368207 309309 86184
10188 696810 313581 135191 -89468 -18626 -181103 98246 196320 -427800 -76612 -431456
10178 -431456 80127 -489717 -658007 67900 605432 109049 -49890 273002 436710 -371116
10167H2154a96375k34724a68280K4971j89202N7665k99688b79905m62747J49712
10157e92940b13029A19522A5984N137N353d80861K00509L5293a907q0939A60119
10145d84736j14967M7848a24787A52137p4747a2912m79961j69588a02768k20314
10135c23082j37182C28637b46751e1061A41045c05877c5281j49994C83217c85931
10124b06922F55569j25381A95099c19761B77407D9888a24778D65621A2058e08594
10113b90420F84658d8161l17007A63401d78681A95869a81968E44836k50777f87248
10102c76874B4908c85133d852A55665c95131E40873d6217B9159A1199K84191J21107
10091D16497c7201A27240f8751j63605p5034B35329L8218b04233A58357c72954
$$ plain form
10167 82154 -196375 -431099 -168280 -143309 -332511 -274846 -574534 -279905 -742652 -592940
10157 -592940 -213029 119522 15984 21121 26474 -480861 -280352 -245059 -1907 -82846 160119
10145 -484736 -599703 -551855 -124787 152137 77390 -12912 -492873 -662461 -102768 -323082
10135 -323082 -460264 328637 -246751 -51061 141045 -305877 -35281 -185275 383217 -385931
10124 -206922 655569 530188 195099 -319761 277407 49888 -124778 465621 12058 -508594
10113 -290420 684658 -48161 -365168 163401 -478681 195869 -181968 544836 294059 -687248
10102 -376874 24908 -385133 -4852 155665 -395131 540873 -46217 29159 11199 295390 416497
10091 416497 -37201 127240 -68751 -232356 -307390 235329 273547 -204233 158357 -372954
10080B41754g33257C61550A66518f40156C4307Q69571c3496q64187a38103D15101
10069c29282J23218l12057E45967j48695d16457O9342a67665B47584h7411j94950
10059b82361B25376h00967A32562d5608A24271e91734I45188I9488b21512i2525
10048a014961a11834M2967j9116G6528c17646b4850l98622a96710j87354J19448
10038b64616j91851C13370f90845L16962J41495H6475K47387b18964k14523J81433
10028b52054j86797C93864b18093A12273n5851f0852A67540J28002h29996J94125
10018f35871l76812E53697A8102O80141g5481k299n88586I3823b87268c14m59843
10007d60157A85335K59191b50999a9712k16273o2510J29836j53942k43907E1319
$$ plain form
10080 241754 -733257 361550 166518 -640156 34307 903878 -33496 -897683 -138103 415101
10069 -329282 -206064 -518121 545967 397272 -416457 -347115 -167665 247584 -87411 -282361
10059 -282361 225376 -800967 132562 -45608 124271 -591734 945188 99488 -221512 -92525
10048 -1014961 -111834 -68867 -87983 76528 -317646 -24850 -423472 -196710 -384064 -264616
10038 -264616 -456467 313370 -690845 -373883 -232388 86475 333862 -218964 -433487 -252054
10028 -252054 -438851 393864 -218093 112273 56422 -60852 167540 295542 -829996 -635871
10018 -635871 -1012683 553697 18102 698243 -75481 -77780 -666366 93823 -287268 -314 -460157
10007 -460157 185335 444526 -250999 -19712 -235985 -298495 -168659 -322601 -566508 51319
9996a99048k79184A5478b79523j07832a21780j80338j80721A05570J94185b77082
9985d8293A1337d99057b30347D86502c21979m48837E15919k33578f12878j81468
9975g94346A38779f3562n76321a77265r6403D84951b17650A40779b10132G0002
9964C94064b5797l47690A26834a56132d6643r7076n9079k38822J18081A03583
9953f1115G4481a05967C9969c06680D63355c00341a44204l16644o8872Q1383c2251
9941h4764q5950d3811F843h9952a5160n63276J0983C03644b16828G71322f01715
9929c32417A94569d69390d2262l14234j79992K65155k84372D7201b40426g1562
9918G92489b51178e3122l11132A39609i33076a6459C27588M4379C6976J32725
$$ plain form
9996 -199048 -478232 15478 -279523 -387355 -121780 -302118 -482839 105570 299755 -277082
9985 -48293 11337 -499057 -230347 486502 -321979 -770816 515919 282341 -612878 -794346
9975 -794346 138779 -63562 -639883 -177265 -273668 484951 -217650 140779 -210132 70002
9964 394064 -25797 -373487 126834 -156132 -46643 -143719 -202798 -441620 -323539 103583
9953 -61115 74481 -105967 39969 -306680 463355 -300341 -144204 -460848 -529720 -448337 -32251
9941 -84764 -170714 -43811 6843 -89952 -15160 -578436 -567453 303644 -216828 771322 -601715
9929 -332417 194569 -469390 -42262 -356496 -536488 -271333 -555705 47201 -240426 -71562
9918 792489 -251178 -53122 -364254 139609 -933076 -16459 327588 371967 36976 169701
9908A69701c80444A8765M58911I9b53836A32866C7849c65647p2364A54019d68789
9896b89665B18873d74529J74133m3473R1427J02388B62134c00896d9230j05160
9886a54390B67866J19700a55078C81069j86153M41814e82682a40114A2645J2669
9876B5314J91982q7224f65532i7869b5759I6923c5885C84316c34294P5766B53966
9864A25425K33589f52608a04241k83202m19384b28701B10193g03538A19163c49588
9853c21721P7323i0352F74164d8799k49725r097O3092a0917k49374g8583n37927
9842f16510C65727a24916b9901l60449p8685O455E41379j22189j11074J07348
9832D15464d3041j44203A11740e5053k35117m48667F70352k83044e28485a71769
$$ plain form
9908 169701 -380444 18765 477676 99 -253836 132866 37849 -365647 -438011 154019 -468789
9896 -289665 218873 -474529 -300396 -343869 -252442 -150054 262134 -300896 -49230 -154390
9886 -154390 267866 387566 -155078 381069 194916 636730 -582682 -140114 12645 25314
9876 25314 217296 130072 -665532 -97869 -25759 96923 -35885 384316 -334294 -258528 253966
9864 125425 359014 -652608 -104241 -387443 -806827 -228701 210193 -703538 119163 -349588
9853 -321721 -244398 -90352 674164 -48799 -298524 -307621 -244529 -10917 -260291 -78583 -616510
9842 -616510 365727 -124916 -29901 -390350 -469035 -462580 541379 419190 308116 415464
9832 415464 -43041 -187244 111740 -55053 -290170 -738837 670352 387308 -528485 -171769
9821b32996M184j51357D2139L34314b27636d4157D79167a70632o16577B35357
9810A71589e48570J38553J76797D92517A34268a50626o0321D08866g34519E440
9799e09574a3538n04276b54179B9735d9637C1603d96016e5032B355K60545B4660
9787E13960d48333a00313j09176n2491j93700K1785a1204k0877G0426c45442a36119
9775A31326d88764J53696c8580E90379b489l4702o53106B66589b21853l5243j01354
9764c58450B74225e24872j21020L03167j61029J18526j73117K24752C31669N6072
9754C87741j35652Q7798J67759K09032e05538J19404c7064C2379c56824B34623
9743e31737b32960l548n02729K11658j36373b3652A61081a94053C00837a25387
$$ plain form
9821 -232996 -228812 -380169 42139 376453 -227636 -44157 479167 -170632 -787209 235357
9810 171589 -548570 -410017 -233220 492517 134268 -150626 -210947 408866 -734519 5440
9799 -509574 -13538 -517814 -254179 29735 -49637 31603 -496016 -55032 2355 262900 24660
9787 513960 -448333 -100313 -209489 -261980 -455680 -433895 -11204 -32081 70426 -345442 -136119
9775 131326 -488764 -335068 -38580 590379 -2489 -37191 -690297 266589 -221853 -257096 -358450
9764 -358450 274225 -524872 -645892 -342725 -503754 -385228 -558345 -333593 331669 387741
9754 387741 252089 339887 507646 716678 -505538 -386134 -37064 32379 -356824 234623
9743 -531737 -232960 -236508 -739237 -527579 -663952 -23652 161081 -194053 300837 -125387
9732B33664A15517L16777K4014D3179e92356E2880a77141H12714e97664H4905
9721g26955b32696l58099J1008a24684F38323d31359m2037K9759C38542l01a37243
9709a09063d8332q3632C26994b67013o4036a60424O5008n54989B16287a89102
9698A96683K09120c54927a67816Q750r50600c52057n8844g0060b3986m69085b02922
9686E6790b50352C30780K64096k06013a87111j10803a45895B95897g2634n9045
9676a31679D547b95582r1593J72832k7935f3166D1764f41383b06387N1227j92980
9665c48140j38083B7687d44373g1228B16498b08220a2957A8900a44762j82013
9655c26775a56016B04740d14013J41055q4078J22394a9628k38135k10764B63969
$$ plain form
9732 233664 115517 432294 456308 43179 -592356 52880 -177141 812714 -597664 84905
9721 -726955 -232696 -590795 -579787 -124684 638323 -431359 -473396 -443637 338542 338241 -137243
9709 -109063 -48332 -131964 326994 -267013 -331049 -160424 -95416 -650405 216287 -189102
9698 196683 405803 -354927 -167816 -159066 -1109666 -352057 -410901 -70060 -23986 -493071 -202922
9686 56790 -250352 330780 594876 388863 -187111 -297914 -145895 295897 -72634 -131679
9676 -131679 4547 -295582 -387175 -214343 -242278 -63166 41764 -641383 -206387 -155160 -348140
9665 -348140 -486223 27687 -444373 -71228 216498 -208220 -12957 18900 -144762 -326775
9655 -326775 -156016 204740 -414013 -272958 -357036 -234642 -19628 -257763 -468527 263969
9644f15859I6090J92470e94530a34742N5625F3097K25478j33908H983a54483A61333
9632f03707L5145E86625E970i53636C39081b07031D7507R4716g6322o9402p07544
9621h53268B36452J16183g40321E45377f08852K12078A61579b9088E18934b63037
9610A42343c24148a07979n17589J88744J88862N8070k82193e5232p1922A47589
9599g0042k55760j58856C52904q9637F7883K74968c50155L3600E33696h2378l73461
9588d55839D4972J4945h14151P4087d6711B60604d54168j325L2575D57243A68417
9576c26857B84851j33356e2100a9425o77966R5343g6939j11998A18198b27246
9565E9918f986C42337k5109o6514K00279i466A30195l9994c78654n2339p6679
$$ plain form
9644 -615859 96090 288560 -594530 -134742 -79117 63097 288575 154667 8983 -154483 161333
9632 -603707 -568562 586625 5970 -953636 339081 -207031 47507 142223 -76322 -145724 -853268
9621 -853268 236452 352635 -740321 545377 -608852 -396774 161579 -29088 518934 -263037
9610 142343 -324148 -107979 -625568 -436824 -247962 -189892 -472085 -55232 -127154 147589
9599 -70042 -325802 -484658 352904 263267 67883 342851 -350155 -316555 533696 -82378 -455839
9588 -455839 44972 59917 -814151 -740064 -46711 260604 -454168 -455493 -422918 457243 168417
9576 -326857 284851 151495 -52100 -19425 -697391 -602048 -76939 -188937 118198 -227246
9565 59918 -6986 342337 317228 250714 450993 -9466 130195 90201 -378654 -430993 -507672
9554e07672a11277A31911a75419A83511H4626J5272i154H8944h8069I6397d54639
9542C2g02129A31153e46121D81637k24517a79316A80625a13751a0168n76311A08078
9530g04028J33356A97024a98207e4486q15527c67588k63115E67904a90839Q2222
9520a08617A43357M6933e05109b14922l99400c02171q0983i4289n71384a61703
9509I9990b6153G1861b41777A76173G7408d47281j41709a37218H0018b67207q2869
9498c50076B84688d13577K03816E64776J19531G0206a36538k17922a7957j058074
9488a076031d09062r9972G01852D6391d03372K6147A73172i4087j01302n2471
9478b47860A61245C3567c2414H02453d79136D65387f00457F5746N3805d60532
$$ plain form
9554 -507672 -111277 131911 -175419 183511 84626 99898 -9154 88944 -88069 96397 -454639
9542 32 -702129 131153 -546121 481637 257120 -179316 180625 -113751 -10168 -586479 108078
9530 -704028 -570672 197024 -198207 -54486 -870013 -367588 -630703 567904 -190839 -108617
9520 -108617 143357 190290 -505109 -214922 -614322 -302171 -383154 -94289 -665673 -161703
9509 99990 -26153 71861 -241777 176173 77408 -447281 -588990 -137218 80018 -267207 -350076
9498 -350076 284688 -413577 -209761 564776 684307 70206 -136538 -354460 -17957 -1076031
9488 -1076031 -409062 -509034 701852 46391 -403372 -377225 173172 -94087 -195389 -247860
9478 -247860 161245 33567 -32414 802453 -479136 465387 -600457 65746 119551 -460532
9467B46992b97107R8757m01011b90965a6904K127k48273A56882a83359C60545
9456d6880j28897A5235a9143C76364f35837b49296D62050e40563J79976A49292
9445b36183j09745E785c06177h1563o6825H36800b65894k8877k93729D06686a037612
9433h94480a64614p4218j14119M2457g943D72169d34511J25803H1832c43440m2342
9422c85782g9316C90694m1809A67731o1049D9622d30879j39576a29778K3095l78351
9411d85034a61766o09870g2125B56513b03517A19881e57357b22725C44906j05246
9401B39660o9897O7067f57722K43452A68616b9915m24231A88988B6321d97161
9390d43208D6293a99717m5218m27212C05578K454I622N2394A1991O30060J7913
$$ plain form
9467 246992 -297107 -198350 -599361 -290965 -16904 -14777 -263050 156882 -183359 360545
9456 -46880 -175777 15235 -19143 376364 -635837 -249296 462050 -540563 -360587 149292
9445 -236183 -345928 5785 -306177 -81563 -148388 836800 -265894 -294771 -588500 406686 -1037612
9433 -894480 -164614 -238832 -352951 -310494 -7943 472169 -434511 -308708 81832 -343440 -385782
9422 -385782 -79316 390694 348885 167731 106682 49622 -430879 -570455 -129778 -106683 -485034
9411 -485034 -161766 -771636 -72125 256513 -203517 119881 -557357 -222725 344906 239660
9401 239660 169763 236830 -657722 -414270 168616 -29915 -454146 188988 26321 -497161
9390 -443208 46293 -199717 -244935 -672147 305578 308032 9622 62016 11991 642051 659964
9379F59964e31387B1341I927f1369q6335B30211d07988J49873D05601j31614A36357
9367A29271Q111a129397B40505a78410l64364E7813Q9482c12823n63916d07213
9356B3224N66963j4461c6712B24872h6121G7485a48868j53870j80206A29621M06962
9345E36583c42184A99449b0138p9443m31942D12963J34659B17502e00272C25465
9334d26034k01236o9762a16369l2168j44509B47515J6256a06925K1465B03544
9323e94673D23149g6395l02588A16878c13780j07377l26572b88639B86259b77336
9312e74505A62153c9148B05706e66218D36397B05258L1251H331b15464d8205k3572
9301g1777D58418d3834I5496c86841A9799I316R8181m6426e26472a76046m41578
$$ plain form
9379 659964 -531387 21341 9927 -61369 -147704 230211 -407988 -258115 405601 273987 136357
9367 129271 137382 -1129397 240505 -178410 -542774 57813 147295 -312823 -876739 -407213
9356 23224 590187 575726 -36712 224872 -86121 77485 -148868 -302738 -482944 129621 536583
9345 536583 -342184 199449 -20138 -99581 -531523 412963 547622 217502 -500272 325465
9334 -426034 -627270 -697032 -116369 -148537 -293046 247515 263771 -106925 -85460 203544
9323 -594673 423149 -76395 -378983 116878 -313780 -421157 -747729 -288639 286259 -277336
9312 -574505 162153 -39148 205706 -566218 436397 205258 236509 8331 -215464 -48205 -71777
9301 -71777 458418 -43834 95496 -386841 19799 9316 107497 61071 -526472 -176046 -617624
9290f17624F46805f92211A76738c79696H4878J99596H5051d69957B4106d19957
9279c73837J12917f2754j00435j46104F60371A38247i3507j51600j35411Q3624
9269b96894b7314k67306k5167o81679a80818c7496l100l10021A77259e53550h8355
9257A18633b76638C9737J04938J94991F0464K08002c8176m9972C54852a41862
9246B19196g21466a14001k60789l07353D30895a99903B82089A6964g7142j88505
9236b65647E1150b89440A61269b5495l46056A87755K98710j75903G179h24048
9225b49636a20659J1687E05585H7029f598l42024g4553j31421B3640a18576l133
9214a21709i080l94516C24204i5031n95542E53863j90949E4304h0312o39504a09057
$$ plain form
9290 -617624 646805 -692211 176738 -379696 84878 284474 85051 -469957 24106 -419957
9279 -373837 -260920 -62754 -163189 -309293 660371 138247 -93507 -245107 -380518 -296894
9269 -296894 -27314 -294620 -319787 -1001466 -180818 -37496 -40596 -350617 177259 -553550 -88355
9257 118633 -276638 39737 144675 339666 60464 268466 -38176 -88148 354852 -141862
9246 219196 -721466 -114001 -374790 -682143 430895 -199903 282089 16964 -77142 -265647
9236 -265647 51150 -289440 161269 -25495 -371551 187755 486465 310562 7179 -824048
9225 -249636 -120659 -108972 505585 87029 -6598 -348622 -74553 -205974 23640 -118576 -121709
9214 -121709 -9080 -403596 324204 -95031 -690573 553863 362914 54304 -80312 -719816 -109057
9202G5010h2382j55886j04311R0121a01457j8670J4110k88435C8834i9431j35985
9191b35416C57312a42505n04768f4897F2074L4615P73957B7983K16155a38972
9180b60577j50478a49205D37953e4609l09659a55910l72304E2415N78694B35406
9169A10920b08788D09172b05848h6898A08339b39843B10695i37664d66508j26365
9159e92873d3582j72344F16871A76286p6353K9829m9596f16523E4988g6615K8272
9148d8343j85673n8231D21184e4419j79183k20736Q5426m889k14469J45257D43454
9136c20211O3200f5284j35757l44379Q5765b170q5249A01579f6768j31760k9960
9125b28488f98H1557k6117K92465i047B20991l4796J54531f9404C67430a13660
$$ plain form
9202 75010 -82382 -238268 -342579 -252458 -101457 -120127 -106017 -394452 38834 -99431 -235416
9191 -235416 357312 -142505 -647273 -64897 62074 96689 870646 27983 244138 -138972
9180 -260577 -411055 -149205 437953 -54609 -364268 -155910 -528214 52415 631109 235406
9169 110920 -208788 409172 -205848 -86898 108339 -239843 210695 -937664 -466508 -592873
9159 -592873 -43582 -215926 616871 176286 99933 129762 80166 -616523 54988 -76615 -48343
9148 -48343 -234016 -292247 421184 -54419 -233602 -454338 -368912 -373801 -588270 -443013 443454
9136 -320211 -257011 -65284 -201041 -545420 -459655 -2170 -87419 101579 -66768 -198528 -228488
9125 -228488 -698 81557 55440 347905 -9047 220991 186195 340726 -69404 367430 -113660
9113C21521g3686I63828a60196A75488J38346a172911M40877b51505J24985k46961
9103c73481i7991j57242p1688A00044f91622D84993e70333D08571a49288D97143
$$ plain form
9113 321521 -73686 963828 -160196 175488 313834 -1172911 -732034 -251505 -126520 -373481
9103 -373481 -97991 -255233 -326921 100044 -691622 484993 -570333 408571 -149288 497143
$$ [...]
##END NTUPLES=NMR SPECTRUM
##END=
