
##TITLE=AC1363_CENAH12181_6945775_Yrp4P3u4DM
##JCAMPDX= 6.0         $$ Bruker NMR JCAMP-DX V2.0
##DATA TYPE= NMR SPECTRUM
##DATA CLASS= NTUPLES
##ORIGIN= BRUKER
##OWNER= Administrator
$$ 1.72 TOPSPIN		Version 2.1
$$ 2012-10-18 13:48:11.977 -0700  Administrator@X
$$ Compression mode = diff/dup
##.OBSERVE FREQUENCY= 400.02188249412
##.OBSERVE NUCLEUS= ^1H
##.ACQUISITION MODE= SIMULTANEOUS (DQD)
##.ACQUISITION SCHEME= undefined
##.AVERAGES= 64
##.DIGITISER RES= 22
##SPECTROMETER/DATA SYSTEM= spect
##.PULSE SEQUENCE= noesygpps1d.comp
##.SOLVENT NAME= COFFEE_meoh
##.SHIFT REFERENCE= INTERNAL, COFFEE_meoh, 1, 14.96064
##AUDIT TRAIL= $$ (NUMBER, WHEN, WHO, WHERE, PROCESS, VERSION, WHAT)
$$ ##TITLE= Audit trail, TOPSPIN		Version 2.1
$$ ##JCAMPDX= 5.01
$$ ##ORIGIN= Bruker BioSpin GmbH
$$ ##OWNER= Administrator
$$ $$ C:\Bruker\TOPSPIN/data/COFFEE/nmr/AC1363_CENAH12181_6945775_Yrp4P3u4DM/12/pdata/1/auditp.txt
$$ ##AUDIT TRAIL=  $$ (NUMBER, WHEN, WHO, WHERE, PROCESS, VERSION, WHAT)
(   1,<2012-10-14 00:50:54.140 -0500>,<Administrator>,<TOPSPIN>,<go>,<TOPSPIN 2.1>,
      <created by zg
	started at 2012-10-14 00:39:23.968 -0500,
	POWCHK enabled, PULCHK disabled,
       configuration hash MD5:
       6B 1B 68 BB D9 2E 58 E2 7F 35 AD 54 07 DF 0E 41
       data hash MD5: 64K
       49 CA 18 FD AC CD FE 03 DA 4D E4 F8 B3 A3 FD DE>)
(   2,<2012-10-14 00:50:57.031 -0500>,<Administrator>,<TOPSPIN>,<proc1d>,<TOPSPIN 2.1>,
      <Start of raw data processing
       efp LB = 0.3 FT_mod = 6 PKNL = 1 PHC0 = 0 PHC1 = 0 SI = 128K 
       data hash MD5: 128K
       6B 76 60 27 54 75 00 DC 9F 0D 85 17 6C 0F 9C 9A>)
(   3,<2012-10-14 00:50:58.109 -0500>,<Administrator>,<TOPSPIN>,<proc1d>,<TOPSPIN 2.1>,
      <pk PHC0 = 4.790039 PHC1 = 0 
       data hash MD5: 128K
       F0 42 FA BF 84 39 CD 20 04 5A 1A 5C F3 B9 50 3F>)
(   4,<2012-10-14 00:50:58.328 -0500>,<Administrator>,<TOPSPIN>,<proc1d>,<TOPSPIN 2.1>,
      <abs ABSG = 1 
       data hash MD5: 128K
       0F C8 4C 10 BA F8 BE AD 3F AA 16 1E 2B C5 AE E2>)
(   5,<2012-10-14 00:50:58.406 -0500>,<Administrator>,<TOPSPIN>,<proc1d>,<TOPSPIN 2.1>,
      <abs ABSG = 2 
       data hash MD5: 128K
       78 D2 BA 21 11 80 6D A7 D7 82 C6 4F FE 42 84 E8>)
(   6,<2012-10-14 00:50:58.640 -0500>,<Administrator>,<TOPSPIN>,<proc1d>,<TOPSPIN 2.1>,
      <abs ABSG = 3 
       data hash MD5: 128K
       B8 4D AA DC 2D B3 D3 D1 6C AE 10 5F 33 27 44 8E>)
(   7,<2012-10-14 00:50:58.703 -0500>,<Administrator>,<TOPSPIN>,<proc1d>,<TOPSPIN 2.1>,
      <abs ABSG = 4 
       data hash MD5: 128K
       62 DA 96 68 24 14 B9 F0 1D F1 84 84 EA 4C 9B 11>)
(   8,<2012-10-14 00:50:58.781 -0500>,<Administrator>,<TOPSPIN>,<proc1d>,<TOPSPIN 2.1>,
      <abs ABSG = 5 
       data hash MD5: 128K
       A5 39 05 89 A4 DD 18 08 EA 32 C9 6C B8 A7 CF 1E>)
(   9,<2012-10-14 00:50:59.000 -0500>,<Administrator>,<TOPSPIN>,<audit>,<TOPSPIN 2.1>,
      <user comment:
       ICON-NMR User ID: COFFEE
       data hash MD5: 128K
$$ [...]
##$TP07= 0
##$TPNAME0= <>
##$TPNAME1= <>
##$TPNAME2= <>
##$TPNAME3= <>
##$TPNAME4= <>
##$TPNAME5= <>
##$TPNAME6= <>
##$TPNAME7= <>
##$TPOAL= (0..7)
0.5 0.5 0.5 0.5 0.5 0.5 0.5 0.5
##$TPOFFS= (0..7)
0 0 0 0 0 0 0 0
##$TUNHIN= 0
##$TUNHOUT= 0
##$TUNXOUT= 0
##$USERA1= <user>
##$USERA2= <user>
##$USERA3= <user>
##$USERA4= <user>
##$USERA5= <user>
##$V9= 5
##$VALIST= <valist>
##$VCLIST= <CCCCCCCCCCCCCCC>
##$VD= 0
##$VDLIST= <DDDDDDDDDDDDDDD>
##$VPLIST= <PPPPPPPPPPPPPPP>
##$VTLIST= <TTTTTTTTTTTTTTT>
##$WBST= 2048
##$WBSW= 25
##$XGAIN= (0..3)
0 0 0 0
##$XL= 0
##$YL= 0
##$YMAX_a= 11986610
##$YMIN_a= -8576757
##$ZGOPTNS= <>
##$ZL1= 120
##$ZL2= 120
##$ZL3= 120
##$ZL4= 120
##$ABSF1= 14.96064
##$ABSF2= -5.597542
##$ABSG= 5
##$ABSL= 3
##$ALPHA= 0
##$AQORDER= 0
##$ASSFAC= 0
##$ASSFACI= 0
##$ASSFACX= 0
##$ASSWID= 0
##$AUNMP= <proc_prof1d_extract.lims>
##$AXLEFT= 0
##$AXNAME= <>
##$AXNUC= <1H>
##$AXRIGHT= 0
##$AXTYPE= 0
##$AXUNIT= <>
##$AZFE= 0.1
##$AZFW= 0.1
##$BCFW= 0
##$BC_mod= 0
##$BYTORDP= 0
##$COROFFS= 0
##$CY= 15
##$DATMOD= 1
##$DC= 0
##$DFILT= <>
##$DTYPP= 0
##$F1P= 0
##$F2P= 0
##$FCOR= 0.5
##$FTSIZE= 131072
##$FT_mod= 6
##$GAMMA= 0
##$GB= 0
##$INTBC= 1
##$INTSCL= 1
##$ISEN= 128
##$LB= 0.3
##$LEV0= 0
##$LPBIN= 0
##$MAXI= 10000
##$MC2= 0
##$MEAN= 0
##$ME_mod= 0
##$MI= 0
##$NCOEF= 0
##$NC_proc= -2
##$NLEV= 6
##$NOISF1= 0
##$NOISF2= 0
##$NSP= 0
##$NTH_PI= 0
##$NZP= 0
##$OFFSET= 14.96064
##$PC= 1
##$PHC0= 4.790039
##$PHC1= 0
##$PH_mod= 1
##$PKNL= yes
##$PPARMOD= 0
##$PPDIAG= 0
##$PPIPTYP= 0
##$PPMPNUM= 2147483647
##$PPRESOL= 1
##$PSCAL= 4
##$PSIGN= 0
##$PYNMP= <proc.py>
##$REVERSE= no
##$SF= 400.020009779864
##$SI= 131072
##$SIGF1= 0
##$SIGF2= 0
##$SINO= 400
##$SIOLD= 131072
##$SPECTYP= <>
##$SREGLST= <1H.CDCl3>
##$SSB= 0
##$STSI= 131072
##$STSR= 0
##$SW_p= 8223.68421052631
##$SYMM= 0
##$S_DEV= 0
##$TDeff= 65536
##$TDoff= 0
##$TI= <>
##$TILT= no
##$TM1= 0
##$TM2= 0
##$TOPLEV= 0
##$USERP1= <user>
##$USERP2= <user>
##$USERP3= <user>
##$USERP4= <user>
##$USERP5= <user>
##$WDW= 1
##$XDIM= 131072
##$YMAX_p= 305095041
##$YMIN_p= -11543
##$CURPLOT= <Network HP LaserJet P1505>
##$CURPRIN= <$Network HP LaserJet P1505>
##$DFORMAT= <normdp>
##$LAYOUT= <+/1D_H.xwp>
##$LFORMAT= <normlp>
##$PFORMAT= <normpl>
##$SURQMSG= 1
$$ End of Bruker specific parameters
$$ ---------------------------------
##NTUPLES= NMR SPECTRUM
##VAR_NAME=  FREQUENCY,     SPECTRUM/REAL,   SPECTRUM/IMAG
##SYMBOL=    X,             R,               I
##VAR_TYPE=  INDEPENDENT,   DEPENDENT,       DEPENDENT
##VAR_FORM=  AFFN,          ASDF,            ASDF
##VAR_DIM=   131072,        131072,          131072
##UNITS=     HZ,            ARBITRARY UNITS, ARBITRARY UNITS
##FACTOR=    0.0627417313425164, 1,          1
##FIRST=     8223.62146879497, 1935,         -56935
##LAST=      0,             2549,            -56655
##MIN=       0,             -11543,          0
##MAX=       8223.62146879497, 305095041,    0
$$ Real data points
##PAGE= N=1
##DATA TABLE= (X++(R..R)), XYDATA
$$ [...]
64045C09901N935N820N209N204N981O688O787O695O938P255P022O192N333M818
64031C95778M341L327J644k38j772k907l969m944n243m435k992j872j429j130
64017C74159m26N46J266J433J055K46p55j588k082k449k935l389l391k792j906
64002C56992j212r49r63q93m96J72R15J668K418L010L293L456L865M532N080N374
63986C86262N787O611P589Q358R008R747J0298J0217R719R628J0337J1370J2108
63973E07039J2579J3193J4047J4907J5681J6509J7357J7910J8073J8334J9287
63962F84916K0898K2501K3641K4652K6186K8348L0646L2806L5297L8837M3630
63951A012358M9232N5079O0992O7259P4411Q2815R2322J02259J11921J21004J29574
$$ y = [309901, 315836, 321656, 326865, 332069, 338050, 344738, 351525, 358220, 365158, 372413, 379435, 385627, 390960, 395778, 400119, 403446, 405090, 404852, 403080, 400173, 396204, 391260, 386017, 381582, 378590, 376718, 375289, 374159, 373733, 374279, 375545, 376978, 378033, 378279, 377524, 375936, 373854, 371405, 368470, 365081, 361690, 358898, 356992, 355780, 354831, 353868, 352975, 352479, 352651, 353566, 355234, 357652, 360662, 363955, 367411, 371276, 375808, 380888, 386262, 392049, 398660, 406249, 414607, 423615, 433362, 443660, 453877, 463596, 473224, 483561, 494931, 507039, 519618, 532811, 546858, 561765, 577446, 593955, 611312, 629222, 647295, 665629, 684916, 705814, 728315, 751956, 776608, 802794, 831142, 861788, 894594, 929891, 968728, 1012358, 1061590, 1116669, 1177661, 1244920, 1319331, 1402146, 1494468, 1596727, 1708648, 1829652, 1959226]
63940A959226J37727J45323J51893J56690J58974J58423J55172J49309J40580
63931C313317J28627J13392R5066P4019N1071K7500M286j8574m1526o4294q5782
63920C597102j05028j21663j35364j45552j52027j55357j56209j54653j50607
63911B320642j44536j37168j28735j19083j08417r7446q6843p7102o8758o2106
63901A290448n6599n1219m5699m0820l7152l4095l0680k6901k3622k1457k0282
63890I01922j9726j9474j9074j8102j6721j5594j5036j4638j3899j2801j1518
63879G25339j0021q334o842n793m753l039o54J678L427M767O121P568Q829R625
63865G27918R928J0018J0307J0862J1164J0706R694Q786Q087O986N173L211J723
$$ y = [1959226, 2096953, 2242276, 2394169, 2550859, 2709833, 2868256, 3023428, 3172737, 3313317, 3441944, 3555336, 3650402, 3724421, 3775492, 3802992, 3807278, 3788704, 3747178, 3682884, 3597102, 3492074, 3370411, 3235047, 3089495, 2937468, 2782111, 2625902, 2471249, 2320642, 2176106, 2038938, 1910203, 1791120, 1682703, 1585257, 1498414, 1421312, 1352554, 1290448, 1233849, 1182630, 1136931, 1096111, 1058959, 1024864, 994184, 967283, 943661, 922204, 901922, 882196, 862722, 843648, 825546, 808825, 793231, 778195, 763557, 749658, 736857, 725339, 715318, 706984, 700142, 694349, 689596, 686557, 685903, 687581, 691008, 695775, 701896, 709464, 718293, 727918, 737846, 747864, 758171, 769033, 780197, 790903, 800597, 809383, 817470, 824456, 829629, 832840, 834563]
63852H34563N31q68k434l832n299p429j0085j2312j3517j4167j4988j6086j7145
63839G16932j8106j9083j9905k0281k0237k0091k0012j9898j9592j8928j7810
63828E02989j6529j5717j5585j5406j4359j2717j1500j0939j0144q609p213p023
63816C57248p724q023p358o372n711n255m714m291m299m526m415l705k700j997
63802B86158k051k720l249l038k461k439l058l331k633j671j379j483j166o86
63788B54793j136k588l629l201j920j045r49j241j757k500l038k851k176j745
63774B25017j708j558j123r02j179j465j150l34M06P04N86K03k56n81o84o49n00
63757B14827j67J98J60m08r56q58k11L21M06L07K60J42o4R5R81K121K495J673
$$ y = [834563, 835094, 834226, 831792, 827960, 822661, 815232, 805147, 792835, 779318, 765151, 750163, 734077, 716932, 698826, 679743, 659838, 639557, 619320, 599229, 579217, 559319, 539727, 520799, 502989, 486460, 470743, 455158, 439752, 425393, 412676, 401176, 390237, 380093, 371484, 364271, 357248, 349524, 341501, 334143, 327771, 322060, 316805, 312091, 307800, 303501, 298975, 294560, 290855, 288155, 286158, 284107, 281387, 278138, 275100, 272639, 270200, 267142, 263811, 261178, 259507, 258128, 256645, 255479, 254793, 253657, 251069, 247440, 244239, 242319, 241274, 240325, 239084, 237327, 234827, 231789, 228938, 226762, 225017, 223309, 221751, 220628, 219726, 218547, 217082, 215932, 215598, 216004, 216708, 217294, 217497, 217241, 216660, 215976, 215327, 214827, 214660, 214858, 215018, 214610, 213654, 212796, 212585, 212906, 213312, 213619, 213879, 214021, 213957, 214052, 215033, 217154, 219649, 221322]
63739B21322L91j93L71J512K295K245J572Q74O73J061J664J972J825J569J666
63724B40819K195K805L085K912K493K171K200K452K416J696N78q0J91Q18P67k40
63708B67278j401j829j585j449j747j868j108K68J200R93J5q43j078p43l9Q57
63692B56921J681K124K166K062J933J629J080O37Q21J746K946L691L519K602J651
63677B87209J266J321J114K57q23j425j392j116q44l85M50J411K024K058J652
63662B92777J044L43m33j213j826k111k087j951j913k013k121k102j924j708j635
63647B71127j722j654j021J40J189J498J172R26J259J970K570K886L061L147K990
63632B89538K607K380K737L645M581N072N185N363N840O400O792P172P901Q965
$$ y = [221322, 221713, 221520, 221891, 223403, 225698, 227943, 229515, 230389, 231062, 232123, 233787, 235759, 237584, 239153, 240819, 243014, 245819, 248904, 251816, 254309, 256480, 258680, 261132, 263548, 265244, 265822, 265742, 265933, 266751, 267518, 267278, 265877, 264048, 262463, 261014, 259267, 257399, 256291, 256559, 257759, 258752, 258767, 257924, 256846, 256103, 256064, 256921, 258602, 260726, 262892, 264954, 266887, 268516, 269596, 270233, 271054, 272800, 275746, 279437, 282956, 285558, 287209, 288475, 289796, 290910, 291167, 290344, 288919, 287527, 286411, 285567, 285182, 285632, 287043, 289067, 291125, 292777, 293821, 294164, 293731, 292518, 290692, 288581, 286494, 284543, 282630, 280617, 278496, 276394, 274470, 272762, 271127, 269405, 267751, 266730, 266870, 268059, 269557, 270729, 271655, 272914, 274884, 277454, 280340, 283401, 286548, 289538, 292145, 294525, 297262, 300907, 305488, 310560, 315745, 321108, 326948, 333348, 340140, 347312, 355213, 364178]
63618C64178R863J0218J0274J0613J1470J2562J3602J4731J6198J7752J8740J8929
63606E29130J8962J9661K0978K1915K1561J9867J7368J4472J1236P654L879K95
63594G06978k585m402n292n753o112o393o812p926r861j1836j3062j3782j4814
63581E98348j6151j6904j6637j5886j5054j3664j1280q587o707n784m977l753
63569D62964k488j646j041j68J053K231L025L518M090N057O430P910R109R779
63555E09823R968J0010J0295J0911J1612J2298J3361J5199J7487J9401K0646K1677
63543F82688K2823K3684K3708K2731K0542J6561J0701M186j326n253q122j0254
63531H02669j1321j1215j0552j0030r841r948j0454j1488j3075j5212j7707j9974
$$ y = [364178, 374041, 384259, 394533, 405146, 416616, 429178, 442780, 457511, 473709, 491461, 510201, 529130, 548092, 567753, 588731, 610646, 632207, 652074, 669442, 683914, 695150, 702804, 706683, 706978, 704393, 699991, 694699, 688946, 682834, 676441, 669629, 661703, 651842, 640006, 626944, 613162, 598348, 582197, 565293, 548656, 532770, 517716, 504052, 492772, 484185, 477478, 471694, 466717, 462964, 460476, 458830, 457789, 457621, 458674, 460905, 463930, 467448, 471538, 476595, 483025, 490935, 500044, 509823, 519791, 529801, 540096, 551007, 562619, 574917, 588278, 603477, 620964, 640365, 661011, 682688, 705511, 729195, 752903, 775634, 796176, 812737, 823438, 827624, 826298, 821045, 812923, 802669, 791348, 780133, 769581, 759551, 749710, 739762, 729308, 717820, 704745, 689533, 671826, 651852]
63519F51852k1459k2287k2910k3098k2122k0068j8136j7133j6469j5212j3435
63508D39523j1800j0389q907p679p425q094q682q362p152n487l755k374j715j739
63494C45963k022k270k396k182j377k94K89Q5k92j65L76Q17J014J207J492J695
63478C41940J732J702J710J760J856J961J990J951J940J812J052n54k205k612
63464C56035j455K3K68r06k196k322j244J58J168J699J920J962J967K081K198
63449C61356K058J752J877K852M262N258N552N683O220P073P803Q399R291J0712
63435D40148J2284J3482J4266J5134J6517J8324J9995K0830K0269J8205J5212
63424F24666J2245R918Q184O947O619P649R692J1892J3968J6401J9320K1914K3303
$$ y = [651852, 630393, 608106, 585196, 562098, 539976, 519908, 501772, 484639, 468170, 452958, 439523, 427723, 417334, 408427, 400748, 393323, 385229, 376547, 368185, 361033, 355546, 351791, 349417, 347702, 345963, 343941, 341671, 339275, 337093, 335716, 335422, 335711, 335796, 335504, 335339, 335715, 336532, 337546, 338753, 340245, 341940, 343672, 345374, 347084, 348844, 350700, 352661, 354651, 356602, 358542, 360354, 361406, 360852, 358647, 356035, 354580, 354603, 354871, 353965, 351769, 349447, 348203, 348361, 349529, 351228, 353148, 355110, 357077, 359158, 361356, 363414, 365166, 367043, 369895, 374157, 379415, 384967, 390650, 396870, 403943, 411746, 420145, 429436, 440148, 452432, 465914, 480180, 495314, 511831, 530155, 550150, 570980, 591249, 609454, 624666, 636911, 646829, 655013, 661960, 668579, 676228, 685920, 697812, 711780, 728181, 747501, 769415, 792718]
63411G92718K3468K2797K1206J8360J4443J0068N547R97l023n765p300q547j0015
63398H74954j1189j1567j1705j2642j4611j6955j9133k1175k3055k4225k4151
63387F84546k3025k1554k0139j8591j6686j4614j2679j0896r174p708o703n862
63375E16915m724l417k427j504K64K882M968N650O046P704J0112J1325J0925J0794
63361E75513J2446J5048J6879J7673J8448J9786K1351K2720K3740K4153K3703
63350G91460K2545K0969J8897J6135J2866R307N207M40m155p413r330j0935j2571
63337H53422j3335j2688j1756j2173j4109j6287j7791j8994k0561k2207k2954
63326F70567k2390k1120j9896j8742j7157j4971j2559j0218p850n399l355k448
$$ y = [792718, 816186, 838983, 860189, 878549, 892992, 903060, 908607, 909604, 906581, 900816, 893516, 884969, 874954, 863765, 852198, 840493, 827851, 813240, 796285, 777152, 755977, 732922, 708697, 684546, 661521, 639967, 619828, 601237, 584551, 569937, 557258, 546362, 537188, 529480, 522777, 516915, 512191, 508774, 506347, 504843, 505107, 507989, 512957, 518607, 524653, 532357, 542469, 553794, 564719, 575513, 587959, 603007, 619886, 637559, 656007, 675793, 697144, 719864, 743604, 767757, 791460, 814005, 834974, 853871, 870006, 882872, 892179, 897386, 897826, 893671, 886258, 876928, 865993, 853422, 840087, 827399, 815643, 803470, 789361, 773074, 755283, 736289, 715728, 693521, 670567, 648177, 627057, 607161, 588419, 571262, 556291, 543732, 533514, 525664, 520265, 516910, 514462]
63314E14462l024m915p624j0406j2408j3159j2897j2116j1000r597q225p231o485
63301C95375n694n065n058n474n469m637l508k631j855r30k68m66j322j933j787
63286C49278j263j028j305j842k322k595k584k137j145R3Q37N79k24n54p3M56
63270C34171K50m06o27r4P36J419J894K128J988J637J524J858K459L221M272N465
63254C61895O219O219N883N761N797N664N545N998P050Q019Q378Q363Q577R305
63240D58673J0405J1581J2567J3281J4025J5305J7196J9073K0271K0807K1172
63229F34356K1464K1246K0317J9241J8796J9093J9495J9363J8710J8055J7791
63218H47927J7796J7653J7182J6599J6080J5287J3549J0489O313J457l737q907
$$ y = [514462, 511438, 506523, 498899, 488493, 476085, 462926, 450029, 437913, 426913, 417316, 409091, 401860, 395375, 389681, 384616, 379558, 374084, 368615, 363978, 360470, 357839, 355984, 355054, 354786, 354320, 352998, 351065, 349278, 348015, 346987, 345682, 343840, 341518, 338923, 336339, 334202, 333057, 333150, 333987, 334566, 334342, 333788, 333715, 334171, 334421, 334015, 333388, 333294, 334030, 335449, 337343, 339471, 341459, 343096, 344620, 346478, 348937, 352158, 356430, 361895, 368114, 374333, 380216, 385977, 391774, 397438, 402983, 408981, 416031, 424050, 432428, 440791, 449368, 458673, 469078, 480659, 493226, 506507, 520532, 535837, 553033, 572106, 592377, 613184, 634356, 655820, 677066, 697383, 716624, 735420, 754513, 774008, 793371, 812081, 830136, 847927, 865723, 883376, 900558, 917157, 933237, 948524, 962073, 972562, 978875, 980332, 976595, 967688]
63206I67688j3539j7351k0619k3779k6598k8258k8428k7851k7438k7044k5671
63195G01112k2930j9686j6966j4778j2510j0105q137o815n631m171k648j400l64
63182E74971N59J161J431J857K679L237K846J963J700K257K762K676K392K227
63168F04718J773P12m76j242j767k475l270l913m675n903p327q462r372j0325
63154E47996j0997j0901j0379j0287j0625j0445r226p564o243n325m530l837l303
63141D44334k766k187j846j822j661j020k78k3k52n19o41p09n60K10J605K997
63125D34862L690L535K979K688L038L768M231M186M256N176O648P366O475M652
63111D97550L345L153L442L526L621M189M827M601L495K696L016L728L603K677
$$ y = [967688, 954149, 936798, 916179, 892400, 865802, 837544, 809116, 781265, 753827, 726783, 701112, 678182, 658496, 641530, 626752, 614242, 604137, 596000, 589185, 583554, 579383, 576735, 575335, 574971, 575530, 576691, 578122, 579979, 582658, 585895, 588741, 590704, 592404, 594661, 597423, 600099, 602491, 604718, 606491, 607203, 606727, 605485, 603718, 601243, 597973, 594060, 589385, 583482, 576155, 567693, 558321, 547996, 536999, 526098, 515719, 505432, 494807, 484362, 475136, 467572, 461329, 456004, 451474, 447637, 444334, 441568, 439381, 437535, 435713, 434052, 433032, 432754, 432731, 432479, 431960, 431319, 430610, 430050, 430260, 431865, 434862, 438552, 442087, 445066, 447754, 450792, 454560, 458791, 462977, 467233, 472409, 479057, 486423, 492898, 497550, 500895, 504048, 507490, 511016, 514637, 518826, 523653, 528254, 531749, 534445, 537461, 541189, 544792, 547469]
63097E47469K112K498L180L444L447L580L706L591L538L920M391M338L853L639
63083E96706L980M465M748M967N326N734O141O765P713Q652R184R344R511R982
63069F93218J0816J1956J3246J4435J5335J6044J6865J8054J9696K1720K3908
63058H75293K5949K7710K9449L1601L4269L7030L9364M1183M2756M4250M5566
63047A274420M6677M7774M8848M9392M8929M7740M6667M6141M5837M5348M4775
63036A792548M4327M3757M2594M0803L8714L6325L3057K8256K1734J3749M720
63025B140584m909j4749k4510l4017m3043n1196n7942o2769o5442o6155o5318
63014A650534o3175n9849n5751n1616m7792m3837l9200l4095k9227k4832k0623
$$ y = [547469, 549581, 552079, 555259, 558703, 562150, 565730, 569436, 573027, 576565, 580485, 584876, 589214, 593067, 596706, 600686, 605151, 609899, 614866, 620192, 625926, 632067, 638832, 646545, 655197, 664381, 673725, 683236, 693218, 704034, 715990, 729236, 743671, 759006, 775050, 791915, 809969, 829665, 851385, 875293, 901242, 928952, 958401, 990002, 1024271, 1061301, 1100665, 1141848, 1184604, 1228854, 1274420, 1321097, 1368871, 1417719, 1467111, 1516040, 1563780, 1610447, 1656588, 1702425, 1747773, 1792548, 1836875, 1880632, 1923226, 1964029, 2002743, 2039068, 2072125, 2100381, 2122115, 2135864, 2140584, 2135675, 2120926, 2096416, 2062399, 2019356, 1968160, 1910218, 1847449, 1782007, 1715852, 1650534, 1587359, 1527510, 1471759, 1420143, 1372351, 1328514, 1289314, 1255219, 1225992, 1201160, 1180537]
63003A180537j6633j3388j0997q737o023l294j415n32m8M62R46J352J792K110
62989A126132J866J024K24J7Q0m68k049m186o090p496q858j0794j3385j6064j8222
62974A041731j9797k1088k2103k2481k2090k1352k0701k0007j8920j7488j6065
62963H19639j4659j2940j0962r459r058r435r584q859p620o782o935p873q896
62950F96577r465r549r440r381r419r459r307q766p911p168o872o847o727o557
62936E79709o624o753o375n431m578m192l769k834j864j653k070k296k046j720
62922E27504j462r28j56J86k37r35j417j884k577l045k697j738r38o98r06j449
62906E06623k300l174l616l497l023k388j823j757k405l194l224k379j447j030
$$ y = [1180537, 1163904, 1150516, 1139519, 1130782, 1124759, 1121465, 1120050, 1119518, 1119470, 1119932, 1120878, 1122230, 1124022, 1126132, 1127998, 1129022, 1129246, 1129263, 1129343, 1128875, 1126826, 1122640, 1116550, 1109054, 1100196, 1089402, 1076017, 1059953, 1041731, 1021934, 1000846, 978743, 956262, 934172, 912820, 892119, 872112, 853192, 835704, 819639, 804980, 792040, 781078, 771619, 762561, 753126, 743542, 734683, 727063, 720281, 713346, 705473, 696577, 687112, 677563, 668123, 658742, 649323, 639864, 630557, 621791, 613880, 606712, 599840, 592993, 586266, 579709, 573085, 566332, 559957, 554526, 549948, 545756, 541987, 539153, 537289, 535636, 533566, 531270, 529224, 527504, 526042, 525114, 524958, 525144, 524907, 523972, 522555, 520671, 518094, 515049, 512352, 510614, 509676, 508978, 508072, 506623, 504323, 501149, 497533, 494036, 491013, 488625, 486802, 485045, 482640, 479446, 476222, 473843, 472396, 471366]
62892D71366q89o53n22q18j268j308q45k12M31J129J599J342M40k93k56K22L93
62875D69858O5l37m62l62j95j7R0Ok48o05j190k059k712k407j220j86k9k82k05
62856D57503K9j52m26R7J299J920J296L13Q6N44R70J193J411J327M68q03j441
62839D65634r68Q2J002J520J599J225O21K31K24M33Q16J515K330K650K215J577
62823D82706J508K190L222M089M405M056L415L249L958N100N913O224O533P260
62809E43828Q255R024R262R056Q753Q681Q937R447J0162J1092J2102J2930J3507
62796F75036J4108J4964J5929J6767J7616J8845K0512K2391K4488K7091L0180
62785H97927L3310L6363L9948M4530M9489N3708N7047O0464O4500O8388P1136
$$ y = [471366, 470477, 469824, 469302, 468484, 467216, 465908, 465063, 464851, 465282, 466411, 468010, 469352, 469792, 469499, 469243, 469465, 469858, 469923, 469586, 469124, 468762, 468567, 468550, 468640, 468646, 468398, 467793, 466603, 464544, 461832, 459425, 458205, 458019, 457990, 457708, 457503, 457532, 457380, 456954, 457051, 458350, 460270, 461566, 461879, 461965, 462509, 463479, 464672, 466083, 467410, 467878, 467075, 465634, 464666, 464748, 465750, 467270, 468869, 470094, 470715, 470946, 471170, 471603, 472419, 473934, 476264, 478914, 481129, 482706, 484214, 486404, 489626, 493715, 498120, 502176, 505591, 508840, 512798, 517898, 523811, 530035, 536568, 543828, 552083, 561107, 570369, 579425, 588178, 596859, 605796, 615243, 625405, 636497, 648599, 661529, 675036, 689144, 704108, 720037, 736804, 754420, 773265, 793777, 816168, 840656, 867747, 897927, 931237, 967600, 1007548, 1052078, 1101567, 1155275, 1212322, 1272786, 1337286, 1405674, 1476810]
62774A476810P2789P3858P3902P1713O6944O0650N3794M5921L5867K3427R763
62763B065438l646j6062k7607l8672m9204n8434o5377o9750p2121p3127p2963
62752A518475p1813p0250o8541o6068o2113n7119n2437m8775m5586m2079l8244
62741H95450l4682l1833k9672k7778k5569k2807j9970j7832j6577j5713j4832
62730F38185j3896j2717j0903q687p113o805p019o531n171l797k962k333j451
62717E48800m99r1n42j470j920r73J357L917N390N589N490O044P328Q855J0283
62702E97558J1542J2665J3765J5065J6650J8319J9761K0811K1400K1475K1130
62691G90141K0643K0128J9262J7606J5102J2015Q447M316r4l987o863r206j1963
$$ y = [1476810, 1549599, 1623457, 1697359, 1769072, 1836016, 1896666, 1950460, 1996381, 2032248, 2055675, 2065438, 2061792, 2045730, 2018123, 1979451, 1930247, 1871813, 1806436, 1736686, 1664565, 1591438, 1518475, 1446662, 1376412, 1307871, 1241803, 1179690, 1122571, 1070134, 1021359, 975773, 933694, 895450, 860768, 828935, 799263, 771485, 745916, 723109, 703139, 685307, 668730, 653017, 638185, 624289, 611572, 600669, 591982, 584869, 578064, 571045, 564514, 559343, 555546, 552584, 550251, 548800, 548301, 548210, 547668, 546198, 544278, 543305, 544662, 548579, 553969, 559558, 565048, 571092, 578420, 587275, 597558, 609100, 621765, 635530, 650595, 667245, 685564, 705325, 726136, 747536, 769011, 790141, 810784, 830912, 850174, 867780, 882882, 894897, 903344, 907660, 907566, 903579, 896716, 887510, 875547]
62678H75547j5338j8601k1105k3022k4708k5828k5694k4359k2780k1738k1044
62667F31330k0081j8738j7436j6460j5641j4682j3450j1918j0198q640p620p048
62655D69418o318n036l669l088l478m031l951l413l158l357l414k976k479k397
62641D18653k426j953j052l63r9J67O80J113J200J246J552J811J517P48J41J49
62625D23084O94J428K028K312K306K256K364K633L066L745M520M908M725M556
62611D64625N095O186P087P666Q610J0206J1698J2285J2265J2633J3810J5423
62599E87589J7166J9190K1564K3944K6058K8089L0234L2194L3514L4215L4681
62588H88438L4877L4170L2016K8638K4669K0319J5109Q576J079o270j2543j7769
$$ y = [875547, 860209, 841608, 820503, 797481, 772773, 746945, 721251, 696892, 674112, 652374, 631330, 611249, 592511, 575075, 558615, 542974, 528292, 514842, 502924, 492726, 484086, 476466, 469418, 463100, 458064, 454395, 451307, 447829, 443798, 439847, 436434, 433276, 429919, 426505, 423529, 421050, 418653, 416227, 414274, 413222, 412859, 412760, 412927, 413607, 414720, 415920, 417166, 418718, 420529, 422046, 422794, 422935, 423084, 423778, 425206, 427234, 429546, 431852, 434108, 436472, 439105, 442171, 445916, 450436, 455344, 460069, 464625, 469720, 475906, 482993, 490659, 499269, 509475, 521173, 533458, 545723, 558356, 572166, 587589, 604755, 623945, 645509, 669453, 695511, 723600, 753834, 786028, 819542, 853757, 888438, 923315, 957485, 989501, 1018139, 1042808, 1063127, 1078236, 1086812, 1087891, 1081621, 1069078, 1051309]
62576A051309k2628k7368l1327l3649l4318l4143l3806l3296l2298l0807k9081
62565G08588k7298k5476k3603k1609j9340j6815j4438j2720j1765j1216j0658
62554E13650r943r111q193p098n662l956k593k354l261m263m225l144j947j221
62540D46679p47k48Jk79p30p93n31n47j129j851k067j580o69K66R73J360J533
62523D39641J807K542L748M984N837O447P269Q373R368J0125J1106J2593J4075
62510E37915J4909J5209J5559J5993J5995J5380J4424J3152J1290R052P178N815
62498F91871M155J638j111l099m139m580m382l256j474K54J695L213N052O988
62484F92825Q800J0586J2488J4455J6425J8438K0490K2395K3873K4679K4716K4108
$$ y = [1051309, 1028681, 1001313, 969986, 936337, 902019, 867876, 834070, 800774, 768476, 737669, 708588, 681290, 655814, 632211, 610602, 591262, 574447, 560009, 547289, 535524, 524308, 513650, 503707, 494596, 486403, 479305, 473643, 469687, 467094, 464740, 461479, 457216, 452991, 449847, 447900, 446679, 445932, 445684, 445685, 445406, 444676, 443883, 443352, 442805, 441676, 439825, 437758, 436178, 435509, 435775, 436748, 438108, 439641, 441448, 443990, 447738, 452722, 458559, 465006, 472275, 480648, 490016, 500141, 511247, 523840, 537915, 552824, 568033, 583592, 599585, 615580, 630960, 645384, 658536, 669826, 678878, 686056, 691871, 696026, 697664, 696553, 693454, 689315, 684735, 680353, 677097, 675623, 675877, 677572, 680785, 685837, 692825, 701625, 712211, 724699, 739154, 755579, 774017, 794507, 816902, 840775, 865454, 890170, 914278]
62472I14278K2957K0952J7565J2922Q111M188J035k394o832j2123j7628k2667
62460I40364k6590k8973k9950l0098k9875k9361k8465k7169k5596k3971k2384
62449F37932k0479j7734j4343j1373r553q337o764m875l414k426j145O38K156
62436E40283K866L173L529L665L293K847K762K541J334q21l033m644n754o717
62422E45324p693q638r323r396q826q176p955p803o894n198l749l434l949m316
62408D49974m084l638l443l449l294k848k320j914j564j105n55o3M38J203K172
62393D25510K710K274J224N68Q15J442J773J921K412L086L162K479J968K450L502
62378D57296M143M276M619N429O172O626P330Q533R520R706R687J0368J1525J2236
$$ y = [914278, 937235, 958187, 975752, 988674, 996785, 1000973, 1002008, 999614, 992782, 980659, 963031, 940364, 913774, 884801, 854851, 824753, 794878, 765517, 737052, 709883, 684287, 660316, 637932, 617453, 599719, 585376, 574003, 564450, 556113, 549349, 544474, 541060, 538634, 537489, 538127, 540283, 543149, 546322, 549851, 553516, 556809, 559656, 562418, 564959, 566293, 565472, 562439, 557795, 552041, 545324, 537631, 528993, 519670, 510274, 501448, 493272, 485317, 477514, 470620, 465422, 461673, 458239, 454290, 449974, 445890, 442252, 438809, 435360, 432066, 429218, 426898, 424984, 423420, 422315, 421760, 421697, 422135, 423338, 425510, 428220, 430494, 431718, 432286, 433101, 434543, 436316, 438237, 440649, 443735, 446897, 449376, 451344, 453794, 457296, 461439, 465715, 470334, 475763, 481935, 488561, 495891, 504424, 513944, 523650, 533337, 543705, 555230, 567466]
62364E67466J2519J3427J5413J7637J9216K0378K1898K4029K6521K9220L2079
62353G99803L4807L7023L8525L9128L8448L6188L2499K7760K2211J6105R917M036
62341A136450j566o998j1921j5810j8672k1099k3533k5766k7264k7817k7743k7483
62329I00778k6981k5571k2730j9029j5907j4149j3013j1332r184p766p707q276
62317G19133q604q921j0050j2043j3990j5096j5409j5401j5269j4823j3867j2482
62305E63178j1029r894r098q213o833n223m076l586l100k074r71o97j263j624
62291D95497r93K65J243J557J449J248J184J506K293L206L734L723L498L523M091
62276E27024N164O261O733O409N795N450N394N391N464N838O643Q021J0095J2408
$$ y = [567466, 579985, 593412, 608825, 626462, 645678, 666056, 687954, 711983, 738504, 767724, 799803, 834610, 871633, 910158, 949286, 987734, 1023922, 1056421, 1084181, 1106392, 1122497, 1132414, 1136450, 1134884, 1127886, 1115965, 1100155, 1081483, 1060384, 1036851, 1011085, 983821, 956004, 928261, 900778, 873797, 848226, 825496, 806467, 790560, 776411, 763398, 752066, 742882, 735116, 727409, 719133, 710529, 701608, 691558, 679515, 665525, 650429, 635020, 619619, 604350, 589527, 575660, 563178, 552149, 542255, 533157, 524944, 518111, 512888, 508812, 505226, 502126, 500052, 499081, 498384, 497121, 495497, 494504, 494769, 496012, 497569, 499018, 500266, 501450, 502956, 505249, 508455, 512189, 515912, 519410, 522933, 527024, 532188, 538449, 545182, 551591, 557386, 562836, 568230, 573621, 579085, 584923, 591566, 599587, 609682, 622090]
62262F22090J3947J4456J5199J7510K0866K3574K5216K7164L0375L3997L6677
62251H81071L8220L9148L9485L8834L7079L4158K9603K3198J5812Q891L170j619
62239A187050o062j0603j5453k0350k4633k7963l0777l3538l5876l7038l6850
62228I07907l5690l3806l1287k8460k5593k2450j8820j5254j2570j0744r082p366
62216F56785o045n299m765m310m219m467m551m370m489n243o109o439o195n669
62202E84615m977m242l825l864l924l492k606j658q81k76K22P93J681K818L770
62187E64154M290M650N217N949O582O994P146P074P095P672Q714R362Q920P672
62173F61491O503N956O114O988Q498J0242J1839J3452J5521J8125K0944K3680
$$ y = [622090, 636037, 650493, 665692, 683202, 704068, 727642, 752858, 780022, 810397, 844394, 881071, 919291, 958439, 997924, 1036758, 1073837, 1107995, 1137598, 1160796, 1176608, 1185499, 1188669, 1187050, 1180988, 1170385, 1154932, 1134582, 1109949, 1081986, 1051209, 1017671, 981795, 944757, 907907, 872217, 838411, 807124, 778664, 753071, 730621, 711801, 696547, 683977, 673233, 664151, 656785, 650740, 645441, 640676, 636366, 632147, 627680, 623129, 618759, 614270, 609027, 602918, 596479, 590284, 584615, 579638, 575396, 571571, 567707, 563783, 560291, 557685, 556027, 555146, 554870, 555092, 555885, 557566, 560384, 564154, 568444, 573094, 578311, 584260, 590842, 597836, 604982, 612056, 619151, 626823, 635537, 644899, 653819, 661491, 667994, 673950, 680064, 687052, 695550, 705792, 717631, 731083, 746604, 764729, 785673, 809353]
62161H09353K6040K7535K7882K7466K6745K5263K2065J7216J2093P785L947k42
62149A033148m619q313j1061j3429j5801j7926j9562k0904k2057k2593k2006k0368
62137H34509j8256j6164j4213j2261j0130p764n328l080j129M53J404J472R76
62124G50489O98R97J403J425J280J415J668J578J156O62j91j850l790m699m065
62109G48176k787j960j846k396l767n675o996o949o077n380m925m217l286k437
62095F89478j370K78J779K003J216R45J881L108L724M004M425M689M525M492N163
62080G30340O089O486O392O409O704P029P439Q175R116R920J0613J1375J2049
62067H38136J2389J2615J3070J3680J4310J5354J7174J9134K0070J9689J8656
$$ y = [809353, 835393, 862928, 890810, 918276, 945021, 970284, 992349, 1009565, 1021658, 1029443, 1033390, 1033148, 1028529, 1020216, 1009155, 995726, 979925, 961999, 942437, 921533, 899476, 876883, 854877, 834509, 816253, 800089, 785876, 773615, 763485, 755721, 750393, 747313, 746184, 746637, 748041, 749513, 750489, 751187, 752184, 753587, 755012, 756292, 757707, 759375, 760953, 762109, 762771, 762580, 760730, 756940, 752241, 748176, 745389, 743429, 741583, 739187, 735420, 729745, 722749, 715800, 709723, 704343, 699418, 695201, 691915, 689478, 688108, 688386, 690165, 692168, 693384, 694329, 696210, 699318, 703042, 707046, 711471, 716160, 720685, 725177, 730340, 736429, 742915, 749307, 755716, 762420, 769449, 776888, 785063, 794179, 804099, 814712, 826087, 838136, 850525, 863140, 876210, 889890, 904200, 919554, 936728, 955862, 975932, 995621, 1014277]
62056A014277J7232J4799J1008O560K345j627n802j0013j3509j5959j7930k0198
62044I81183k2794k5021k6385k7305k8562l0062l0741k9911k8153k6339k4325
62033F81585k1532j8498j6642j6307j6047j4464j1926r816q726q152p571o991
62021E24913o528o157n926n908n854n340m399l608l370l369l015k306j883k189
62007D65061k734k554j378J9Q23J155J608K170K312K020J917K184K199J632J139
61992D77573J356J805J668J096Q61R59N53o78k054k972l647m452n202n593n762
61977D55511n926n892n379m622m129l947l635k932k095j568j558j957k477k773
61963D06621k623k049j315p28m32l06j52J8m1l71n01O2J033J543J267R50J451
$$ y = [1014277, 1031509, 1046308, 1057316, 1063876, 1066221, 1064594, 1058792, 1048779, 1035270, 1019311, 1001381, 981183, 958389, 933368, 906983, 879678, 851116, 821054, 790313, 760402, 732249, 705910, 681585, 660053, 641555, 624913, 608606, 592559, 578095, 566169, 556353, 547627, 539475, 531904, 524913, 518385, 512228, 506302, 500394, 494540, 489200, 484801, 481193, 477823, 474454, 471439, 469133, 467250, 465061, 462327, 459773, 458395, 458414, 459237, 460392, 462000, 464170, 466482, 468502, 470419, 472603, 474802, 476434, 477573, 478929, 480734, 482402, 483498, 484359, 485318, 485871, 485193, 483139, 480167, 476520, 472068, 466866, 461273, 455511, 449585, 443693, 438314, 433692, 429563, 425616, 421981, 419049, 416954, 415386, 413828, 411871, 409394, 406621, 403998, 401949, 400634, 399906, 399474, 399168, 399016, 399034, 398993, 398622, 398121, 398183, 399216, 400759, 402026, 402976, 404427]
61946D04427K618L556L823L823M039M398M638M947N754O988P889P826P144O847
61932D78717P341P872P471O237N182M873M814M290L278K169J146K52l04m67o94
61917E32177j397k205k417k098k023k443k603j783k40J252K373L301M125M766
61903E30785N353O162P100P544O902N245L251J590L61p87j994k885l105l008l410
61888E59104m553n744o200n896n325m717l896k853k009j821k276k906l212l134
61874E04562l073l416l976m174l791l306l185l115k299n20J469K682K856K546
61860D83260K494K984L788M579N275N966O587O945P087P364P980Q706R267R832
61846E72114J0764J1959J2824J2927J2386J1504J0308Q622O455M094J843j67j865
$$ y = [404427, 407045, 410601, 414424, 418247, 422286, 426684, 431322, 436269, 442023, 449011, 456900, 464726, 471870, 478717, 486058, 493930, 501401, 507638, 512820, 517693, 522507, 526797, 530075, 532244, 533390, 533642, 533338, 532871, 532177, 530780, 528575, 526158, 524060, 522037, 519594, 516991, 515208, 514968, 516220, 518593, 521894, 526019, 530785, 536138, 542300, 549400, 556944, 563846, 569091, 572342, 573932, 574293, 573506, 571512, 568627, 565522, 562514, 559104, 554551, 548807, 542607, 536711, 531386, 526669, 522773, 519920, 517911, 516090, 513814, 510908, 507696, 504562, 501489, 498073, 494097, 489923, 486132, 482826, 479641, 476526, 474227, 473707, 475176, 477858, 480714, 483260, 485754, 488738, 492526, 497105, 502380, 508346, 514933, 521878, 528965, 536329, 544309, 553015, 562282, 572114, 582878, 594837, 607661, 620588, 632974, 644478, 654786, 663408, 669863, 673957, 675800, 675633, 673768]
61833F73768l086l660l703l674l941m371m519m249l799l161j819M91L044M649
61819F41970M876M338L695K829J253j019l360n237o772q456j0421j2149j3025
61806E98522j3074j2894j2815j2514j1671j0603r802r122q027o631n768n867o354
61793D73380o465o123n595m812l694k798k858l625l885k881j240j79j56o30r01
61778D27538p74m22n9J72J58r4l79m06n6M88Q93J012R97J046J056P52J71k26j01
61759D31766L30O71R26J334J757J745J317J124J548K066J932J216O65O71Q39N80
61743D50487l02j574k750l286k967k162j400p49m1L91r5j378k336k112j146m38
61727D28142j99J71R76J717J779J189N15K45M18P74J121J437J630J467J004P49
$$ y = [673768, 670682, 667022, 663319, 659645, 655704, 651333, 646814, 642565, 638766, 635605, 633786, 634277, 637321, 641970, 646846, 651184, 654879, 657708, 658961, 657942, 654582, 649345, 642573, 634117, 623696, 611547, 598522, 585448, 572554, 559739, 547225, 535554, 524951, 515149, 506027, 498000, 491369, 485601, 479734, 473380, 466915, 460792, 455197, 450385, 446691, 443893, 441035, 437410, 433525, 430644, 429404, 429225, 429069, 428439, 427538, 426764, 426342, 426283, 426455, 426613, 426519, 426140, 425734, 425678, 426166, 427059, 428071, 429068, 430114, 431170, 431922, 432093, 431867, 431766, 432096, 432767, 433693, 435027, 436784, 438529, 439846, 440970, 442518, 444584, 446516, 447732, 448397, 449068, 449907, 450487, 450185, 448611, 445861, 442575, 439608, 437446, 436046, 435297, 435256, 435647, 435552, 434174, 431838, 429726, 428580, 428142, 427943, 428114, 429090, 430807, 432586, 433775, 434290, 434535, 434953, 435727, 436848, 438285, 439915, 441382, 442386, 443135]
61711D43135R53R83J39j043j206j59O63K00p86j121j080j648k593k749j993j531
61695D30164k050k853l115k928k620k007r96j76j45o74j075j038p44n13p15j574
61679D06941k709l273k854j915j109n85k71k95o88j073j110r77j071j435j818
61664C85758j997j799j191n99o53j290j561q21L66J025J052J017J050P60J54j20
61648C81151L39J133J589J497J117Q12P83J029J371J561J406Q39%o87q31n32l14
61631C92263n01q81j168j388j660j873j877j711j421j002p18j025j882k558k573
61616C70025k336k395k562k361j950j850k089k329k548k865k893k246j529j828
61602C38244l053l861l502k820k894l469l506k729j875j647k070k750l226l076
$$ y = [443135, 444088, 445071, 445210, 444167, 442961, 442802, 443465, 443665, 442879, 441758, 440678, 439030, 436437, 433688, 431695, 430164, 428114, 425261, 422146, 419218, 416598, 414591, 413595, 413419, 413274, 412600, 411525, 410487, 409743, 409230, 408515, 406941, 404232, 400959, 398105, 396190, 395081, 394496, 394225, 393930, 393242, 392169, 391059, 390082, 389011, 387576, 385758, 383761, 381962, 380771, 380172, 379519, 378229, 376668, 375847, 376213, 377238, 378290, 379307, 380357, 381117, 381271, 381151, 381490, 382623, 384212, 385709, 386826, 387638, 388421, 389450, 390821, 392382, 393788, 394627, 394627, 393940, 393109, 392577, 392263, 391762, 390881, 389713, 388325, 386665, 384792, 382915, 381204, 379783, 378781, 378063, 377038, 375156, 372598, 370025, 367689, 365294, 362732, 360371, 358421, 356571, 354482, 352153, 349605, 346740, 343847, 341601, 340072, 338244, 335191, 331330, 327828, 325008, 322114, 318645, 315139, 312410, 310535, 308888, 306818, 304068, 300842, 297766]
61588B97766k238j289j046j695k486k496j569m16J81P5l85r42j613k244k340j646
61572B75617o47j49m52j173j763j838j206j2J130J542J142M26j25l74l32m1L40
61555B72085O37Q98J190J272Q36O3n02n97l66R1P45J200Q89n8p14m60L09Q19P98
61536B79135L97k03p09p18k41Q1j81n82m62L3K00j72n88o15l03J63O43Q34M58
61517B77170k19n48l01Qj03n03q23j011j112q93j82N94P74L57N2K91O85O48K38
61498B75122p4j56l76r82j752k253k198j525m07O60J162J096R60J052J133R46
61482B72408P00O78O55K49l35m72j0N89J024J510K157K508K135J295N84K11L8
61465B85924J11N96J178J115J82q08q11K32J315J488P53j76p16p88n28n3M62P45
$$ y = [297766, 295528, 294239, 293193, 291498, 289012, 286516, 284947, 284531, 284712, 284787, 284402, 283460, 281847, 279603, 277263, 275617, 274970, 274821, 274369, 273196, 271433, 269595, 268389, 268377, 269507, 271049, 272191, 272617, 272492, 272118, 271786, 271745, 272085, 272722, 273620, 274810, 276082, 276918, 276981, 276479, 275882, 275516, 275607, 276352, 277552, 278441, 278383, 277669, 277209, 277518, 278337, 279135, 279532, 279329, 278620, 277902, 277661, 277742, 277561, 276979, 276517, 276550, 276750, 276578, 275990, 275375, 275072, 275235, 275878, 276712, 277170, 276951, 276403, 276102, 276110, 276007, 275504, 274681, 273670, 272558, 271665, 271483, 272077, 272851, 273208, 273260, 273551, 274236, 274884, 275122, 275048, 274892, 274516, 273534, 271782, 269529, 267331, 265806, 265399, 266059, 267221, 268317, 269277, 270329, 271462, 272408, 273108, 273786, 274441, 274690, 274355, 273883, 273873, 274462, 275486, 276996, 279153, 281661, 283796, 285091, 285675, 285886, 285924, 286035, 286631, 287809, 288924, 289106, 288298, 287487, 287719, 289034, 290522, 291275, 291099, 290383, 289595, 289067, 289014, 289476, 290221]
61447B90221O70L83J59J40K86M37L86P5k41j74L23Q55J078J093J212J459J618
61430B99980J566J393J193R98R23J196J933K888L460L137K117J274J186J315O90
61415C25249o43j553j358o50j78K73J184K173K461K160K013K054J465m7j630k289
61399C30684j990j444j289j584j824j419m47K48J52p0M37J247J205L07j43M68
61383C24538J122P77j15m29N9P33J205J501J585J372J041Q00O14N55R60J793K260
61366C40371J746P46K38M40Q17J030J204J392J468J484J608J738J683J651K015
61351C59631K667L166L469L988M804N423N433N043M690M516M325L893L151K278
61337D16477J616J365J324J216J141J448K110K569K357J691J204J209J374J214
$$ y = [290221, 290891, 291274, 291433, 291573, 291859, 292296, 292682, 292757, 292516, 292342, 292665, 293520, 294598, 295691, 296903, 298362, 299980, 301546, 302939, 304132, 305130, 306053, 307249, 309182, 312070, 315530, 318667, 320784, 322058, 323244, 324559, 325249, 324606, 323053, 321695, 321045, 320867, 321140, 322324, 324497, 326958, 329118, 331131, 333185, 334650, 334603, 332973, 330684, 328694, 327250, 325961, 324377, 322553, 321134, 320687, 320935, 321087, 321017, 321454, 322701, 323906, 324213, 324070, 324538, 325660, 326437, 326322, 325893, 325952, 326685, 327890, 329391, 330976, 332348, 333389, 334189, 334803, 335358, 336318, 338111, 340371, 342117, 342863, 343101, 343541, 344358, 345388, 346592, 347984, 349452, 350936, 352544, 354282, 355965, 357616, 359631, 362298, 365464, 368933, 372921, 377725, 383148, 388581, 393624, 398314, 402830, 407155, 411048, 414199, 416477, 418093, 419458, 420782, 421998, 423139, 424587, 426697, 429266, 431623, 433314, 434518, 435727, 437101, 438315]
61323D38315P31M25O20J068J420J815K609L617M161L966L480L212L283L805N056
61308D77583O864Q333Q741Q410Q229Q628R404J0167J0480R928Q590P181O211N272
61294E94021L698J603l90k169m064n873o900p025p035p545q253q561q402q088
61280E25017p649o798n432l925k855k464k373j934r68K8N75Q63J385K212K990
61265D98672L456L522L061K108J209J008J535K344L231M291N270N566M974L964
61251E44211K997K057J001k7o97p14R8J541K817L054K211J100L97Q7kK90J060
61234E61481J881K178J891J462J302J525K032K568K845K774K627K801L458M415
61220E95240N278N749N883O001O261O414O174N732N639O161P002P551P299O162
$$ y = [438315, 439046, 439471, 440091, 441159, 442579, 444394, 447003, 450620, 454781, 458747, 462227, 465439, 468722, 472527, 477583, 484447, 492780, 501521, 509931, 518160, 526788, 536192, 546359, 556839, 566767, 575357, 582538, 588749, 594021, 597719, 599322, 598932, 596763, 592699, 586826, 579926, 572901, 565866, 558321, 550068, 541507, 533105, 525017, 517368, 510570, 505138, 501213, 498358, 495894, 493521, 491587, 490619, 490647, 491222, 492085, 493470, 495682, 498672, 502128, 505650, 508711, 510819, 512028, 513036, 514571, 516915, 520146, 524437, 529707, 535273, 540247, 544211, 547208, 549265, 550266, 550239, 549542, 548828, 548926, 550467, 553284, 556338, 558549, 559649, 560046, 560133, 560131, 560421, 561481, 563362, 565540, 567431, 568893, 570195, 571720, 573752, 576320, 579165, 581939, 584566, 587367, 590825, 595240, 600518, 606267, 612150, 618151, 624412, 630826, 637000, 642732, 648371, 654532, 661534, 669085, 676384, 682546]
61206F82546M610L378K794K556K379K488L122L950M522M992N709O314O035M956
61192G40351M234M810O404P949Q483P617N728L786K544J710M75j201k478k893
61178G87519k941l209l702m338n297o399o899o460n792n774o396p073p489p606
61164G08144p263o502n879n835o033n914n592n563n823n961n967o202o575o523
61150F22512n867n057m399l606k398j086j94J73K08j16j007k308l388l784l742
61135E85941l825m041l759k608j103l8M94J018J822K688L451M231N070N777O346
61120F01464P043P963Q918R902J1151J2555J3631J4348J5407J7166J8817J9205
61108G57570J8269J7085J6657J7011J7423J7131J5875J4054J2330J1047J0062
$$ y = [682546, 687156, 690534, 693328, 695884, 698263, 700751, 703873, 707823, 712345, 717337, 723046, 729360, 735395, 740351, 744585, 749395, 755799, 763748, 772231, 779848, 785576, 789362, 791906, 793616, 794091, 792890, 790412, 787519, 784578, 781369, 777667, 773329, 768032, 761633, 754734, 748274, 742482, 736708, 730312, 723239, 715750, 708144, 700881, 694379, 688500, 682665, 676632, 670718, 665126, 659563, 653740, 647779, 641812, 635610, 629035, 622512, 616645, 611588, 607189, 603583, 601185, 600099, 599905, 600078, 600286, 600170, 599163, 596855, 593467, 589683, 585941, 582116, 578075, 574316, 571708, 570605, 570567, 571061, 572079, 573901, 576589, 580040, 584271, 589341, 595118, 601464, 608507, 616470, 625388, 635290, 646441, 658996, 672627, 686975, 702382, 719548, 738365, 757570, 775839, 792924, 809581, 826592, 844015, 861146, 877021, 891075, 903405, 914452, 924514]
61097I24514R031P559N236J993j464m159n854p173q596r965j1069j1953j2484
61084H75616j2431j2214j2692j3711j3938j2723j1125j0190r312p456n231m134
61072G50459m179l849k389p08K92R64K036L454M734N852P202Q943J0728J1948
61058G95487J2217J1880J1930J3085J5107J7354J9587K1765K3541K4738K5906
61047I92597K7589K9376L0577L1561L3219L5395L7078L8145L9626M2031M4661
61036A381855M6961M9293N1876N4081N5489N6695N8440O0628O2839O5019O7153
61025B010329O9009P0888P3881P8699Q4798R1221R7756J04849J13014J22790J34671
61014C051905J48717J64987J84632K09460K40131K76010L17306L65848M23119
$$ y = [924514, 933545, 941104, 946340, 948333, 946869, 942710, 936856, 929683, 921087, 911122, 900053, 888100, 875616, 863185, 850971, 838279, 824568, 810630, 797907, 786782, 776592, 767280, 759824, 754593, 750459, 746280, 742431, 740042, 739334, 739626, 740590, 742626, 746080, 750814, 756666, 763868, 772811, 783539, 795487, 807704, 819584, 831514, 844599, 859706, 877060, 896647, 918412, 941953, 966691, 992597, 1020186, 1049562, 1080139, 1111700, 1144919, 1180314, 1217392, 1255537, 1295163, 1337194, 1381855, 1428816, 1478109, 1529985, 1584066, 1639555, 1696250, 1754690, 1815318, 1878157, 1943176, 2010329, 2079338, 2150226, 2224107, 2302806, 2387604, 2478825, 2576581, 2681430, 2794444, 2917234, 3051905, 3200622, 3365609, 3550241, 3759701, 3999832, 4275842, 4593148, 4958996, 5382115]
61005E382115M89466N66093O55157P55798Q62676R70367J073113J151098J159184
60996A3065067J045983P99918M76988J73000l7616j36445j43686q5880N910P6342
60986A5239581N1859j12732l92153p02250r56153j110288j166005j144289j067872
60977H639698r58913q38504p21473o14150n18675m36937l69420l13681k66669
60968C601276k27389j95839j70799j50310j33404j19813j08631r8663q9581q1583
60958B225264p4305o7150o0332n4474m9366m4203l8958l4531l1461k9311k7466
60947A713707k5807k4356k2814k0732j7929j4676j1646r514q337p495o577n982
60935A537842o289p341q567r856j1475j3321j4929j6110j6964j7459j7675j8313
$$ y = [5382115, 5871581, 6437674, 7092831, 7848629, 8711305, 9681672, 10754785, 11905883, 13065067, 14111050, 14910968, 15387956, 15560956, 15523340, 15386895, 15243209, 15157329, 15163239, 15239581, 15291440, 15178708, 14786555, 14084305, 13128152, 12017864, 10851859, 9707570, 8639698, 7680785, 6842281, 6120808, 5506658, 4987983, 4551046, 4181626, 3867945, 3601276, 3373887, 3178048, 3007249, 2856939, 2723535, 2603722, 2495091, 2396428, 2306847, 2225264, 2150959, 2083809, 2023477, 1969003, 1919637, 1875434, 1836476, 1801945, 1770484, 1741173, 1713707, 1687900, 1663544, 1640730, 1619998, 1602069, 1587393, 1575747, 1566233, 1557896, 1550401, 1543824, 1537842, 1531553, 1524212, 1515645, 1505789, 1494314, 1480993, 1466064, 1449954, 1432990, 1415531, 1397856, 1379543]
60923A379543k0003k2160k3475k3658k3781k4565k5387k5474k5110k4911k4696
60912A116323k3924k2751k1768k1086k0489k0145k0222k0024j8584j6127j4011
60901H97192j2972j2316j1208r951r332r293r008q094p087o683o947p353p413
60888G79535p124o932p209p808q274q485q782r354r751r423q539p935q203r094
60874F62622r819r768q913p670o509n672n262n423o175o953o820n470l838l201
60860E71129l751m547m821m722m604m279l556l035l522m698n224m421l273l196
60846E13480m178m856m356l321k840k947k847k346k232l061m249m824m664m399
60832D62360m309m007l283k576k294k169j699r21k81j0j1k06n20o21j81M92O86
$$ y = [1379543, 1359540, 1337380, 1313905, 1290247, 1266466, 1241901, 1216514, 1191040, 1165930, 1141019, 1116323, 1092399, 1069648, 1047880, 1026794, 1006305, 986160, 965938, 945914, 927330, 911203, 897192, 884220, 871904, 860696, 850745, 841413, 832120, 823112, 815018, 807931, 801248, 794301, 786948, 779535, 772411, 765479, 758270, 750462, 742188, 733703, 724921, 715567, 705816, 696393, 687854, 679919, 671716, 662622, 652803, 643035, 634122, 626452, 619943, 614271, 609009, 603586, 597411, 590458, 583638, 578168, 574330, 571129, 567378, 562831, 558010, 553288, 548684, 544405, 540849, 537814, 534292, 529594, 524370, 519949, 516676, 513480, 509302, 504446, 500090, 496769, 493929, 490982, 488135, 485789, 483557, 480496, 476247, 471423, 466759, 462360, 458051, 454044, 450761, 448185, 445891, 443722, 442023, 441102, 440821, 440811, 440800, 440594, 440074, 439453, 439272, 439764, 440450]
60815D40450K01l79n53n97j066j884k421k265j573p93l57n44j243j882j949j586
60799D21559j337j343j249r41r31j630k571k813k072j142j031j945l185l980m190
60784C91199m125l929l437k644j932j613j541j490j576j927k154j820j278j332
60770C60401j935j966o86J196K371K314J400J85p77q64N0J102J270O29J62M04
60754C65256R35J258J390J414J179P93P77J402K209K567K395K015J642J292Q60
60739C87384Q5j209k695l644l763l501l375l373l359l521l961m283m125l775l733
60724C39152l873l626k859k035j542j367j371j376j103m34K11K82j98o34o31l16
60708C18280j5%m84j340j872j419k44P05R68R58J078J140R10O25O04P92J058J475
$$ y = [440450, 440651, 440272, 439719, 439122, 438056, 436172, 433751, 431486, 429913, 429120, 428763, 428219, 426976, 425094, 423145, 421559, 420222, 418879, 417630, 416689, 415758, 414128, 411557, 408744, 406672, 405530, 404499, 402554, 399369, 395389, 391199, 387074, 383145, 379708, 377064, 375132, 373519, 371978, 370488, 368912, 366985, 364831, 363011, 361733, 360401, 358466, 356500, 355814, 357010, 359381, 361695, 363095, 363280, 362503, 361639, 361689, 362791, 364061, 364690, 364852, 365256, 366191, 367449, 368839, 370253, 371432, 372225, 373002, 374404, 376613, 379180, 381575, 383590, 385232, 386524, 387384, 387469, 386260, 383565, 379921, 376158, 372657, 369282, 365909, 362550, 359029, 355068, 350785, 346660, 342885, 339152, 335279, 331653, 328794, 326759, 325217, 323850, 322479, 321103, 320000, 319566, 319777, 320059, 319861, 319227, 318596, 318280, 318265, 318265, 317781, 316441, 314569, 313150, 312906, 313611, 314579, 315537, 316615, 317755, 318665, 319290, 319894, 320686, 321744, 323219]
60690C23219J935J927J225M37L58R75J619J912K044K259K550K860L141L281L227
60675C52969L175L271L291L005K713K859L210L042K214J404J068P73J1r08j331
60660C80766j293j392j836k260k483k740l038k897k086j133n91k21N74J586J851
60645C62807R26l29o85M3Q32O77l59j362j676j610j897k654l131k678j644r40
60629C46320q94j055j050j042j129r42k81L72M98L18L04L17q8o34n36K38P72N24
60611C42012Q4J82O06O85L76K17M47P56Q38P51P28R21J240J308P81n6l80J69Q94
60592C52559R48M76K58M45M73J62J05P19J618K226K419K281J768J074Q12J282
60576C69625J987K335K490K954L622L998M167M802O166P733Q942R704R978R467
$$ y = [323219, 325154, 327081, 328306, 328743, 329101, 330076, 331695, 333607, 335651, 337910, 340460, 343320, 346461, 349742, 352969, 356144, 359415, 362706, 365711, 368424, 371283, 374493, 377535, 379749, 381153, 382221, 382994, 383005, 382097, 380766, 379473, 378081, 376245, 373985, 371502, 368762, 365724, 362827, 360741, 359608, 359017, 358796, 359370, 360956, 362807, 363733, 363404, 362719, 362762, 363594, 364271, 363912, 362550, 360874, 359264, 357367, 354713, 351582, 348904, 347260, 346320, 345426, 344371, 343321, 342279, 341150, 340208, 339927, 340299, 340797, 341115, 341419, 341736, 341648, 341014, 340478, 340716, 341488, 342012, 342096, 342278, 342884, 343569, 343945, 344162, 344609, 345365, 346203, 346954, 347682, 348603, 349843, 351151, 351932, 351876, 351496, 351665, 352559, 353507, 353983, 354241, 354686, 355159, 355321, 355426, 356145, 357763, 359989, 362408, 364689, 366457, 367531, 368343, 369625, 371612, 373947, 376437, 379391, 383013, 387011, 391178, 395980, 402146, 409879, 418821, 428525, 438503, 447970]
60562D47970Q080O255M415K506M09j530k860l557l798l420k219o65L19L84J55
60547D52444M55J475K833M114N170O093P127Q464J0104J1865J3470J4407J4007
60534E52028J2097R480P237N528L627J205j079k580l500m226m512m026l315l304
60520E64660l994m466m187l506k800j924p54L77J250K133L229M202M788N386O484
60505E70878P894R153J0464J2502J5312J8093K0256K2130K4298K6756K9017L0733
60493G97486L1752L1786L0468K7794K4141J9713J4168P037j562j0715j9227k6261
60481I26580l1518l5027l6953l7543l7011l5410l2835k9789k7062k5019k3141
60470E75272k0663j7580j4697j2692j1531j0807j0225r540q467p092o009n614
$$ y = [447970, 456050, 462305, 466720, 469226, 469635, 468105, 465245, 461688, 457890, 454470, 452251, 451586, 451905, 452289, 452444, 452899, 454374, 457207, 461321, 466491, 472584, 479711, 488175, 498279, 510144, 523614, 538021, 552028, 564125, 573605, 580842, 586370, 589997, 591202, 590123, 587543, 584043, 579817, 575305, 571279, 567964, 564660, 560666, 556200, 552013, 548507, 545707, 543783, 543029, 543406, 544656, 546789, 550018, 554220, 559008, 564394, 570878, 578772, 587925, 598389, 610891, 626203, 644296, 664552, 686682, 710980, 737736, 766753, 797486, 829238, 861024, 891492, 919286, 943427, 963140, 977308, 984345, 982783, 972068, 952841, 926580, 895062, 860035, 823082, 785539, 748528, 713118, 680283, 650494, 623432, 598413, 575272, 554609, 537029, 522332, 509640, 498109, 487302, 477077, 467537, 459070, 451978, 445969, 440355]
60458D40355n524n193m804m862n030m300k568j161j313k686l998m510m233l230
60444C86943j688m31l28j133j755j777j784k044j902r94j29j60p13q85p23j018
60428C69479j806k187j693r52o52n85j54N67Q87M41l26o15q0Q72J479J301N60
60411C66536j27k50K58J027J493J392J031R26J099J076P31N83R66J300Q20k64
60395C78597r51o99P6P89J381K058K754L081K629J366j18r10o41L6L00K52O57
60378C90657J689K565K565J855J121Q49J151J817K353K319J819J365J200J131
60364D14456J075J182J302R27m1r50j162p66k01L89J086J786K280K518K577K556
60348D29014K664L007L158K453J012n1O9P96R55L42j25K69J146J562J065L4p99
$$ y = [440355, 434831, 429638, 424834, 419972, 414942, 410642, 408074, 406913, 405600, 402914, 398916, 394406, 390173, 386943, 385255, 384824, 384496, 383363, 381608, 379831, 378047, 376003, 374101, 373107, 372978, 372818, 372105, 371220, 370497, 369479, 367673, 365486, 363793, 362841, 362189, 361604, 361450, 362017, 362904, 363345, 363019, 362404, 362324, 363196, 364675, 365976, 366536, 366409, 366159, 366417, 367444, 368937, 370329, 371360, 372286, 373385, 374461, 375192, 375775, 376741, 378041, 378861, 378597, 377646, 376947, 377023, 377812, 379193, 381251, 384005, 387086, 389715, 391081, 390963, 390053, 389412, 389448, 389748, 390000, 390657, 392346, 394911, 397476, 399331, 400452, 401301, 402452, 404269, 406622, 408941, 410760, 412125, 413325, 414456, 415531, 416713, 418015, 418942, 418901, 417951, 416789, 416023, 415822, 416211, 417297, 419083, 421363, 423881, 426458, 429014, 431678, 434685, 437843, 440296, 441308, 441257, 441326, 442122, 443077, 443419, 443294, 443563, 444709, 446271, 447336, 447370, 446571]
60331D46571j123j247j566j986k196k285k514k565j799m92K4r54k381k725j797
60316D20965n14O31J843K967L364L024K938L853N332O449P034P677Q788J0063
60302D84414J0874J0864J0099Q729O730M060R69k115n008p810j0296j1756j1705
60289D88049j0560r179p951o692n309m100l398l192l092k477r78Q90J836J086
60275D34933n57j490j123m39o19j664k594k660j984j152n24l3L95M87p0j024j694
60258D18188j805j795k003k016j311k25L09o9q15j258j233r29n39j60K34P73J400
60241D06746J713J382O45J26J99P83J538K021J874J201N83L22K0o90j378j349
60225D15736o40J79R19J699K224K080J696K003K997L623L315K756K692K896K878
$$ y = [446571, 445448, 444201, 442635, 440649, 438453, 436168, 433654, 431089, 429290, 428798, 428822, 427868, 425487, 422762, 420965, 420451, 421082, 422925, 425892, 429256, 432280, 435218, 439071, 444403, 450852, 457886, 465563, 474351, 484414, 495288, 506152, 516251, 524980, 531710, 535770, 536739, 534624, 529616, 521806, 511510, 499754, 488049, 477489, 468310, 460359, 453667, 448358, 444258, 440860, 437668, 434576, 432099, 431121, 432011, 433847, 434933, 434376, 432886, 431763, 431324, 430705, 429041, 426447, 423787, 421803, 420651, 420127, 420094, 420489, 420976, 420906, 419882, 418188, 416383, 414588, 412585, 410569, 409258, 409033, 409342, 409273, 408458, 407200, 405967, 405038, 404499, 404339, 404573, 405346, 406746, 408459, 409841, 410486, 410612, 410811, 411594, 413132, 415153, 417027, 418228, 418811, 419133, 419153, 418463, 417085, 415736, 415096, 415275, 416194, 417893, 420117, 422197, 423893, 425896, 428893, 432516, 435831, 438587, 441279, 444175, 447053]
60210D47053K875L366M097M362M049L794M181N142O069O339N863N208M939M862
60196E12199M326L331K681K785L005K646K041K005K554K821K101N46j091k078
60182E39872k214k021k252l001l593l542l263l415l972m393m477m447m318l828
60168D91136l016k377k235k312k149j724j477j681j999j771q30K07O90P43R39
60153D72144J308J313Q58O03R66J473J562J433J543J715J553J312J632K514L361
60138D95290L961M657N457N724N146M393M348N050N837O321O765P441P965P548
60124E75903N929L881K537K199K079J375K94l34k33J6j37n22o77n15k93j38nL1
60106E91390k31o94r11o42k26j64m70p97j161j973l220m141m082l333k585j950
$$ y = [447053, 449928, 453294, 457391, 461753, 465802, 469596, 473777, 478919, 484988, 491327, 497190, 502398, 507337, 512199, 516525, 519856, 522537, 525322, 528327, 530973, 533014, 535019, 537573, 540394, 542495, 543041, 541950, 539872, 537658, 535637, 533385, 530384, 526791, 523249, 519986, 516571, 512599, 508206, 503729, 499282, 494964, 491136, 488120, 485743, 483508, 481196, 479047, 477323, 475846, 474165, 472166, 470395, 469565, 469772, 470462, 471205, 472144, 473452, 474765, 475623, 476226, 477192, 478665, 480227, 481660, 483203, 484918, 486471, 487783, 489415, 491929, 495290, 499251, 503908, 509365, 515089, 520235, 524628, 528976, 534026, 539863, 546184, 552949, 560390, 568355, 575903, 581832, 585713, 588250, 590449, 592528, 593903, 594197, 593863, 593630, 593646, 593509, 592987, 592310, 591795, 591502, 591364, 591359, 591390, 591159, 590465, 589554, 588912, 588686, 588522, 588052, 587255, 586094, 584121, 580901, 576760, 572678, 569345, 566760, 564810]
60090E64810j146m18m57j271j933j709q74j47J77K27J91L08Q01J492J815J567
60074E63433J201J151J269J224R01R5j648m263o731q007q090p672p126o438n751
60059E13548n321n109m962m981n154m978m143l230k998l218l015k165j179k73
60045D62822P70J687J794J145P68J338K397L160L426L328K939K537K571K970L048
60030D96700K506J874J550J083K3j159j720j743j886k390l033l789m703n303m892
60015D73118l577k374k208l110m430n430n673n250m643m158l547k511j396r43
60001D23868j396k209k709k596j879p54L94J252J897K529K944K732K028J492J415
59986D29008J369J060R06J353K021K154J723J460J800K296K244J506N58p8k83
$$ y = [564810, 563664, 563246, 562789, 561518, 559585, 557876, 557002, 556855, 557032, 557259, 557450, 557758, 558559, 560051, 561866, 563433, 564634, 565785, 567054, 568278, 569179, 569274, 567626, 563363, 556632, 548625, 540535, 532863, 525737, 519299, 513548, 508227, 503118, 498156, 493175, 488021, 483043, 478900, 475670, 472672, 469454, 466439, 464274, 463095, 462822, 463592, 465279, 467073, 468218, 468986, 470324, 472721, 475881, 479307, 482635, 485574, 488111, 490682, 493652, 496700, 499206, 501080, 502630, 503713, 503736, 502577, 500857, 499114, 497228, 494838, 491805, 488016, 483313, 478010, 473118, 469541, 467167, 464959, 461849, 457419, 451989, 446316, 441066, 436423, 432265, 428718, 426207, 424811, 423868, 422472, 420263, 417554, 414958, 413079, 412325, 412719, 413971, 415868, 418397, 421341, 424073, 426101, 427593, 429008, 430377, 431437, 432343, 433696, 435717, 437871, 439594, 441054, 442854, 445150, 447394, 448900, 449458, 449380, 449097]
59971D49097l13m16n08l45J1Q5k92m41N36K552M410N092M781M396M465M823N140
59954D83073N234M903L943K514J184L82l3n62j475k535l190l086k432j891j904
59939D84125k180k040j336p27q63j566k054j903j406r87n66K27J361K263K477
59924D74825K241K180K533L010L406L935M788N726O421O970P614Q078P796O775
59910E46298N734N205M988M643M080L361K434J408P96R67J554J852J677J362J064
59895E87423N21l98j382k074k458k731k964l035k742j924o55O98J771K548L222
59880E75820L751L888L668L529L720L906L631L012K590K537K395J778R79O45Q80
59865F16729J100P76O6m77n79l85j22O2M9j07p1K93N17R2n67m62N05J113L36j326
$$ y = [449097, 448784, 448368, 447860, 447515, 447526, 447611, 447319, 446878, 447414, 449966, 454376, 459468, 464249, 468645, 473110, 477933, 483073, 488307, 493210, 497153, 499667, 500851, 501233, 501200, 500638, 499163, 496628, 493438, 490352, 487920, 486029, 484125, 481945, 479905, 478569, 477842, 476979, 475413, 473359, 471456, 470050, 469063, 468497, 468724, 470085, 472348, 474825, 477066, 479246, 481779, 484789, 488195, 492130, 496918, 502644, 509065, 516035, 523649, 531727, 539523, 546298, 552032, 557237, 562225, 566868, 570948, 574309, 576743, 578151, 578947, 579914, 581468, 583320, 584997, 586359, 587423, 587944, 587546, 586164, 584090, 581632, 578901, 575937, 572902, 570160, 568236, 567581, 568279, 570050, 572598, 575820, 579571, 583459, 587127, 590656, 594376, 598282, 601913, 604925, 607515, 610052, 612447, 614225, 615204, 615849, 616729, 617829, 618605, 618671, 618194, 617615, 617230, 617108, 617170, 617219, 617112, 617041, 617334, 617851, 617943, 617376, 616914, 617419, 618532, 618868, 617542]
59845F17542k685l451m175m995n371n029m340l636k951k532k910m102n384o136
59831E59845o427o485o204n505m689l850k594q59M21L30o73j216p88k59m95j215
59815E19337j606j435j060p36m65l37n36r72j266j230j047r30q59p92r37j552
59799E03577k537l374l571l099k391j894j701j594j433j340j444j570j400r54
59785D75275o71q53j239j301q58j57N31J098J384J189O05J13J15N41J068J523
59769D78363J873K035J966J902K130K516K612K259J936K231L150M103M556M557
59755E16189M564M883N356N652N760O069O830P692P984P512O883O815P318P759
59741F07266P734P423P044O419N428M528M187L990K990J124m89j044j158j954
$$ y = [617542, 614857, 611406, 607231, 602236, 596865, 591836, 587496, 583860, 580909, 578377, 575467, 571365, 565981, 559845, 553418, 546933, 540729, 535224, 530535, 526685, 524091, 523232, 523653, 523983, 523310, 522094, 521306, 521047, 520552, 519337, 517731, 516296, 515236, 514500, 514035, 513698, 513162, 512190, 510924, 509694, 508647, 507717, 506858, 506066, 505129, 503577, 501040, 497666, 494095, 490996, 488605, 486711, 485010, 483416, 481983, 480643, 479199, 477629, 476229, 475275, 474604, 473751, 472512, 471211, 470353, 470196, 470727, 471825, 473209, 474398, 475003, 475116, 475231, 475772, 476840, 478363, 480236, 482271, 484237, 486139, 488269, 490785, 493397, 495656, 497592, 499823, 502973, 507076, 511632, 516189, 520753, 525636, 530992, 536644, 542404, 548473, 555303, 562995, 570979, 578491, 585374, 592189, 599507, 607266, 615000, 622423, 629467, 635886, 641314, 645842, 650029, 654019, 657009, 658133, 657644, 656600, 655442, 653488]
59727F53488l432m531m580m003l659l998m920n860o050n210m058l659m255n162
59713E90111n735n843n431m394l099k323k371k746k869k636k048j087j67Mn58
59698E48808r36n79p3n3j27M27J429K105K197J961J419M39o29j163j064p22l53
59681E53086R7M77N11J58n01j507k629l124k574j684j521k166k880l290l568l619
59665E25266l117k336k022k278k445k166j706j097O1J564K287J496j12j196j122
59650E11077j72J063K031K305J919J383J104R13L67o63j863k798l262l390l399
59635E06615l163k312r73JK8l93m98m61r94j965k473k252j996k102k083j531q30
59618D82618n43p91j546k774l923m152l425k672k478k317j654r65j023j663j988
$$ y = [653488, 650056, 645525, 640945, 636942, 633283, 629285, 624365, 618505, 612455, 607245, 603187, 599528, 595273, 590111, 584376, 578533, 573102, 568708, 565609, 563286, 560915, 558169, 555300, 552664, 550616, 549529, 549362, 549366, 548808, 547872, 547293, 547220, 547167, 547040, 547467, 548896, 551001, 553198, 555159, 556578, 557017, 556388, 555225, 554161, 553439, 553086, 553183, 553660, 554171, 554329, 553828, 552321, 549692, 546568, 543994, 542310, 540789, 538623, 535743, 532453, 528885, 525266, 522149, 519813, 517791, 515513, 513068, 510902, 509196, 508099, 508160, 509724, 512011, 513507, 513395, 512199, 511077, 510905, 511968, 513999, 516304, 518223, 519606, 520710, 521623, 521990, 521327, 519464, 516666, 513404, 510014, 506615, 503452, 501140, 500167, 500168, 500196, 499803, 499305, 498844, 497850, 495885, 493412, 491160, 489164, 487062, 484979, 483448, 482618, 482075, 481284, 479738, 476964, 473041, 468889, 465464, 462792, 460314, 457997, 456343, 455378, 454355, 452692, 450704]
59603D50704j404r7J245J787J199K07K2Q74J705J587P49j37r02j521j549o96N14
59586D54287J290J372Q93J6q14r55n00m29j174j805j397m59j2L3M00Q57M29r02
59568D51130j976k005j359o94k27p3m15j045j340r92l70K7O9l1KK78N18K94k05
59549D41586o7J155K663L413L499L710M153M318M317M880O108P261Q008Q907J0364
59534E14275J1905J2671J1924R011L919j870n967p217o608n707n024m331l647
59521E23334l022k038m72R04J078J79o58p45m09j48K8J64q2j035k445l671m306
59504E06656m373m052l490k895k592k764l180l360l052k468j965j701j631j664
59490D67469j615j193l14O11J032R49R69J554K403K803K535K256K774M032N043
$$ y = [450704, 449300, 449203, 450448, 452235, 453434, 453641, 453663, 454537, 456242, 457829, 458578, 458441, 457539, 456018, 454469, 453773, 454287, 455577, 456949, 457842, 457858, 457044, 456089, 455589, 455160, 453986, 452181, 450784, 450325, 450313, 450346, 450746, 451603, 452032, 451130, 449154, 447149, 445790, 445096, 444869, 444796, 444381, 443336, 441996, 441004, 440634, 440661, 440730, 440699, 440701, 440979, 441497, 441791, 441586, 441519, 442674, 445337, 448750, 452249, 455959, 460112, 464430, 468747, 473627, 479735, 486996, 495004, 503911, 514275, 526180, 538851, 550775, 559786, 563705, 561835, 555868, 548651, 542043, 536336, 531312, 526981, 523334, 520312, 518274, 517802, 518706, 519784, 519963, 519305, 518560, 518151, 518003, 518031, 518195, 518113, 517078, 514633, 510962, 506656, 502283, 498231, 494741, 491846, 489254, 486490, 483310, 479950, 476898, 474430, 472465, 470764, 469133, 467469, 465854, 464661, 464347, 464958, 465990, 466939, 467908, 469462, 471865, 474668, 477203, 479459, 482233, 486265, 491308]
59475D91308N063M550M555N244N671N106L982L081K402J419J66p27r18o68k88
59460E29946J70N90P31P25J170K378L822M633M607M418M821N762O496O531O173
59445E82973N937N723N072M073L317K842J956L36j363k512l394m494n478n687
59431E89301n187m548l931l193k601k543k685k223r13Q33K658M377N638O352P271
59416E88606R170J1601J3423J4415J5329J6477J7499J8464J9648J9871J6824R903
59404G71230J557n139r083j0647r969p282l875j044J466M361O400M920q82q540
59390G33473j4723j7935j8496j7154j4749j2455j1089j0262r003p200n721n057
59378E89629m559l363j557k1O92P70O17M23L48O49J257J696J726J787K320L005
$$ y = [491308, 496371, 500921, 505476, 510720, 516391, 521497, 525479, 528560, 530962, 532381, 532547, 531820, 530902, 530234, 529946, 530116, 530706, 531437, 532162, 533332, 535710, 539532, 544165, 548772, 553190, 558011, 563773, 570269, 576800, 582973, 588910, 594633, 599705, 603778, 607095, 609937, 611893, 612229, 610866, 608354, 604960, 600466, 594988, 589301, 584114, 579566, 575635, 572442, 569841, 567298, 564613, 562390, 561477, 562310, 564968, 569345, 574983, 581335, 588606, 597776, 609377, 622800, 637215, 652544, 669021, 686520, 704984, 724632, 744503, 761327, 771230, 772787, 767648, 758565, 747918, 737949, 730667, 726792, 725748, 727214, 731575, 737975, 742895, 742013, 733473, 718750, 700815, 682319, 665165, 650416, 637961, 626872, 616610, 607607, 600407, 594686, 589629, 585070, 581707, 580150, 580129, 580821, 581591, 582208, 582631, 582979, 583628, 584885, 586581, 588307, 590094, 592414, 595419]
59362E95419L245L216L648M526M906M393M001M857O591P751P678P182P326Q175
59348F72914Q986R220Q983Q668Q463Q286Q048P823P778P954Q254Q522Q514P836
59334G90249O212L899J645J9j096k273l902n848p588q616q878q885r286j0050
59320G35602j0292r187p059n246m725n055m932l679j878m77K76P18J002J104J469
59305F87641K833N104P063P734P500P245O799N075J689k386n956q650j0587j1637
59291F99467j1582j0725r807r258q798p905o548n284m621m407m087l528l133l020
59277F06764k646j590k89N93J159K042L362M602N510O322P133P633P709P723P947
59262F63974Q144P866O878N225L227J421N6j306l154n100o192o241o114o461o791
$$ y = [595419, 598664, 601880, 605528, 610054, 614960, 619353, 623354, 628211, 634802, 642553, 650231, 657413, 664739, 672914, 681900, 691120, 700103, 708771, 717234, 725520, 733568, 741391, 749169, 757123, 765377, 773899, 782413, 790249, 796461, 800360, 802005, 802024, 800928, 798655, 794753, 788905, 781317, 772701, 763823, 754938, 745652, 735602, 725310, 716123, 709064, 703818, 699093, 694038, 689106, 685427, 683549, 683072, 683348, 684066, 685068, 686172, 687641, 690474, 695578, 702641, 710375, 717875, 725120, 731919, 736994, 738683, 736297, 730341, 721691, 711104, 699467, 687885, 677160, 667353, 658095, 649297, 641392, 634844, 629560, 624939, 620532, 616445, 612917, 609784, 606764, 604118, 602528, 602239, 602832, 603991, 606033, 609395, 613997, 619507, 625829, 632962, 640595, 648304, 656027, 663974, 672118, 679984, 686862, 692087, 695314, 696735, 696791, 695485, 692331, 687231, 681039, 674798, 668684, 662223, 655432]
59247F55432o270m904l478k656k455k457k213j562p32M6Q26J634K031J604P45
59232F35591L01M16M04m0l58j25K12K1o13j248j709k023k082j922j889k105k184
59215F20647j910j741k177l037l792m272m534m361l532k352j400q49m53o8K13
59200E86382L07K67K18L97R84J650J625N83p97j571j545j190q73n91l09n2K55
59183E85740P20J264J782K306K783K920K576K084J831J729J498J338J749K716
59169F13036L544L669L323L171L541M116M433M422M369M382M179L597L000K783
59155F65565K626J752K0j743k713k975l247l941m789n207m942m400m257m648m957
59140F22144m752m517m865n422n307m558m068m087l892l198k751l057l441l055
$$ y = [655432, 649162, 644258, 640780, 638124, 635669, 633212, 630999, 629437, 628705, 628751, 629577, 631211, 633242, 634846, 635591, 635892, 636308, 636712, 636672, 636314, 636189, 636401, 636422, 635809, 634561, 632852, 630829, 628747, 626825, 624936, 622831, 620647, 618737, 616996, 614819, 611782, 607990, 603718, 599184, 594823, 591291, 588939, 587539, 586690, 586237, 586169, 586382, 586689, 586956, 587174, 587571, 588555, 590205, 591830, 592413, 591616, 590045, 588500, 587310, 586437, 585846, 585537, 585485, 585740, 586460, 587724, 589506, 591812, 594595, 597515, 600091, 602175, 604006, 605735, 607233, 608571, 610320, 613036, 616580, 620249, 623572, 626743, 630284, 634400, 638833, 643255, 647624, 652006, 656185, 659782, 662782, 665565, 668191, 669943, 669963, 668220, 665507, 662532, 659285, 655344, 650555, 645348, 640406, 636006, 631749, 627101, 622144, 617392, 612875, 608010, 602588, 597281, 592723, 588655, 584568, 580676, 577478, 574727, 571670, 568229, 565174]
59126E65174k022r22J01J045J612J746K088L079M211M759M805M768M569M036L635
59111F02684L874M355M326L834L481L247K569J488P82Q24J046P88J06m41n18m41
59095F32004r59k468m234m867l812k060r72r44j550k359k969k809j786q00q11
59080E98604j627k332k665l152m085n045n456n062m017l010k974m026m997m703
59066E45453l411k344k000j842j413r22p37j006j689k371k215r19N34Q32n1r45
59050E24954j027m67K36P46P09J8p20p53j80L12O17J192J972K262J853J335J117
59033E34176J045J113J691K707L511L772L875M162M529N024O045P601R074J0031
59019E98356J0661J1166J1427J1510J1799J2191J1827J0075P275M198J303j100
$$ y = [565174, 563152, 562230, 562331, 563376, 564988, 566734, 568822, 571901, 576112, 580871, 585676, 590444, 595013, 599049, 602684, 606558, 610913, 615239, 619073, 622554, 625801, 628370, 629858, 630640, 631464, 632510, 633298, 633404, 632963, 632445, 632004, 631045, 628577, 624343, 619476, 615664, 613604, 612632, 611688, 610138, 607779, 604810, 602001, 600215, 599415, 598604, 596977, 594645, 591980, 588828, 584743, 579698, 574242, 569180, 565163, 562153, 559179, 555153, 550156, 545453, 542042, 539698, 537698, 535856, 534443, 533521, 532784, 531778, 530089, 527718, 525503, 524584, 525118, 525950, 525899, 524954, 523927, 523460, 523696, 524442, 525151, 525169, 524449, 523696, 523516, 523828, 524445, 525637, 527609, 529871, 531724, 533059, 534176, 535221, 536334, 538025, 540732, 544243, 548015, 551890, 556052, 560581, 565605, 571650, 579251, 588325, 598356, 609017, 620183, 631610, 643120, 654919, 667110, 678937, 689012, 696287, 700485, 701788, 700688]
59007G00688k664l434m073n122o327p013o824n879m538l278k402j715q29J19N61
58992F47270M01K76O93J407J928K123J980J348L38m15m12Q8M56N18O17J017J595
58975F61228K102K555L266M512O187P859R225J0249J0770J0432R345Q377Q228
58962G54335Q530Q445P877P335O856N886M238K433R99k6q82j896l443n451p135
58947G88101p873q149q892j0070j0869j0993j0798j0197q709o711n344m866m247
58934F80383k862j455q52p78o74o65r22q27K29J785K856L135L062K984K889K640
58918F90928K049R99j74q09o94l26j93l08o09j113j470j104j34N87P72J186K368
58901F91955L791M871N964P528R022R565R199Q602Q033P356O777O687P010P417
$$ y = [700688, 698024, 694590, 690517, 685395, 679068, 672055, 665231, 659352, 654814, 651536, 649134, 647419, 646590, 646709, 647270, 647671, 647947, 648640, 650047, 651975, 654098, 656078, 657426, 657764, 657349, 656937, 657025, 657481, 657999, 658616, 659633, 661228, 663330, 665885, 669151, 673663, 679850, 687709, 696934, 707183, 717953, 728385, 737730, 746107, 754335, 762865, 771310, 779187, 786522, 793378, 799264, 803502, 805935, 806934, 806908, 806026, 804130, 800687, 795236, 788101, 780228, 772079, 763187, 753117, 742248, 731255, 720457, 710260, 701551, 694840, 689496, 684630, 680383, 677521, 676066, 675214, 674436, 673762, 673097, 672175, 671348, 671577, 673362, 676218, 679353, 682415, 685399, 688288, 690928, 692977, 693976, 693802, 692993, 692299, 691973, 691780, 691472, 690863, 689750, 688280, 687176, 687042, 687629, 688401, 689587, 691955, 695746, 700617, 706581, 714109, 723131, 732696, 741895, 750497, 758530, 765886, 772663, 779350, 786360, 793777]
58887G93777P940Q766R604R975R873R591R084Q151P046O272N878N399M375K620
58873H98351K60k121l776m628n429o598p431p075n865m905m613m542m424m519
58859H32685m874n041m763m330m047l880l830m203n158o259o816o585n885n106
58845G61908m291l355k534k329k879l730m453n238o428p783q695r010r037q852
58831F83294q297p647p484p771p755p004n844m649l392k130j145l24P82K021K599
58816F25254K402K433L314M229M100L114K316K159K242K063J461N46k66n67o01
58801F54199j132k332l464l948m024l967l628l255l748n213o276n859m778m480
58787E98095m974n258n100n014m813l697j725K5Q60J039R93Q97R91J412J711J420
$$ y = [793777, 801717, 810483, 820087, 830062, 839935, 849526, 858610, 866761, 873807, 880079, 885957, 891356, 895731, 898351, 898611, 896490, 892714, 888086, 882657, 876059, 868628, 861553, 855688, 850783, 846170, 841628, 837204, 832685, 827811, 822770, 818007, 813677, 809630, 805750, 801920, 797717, 792559, 786300, 779484, 772899, 767014, 761908, 757617, 754262, 751728, 749399, 746520, 742790, 738337, 733099, 726671, 718888, 710193, 701183, 692146, 683294, 674997, 667350, 659866, 652095, 644340, 637336, 631492, 626843, 623451, 621321, 620176, 619852, 620634, 622655, 625254, 627656, 630089, 633403, 637632, 641732, 644846, 647162, 649321, 651563, 653626, 655087, 655633, 655367, 654800, 654199, 653067, 650735, 647271, 643323, 639299, 635332, 631704, 628449, 624701, 619488, 613212, 607353, 602575, 598095, 593121, 587863, 582763, 577749, 572936, 569239, 567514, 567539, 568399, 569438, 570431, 571328, 572319, 573731, 575442, 576862]
58771E76862Q98P33M72q97l173m787m702l609k897l117l730l788k729j051j30
58756E44355p53j866j623L33K497L503L598L758M244M533M147L065J625M19p0
58741E71765J08M67P07Q76R76R08Q65J263K092K777K900K630K323K060J798J668
58725E96183J833K209K496K413J916J289R77J144J554J942K335K792L123L233
58711F25439L518M394N566O166N689M471L189K151J091m82k677m975o736p904
58697F38900q887r766j0183j0101j0031j0189j0039r175q098p596p786q183q265
58684E20601p594o036m287l535l927m116l066j595j174j814k280j984j490j289
58670D76414j197r48m99L23J612K925L704M072M452M647M180L332K789K394J343
$$ y = [576862, 577760, 578493, 578965, 578068, 574895, 570108, 565406, 561797, 558900, 555783, 552053, 548265, 545536, 544485, 544355, 543602, 541736, 540113, 540446, 542943, 546446, 550044, 553802, 558046, 562579, 566726, 569791, 571416, 571835, 571765, 571873, 572340, 573047, 573923, 574899, 575807, 576672, 577935, 580027, 582804, 585704, 588334, 590657, 592717, 594515, 596183, 598016, 600225, 602721, 605134, 607050, 608339, 609316, 610460, 612014, 613956, 616291, 619083, 622206, 625439, 628957, 633351, 638917, 645083, 650772, 655243, 658432, 660583, 661674, 661192, 658515, 653540, 646804, 638900, 630013, 620247, 610064, 599963, 589932, 579743, 569704, 560529, 552431, 544835, 537049, 528866, 520601, 513007, 506971, 502684, 499149, 495222, 491106, 488040, 486445, 485271, 483457, 481177, 479193, 477703, 476414, 475217, 474269, 473770, 474093, 475705, 478630, 482334, 486406, 490858, 495505, 499685, 503017, 505806, 508200, 509543]
58655E09543l16j534j854k044k723l430l611l651m136m657m235k759j297q84j422
58640D70990j965j949j774k028k420j996m39J446K781L445L587L091K167J745
58626D76681K351L151L024K236J950K398K614K017J177P92Q01P70N53K73J74N69
58610E01531J549K674L366L544L537L506L411L282L095K654K014J691J951K291
58596E40096K213K047K310K676K444J646Q87L98R3K31J157K590L957N140O149
58581E74034O547O157N848O568P905Q720Q831Q939R135Q808P909P106O697O533
58567F79737O837P900R031R219Q813R219J0795J2467J3562J4609J5895J6680J6400
58554H31164J5485J4390J2818J0507P857N198K285q92l600n176n789n957n934
$$ y = [509543, 509227, 507693, 505839, 503795, 501072, 497642, 494031, 490380, 486244, 481587, 477352, 474593, 473296, 472412, 470990, 469025, 467076, 465302, 463274, 460854, 458858, 458419, 459865, 462646, 466091, 469678, 472769, 474936, 476681, 479032, 482183, 485207, 487443, 489393, 491791, 494405, 496422, 497599, 498391, 499192, 499962, 500515, 500788, 500962, 501531, 503080, 505754, 509120, 512664, 516201, 519707, 523118, 526400, 529495, 532149, 534163, 535854, 537805, 540096, 542309, 544356, 546666, 549342, 551786, 553432, 554319, 554717, 554810, 555041, 556198, 558788, 562745, 567885, 574034, 580581, 586738, 592586, 599154, 607059, 615779, 624610, 633549, 642684, 651492, 659401, 666507, 673204, 679737, 686574, 694474, 703505, 712724, 721537, 730756, 741551, 754018, 767580, 782189, 798084, 814764, 831164, 846649, 861039, 873857, 884364, 892221, 897419, 899704, 898812, 895212, 890036, 884247, 878290, 872356]
58541H72356n817n709n535n245n371o681r102j1619j3366j4270j4581j4471j4135
58528G46454j3590j2472j0634q784p747p346o752n733m609l396k044j194j478
58515F60675k266k394j935j895k375k556k370k596l141k893j612m01N6K64N81
58500F35142N68J18k01l34q78j645j551m19N74P92R73J635K179K237K445L060
58484F44695L310K976L199M697O440P150P052P185P965R262J0908J2320J2540
58471G39699J1464J0069Q871P250M913K684J077o03k777m487m849m423m056l427
58457G61405j948j36J173K228L721N399O387O488O221N930N581N065M131K540
58443H14185N96j009k205l538m984n747n609n303n186m701l693k896k527j736
$$ y = [872356, 866539, 860830, 855295, 850050, 844679, 837998, 828896, 817277, 803911, 789641, 775060, 760589, 746454, 732864, 720392, 709758, 700974, 693227, 685881, 679129, 673396, 668787, 665391, 663347, 662153, 660675, 658409, 656015, 654080, 652185, 649810, 647254, 644884, 642288, 639147, 636254, 634642, 634241, 634297, 634561, 635142, 635710, 635828, 635627, 635293, 634415, 632770, 631219, 630800, 631374, 632166, 633139, 634774, 636953, 639190, 641635, 644695, 648005, 650981, 654180, 658877, 665317, 672467, 679519, 686704, 694669, 703931, 714839, 727159, 739699, 751163, 761232, 770103, 777353, 782266, 784950, 786027, 785424, 782647, 778160, 773311, 768888, 764832, 761405, 759457, 759321, 760494, 762722, 766443, 771842, 778229, 784717, 790938, 796868, 802449, 807514, 811645, 814185, 814781, 813772, 811567, 808029, 803045, 797298, 791689, 786386, 781200, 776499, 772806, 769910, 767383, 765647]
58429G65647j77J183J707K223L507M882N386N296N361N503N346N188N376N453
58415H21881M776L321J260j369l912n104m661l836l737m016l964l714l543l105
58401G90277k210j418r94l71O61J389J482J696K495L239L569M255N759P185P626
58386H24640P397P032O387N551N370O050O605O582O868P823Q148O849M821L388
58372I13511K606K220K722M201N516N948O323P328Q187Q274Q491R598J0671J0683
58358A006279J0214J0225J0519J0765J1471J2580J2714J1348J0040R919R785Q448
58346A134307P117P319Q170Q015P393P987R714J1099J1734J2347J3170J3953J4778
58333A267103J5464J5267J4547J5163J7704J9993K0129J9249J9257J9649J8963
$$ y = [765647, 765470, 766653, 768360, 770583, 774090, 778972, 784358, 789654, 795015, 800518, 805864, 811052, 816428, 821881, 826657, 829978, 831238, 829869, 825957, 820853, 816192, 812356, 808619, 804603, 800639, 796925, 793382, 790277, 788067, 786649, 785655, 785284, 785945, 787334, 788816, 790512, 793007, 796246, 799815, 804070, 809829, 817014, 824640, 832037, 839069, 845456, 851007, 856377, 862427, 869032, 875614, 882482, 890305, 898453, 905302, 910123, 913511, 916117, 918337, 921059, 925260, 930776, 936724, 943047, 950375, 958562, 966836, 975327, 984925, 995596, 1006279, 1016493, 1026718, 1037237, 1048002, 1059473, 1072053, 1084767, 1096115, 1106155, 1116074, 1125859, 1134307, 1141424, 1148743, 1156913, 1164928, 1172321, 1180308, 1190022, 1201121, 1212855, 1225202, 1238372, 1252325, 1267103, 1282567, 1297834, 1312381, 1327544, 1345248, 1365241, 1385370, 1404619, 1423876, 1443525, 1462488]
58322A462488J7729J7393J7516J6731J5320J4549J4344J3959J3944J5168J6819
58311A635960J7549J7675J8246J9029J9403K0060K1771K3643K4593K5260K6498
58300A869687K7515K7581K7944K9788L1892L2776L3439L5523L8367M0394M1811
58289B236717M3372M4316M4225M5070M8465N2664N5215N6831N9540O2967O5737
58278B815119O8772P3587P8950Q2709Q5489Q9142R3201R6362R9697J04761J10183
58267C797972J14084J18144J25203J34411J42928J50939J60687J71811J82000
58258E098179J91080K00318K08890K15341K21283K29357K38743K46854K54026
58249G104071K62128K70201K76207K81737K90176L01583L13999L28213L46257
$$ y = [1462488, 1480217, 1497610, 1515126, 1531857, 1547177, 1561726, 1576070, 1590029, 1603973, 1619141, 1635960, 1653509, 1671184, 1689430, 1708459, 1727862, 1747922, 1769693, 1793336, 1817929, 1843189, 1869687, 1897202, 1924783, 1952727, 1982515, 2014407, 2047183, 2080622, 2116145, 2154512, 2194906, 2236717, 2280089, 2324405, 2368630, 2413700, 2462165, 2514829, 2570044, 2626875, 2686415, 2749382, 2815119, 2883891, 2957478, 3036428, 3119137, 3204626, 3293768, 3386969, 3483331, 3583028, 3687789, 3797972, 3912056, 4030200, 4155403, 4289814, 4432742, 4583681, 4744368, 4916179, 5098179, 5289259, 5489577, 5698467, 5913808, 6135091, 6364448, 6603191, 6850045, 7104071, 7366199, 7636400, 7912607, 8194344, 8484520, 8786103, 9100102, 9428315, 9774572]
58240I774572L66873L87389M08431M31739M55281M75949M94913N14688N33223
58231A3843058N47114N58501N72407N89423O07539O28628O55863O86886P16997
58222A9406416P46923P80119Q15206Q49261Q85846R30958R83775J040627J105056
58213B7544187J183877J276150J376823J488421J617811J764604J925369K106752
58205D0283994K321720K576143K873014L226053L653207M160038M746287N424884
58197F9265340O216265P129592Q171617R368543J0753044J2332211J4090158J6004909
58189A53331679J8018057J9986933K1689289K2816210K2848107K0973617J6399827
58182B96063719R031322r6465r186162j6605913k1564255k4087582k4606437k3650174
$$ y = [9774572, 10141445, 10528834, 10937265, 11369004, 11824285, 12300234, 12795147, 13309835, 13843058, 14390172, 14948673, 15521080, 16110503, 16718042, 17346670, 18002533, 18689419, 19406416, 20153339, 20933458, 21748664, 22597925, 23483771, 24414729, 25398504, 26439131, 27544187, 28728064, 30004214, 31381037, 32869458, 34487269, 36251873, 38177242, 40283994, 42605714, 45181857, 48054871, 51280924, 54934131, 59094169, 63840456, 69265340, 75481605, 82611197, 90782814, 100151357, 110904401, 123236612, 137326770, 153331679, 171349736, 191336669, 213025958, 235842168, 258690275, 279663892, 296063719, 305095041, 304998576, 295812414, 279206501, 257642246, 233554664, 208948227, 185298053]
58174A85298053k1754923j9406501j6958240j4613266j2481727j0622576r043393
58167H0417427p713337o599397n678550m921420m291298l763162l325239k961315
58159D1163709k649021k375982k141474j941300j765187j609004j475407j361410
58151B5844924j257754j161113j075463j000889r31955q67409q11056p62328p15851
58142A7261106o71062o32866o01927n72928n43389n16081m91839m67735m43386
58133A2319893m21887m03494l84937l65609l48230l32994l17164l00730k86398
58124I158450k73880k60144k45634k34226k26696k19862k12512k06540k01878
58115G077078j95857j88146j81084j74720j66657j57257j49766j44739j39398
$$ y = [185298053, 163543130, 144136629, 127178389, 112565123, 100083396, 89460820, 80417427, 72704090, 66104693, 60426143, 55504723, 51213425, 47450263, 44125024, 41163709, 38514688, 36138706, 33997232, 32055932, 30290745, 28681741, 27206334, 25844924, 24587170, 23426057, 22350594, 21349705, 20417750, 19550341, 18739285, 17976957, 17261106, 16590044, 15957178, 15355251, 14782323, 14238934, 13722853, 13231014, 12763279, 12319893, 11898006, 11494512, 11109575, 10743966, 10395736, 10062742, 9745578, 9444848, 9158450, 8884570, 8624426, 8378792, 8144566, 7917870, 7698008, 7485496, 7278956, 7077078, 6881221, 6693075, 6511991, 6337271, 6170614, 6013357, 5863591, 5718852, 5579454]
58106E579454j33028j27973j24571j20113j13854j08414j05076j02059r8486r5905
58096D449975r4735r3202r0742q8857q7691q5426q1807p8758p6841p4636p2108
58085C525172p0902p0730o9249o6220o4132o3836o3216o1106n8969n7615n5759
58074B823438n3044n1187n0774m9905m7404m4717m3330m2820m2463m2445m2480
58063B312869m1492l9477l7687l6471l5101l3897l4047l5165l5545l5115l5421
58052A913451l6420l6186l4213l2214l1010k9468k7229k5679k5382k5141k4489
58041A586020k4515k5478k6042k5733k5749k6443k6447k5151k3781k3147k2605
58030A310929k1933k1932k2392k1824k0152j9254j9982k0868k0758k0469k0772
$$ y = [5579454, 5446426, 5318453, 5193882, 5073769, 4959915, 4851501, 4746425, 4644366, 4545880, 4449975, 4355240, 4262038, 4171296, 4082439, 3994748, 3909322, 3827515, 3748757, 3671916, 3597280, 3525172, 3454270, 3383540, 3314291, 3248071, 3183939, 3120103, 3056887, 2995781, 2936812, 2879197, 2823438, 2770394, 2719207, 2668433, 2618528, 2571124, 2526407, 2483077, 2440257, 2397794, 2355349, 2312869, 2271377, 2231900, 2194213, 2157742, 2122641, 2088744, 2054697, 2019532, 1983987, 1948872, 1913451, 1877031, 1840845, 1806632, 1774418, 1743408, 1713940, 1686711, 1661032, 1635650, 1610509, 1586020, 1561505, 1536027, 1509985, 1484252, 1458503, 1432060, 1405613, 1380462, 1356681, 1333534, 1310929, 1288996, 1267064, 1244672, 1222848, 1202696, 1183442, 1163460, 1142592, 1121834, 1101365, 1080593]
58019A080593k0976k0568k0254k0313j9828j8565j7653j7469j6816j5160j3708
58008H79283j3303j3139j2538j2129j2213j1863j0734r989j0312j0743j0480j0197
57996G41643j0530j0906j0879j1044j1598j1578j0575r645r506r278q085o509
57984F21510n471n036n151o120p437p667o508n546n960o769o504n344m526m537
57970E38934m927n120m736l827l148l310l641l049k008k062l265l968l501l132
57956D89240l710m283m009l626l997m688n053n287n414m651k830j225r71j676
57942D37820k357k641k404j434j41N82P04J078J813K050J664J588J971J841J123
57927D43257J029J729J610j78k286l415m161n407o556o734o278n829n284m698
$$ y = [1080593, 1059617, 1039049, 1018795, 998482, 978654, 960089, 942436, 924967, 908151, 892991, 879283, 865980, 852841, 840303, 828174, 815961, 804098, 793364, 783375, 773063, 762320, 751840, 741643, 731113, 720207, 709328, 698284, 686686, 675108, 664533, 654888, 645382, 636104, 628019, 621510, 616039, 611003, 605852, 599732, 592295, 584628, 578120, 572574, 566614, 559845, 553341, 547997, 543471, 538934, 534007, 528887, 524151, 520324, 517176, 513866, 510225, 507176, 505168, 503106, 499841, 495873, 492372, 489240, 485530, 481247, 477238, 473612, 469615, 464927, 459874, 454587, 449173, 444522, 441692, 440467, 439496, 437820, 435463, 432822, 430418, 428984, 428843, 429425, 430129, 431207, 433020, 435070, 436734, 438322, 440293, 442134, 443257, 444286, 446015, 447625, 447447, 445161, 441746, 437585, 432178, 425622, 418888, 412610, 406781, 401497, 396799]
57913C96799m803n500n436m127k954k874k817j698l40Q7KJ80L6j158k578l068
57897C59751k950l090l237k834k383k475k460j688r40j114j528j173n64n94n96
57882C32125M76J832J808N27m35o04r25j755k338k340k264k269j991j547j529
57867C18771j886j940j523j110q82n83k04Q6M79J187J839J998J979K297K713K643
57851C25864K213K008K112K129J882J381N03o42j507j860k196k799l143k924k829
57836C20192l408l974l674k923k750l267l826m086l994l255j897p50m09l48O4
57821B81695M04J36j13M94J428J449M09q65j957k925l444l229k994l582m492m516
57805B57898l645l027l156l321k898k032j034p2N21N33M63J015K104L042L518
$$ y = [396799, 391996, 386496, 381060, 376933, 373979, 371105, 368288, 366590, 366250, 366337, 366339, 366519, 366555, 365397, 362819, 359751, 356801, 353711, 350474, 347640, 345257, 342782, 340322, 338634, 337694, 336580, 335052, 333879, 333315, 332721, 332125, 332601, 334433, 336241, 336768, 336333, 335729, 334804, 333049, 330711, 328371, 326107, 323838, 321847, 320300, 318771, 316885, 314945, 313422, 312312, 311430, 310847, 310643, 310729, 311208, 312395, 314234, 316232, 318211, 320508, 323221, 325864, 328077, 330085, 332197, 334326, 336208, 337589, 338092, 337450, 335943, 334083, 331887, 329088, 325945, 323021, 320192, 316784, 312810, 309136, 306213, 303463, 300196, 296370, 292284, 288290, 285035, 283138, 282388, 281979, 281631, 281695, 282099, 282235, 282122, 282616, 284044, 285493, 285902, 285037, 283080, 280155, 276711, 273482, 270488, 266906, 262414, 257898, 254253, 251226, 248070, 244749, 241851, 239819, 238785, 238713, 239234, 239767, 240230, 241245, 243349, 246391, 249909]
57790B49909L647L415K834K380K422K584K341J924J809J893J967K430L504M411
57776B87470M373L943M047M345L838K711K108K261K271J653P67k69j789l566m777
57761C09386n125n053m800m283l877m219n086n462m854l675k359j000P2L57k3
57746B59999l06J0Q47J948K931L242K763K261K397K708K468J990K018K307K061
57731B89644J507J530K007J866Q36k83j090j833k177j312L68J192M03q41j305
57716B90512j279j648k378k777k551j914j224r21j266j819j853j453j461k090
57702B65878k504k169j697j795k161k073j483q81n05k54j09j67m20p38r07o39
57686B47376J77J165J783K002K243K678L005L066L272M248O206Q646J0698J1987
$$ y = [249909, 253556, 256971, 259805, 262185, 264607, 267191, 269532, 271456, 273265, 275158, 277125, 279555, 283059, 287470, 291843, 295786, 299833, 304178, 308016, 310727, 312835, 315096, 317367, 319020, 319787, 319518, 317729, 314163, 309386, 304261, 299208, 294408, 290125, 286248, 282029, 276943, 271481, 266627, 262952, 260593, 259593, 259665, 260022, 259999, 259693, 259703, 260550, 262498, 265429, 268671, 271434, 273695, 276092, 278800, 281268, 283258, 285276, 287583, 289644, 291151, 292681, 294688, 296554, 297390, 297107, 296017, 294184, 292007, 290695, 291063, 292255, 292658, 291817, 290512, 289233, 287585, 285207, 282430, 279879, 277965, 276741, 275820, 274554, 272735, 270882, 269429, 267968, 265878, 263374, 261205, 259508, 257713, 255552, 253479, 251996, 251115, 250610, 250356, 250247, 250080, 249660, 248922, 248015, 247376, 247553, 248718, 250501, 252503, 254746, 257424, 260429, 263495, 266767, 271015, 277221, 285867, 296565, 308552]
57672C08552J3261J5636J9092K2383K4799K7049K9722L1761L1429K7949K1162
57661E72795J0650l058j6979k7233l2353l3716l2990l0745k7489k4165k1054j7640
57649C16023j4054j1350r878q699p182n827n015m193l016k152k109k264j852j075
57635B37357n19k84k80o07r88o82L73J140P82k64j112j523j653j487j204j316
57619B27733j839k041j581j121j215j426j263j088j268j309p18r8l25j211j889
57604B09341k089k073j811j148m87l26m23k57l1k86q49j075r89j162j534j424
57588A93377p82m67r54j616j686j268r96j181j690k259k502k012q91N3J16m24
57572A74818p47o61p93j407j711r05M59R55J49p85o52K46P63M69j21n84j032j549
$$ y = [308552, 321813, 337449, 356541, 378924, 403723, 430772, 460494, 492255, 523684, 551633, 572795, 583445, 580387, 563408, 536175, 503822, 470106, 437116, 406371, 378882, 354717, 333663, 316023, 301969, 290619, 280741, 272042, 264860, 259033, 254018, 249825, 246809, 244657, 242548, 240284, 238432, 237357, 236838, 236554, 236274, 235667, 234679, 233997, 234370, 235510, 236292, 236028, 234916, 233393, 231740, 230253, 229049, 227733, 225894, 223853, 222272, 221151, 219936, 218510, 217247, 216159, 214891, 213582, 212864, 212766, 212441, 211230, 209341, 207252, 205179, 203368, 202220, 201733, 201407, 200984, 200727, 200696, 200410, 199561, 198486, 197497, 196335, 194801, 193377, 192595, 192128, 191174, 189558, 187872, 186604, 185608, 184427, 182737, 180478, 177976, 175964, 175073, 175126, 175242, 174818, 174071, 173410, 172617, 171210, 169499, 168594, 169053, 170008, 170157, 169372, 168720, 168966, 169729, 170198, 170077, 169493, 168461, 166912]
57554A66912j827j530o03P29J967K478K124J500J102O00m41j484j578p86o8J56
57538A69251L05M38J3q23r58M8J006O45o87j627j659j409j476j723j698j170k65
57521A58211N78Q75N96K71M02R25J392J468J093M90J35M13J107J504J235O99M80
57504A71874O62R23J035R92Q48O21M01L68N88P27J14j438k881k663n91J621K286
57487A75487J645J079J099J087O60J14l40p38p35J14J407K142K049J789J840K047
57471A90746K218K241J704M53n97m46L49L19o67j340j313j615k558k885j846m73
57455A84290J32K76M23K5j148j830r39O26J238Q55O44J047J577K032K544K768
57439A94560K192J047N6m57m88J8P33Q32K12L4J074K320K408J702J579K187K441
$$ y = [166912, 165085, 163555, 162952, 163681, 165648, 168126, 170250, 171750, 172852, 173452, 173011, 171527, 169949, 169163, 169095, 169251, 169556, 169994, 170007, 169184, 168226, 168274, 169280, 169925, 169238, 167611, 165952, 164543, 163067, 161344, 159646, 158476, 158211, 158789, 159664, 160260, 160531, 160933, 161858, 163250, 164718, 165811, 166301, 166436, 166849, 167956, 169460, 170695, 171394, 171874, 172536, 173459, 174494, 175486, 176334, 176955, 177356, 177724, 178312, 179039, 179153, 177715, 174834, 172171, 171580, 173201, 175487, 177132, 178211, 179310, 180397, 181057, 181171, 180831, 180093, 179358, 179472, 180879, 183021, 185070, 186859, 188699, 190746, 192964, 195205, 196909, 197362, 196765, 196319, 196668, 196987, 196320, 194980, 193667, 192052, 189494, 186609, 184763, 184290, 184422, 184698, 185121, 185146, 183998, 182168, 181229, 181855, 183093, 183948, 184592, 185639, 187216, 189248, 191792, 194560, 196752, 197799, 197855, 197398, 196910, 196928, 197661, 198493, 198705, 198739, 199813, 202133, 204541, 206243, 207822, 210009, 212450]
57422B12450J885J107M67j36l58M04J740K366J780P64J02k03k50K10J128J902
57406B25358K086J908J826J997K225K095J357M85M65J534K589K626K157K286K924
57391B53918L107K810L037M066M862M580L673L169L589M826O310P154O782N654
57377C17537M742M345M046L782L970M533M757M395M017L964L797L194K633K722
57363C72434L395M178M693M715M240L864M436N989P471P968P662P280P084O907
57349D52316O796O996P467P889Q110Q301Q624Q981R175R197R300R688J0256J0703
57335E73799J0916J1015J1088J1114J1206J1463J1568J1142J0608J0944J2157
57324F97020J2881J2249J1428J2225J4615J6799J7530J7310J7233J7685J8483
$$ y = [212450, 214335, 215442, 215909, 215773, 215415, 215819, 217559, 219925, 221705, 222469, 222571, 222368, 222118, 222328, 223456, 225358, 227444, 229352, 231178, 233175, 235400, 237495, 238852, 239337, 239802, 241336, 243925, 246551, 248708, 250994, 253918, 257025, 259835, 262872, 266938, 271800, 276380, 280053, 283222, 286811, 291637, 297947, 305101, 311883, 317537, 322279, 326624, 330670, 334452, 338422, 342955, 347712, 352107, 356124, 360088, 363885, 367079, 369712, 372434, 375829, 380007, 384700, 389415, 393655, 397519, 401955, 407944, 415415, 423383, 431045, 438325, 445409, 452316, 459112, 466108, 473575, 481464, 489574, 497875, 506499, 515480, 524655, 533852, 543152, 552840, 563096, 573799, 584715, 595730, 606818, 617932, 629138, 640601, 652169, 663311, 673919, 684863, 697020, 709901, 722150, 733578, 745803, 760418, 777217, 794747, 812057, 829290, 846975, 865458]
57313H65458J9412K0198K0490K0295K0042K0058K0242K0358K0360K0395K0731
57302A088039K1571K2646K3294K3276K3242K3899K5078K6185K7206K8582L0390
57291A363408L2345L4347L6199L7164L6812L6081L6467L8112L9750M0528M0867
57280A772080M1310M1691M1849M2274M3378M4791M5816M6187M6078M5902M6260
57269B257616M7575M9528N1302N2514N3400N4160N4714N5174N5841N6646N7248
57258B845718N7724N8471N9414O0094O0559O1359O2486O3328O3660O3747O3307
57247C519867O1609N8988N7021N6516N6486N5849N5091N5201N5981N6571N7031
57236D146211N8156O0128O2494O5166O8315P1337P3083P3183P2285P0737O8034
$$ y = [865458, 884870, 905068, 925558, 945853, 965895, 985953, 1006195, 1026553, 1046913, 1067308, 1088039, 1109610, 1132256, 1155550, 1178826, 1202068, 1225967, 1251045, 1277230, 1304436, 1333018, 1363408, 1395753, 1430100, 1466299, 1503463, 1540275, 1576356, 1612823, 1650935, 1690685, 1731213, 1772080, 1813390, 1855081, 1896930, 1939204, 1982582, 2027373, 2073189, 2119376, 2165454, 2211356, 2257616, 2305191, 2354719, 2406021, 2458535, 2511935, 2566095, 2620809, 2675983, 2731824, 2788470, 2845718, 2903442, 2961913, 3021327, 3081421, 3141980, 3203339, 3265825, 3329153, 3392813, 3456560, 3519867, 3581476, 3640464, 3697485, 3754001, 3810487, 3866336, 3921427, 3976628, 4032609, 4089180, 4146211, 4204367, 4264495, 4326989, 4392155, 4460470, 4531807, 4604890, 4678073, 4750358, 4821095, 4889129]
57225D889129O3917N9325N5570N2953N0722M8288M6030M4741M4612M4990M5222
57214E445499M5397M6035M7140M7993M7969M7241M6470M6022M5778M5515M5304
57203E956363M5406M5878M6301M6035M4868M3232M1668M0229L8765L7529L7066
57192F423340L7611L9053M1438M5029M9777N5083O0149O4273O7023O8493O9335
57181G020604P0050P0432P0225P0198P1819P5810Q1549Q7907R4061R9506J03979
57170G916140J07588J10436J12139J12305J11417J10424J09572J08560J07909
57161H906490J09047J12691J18187J24897J33113J42882J52767J60594J64842
57152A0125510J64808J60300J52111J42132J32022J21984J11427J00294Q8946
$$ y = [4889129, 4953046, 5012371, 5067941, 5120894, 5171616, 5219904, 5265934, 5310675, 5355287, 5400277, 5445499, 5490896, 5536931, 5584071, 5632064, 5680033, 5727274, 5773744, 5819766, 5865544, 5911059, 5956363, 6001769, 6047647, 6093948, 6139983, 6184851, 6228083, 6269751, 6309980, 6348745, 6386274, 6423340, 6460951, 6500004, 6541442, 6586471, 6636248, 6691331, 6751480, 6815753, 6882776, 6951269, 7020604, 7090654, 7161086, 7231311, 7301509, 7373328, 7449138, 7530687, 7618594, 7712655, 7812161, 7916140, 8023728, 8134164, 8246303, 8358608, 8470025, 8580449, 8690021, 8798581, 8906490, 9015537, 9128228, 9246415, 9371312, 9504425, 9647307, 9800074, 9960668, 10125510, 10290318, 10450618, 10602729, 10744861, 10876883, 10998867, 11110294, 11210588, 11299534]
57143A1299534P7219O4614N1377L8695K7953K0204J5967J4793J5194J5579J5149
57132A1656278J3561J0228M638l024j2319k3344l6347n0777o5378p9048r0930
57121A1323538j00093j06212j10609j15649j22777j31687j41308j50683j58645
57112A0185875j63713j65119j63646j60980j58483j56604j54869j51792j45035
57103H765634j32056j10603p8710l4824K1452Q8835J64681K45517L27273M05964
57093I663163M79368N48365O16443O87842P65646Q49783R35176J012574J073483
57084A6631843J114639J136098J135418J107883J054259R83143Q98149P82781
57076B4844213O06285L51673L7960k87657n78758q10823r80483j093964j159436
$$ y = [11299534, 11376753, 11441367, 11492744, 11531439, 11559392, 11579596, 11595563, 11610356, 11625550, 11641129, 11656278, 11669839, 11680067, 11684705, 11681681, 11669362, 11646018, 11609671, 11558894, 11493516, 11414468, 11323538, 11223445, 11117233, 11006624, 10890975, 10768198, 10636511, 10495203, 10344520, 10185875, 10022162, 9857043, 9693397, 9532417, 9373934, 9217330, 9062461, 8910669, 8765634, 8633578, 8522975, 8444265, 8409441, 8430893, 8519728, 8684409, 8929926, 9257199, 9663163, 10142531, 10690896, 11307339, 11995181, 12760827, 13610610, 14545786, 15558360, 16631843, 17746482, 18882580, 20017998, 21125881, 22180140, 23163283, 24061432, 24844213, 25450498, 25802171, 25840131, 25552474, 24973716, 24162893, 23182410, 22088446, 20929010]
57067B0929010j184927j177023j140064j077859r95984r01595q01505p01138o04414
57058A2344501n13612m29745l53812k87250k30789j83664j44508j12172q5189
57049A0003760o1439l9435j9363k109J2192K4035L3784M1886M9145N5859O1315
57038A0159630O4877O7051O8732P0077P1037P2133P3594P4463P3833P2285P0519
57027A0938231O7022N9001M5943L0811J7405P782K501J736N084J1075J7898K4375
57015A1228864K9700L2810L2796K9918K5822K2696K2134K4400K8488L2930L6729
57004A1547287L9538M1351M2453M3523M5206M7454M9629N1334N2742N4076N5129
56993A2069722N5432N4557N2172M8203M3211L8380L4892L3156L2633L2289L1331
$$ y = [20929010, 19744083, 18567060, 17426996, 16349137, 15353153, 14451558, 13650053, 12948915, 12344501, 11830889, 11401144, 11047332, 10760082, 10529293, 10345629, 10201121, 10088949, 10003760, 9942321, 9902886, 9883523, 9881414, 9893606, 9917641, 9951425, 9993311, 10042456, 10098315, 10159630, 10224507, 10291558, 10360290, 10430367, 10501404, 10573537, 10647131, 10721594, 10795427, 10867712, 10938231, 11005253, 11064254, 11110197, 11141008, 11158413, 11166195, 11168696, 11170432, 11175516, 11186591, 11204489, 11228864, 11258564, 11291374, 11324170, 11354088, 11379910, 11402606, 11424740, 11449140, 11477628, 11510558, 11547287, 11586825, 11628176, 11670629, 11714152, 11759358, 11806812, 11856441, 11907775, 11960517, 12014593, 12069722, 12125154, 12179711, 12231883, 12280086, 12323297, 12361677, 12396569, 12429725, 12462358, 12494647, 12525978]
56982A2525978K9561K7074K3797J9674J5310J1941J0475J0757J2054J3860J5970
56971A2716451J8117K0039K1702K3118K4153K4813K5520K6624K7882K8735K9030
56960A2986184K9040K8917K8356K6745K3399J8000J1006L437l951j0985j7420
56949A3122728k2530k5713k7111k7133k5776k2960j9186j5317j1982r621q791
56938A2906608r815j2409j6128k0922k6643l2321l6670l9262m0777m2197m4263
56927A2585201m7493n2020n7339o2572o6993p0182p2026p2925p3675p4721p5832
56916A1859423p6903p8613q1669q5763q9806r2900r4519r4278r2309q9560q6833
56905A0896270q3774p9524p4251o9174o5213o2380o0417n9288n8964n9344o0490
$$ y = [12525978, 12555539, 12582613, 12606410, 12626084, 12641394, 12653335, 12663810, 12674567, 12686621, 12700481, 12716451, 12734568, 12754607, 12776309, 12799427, 12823580, 12848393, 12873913, 12900537, 12928419, 12957154, 12986184, 13015224, 13044141, 13072497, 13099242, 13122641, 13140641, 13151647, 13155084, 13151133, 13140148, 13122728, 13100198, 13074485, 13047374, 13020241, 12994465, 12971505, 12952319, 12937002, 12925020, 12915399, 12906608, 12896793, 12884384, 12868256, 12847334, 12820691, 12788370, 12751700, 12712438, 12671661, 12629464, 12585201, 12537708, 12485688, 12428349, 12365777, 12298784, 12228602, 12156576, 12083651, 12009976, 11935255, 11859423, 11782520, 11703907, 11622238, 11536475, 11446669, 11353769, 11259250, 11164972, 11072663, 10983103, 10896270, 10812496, 10732972, 10658721, 10589547, 10524334, 10461954, 10401537, 10342249, 10283285, 10223941, 10163451]
56894A0163451o2426o4731o6823o8448o9489o9641o8961o8389o9012p0961p3784
56883I410786p7565q2715q8791r4441r8653j01337j02694j02790j01701r9475
56873H460624r5985r1440q6774q2728p8848p4271o9217o4662o0750n6747n2601
56862G646601m9271m7312m6332m6199m7708n1627n7882o5978p5220q4229r1257
56851F983586r5508r7396r7318r5169r1421q7518q4426q1722p8727p5628p2792
56840F025961o9884o6616o3674o1922o1089o0106n8425n6388n4826n5140n9362
56829E358529o8859q2663r7646j10644j20232j26572j30082j30663j28073j22818
56819D240277j16247j09623j03185r6490q9421q2442p6004p0228o5219o1031n7324
$$ y = [10163451, 10101025, 10036294, 9969471, 9901023, 9831534, 9761893, 9692932, 9624543, 9555531, 9484570, 9410786, 9333221, 9250506, 9161715, 9067274, 8968621, 8867284, 8764590, 8661800, 8560099, 8460624, 8364639, 8273199, 8186425, 8103697, 8024849, 7950578, 7881361, 7816699, 7755949, 7699202, 7646601, 7597330, 7550018, 7503686, 7457487, 7409779, 7358152, 7300270, 7234292, 7159072, 7074843, 6983586, 6888078, 6790682, 6693364, 6598195, 6506774, 6419256, 6334830, 6253108, 6174381, 6098753, 6025961, 5956077, 5889461, 5825787, 5763865, 5702776, 5642670, 5584245, 5527857, 5473031, 5417891, 5358529, 5289670, 5207007, 5109361, 4998717, 4878485, 4751913, 4621831, 4491168, 4363095, 4240277, 4124030, 4014407, 3911222, 3814732, 3725311, 3642869, 3566865, 3496637, 3431418, 3370387, 3313063]
56808C313063n3617n0063m7564m7159m9765n6171o6224p7920q8305r5669j00138
56797B580468j01986j00589r5693q8677q1499p4939o8675o2561n6953n2009m7529
56786A749358m3508m0178l7510l5025l2136k8544k4586k1489k0917k3704k9027
56775A412734l5121m0697m5408m9211n1760n2610n1755m9758m7254m4468m1372
56764I03320l8266l5740l3919l2227l0257k8392k7075k5948k4477k2981k2125
56753E81913k1698k0872j9521j8216j7061j5618j4047j3102j2813j2334j1437
56742D05194j0938j1140j1106j0137q967q633q973q990q160o720n213m261m242
56729B97714m767m975m684m473m457l970k959k545l402m546m700m057l747m100
$$ y = [3313063, 3259446, 3209383, 3161819, 3114660, 3064895, 3008724, 2942500, 2864580, 2776275, 2680606, 2580468, 2478482, 2377893, 2282200, 2193523, 2112024, 2037085, 1968410, 1905849, 1848896, 1796887, 1749358, 1705850, 1665672, 1628162, 1593137, 1561001, 1532457, 1507871, 1486382, 1465465, 1441761, 1412734, 1377613, 1336916, 1291508, 1242297, 1190537, 1137927, 1086172, 1036414, 989160, 944692, 903320, 865054, 829314, 795395, 763168, 732911, 704519, 677444, 651496, 627019, 604038, 581913, 560215, 539343, 519822, 501606, 484545, 468927, 454880, 441778, 428965, 416631, 405194, 394256, 383116, 372010, 361873, 352906, 344273, 335300, 326310, 318150, 311430, 306217, 301956, 297714, 292947, 287972, 283288, 278815, 274358, 270388, 267429, 264884, 261482, 256936, 252236, 248179, 244432, 240332]
56715B40332m521m555m202l480k519j810j728j992k148k246k504k752k704k427
56701B00744k116j850j854k376k959k619j254n7J01j64O1N29N14J92K23M71K43
56684A87829n18j144j207q19l12r6m36q92o33K13L84o39j601j279l83l19r13q28
56666A76407K45J320J770J843J654R53j9n63n54m12k15K53O70M89J0J12Q59J408
56648A86230J271P77K54k94o50m34J98O24O20M33J47k59m51j05L97N29N90J070
56630A90947J371M10j524k832k684j905j542j664j889k049j942j309m75k92j046
56615A71575k025k408j982j007l2J71o56j595j523p14m20q99j038k49N92O03J59
56598A58552j4j9l27q11j052j040r23m82N04J670K320K102J247L36J4M80J207
$$ y = [240332, 235811, 231256, 227054, 223574, 221055, 219245, 217517, 215525, 213377, 211131, 208627, 205875, 203171, 200744, 198628, 196778, 194924, 192548, 189589, 186970, 185716, 185659, 185760, 185596, 185657, 186186, 186700, 186892, 187115, 187586, 187829, 187311, 186167, 184960, 184141, 183829, 183733, 183297, 182405, 181772, 181985, 182369, 181730, 180129, 178850, 178467, 178148, 177235, 176407, 176652, 177972, 179742, 181585, 183239, 184192, 184173, 183610, 183056, 182644, 182429, 182682, 183352, 183841, 183851, 183963, 184822, 186230, 187501, 188278, 188532, 188238, 187588, 187154, 187352, 187976, 188596, 189029, 189176, 188917, 188466, 188361, 188758, 189287, 189877, 190947, 192318, 192728, 191204, 188372, 185688, 183783, 182241, 180577, 178688, 176639, 174697, 173388, 172913, 172621, 171575, 169550, 167142, 165160, 164153, 164121, 164292, 163636, 162041, 160518, 159804, 159384, 158485, 157447, 157198, 157790, 158393, 158552, 158538, 158519, 158192, 157381, 156329, 155289, 154366, 153884, 154388, 156058, 158378, 160480, 161727, 162063, 162077, 162557, 163764]
56581A63764J434J005L37k34o09n67mO05P71Q95J691K799L046K216J391J273J330
56564A81143J053R30J507K382K961L432M280N376O166O302N609L971J797n4j228
56549B25627k231l394m151l902k923j835q09Q5L31l64j328j633j295j054j245
56534A99879j509j488j213q71o21n33m00J69J088J605J203L79L4L07N28K28l27
56517A98458n78k87K97O54L85l63j004j176j124j238j406j164m23L20N73M13K82
56500A92619L23J65m00q40l95P62J483J044J7o62r29j184j223n48M78Q58L30l18
56482A91580m68l01l2N14J253J524R96K48kK03L12J00j82j76K69R73J506J603
56464A99920J417J071K29j274k622k628j240L03R49P59L40Q5K19Q18J512J735
$$ y = [163764, 165198, 166203, 166540, 166306, 165697, 165130, 165126, 165731, 166502, 167397, 169088, 171887, 174933, 177149, 178540, 179813, 181143, 182196, 183126, 184633, 187015, 189976, 193408, 197688, 203064, 209230, 215532, 221141, 225112, 226909, 226855, 225627, 223396, 220002, 215851, 211949, 209026, 207191, 206382, 206467, 206798, 206434, 205106, 203473, 202178, 201124, 199879, 198370, 196882, 195669, 194798, 194177, 193644, 193244, 193413, 194501, 196106, 197309, 197688, 197722, 198029, 198557, 198785, 198458, 197880, 197593, 197890, 198544, 198929, 198566, 197562, 196386, 195262, 194024, 192618, 191454, 191031, 191351, 191924, 192337, 192619, 192942, 193107, 192707, 191867, 191472, 192234, 193717, 194761, 194778, 194116, 193187, 192003, 190780, 190232, 190710, 191568, 191898, 191580, 191112, 190811, 190779, 191293, 192546, 194070, 195066, 195314, 195312, 195515, 195827, 195927, 195745, 195569, 195838, 196811, 198317, 199920, 201337, 202408, 202637, 201363, 198741, 196113, 194873, 195176, 196125, 196884, 197224, 197309, 197528, 198346, 199858, 201593]
56448B01593J477J226J156R62O27N59Q69J151J180J093Q04J24n04k69O97J197
56432B13942N14o95j336j042j37P70R80K74n39m61K84O23M15N57J139R77l50j486
56414B14429j185m1O70P78Q48Q67M60k10p50j232j704j655p92K04N43M79P06J154
56396B13569J237R11O75P81J158J792K530K844K404J691J501K081L041L724L508
56381B43447K256P86K06N12O34Q2l71j05L66L86K00K36L00K43M66J069J360J038
56363B53111Q41J205J351P02J01M27J007Q24M12R96K363L154K884K253J716J159
56347B74506P83J006J507J588J390J668K420K829K590K297K465K990L613M172
56333C05824M437M318M111M045L917L637L578L796L635K803K106K169K312J790
$$ y = [201593, 203070, 204296, 205452, 206414, 207041, 207600, 208469, 209620, 210800, 211893, 212697, 212821, 212317, 212048, 212745, 213942, 214456, 213761, 212425, 211383, 211246, 212016, 212996, 213270, 212731, 212270, 212554, 213177, 213592, 214149, 215288, 216265, 215915, 214429, 213244, 213203, 213873, 214651, 215499, 216366, 216826, 216616, 215866, 214634, 212930, 211275, 210483, 210687, 211230, 211709, 212415, 213569, 214806, 215717, 216392, 217173, 218331, 220123, 222653, 225497, 227901, 229592, 231093, 233174, 236215, 239939, 243447, 245703, 246489, 246695, 247207, 247841, 247923, 247552, 247447, 247813, 248199, 248399, 248635, 248935, 249178, 249644, 250713, 252073, 253111, 253952, 255157, 256508, 257210, 257311, 257738, 258745, 259569, 259981, 260977, 263340, 266494, 269378, 271631, 273347, 274506, 275289, 276295, 277802, 279390, 280780, 282448, 284868, 287697, 290287, 292584, 295049, 298039, 301652, 305824, 310261, 314579, 318690, 322735, 326652, 330289, 333867, 337663, 341298, 344101, 346207, 348376, 350688, 352478]
56319C52478J335K048L469M221M105M008M051L537K624K373K997L489L316L159
56305C97210L642M412M904N030M878M539M462N090O102O729O892P150P659P985
56291D76684P996P988P973P725P481P750Q416Q916R212R756J0595J1395J2246
56278E94133J3457J4707J5368J5539J5796J6097J6031J6028J7054J9028K0757
56267G73995K1648K2397K3728K5439K7032K8446K9857L1442L3568L6582M0315
56256A094449M4281M8353N2716N7399O2425O8156P4795Q1916Q9102R6503J04011
56245A874106J10688J15988J20747J25677J29609J30715J28836J24986J19087
56236B980439J10009R7570Q2603O5283M5251K3423J723j9095l9477n8885p5631
$$ y = [352478, 353813, 355861, 359330, 363551, 367656, 371664, 375715, 379252, 381876, 384249, 387246, 390735, 394051, 397210, 400852, 405264, 410168, 415198, 420076, 424615, 429077, 434167, 440269, 446998, 453890, 461040, 468699, 476684, 484680, 492668, 500641, 508366, 515847, 523597, 532013, 540929, 550141, 559897, 570492, 581887, 594133, 607590, 622297, 637665, 653204, 669000, 685097, 701128, 717156, 734210, 753238, 773995, 795643, 818040, 841768, 867207, 894239, 922685, 952542, 983984, 1017552, 1054134, 1094449, 1138730, 1187083, 1239799, 1297198, 1359623, 1427779, 1502574, 1584490, 1673592, 1770095, 1874106, 1984794, 2100782, 2221529, 2347206, 2476815, 2607530, 2736366, 2861352, 2980439, 3090448, 3188018, 3270621, 3335904, 3381155, 3404578, 3406301, 3387206, 3347729, 3288844, 3213213]
56225C213213q9207j00634j10034j15967j18059j18260j18315j17695j15210j11033
56215B098799j05918r9800r2601q5351p9128p3683o8232o2839n8058n3883n0018
56204A269288m6593m3687m0816l7588l4356l1548k8889k5977k3011k0418j8255
56193I18150j6466j5231j4595j4235j3800j3034j1545r266p121o239o340o040
56181G84238m935m146m383m730m076k582j047K65J357J919J874J875K444L166
56167G71239L323K972K848L443M581N622O083O261P049Q708J0207J0569J0310
56154H53215J0673J1838J3061J4205J5711J7385J8731K0289K3031K6581K9715
56143A054435L2637L6798M2397M7981N2923N8053O3311O6882O7674O6718O4939
$$ y = [3213213, 3124006, 3023372, 2913338, 2797371, 2679312, 2561052, 2442737, 2325042, 2209832, 2098799, 1992881, 1893081, 1800480, 1715129, 1636001, 1562318, 1494086, 1431247, 1373189, 1319306, 1269288, 1222695, 1179008, 1138192, 1100604, 1066248, 1034700, 1005811, 979834, 956823, 936405, 918150, 901684, 886453, 871858, 857623, 843823, 830789, 819244, 809978, 802857, 796618, 790278, 784238, 779303, 775157, 770774, 766044, 761968, 759386, 758339, 758604, 759961, 761880, 763754, 765629, 768073, 771239, 774562, 777534, 780382, 783825, 788406, 794028, 800111, 806372, 813421, 822129, 832336, 842905, 853215, 863888, 875726, 888787, 902992, 918703, 936088, 954819, 975108, 998139, 1024720, 1054435, 1087072, 1123870, 1166267, 1214248, 1267171, 1325224, 1388535, 1455417, 1523091, 1589809, 1654748]
56132A654748O1403N5143M7332M0117L4445L0166K7226K5354K3349J9888J4674
56121B033845Q258J396m929r750j3032j5762j8910k3029k8805l6618m5330n2746
56109A794588n7649o0220o0480n7934n3044m7345m1620l5420k8833k3017j8553
56098A310473j4831j1533r069p180m865k183k91P67K321M611O157O246O072O593
56084A293288P309P882Q954J0463J1223J1012J1106J2000J2723J3072J4152J5966
56072A429150J6950J6855J7440J9275K0553K0296K0012K0791K1544K1629K2400
56061A646895K4444K6101K6474K7156K9086L0637L0830L1472L3846L6154L6785
56050A979880L7245L9204M1355M2116M2790M5021M7504M8377M8758N0808N4214
$$ y = [1654748, 1716151, 1771294, 1818626, 1858743, 1893188, 1923354, 1950580, 1975934, 1999283, 2019171, 2033845, 2042103, 2043499, 2038570, 2028820, 2015788, 2000026, 1981116, 1958087, 1929282, 1892664, 1847334, 1794588, 1736939, 1676719, 1616239, 1558305, 1505261, 1457916, 1416296, 1380876, 1352043, 1329026, 1310473, 1295642, 1284109, 1275040, 1267860, 1262995, 1260812, 1260521, 1261288, 1263609, 1268220, 1274377, 1280623, 1286695, 1293288, 1300597, 1308479, 1317433, 1327896, 1339119, 1350131, 1361237, 1373237, 1385960, 1399032, 1413184, 1429150, 1446100, 1462955, 1480395, 1499670, 1520223, 1540519, 1560531, 1581322, 1602866, 1624495, 1646895, 1671339, 1697440, 1723914, 1751070, 1780156, 1810793, 1841623, 1873095, 1906941, 1943095, 1979880, 2017125, 2056329, 2097684, 2139800, 2182590, 2227611, 2275115, 2323492, 2372250, 2423058, 2477272]
56039B477272N7515O1018O5448O9638P2480P5268P9390Q3615Q6465Q9211R3599
56028C310919R8718J03053J07598J13896J21043J27632J34671J43534J53095J61768
56018D575927J70197J79111J87022J93101J99655K08552K17914K25658K33345
56009F390482K42837K52236K59207K65437K73701K83428K93487L06170L23697
56000H890682L43583L62256L80545M00869M21860M40813M58497M76453M92594
55991A2668152N04897N16283N30419N45954N60758N78126O02259O31011O59733
55982A7797592O88905P21051P53916P84526Q16666Q56521R04156R57145J018657
55973B5299135J093297J178816J271203J374153J493990J629636J778327J947225
$$ y = [2477272, 2534787, 2595805, 2661253, 2730891, 2803371, 2878639, 2958029, 3041644, 3128109, 3217320, 3310919, 3409637, 3512690, 3620288, 3734184, 3855227, 3982859, 4117530, 4261064, 4414159, 4575927, 4746124, 4925235, 5112257, 5305358, 5505013, 5713565, 5931479, 6157137, 6390482, 6633319, 6885555, 7144762, 7410199, 7683900, 7967328, 8260815, 8566985, 8890682, 9234265, 9596521, 9977066, 10377935, 10799795, 11240608, 11699105, 12175558, 12668152, 13173049, 13689332, 14219751, 14765705, 15326463, 15904589, 16506848, 17137859, 17797592, 18486497, 19207548, 19961464, 20745990, 21562656, 22419177, 23323333, 24280478, 25299135, 26392432, 27571248, 28842451, 30216604, 31710594, 33340230, 35118557, 37065782]
55965C7065782K148612K388228K669867L005685L408444L878944M415465N029922
55957F4010949N739958O553772P481578Q553124R800851J1231786J2834511J4592901
55949A40799430J6452636J8278474J9864704K0929229K0998090J9338100J5246027
55942B71906690Q649434M66811p732769j4525804j9194198k1704980k2383997
55935A95481187k1678476k0070789j8006037j5810574j3679359j1724850j0008050
55928H4503052q539101p294275o248501n382342m667814m071460l571676l157137
55920D1570746k811020k512333k250734k025723j832624j662038j511023j382168
55912B5583083j272361j173419j082769j003374r34092q69828q10090p58228p13021
$$ y = [37065782, 39214394, 41602622, 44272489, 47278174, 50686618, 54565562, 58981027, 64010949, 69750907, 76304679, 83786257, 92339381, 102140232, 113372018, 126206529, 140799430, 157252066, 175530540, 195395244, 216324473, 237322563, 256660663, 271906690, 280556124, 281022935, 273290166, 258764362, 239570164, 217865184, 195481187, 173802711, 153731922, 135725885, 119915311, 106235952, 94511102, 84503052, 75963951, 68669676, 62421175, 57038833, 52371019, 48299559, 44727883, 41570746, 38759726, 36247393, 33996659, 31970936, 30138312, 28476274, 26965251, 25583083, 24310722, 23137303, 22054534, 21051160, 20117068, 19247240, 18437150, 17678922, 16965901]
55903A6965901o69742o28584n93545n63663n33720n03215m76624m54740m33411
55894A2108657m11162l90878l73267l55384l36539l19619l05549k91858k77548
55885I046853k64445k53097k42089k31820k24482k19819k15092k09418k04141
55876F982450j99015j92122j83614j75602j68360j60481j52537j46698j42737
55867E461284j38242j32707j27762j23473j18085j11467j05351j00273r5511r1669
55857D316744q9934q9227q7509q5362q4712q4696q2724p9203p7035p6573p5277
55846C404492p2517p0456o9723o8295o5615o3789o3648o3110o0779n7950n5821
55835B692789n3675n1051m8901m7451m5405m2441m0049l8974l8123l6876l6145
$$ y = [16965901, 16296159, 15667575, 15074030, 14510367, 13976647, 13473432, 12996808, 12542068, 12108657, 11697495, 11306617, 10933350, 10577966, 10241427, 9921808, 9616259, 9324401, 9046853, 8782408, 8529311, 8287222, 8055402, 7830920, 7611101, 7396009, 7186591, 6982450, 6783435, 6591313, 6407699, 6232097, 6063737, 5903256, 5750719, 5604021, 5461284, 5323042, 5190335, 5062573, 4939100, 4821015, 4709548, 4604197, 4503924, 4408413, 4316744, 4226810, 4137583, 4050074, 3964712, 3880000, 3795304, 3712580, 3633377, 3556342, 3479769, 3404492, 3331975, 3261519, 3191796, 3123501, 3057886, 2994097, 2930449, 2867339, 2806560, 2748610, 2692789, 2639114, 2588063, 2539162, 2491711, 2446306, 2403865, 2363816, 2324842, 2286719, 2249843, 2213698]
55824B213698l6301l6333l5907l6134l7392l8435l8444l8055l7749l7086l6076
55813A805786l5274l4274l2104k9492k8374k8719k8208k5805k3248k2164k1955
55802A496169k1609k1470k1912k2055k1140j9809j8944j8393j7708j7008j6491
55791A279630j6068j5873j6081j6115j5231j3911j3293j3337j3182j3144j4499
55780A118896j7148j9457k0671k1603k2596k2724k1440j9378j7050j4321j1441
55769I11067r016o886m752l853n995j0752j5645j9283k2146k4158k4067k1935
55757G42579j9756j8687j7773j6304j5245j5245j5335j4748j4198j4218j3987
55746E67083j2937j1860j1331j0674r471q424p786o655m864l796m189m896n010
$$ y = [2213698, 2177397, 2141064, 2105157, 2069023, 2031631, 1993196, 1954752, 1916697, 1878948, 1841862, 1805786, 1770512, 1736238, 1704134, 1674642, 1646268, 1617549, 1589341, 1563536, 1540288, 1518124, 1496169, 1474560, 1453090, 1431178, 1409123, 1387983, 1368174, 1349230, 1330837, 1313129, 1296121, 1279630, 1263562, 1247689, 1231608, 1215493, 1200262, 1186351, 1173058, 1159721, 1146539, 1133395, 1118896, 1101748, 1082291, 1061620, 1040017, 1017421, 994697, 973257, 953879, 936829, 922508, 911067, 902051, 895165, 890413, 886560, 880565, 869813, 854168, 834885, 812739, 788581, 764514, 742579, 722823, 704136, 686363, 670059, 654814, 639569, 624234, 609486, 595288, 581070, 567083, 554146, 542286, 530955, 520281, 510810, 502386, 494600, 487945, 483081, 479285, 475096, 470200, 465190]
55733D65190n377o716p943p940p422p483p740p412o957p055p179o685o178o344
55719C66759o513n866n034m980n198m585l254k108j289m32K50L78K15mq47k573
55703C24919m130m477m181m474n450o365p074p839q343q090p351o714o206n724
55689B38501n586n730n203l565j966j627k052k024j538j410j560j258o15m27q39
55674B03101j356j913k704l301l138k552k303k334k142j930k157k393j916j149
55660A71813j147j761j739o66M72Q59Q06Q35Q54N58k1o87j211j256p53k46k82
55643A66428n71m63QK92L60N87P39L6j555k994l438l231l222l660m059l950l471
55626A37836l179l339l445k812j631r32j230j868k027j760j461j028l30L9o00
$$ y = [465190, 459813, 453097, 445154, 437214, 429792, 422309, 414569, 407157, 400200, 393145, 385966, 379281, 373103, 366759, 360246, 354380, 349346, 344366, 339168, 334583, 331329, 329221, 327932, 327500, 327750, 328128, 328343, 328339, 327492, 324919, 320789, 316312, 312131, 307657, 302207, 295842, 288768, 280929, 272586, 264496, 257145, 250431, 244225, 238501, 232915, 227185, 221982, 218417, 216451, 214824, 212772, 210748, 209210, 207800, 206240, 204982, 204367, 203940, 203101, 201745, 199832, 197128, 193827, 190689, 188137, 185834, 183500, 181358, 179428, 177271, 174878, 172962, 171813, 170666, 168905, 167166, 166500, 166972, 167831, 168637, 169472, 170326, 170884, 170863, 170176, 168965, 167709, 166956, 166710, 166428, 165857, 165394, 165402, 165694, 166054, 166641, 167380, 167416, 165861, 162867, 159429, 156198, 152976, 149316, 145257, 141307, 137836, 134657, 131318, 127873, 125061, 123430, 122498, 121268, 119400, 117373, 115613, 114152, 113124, 112794, 112833, 112233]
55611A12233j888k740k651k071j641j673k102k443k051r55j01k31r21j290j223
55596H8252j155j185j086r17q32o15j10K36k5n75q86j036j244j107l40K76j81
55579G7470j241j578q80%N64J098J593J525R41N97P51P74L04k18m57p20j191j448
55561G7884j196p99o72p09n99k45K75P02N35l89j327j399q65p27r84n37R13K095
55543G1956J945J087P13Q14N73j20n47k86M12J207J853J951J237J68m11k64J8
55526H2306j47o89j176j389j399j379j378j299j053q50j101j869k524k334j373
55511F2346n39n36j066j252o82J56N77N04M54P50J045P93K4n93m99J34O58P24
55493F2998N83O36Q93J038Q73N18J68k1J36P34J388J394N22o21j315j527j555
$$ y = [112233, 110345, 107605, 104954, 102883, 101242, 99569, 97467, 95024, 92973, 92018, 91917, 91686, 90765, 89475, 88252, 87097, 85912, 84826, 83909, 83077, 82462, 82352, 82588, 82563, 81988, 81102, 80066, 78822, 77715, 77375, 77651, 77470, 76229, 74651, 73771, 73771, 74335, 75433, 77026, 78551, 79492, 80089, 80840, 81614, 81918, 81700, 81243, 80523, 79332, 77884, 76688, 75889, 75217, 74508, 73909, 73664, 73939, 74641, 75176, 74787, 73460, 72061, 71196, 70469, 69485, 68948, 69861, 71956, 73901, 74988, 75701, 76515, 77088, 76968, 76421, 76135, 76547, 77754, 79607, 81558, 82795, 82963, 82552, 82288, 82306, 82159, 81470, 80294, 78905, 77506, 76127, 74749, 73450, 72397, 71547, 70446, 68577, 66053, 63719, 62346, 61807, 61271, 60205, 58953, 58271, 58427, 59004, 59508, 59962, 60712, 61757, 62550, 62574, 61981, 61482, 61616, 62274, 62998, 63581, 64217, 65110, 66148, 67021, 67539, 67707, 67686, 67822, 68556, 69944, 71338, 71860, 71239, 69924, 68397, 66842]
55476F6842j356p47r0N2j95k02Q2rp09j308j051l6J027J395O06j088k488k436
55458E8289j269m59n75o59K8P47N56j76n02l66l20l70j77P2Pj11J55N15M59K93
55438E6137O04J031P02k27o60j88M13M86K60J22J8j12r2l0l85j150j558r26M59
55419E4904J629J797R53j23m99J2P04R84J032J121R06J51m20m9O71N23m22q98
55401F2976m60r8n51j253j435j210r66n98MM19L59K32M61P80P47N18M84N96N16
55382F1521K45M5M9J86L60M56M02L57N35P72O48J12m81r81j552k069k057j463
55364E7085r03q29j005j025q53n62j11L39M70L89O29J239J494R18Rm83m69k46
55346E6086R0M57N08J34j83m4J92n7p29j275j365r67o9J103J917J927J430R37
$$ y = [66842, 65486, 64739, 64649, 64701, 64506, 64304, 64386, 64377, 63668, 62360, 61309, 61273, 62300, 63695, 64301, 63213, 60725, 58289, 57020, 56561, 55986, 55327, 55355, 56102, 56658, 56482, 55980, 55614, 55294, 54924, 54747, 54819, 54826, 54715, 54870, 55385, 55844, 56137, 56741, 57772, 58474, 58247, 57587, 57399, 57812, 58298, 58558, 58680, 58698, 58586, 58494, 58464, 58079, 56929, 55371, 54445, 54904, 56533, 58330, 59283, 59160, 58661, 58673, 59377, 60361, 61393, 62514, 63420, 63571, 63151, 63102, 63773, 64296, 63874, 62976, 62516, 62418, 61867, 60614, 59179, 57969, 57003, 56405, 56409, 56828, 57187, 57419, 57880, 58660, 59407, 59925, 60409, 61005, 61521, 61766, 61811, 61860, 62046, 62406, 62862, 63264, 63621, 64156, 64928, 65576, 65688, 65207, 64226, 62674, 60605, 58548, 57085, 56182, 55353, 54348, 53323, 52470, 51908, 51797, 52136, 52606, 52995, 53624, 54863, 56357, 57275, 57284, 56801, 56332, 56086, 56176, 56633, 57141, 57275, 57092, 57048, 57240, 57183, 56454, 55179, 53814, 52847, 52778, 53881, 55798, 57725, 59155, 60092]
55328F0092L89n21j501j814j183p6Q56J193Q20P8k93J01P20P65K62o9O3J87k6
55309F0043k20J9N19Q45Q94Q41P23M65K21K90P02J085J095Q21N95M44rr38j810
55290F6625j787o79P59J620J658J211N94j03p55j066q61l35R3J62j6k06m10q60
55272F5644j543j973j671q45k63l61p30o22J43J013J400J335J273J336J066J60
55256F5362q55j141o68k32k24j04N53J174R69J31m93o03n93o73p01p41j009j297
55238E8855j128n62j12J12M42Q20P61K64n8Rl9m51p37n11o8K49N56Q32N60m43
55218E9351j469j715j139r8J173K231K275J131j30l36L68R17P80L40M0n5OJ71
55200F3841K50J37N1J82L10J63m2J12O03J031J163J013O00L9l61m41m75p34j038
$$ y = [60092, 60481, 59960, 58459, 56645, 55462, 55386, 56242, 57435, 58255, 58333, 58040, 58141, 58861, 59626, 59888, 59819, 59882, 60069, 60043, 59823, 59842, 60361, 61206, 62100, 62941, 63664, 64129, 64350, 64640, 65342, 66427, 67522, 68343, 68938, 69382, 69373, 68435, 66625, 64838, 64159, 64918, 66538, 68196, 69407, 70001, 69898, 69143, 68077, 67216, 66881, 66974, 67136, 67120, 66914, 66504, 65644, 64101, 62128, 60457, 59612, 59349, 58988, 58258, 57636, 57779, 58792, 60192, 61527, 62800, 64136, 65202, 65362, 64507, 63366, 62698, 62466, 62242, 62138, 62691, 63865, 64834, 64965, 64472, 63869, 63276, 62603, 61902, 61161, 60152, 58855, 57727, 57165, 57053, 57165, 57607, 58427, 59188, 59452, 59394, 59403, 59364, 58913, 58176, 57665, 57597, 57846, 58402, 59234, 59794, 59351, 57882, 56167, 55028, 54930, 56103, 58334, 60609, 61740, 61610, 61274, 61642, 62559, 63339, 63679, 63719, 63664, 63670, 63841, 64091, 64228, 64279, 64461, 64771, 64934, 64892, 65004, 65607, 66638, 67801, 68814, 69414, 69453, 69092, 68651, 68176, 67442, 66404]
55181F6404j061p85k99M67J337J652R88j15p22n91j95P3J54L5k05k51N7L19J15
55162F7377k88l34j0K93N23R07J278J245Q99P10P20N22K6m30o68q02o78NR98J520
55142G3813J181L53m15q31o86n9L31k55j367j663p23K71J92m94n57K36J035J204
55124G1566Q64K91m44j123j311q40k3P20J146J130O83J76P7L71M67no24o76p2
55105G2373O21R22Q72O64K91k38o44o71l96nN57J286J688J168o5r76p79K65J249
55086G8182J479R03Qm96k09N44J086J129Q74M61p1l51O4P53O04o56j812j644m07
55067H0441P55J319J472J242N26k65m58l8L53L27P2j74l53l95k71k35m48n69k35
55048H3066K39K63j46m60m97m64l62o5J38j61p00q56o59o87j023j186j067r49
$$ y = [66404, 65343, 64558, 64259, 64726, 66063, 67715, 68703, 68588, 67866, 67275, 67080, 67153, 67307, 67342, 67137, 66886, 66943, 67262, 67377, 67089, 66755, 66745, 67038, 67561, 68468, 69746, 70991, 71890, 72600, 73320, 73842, 73868, 73438, 72770, 71968, 71290, 71295, 72293, 73813, 74994, 75347, 74932, 74101, 73415, 73356, 73687, 73432, 72065, 70402, 69679, 69950, 70142, 69648, 69091, 69327, 70362, 71566, 72430, 72721, 72277, 71154, 69843, 69003, 68980, 69700, 70846, 71976, 72659, 72835, 72912, 73283, 73750, 73745, 73121, 72445, 72373, 72994, 73916, 74788, 75452, 75743, 75505, 74861, 74190, 73794, 73789, 74346, 75632, 77320, 78488, 78423, 77447, 76668, 76933, 78182, 79661, 80564, 80572, 80076, 79867, 80411, 81497, 82626, 83500, 83961, 83890, 83539, 83603, 84356, 84960, 84304, 82492, 80848, 80441, 81196, 82515, 83987, 85229, 85755, 85490, 85032, 84994, 85347, 85674, 85746, 85572, 85219, 84824, 84553, 84318, 83870, 83301, 83066, 83305, 83568, 83422, 82962, 82465, 82001, 81639, 81574, 81712, 81551, 80851, 79995, 79336, 78649, 77626, 76440, 75373, 74424]
55030G4424o45L07J423J477L30n77j81Q42J344J281J172R12K18l77j73M47N35
55013H2759M8k01N2K12L4J0L15K66n79j482j371k85P31J009R06R84J140R71N81
54994H6100M52N45K51n62j054n10N43R81N65O8RJ14O2n4j36l18m46j23N01O09
54974H7597j17r14r37l06L19O47O60K84k74l43L15R15O27k48p94p90o64m80Q1
54955H5578Q65J265J136Q92O94K84l04o69p26q05r00o45j16J01j04j10L31O23
54937H7390L73J51N36J048Q85K50O5O18J260J415J164Q10M94L83O98J345J887
54920A00772K058K037K088K155J985J552J198J395K283L361L836L411K544J751
54906A32426R77Oq68j216j337j910k800l055k363j696j938k578k544j799j268
$$ y = [74424, 73779, 74086, 75509, 76986, 77316, 76739, 76558, 77400, 78744, 80025, 81197, 82109, 82327, 81950, 81777, 82224, 82759, 82807, 82606, 82658, 82870, 82904, 82914, 83229, 83495, 82916, 81434, 80063, 79778, 80509, 81518, 82424, 83408, 84548, 85519, 86100, 86552, 87097, 87348, 86786, 85732, 85222, 85765, 86746, 87311, 87379, 87388, 87502, 87564, 87510, 87374, 87056, 86610, 86487, 86988, 87597, 87480, 86566, 85629, 85323, 85642, 86289, 86949, 87233, 86959, 86616, 86931, 87846, 88473, 88225, 87431, 86641, 85977, 85497, 85578, 86443, 87708, 88844, 89736, 90430, 90714, 90410, 89741, 89015, 88210, 87310, 86665, 86549, 86650, 86546, 86436, 86767, 87390, 87763, 87914, 88450, 89498, 90383, 90633, 90698, 91316, 92576, 93991, 95155, 95965, 96459, 96842, 97540, 98885, 100772, 102830, 104867, 106955, 109110, 111095, 112647, 113845, 115240, 117523, 120884, 124720, 128131, 130675, 132426, 133403, 133409, 132541, 131325, 129988, 128078, 125278, 122223, 119860, 118164, 116226, 113648, 111104, 109305, 108037]
54891A08037j375j564j296p72l77j03K07M64N04L60J78P9L26J185K427L232K932
54874A14444J761O88N34J319K300K673K356K057K321K720K431J511Q65Q30N33
54859A39343q48k796m069m198l763l420l306l291l228k941k397j953j994k349
54845I8790k406j855r39o7N27P42O16M10L70L79J29m07q53q71m42J48M24J3q58
54826I3850j332q55K8K95k36p64o74k31M1J06K12L66M24M37N22N07M9q43j582
54807I0320j488n10O37J182J057P36M37l4n35m30M31J140R15K99L68J030J121
54790I6676K09p55q34k45K54M05L24L2l71m49O5P56R97P75O34Q93J226J147P05
54771A02444N88J344K534L007K294J324J257J988K497K374K083J835J319O79P49
$$ y = [108037, 106662, 105098, 103802, 103030, 102653, 102550, 102757, 103221, 103725, 104085, 104263, 104342, 104668, 105853, 108280, 111512, 114444, 116205, 116893, 117427, 118746, 121046, 123719, 126075, 128132, 130453, 133173, 135604, 137115, 137980, 138810, 139343, 138495, 135699, 131630, 127432, 123669, 120249, 116943, 113652, 110424, 107483, 105086, 103133, 101139, 98790, 96384, 94529, 93590, 93523, 94050, 94792, 95408, 95818, 96188, 96567, 96696, 96289, 95436, 94565, 94123, 94271, 94695, 94708, 93850, 92518, 91663, 91691, 91986, 91750, 90986, 90312, 90081, 90122, 90228, 90440, 90806, 91230, 91667, 92189, 92696, 92745, 91902, 90320, 88832, 88322, 88959, 90141, 91198, 91934, 92371, 92337, 91802, 91372, 91803, 92943, 93858, 94157, 94525, 95555, 96676, 96885, 96130, 95296, 95051, 95305, 95710, 96034, 96066, 95695, 95246, 95311, 96067, 97064, 97839, 98473, 99366, 100592, 101739, 102444, 103032, 104376, 106910, 109917, 112211, 113535, 114792, 116780, 119277, 121651, 123734, 125569, 126888, 127567, 128316]
54756A28316J818L067L688L760L493K499O09j315k279k429k630l164l624l775
54742A28034l721l396k601j553p74n02n93q75j178j229r81q11r33r02k77N40P73
54725A09021M36L03P89J480J840J822J683J683K015K576K837K393J692J685K626
54710A34881L607L505K076N2j575k295k329k287k495k733k684k383k026j668j414
54695A20232j576k144k404j746o25j08m83r73r29n79m02l81k92k35m66q80j191
54678A04818j399j708k001j740o89N12P93j04j183j281m68J31m9l37j6N00L92
54661I6171j45r9Q40J783J808J048L20J28K93L18l2m55m24J23N96N06P6k49n85
54642A02021j224j743j337j20P29M20n20j133j179r25l36P98K125K800K393J332
$$ y = [128316, 130134, 133201, 136889, 140649, 144142, 146641, 147250, 145935, 143656, 141227, 138597, 135433, 131809, 128034, 124313, 120917, 118316, 116763, 115989, 115487, 114894, 114019, 112841, 111612, 110631, 109820, 108887, 107985, 107708, 108248, 109021, 109457, 109760, 110549, 112029, 113869, 115691, 117374, 119057, 121072, 123648, 126485, 128878, 130570, 132255, 134881, 138488, 141993, 144069, 144121, 142546, 140251, 137922, 135635, 133140, 130407, 127723, 125340, 123314, 121646, 120232, 118656, 116512, 114108, 112362, 111737, 111629, 111146, 110173, 109244, 108665, 108263, 107882, 107590, 107355, 106889, 106009, 104818, 103419, 101711, 99710, 97970, 97281, 97793, 98586, 98482, 97299, 96018, 95550, 95681, 95632, 95295, 95279, 95779, 96171, 96026, 95927, 96767, 98550, 100358, 101406, 101726, 101854, 102147, 102465, 102433, 101978, 101554, 101677, 102273, 102779, 102855, 102606, 102021, 100797, 99054, 97717, 97597, 98326, 98746, 98226, 97093, 95914, 94989, 94653, 95451, 97576, 100376, 102769, 104101]
54626A04101L61j37k55k95m78p73q77m66L47R11O24l69j158j026k32L51L20O8
54608A01017O3K25K29L8j61k07L0N78J052Q38k2n96k34M47L85l61p09r2P86R06
54588A04212K6j244k004j675m64O93J020P22M66L21j12p06p47o0O51Q05N67K18
54570A02689l72j126j368o38N17J168J098P67N31M30M48M95K70l33q19n75K75
54553A03457R72J107J058J296J656J580R06O8m82p57r54r25l12P25J395J105J88
54536A12083n99r78j128j015l67P11J622J871J428N35l62o64j25O74R30O38L93
54519A15647K25m22j415j705q77k9l52j443j919j218q9N59N21J26j76r1K64M07
54501A08013J11l03n13o47q01n84J83Q26N57l20p98o07l67l70j57M67R13P65N50
$$ y = [104101, 104462, 104325, 104070, 103775, 103297, 102524, 101647, 101181, 101528, 102439, 103063, 102694, 101536, 100510, 100278, 100629, 100949, 101017, 101080, 101305, 101534, 101572, 101411, 101204, 101234, 101812, 102864, 103702, 103680, 103084, 102850, 103297, 103682, 103321, 102612, 102520, 103306, 104212, 104238, 102994, 100990, 99315, 98851, 99544, 100564, 101286, 101752, 102073, 101961, 101255, 100508, 100448, 101099, 101904, 102471, 102689, 102317, 101191, 99823, 99185, 99702, 100870, 101968, 102735, 103266, 103696, 104144, 104639, 104909, 104576, 103757, 103182, 103457, 104429, 105536, 106594, 107890, 109546, 111126, 112032, 112100, 111618, 110861, 109907, 108982, 108670, 109395, 110790, 111895, 112083, 111484, 110506, 109378, 108363, 107996, 108707, 110329, 112200, 113628, 114163, 113801, 113137, 113012, 113686, 114616, 115254, 115647, 115872, 115450, 114035, 112330, 111453, 111424, 111072, 109629, 107710, 106492, 106403, 106962, 107483, 107609, 107433, 107342, 107606, 108013, 108124, 107821, 107308, 106661, 105860, 105276, 105459, 106285, 106842, 106522, 105724, 105117, 104750, 104380, 104223, 104690, 105603, 106368, 106918]
54482A06918R17J511J382L18q13j108o08o6M1j3K53O92O09k24r86p09M47J352
54464A09913J432J324J744K271J915O00o30r58o92n93p71p44l50k2q4k71j95K3
54446A13912jk53l24j29j05n25r56p85o5N71P47P11P32N77r3r46j110k00J058
54427A12816J549J002K03n8J64L10J65k7q1p2m6M4Q8q7k99r5O33J438J901K065
54407A21613K034J580N64m76p47j88M72O70O17O93O89J26p90j125l88O69Q89J91
54389A27093m04k25K14J89o7J28O61P34K02p8M62J207J181L31m90n70n8L01o0
54370A30751r16j338o15Q84K092K432K177J730J184P56R15J643K148J847J166
54355A46856Q81J139J661K368L141L397K719J678J120Q56n2j733l219l793l768
$$ y = [106918, 107835, 109346, 110728, 111046, 110233, 109125, 108517, 108451, 108492, 108479, 108732, 109424, 110033, 109809, 108823, 108114, 108561, 109913, 111345, 112669, 114413, 116684, 118599, 119199, 118569, 117611, 116919, 116326, 115555, 114811, 114461, 114439, 114355, 114084, 113889, 113912, 113911, 113658, 113334, 113205, 113100, 112575, 111619, 110834, 110769, 111340, 112087, 112798, 113530, 114107, 114014, 113068, 111958, 111758, 112816, 114365, 115367, 115570, 115512, 115676, 115986, 116151, 116124, 116043, 115971, 115925, 115969, 116057, 115970, 115671, 115576, 116209, 117647, 119548, 121613, 123647, 125227, 125791, 125315, 124568, 124380, 124852, 125522, 126139, 126832, 127521, 127647, 126857, 125732, 125344, 126013, 126902, 127093, 126689, 126464, 126678, 126867, 126800, 126928, 127589, 128323, 128525, 128447, 128909, 130116, 131297, 131628, 131138, 130568, 130510, 130811, 130751, 129835, 128497, 127882, 128766, 130858, 133290, 135467, 137197, 138381, 139137, 140052, 141695, 143843, 145690, 146856, 147737, 148876, 150537, 152905, 156046, 159443, 162162, 163840, 164960, 165816, 165764, 164031, 160812, 157019, 153251]
54340A53251l646l383k872k467k422k397k021j502j143p01J16Q54P32k51j291
54325A30857j829j997j992j645r02j56K88O37J111J345Q23k20q98p22m8N32P71
54308A25955N85j23j106j602j139k12L02L10M59J028J487J358Q56M06o2p66j407
54291A26329j399p22r4j24o15q07k33P95J461J259M39k64m10k01o7j50k84k94
54273A24619j41J61N89J057J429J578J461J133O96K35j57k94p3K66K63j35l39
54256A32348J54J010J413J060L63j80m22l94j82QJ18M08R63J153L29j037j696
54239A35416j234n20l38m53l73k29k98l55j04K20K87K41L56N05M52K19j79q21
54221A32792j367j136j48N96M79J25K38M38J22k65l4L70J4q89j279r20n19l30
$$ y = [153251, 149605, 146222, 143350, 140883, 138461, 136064, 134043, 132541, 131398, 130697, 130813, 131667, 132399, 132148, 130857, 129028, 127031, 125039, 123394, 122492, 122336, 122624, 123261, 124372, 125717, 126540, 126320, 125422, 124700, 124652, 125184, 125955, 126540, 126417, 125311, 123709, 122570, 122358, 122660, 122970, 123429, 124457, 125944, 127302, 128158, 128564, 128502, 127736, 126329, 124930, 124208, 124114, 123990, 123375, 122568, 122335, 123130, 124591, 125850, 126289, 126025, 125615, 125414, 125347, 125197, 124913, 124619, 124478, 124639, 125228, 126285, 127714, 129292, 130753, 131886, 132582, 132817, 132660, 132366, 132293, 132559, 132822, 132687, 132348, 132502, 133512, 134925, 135985, 136348, 136168, 135746, 135352, 135170, 135178, 135296, 135704, 136667, 137820, 138149, 137112, 135416, 134182, 133662, 133324, 132871, 132498, 132269, 131971, 131616, 131512, 131732, 132019, 132260, 132616, 133121, 133573, 133792, 133613, 132792, 131425, 130289, 130141, 130737, 131216, 131341, 131579, 132017, 132139, 131874, 131840, 132210, 132224, 131335, 130056, 129136, 128617, 128287]
54203A28287J04P99J160J042R15Q47L95l29o56n45p02j235j368p67j03J08J62
54186A28114K45pn10m46L05O55po14m5J000R98j29r90o99K67J054J304R93K86
54167A31774l85o61o70o77m78K34J082J276O76p6m56n82p81j079j269j082l45
54150A26501P38J466J271M07l13m41j96N8J37m2m12n81k33K92L11j61k45N66J572
54131A30695J658P06l06n22o2L89M36J73j70m48m80j08M44N73j6p20n70O09J877
54112A34158K247J806J471J777K246K052J026j90r02j044j009j031r29m88K14
54097A41404Q61J117P80O3l09K51J289J597P15m00o89l16m8J36P47J498J512Q25
54079A51033N07J007J452J052K87J26Q01J939L179M121M284L779L458L844M317
$$ y = [128287, 128391, 129190, 130350, 131392, 132307, 133154, 133549, 133220, 132564, 132019, 131317, 130082, 128714, 127947, 127844, 127952, 128114, 128359, 128352, 127842, 127396, 127701, 128356, 128349, 127735, 127690, 128690, 129688, 129559, 128569, 127870, 128137, 129191, 130495, 131488, 131774, 131389, 130728, 130058, 129381, 128903, 129137, 130219, 131495, 132171, 132095, 131639, 131057, 130276, 129197, 127928, 126846, 126501, 127239, 128705, 129976, 130383, 130070, 129629, 129433, 129491, 129628, 129586, 129174, 128593, 128360, 128652, 128963, 128802, 128557, 129123, 130695, 132353, 133059, 132753, 132231, 132169, 132558, 132994, 133167, 132997, 132549, 132069, 131961, 132405, 132978, 132962, 132242, 131672, 132281, 134158, 136405, 138211, 139682, 141459, 143705, 145757, 146783, 146593, 145691, 144647, 143638, 142607, 141678, 141190, 141404, 142265, 143382, 144162, 144225, 143916, 144167, 145456, 147053, 147768, 147368, 146679, 146363, 146315, 146451, 147198, 148696, 150208, 151033, 151540, 152547, 153999, 155051, 155338, 155464, 156265, 158204, 161383, 165504, 169788, 173567, 177025, 180869, 185186]
54064A85186L936K587Q46q16k108k725k651k342k089j676j089q75j243j419o99
54049A72823M28J009R49P75O51N80J081K492L934M170L337K715K831L053K990
54034B03818L083L534L865L871L981M203L810K509J123M76L75K16j29n40j053
54019B33142j499j376o85k31n63j167j345j273j517k054k447k606k608k216j385
54004B10170q39j288k266k600j939j013m05N4N54P43L47k61m86k55j1j27n77r99
53986A98802j067q59p89j063j353j337j301j748k497k721k020r71l87m79r17j332
53970A77961j474j129l10O58J390J709J577J006L09P7N38J204J480J496J792K361
53954A90645K512J889J002N32N29P14J135J946K775K978K547K260K697L624M497
$$ y = [185186, 189122, 191709, 192555, 191739, 189631, 186906, 184255, 181913, 179824, 178148, 177059, 176184, 174941, 173522, 172823, 173251, 174260, 175209, 175984, 176635, 177215, 178296, 180788, 184722, 188892, 192229, 194944, 197775, 200828, 203818, 206901, 210435, 214300, 218171, 222152, 226355, 230165, 232674, 233797, 234273, 234648, 234864, 234735, 234195, 233142, 231643, 230267, 229582, 229351, 228788, 227621, 226276, 225003, 223486, 221432, 218985, 216379, 213771, 211555, 210170, 209331, 208043, 205777, 203177, 201238, 200225, 199820, 199874, 200428, 201171, 201518, 201257, 200771, 200516, 200505, 200378, 199801, 198802, 197735, 196876, 196087, 195024, 193671, 192334, 191033, 189285, 186788, 184067, 182047, 181076, 180689, 180210, 179293, 177961, 176487, 175358, 175048, 175706, 177096, 178805, 180382, 181388, 181697, 181774, 182312, 183516, 184996, 186492, 188284, 190645, 193157, 195046, 196048, 196580, 197109, 197823, 198958, 200904, 203679, 206657, 209204, 211464, 214161, 217785, 222282]
53939B22282N095N364N124M387L696L579L830L868L670L736M188M557M629M857
53925B82862N563O252O303N900N731N837N465M139K360R74K29k20o02p18l75J87
53909C29887N41N63M88M01j5r86k126k694k439j923j831k239k700k913k988l159
53893C05867l444l707l887m031m217m472m856n481o358p139p126n880l833k159
53879B39277j778k539l432l562k825j827j283j401j759j822j618j648k109k497
53865B09177k290j708j437j693k024k032j793j552j409j424j594j541p65N23J220
53850A89658M88j177k450k583j880r35o7N35O53L50L0k7L7l4j79p7N03J463K352
53831A86660K526J737N22k55l69m01p95j204j068m47J43M34N53O28O94Q32J033
$$ y = [222282, 227377, 232741, 237865, 242252, 245948, 249527, 253357, 257225, 260895, 264631, 268819, 273376, 278005, 282862, 288425, 294677, 300980, 306880, 312611, 318448, 323913, 328052, 330412, 331386, 331615, 331395, 330793, 330075, 329700, 329887, 330428, 330991, 331479, 331880, 331865, 330879, 328753, 326059, 323620, 321697, 319866, 317627, 314927, 312014, 309026, 305867, 302423, 298716, 294829, 290798, 286581, 282109, 277253, 271772, 265414, 258275, 251149, 245269, 241436, 239277, 237499, 234960, 231528, 227966, 225141, 223314, 222031, 220630, 218871, 217049, 215431, 213783, 211674, 209177, 206887, 205179, 203742, 202049, 200025, 197993, 196200, 194648, 193239, 191815, 190221, 188680, 187915, 188438, 189658, 190146, 188969, 186519, 183936, 182056, 181121, 181054, 181589, 182242, 182592, 182622, 182595, 182632, 182598, 182419, 182342, 182845, 184308, 186660, 189186, 190923, 191445, 191190, 190821, 190420, 189625, 188421, 187353, 186906, 187049, 187483, 188036, 188664, 189358, 190190, 191223]
53814A91223J024O48K68M29J160K005K665L222L713L942L794L389K877K349J935
53799B24643J718J556J344J336J824K508K722K285J676J281J017P44N72M86K39
53784B45951j76l94k95k64o25j199j731k283k908l388l584l646l615l332k940
53769B15571k912l175k922j810p23o17j228j629j583j467j314q76m14m01o29n07
53753A93364j89m09j175j619j289o80k70N9M14N62N69Q79J376J242K35o64n43
53736A91862K45P77Q53Q32P27L19j66k76o4Q6J52M14Q38J106J141J059P75K30
53718B00910j47J38Q59J326J413J629K108K299J909J438J444J776J974J989K052
53703B23117K153K129K069K188K368K268J859J502J423J455J377J232J120R12
$$ y = [191223, 192247, 192895, 193163, 193592, 194752, 196757, 199422, 202644, 206357, 210299, 214093, 217482, 220359, 222708, 224643, 226361, 227917, 229261, 230597, 232421, 234929, 237651, 239936, 241612, 242893, 243910, 244654, 245226, 245712, 245951, 245775, 245381, 245086, 244822, 244197, 242998, 241267, 238984, 236076, 232688, 229104, 225458, 221843, 218511, 215571, 212659, 209484, 206562, 204752, 204029, 203412, 202184, 200555, 198972, 197505, 196191, 195315, 194901, 194500, 193871, 193364, 193175, 192766, 191591, 189972, 188683, 188003, 187733, 187792, 188206, 188768, 189337, 190216, 191592, 192834, 193069, 192405, 191862, 192107, 192884, 193737, 194569, 195296, 195615, 195449, 195173, 195109, 195195, 195347, 195761, 196599, 197705, 198846, 199905, 200680, 200910, 200763, 200901, 201760, 203086, 204499, 206128, 208236, 210535, 212444, 213882, 215326, 217102, 219076, 221065, 223117, 225270, 227399, 229468, 231656, 234024, 236292, 238151, 239653, 241076, 242531, 243908, 245140, 246260, 247172]
53689B47172M83Q5K18R78J773J837J022j24r64j331j430j388j106n41L5K01j82
53672B46738q15j274j468j615j778j680j090k26M76Q77J144J306J166P26L27K15
53656B43029K72L22M40O85Q36O80L65J59L7j17n3N72J517K006J656R47N68P30
53638B54651J236J943K659K919K362J304N01K77L49M84R13J802K722L057K789
53623B79968K506K654L121L505L567L393L286L543M095M477M316L837L544L510
53609C29322L370L043K980L474M170M498M259L561K523J397O28L66J72l76j041
53594C62346j362j401j562j770j532p67n8O0l69r79j453j595j454j376j561j652
53578C43515j260p33p67j243j326q28n24p21n30P40K236K627J997J566J844K085
$$ y = [247172, 247655, 247740, 247958, 248936, 250709, 252546, 253568, 253444, 252480, 251149, 249719, 248331, 247225, 246684, 246719, 246920, 246738, 245923, 244649, 243181, 241566, 239788, 238108, 237018, 236792, 237268, 238145, 239289, 240595, 241761, 242487, 242814, 243029, 243301, 243623, 244063, 244748, 245584, 246264, 246629, 246788, 246825, 246708, 246655, 247227, 248744, 250750, 252406, 253353, 253921, 254651, 255887, 257830, 260489, 263408, 265770, 267074, 267575, 267852, 268201, 268685, 269598, 271400, 274122, 277179, 279968, 282474, 285128, 288249, 291754, 295321, 298714, 302000, 305543, 309638, 314115, 318431, 322268, 325812, 329322, 332692, 335735, 338715, 342189, 346359, 350857, 355116, 358677, 361200, 362597, 363225, 363591, 363763, 363387, 362346, 360984, 359583, 358021, 356251, 354719, 353952, 353894, 353954, 353585, 352606, 351153, 349558, 348104, 346728, 345167, 343515, 342255, 341522, 340755, 339512, 338186, 337358, 336834, 336113, 335583, 336323, 338559, 341186, 343183, 344749, 346593, 348678]
53562C48678J670R43M85L07K31L72P55R88Q57Q87J700K999L757L479K754K406
53546C73268K549K753K933L471M514N560O016N914N707N599N401N073M929N258
53532D38945O044P187Q531R623R862R313Q883R269J0052J0365J0220J0469J1495
53519E60258J2642J3100J2870J2563J2717J3613J5307J7384J8928J9229J8520
53508G27131J7717J7411J7429J7332J7006J6632J6339J6082J5749J5204J4362
53497I08394J3350J2541J2251J2419J2691J2779J2593J2124J1464J0917J0816
53486A042339J1080J1254J1119J0950J0945J0700R700Q193P029O523N953M401
53474A150186J812r32k868l695l874m169n019o236p336q078q568q953r265r550
$$ y = [348678, 350348, 351291, 351776, 352083, 352314, 352686, 353441, 354429, 355286, 356173, 357873, 360872, 364629, 368108, 370862, 373268, 375817, 378570, 381503, 384974, 389488, 395048, 401064, 406978, 412685, 418284, 423685, 428758, 433687, 438945, 444989, 452176, 460707, 470330, 480192, 489505, 498388, 507657, 517709, 528074, 538294, 548763, 560258, 572900, 586000, 598870, 611433, 624150, 637763, 653070, 670454, 689382, 708611, 727131, 744848, 762259, 779688, 797020, 814026, 830658, 846997, 863079, 878828, 894032, 908394, 921744, 934285, 946536, 958955, 971646, 984425, 997018, 1009142, 1020606, 1031523, 1042339, 1053419, 1064673, 1075792, 1086742, 1097687, 1108387, 1118087, 1126280, 1133309, 1139832, 1145785, 1150186, 1151998, 1151066, 1148198, 1144503, 1140629, 1136460, 1131441, 1125205, 1117869, 1109791, 1101223, 1092270, 1083005, 1073455]
53460A073455r872j0164j0347j0558j1029j1687j2188j2396j2479j2463j2042
53449I48230j1022r685q524p815p468p080o106m353k337q15R6R02J818K482K714
53434H91037K970L651M546N352O197P165P851P976Q067Q858J0344J1886J3102
53421I89002J4051J4801J5345J5821J6316J6701J7077J8021J9823K1837K3236
53410A182031K4043K4746K5302K5471K5837K7296K9540L1186L1642L1824L2636
53399A491554L3772L4510L4843L5153L5470L5679L5943L6306L6295L5478L4057
53388A879060L2461L0799K9160K7867K6869K5379K2877K0035J7813J5950J3256
53377B141526R363N257J941p27l553o986j0911j4973j8780k2066k4964k7936l1124
$$ y = [1073455, 1063583, 1053419, 1043072, 1032514, 1021485, 1009798, 997610, 985214, 972735, 960272, 948230, 937208, 927523, 918999, 911184, 903716, 896636, 890530, 886177, 883840, 883025, 883121, 884023, 885841, 888323, 891037, 894007, 897658, 902204, 907556, 913753, 920918, 928769, 936745, 944812, 953670, 964014, 975900, 989002, 1003053, 1017854, 1033199, 1049020, 1065336, 1082037, 1099114, 1117135, 1136958, 1158795, 1182031, 1206074, 1230820, 1256122, 1281593, 1307430, 1334726, 1364266, 1395452, 1427094, 1458918, 1491554, 1525326, 1559836, 1594679, 1629832, 1665302, 1700981, 1736924, 1773230, 1809525, 1845003, 1879060, 1911521, 1942320, 1971480, 1999347, 2026216, 2051595, 2074472, 2094507, 2112320, 2128270, 2141526, 2150889, 2156146, 2158087, 2157360, 2153807, 2146821, 2135910, 2120937, 2102157, 2080091, 2055127, 2027191, 1996067]
53364A996067l3941l5570l5812l5368l5201l5660l6138l5653l3941l1931l0887
53353A615965l1019l1222l0341k8433k6594k5646k5389k5073k4307k3243k2119
53342A322579k0964j9759j8554j7257j5549j3384j1372j0280j0053r761q697p238
53330A159711o374o600p567q655r434r634r093q016p016o563o446o018n047m071
53316A059177l729l860l570k280m61R19J492J770K358L271M175M955N759O624
53302A076600P345P781Q096Q685R841J1533J3400J4979J5989J6401J6287J5711
53290A222648J4803J3805J2900J2010J0897R483Q040O895N979M756K762K04k247
53277A322935m291o390r053j1925j3996j4677j4445j4322j4997j6471j8292j9912
$$ y = [1996067, 1962126, 1926556, 1890744, 1855376, 1820175, 1784515, 1748377, 1712724, 1678783, 1646852, 1615965, 1584946, 1553724, 1523383, 1494950, 1468356, 1442710, 1417321, 1392248, 1367941, 1344698, 1322579, 1301615, 1281856, 1263302, 1246045, 1230496, 1217112, 1205740, 1195460, 1185407, 1175646, 1166949, 1159711, 1153337, 1146737, 1139170, 1130515, 1121081, 1111447, 1102354, 1094338, 1087322, 1080759, 1074313, 1068295, 1063248, 1059177, 1055448, 1051588, 1048018, 1045738, 1045277, 1046196, 1047688, 1049458, 1051816, 1055087, 1059262, 1064217, 1069976, 1076600, 1083945, 1091726, 1099822, 1108507, 1118348, 1129881, 1143281, 1158260, 1174249, 1190650, 1206937, 1222648, 1237451, 1251256, 1264156, 1276166, 1287063, 1296546, 1304586, 1311481, 1317460, 1322216, 1324978, 1325182, 1322935, 1318644, 1312254, 1303201, 1291276, 1277280, 1262603, 1248158, 1233836, 1218839, 1202368, 1184076, 1164164]
53265A164164k0953k1361k1304k1016k0761k0806k1168k1457k1241k0570j9848
53254I33679j9260j8671j8131j8012j8417j8837j8627j7679j6399j5255j4521
53243G39870j4177j3840j3102j2145j1659j1871j1996j1119r396p847p157p146
53231F08415p312p334p029o392n828n889o532p138p413p859q961j0308j1010j0771
53217D98639j0097r541r189q919q672q353p780o986o383o328o717p153p415p502
53203C87604p340o799o062n644n883o537p082p251p053o444n313l849k638k257
53189C07452k804l833m616m530l493k134j360j520k097k310j914j301r60j104
53175B73476j679k468l075l086k470j742j516j833k118j858j217p29o05n49l33
$$ y = [1164164, 1143211, 1121850, 1100546, 1079530, 1058769, 1037963, 1016795, 995338, 974097, 953527, 933679, 914419, 895748, 877617, 859605, 841188, 822351, 803724, 786045, 769646, 754391, 739870, 725693, 711853, 698751, 686606, 674947, 663076, 651080, 639961, 630565, 622718, 615561, 608415, 601103, 593769, 586740, 580348, 574520, 568631, 562099, 554961, 547548, 539689, 530728, 520420, 509410, 498639, 488542, 479001, 469812, 460893, 452221, 443868, 436088, 429102, 422719, 416391, 409674, 402521, 395106, 387604, 380264, 373465, 367403, 361759, 355876, 349339, 342257, 335006, 327953, 321509, 316196, 312347, 309709, 307452, 304648, 300815, 296199, 291669, 288176, 286042, 284682, 283162, 281065, 278755, 276841, 275540, 274580, 273476, 271797, 269329, 266254, 263168, 260698, 258956, 257440, 255607, 253489, 251631, 250414, 249685, 249080, 248531, 248198]
53160B48198j58l20p65j231j559j645j305n89m6j89p56j004p47o23j123j898k304
53143B31936k198j813j245n09P5J28j61j83K59O72N81J92O2L02M81K47j94m24
53125B28208l27j33J1J79M07O02P65R73J039N58m09j081q33k5N17O18O25M96j29
53106B32061r12r31j57K05n84j562j441n18j76p93j346j066m69l91q10j127j035
53089B18948o34o8M95P49N55K77L73O85N06m97j661j957j188k19J18k0N3L94L75
53070B17284k33q48r60q53r34j008p12l02k95o44r04j050j370j693j441n29M71
53053B03979J105J384J334Q66K73Q8K16r6j059j730j179J57R09L31j004j927j723
53036B01924n88O40J204J025N40M7m77r14q90l13L63O70O12M23K55K47M81O81
$$ y = [248198, 248040, 247720, 246955, 245724, 244165, 242520, 241215, 240626, 240580, 240391, 239635, 238631, 237884, 237261, 236138, 234240, 231936, 229738, 227925, 226680, 226171, 226246, 226374, 226213, 226030, 226289, 226961, 227542, 227734, 227796, 228098, 228579, 228826, 228632, 228208, 227881, 227748, 227759, 227938, 228345, 228947, 229712, 230685, 231724, 232282, 231873, 230792, 229959, 229934, 230451, 231069, 231694, 232190, 232061, 231149, 230218, 230061, 230266, 229682, 228120, 226679, 226161, 225985, 225192, 223846, 222780, 222311, 221920, 221110, 219983, 218948, 218314, 218246, 218741, 219490, 220045, 220322, 220695, 221380, 221886, 221389, 219728, 217771, 216583, 216364, 216482, 216462, 216515, 216909, 217284, 217051, 216203, 215243, 214390, 213456, 212448, 211736, 211434, 211139, 210495, 209591, 208541, 207171, 205478, 204037, 203508, 203979, 205084, 206468, 207802, 208668, 208941, 209029, 209245, 209149, 208090, 206360, 205181, 205338, 206247, 206578, 205574, 203647, 201924, 201336, 201976, 203180, 204205, 204745, 204792, 204315, 203401, 202511, 202198, 202561, 203231, 203843, 204266, 204521, 204768, 205249, 205930]
53018B05930M65J16M03J256J457L11j117j363n96j35l23k48M38Q24L56j22K55
53001B07907R29Q23O8l11j24k65j140j831j365j23O58N08J56L26P34O31pl87N9
52982B07246R91J664J747J387Q90O00Q63J590K069J724R75P75J320J765J416N87
52966B27609N5Q9M18P33Q82P61M12O7j10k22l81n56q06j279j778j787j225p91
52948B22091j038j538j518j011p00q27j016j032j002q47l12L83N89K48O5M37Q25
52931B13797O61J94n2j11k90m61l72k72n53r59q97m65m39j072j623j334l99L66
52913B05719N46M37N20Q45J052Q51M07J40J08o4n72j005r13n06l70o36r08r36
52895B04715q53o98k60M57J039J174R59N86J07k87j91M47J050J021M35j90n29
$$ y = [205930, 206395, 206511, 206914, 208170, 209627, 209938, 208821, 207458, 206862, 206727, 206404, 206156, 206594, 207418, 207774, 207652, 207907, 208836, 209659, 209727, 209416, 209292, 209027, 207887, 206056, 204691, 204568, 205226, 205734, 205890, 206216, 206950, 207581, 207574, 207187, 207246, 208237, 209901, 211648, 213035, 213925, 214525, 215388, 216978, 219047, 220771, 221746, 222521, 223841, 225606, 227022, 227609, 227664, 227753, 228171, 228904, 229786, 230547, 230959, 231026, 230916, 230694, 230313, 229757, 228951, 227672, 225894, 224107, 222882, 222091, 221053, 219515, 217997, 216986, 216286, 215459, 214443, 213411, 212409, 211562, 211250, 211633, 212222, 212470, 212535, 212972, 213797, 214458, 214652, 214600, 214489, 214199, 213738, 213366, 213094, 212541, 211582, 210685, 210220, 209781, 208709, 207086, 205752, 205353, 205719, 206265, 206702, 207222, 208067, 209119, 209970, 210377, 210517, 210625, 210561, 209989, 208984, 208071, 207565, 207195, 206559, 205651, 204715, 203862, 203164, 202904, 203361, 204400, 205574, 206533, 207119, 207226, 206939, 206748, 207195, 208245, 209266, 209701, 209511, 208982]
52878B08982n97m46j04L32P98J293J627J417O70J39N00J356J627J005L66N40J115
52861B20620J044R9q24q74j76N65R40R12L74p31j866k150j482q79j195j926j889
52844B10562q88P4J85l24q76j358j829k043j818j449j279j134p05k28k23p12j159
52827A94796j159p40q2O54J235J415J174O16k01j112j711j694j256p96m09L7N02
52810A91269Q84J314J803J898J282N45N51J087J052J49n96l82J45p4j004j811
52794A98112k144k266k207j742j079p45p11l84L83R37Q05M12M22P88R27N75N6
52777A92139j94l6L93Q17J024J033J050J071P83J1q71j276j016l93K19N40L56
52760A95650k88q61p87j42M43O37O98Q46Q63O43N38P37P86L60N4O52J840K507
$$ y = [208982, 208385, 207939, 207835, 208167, 208965, 210258, 211885, 213302, 213972, 214111, 214611, 215967, 217594, 218599, 218965, 219505, 220620, 221664, 221763, 220939, 220065, 219889, 220454, 221394, 222306, 222680, 221949, 220083, 217933, 216451, 215572, 214377, 212451, 210562, 209674, 209748, 209933, 209609, 208733, 207375, 205546, 203503, 201685, 200236, 198957, 197823, 197118, 196890, 196667, 195955, 194796, 193637, 192897, 192815, 193469, 194704, 196119, 197293, 197909, 197708, 196596, 194885, 193191, 191935, 191139, 190730, 190767, 191269, 192153, 193467, 195270, 197168, 198450, 198995, 199546, 200633, 201685, 201834, 201238, 200856, 201001, 200927, 199923, 198112, 195968, 193702, 191495, 189753, 188674, 187929, 187218, 186834, 187217, 188154, 188959, 189371, 189793, 190581, 191508, 192083, 192139, 191945, 191909, 192302, 193119, 194143, 195176, 196226, 197297, 198080, 198091, 197220, 195944, 194928, 194535, 194754, 195294, 195650, 195362, 194501, 193714, 193572, 194015, 194652, 195350, 196196, 197059, 197702, 198240, 198977, 199763, 200123, 200177, 200829, 202669, 205176]
52742B05176K255J710J266N45n50j203q02K0K70K4J46Q75J567J713J498J211P99
52725B16520J95m20q39j030j025r68j195j872k500k378j588r97j069j248q31J7
52709A98772N74N80L88K88J61j20l79l68r1K74O87J243J881K248K001J196K48
52692B09583m90r16r35l70O75J618J835J283M22l07o87o37l12j97o67j384j559
52675B06955q65K07R42R97M62l22q44p38j77L26N55P56J107J431J539J483J326
52658B15140J039P33N88M59J4n38m26N73J614J820J407J139J101P22j78j125j697
52641B22385j883j674j051l98k83n99n54J39P56O23J74L09J055J576J421J024
52625B23020Q92Q92O66L27K61M92N95K46l79q18q25o09o26j045j432j206m52K2
$$ y = [205176, 207431, 209141, 210407, 210952, 210402, 209199, 208397, 208417, 208687, 208711, 208857, 209732, 211299, 213012, 214510, 215721, 216520, 216715, 216295, 215456, 214426, 213401, 212433, 211238, 209366, 206866, 204488, 202900, 201903, 200834, 199586, 198755, 198772, 199346, 199926, 200314, 200602, 200763, 200643, 200264, 199896, 199805, 200079, 200766, 202009, 203890, 206138, 208139, 209335, 209583, 209093, 208177, 207242, 206872, 207547, 209165, 211000, 212283, 212705, 212398, 211711, 211074, 210762, 210565, 209898, 208514, 206955, 206090, 206297, 207239, 208236, 208698, 208376, 207532, 206794, 206617, 206943, 207498, 208254, 209361, 210792, 212331, 213814, 215140, 216179, 216912, 217500, 217959, 217973, 217435, 217009, 217582, 219196, 221016, 222423, 223562, 224663, 225385, 225207, 224082, 222385, 220502, 218828, 217777, 217379, 217096, 216497, 215943, 216082, 216838, 217461, 217635, 217944, 218999, 220575, 221996, 223020, 223912, 224804, 225470, 225797, 226058, 226550, 227145, 227391, 227012, 226194, 225369, 224760, 224134, 223089, 221657, 220451, 219999, 220021]
52607B20021l00q76p76N5P37O78K74K13N30P58O37L17L0j00J8L52O71P76P00N28
52587B25243J91l37q06r49q23o31l60O4M50N17L06J09P5J85M23P03P31M04J22
52568B25617L15P34P44K20l15m74l78k16O2M88Q66R51O09j63j077j583j468j217
52550B23715j294j319o80K73N61P1k89o7J28j53l65K5N81O48M20M78P91Q94O82
52531B25100L83Q6j51p2L58O72N57M21O68R56P56L06K08M07L67N3m8J97L68J69
52511B31761k17m18p7J041K579L527L226K191J330P12r9q65q87l00r4p06j527
52494B41177j942j965j610o94M47Q83K95n64r96j185j397j243m02N39Q31N90M29
52477B33193M91N64P46J198J526J266P23N58O40K84m44o11J18Q79Q93N77P92J552
$$ y = [220021, 219721, 218845, 218069, 218124, 218861, 219539, 219813, 220026, 220556, 221314, 221951, 222268, 222298, 222198, 222216, 222568, 223239, 224015, 224715, 225243, 225434, 225097, 224291, 223342, 222519, 221888, 221528, 221592, 222042, 222559, 222865, 222974, 223049, 223234, 223657, 224360, 225091, 225495, 225617, 225932, 226666, 227410, 227630, 227315, 226841, 226463, 226247, 226309, 226797, 227663, 228614, 229223, 229060, 227983, 226400, 224932, 223715, 222421, 221102, 220422, 220695, 221256, 221327, 221038, 220971, 221099, 220946, 220581, 220606, 221187, 221835, 222255, 222733, 223524, 224418, 225100, 225483, 225569, 225418, 225346, 225704, 226376, 226933, 227354, 228022, 228978, 229734, 230040, 230248, 230655, 231022, 231075, 231027, 231224, 231592, 231761, 231544, 231126, 231049, 232090, 234669, 238196, 241422, 243613, 244943, 245655, 245556, 244691, 243804, 243504, 243410, 242704, 241177, 239235, 237270, 235660, 234966, 235413, 236296, 236591, 236027, 235031, 233846, 232449, 231206, 230804, 231343, 232174, 232764, 233193, 233684, 234248, 234994, 236192, 237718, 238984, 239707, 240265, 240905, 241189, 240745, 240134, 240252, 241131, 242024, 242601, 243393, 244945]
52459B44945K270K759L177L198K184L11j281j761j465j198j247j460j800k187
52445B46445k232j741j251j320j529j026K2M44k24j022r77l91q5r2P1L50L13J09
52427B35864M06J323K180K346J816R45J33k03J18P66J258J515J683J631J209Q58
52411B53848J259K336L309L749M011M520N280O155O916O956N685L420J168o63
52397C07949k571m681o136o236n417m464l428k056p32m9J11K98N50M90K31L29
52381B74188Q88J407J578J624J770J960K214K731L374L593L103K366K116K613
52367C05525L553M460M969M861M110K935J742R51P28Q67R60Q50P51Q52J011J015
52351C40140R98J312K004K758L318L725M103M465M824N254N726O031N976N666
$$ y = [244945, 247215, 249974, 253151, 256349, 258533, 258844, 257563, 255802, 254337, 253139, 251892, 250432, 248632, 246445, 244213, 242472, 241221, 239901, 238372, 237346, 237368, 237812, 237588, 236566, 235589, 235198, 235113, 235021, 235092, 235442, 235755, 235864, 236270, 237593, 239773, 242119, 243935, 244880, 245013, 244810, 244928, 245694, 246952, 248467, 250150, 251781, 252990, 253848, 255107, 257443, 260752, 264501, 268512, 273032, 278312, 284467, 291383, 298339, 304024, 307444, 308612, 307949, 305378, 300697, 294561, 288325, 282908, 278444, 275016, 272960, 272228, 272179, 272290, 272588, 273138, 273628, 273859, 274188, 275076, 276483, 278061, 279685, 281455, 283415, 285629, 288360, 291734, 295327, 298430, 300796, 302912, 305525, 309078, 313538, 318507, 323368, 327478, 330413, 332155, 333106, 333834, 334701, 335661, 336511, 337262, 338114, 339125, 340140, 341138, 342450, 344454, 347212, 350530, 354255, 358358, 362823, 367647, 372901, 378627, 384658, 390634, 396300]
52337C96300N539O084P479R320J0807J1465J1704J2390J3781J5077J5394J4910
52325E30250J4664J5176J5822J5851J5590J5955J6998J7669J7226J6158J5324
52314G06683J4754J3891J2645J1443J0483R598Q830Q402Q103P361O097M855L942
52301H27087L072K080J367J236J348J223Q15K17p30k019l170l835m277m762m924
52286H14728m371l533l184l295l052j931j51J785L400M262M402M642N744P257
52272H26703Q029P892P973R027J0387J1007J0758J0102R125P739O374N596N237
52259I35949M630L631K687J924R37l71j469k030k531l577n066o457p524q367r003
52244I03363r488j0307j1973j4170j5897j6549j6463j6162j5673j4836j3873j3123
$$ y = [396300, 401839, 407923, 415402, 424722, 435529, 446994, 458698, 471088, 484869, 499946, 515340, 530250, 544914, 560090, 575912, 591763, 607353, 623308, 640306, 657975, 675201, 691359, 706683, 721437, 735328, 747973, 759416, 769899, 779497, 788327, 796729, 804832, 812193, 818290, 823145, 827087, 830159, 832239, 833606, 834842, 836190, 837413, 838228, 838445, 837715, 835696, 832526, 828691, 824414, 819652, 814728, 810357, 806824, 803640, 800345, 797293, 795362, 795211, 796996, 800396, 804658, 809060, 813702, 819446, 826703, 834732, 842624, 850597, 859624, 870011, 881018, 891776, 901878, 911003, 918742, 925116, 930712, 935949, 940579, 944210, 946897, 948821, 949758, 949387, 947918, 945888, 943357, 939780, 934714, 928257, 920733, 912366, 903363, 893875, 883568, 871595, 857425, 841528, 824979, 808516, 792354, 776681, 761845, 747972, 734849]
52232G34849j2537j1845j1018j0134r030p584o242n681n899o096n565m394l201
52219F35623k532k529k867k913k282j258l69L41J200K118K489K045J278Q16P89
52204F31949R81J144J013M68j40k60J20M92P43J269K023K252J665J038J003J107
52188F46867P86N63J157K071K221J631J255J321J107L95j57l04o90j615k413k592
52172F51603k586k781k700j943j097q57q72l87M88J141J664K656L949M672M644
52157F57594M688N323N991O053N753N629N588N247M752M557M637M598M490M770
52143G29670N424N852N814N879O575P647Q610R490J0432J1040J0979J0917J1896
$$ y = [734849, 722312, 710467, 699449, 689315, 680285, 672701, 666459, 660778, 654879, 648783, 643218, 638824, 635623, 633091, 630562, 627695, 624782, 622500, 621242, 620873, 621214, 622414, 624532, 627021, 629066, 630344, 631160, 631949, 632930, 634074, 635087, 635555, 635415, 635155, 635275, 635767, 636510, 637779, 639802, 642054, 643719, 644757, 645760, 646867, 647653, 648216, 649373, 651444, 653665, 655296, 656551, 657872, 658979, 659374, 659217, 658913, 658223, 656608, 654195, 651603, 649017, 646236, 643536, 641593, 640496, 639639, 638767, 638380, 638868, 640009, 641673, 644329, 648278, 652950, 657594, 662282, 667605, 673596, 679649, 685402, 691031, 696619, 701866, 706618, 711175, 715812, 720410, 724900, 729670, 735094, 740946, 746760, 752639, 759214, 766861, 775471, 784961, 795393, 806433, 817412, 828329, 840225]
$$ [...]
##END NTUPLES=NMR SPECTRUM
##END=
