
##TITLE=AC1364_HAWAH12178_6945872_XUyv9gVlkS
##JCAMPDX= 6.0         $$ Bruker NMR JCAMP-DX V2.0
##DATA TYPE= NMR SPECTRUM
##DATA CLASS= NTUPLES
##ORIGIN= BRUKER
##OWNER= Administrator
$$ 1.72 TOPSPIN		Version 2.1
$$ 2012-10-18 13:48:20.278 -0700  Administrator@X
$$ Compression mode = diff/dup
##.OBSERVE FREQUENCY= 400.02188249412
##.OBSERVE NUCLEUS= ^1H
##.ACQUISITION MODE= SIMULTANEOUS (DQD)
##.ACQUISITION SCHEME= undefined
##.AVERAGES= 8
##.DIGITISER RES= 22
##SPECTROMETER/DATA SYSTEM= spect
##.PULSE SEQUENCE= zg30
##.SOLVENT NAME= COFFEE_meoh
##.SHIFT REFERENCE= INTERNAL, COFFEE_meoh, 1, 14.98509
##AUDIT TRAIL= $$ (NUMBER, WHEN, WHO, WHERE, PROCESS, VERSION, WHAT)
$$ ##TITLE= Audit trail, TOPSPIN		Version 2.1
$$ ##JCAMPDX= 5.01
$$ ##ORIGIN= Bruker BioSpin GmbH
$$ ##OWNER= Administrator
$$ $$ C:\Bruker\TOPSPIN/data/COFFEE/nmr/AC1364_HAWAH12178_6945872_XUyv9gVlkS/10/pdata/1/auditp.txt
$$ ##AUDIT TRAIL=  $$ (NUMBER, WHEN, WHO, WHERE, PROCESS, VERSION, WHAT)
(   1,<2012-10-14 01:13:34.750 -0500>,<Administrator>,<TOPSPIN>,<go>,<TOPSPIN 2.1>,
      <created by zg
	started at 2012-10-14 01:12:27.859 -0500,
	POWCHK enabled, PULCHK disabled,
       configuration hash MD5:
       6B 1B 68 BB D9 2E 58 E2 7F 35 AD 54 07 DF 0E 41
       data hash MD5: 64K
       23 FB 51 79 11 90 9C 31 2D C2 76 E2 C2 73 85 28>)
(   2,<2012-10-14 01:13:37.312 -0500>,<Administrator>,<TOPSPIN>,<proc1d>,<TOPSPIN 2.1>,
      <Start of raw data processing
       efp LB = 0 FT_mod = 6 PKNL = 1 PHC0 = 0 PHC1 = 0 SI = 32K 
       data hash MD5: 32K
       91 A5 44 FF EA F4 92 B5 11 DC CC E8 27 48 49 89>)
(   3,<2012-10-14 01:13:37.703 -0500>,<Administrator>,<TOPSPIN>,<proc1d>,<TOPSPIN 2.1>,
      <pk PHC0 = 183.4607 PHC1 = 0 
       data hash MD5: 32K
       82 6C 76 BC 3B 4A FF 11 7E 59 2C 69 8F 6C 0D 54>)
(   4,<2012-10-14 01:13:37.812 -0500>,<Administrator>,<TOPSPIN>,<proc1d>,<TOPSPIN 2.1>,
      <abs ABSG = 1 
       data hash MD5: 32K
       2C C9 1D B5 30 9B 5D D0 40 57 11 4C A1 10 A9 76>)
(   5,<2012-10-14 01:13:37.843 -0500>,<Administrator>,<TOPSPIN>,<proc1d>,<TOPSPIN 2.1>,
      <abs ABSG = 2 
       data hash MD5: 32K
       D8 EB 9D 31 61 18 7A C9 38 C2 76 2F FD A0 97 38>)
(   6,<2012-10-14 01:13:37.875 -0500>,<Administrator>,<TOPSPIN>,<proc1d>,<TOPSPIN 2.1>,
      <abs ABSG = 3 
       data hash MD5: 32K
       37 81 59 8B 13 CA EF F7 5E 4C 8A 22 D4 E2 12 43>)
(   7,<2012-10-14 01:13:37.906 -0500>,<Administrator>,<TOPSPIN>,<proc1d>,<TOPSPIN 2.1>,
      <abs ABSG = 4 
       data hash MD5: 32K
       3A 0B FD D5 82 2D A3 DF 2B E5 D5 91 26 8A 37 4A>)
(   8,<2012-10-14 01:13:37.937 -0500>,<Administrator>,<TOPSPIN>,<proc1d>,<TOPSPIN 2.1>,
      <abs ABSG = 5 
       data hash MD5: 32K
       04 26 BA D8 7C 13 B9 C2 AA 3A E6 4E 7D B3 95 0C>)
(   9,<2012-10-14 01:13:41.562 -0500>,<Administrator>,<TOPSPIN>,<audit>,<TOPSPIN 2.1>,
      <user comment:
       ICON-NMR User ID: COFFEE
       data hash MD5: 32K
       04 26 BA D8 7C 13 B9 C2 AA 3A E6 4E 7D B3 95 0C>)
$$ ##END=
$$ [...]
150 150 150 150 150 150 150 150
##$TP07= 0
##$TPNAME0= <>
##$TPNAME1= <>
##$TPNAME2= <>
##$TPNAME3= <>
##$TPNAME4= <>
##$TPNAME5= <>
##$TPNAME6= <>
##$TPNAME7= <>
##$TPOAL= (0..7)
0.5 0.5 0.5 0.5 0.5 0.5 0.5 0.5
##$TPOFFS= (0..7)
0 0 0 0 0 0 0 0
##$TUNHIN= 0
##$TUNHOUT= 0
##$TUNXOUT= 0
##$USERA1= <user>
##$USERA2= <user>
##$USERA3= <user>
##$USERA4= <user>
##$USERA5= <user>
##$V9= 5
##$VALIST= <valist>
##$VCLIST= <CCCCCCCCCCCCCCC>
##$VD= 0
##$VDLIST= <DDDDDDDDDDDDDDD>
##$VPLIST= <PPPPPPPPPPPPPPP>
##$VTLIST= <TTTTTTTTTTTTTTT>
##$WBST= 2048
##$WBSW= 25
##$XGAIN= (0..3)
0 0 0 0
##$XL= 0
##$YL= 0
##$YMAX_a= 488587
##$YMIN_a= -625246
##$ZGOPTNS= <>
##$ZL1= 120
##$ZL2= 120
##$ZL3= 120
##$ZL4= 120
##$ABSF1= 14.98509
##$ABSF2= -5.573092
##$ABSG= 5
##$ABSL= 3
##$ALPHA= 0
##$AQORDER= 0
##$ASSFAC= 0
##$ASSFACI= 0
##$ASSFACX= 0
##$ASSWID= 0
##$AUNMP= <proc_prof1d_extract_pilot.lims>
##$AXLEFT= 0
##$AXNAME= <>
##$AXNUC= <1H>
##$AXRIGHT= 0
##$AXTYPE= 0
##$AXUNIT= <>
##$AZFE= 0.1
##$AZFW= 0.1
##$BCFW= 0
##$BC_mod= 0
##$BYTORDP= 0
##$COROFFS= 0
##$CY= 15
##$DATMOD= 1
##$DC= 0
##$DFILT= <>
##$DTYPP= 0
##$F1P= 0
##$F2P= 0
##$FCOR= 0.5
##$FTSIZE= 32768
##$FT_mod= 6
##$GAMMA= 0
##$GB= 0
##$INTBC= 1
##$INTSCL= 1
##$ISEN= 128
##$LB= 0
##$LEV0= 0
##$LPBIN= 0
##$MAXI= 10000
##$MC2= 0
##$MEAN= 0
##$ME_mod= 0
##$MI= 0
##$NCOEF= 0
##$NC_proc= -8
##$NLEV= 6
##$NOISF1= 0
##$NOISF2= 0
##$NSP= 0
##$NTH_PI= 0
##$NZP= 0
##$OFFSET= 14.98509
##$PC= 1
##$PHC0= 183.4607
##$PHC1= 0
##$PH_mod= 1
##$PKNL= yes
##$PPARMOD= 0
##$PPDIAG= 0
##$PPIPTYP= 0
##$PPMPNUM= 2147483647
##$PPRESOL= 1
##$PSCAL= 4
##$PSIGN= 0
##$PYNMP= <proc.py>
##$REVERSE= no
##$SF= 400.02
##$SI= 32768
##$SIGF1= 0
##$SIGF2= 0
##$SINO= 400
##$SIOLD= 32768
##$SPECTYP= <>
##$SREGLST= <1H.CDCl3>
##$SSB= 0
##$STSI= 32768
##$STSR= 0
##$SW_p= 8223.68421052631
##$SYMM= 0
##$S_DEV= 0
##$TDeff= 65536
##$TDoff= 0
##$TI= <>
##$TILT= no
##$TM1= 0
##$TM2= 0
##$TOPLEV= 0
##$USERP1= <user>
##$USERP2= <user>
##$USERP3= <user>
##$USERP4= <user>
##$USERP5= <user>
##$WDW= 1
##$XDIM= 32768
##$YMAX_p= 432982668
##$YMIN_p= -757371
##$CURPLOT= <Network HP LaserJet P1505>
##$CURPRIN= <$Network HP LaserJet P1505>
##$DFORMAT= <normdp>
##$LAYOUT= <+/1D_H.xwp>
##$LFORMAT= <normlp>
##$PFORMAT= <normpl>
##$SURQMSG= 1
$$ End of Bruker specific parameters
$$ ---------------------------------
##NTUPLES= NMR SPECTRUM
##VAR_NAME=  FREQUENCY,     SPECTRUM/REAL,   SPECTRUM/IMAG
##SYMBOL=    X,             R,               I
##VAR_TYPE=  INDEPENDENT,   DEPENDENT,       DEPENDENT
##VAR_FORM=  AFFN,          ASDF,            ASDF
##VAR_DIM=   32768,         32768,           32768
##UNITS=     HZ,            ARBITRARY UNITS, ARBITRARY UNITS
##FACTOR=    0.250966925370066, 1,           1
##FIRST=     8223.43324360094, -151352,      -267808
##LAST=      0,             101116,          -321737
##MIN=       0,             -757371,         0
##MAX=       8223.43324360094, 432982668,    0
$$ Real data points
##PAGE= N=1
##DATA TABLE= (X++(R..R)), XYDATA
$$ [...]
23863 -180364 -177885 36309 -383726 42446 -115087 146014 38249 -307823 57662 85232 108247
23852 108247 -59582 -224324 -207582 237357 -214377 -82756 195563 299069 -114000 9367
23841 -164468 -325487 185066 -39689 -16718 -101508 60764 93746 -109832 124633 36355 -1558
23829 314005 54111 -7787 -253367 -203535 266767 -190787 145925 -4002 -43872 106725 102168
23818 102168 -82021 -7393 -148904 -130899 -188101 -282071 -371210 132821 -273121 15296 -45365
23806 121109 -227255 -44968 -8544 -12506 -58151 107536 -39903 -125630 195314 -98822 -167202
23795 -167202 32502 -18058 -251776 231680 336716 113738 68862 -368540 -85407 226410
23784 144758 -26699 -322213 -211479 -257543 18130 386498 -120622 113864 -5767 164637
23773 369355 -157661 -256835 -163886 -106477 89251 -58322 32252 34450 232816 47598 122209
23762 122209 -166024 39931 -248954 -30034 -127458 -65022 -39952 -310257 100133 -41082 95967
23750 138073 38578 -252722 3234 -67739 -46032 -31711 -212204 93860 -110122 172842 -7375
23738 36048 174204 -192123 -97651 -49822 216230 179709 157661 -166843 -23059 -158475 -89916
23727 -89916 115351 -7903 -235905 239453 120111 29506 -50610 110647 -85619 -114922 -293253
23716 -293253 -232970 421143 164810 45865 -181778 -74253 5003 29370 74031 -212253 41849
23704 -21438 -1757 244491 -198854 -176561 310013 193502 409759 212000 206607 -35891 -261681
23693 -261681 -360768 -193268 168845 -17440 54597 74541 231228 201001 -169114 94087 -215049
23681 98360 153710 -3522 -81942 -168831 9102 16700 29331 105152 -303197 -60209 -115828 -54276
23668 -182519 55193 -217323 67282 -145644 61259 -89665 109698 -161999 200969 -61326
23657 -15340 -247442 13180 -129484 -69788 230290 42596 -67254 31234 -23631 102968 -260738
23645 -336705 -56729 246645 -118994 -62577 -157560 77689 -240630 255571 72914 -387879
23634 -247599 -101359 -29840 -34623 -61365 -109014 136345 34429 -38564 255236 -26871 50835
23622 412304 -58051 -103190 -48362 37943 217594 -120012 84906 30795 -23179 106232 -177355
23610 29729 -61304 15934 -173896 -21874 199586 -227242 -20371 -264163 -264010 -349545 -210949
23599 -210949 56687 -138800 158328 -96805 229016 -31645 -14925 13976 65121 155946 8921
23587 -62859 237283 17401 -353208 -33698 -69245 -363759 -115393 310922 323173 238895 -167897
23575 -135120 210115 -199073 -348885 -39935 -22224 156861 311147 95684 -166831 -158438
23565 -158438 304298 87604 -52663 -97365 -105528 -399600 51682 56565 18572 32553 -48331
23553 -135873 -158542 101604 -229018 175736 -104096 24962 59094 245927 10108 -77755
23542 -279386 313877 76956 -165024 45953 -70058 93917 -142372 94538 17743 248187 -221190
23530 141826 152418 190330 -211430 -32118 -198198 -198083 -347550 316669 47439 232909 102989
23518 208795 643 -37586 101013 32566 -307985 10679 64205 -78397 -162941 -21468 -24241 -89809
23506 -89809 86293 228120 39982 91693 164900 -87690 273130 119276 -132918 -80602 18361
23494 146397 -375238 -41791 -117190 2739 -126182 245941 -231671 76842 -24853 -187928 169522
23482 -19601 137945 -68689 -87664 -60455 162210 164714 -387635 -105108 -170909 20267 -76521
23470 24541 198701 114695 -36556 -22710 21173 98399 189592 -487870 -355095 98549 277278
23459 277278 -150680 -63431 -49575 -61413 31795 -411417 76209 283383 23844 269702 82032
23447 427352 49129 -102721 -228627 107292 32638 -313592 33355 129875 -44911 96422 194712
23436 194712 50785 -196502 11389 -134755 -193918 -76677 -3512 7096 287905 -353342 -468999
23425 -468999 -58819 59479 -216732 -154001 -178339 -72763 -223408 216906 -61532 -73844 462676
23413 134984 -89707 -307013 -34269 -74665 -70889 -338745 -54624 130159 -130421 167986 -85722
23401 -80760 -122471 -52059 -19220 -196868 -97898 328541 -245589 -163804 -227348 49276 203745
23390 203745 -224588 -24747 75261 88431 -26959 187214 -376270 19038 -49741 126200 129176
23379 129176 34034 -50209 -16956 -161043 6069 -39279 -134248 150603 119396 -22558 -249559
23368 -249559 -334492 -182537 298672 240873 -28828 -163894 -51926 -99173 183412 -147738
23357 -10991 69856 -134989 120265 100138 107379 53977 -131483 -89100 -294501 29677 209465
23346 209465 198197 -42400 100551 103854 -93520 -110843 -101753 -172130 71014 352652 13603
23334 220678 -55354 45817 -146238 -136730 137761 277029 29039 -133273 36521 -167372 -133329
23323 -133329 -183663 204887 34816 -184971 454 48430 31312 -346444 158354 -4716 -202980
23312 -202980 158830 -153330 51144 230926 68750 96076 -65121 273096 86108 -141860
23301 -85443 16159 -183647 50278 -144033 8789 82407 -201652 -86715 227575 -242551 127576
23289 349697 -102426 -196651 -117978 -16235 -124623 -285220 179321 70638 -133299 197119
23278 287955 67397 -85179 112853 -4413 142836 180717 -115909 -8454 32856 -278287 146775
23266 237141 87697 -324890 123388 -121247 -18495 -69687 117107 84031 12724 -6046 -258058
23255 -258058 -413311 -42249 29475 -104125 -68128 -106336 110039 254005 87506 152012 -132361
23243 17028 39243 -175944 -156398 -57332 -533744 -155461 109379 53451 36454 66101 116051
23232 116051 -42629 -57985 -133542 -118766 -151320 -230913 -244736 -70382 -32645 -67208 -40486
23221 -40486 -307170 -11134 -155415 -91034 14816 -109149 108130 92130 -32603 -5068 -103980
23210 -103980 232373 -267447 -20610 195334 -100676 -94820 -357546 -83812 135274 -128316
23199 68324 44141 -203647 154805 -93022 170175 194593 336791 -15023 -159448 -83263 -11316
23187 -8789 274224 -4776 -175623 -142421 135233 52254 83642 24636 -65566 107966 73052
23176 73052 127302 -126256 -43483 144799 -147362 -92786 342270 -218747 264001 -51598
23165 -8934 -46261 -156241 -100464 -108028 -47652 -142045 -237882 -141318 -270125 189363 -141225
23153 -112088 -157860 -8820 -385102 -162567 69317 97537 385126 50526 -15464 -161187 73366
23141 -234625 205646 134601 -218641 -27009 -26942 215458 252856 -99992 -90501 39063 -127771
23129 150451 -512803 180543 288426 -101977 -92091 363048 77009 169322 -256615 208550
23118 -168285 248762 119542 -285443 -405851 13520 260646 -40020 -50447 27566 51446
23108 51446 -372613 288184 65511 94506 -379682 146749 237458 258995 412853 -860 -111697
23097 -111697 203442 -103615 76908 40604 131181 -147060 254466 -91227 119849 -71338
23086 129811 204722 -233908 -8241 -29391 -357002 -76900 -332185 217799 235445 37876 -43058
23074 -471104 -102648 -129280 -79937 13057 -117295 106809 159734 214889 -218739 44923 -39809
23062 149450 -121142 50388 50596 -86330 -51567 -269739 -3359 -3860 93841 -187298 -93387 -100310
23050 -100310 -362076 -221014 27661 63334 94557 -53487 -34688 113449 -240372 21422 -41806
23038 -148509 183393 44253 -35900 -173652 450021 -108532 -144732 240380 -187178 10492
23027 75006 -14180 -21083 295191 -121604 -217949 -13337 185559 223740 -148122 -102560 6569
23015 -20055 75465 7285 294775 -234054 136003 134816 299475 39615 -19864 110014 -50678
23003 31633 -258021 55501 -38101 -388832 107319 -22777 46447 -313301 187460 198802 -89109
22991 -365451 127312 -227919 9362 -81369 696 253947 168117 254101 33038 192726 -193268
22979 -143273 583 -126071 78035 -135099 -94155 -258426 -139182 222072 114784 45614 -14965
22967 52835 146023 -90396 279203 -228717 144054 -100606 -334142 -8149 78907 -183421 83307
22955 -60391 -163161 65045 183061 -103163 -127015 -108831 -106169 -66944 -177825 31535 -136552
22943 -2241 15304 -63408 12177 -178842 -148803 -228414 -68568 87927 80172 -335757 -37267 48610
22930 43729 151466 -173933 -286929 7440 -345765 -41859 -109372 -80066 -366563 284202 56388
22918 -240674 -105144 14285 -89847 142413 103473 -178303 44130 179223 -42293 -60252 -505336
22907 -505336 -152298 -128964 185799 -196540 -300349 -236688 -99898 -105018 211971 203952 -388626
22895 -217868 116290 -129323 -21619 -152610 -176611 99010 114822 136633 -50763 -237893 -142539
22884 -142539 -301051 237315 -142822 -42958 -107442 248146 -179843 -98566 17075 -85298
22873 195261 160204 -178521 7373 -32776 -164225 132777 63373 539566 5888 56586 167410
22862 167410 -152301 152820 -51091 54648 125235 93045 201760 -256452 -278499 15095 305141
22851 305141 238456 -56848 -71834 124459 -176210 37294 -120222 -103672 -196040 29465 21087
22840 21087 -118111 -38892 -38679 131308 83561 -56062 186870 559 9766 58617 50961 7977
22827 295278 68869 80552 -298887 189804 -8431 -48134 -216622 78023 160975 -326272 -254025
22816 -254025 5669 6550 -43507 125331 -209751 -28895 -46141 76115 336022 -17538 67621
22804 -418295 -141129 66174 -73103 -152696 -17492 -96321 69949 -119685 -84794 -166644 -129765
22793 -129765 -35088 -142181 -394405 285468 -33709 -217596 284678 169415 204054 -79928
22782 169944 -4213 155061 -73427 243297 -403982 36815 69580 -223086 151041 196872 -228121
22770 89402 -192171 246484 -304621 -210729 -215800 -122907 409155 -273955 -268663 -221403 93287
22758 -94411 130993 -50295 281747 177734 -116547 43308 127075 -277369 -213177 -35408 326072
22746 107643 81787 118512 27965 106572 106260 -95689 139120 10877 -150133 -100372 -241695
22735 -241695 22636 -277767 -198552 39356 273873 14067 136988 -265248 103623 -102765
22724 6089 -148408 90963 290933 13187 -168717 277511 107023 196856 42708 -119137 333573
22712 22278 -97733 -179256 301429 -192470 32852 74640 -2497 70143 12693 -56420 -212898
22701 -212898 -73046 280750 309902 -69735 97501 -81594 -105652 -10671 -41034 -63568 78213
22689 -28344 124733 -244226 149310 -45125 138492 160712 -293925 -38807 7854 -252634 -291453
22678 -291453 -7157 -251574 128972 65489 -100175 -95533 -106997 -77637 -61069 -105666 -160151
22667 -160151 93505 173806 -197702 -157854 -325345 -105222 -100348 -42101 134566 146042 -84266
22655 205472 -3457 119960 -107337 -68100 82129 227064 -28706 -152975 -154252 -104071 146574
22643 126298 47490 250327 176952 -9524 45097 107547 -21524 18031 -122564 -376998 104758
22631 -195180 -55832 71190 -195110 -117302 -28808 -206858 -175495 94890 -6381 -203470 -8846
22619 -293567 -204011 121775 91194 -86959 81414 -273861 131874 30384 49556 -39051 -203548
22608 -203548 131568 -34641 -226910 -25532 -173585 -129925 275831 7290 -149082 -172115 61059
22596 -144674 -25933 -183338 -224427 -81748 10190 -41268 -152165 -223373 82062 117674 75924
22585 75924 -172073 -63779 -318557 -54699 71648 37020 -254846 -176467 139441 248144 -92120
22573 104079 -74122 25275 104565 -209437 5336 -231639 -16928 136039 45664 -239328 -15626
22561 -79299 153567 -317041 -19718 -10799 -6929 56765 -358185 207432 197496 199998 196182 46791
22548 -166241 80795 -128151 83221 -264451 -127994 221207 11519 -113761 434511 -213021
22537 210501 -52211 57405 -303162 25543 -178373 -271023 366672 -123119 -197443 -113223 12666
22525 -291913 -219644 61151 -110391 202345 -218783 132958 -115297 82419 166116 -5279 -226439
22514 -226439 -4111 -208992 -81131 -368974 52891 -20046 214374 163383 -98104 142303 57795
22502 -97849 -139811 -99151 -106552 122497 90939 -224788 -42825 39988 74135 111386 -85699
22490 -220679 150295 -167087 21324 -159680 -205902 6569 -128033 -243712 -150243 213567
22479 -13930 -20809 -234471 109152 -70531 -113408 47536 146505 -31128 253955 317879 161201
22468 161201 -189712 324708 -121852 53521 8476 125117 1711 198098 267174 -182026 241841
22456 221622 -234862 10340 -46414 -154073 -124653 105401 278671 -199681 -13976 113649
22445 -88569 12050 -152504 -64928 -176676 -176258 61801 12762 -129354 -258696 114894 -294039
22433 -311777 -218928 -139185 186387 -38277 113787 49438 -74022 253224 -224030 102457
22422 -303222 -321570 -99838 303153 -35431 -22510 170142 -283917 89599 -39231 215480 160279
22411 160279 -205130 43217 134944 301672 -348398 -156743 16736 -1736 -88491 131429 46070
22399 -73198 250548 -212317 53681 -35513 -3795 -117949 22496 -125031 192259 -86121 -226145
22388 -226145 46852 -261600 52048 -168704 -174164 -232147 -10273 -61573 -139916 -20050 98511
22376 -169257 -69660 264087 -226573 -161914 -208475 343351 -35687 -157478 -272253 79919
22365 -171744 44264 -261175 -32737 162479 -131021 110201 -122600 79297 -75073 -161712
22355 -161712 -222300 69366 46357 33793 207825 -211032 -20677 -67956 -54878 82093 -245361
22343 -119885 88520 167544 225761 -68845 19849 -26060 -81282 -21460 -105723 200937 29872
22331 -6727 -529225 -56001 23476 62070 -17972 -88940 3872 -120452 73657 52876 13766 -210256
22318 -12859 -266764 -57560 -82348 284977 283876 31566 114141 -172767 -161691 -22794 141574
22306 -230252 -78694 3273 -121991 330632 -110298 60433 11523 -16789 -240702 -232850 64203
22294 -117654 123840 82099 276746 123068 -140996 -439308 114585 110960 213272 -190385
22283 103747 -45400 130821 -32119 261810 -175647 -99531 62561 -163119 -177012 42972 -111567
22271 -90098 -311263 -63026 -8282 -20497 80851 -119148 -135986 215034 -99281 121654 120051
22260 120051 163332 -266165 226114 174028 -199981 139773 -464309 -214958 206198 -81103
22249 37999 -68766 -62755 -93601 227373 -231056 -179943 -27446 -63270 -354874 22808 279710
22238 279710 -440132 51938 73538 37776 -61443 -339870 -162045 -58644 -42632 359232 -111796
22226 -247801 -75099 285607 -94858 129395 95438 72124 -135517 -210159 -449497 147221
22215 -329595 -19926 76629 95872 125568 142554 -48602 -143113 -195160 -354727 -149391 -38332
22203 51495 -20252 240356 10622 -126058 215481 124871 92323 -78765 -65289 -220839 -453664
22192 -453664 -162457 123208 -24080 -126427 -54552 249200 -122192 4129 168984 -157743
22181 -27943 -102853 -133746 -142594 173467 264759 -1618 -184678 -44160 -26081 -93850 137292
22169 93652 -102213 -340095 -87651 -90912 -91458 -208182 -38239 -38662 125781 -41102 -244048 258682
22156 -26676 213814 -43134 -437614 -443841 -97008 -293025 84186 -114468 -41112 -84619 -62945
22145 -62945 -260854 13253 203221 -127988 -136815 168618 -162875 -113029 -5040 -27145 -78934
22134 -78934 166544 118847 -473213 -11051 105824 -226074 -576803 115914 -176777 148785
22123 280890 -275533 -129517 -192142 -183293 -81987 -79208 -59282 -60988 117867 -46569 -179969
22112 -179969 -347074 54177 -171315 -19720 419503 -208737 92345 111527 -163478 160467
22101 -294519 212752 99124 203048 -15598 243693 -77694 1664 -60813 291214 28744 3711
22089 37527 157812 -55664 -250974 -114886 -97433 26362 115207 -43454 16342 130650 63003
22077 94672 71895 206309 105318 190134 -282721 -295301 -89435 256077 256382 -254038 -89982
22065 -27462 -36936 35782 -50892 -43867 135857 -190992 -30039 -465534 -104390 64275 -253821
22053 -68032 -141016 -147986 -74014 -53010 -213048 -159356 -130998 -48849 129460 139430 -270333
22041 -132078 -91377 -61383 -277125 50516 -233623 -142463 -221228 -189461 -368623 -200977 -238067
22030 -238067 -124333 354045 45488 180320 252383 50261 161478 236946 -351675 249292
22019 222276 -72905 -7201 -125966 -60348 140836 -47754 -169893 60508 168533 -165193 176415
22007 148767 157325 -86851 -5382 -30864 -25675 319217 88834 -23815 -17211 194886 55435 96076
21995 96076 171121 -134460 -92462 -66307 -42074 -15983 -182206 -115973 -16876 -112859 79593
21983 102253 -24001 -198450 -134723 -215832 162549 350008 -137319 3305 -187269 110388
21972 205217 24760 -138436 -227459 -62195 150031 -530567 -112780 -137693 -18529 -18928 -173575
21961 -173575 -82651 -19044 -72021 -345245 -270979 -150696 -126226 125117 -266669 82960 -34800
21949 -27275 65087 50843 328121 21176 347190 -157722 267677 -59577 -19090 -180056 8295
21937 -160539 -287611 68146 -94329 209941 -94720 81568 -131243 -40955 102049 18817 49975
21926 49975 -297498 44668 -270662 -295067 -317027 -235439 -96518 16796 -86680 -322923 -198109
21915 -198109 79946 248373 -332011 -126038 -111638 -6970 9126 -339878 119701 345859 -89610
21903 -232553 64723 -201349 -195127 81071 -402872 48202 -259870 -26134 -162504 138026 20692
21891 -32612 -59414 -169664 156248 -43292 -192207 -23462 37160 -91033 -63964 60736 -374890
21879 -67266 256446 11096 47859 25300 -101188 -28899 139744 -233230 -125491 112334
21868 -139195 -45136 -327657 4917 -253607 -92053 -36294 4069 -9493 -474945 42293 -363743
21856 177068 -37069 -204555 -17929 24405 -373106 -39941 99654 31352 43222 167067 139747
21845 139747 71234 -202387 -120435 -126893 251007 -193878 86453 54210 -281509 43315 -44564
21833 -227243 -178418 -324951 34880 -80815 -160883 -99313 -93847 -233269 81685 -128819 -20023
21821 -6632 240546 36455 168660 -273620 -24946 325259 125758 -56674 -226360 234538
21810 -49953 165917 -352988 -10681 -92840 -59617 262221 -49447 68505 -60516 -61258 -83263
21799 -83263 188772 -190005 -14537 77388 -100314 -161117 -125803 -299929 -249632 15765 -79229
21787 -134919 -92819 28771 228647 77595 61544 -151187 -148094 -91175 160268 128132 87654
21776 87654 161786 -237380 181350 383333 -126669 85816 11898 83607 -87604 55836 40443
21765 40443 304671 108526 25981 5510 310753 -218591 -59550 42151 37571 86394 218410
21754 218410 -83436 -396182 -199328 -315553 -129668 827 -112547 225448 -477529 -328285
21744 -328285 58491 -268852 48541 -8940 48548 -142911 -431201 -136719 242576 -292511
21733 -85020 69640 4096 -147956 -72840 126614 -168828 -137939 82607 133679 50967 -80056
21721 -25745 116778 -1174 191524 -77047 150356 26589 -213057 -142954 4070 -150882 -68697
21709 -97851 270000 240697 14614 14055 -161517 -275118 -278005 -38367 -69373 -50541 -78002 -196237
21697 -196237 -248362 78535 450416 -135992 -120562 -138954 30783 -113619 13913 -80233 -36897
21685 744 77936 139896 -110732 -119704 147356 383344 160487 71683 -156089 36004 -207814
21673 -167221 -134396 -40044 -76298 -48380 -33021 -131512 -46726 38063 -28260 17885 -474848
21661 -57486 84863 -98695 238383 -140503 83416 -248071 -77213 -434363 -61333 -7557 80842
21649 154225 -178583 -100262 -171595 -278515 -29908 12406 16322 -104687 198948 -299834 -36378
21637 -27346 -25193 144755 200596 -270368 159564 41339 -111192 458664 -223792 -204546 -7578
21625 1132 -317527 73412 49147 105086 -56575 -74446 58383 -218515 -386596 37497 -275704
21613 362367 -271289 -130859 -101037 212013 -210593 8726 -285687 79715 -56446 -208760
21603 -208760 -321309 -87391 57895 143152 88272 -25921 62580 180229 22869 -49059 -5406
21591 -137205 -45378 48517 32844 -20767 -10192 229079 186197 55754 142492 92729 106795
21580 106795 -213126 -93846 168443 -403287 67385 -226658 -128790 130346 -303550 -32496
21569 -189722 -365973 -50316 -262044 -50883 -219584 -408385 112239 -416735 236178 230522
21559 230522 -51532 261068 101045 352662 4244 -118276 -127346 -65454 -11754 -44496 -250918
21548 -250918 -237271 -67057 -22637 149349 -129919 11766 -184860 18466 -93784 -168355 22225
21536 173669 -59039 -251410 -335325 -164454 -37804 -418294 -168377 187864 -112397 -56637
21526 -56637 -104566 -346474 33608 347179 74150 4603 -219479 -355583 -5870 -167835 112931
21514 -1270 27380 -201399 -46298 35198 -176848 -245308 -131272 -59386 241316 -71269 -25486
21502 -289394 -4632 -17982 -62382 -276013 -320730 -20398 -11811 -185955 -174193 55509 -94550
21490 307015 -370269 -190477 -7812 -300861 39336 16815 -404817 217931 -25788 -125685 -132998
21479 -132998 -91003 109361 56586 46479 -193733 -130938 177632 251131 -197387 42235 207963
21468 207963 353156 137934 -145331 79208 -79484 141760 -74675 31170 -207249 127266
21457 -134824 3699 52167 -211565 149250 56676 167360 -198980 109807 23636 57828 -370572
21445 -143209 -238652 -124706 419885 160797 -41793 193286 145568 409652 94608 448200
21435 448200 -112855 -121209 -115970 293996 93159 -421631 -102240 -165730 226529 -345786 49567
21423 81908 369946 40860 18295 -376364 -49394 -60952 -192419 24217 114945 282351 -188176
21411 267679 -262359 -22693 78524 -33387 -111235 -27201 -267911 236801 -408445 -54589 259447
21399 -32928 78353 179104 -109924 62287 131696 91177 269657 -248005 -31068 -283174 21711
21387 182563 97062 -7666 -236424 78024 46675 -37186 149643 -322681 -66642 31763 7356
21375 -68627 -20032 -404372 -15267 83436 -345230 178726 -118702 179523 -189697 53863
21364 -190260 -53611 -98817 -226916 -272281 -208577 -622 -198788 9641 -163358 -142320 -111894
21353 -111894 -432475 -19287 37662 -45697 212380 69432 -165460 -47880 37422 -144621 -56416
21341 74629 -178171 -73934 112005 -298050 50706 -183584 125332 -378890 215730 138607
21331 138607 -260069 -142496 70178 15636 -89210 -89413 -131824 -34065 163343 -77953 87928
21319 -148049 -431229 301508 -294095 -148676 -179893 184917 124197 213745 -424 -143269 -60809
21307 -36241 168013 -398131 -103433 90954 -44577 -199268 -156906 51114 -204924 -203609 -5057
21295 -8176 -235430 -125420 28468 -43663 -295476 -188296 46807 -33249 -27005 -77464 -189633
21284 -189633 236542 -128431 44960 -420166 118385 214803 269475 -90259 -115274 -28618 -287576
21273 -287576 -216637 -94752 19557 -100548 -74619 245906 84622 -153467 -169693 34059 -134296
21261 59003 234023 44858 -107420 -35121 84054 -145065 10098 -205128 -139919 122214 351981
21250 351981 118380 27070 -77944 -54496 -42898 -126568 127292 -169470 215 40935 -449088
21238 -97604 -59711 16472 9248 155732 -212049 -96226 74150 -118431 19112 -65052 89996
21226 -143581 44314 -130182 19231 -22658 106375 -329107 -12510 -233581 -133468 -316968
21216 -316968 150870 127790 -130417 -117094 67514 11341 -112956 -248465 -14242 79260 -983
21204 -158571 -212042 -357990 48105 -254742 32723 127142 -148933 272015 116500 31718
21193 95378 -276228 76447 25995 76044 -54089 123328 30392 83291 -456792 89392 186730
21182 186730 -318661 230777 37595 9810 163390 -121557 -92799 67027 -63785 -139347 -59595
21170 -202363 -69603 447675 404059 -167065 -395336 -335733 120642 53098 -218153 58249
21159 201911 271960 -129354 48290 425159 65401 160799 -16778 -245494 -113508 -289257
21149 -289257 -301863 -217725 207827 -75350 152114 257345 -31280 122061 131175 -127584 -145036
21138 -145036 123892 11753 114123 47598 -226630 -195288 275730 94154 246169 23203
21127 107250 -427275 404834 12641 -127891 122617 -156441 259440 -186275 -90239 -41699
21116 -178677 -113301 -60841 159166 -680 52438 48431 121462 -338393 -63728 118065 -163234
21104 -46219 -48952 16995 -216669 127884 270714 307076 108116 22599 -129010 148077 -18713
21092 136667 -216307 -127090 -87435 -210275 -158426 82478 -39299 52902 -211650 -133489 -189097
21081 -189097 180343 -434654 30142 -135845 -106954 82439 273109 252169 -285614 -477900
21071 -477900 -393733 391227 -17591 224715 55794 -241760 -192240 147638 -86201 -359410
21061 -359410 90917 -263512 -160486 -91773 -20514 -341824 -53352 296837 -112108 54185
21050 -366243 -168312 -128074 29196 -185626 -8586 -127862 130627 -97833 -81511 -234676 2112
21038 -38063 254028 -317266 -76603 -227356 -139755 -341344 56015 14802 198155 50271 -417346
21026 -28093 -120787 -241487 -195292 16135 -135273 20396 129428 -248838 -4860 -164040 -31776
21014 -65 -322855 143344 -125545 -177709 22342 -25220 24213 -318071 -35769 -61629 89119
21002 74717 -6582 -97116 209186 -10442 -142527 -50907 -277217 -139776 -336656 35551 164082
20991 164082 -17288 -327674 -61442 1463 -317025 55438 -116278 491184 -51714 -288142 280764
20979 -135550 -90633 -119881 -229593 224691 4921 -142242 200837 -102090 -103879 -331674 -34491
20967 -208318 -236757 -91452 -133419 84449 -26174 283957 -233348 -249451 348476 70423 -280743
20955 244630 -93217 -257436 157478 23476 -178481 9287 -30846 -107201 -38204 80316 -22378
20943 135699 174615 -11103 34091 -79378 -259647 196348 190619 152127 -150235 -43667 -26593
20932 -26593 -81117 -74061 -103134 56857 -335080 -100125 107145 -52914 -104022 -141031 205243
20920 122577 9651 -78152 -28671 109833 98907 160612 -208013 -45549 -234827 223460 -40227
20908 217906 -362565 -230916 39181 -190689 -82148 89787 118429 199049 -120704 66366 -335216
20896 -265582 57443 354725 -42418 193735 -55948 -160726 -13554 225802 -266773 -53808
20885 -14049 1278 -197535 -258291 55958 133093 -312105 6984 -103141 -81531 -284957 -115657
20873 -10598 348104 -219255 -501506 12637 -70801 -117714 -150025 -203063 -120357 103817 -19586
20861 -8571 62138 -315069 -17776 -54768 34992 -2591 -62564 -147448 -289487 248993 81606
20849 109683 127947 -278410 -72689 -43037 -66298 -354448 402722 65430 -130734 -102373 -25409
20837 -59015 -57109 70088 -14039 -127872 -9081 56640 50735 -209435 -95838 -158485 223407 94088
20824 -88738 260084 -39056 -210396 75766 -258212 77340 -248598 49414 -7991 -205858 -153319
20813 -153319 23686 -45961 -87699 112264 -137316 125041 -328071 138286 -308560 84508
20802 -223280 -34562 -166541 -238066 -198937 -10169 -136265 45175 -17641 -226173 117312 -22260
20790 89063 -113734 -120776 32703 -302720 -227871 -307733 173269 -97719 27548 84653 37405
20778 33462 118679 -42245 131711 -53082 -220423 -151588 62048 205673 135265 279591 150101
20767 150101 4561 -201539 261034 99321 -10905 -113646 -166113 -66696 -43004 -330514 -172704
20756 -172704 -24609 -295631 -270990 87217 111839 39308 230211 -76266 131718 -133300 -3234
20744 -234315 111365 -230716 -229820 32533 -90088 68370 -11391 190648 193264 -24049 122976
20732 -85677 -39445 -163623 56466 -27493 -181845 211477 137145 5086 128195 197565 301123
20721 301123 -117172 75354 -210474 -319415 -94980 47756 -223521 -49222 217170 -202077
20710 -178981 -51087 -5275 -305078 -190182 -513 -16122 14578 -101921 5097 98901 30501 -59099
20697 144708 -41823 -42998 101040 -115349 111733 -145324 116294 -446821 -297108 145920
20686 5958 -175006 -347046 -286645 4317 -345525 -331050 -72154 25647 -105471 52895 248879
20675 248879 -87628 -348419 -172054 108039 106128 -231452 -191423 140573 -68918 -146205 -207843
20664 -207843 41323 178000 -323274 -232700 -62922 -130956 -7349 103291 45824 191765 -242812
20652 83295 -164530 -174733 -78365 230145 -295956 -120941 240828 -1071 -292060 -82579 70262
20640 244923 -214440 -59093 136707 -193646 -122516 -317659 -353 -11962 216607 -477431 -270544
20629 -270544 302465 -79709 -358475 191690 -335271 -145079 -286122 -215317 79526 211770
20619 211770 109473 -6250 -66411 59593 -107536 174693 59163 53187 -138260 -308506 -87038
20607 -154642 29342 83644 -74232 -152082 -193205 -235837 -27169 7587 -185056 -114982 -23849
20595 -245868 -62116 26619 11518 155496 71550 -151953 -70900 150482 330413 39447 -244582
20583 59915 -77744 -216518 -143163 -155137 261271 354102 218078 -17825 238348 -87274 -103495
20572 -103495 -15615 -241204 -9849 -198287 -158637 -54725 56324 -315557 -66713 -95309 -89461
20561 -89461 -17007 -174757 260027 -77982 -235685 41850 -101290 31622 175025 -197030
20550 16245 -184551 -23950 -335680 -275098 43470 170023 -30473 -306308 -106376 13649 -72836
20538 259442 -84206 -13036 -189479 -49298 -39651 -386666 -41932 6456 67912 110757 31568
20526 -427305 -6882 -169936 -98940 -56430 14785 -79064 -224654 188521 -119137 -6544 -70651
20515 -70651 152579 -181605 -103427 -78969 33215 184825 -154147 -160145 -258704 -9387 55576
20503 59971 148444 223450 -32310 -12945 -37002 4834 -2348 -38413 -2673 152327 -41298 12875
20490 54695 -171874 -62540 -74103 119779 271354 -249005 40995 -52123 66124 -58849 58179
20478 10329 -110237 -226333 -50007 -82926 -173819 -175381 -110055 -177840 -56377 279496 66908
20466 -185370 -39261 -254245 143620 173932 135761 -83750 171564 158616 -70474 106633 342476
20455 342476 410218 188710 97912 157051 -23515 25093 6581 -225862 887 -369364 -74997
20443 -247540 -237775 -77865 3345 -226785 -72720 -314926 -366295 -14446 114329 161509 -197650
20431 -40940 -48937 98880 -2961 84302 -40104 67416 -115836 -304634 -177228 -48693 -46036 -194089
20419 -194089 114897 121888 -23608 -122407 102080 120503 188189 -45773 331640 -50351 -199923
20408 -199923 260615 -29721 -240748 232928 -86766 -108944 93363 123466 -319011 -118554
20397 267532 192813 1500 28795 22693 5742 -82933 -152562 -109356 17164 -233458 218688 153417
20385 153417 -188216 -469004 -37643 -152724 139033 -128326 -96912 62220 126588 102408
20375 102408 -281910 -25551 -154088 24097 -123015 30855 -261929 107739 -147132 -83083
20365 -83083 102854 169885 -228472 284229 134421 54134 -381997 -207020 -400261 -258946
20355 -258946 63008 -33553 -270756 -176498 31097 -19663 248100 -89683 -159425 125734 199580
20344 199580 -286198 -81368 -383336 -7086 -274297 -20913 186638 127888 -227185 165262
20333 -78694 -342654 -225059 33495 200951 27767 110992 -72011 37414 -91198 -230633 163269
20321 216213 -84102 -238656 -1812 -172537 59701 148447 1751 -367313 -38210 -19438 -255294
20310 -255294 235047 -14734 76515 -136898 -310232 75092 -112976 -243427 353594 -368395
20299 -129584 186140 134433 -232550 -174133 8343 -247874 -319640 -43789 63764 -68024 -123221
20288 -123221 175474 -241855 173441 151292 165813 -525034 -158138 11852 -120926 -144126
20278 -144126 3419 -103171 69169 -133659 -147821 22084 -197426 310343 -71747 187214 -618668
20266 80130 -17807 -50404 -311195 121792 285640 106444 -82376 230495 -62571 -8736 213162
20254 -226700 -297695 -72025 162795 87782 -313322 -313388 -197845 17963 -105921 53530 -195636
20242 -121850 -195421 -150795 -510929 -68781 -125558 -260330 -50530 -185617 -140866 -387837 -120515
20230 -231511 125991 -137826 37903 -138481 5985 -123772 -272791 -165302 -193540 70004
20219 -243945 265553 -103186 -37098 83033 96522 -120442 -73935 -205674 -1275 -221417 424410
20207 -77287 37679 -226718 -193753 141444 -290805 -212613 19538 70848 168184 14121 -78401
20195 -201223 19238 -93565 -40283 -3094 -299983 -256286 -154500 123053 8392 -28399 106345
20183 115635 -322813 -58369 -62197 -100117 -308513 -84227 23385 -206057 114346 -101122 -84546
20172 -84546 -153918 -230765 -216793 -40046 -28590 -123047 -185364 -360742 109573 -66343 163013
20160 284087 -237287 263260 -81723 -131048 -47348 -157610 78820 -179325 -188727 112515 -82963
20148 64781 111677 -85589 376686 -93929 -96207 87659 63678 115374 33915 178232 -25461
20136 -26311 -95107 -67771 -103928 6628 52761 -141717 141791 38201 -110027 311958 -126224
20124 -288397 22953 86812 -207453 -283247 132658 -143366 111387 -298553 109029 93460
20114 93460 -183329 -13061 -220901 107102 -137477 104537 -271539 87148 -83099 -16613
20103 -227052 47071 148126 -300457 277119 -91787 -323353 143117 -152280 58815 48812
20093 48812 -348084 -147332 -32916 -38668 165898 337050 41493 119316 37119 239559 141106
20082 141106 74780 49248 -105359 1000 -85853 83008 28143 -184991 -449130 -31845 -221562
20071 -221562 88284 88453 -29371 -227230 69044 -277394 -75464 200924 304144 205476 -122001
20059 -78288 -38956 -122409 -188257 6025 -20283 -225442 60968 49395 -99660 250738 -146275
20047 -343999 116340 -296768 -96979 25655 -204201 18856 -277881 261786 -271300 -246579
20037 -246579 -74455 -334892 101224 -61181 192562 273870 -45583 -45515 -118591 491742 -76661
20025 -66555 -71979 211646 157305 -153355 137627 111795 -281691 -147739 -48138 65837 -172028
20013 -111847 210274 -124940 28526 -26778 408124 -340442 -24447 -57058 -100001 245992
20002 -109256 -263516 -171589 77539 105346 -492357 -93098 154845 130891 -112379 -148933 41465
19990 -142349 -12348 341298 140288 130130 -197193 -136420 107447 -206556 -150200 3535 7532
19979 7532 -63063 5481 -28879 -517 279661 -22107 -182845 -32705 127429 -166827 -144870 12363
19966 343231 -192025 23868 -268112 -103377 -418260 -149723 249138 -321494 -67101 -19946
19955 -119644 -93121 189274 -73829 -54145 284353 123985 112025 343479 32519 7285 -241292
19943 -136237 -154429 94784 -16770 -192460 -90964 -74576 105904 240430 179217 62720 -170647
19931 101679 -92521 29712 722 -108663 -271870 -71519 -77045 56773 -44482 -90087 141265
19919 -209925 356773 -308994 -132277 -300661 -240900 -172637 282827 -298561 -87504 67255
19908 -352239 -200345 -77457 -115466 125246 -69753 -448781 -159267 -115644 -122130 -244690 36000
19896 35860 -90985 91390 -27612 -135773 69266 305236 11759 14667 -42924 -98846 32983
19884 157931 -159621 -234382 -189508 -60503 -311842 10939 -44680 -223348 139449 18043 -42724
19872 -231220 27967 -198080 -40231 -4789 -144511 32705 -301519 -36228 -89729 -84759 -57578
19861 -57578 80041 32955 -48102 53235 172125 -366902 -315382 -196975 -110837 326748 -62866
19849 17029 156356 -55710 -247754 -40885 100737 278 -20290 -24933 -15950 93586 -42788 13822
19836 -278833 -76855 112189 -141499 -20011 91967 18337 -271560 -99598 19476 -144201 -242951
19825 -242951 123407 -105716 -89728 -31886 -396184 42536 -307213 -121567 72710 -185244
19814 281237 114813 -24390 -51298 -11671 -285306 -259310 -247786 140088 -198725 194195
19803 -79699 -100445 -128156 -132578 -218071 44751 -165050 -17129 99130 -146972 -225989 -196779
19792 -196779 -337530 -71896 -175143 -199386 -140328 -277594 135079 147621 116728 -166776
19781 -234130 -11507 46256 4666 124856 127705 -55054 -19171 21720 -122791 -243151 -326789
19770 -326789 5254 -47924 -179757 123620 -258007 188720 391832 -101828 412134 -178417
19759 27509 147035 -158954 -213796 -172282 208366 86174 65702 31116 -27580 10386 -233025
19747 169227 -243355 94146 128756 -15752 66557 219005 59793 -308306 -39900 -94490 76346
19735 111754 -245178 138147 82073 52935 308253 -132042 -103581 -30424 -127019 -220034 -307503
19724 -307503 68625 114372 -63774 168352 -57723 -141860 -156184 -104923 6899 -195622 -130422
19713 -130422 153594 -87127 -114392 71586 207844 -151935 -121836 150499 -44780 -164222
19703 -164222 100281 -120284 -188183 -88954 -175571 -78067 174377 -125519 -81500 116056
19692 -250746 -133063 -50834 62562 -51580 -299103 20547 -82036 -146736 165947 -136981 21693
19680 -36759 -21243 -120355 -104437 14854 -98403 102743 60270 -13584 262316 -23966 -235500
19669 -235500 -140933 -34432 -427529 -116412 1210 -166594 72892 141263 159586 96846 -244626
19657 -5728 -48515 -2312 68704 -185357 168879 226948 -171075 -193960 -340169 41690 -191974
19645 290175 689 -66945 37859 -94495 -205495 -190502 -8438 107915 -110669 -315239 -171980
19634 -171980 73344 -23395 179109 206712 14983 -126002 10228 -89429 -15639 201668 -45116
19622 15099 -202006 -29189 68669 61992 -199423 -152395 -232477 75467 -38785 -3419 22710 -525425
19609 -329792 -243006 -288620 -115806 -165619 -234134 -102269 -54502 116717 -1801 -224927 -9830
19597 -245404 18517 -23674 -173164 -240690 -39367 92627 253715 12875 -261039 37715 -96332
19585 -340172 -113254 11794 30132 -205518 -325698 -292100 -47808 65694 -96978 5638 -213138
19573 156474 32485 71078 -161724 -123070 -187934 -132612 -64265 -30917 -318914 -57069 142983
19561 3268 -182807 -38376 179816 -220980 109557 -110836 115653 -279408 -176639 53940
19550 -251029 -259189 -130642 -216176 270093 -127340 -60466 60998 -212591 -167476 30795 -21754
19538 81648 271907 7445 -108253 -228455 -376174 -38889 -301872 -102337 134172 316777
19528 316777 166121 -253415 -201565 -261814 -220131 -330652 29485 41388 -122543 -39768 -74701
19517 -74701 -74024 -41721 22228 -76596 -14605 -205623 -224398 -68981 -313485 -11739 29438 -4027
19504 -140793 -103767 -235389 -82455 -129922 131263 31466 -335585 30958 63882 93815 455958
19493 455958 -2746 -89364 -170321 -169244 -196279 -31909 -27232 118381 286181 -107746 -324208
19482 -324208 -4240 225365 -152262 -121963 -48895 -140137 -241754 -317469 112782 -66181 -210740
19471 -210740 -176380 46207 33719 28856 167358 -133967 -231461 354175 -75679 30785 -15393
19459 145124 -209540 214083 -123682 5740 113913 128521 205086 -60404 -288617 -20089 20101
19447 203680 -129410 117843 1312 -299331 -306946 -61564 56608 -94220 -190795 -270505 229038
19435 -129544 -220719 -178151 -62388 -80688 -217992 -125929 -88034 9810 -272493 98443 -140415
19423 111020 -43406 -8529 -177261 -334579 -32457 -72036 -25256 -202155 -221530 17029 -232335
19411 -189229 -18295 -139909 -96147 -135979 -66349 -99430 272737 263706 -89181 162442 -100488
19399 201190 -142136 70975 -245811 -269849 -322640 -112627 -77072 -60719 -460077 5298 212133
19388 212133 -160344 205480 131907 95776 12803 -25718 167899 -225528 -168163 85539 22373
19376 -138961 237638 -100790 43886 -292287 144542 -222784 128631 -169706 -166862 -121374
19366 -121374 -248550 230158 -106136 -98222 -18184 138809 82028 -220565 -117627 52018
19355 -71016 -125985 290 157097 111244 128490 -217401 -457301 -106275 -23646 259216 5167
19343 -382140 -32579 -570791 13666 -156008 -103979 107140 173941 -107780 13386 -340702
19332 -279123 88237 -33240 -207019 35796 -301361 -183957 92474 -156548 -65382 -61318 53926
19320 -132372 -128412 -56807 -124113 -68325 -160068 -334519 -221910 133077 -122938 13680 -41353
19308 -303973 -77258 121185 -192657 53531 -27841 -187830 -160120 86687 103386 198770 457
19296 46270 98594 81442 -464143 -66281 -19735 158194 -14633 -296571 51081 116365 -117185
19284 95207 168989 116996 104679 93495 -292845 -403934 -83789 175738 202914 64363 149534
19273 149534 53703 18414 -6216 -128510 40794 90366 -321840 -205726 -32977 -112245 -223860
19262 -223860 -180498 -207056 -89505 -438938 -124915 89098 -195669 -337858 18603 32635 -176107
19250 -205347 -328408 -191986 -225159 259298 -238197 -110064 -197101 96100 44239 29071
19240 29071 -138658 -77397 100395 -234777 -141523 -76623 -32365 -165716 -87668 -84900 59938
19228 -278955 -52645 6533 -223768 179463 213196 90702 -99421 -108298 -111622 -31360 -153317
19217 -153317 -197207 -195838 103588 -11095 -194689 -250222 -148770 8880 -7536 -47613 284953
19205 28301 197156 -201107 162737 224831 -63896 117554 4488 285823 -36074 -555118 50656
19193 -154625 -207490 87439 -115689 -159461 -63545 -3828 144220 -246178 -17478 39463 256571
19182 256571 -408275 -173786 118666 -6128 152007 -310733 298963 -301248 121457 -49324
19171 -82277 -127427 -510880 17568 48583 -297675 -266680 -27586 -20655 -61990 -153337 150557
19159 179171 -178259 -279412 -246389 -262509 -131299 -326562 -70254 -295332 -224109 -1697 391157
19147 295449 -117752 -66118 -234770 -339510 72921 -174819 147492 -30544 -66265 203100
19136 -215117 -150702 41325 -43920 -1210 -40859 -22790 -66787 -195204 253233 43650 306619
19125 306619 61679 -109941 198258 -321352 26691 -4998 -41571 -103656 -186444 76462 -96125
19113 -48209 -69634 31811 -252521 -303720 -183380 -409959 -314159 -55445 -74078 -82430 263631
19101 -27905 -210107 -57573 -400152 32858 54538 105834 -210547 150178 -69365 -179940 -116945
19090 -116945 -55049 -221 279294 -133335 -126337 -78070 -37104 -116975 -222039 131688 -231318
19078 -189839 20463 -86516 63587 90744 -153970 -29758 -156253 1575 -191851 46498 -258084
19066 -188733 70640 -128179 129195 -86727 30092 234196 -192432 -275923 -23538 228283
19055 -31817 45030 184112 325143 169325 76160 66508 14146 -141063 136458 -260149 -56422
19043 -68312 25373 30147 409972 -394388 -37369 -126223 263046 64831 -138636 85040 9409
19031 179544 -48008 -11697 -118298 42915 -22760 -130145 5932 -67783 146216 -119255 94152
19019 -111081 98028 243585 -192673 483188 -71727 -88658 79318 275369 92680 5000 233223
19008 233223 -118461 -210625 -75321 -21664 -51522 -166409 -172781 92746 -169939 -97299 -173956
18997 -173956 -281393 -237577 80646 -379015 -61131 -502 111225 -354048 53525 -229404 311790
18985 13508 -195851 -32065 -26610 127840 -238818 -231574 -107495 7365 -83810 -69397 -54819
18974 -54819 201598 -71489 555028 26482 41394 -78687 77589 130764 -12597 221033 -24963
18962 -45802 -164227 167289 55473 -203024 -311411 982 -27190 -217717 -182582 -70942 -285672
18951 -285672 -89034 241919 303904 -91177 -44955 -169270 -59799 -198451 66261 -465891 318376
18939 132732 -308093 -254197 -214609 -136918 136401 -31354 282438 189780 -56597 -280352 118119
18927 -26982 57299 106973 -13977 -451280 -17082 210062 -115708 -112962 -308543 -111601 -105486
18916 -105486 155391 192441 -81964 -137967 1519 16798 125279 245921 155994 -112148 198835
18904 286626 90501 -8433 -65670 -152376 131017 199732 -131572 -135012 57658 74729 -122044
18892 -25212 327149 -223555 10731 -137520 -65646 -263589 -99887 -56900 62008 24361 -160720
18880 -4657 -45219 150149 49374 80998 -177457 -408812 -29808 246863 3346 -186090 61431
18868 -299282 -51730 -75983 -210541 -181966 -269104 -60310 -102749 194641 -53359 -208480 133595
18856 -204428 -59541 108974 -178749 -215840 -47 13447 -221315 90928 -269045 -50008 -152369
18845 -152369 -174055 -246226 84057 -130222 -100583 -271685 -71335 203273 -256401 -22631 -178351
18834 -178351 -207306 -10127 138097 -128548 -121602 -89631 -152088 -334672 91941 -205476 40413
18822 -118685 -243463 460531 -79443 72079 202669 171902 80795 187567 258297 -85159 127049
18810 58085 11937 299526 146113 97539 163962 88804 202935 -169992 -8146 -24272 -153114
18799 -153114 -251881 -58897 303652 -75900 -94380 -191364 -163576 9936 -154714 -228052 -73501
18787 -234806 169003 -140454 -258888 -16920 70732 -184150 -42146 78608 -249282 -339398
18777 -339398 -104732 260140 -104886 45129 -246598 -150260 -247465 -496175 -350069 -132266
18766 -119686 -87860 -181503 -163910 -163576 -503395 -220626 -16423 -30598 -167376 -253193 -14618
18754 -140897 -63896 -96241 -65944 -115196 -420811 -123529 -12571 182925 204436 38200 -132595
18742 53483 -290598 -268559 -320274 -128553 39843 -10922 65140 -42698 -159660 -79516 -162238
18731 -162238 -122441 278601 -101030 -42406 130721 -270747 -185502 144257 261977 65290
18720 282064 -176218 209606 99427 -45121 -79706 -106685 -287757 3506 399948 162529 16422
18708 -147780 37064 -241163 -438140 30532 -458226 35809 -246659 -67529 -83608 -120042 -144721
18697 -144721 -108778 -214129 -79745 -127791 45985 161967 -107866 224829 -73993 -210359
18687 -210359 -37326 -33665 203187 -462001 207208 -301326 -308156 -326160 -63763 -163360 -213705
18676 -213705 -369531 -264023 233152 215809 131317 35895 -56045 215326 -223812 -39121
18665 -177829 -65124 -89883 35380 141816 -130983 -234660 18383 -268161 -202716 -442449
18655 -442449 200127 12440 -182036 -143630 -164928 -79594 -70538 -6887 -78805 150218 -41034
18643 -315822 -140169 88581 78013 194728 55073 208559 -361787 -148513 -319378 -235629
18633 -235629 116640 244402 -128103 158958 255983 -58828 -16723 117678 -91256 -4437 65770
18621 55773 112613 -55426 39192 -13824 -89200 -26327 141693 -135862 65910 253720 -194575
18609 -298430 -84516 327385 -47321 -56127 13299 -149866 61750 4831 -103459 180442 160293
18598 160293 -87083 110236 -204301 179231 260408 66207 80342 -65976 -387842 -403206 -173298
18586 -44798 -15111 194194 211214 -244870 -238775 114209 41604 -45159 114960 104723 -23774
18574 -423297 -198323 -46531 179077 13738 28578 97382 186930 79279 -67950 -408492 79390
18562 -264463 11044 117030 -352502 -83293 -315018 -303136 -42115 -132650 -15574 -704 61716
18550 26998 -110897 -98689 -43985 85796 82676 -436624 -124653 -66310 -279066 -304003 -53481
18538 53118 -31974 -182450 124678 -242560 -215848 -277366 -76227 -236009 -116296 -329517
18528 -329517 51961 -3831 -79024 -197416 90168 -95296 295915 -437970 -980 -212383 -27260
18516 -124294 -79920 44745 -418895 -1723 -13391 -247140 -204642 -277584 -156064 90560 -15283
18504 -16527 -440078 -7312 122261 -288408 -57527 -54720 89819 -84548 -207941 -80953 -24018
18492 -119784 207155 213953 -64723 -1009 37287 -227886 -974 62487 -151666 163312 -146584
18480 -118559 -138784 25932 -128824 -114261 -258132 -165204 -378449 47302 23831 -236830 -20477
18468 71858 38502 -4720 -331787 290963 -38451 150377 -31606 -287514 -141375 86179 32265
18456 105 -275328 -491183 302779 40931 130173 -570 -216693 98717 -169292 -120504 -57845
18444 33522 137058 -58885 231 -213913 -182153 169498 291930 -103499 -132967 -386344 -25310
18432 113411 342531 -231796 64619 -199117 119254 23123 19912 54255 -53410 353147 128575
18420 26259 104038 219173 177802 -137610 51355 -255748 -162736 -6978 62590 126666 215288
18409 215288 -103949 111065 -143119 21078 110330 -69926 103699 60672 -118098 257644
18398 166105 -142906 -282163 -76594 111130 318225 141531 -58579 -92810 178250 -294775
18387 -39076 -152848 -315442 103769 -171685 -277738 -8614 50880 -19712 38081 39113 -185880
18375 -182065 -2186 -285278 321932 143372 219136 -22362 -106825 -113640 44736 -64549 -138564
18364 -138564 -117096 -104917 -104645 58398 151137 -3718 72992 97472 143988 -140799 -24837 -182590
18352 -182590 -124349 -365314 20319 -53123 -236829 57308 -39687 -628 -111789 -314057 30875
18340 -146780 175118 155461 -149167 -265482 27513 -62953 183793 -247716 48811 156724
18330 156724 67384 -11339 -222652 -463399 12252 -78308 63298 -65024 -260499 -216281 194379
18318 -95829 -32198 183194 -208318 -362912 347020 -224557 -124341 177759 -209077 -150791
18308 -150791 82609 167607 -149660 -273559 -14688 82852 -230475 -152256 -200155 -63136 -33017
18297 -33017 106689 -14555 106329 -149966 7216 -165320 -118831 -104162 141104 -328364 46005
18285 52063 59922 -88519 -245470 -53809 -447062 -87770 -278237 -404635 127684 -64882 510070
18273 -65149 -66676 -109069 -89854 -283391 -91412 17758 -472501 -167687 -9772 -225325 49884
18261 -84045 151905 -71685 285154 48325 -79512 -122386 120786 -164518 -99020 -49944 452092
18249 -78946 -95882 -146491 158209 -47538 -52519 -197909 12287 114701 304023 -104813 -46669
18237 20364 135226 13034 227033 -86017 -146905 -183829 234043 -158714 332690 46878 157414
18226 157414 -110429 -37348 27076 61197 -39462 -201554 -53050 -10932 7129 76357 46250
18215 46250 7000 91258 -100660 -20101 -266831 -107769 152431 -366496 -66463 -174515 -409495
18204 -409495 -221340 156724 276132 -92169 -175460 -312843 -71549 19942 -103207 7606 60405
18193 60405 -217178 -64244 -113242 -183315 6604 115162 -64479 437 17481 -117071 69840 -291800
18180 30519 -66815 -11162 -312042 -116048 151934 7456 175841 -153640 86926 -179671 33730
18168 150711 -7326 -24327 -111907 170742 -55098 -23659 25159 74619 -283661 -204982 204868
18156 -280307 -333051 -128019 -171017 -241848 -274203 -266719 -153445 -136812 -142419 258989 -294679
18144 -84399 140213 68639 -50704 92155 140883 -420684 -285120 -39395 422063 -106066 -142298
18133 -142298 -126204 217898 -88974 -113882 368069 122413 -280616 -178422 -370931 180578
18122 5702 109182 -72052 227513 91347 -124178 97507 46717 155188 24180 145810 -60054
18110 -216523 -156863 -135601 -86321 195896 -11576 218918 -66745 5959 100355 -222681 -235825
18099 -235825 -53783 -134557 102722 -17312 62438 -261341 -102619 62548 100218 -217828 -168325
18088 -168325 -322185 -114797 -255346 -148107 -24569 -242427 -57644 100399 145586 -51746
18077 -159667 -141580 40246 10382 34523 197425 -145482 -88629 190235 -85981 13525 47862
18066 47862 -53581 -167014 -283403 -190753 150127 -295415 142928 110955 371848 21448
18055 -15126 -82394 408095 -43635 257248 343983 83335 -199096 -86050 -181473 -223158 91336
18043 -36469 187657 -25924 114784 -192877 181258 155830 16623 54542 -86498 216370 -63688
18031 212924 188673 -92940 -168926 63870 238888 26449 223150 -143788 78315 80696 21308
18019 1400 -293725 12846 75472 -300351 -239649 147888 -161711 84521 76712 89913 -422729
18007 -357187 -186668 82956 -142871 -144147 -89910 -209590 -193222 -104334 -213004 -472500 137238
17995 7080 5349 -69879 180395 26420 -243260 173427 -56038 69207 568815 -106338 98748
17983 -378665 12110 -54605 202797 -36905 123341 115092 87550 -234747 249162 -98603 -366767
17972 -366767 51218 121554 12650 -230795 -204847 150617 -146877 118678 -300751 -34094
17961 -180658 -319164 156786 -418006 116006 -146764 78992 -33075 257957 -273111 -146054
17951 -146054 -26336 213758 237574 -285772 -105666 -186445 136193 121613 -101613 -218977
17941 -218977 -159025 -73989 413620 169429 -89322 62655 136593 -222523 -64060 25894 -120557
17929 31275 -81456 -334370 -162199 -171031 341443 219758 -180639 -5351 99429 169404 333175
17918 333175 212857 -151230 285286 36931 234655 212255 6748 -23180 -34427 -154055 -320786
17907 -320786 -4171 127779 10345 221980 101353 2178 91257 100414 9265 7565 134040 79639
17895 79639 -88481 530555 -292099 -250075 -80505 -122172 -166332 -69182 -78257 110670 -150176
17883 150287 104635 227814 -220519 68477 -133919 -257761 -64998 -86498 41418 25978 -192153
17871 115463 -334759 -72696 19373 140286 11433 216033 -204405 93314 -64416 154642
17860 202444 44823 -57231 -145930 -27886 -401622 -28550 41435 -416554 98392 -189017 270276
17848 -140265 -42708 52553 120021 -60825 51556 -69457 200211 -227259 -38064 -60504 -27589
17836 114720 315094 91037 -173370 -368730 -151933 50296 159714 9422 106058 -109194
17825 141622 -110618 -94609 -27305 -13640 99704 127512 -67596 123667 -82712 214732 146746
17814 146746 274997 -187495 524 -226284 158929 -44867 137853 216385 -30563 -630633 106352
17802 251611 -108127 87657 -376 -26396 -25252 -163149 67412 -97025 -48396 357978 -63467
17790 2723 -69460 336556 -266089 -43754 -79462 95119 61468 -356786 -414324 -43812 -114694
17779 -114694 163087 12014 -126 159713 -239151 -61723 -244549 115733 -356468 -50567 47283
17767 57593 -196651 203178 156623 149220 255481 -225081 -295774 81465 226086 -118086 -210797
17756 -210797 -57294 -291284 -36208 -257753 168294 -175455 348555 -261435 -222590 -122451
17746 -122451 15918 -66029 193335 -75517 107042 -33504 -15472 -112517 72830 -71980 8867
17734 302796 -116735 9819 158835 84512 -42432 42932 -131104 10093 170102 167786 -57601
17722 -133185 -19820 247700 262483 232336 180928 125813 -231464 40442 62470 201963 8825
17710 73686 -31234 238203 361905 154220 62473 -136504 -117995 31176 -179163 -130693 102450
17698 409066 -52621 -235037 -9521 160458 241605 53398 101169 56313 -37189 -114652 36203
17686 45308 5844 -134313 92067 246297 -280304 -311325 -129284 159981 -263014 -97764 118614
17674 -92973 339836 227568 381420 -103166 -182135 -51623 168553 -60853 20756 382468
17664 382468 -239129 220242 -47551 46949 -11680 -129783 291425 145518 181590 -174438
17653 -206834 83107 -7248 114540 133151 -99385 -13085 -105575 41248 227233 -9345 159188
17641 -274411 303421 191557 -42060 26102 60512 175446 101148 -243160 -167130 161 141130
17630 141130 -62564 207855 -343518 318082 -58188 73266 41150 -149617 19090 192795
17620 192795 22520 139007 -261362 42279 127591 -20075 -34379 -164874 356502 86761 -41509
17608 7599 -66629 -5412 -13907 -343174 259253 21898 -53589 -237991 44643 280551 -69677
17596 65013 -63373 -86811 127022 -366244 234661 92769 -31499 14504 -106638 192398 158073
17585 158073 -221856 209480 43357 -133279 -381962 28874 -81208 -167354 135301 -250779
17574 50635 -59681 -358892 107430 33213 169162 72098 192414 -109874 59989 49343 203712
17563 203712 246965 137922 171905 93232 167384 171744 124380 139725 -40708 -91780 252261
17551 65953 204945 -385 167831 -259727 275605 148698 85605 -22224 -87257 143746 -38868
17539 393270 -137012 60649 232010 168968 -247749 -85600 -40746 -122836 -54478 292918 33173
17527 85948 -263087 259520 -89253 109463 301293 95385 341655 65409 -33665 -33378 330555
17515 294317 -114276 125364 -111738 1117 275384 -348131 54970 -457665 185281 170835
17505 170835 325542 -94834 83663 42157 71739 178813 315127 57037 -43093 119160 40213
17493 60073 168887 18710 229085 130077 196204 -43823 103995 169964 218677 -82723 34494
17481 92501 351531 94786 296559 20055 161054 251949 328596 156754 238259 179681 177026
17470 177026 135047 248872 -197735 146647 56815 -8375 82848 187120 278093 162590 81921
17459 81921 -30463 -73559 110960 -48250 434825 183548 138703 315221 252466 462110 24680
17447 235858 39699 71106 -179672 279547 257347 490085 218708 126575 -144381 67605
17436 462011 37245 67660 120365 252709 464213 -12457 -72484 161196 131617 434307 -45336
17424 283400 403827 282551 544799 465977 184898 70877 228259 464564 330420 255814
17414 255814 148744 386938 347929 94518 235354 -35491 158278 211837 113028 -19377 46515
17402 380467 -30105 12792 -108677 513212 202607 131869 125417 282394 -61355 152818 294842
17391 294842 -43165 -151089 65860 134865 457821 56756 347012 308830 -130783 -105513 -232578
17380 -232578 181834 -121541 58673 231310 234789 -37112 376949 81317 80664 78218 -13654
17368 174896 -136822 522243 226156 47508 -162875 -13934 194766 -232481 -84513 337253
17357 156917 104428 177557 35142 118477 -105182 210772 -272302 43563 270192 199635 211660
17346 211660 199457 -88212 362692 -191951 115498 -308907 -46072 -85585 250092 -18889
17335 317007 70720 200007 152564 4604 261764 93561 89407 168890 -3062 -24848 197099
17323 110328 100327 327801 -49376 60906 257216 37740 -50662 45974 168159 171050 331419
17312 331419 148136 186988 -144653 62071 -207655 179702 346478 275484 282075 129159
17301 32809 215312 162459 92264 236065 -338566 131000 93004 170423 94016 63336 -44257
17289 120819 102945 172969 266974 321937 225485 224702 162280 151841 66585 329639 25485 -153197
17276 334361 421217 419998 277984 134797 121860 254269 446559 244363 264862 -7616 304756
17264 56850 14247 39997 294547 472391 231622 -49004 -8902 -89079 453148 340181 369145
17253 369145 326015 178641 160789 336870 292223 -35100 -20479 128647 -67360 303135 38914
17241 264064 50115 295175 188401 20731 -294239 104506 273803 228910 55925 -23576
17230 18697 294652 119713 301545 -68537 78805 116329 139659 329238 109476 65395 282698
17219 282698 72658 71660 127170 541778 -29973 225211 376658 211996 338382 264671 -95815
17207 528544 405423 -212445 229388 238500 514243 242008 63246 196773 328870 170863
17197 170863 328155 408256 -156572 318823 410488 503073 301333 -38870 -71422 517118
17186 208156 -61634 108510 45987 235017 424664 206489 311824 378468 29942 300077
17176 300077 357397 447761 409511 425518 297492 394412 283412 315554 492539 107451 -65408
17164 -54030 209802 298522 468205 210991 154435 611435 95262 598546 143890 245369
17154 245369 316783 255067 -37838 99977 244207 271158 458119 280472 343477 81908 196881
17143 196881 -135818 347863 185650 435124 -63008 397542 495638 285426 -169357 304855
17132 239956 384152 279358 218600 216926 405613 302734 201321 273182 246652 226067 377063
17121 377063 256454 505578 221550 275735 399022 431759 278807 220792 197941 719495
17111 719495 98928 374489 175994 366780 271968 318109 387019 395674 297958 -18540 97828
17099 488540 351383 102573 303249 295354 313411 344578 510126 164587 387978 318847
17089 318847 524019 535642 332164 475403 582357 7024 342077 241502 509806 187666
17078 596407 446612 323101 521708 548429 339526 502962 416691 558228 212316 359901
17068 359901 272444 900203 138546 446442 420195 820330 635428 572560 320962 457324
17058 457324 402267 579099 714527 233137 349469 358463 338871 518082 573762 600710 464603
17047 464603 211261 417538 503047 638079 402902 363405 223519 231269 403858 535005
17037 535005 508244 602507 312740 357479 551415 226579 588316 874785 613971 874408
17027 874408 336265 256239 708724 601529 602889 465925 469735 335026 386030 621017 637895
17016 637895 473970 335040 552946 603665 430340 468336 518696 337687 740852 864851
17006 864851 806865 591027 555333 318856 616223 621274 281106 516602 600150 747954
16996 747954 678360 664991 674777 633331 807458 533610 517353 1011940 899129 584907 515264
16985 515264 334337 978267 500182 854023 686526 416486 844433 928670 759636 580238
16975 580238 711225 784321 851641 1059470 654072 728875 1046391 849611 770449 795724
16965 795724 670279 891049 525211 794166 895755 725976 628076 760845 927371 903333
16955 903333 1286216 943489 1072210 1001886 1117807 1005924 1157508 825836 751892 986626
16945 986626 1016957 1240592 1002482 742568 633377 942603 890215 641859 1150732 910857
16935 910857 1137252 1191362 1029154 995353 983122 1234650 872767 1186895 914252 1057540
16925 1057540 1015509 1402614 1305824 1360620 1169756 1526999 1104064 1206189 1389153 1288700
16915 1288700 832563 933199 1224741 1149179 1337837 1486193 1241819 1324233 1265776 1076220
16905 1076220 1362925 1460584 1271444 1499162 1726141 1323720 1462246 1726412 1944998 1683553
16895 1683553 1416011 1777511 1530398 1642611 1552659 1482065 1639530 1730696 1462896 1564993
16885 1564993 1740342 1912706 1901885 1359620 1907559 2055774 2029191 1979884 1870562 2011392
16875 2011392 1982469 2124529 1825650 1941799 1948848 2045354 2373345 2368217 1940386 2226636
16865 2226636 2517415 2601354 2403922 2493596 2389537 2520763 2552481 2677042 2512525 2537429
16855 2537429 2378546 2641663 2510549 2930212 2975545 2917983 2808818 2757018 2896781 3169178
16845 3169178 3165201 3163873 3433675 3639333 3171954 3390618 3205505 3566321 3644541 3764612
16835 3764612 3863902 3742707 3722481 3773515 4368154 4136062 4274177 4252999 4341058 4633520
16825 4633520 4291083 4168491 4417902 4733061 4786694 4967563 5000375 4800206 5028959 5087095
16815 5087095 5645106 5327989 5530184 5853319 5926614 5932918 5867868 6423532 6410186 6513590
16805 6513590 6832800 6626829 7063833 7231015 7077731 7246219 7547146 7839011 7767206 8373944
16795 8373944 8612115 8700380 8832823 9024103 9154592 9782106 9835487 9999987 10615681 10466581
16785 10466581 11014339 11247020 11682285 12168317 12724056 12554189 13089144 13611475 14255162
16776 14255162 14477433 15295231 15710332 16084719 16582023 17529348 17845456 18841822 19478085
16767 19478085 20002546 20717977 21625596 22006504 23503339 24475439 25137011 26079957 27617275
16758 27617275 29096212 29919537 31548471 32954514 34655667 36271303 38019042 39903189
16750 39903189 41622536 44212877 46447034 48977206 51888565 54196587 57299713 60621633
16742 60621633 64220992 67936322 72144453 76321383 81056410 85656087 90695578 96448397
16734 96448397 102026028 108179877 114292566 120777395 127486900 134333894 141200479 148026833
16726 148026833 154924941 161645765 167852401 173702160 178650129 183267523 186549550 188633861
16718 188633861 189245071 188696332 187032452 183647530 179155120 173582452 167796089 160990484
16710 160990484 154339489 146872176 139327651 132355064 125810319 118795548 112170030 105982431
16702 105982431 100343099 94358644 88891174 83835123 79463496 75178370 71076399 67066287
16694 67066287 63970124 60591411 57092024 54217073 51539746 48962610 46394716 44243960
16686 44243960 41898770 39978744 38240092 36494918 34631827 32970276 31840550 30040332
16678 30040332 29202314 27656275 26834286 25359982 24549837 23598343 22569151 21865853 20856284
16669 20856284 20139587 19231416 18351542 17775909 16836048 16549275 15933063 15309094 15016872
16660 15016872 14622547 13940440 13377060 12618226 12361210 11910646 11704418 11095797 11276481
16651 11276481 10647764 10412820 10211815 9482138 9415137 9004423 8930969 8323661 8408052 8261865
16641 8261865 7931457 7770692 7570609 7419399 7048236 6980468 6949405 6658942 6285563 6364547
16631 6364547 6172659 6127819 5478378 5736434 5384583 5400647 5057425 4967969 5282218 4981451
16621 4981451 4615591 5063088 4388531 4584639 4257528 4006396 4172182 4229315 4032670 4043995
16611 4043995 3799990 3719290 3956688 3771630 3565655 3215326 3426221 3744830 3162542 3204531
16601 3204531 3574905 3110416 3361056 2997344 3140326 2693601 3125586 2735876 2481178
16592 2481178 2690367 2487348 2581527 2409339 2620483 2866057 2401841 2246035 2291457 2094348
16582 2094348 2226236 2136674 2035995 2079893 2292776 2567483 2008741 2061596 1910172 2373904
16572 2373904 2047308 1787573 1664010 2002545 2120132 1674983 2114968 1763445 1477527
16563 1477527 1874080 2032312 1609243 1731220 1778406 1456184 1474518 1637511 1551232 1576732
16553 1576732 1480698 1929551 1701447 1437918 1325715 1380086 1658741 1224951 1382233 1260850
16543 1260850 1335303 1456554 1423207 1338342 1277624 1363638 1167549 1621632 1313825 1466774
16533 1466774 1028992 1145324 1385533 1049907 795230 882859 1038319 829674 1294031 766844
16523 766844 1046054 946635 1101137 815776 955668 1140845 994617 1079218 1282443 489395
16512 1009983 931983 925435 723839 841628 823384 838195 856643 671960 696299 938230 817388
16501 817388 595719 749260 620370 1101555 973469 986896 837234 645017 661921 707635
16491 707635 656632 778842 593416 960079 928452 725053 678690 1030545 661642 621664
16481 621664 730212 562992 758967 841718 802620 696113 379054 531677 551669 485869
16471 485869 480009 526054 685329 534525 557271 538637 677603 649066 556973 710920 618152
16460 618152 482711 704491 344591 509915 568107 940434 607558 658329 548426 564701
16450 564701 654488 486153 607536 220797 669040 412764 716981 326012 355577 294621
16440 294621 232016 538942 283904 401887 400420 133722 318403 397451 601568 567279
16430 567279 705967 455748 218983 528526 578317 580449 452390 545662 216889 127543
16420 127543 615495 428273 514010 434574 410131 597713 447329 398327 470806 380175 519692
16409 519692 531598 383822 283819 804332 173143 326012 60903 450390 417397 86378
16398 304422 -51818 262329 569170 515638 463462 181130 447172 -92209 313469 279802
16388 279802 570352 163493 466613 396813 457665 492718 121696 184622 461190 285036
16378 285036 558942 509348 479270 89321 257798 413015 -67771 70242 426343 255304
16368 255304 383532 -64201 246794 -59583 143547 17784 283327 27581 383177 108916
16357 313623 12910 395518 150335 52447 209949 2070 57261 -181731 582800 312603
16347 312603 237273 283892 463779 181610 35372 407942 178525 -150890 81400 225443
16337 225443 128005 237592 168166 136411 217536 46773 258028 77104 278755 -79939 -50863
16326 -50863 115784 439046 244076 -127306 -468 88967 254851 449806 304289 166185
16316 166185 60135 119926 80933 -294628 155166 -62650 182375 228206 -10306 197050 259720
16305 259720 164834 405836 186527 58580 115187 93358 228172 87084 275950 301390 99341
16293 440067 156333 143763 -129859 158913 72245 308988 98405 140643 36623 84641 -76099
16281 241952 7418 -42129 126912 284604 -91110 112700 107502 339854 201851 132636 460105
16270 460105 421903 573048 -174878 151543 -8283 58665 215840 101459 285601 123277
16259 -69444 75735 457941 -102861 -302456 146337 280541 50680 154328 161449 7463 -104088
16247 24515 7137 41513 82552 140028 151697 18932 283779 -86268 469165 -102836 199292
16235 47980 -44912 280725 103062 66709 184898 280432 216900 378235 248997 2674 -153447
16223 -169311 20178 44337 -309458 13090 212051 -236489 31039 58273 115420 218091 -20221
16211 87669 270896 -371032 158210 -12495 100772 -98759 -221944 -33707 -85223 17719 91971
16200 91971 192209 195527 -59941 142914 459762 -177325 38716 87082 167657 -90080 370575
16188 102977 4216 301574 -171060 -118737 -149404 128538 44626 89808 184287 223677 12390
16176 75000 78878 -249405 257994 -38121 121463 -145714 145156 226867 156265 -191515 -103784
16165 -103784 103568 39400 -17484 40019 -31132 7375 -59001 216507 120688 172432 -40491
16153 -10701 -21993 -119855 89824 342024 -123525 160269 140579 -292451 -68400 106337 -132107
16141 -149413 -75602 256084 49966 88974 26289 108115 73823 -245895 -69632 115065 78982
16130 78982 -50412 135470 -165433 181165 -290651 -226230 96651 -110465 265427 16048
16119 7050 -73641 157087 -306431 17039 207100 -145403 3429 144977 118717 -187425 -23356
16107 35610 80239 18297 -124827 -22661 254436 -72598 347556 30788 160967 260774 23693
16095 119921 324681 254475 -179509 -65266 161936 131822 361248 286986 129868 -166803
16084 82287 -307170 193234 -129713 199439 -55104 174516 452612 9121 232095 -24694
16073 -24109 49827 26340 53815 -32379 54493 -85380 -76743 4780 93385 157461 -119517 -168941
16061 -168941 -390957 -59600 -102138 -273272 83378 -48008 -228000 -136069 -148150 -67645 -111071
16050 -111071 -62129 2198 -64844 -221540 -173736 76170 -221031 116265 -170008 182359 69259
16038 -36670 119210 -181062 6202 -48121 270613 97809 -617455 37008 -220533 34504 204958
16027 204958 -137655 -275947 34337 7302 -80999 -303287 -274239 -118780 99301 -76591 -120673
16016 -120673 -74748 -501956 -307680 44013 87392 -96116 224305 -238193 362263 -128107
16005 12132 158771 -123948 -152817 -12857 -76828 269553 -120374 73671 -228938 2911 -29498
15993 267616 -102430 -165826 66818 18693 -83820 196716 -196052 83011 28630 205908 -14322
15981 27147 6418 -187790 383683 -223637 -77013 161572 -362 428440 83723 -141291 151610
15969 33540 36091 256519 78232 -108008 258355 -17237 94159 19069 -9529 -112202 201587
15957 -163918 -180378 -192283 -148631 10694 83784 59825 -241845 -59033 -325278 175236 163871
15946 163871 77281 415085 -34946 -422106 -361918 -206137 220824 73573 -292897 229765
15935 794 -49248 82153 290131 281579 -397750 140886 119469 -91314 -62878 3716 -42018 -223988
15923 -223988 41666 68032 234716 -56113 -282830 92115 -109474 -131405 71904 -212443 -14602
15911 -95789 6042 -182378 -275268 -206342 194932 279312 -98635 217325 16121 -29459 -212100
15900 -212100 -187892 15695 -217086 -404929 -150271 -216755 -126183 -142819 -75948 -129489 -15601
15888 -248122 -17030 148569 -318336 -14742 239337 -21024 -182719 19334 88609 -105233
15877 -279026 -77973 168317 185543 114033 -32821 73456 -381868 135490 -35899 -278625 26644
15865 15154 254633 -73741 -94441 241517 12479 -544393 -49267 95149 -305256 -100912 17638
15853 229007 226211 160433 62576 18405 -29059 -220285 28539 -76375 -73789 38058 232323
15842 232323 -20752 -306923 82298 -21843 -117754 -116742 28141 -169374 158152 342537 254987
15831 254987 -314807 148535 -157596 72699 122362 66897 -19042 -41653 -217964 124744
15820 -48437 -31243 -47840 126734 120035 -139262 -187730 -156233 -102486 -174877 -170756 -82956 -28436
15807 -15134 -286079 147018 -179781 -286013 -176007 331910 337912 199410 187702 -29013
15796 99228 -66672 67931 -19469 156778 113459 115784 -151782 27351 -557560 -57723 168133
15784 -74687 -243859 -134417 -295435 163716 -215283 -53326 -225272 125023 12048 -133116
15773 218976 341854 243097 -52669 43352 -251980 -46650 101913 166669 -144615 -214875 -398996
15762 -398996 -123632 135222 -54949 140752 181560 13165 -206646 101115 259712 -76920
15751 -258387 113028 -194127 -182119 170039 294120 -7475 74554 373629 38068 100649 267366
15740 267366 -69230 -295338 -249371 166295 -52447 -87339 -64363 -244837 -181161 -321988 -145613
15728 -11534 55352 -179355 -255728 -254438 13135 -415267 -316824 61010 -270306 -52073 -159781
15717 -159781 194097 248900 39208 50381 136353 -28747 170674 134454 -43619 196572 -239619
15705 -7679 167100 9466 88929 -458070 -93439 -272758 147524 -388349 -14905 117123 151298
15694 151298 135900 60146 -93487 -325805 -13253 -46887 -110775 107734 106810 -33625 22898
15682 -134415 -84731 -143434 -30000 78428 -187597 79244 30976 81247 -25143 66852 -302028
15670 271521 -262022 -444976 14606 -32009 95957 106563 -111153 119043 -413478 -205915
15659 -206598 137702 85623 -310617 -205618 -171614 67186 -292407 -170192 -8691 37472 -67101
15647 -38388 5656 -118169 21537 181901 -167210 -204692 -225713 -29189 -144163 117238 -79307
15635 -65926 376256 -69076 -216973 -218502 -59113 130862 -62820 6785 16891 57301 343739
15624 343739 -61655 -7010 278980 27825 32008 -6403 -182133 -63575 63916 -93191 452770
15612 -176763 -412752 -93484 -27459 -280283 -120251 379457 -122901 244158 17297 279293
15602 279293 -27759 80066 -397616 -67358 -305381 -80197 75664 -170566 -120727 -124069 -201487
15591 -201487 -30654 -76583 188597 -157510 76077 -76321 -87190 172534 58254 99280 -8558
15579 72862 -46277 -355421 47677 -64915 -247419 83420 -134283 3541 -119037 96007 179685
15568 179685 -108181 -437019 62793 -371955 104426 97552 -102211 -42081 234107 73921
15557 186228 91064 315777 -202022 65398 234881 -313231 -95293 38561 -143110 27134
15546 156640 148227 77280 -2460 16550 144028 -291201 -86419 68217 387114 227734 44003
15534 82569 -109170 156001 76459 290748 131411 146606 169645 -129665 111775 -162177
15523 13278 53810 22235 25683 195320 33245 -209108 158126 -38684 -156168 157937 -129953
15511 -56829 255213 -127714 -71135 52364 227401 -397747 -313058 393329 -59090 -202849
15501 -202849 -89238 -104065 -24641 -20905 195660 142904 -324652 219413 138131 136604 -57217
15489 -130401 -13455 -122723 -80342 32012 -57034 33464 -194664 -56775 213610 52571 -67935
15477 57328 -192717 35780 -47897 308038 391054 164074 -12407 71337 -177245 -213262 95497
15465 31187 -9244 -37603 -110867 -16615 101658 -60816 238891 86624 -268949 46063 349376
15454 349376 -141279 -19464 330536 -177752 -55965 -100695 195888 -244847 -287572 208338
15443 76265 20127 -96283 -20644 48960 6705 -213655 -200068 -257417 271209 -110403 4008
15431 -27566 -171330 -192142 20934 -9140 -115509 180818 -2246 162232 -252303 -34007 -152882
15420 -152882 -31023 -139872 -139791 179878 198862 -91326 -63660 -14533 141539 -14515 335118
15408 587 -57240 -16162 176320 41682 463406 -42069 40721 239055 -77874 -106410 -132785
15397 -132785 -7712 179527 194424 -317402 32235 -306109 -165920 -3803 -221906 -8329 -46431
15386 -46431 112694 22792 293 -118642 -69157 -279031 -128090 -34017 20863 -206306 79942
15374 -185888 13517 -56557 -103919 -207004 219950 -281815 -65216 -113878 120679 201721 -40893
15362 191475 -1647 61547 70170 -13356 69247 45630 48561 141466 -362672 -23275 40257 -120275
15349 -193368 -163533 83741 -138686 41522 -19546 -69001 195413 -184507 245917 161077 -61815
15337 208271 -119687 -154808 -163733 -209557 -38720 -74133 37163 -94287 -132819 134909 143203
15326 143203 275839 -39606 343860 27564 -110774 -133462 -159831 20153 -21960 94030 36611
15314 -66966 -122723 21368 -95762 60375 129401 -71456 -149939 238257 -191182 45975 8994
15302 -33285 -191727 67550 -135366 117076 3007 -286173 13260 57154 245191 157843 131107
15291 131107 -16569 24233 -118106 244157 -42638 -44874 -220275 153225 -32874 67124 165713
15280 165713 542320 226426 -26869 -230676 -138862 -70982 253699 230921 91694 -79248 140777
15268 122843 -90624 249580 155501 110164 -72830 81804 97478 -81393 -4523 71782 236752
15257 236752 -45913 6849 576989 -68804 58842 66221 507786 569941 396515 985366 735062
15246 735062 946775 546820 179756 252502 93442 -94724 -45657 92960 39288 75926 150414
15235 150414 57939 -93044 68741 -36476 -50827 10082 51684 316269 -238320 106842 123489
15224 123489 310437 -128192 157219 -229253 -97853 75214 -14086 -5313 5140 98524 295573
15213 295573 103168 330713 -75332 -95032 -358522 170422 97027 94169 184545 95784 121649
15202 121649 912 104552 -122690 -134203 68961 -145785 168483 191151 -27291 -143379 -278223
15191 -278223 126886 -2089 88069 150793 -93275 66991 -52660 -164062 283060 -163224 89065
15179 -79084 174643 58589 51984 144738 -111956 -94317 284085 197325 -181976 -154232 170162
15167 144846 -145599 -30435 -28126 -104781 77168 107562 192114 -13778 187701 -67393 237455
15155 -44755 -26299 307178 7174 127242 179846 126147 89331 154805 169795 70754 -116990
15143 -31235 34146 252270 371281 39967 -113501 213570 108830 -146097 -145463 -38304 130708
15131 -60488 -204586 504589 -97274 44099 290339 123329 193096 162554 200958 209945 207322
15120 207322 188651 234508 -9705 17559 309017 213237 356119 165405 283400 201991 19482
15108 334547 100005 180951 104786 154330 141589 299106 319665 119665 287811 128222
15097 -73174 209401 418975 40094 -116573 133622 198203 590359 197707 169422 35976
15086 -119593 141174 127452 264774 190662 47521 229497 272294 39472 217294 29948 198572
15075 198572 149226 -33432 36864 58484 69479 67159 121527 230676 345201 412503 99208
15063 124938 156428 89715 67372 214249 294074 172272 75168 131774 351978 209873 216156
15052 216156 107816 -33574 163287 76555 68053 470040 199759 -266625 167665 196883
15042 196883 -177115 61081 208790 312791 253016 329683 -139595 -164983 136659 641149
15032 641149 493527 177261 278321 103999 127217 -76575 285149 -44688 65734 72502 332971
15021 332971 131228 241331 126205 239488 218430 322417 160013 274170 142269 131017
15011 131017 174240 199489 103494 26512 362829 45374 45461 211049 -27697 292968 180056
15000 180056 -46248 163827 91022 318885 286289 362053 201279 -29540 118946 426839
14990 426839 636545 93019 230597 480766 384766 252650 246573 128731 207957 -43611 260445
14978 153454 244902 -52400 657326 257180 -138386 174732 114903 350868 203851 423035
14968 423035 108374 258824 266587 488307 47626 106566 109645 -67460 100823 107889 181921
14957 181921 -162653 341210 172791 344731 171194 303270 148565 299131 449244 345560
14947 345560 324717 529 36021 97652 48033 254405 237114 11415 331733 205173 409993
14936 409993 190227 137698 333252 -69378 280839 196438 236282 163807 -2256 74724 196966
14925 196966 -56801 423714 365852 202189 370868 120407 232396 212036 245843 161421
14915 161421 287384 358567 580016 330668 269731 73511 273409 374188 531883 305124
14905 305124 425315 389681 599080 332320 281668 102571 267403 551816 333326 521543
14895 521543 218152 98499 379673 222206 271792 227748 514997 675024 325232 461769
14885 461769 678993 335269 637424 621205 547518 393204 201378 159872 463393 258133
14875 258133 20061 290107 285909 158086 500539 207000 313695 331646 2228 384962 506592
14864 506592 237295 526877 442865 561498 290742 245175 458006 152450 322754 215178
14854 215178 480324 577667 315326 134562 856961 312134 530711 568726 288745 495441
14844 495441 327897 276281 495284 402825 529687 628518 317093 102766 409299 381537
14834 381537 258977 646784 532349 379787 525407 750798 371640 494170 552101 470601
14824 470601 217639 407087 338526 264663 525961 139901 463400 434452 513243 205207
14813 814039 630233 348210 507344 712720 386874 463951 185128 358396 213738 455403
14803 455403 378425 566821 490754 244874 480772 531710 504391 255729 237588 228876 470439
14792 470439 288533 693971 270586 423095 328158 452964 687413 435118 279580 448348
14782 448348 404224 500011 549373 371671 315418 277643 426962 585936 892045 654861
14772 654861 914302 505842 786215 574540 671706 474368 623136 362971 994269 958771
14762 958771 187089 497505 415109 821180 543474 785244 844954 334869 790625 575460
14752 575460 685014 851773 590597 725611 762597 357973 766667 825021 937304 547468
14742 547468 572245 473928 861282 815930 494305 554476 663304 844439 694507 832454
14732 832454 731364 982068 790696 795012 601032 826490 621268 472478 682025 733368
14722 733368 586577 818376 743726 749078 675245 813146 956862 745177 921929 696839
14712 696839 829054 764593 807771 939079 765275 895967 932686 806650 854756 1200483
14702 1200483 1206265 1035089 1066084 622239 701987 921167 864157 669582 866018 608930
14692 608930 813495 819458 1139317 1026840 934753 1026699 851792 688864 710487 964636
14682 964636 951200 900764 1320116 830566 462065 835719 883084 738487 981831 899156
14672 899156 777963 934061 1425564 867631 677402 1002639 910549 727067 1039316 960684
14662 960684 989477 1271675 807218 1060041 1402413 1174036 870117 1207489 1188932 1187359
14652 1187359 1329061 1034399 1041620 1172237 1024776 1367811 1172266 1403356 1071817 1403977
14642 1403977 1085651 1070101 1199764 917361 1221613 1125534 1479956 1113269 1177077 1322983
14632 1322983 1433718 1396565 1198037 1195273 1218670 1408123 1032063 1326603 1313591 1210574
14622 1210574 1280760 1398893 1202981 1555791 1683869 1391187 1607462 1461711 1183419 1255596
14612 1255596 1404480 1411503 1666243 1244560 1491168 1696986 1793914 1582996 1751201 1527680
14602 1527680 1440740 1449014 1493418 1400248 1503967 1634382 1501929 1791028 1530141 1599870
14592 1599870 1747083 1737663 1889794 1598401 1766785 2273085 1938270 2113119 1986010 1718598
14582 1718598 1982583 1869007 1861628 2033075 2005570 2131249 2052333 2036298 2156848 2209396
14572 2209396 2216697 2486109 2184661 1881940 2719233 2304500 2561520 2516735 2608815 2845401
14562 2845401 2803109 3103607 2957587 3280155 3464817 3518990 4267303 4106207 4544378 4895053
14552 4895053 5411963 6419988 7534403 9153627 12257948 18168297 27102360 28583721
14544 28583721 17535404 9241047 5920832 4551464 3737233 3462155 3014895 2533822
14536 2533822 2803245 2911984 2747284 2730199 2479107 2533231 2838074 2609383 2361160 2453066
14526 2453066 2207210 2463673 2821408 2310017 3026583 2620226 2551852 2676894 2646208 2252514
14516 2252514 2792428 2404105 2551459 2789387 2771819 2389071 2643885 2689861 3034276 2920874
14506 2920874 3092455 3036398 3090238 3007376 2885897 3408519 3146528 2994108 3219244 3098084
14496 3098084 3236104 3494187 3399641 3593200 3302296 3471387 3433136 3259530 3745816 3569630
14486 3569630 3502276 3508309 3349634 3646779 4110968 3787565 4105525 3447475 3924876 3846177
14476 3846177 4148979 4039244 3958520 4365200 4048073 4208306 4365198 4180195 4534917 4516554
14466 4516554 4894918 4555179 4405964 4876466 4551901 4572504 4637873 4849457 5272171 4750419
14456 4750419 5036660 4930049 5078648 4653820 5080609 5186466 5480673 5166960 5421127
14447 5421127 5494970 5420390 5707244 5663308 6262721 5760405 5786058 6295476 6031258 5904934
14437 5904934 6048521 6242797 6540947 6458006 6803312 6756424 6959201 6829020 7058296 7209893
14427 7209893 6911577 6999950 7330752 7437313 7403684 7351975 7843677 7733095 7934816 8138816
14417 8138816 8302373 8342835 8263911 8548547 8613187 8582901 8833187 9062931 9227644 9501122
14407 9501122 9481799 9559942 9806032 10065963 10245173 10176978 10246020 10338717 10687337 10892663
14397 10892663 10586082 11373259 11243714 11642939 11818965 11884626 12271907 12178681 12576715 12950124
14387 12950124 13247135 13025781 13371600 13633583 14164820 14034442 14388081 14680713 14880569
14378 14880569 15169272 15392863 15754594 16180286 16555089 16731803 17395530 17421676 17612298
14369 17612298 18196246 18564403 18821980 19400984 19662221 19989581 20587453 21167766 21384604
14360 21384604 21917307 22021016 22625847 23253004 23915321 24731531 25211930 25796411 26399571
14351 26399571 27061990 27539007 28016999 29291598 30279624 30476724 30984974 32255127 33171476
14342 33171476 34097961 34669498 35936711 36976940 37979442 38708901 39790353 41253328
14334 41253328 42623757 43891572 45177103 46731824 48148866 49557719 51259111 52728192
14326 52728192 54605570 56414121 58607568 60630184 62732755 64822072 67153532 69748465
14318 69748465 72162290 74931978 77623813 81010312 84234831 87448109 90828048 94620150
14310 94620150 98260204 102669281 106686300 111443310 116537576 121438257 127235609 132895846
14302 132895846 138954774 145448162 152152659 159129990 166950346 175086273 183658287 192613620
14294 192613620 202228600 212170469 222863902 234085437 245431584 257133057 268410921
14287 268410921 279955511 290059857 300216832 310949982 321481668 331741324 341423274
14280 341423274 350864795 360292101 370391206 380702391 390606003 400645461 410634011
14273 410634011 419029550 425386465 429887102 432982668 432035992 429097641 424591984 415868686
14265 415868686 404173359 391575189 378545397 365556044 352532360 340103413 327407544
14258 327407544 314938194 302666039 290795148 279338185 267836882 256825429 246276465
14251 246276465 235945611 225709466 216008375 207099537 198306848 189738993 181600188 174261486
14243 174261486 166921313 160127720 153434776 147171228 141285557 135500762 130058466 125021842
14235 125021842 120051788 115139812 110868592 106548827 102623106 98733297 94863278 91421283
14227 91421283 88043655 84525129 81583451 78194316 75782749 73242419 70485328 68512101
14219 68512101 65542545 63617398 61404227 59516625 57579022 55780384 54118643 52157166
14211 52157166 50813888 49092768 47384140 46294991 45163485 43962845 42182984 40868862
14203 40868862 39667028 38449515 37559379 36604284 35503532 34296560 33139274 32666013
14195 32666013 31609706 30527543 29967833 29446430 28490138 27974566 27059907 26443632 25820250
14186 25820250 25388355 24613713 24044834 23498209 23019813 22552383 22111687 21525968 20936708
14177 20936708 20552311 19946987 19838136 19064506 18744961 18496810 18295975 17440734 17414883
14168 17414883 17232925 16761393 16324082 16227051 15675086 15528554 14881435 15065496 14766925
14159 14766925 14537306 13999517 13454499 13669389 13397774 12912799 12985044 12819682 12496908
14150 12496908 12317409 12252732 11994694 11637625 11475318 11433497 11224906 11003545 10491713 11050967
14140 11050967 10183499 9948468 9959248 10043950 9913520 9822592 9815923 9243577 9229562 9051602
14130 9051602 9272835 8865903 9061661 8674307 8436640 8221585 8245719 7955813 8379034 7966012
14120 7966012 8134036 7695778 7687669 7601922 7422049 6933752 7068804 7299189 7173174 7048600
14110 7048600 6806398 6689469 6737782 6605847 6923175 6307247 6342793 6379906 6104591 6118787
14100 6118787 6171074 6138317 6050119 5836870 5703475 5899893 5936075 5091284 5382672 5599516
14090 5599516 5490330 5267309 5344663 5140882 5517848 4867834 5032066 5015952 5020836 4933227
14080 4933227 4989523 4810675 4633716 4716542 4579538 4876178 4656585 4703303 4349328 4472934
14070 4472934 4377513 4357777 4263017 4055963 4221173 4248991 4075713 4053190 4199126 3891784
14060 3891784 4045203 3991321 3828035 3932023 3719426 3920143 3646096 4081771 3618498 3715421
14050 3715421 3489010 3391912 3472009 3533910 3440261 3499856 3394875 3326900 3458369 3417023 3334495
14039 3334495 3019077 3319961 3220436 3010280 2965202 3279573 3083866 3115508 3139910 2830980
14029 2830980 3058690 2766127 2845661 2715217 2783242 2796907 2680338 2727932 2629557 2836265
14019 2836265 2600252 2709359 2507130 2607234 2494142 2736286 2686179 2132084 2532025 2280774
14009 2280774 2580403 2380890 2458138 2652462 2251932 2292716 2606438 2460404 2365002 2632173
13999 2632173 2752887 2577987 2857478 2987973 3323323 3283314 3506425 4048585 4403978 5066372
13989 5066372 6342119 8822917 14231702 23326973 28124194 20047681 12366861 8440902
13981 8440902 6555579 5486788 4512462 4466056 4186589 3725708 3625432 3397820 3223540
13972 3223540 3059615 3063559 2624388 2641506 2748121 2431447 2674120 2320454 2672136 2317597
13962 2317597 2089178 2319790 2585064 2380205 2218174 1960253 2180381 1983252 1921790 2061044
13952 2061044 2125266 1918266 2109216 1676230 1789501 1871672 2009415 1730321 1949831 1947114
13942 1947114 1498270 1722422 1788068 1714277 1778023 1767718 1846089 1697195 1593606 1532209
13932 1532209 1740492 1898608 1447974 1299975 1361697 1758891 1452345 1476739 1390457 1691046
13922 1691046 1505749 1384903 1572872 1544753 1294610 1259214 1507382 1451401 1537696 1520586
13912 1520586 1217182 1403564 1503536 1200386 956191 1404606 1363232 1567966 1345635 1634943
13902 1634943 1227992 1235586 1263937 1423266 1464620 1254247 1444298 1544639 1138793 1453383
13892 1453383 1315126 1264875 1117543 1076811 1303610 1281435 1275778 1156835 1013350 1255804
13882 1255804 984245 1123542 1209500 1066523 1004809 1109811 1405456 1231289 1060309 1438348
13872 1438348 1343957 1387368 1032792 1115144 984546 1281923 1199212 1224846 1314853 1095955
13862 1095955 977095 1078797 971628 838991 1196963 1197318 1102777 953512 894421 1055657
13852 1055657 1017194 1026886 1087654 1012502 1149935 902173 1261373 1171981 1383469 1049824
13842 1049824 894802 1199077 1061344 941778 883664 949533 1089165 1101313 1258700 1137266
13832 1137266 1406389 1107634 1064835 697739 1028188 839569 968454 873552 571169 1093998
13822 1093998 620650 909430 743888 706918 796055 882828 855867 828371 689080 932128
13812 932128 637910 965006 1011574 843793 880737 824657 471879 661533 709789 1094087
13802 1094087 833983 546667 1017412 825362 616238 743571 1188567 643081 694294 820308
13792 820308 752485 596522 674737 673667 792312 534408 914599 811672 748670 1052678
13782 1052678 737824 425837 510650 801516 482816 800674 811856 595231 781658 769581
13772 769581 629640 770310 551565 370077 715999 636578 396670 564601 395968 857554
13762 857554 467852 540921 457124 643410 703750 780138 658113 748335 981617 810327
13752 810327 558290 429394 667483 643350 530355 797786 407599 447835 921942 665684
13742 665684 483023 472583 624401 1206526 612611 496602 816717 625233 653533 727461
13732 727461 355566 215162 441923 708155 544776 574258 300860 440978 487767 744212
13722 744212 316599 901019 320252 536914 500541 543087 511016 412749 462473 317759
13712 317759 588427 675850 455072 636010 433779 513555 260926 571343 548226 398190
13702 398190 629637 453412 464744 613383 536683 485311 590917 329073 339041 250021 573677
13691 573677 489819 674990 603429 421425 574322 548795 18523 552091 618837 707108 363725
13680 363725 653476 623635 565002 621700 372699 295231 360083 346664 305189 710929 85012
13668 574350 767780 434464 395585 547453 342691 364750 552134 214666 285169 371034
13658 371034 -78876 277382 745915 436469 386831 533671 432282 560674 297249 398986
13648 398986 518022 120093 288000 629270 301880 397268 200732 516631 504005 579649
13638 579649 549015 725220 346018 59992 426037 419426 524630 369236 503941 110462
13627 459726 637763 181360 576742 561801 454497 210500 515735 343764 375174 446304
13617 446304 405931 350695 387220 354911 249800 415946 666970 485726 112573 315390
13607 315390 307522 347943 619368 452189 438928 182272 254566 267329 105100 189854 301615
13596 301615 219368 452603 329384 393511 345572 557222 553548 227478 198679 526104 306641
13585 306641 555716 410132 259042 55410 548601 341228 216896 677952 241115 626856
13575 626856 21772 261597 427632 504848 333504 98771 423953 260727 381458 204345
13565 204345 377567 46669 207523 344118 554338 244942 -184937 301222 489855 252615
13555 252615 352051 342456 670691 316766 290316 548312 429374 279356 430894 257115
13545 257115 422093 488208 277654 133747 149146 314896 54804 111843 143031 88888 -64319
13533 270269 79543 -152602 550445 366673 203839 235467 26318 102770 534554 80045
13522 310520 208258 343748 409168 305773 173156 92905 551954 586237 215347 67538
13511 280190 351532 257583 438898 613952 338232 573581 -6379 183143 78974 378048
13501 378048 655522 -38785 172719 -209866 260012 310733 279179 251438 243837 529022 -76200
13489 259999 375581 453081 250729 293931 220449 351855 54332 158938 461974 291914
13479 291914 -131296 109490 77689 61417 360238 238689 119452 208787 19765 381542
13469 381542 5843 -40420 479573 239879 -17881 78868 450550 375141 95412 -87035 126957
13457 -10469 157489 -61109 366397 516499 192312 100097 558812 393962 238469 -163769
13446 206143 143642 -82875 126402 156302 257344 127211 -183170 146614 338438 41351
13435 209183 36043 198928 270214 186096 294740 -19406 4908 80858 342101 384432 137462
13423 194872 -37764 -44988 13045 217943 -14161 186197 268210 -88128 149365 128634 314294
13412 314294 495931 381232 496302 193820 160576 -27233 189532 333574 366469 358641
13402 358641 7595 414772 227045 337406 109648 41503 118747 433470 157076 120044
13392 120044 212266 239933 112770 486005 416046 440485 243816 -4271 311629 425105 149392
13380 136708 -175844 238190 203389 84844 -85174 13000 92918 579569 85010 291994 -38547
13368 -30368 275115 -56714 351418 128202 100568 51098 64546 266774 330011 196934 261699
13357 261699 210148 -225658 834575 157678 181498 398191 64373 22830 197899 251542
13347 251542 155411 128933 535372 323070 610849 366971 54223 110383 535512 402087
13337 402087 526481 210738 183827 352882 119005 41057 258253 6272 69916 70239 204558
13326 204558 185115 158880 338282 346084 440926 9708 406392 437485 30954 245113 152471
13315 152471 146187 394272 -81238 64497 1921 260018 -55891 242660 17214 228271 159547
13304 159547 105385 227500 200197 -217292 208732 266972 57165 117317 232667 307451 364690
13293 364690 338018 -81389 364018 212068 311141 339357 207736 -208177 -136963 18227 45815
13282 45815 -26693 -59039 4796 -153445 390983 -20114 338030 150285 358243 -78119 250000
13270 114908 -23680 4734 160774 45675 137595 36545 -49547 95653 253552 24511 298418
13259 298418 -270750 -118062 58099 315809 89068 -71975 273628 241639 377173 131749
13248 -127124 396430 33565 -51314 156627 286310 -109463 310064 11444 119420 -40351
13237 -88055 96748 340059 392580 68491 37851 27083 130574 166498 -62686 104718 47237
13225 -4520 -3483 -369398 545968 88021 180732 -110813 59188 -107814 327647 31216 308445
13214 308445 106391 53341 -18134 -23319 122463 173641 48182 129203 128570 114699 256406
13203 256406 -11843 447462 123487 -162591 347213 -4702 71697 -98950 451081 -150737
13192 152058 -59257 -21451 259461 -170467 198202 23672 481417 37563 198898 163979
13182 163979 -97441 35641 -138757 -130773 119367 520529 -176225 -123711 12918 76562 -174661
13170 304570 110341 86730 -123686 322775 248726 23609 340093 100680 392888 -170690
13159 16291 281005 -66333 62140 222259 11899 263127 -5463 -6590 -5859 92345 408122 -58066
13146 -142403 136517 3739 345921 109994 -32806 58069 149343 -7762 -58018 -145948 -11697
13134 121439 -298226 30641 205532 71397 397691 212017 189672 285048 -51554 49538 26156
13123 26156 25423 -63234 -106871 355116 425861 110284 -53753 -26370 47199 49881 322920 394164
13111 394164 49617 54742 -179337 73297 -88759 245451 -134865 216347 119406 -180523 -49303
13099 -134941 -259521 147707 -53905 170892 43479 310213 -196427 -15945 47119 125687
13089 125687 95640 87861 34238 154880 -127236 -108415 94789 235605 277380 251152 -90501
13077 -10821 178992 603527 -118104 -168181 -251195 431863 510513 -94209 -173072 71333 82317
13066 82317 151588 173599 131001 -271778 375883 466821 137401 -23180 -305063 152889 291118
13055 291118 82679 -73160 -87301 -9840 -98244 161031 318084 118823 299365 170776 98411
13044 98411 138346 221105 315565 -59211 -330423 -74805 -67353 131780 149620 240207 85770
13032 215366 165466 -58685 386069 208501 -66903 164562 225651 -106455 15866 508669
13022 508669 75416 24651 -10042 201401 -5598 257700 400071 148689 -65534 315178 -27757
13010 -83361 245653 212314 -188298 164675 -174027 -301798 179147 86239 -208627 173113
12999 -315089 -143178 17100 220217 -204800 120979 -152877 50430 -259907 83754 291515
12989 291515 -244080 -16218 322444 354290 42074 -17113 26871 -58122 165278 51327 223734
12978 223734 150038 400540 181300 -122810 -221572 55516 -82559 81586 -352945 266832
12967 330900 448628 14693 49647 -21585 52389 16316 -29422 138451 196286 -278582 227765
12955 260446 -175380 273047 167785 167561 -94795 151310 27638 -126746 -152650 263964 -4571
12943 67530 -72288 -4304 268081 -77962 156895 -273406 178073 269077 -111366 145704 -77462
12931 -5883 271445 -49216 97993 259233 -129480 182469 112315 -67251 70821 77746 -105139
12919 132419 -120807 79025 217436 -87652 -28618 -90625 -269070 -265094 -263648 155089 234247
12908 234247 78765 249 27935 151052 52069 -200179 121719 54416 -130510 420937 170472
12896 -33855 80971 156395 199587 219358 -214448 -100993 -61517 -53487 -102553 202236 373871
12885 373871 -26935 143689 291813 -43969 130695 -88251 157451 -129305 201465 -117227
12874 -202389 34400 -62124 199438 -63527 39886 -294029 -105911 -193446 221676 263031 114510
12862 -151788 -2970 110291 261050 119223 54496 197951 147512 69458 17748 -9029 -66762
12851 -66762 105187 -102716 140239 53342 54154 18687 101859 -322188 -288568 156337 56817
12839 16171 178795 66807 391563 263564 151686 -392609 117527 -102423 -182272 -236803
12829 -236803 -2138 -55312 -88469 -170140 197779 -5286 -111309 -77598 -157662 -63800 -194594
12818 -194594 -48230 159297 326931 -40962 -168191 -161642 60190 162011 -119587 153392
12807 210677 129439 -91829 -74687 305126 233843 -49651 -243365 180518 142404 -149844 -126043
12796 -126043 239302 -30806 248881 184042 -70779 55742 49769 -177576 -292672 -54031 -287262
12785 -287262 10736 -253109 136256 511549 -283222 -242455 -35047 136183 -140457 30331
12774 -59044 -70495 -85333 205943 -15559 -331549 117901 274092 -149882 -83377 186623
12763 -66104 -175638 -13979 -45435 -274046 375990 151545 -51495 180434 -90828 132926
12752 -14075 76188 -308150 -190245 72943 245189 62832 81224 94912 112151 175710 -158675
12740 182311 -109809 176421 59513 87547 155646 87428 114979 138337 116901 49026 -229036
12728 -72072 -158262 -132021 251827 -58807 -34617 24309 -25118 -164581 350753 58797 -84057
12716 -263220 35359 11139 -4832 78914 81700 113352 163719 100582 99229 88866 -156255 105357
12703 215011 -138087 467257 75963 -111783 -114915 24527 153905 286698 22128 127805
12693 127805 -48467 184619 86953 267540 -145975 299078 -90569 101245 178437 -89799
12682 193530 178048 -5895 -87101 45065 105288 42419 290096 138232 -86033 30257 107217
12671 107217 468688 -234212 1657 157912 -12980 224419 148300 -79208 298970 -49129 68494
12659 101779 101210 202627 214180 -38746 206734 -325576 110230 -38311 205132 234860 -128673
12647 40712 36472 121202 72779 -45906 -14579 -179085 -111670 114498 35825 297363 -31569
12635 160531 174252 37382 144182 139903 358943 4049 -19927 30261 195624 -209766 -280618
12624 -280618 154219 -22548 -10052 70004 111740 224407 250521 -65120 -18311 392216 238701
12613 238701 -714 -23005 134106 10672 9035 -94444 -272902 177805 -20308 408142 -135486
12601 180757 49734 251658 386901 355495 66308 262966 249080 344122 -93849 -161636 94350
12589 120633 119590 -216650 -182846 -41459 96266 -77133 -125922 -7753 -4161 101669 -18891 -126573
12577 -126573 197642 -88254 343755 188776 -271981 -152532 -33496 -376892 92878 -247761
12566 -167421 -199097 53410 -48278 243179 49680 328423 -26141 -116006 95195 175179 -206340
12554 -144340 41562 -187033 290661 60107 -280078 -178934 -68899 27409 95088 287234
12544 287234 -241783 -31067 94009 346500 -29800 -45233 -176489 -485468 67241 366463
12534 366463 24467 -161531 30394 306368 -177312 194705 347809 -28778 -310640 -132645
12523 -67612 -98234 25758 67507 -24733 145502 34569 179865 67190 -49012 429087 130495
12511 33468 -97585 322319 101334 -168325 46532 202191 -123339 276713 -73034 -123220
12501 -123220 -798 242713 88766 -19178 14008 -119203 -50808 -333849 -95905 237954 -335053
12489 300218 -212496 77880 76515 -88022 -472140 52601 27788 172808 116371 193704 34570
12477 -48667 163076 177328 -175646 -95400 168166 -301301 267148 -47551 -121215 -163577 -3874
12465 -57901 82182 -138777 225668 313408 71557 -147667 88536 304132 166923 200030 13442
12453 -59633 -173796 -145417 -26524 99523 267143 -138321 -295695 73206 321709 -109560
12442 -257139 42132 28215 -195507 -161360 -295632 -95593 4713 190026 -373063 163969 147134
12431 147134 394923 -82720 88766 156051 3170 -246293 30492 -222047 -131124 337429 -348416
12419 34138 70769 36591 226482 113708 98970 -83883 149132 -16690 314618 -35860 364712
12407 -8494 112014 -148033 -125766 93850 22487 -167906 -7737 135145 126767 16928 -23320
12395 -139442 -51588 360161 -153275 265985 -57958 -198213 2751 79862 -275283 164793
12384 177656 -385964 -32686 -127246 -101233 256078 -216973 133111 -25223 -21967 55894 129419
12373 129419 106354 -43639 33725 -287947 33407 -222434 48258 46406 -248039 -180621 -88737
12361 -110201 -286453 -12850 -31291 -283862 92277 107395 330763 -104243 -182190 -126545 189354
12349 -149685 -65542 -92850 -224619 183230 -39271 -22686 -225234 -44496 -349366 -131505
12338 86796 273283 68298 77042 193081 -131919 49975 107304 186545 -225645 -54882 -83641
12327 -83641 256880 -274096 358755 78784 1258 -44083 60026 -163174 -199316 38952 222864
12316 222864 -92240 4559 78270 -287855 -68347 -69381 -126983 202814 101307 -106372 115289
12304 340328 -51007 -112311 -71017 27666 -151894 83566 -77628 76959 65927 159930 135580
12293 135580 95209 21669 -114665 -33370 251795 159862 -68231 -290690 -183551 285535
12282 12773 133692 310090 267766 -19013 314122 -210332 239405 118409 -3792 -115874
12272 -115874 -74562 -122546 -111717 131821 371768 47363 -134770 -76511 -18230 -242040 32329
12260 358533 77607 186212 316853 -8083 -110998 67723 2447 321629 -133108 119496 14317
12248 381250 -32440 180284 244089 157757 62758 19750 37459 239974 37260 -141474 -259733
12237 -259733 -138509 39087 225713 117762 -280528 13367 288683 -80996 146699 230686
12227 230686 107615 43672 91428 280026 236151 353214 349700 9901 -86701 403755 471687
12216 471687 -130179 270940 422568 248368 196681 182042 -45702 231712 -93991 177353
12205 120182 308980 128126 347388 256540 -38104 74486 298444 303789 503208 -38369 142337
12193 8277 276157 -7330 150623 141098 46199 199831 439287 -194276 141520 -54633 -121856
12182 -121856 -193011 -102163 184588 310707 -43428 -12662 115001 136576 -56981 148828 184307
12171 184307 -85902 -154269 51485 52978 -2693 193632 168389 244795 195431 -66735 77390 146207
12159 146207 -235 245969 -19686 119674 39098 220631 146631 37548 -84128 236724 335134
12148 335134 -147236 -31050 -88261 53068 125267 140785 46306 313491 209608 -40974 -102481
12137 -102481 161861 -181697 -26692 29371 11268 58610 -123744 14014 20593 99736 277198
12126 277198 -154140 145522 -121646 219780 42603 293880 -6291 3568 72448 22503 -124212
12114 79352 130661 107504 239014 -37606 -57997 228914 28893 215559 -276378 -131614 26841
12102 104165 131136 -110654 38500 -289104 62580 102697 80050 -85517 -281165 -167188 -132837
12091 -132837 180961 -140946 -4326 -251233 2619 -123020 -30786 315512 -468482 21788 -213560
12079 65416 -220638 41374 -283442 177692 51941 354306 -138000 48706 173406 -260877
12068 34951 222576 -13337 -116239 81071 -24515 148199 178056 466580 328421 692600
12058 692600 316427 393206 2738 -179197 76977 -11940 138841 -265687 296664 -206937
12047 42304 50756 -128704 17468 -104779 254265 -484842 56600 -195738 199606 -226556
12036 -133323 -200101 121941 25597 -45125 -97591 268890 26525 -109150 -100031 -111000 180175
12024 271899 170351 30666 -145461 -107741 -5842 -56557 134274 165111 151279 26129 40672
12013 40672 180263 160943 -42814 -33929 224157 115491 -198341 1150 -152893 -54802 -201331
12002 -201331 -158238 -380652 38747 13130 40997 -235324 -93610 -96779 -155447 57328 -61376
11990 118646 290129 -91723 57018 -311466 -300747 3450 165232 -275763 35231 134127 258745
11979 258745 -32372 180049 273300 212456 47737 94254 35262 102256 225379 -32575 113610
11967 108962 8062 -186803 36493 299158 -6538 -173716 37909 -377458 290883 30871 -181385
11955 -106354 -52912 -47512 -257230 -290884 -300293 245873 -39804 136257 -106390 -91560 -9658
11943 -281924 -159138 -316299 275087 109785 99930 -123720 212013 -103956 -57025 -67400
11933 -67400 132865 -17080 367044 131954 48308 143970 12404 154482 -93197 -88417 -43748
11921 184604 135309 429533 118506 -190339 189361 -36234 82937 -376793 299909 92160
11910 -75626 -138338 4569 -99954 -173978 -13138 -114856 -4541 36673 -134145 -188995 104915
11898 302746 31259 211781 -290402 -58844 108331 8634 81343 -132534 -24410 -230128 229566
11886 -118687 -310823 20373 -140687 68209 187367 -52753 -127268 -342735 -17364 9763 -24170
11874 -101562 90200 761 -484006 -192515 -227309 32007 -105107 -164559 151236 -138263 300456
11862 65025 -248328 112532 84259 -382925 -144488 -29127 -42961 -70201 -114620 -356487 -160671
11850 37637 86256 128506 -230526 33604 -21932 -244546 -52310 4312 56092 5246 -27590 -145228
11838 -145228 -239318 -185439 -121428 38707 -196274 253976 -106092 -66227 -246213 -12470 -17478
11827 -17478 -213680 117123 84683 -30369 229354 77817 134130 -225046 84798 -158954 51993
11815 340 -32676 -561255 -16671 -60666 148098 -990 79078 102716 -268009 -30046 183024 -99552
11802 251112 15125 51973 233304 -150882 -26472 -76755 -60124 -296245 -140714 -283596
11792 -283596 -15862 128700 -41433 -223495 302837 -201103 -404412 -160004 104237 45893
11781 113922 -15170 -400132 83878 -11286 -96400 209872 128310 -50397 -135307 171816 -11120
11769 209771 129819 330722 -166839 -128192 104673 14374 35749 -12318 74204 159656 -291298
11757 239983 92929 180897 225072 -233073 68939 38852 -91853 -64250 311568 49054 -370234
11745 122461 -174070 80559 293987 131874 -221026 -235441 -99044 -106576 -10859 188975 7627
11733 108241 115854 -7876 -98503 274575 78494 -14955 198941 -92576 -20888 114462 18163
11721 -169366 29455 147066 330857 152270 86385 213067 -40381 84690 -76736 -222342
11711 -222342 116808 -122806 272326 -36733 40293 177046 -6854 -29999 -50027 -45001 323156
11699 -171508 148483 -58182 -217267 -236151 39863 -35639 -15805 143296 157924 111348 128053
11688 128053 -60609 301170 52809 188224 197445 -53030 -88768 -131583 219908 283072 362770
11677 362770 136130 -122000 62306 173781 164045 95750 -22566 -171672 71608 66686 -110615
11665 92560 253627 -25512 19633 176993 -62182 169687 -137601 -62946 225136 5423 37555
11654 37555 21587 539006 280945 132945 9829 -114465 -73440 280692 -152493 -107106 214248
11642 -62963 5637 -25661 54046 -162689 -122336 296524 -219894 7185 414965 -157349 218161
11630 -60667 -20179 48201 317735 236896 81506 224012 -46165 -282098 161648 -120009 351963
11618 -234575 -64607 -115637 203429 283372 188371 314251 129131 33282 231563 159868 -47820
11606 132466 74086 -269932 22064 -54238 -267770 285961 -3395 267419 101531 -51081 -34915
11595 -34915 -31224 223688 -75489 -239 -31649 -36722 246817 138426 117395 -55678 3004 114938
11583 114938 305145 -306779 95855 -55908 -84226 156115 55509 -148930 -186429 -54428 4358
11571 310652 4542 -127201 177583 136651 439750 216355 91501 258023 27093 79897 332827
11560 332827 -201031 333650 92780 104296 138911 -216586 73852 1569 143936 -16952 191243
11548 92538 -50850 67340 42598 -130087 -371499 184255 239488 27204 -75705 182070 25124
11536 329262 -137722 221737 132082 -126847 -146293 321705 287098 -46216 -111938 -187305 423159
11524 -215696 -30051 -94040 -37070 40538 116882 -115170 21425 -182300 168905 107534 -90630
11512 159705 345034 251830 82986 81072 49061 411167 346204 -7591 135818 196738 166987
11501 166987 -27251 -308984 49009 215843 94400 -45322 -128580 423965 172883 -130342
11490 26324 -74542 128290 602232 51918 320839 336598 140735 187379 214703 172069 74424
11478 673098 375969 307061 108943 61085 115424 -47200 43271 237774 -332010 -24097 43458
11466 82910 -18190 256761 248034 31763 141527 104578 221035 29712 124328 582947 290687
11454 44435 399799 -173400 209301 21361 349174 262795 661245 -52301 35833 -155611
11443 331558 183334 494 221883 -42599 74220 233172 -52479 100932 315540 -144120 72121
11431 -69104 -263850 275295 -227726 -196575 28535 -296261 -56484 386697 -163715 307113
11420 111215 230819 139937 63218 -55966 -371870 178761 -236848 7056 209725 137922 192609
11409 192609 -229391 -19356 -232376 -246746 44232 126562 36125 102870 14717 -40554 315911
11397 2938 50576 -231907 -259976 243454 220998 -443768 192548 -7565 148695 -166874 -177027
11386 -177027 -61728 120316 -64049 547315 6190 161488 60634 -66601 87759 -20453 129351
11374 -52714 -199723 302080 182089 51126 -100696 325495 -34983 72643 366800 -72797
11363 -9638 -301504 -68475 64869 -124225 71073 28583 -8614 379338 53546 -90355 142735
11351 31967 -10160 -99222 251451 -180894 3870 262749 -12225 91632 -151433 -164159 -170271
11340 -170271 -248751 86840 144566 162385 -240533 -143596 -126584 8236 162576 190320 -241059
11328 133798 -148710 257627 163145 -132488 -71648 171076 -84691 -19741 339661 23057
11317 43651 -135343 -199718 345006 -98010 -288878 174531 -114497 256836 46931 -90064
11306 36870 -186507 30994 146725 -137493 45816 96537 -72023 63271 76160 -78418 -108553
11295 -108553 -200677 -24142 -196509 185302 -56560 76034 -50841 59420 14884 87754 -165289
11283 6173 -374863 -165821 -36400 -146082 -164909 75162 -148892 -172075 -209437 -168357 227924
11271 -266001 -108561 22895 -186208 -308551 -189929 -45460 -178971 348963 174256 -108741
11260 145544 38131 -342444 320661 186277 17450 -298900 -414534 -55259 -166558 8540
11249 -82493 -42819 -144619 168576 -258635 32460 172733 -143896 -427758 105831 19924
11238 -187016 -11344 179614 -208008 98514 -6373 35754 139436 121919 -35504 -139185 32151
11226 -247247 -63650 247570 228971 202328 -315987 -166006 -280558 219173 130421 87939
11216 87939 190424 106793 143573 -199534 84058 101954 -166687 -16575 -107785 -119916 77761
11204 -311012 64654 -179077 -216825 60749 145505 -62897 258124 -269915 -220382 -50852 -50094
11193 -50094 118266 262569 -138126 138779 139816 -88217 251592 -54035 -123034 125147 297416
11182 297416 130367 65010 87309 -141915 -88632 72835 -91762 -132097 140829 -7395 129485
11170 149176 92870 25295 -220861 -73378 66233 -66294 255590 80363 116686 -47789 41888
11158 -156985 184109 206413 518568 -25941 -200328 -132647 -14 45505 -547456 -138026 17106
11146 -7372 -297521 -7458 -168343 21888 -155273 43648 144628 330660 -6925 -169850 -240192
11135 -240192 361991 -42555 -12995 33634 464410 114423 266532 417785 -74635 -87378
11125 -87378 387567 93385 -163979 100270 -70398 -364900 -212235 -938 426812 97286 152999
11114 152999 -84022 -9509 56155 125241 95746 201854 14899 151927 392057 -81154 -174705
11103 -174705 337462 -37112 -78254 373686 385065 185415 158384 49168 7473 243210 100247
11091 202981 325841 -45277 67629 76119 299706 169021 -6746 -108911 142516 287096 51647
11079 403409 509144 296368 282672 222209 319358 519427 265602 275441 183841 257744 281489
11068 281489 343506 157293 613013 244787 324400 242936 453012 437273 515793 657748
11058 657748 347787 543357 650641 743071 673741 420332 760885 1041342 1160319 584525
11048 584525 591964 592745 590353 1090031 665182 685470 766486 800475 541538 815936 445974
11037 445974 773681 791232 263310 980749 839384 832891 767479 502810 567551 515778 374932
11026 374932 546518 933182 608250 765388 524310 963125 727859 940849 734287 630205
11016 630205 813337 595759 615936 406174 884904 656760 772585 599423 1113568 621869
11006 621869 947527 805727 535673 477167 444656 805489 794727 843299 368553 987281
10996 987281 1123078 717816 641813 553264 654973 1095589 786511 419414 1224330 1096813
10986 1096813 1357238 1158573 1210339 1005912 1598177 1141085 1736351 1706455 1788732 1467183
10976 1467183 2074661 2565339 2428052 2823513 2571266 2968053 2694454 2675566 2718082 2265813
10966 2265813 2165948 1854977 2109442 2297166 2232203 1954756 2110397 2251514 2176330 2101988
10956 2101988 2003054 1824655 1379970 1335097 1198484 818932 773298 872165 422512 661825
10946 661825 383138 734120 350120 366096 472954 487092 137047 201833 287579 325142
10936 325142 189492 130583 -81909 197306 -67658 497600 208890 402865 -133827 335102
10925 -156269 212612 65126 223563 -260495 113857 7885 -176564 35729 125575 6368 188378
10914 188378 -138795 -205701 184788 89193 60920 -98067 159847 11139 240093 -139227
10903 52720 -18591 -321971 -83628 128991 -107214 -59317 109467 -117969 119978 401842
10893 401842 -161739 33749 8870 -218957 4492 100335 106108 70748 -29704 188987 -67150
10881 108768 110732 -219254 103990 -166101 23801 133521 -56262 69597 85098 14661 45642
10870 45642 -278383 -57972 -144273 108883 244339 261313 -1433 97654 -216895 13684 91527
10859 91527 -149917 119297 -151003 47005 146978 15651 -342584 59497 -88694 122742 -143666
10847 -257065 27855 85802 -152010 -244585 -241451 123858 -164746 28220 68777 -8941 196992
10835 71242 476482 -49186 48015 -59636 29702 -406380 -161129 -348141 -245929 -149478 36553
10823 -64171 32081 -371993 -42257 -118226 258290 242401 -1859 80694 -351382 -57495 -51479
10812 -51479 320500 102093 -100208 19861 123170 -56967 -491960 -121992 126523 65817
10802 65817 300040 301500 128605 125771 144520 -41339 -196432 193566 -65741 -54836 153148
10790 -24657 -42611 -149523 217612 -1465 -135037 10619 55827 -72709 -65165 -178625 -330467
10779 -330467 -66637 -322778 104377 24176 -273392 -22836 -199820 158184 56499 -82346
10768 -368314 -12890 -145621 49072 -255179 -168092 161528 -53426 179774 239725 -377988
10757 -17299 7444 -263886 40121 -57370 145116 -61112 -80352 215289 -101916 -235397 23345
10745 287012 -15193 55109 -60852 -104639 85090 104699 -324343 -278464 -2895 117530 -240864
10733 -117313 -408812 -231773 98095 -431315 -312292 -106475 -77682 -134787 6250 -230862
10722 -101206 -150159 357760 25209 -33414 213130 146414 321387 -38614 -252153 -80260 148562
10710 -87166 32465 -67545 -96626 -3674 -46997 -71375 148497 72460 -85745 -154803 19965 -434740
10697 51162 -164929 -128387 173045 53859 -36208 -328074 -37468 33017 95193 101047 201118
10686 201118 -3546 -206791 27 -44769 -204497 -169620 44372 79238 -141950 -37352 -83104 174193
10673 -8333 180547 -317657 -46613 -25921 -159604 4161 296721 75568 -248853 -435453 65779
10661 111703 -138192 198407 -236921 -123750 -28362 -468352 -37874 -242061 256596 -198771
10650 -62041 -78268 -27324 112117 -151198 -105573 -46628 -194887 -8169 -122700 18062 217666
10639 217666 -108297 -52890 -14085 134129 -321615 220816 -163099 267194 -137389 96355
10628 52713 -86773 -50553 -40677 -245576 -93976 33986 -210964 -98198 -35213 -49958 19422
10616 57327 77930 -166557 -124894 16143 59082 -146890 78297 -18386 265413 -194645 -143216
10605 -143216 7425 -247538 -27221 -4363 -119911 51834 -126304 -96506 146364 75950 2878
10593 -86011 1499 -44991 -35676 -26713 -113179 129057 87073 -160368 163997 -261210 -44392
10581 -265665 -15211 127639 200149 -27613 94487 39287 -451152 -49927 -245257 -48218 -82331
10570 -82331 -132657 14892 130134 -45076 -284388 -135142 -102828 -123281 -254290 -71092 281960
10558 99495 41666 -78259 33307 80906 24622 120212 -224603 268033 -9864 244161 121538
10546 48467 -552178 -218251 -35361 -156694 -114703 -13842 25646 -141697 48301 210125 -190361
10534 -297765 50955 134160 59337 141470 -57490 220774 -100509 24840 -414115 -109143 -271860
10523 -271860 -54324 -201470 308417 26589 -84464 69161 -9446 -117735 -43108 102850 -180517
10511 -231636 136770 -51941 124100 -256734 252897 -16561 208697 155716 -204536 140786
10500 -43690 -26648 147458 -49039 71331 -105640 -134318 -140270 -7612 -18377 137442 -281625
10488 -122623 -110978 495881 -27316 198110 -208013 134505 74971 450779 184303 16306
10477 163498 142258 -92268 125994 -161326 -130876 1674 -23269 -138933 -234527 272671 125614
10465 -399588 192395 4124 160760 274870 62314 -87188 123082 -292063 10169 149822
10455 149822 -2110 -165808 58131 -44562 -73165 -188832 244896 -179814 -101639 -72317 158555
10443 22822 -361330 -27843 -45506 -287639 18110 -33898 14439 320192 67451 -101397 251217
10431 222269 157843 -85974 -118187 96844 -80561 -87404 -321347 -210727 109871 -226671 -209384
10420 -209384 65017 -280561 11740 -74550 -108490 -234639 -118462 -20178 396151 -42233 97149
10408 113932 228615 -237427 36361 -140870 68490 36910 129454 59984 273387 -18117 -11843
10397 -11843 159717 352333 223233 -92900 143044 181956 36043 120292 357261 -59740 144344
10385 157412 38025 -20067 -72323 169276 -71389 -11953 330111 261388 15302 338350 466207
10374 466207 65465 319388 504871 -54691 432512 402177 325130 512230 427938 233686
10364 233686 517416 187289 315603 158423 261522 224254 117442 469065 229512 65415
10353 354146 382012 322666 433421 633707 154104 598945 561790 650633 396616 284734
10343 284734 182035 282132 321038 1107 166928 172062 -41327 298707 222422 46599 149326
10332 149326 119000 62610 137852 430155 24187 212408 213416 204253 341050 10273 492881
10321 492881 36476 6427 320262 155938 378936 242829 269487 -137686 18613 34177 -114880
10309 197648 139108 36792 -25367 39212 105810 40092 108651 6686 110688 231756 73408
10297 -420719 -42051 -65685 32377 -77716 134803 -152719 112714 114100 -83662 -62551 -69641
10286 -69641 57417 -7550 -464564 -221351 -210497 84396 346678 -106990 185511 -292948 -76268
10274 46399 -33499 259171 -9374 -260596 -205696 134797 296384 -23951 -195374 -110547 258609
10262 121428 457614 630027 344092 344915 398618 668190 51115 403329 179675 286804
10252 286804 30512 255930 60080 -6817 -155863 23005 183124 96875 204715 113476 73007
10241 73007 -42308 -122770 -268429 10296 -12352 -106044 -6088 15171 91100 98799 39249 -134719
10228 10728 -8495 385658 81733 -322648 253648 -4045 -418537 -73758 -38860 87347 -176794
10216 -150102 138600 -132945 -120249 -129424 160406 114643 -319976 117331 116177 52211 -213002
10204 21153 -12948 -137422 -306852 -116185 -238989 -216442 60848 257444 134480 163005
10194 163005 -230188 -221964 98201 -240447 -293121 -35753 -131165 -71062 -71857 -141301 -274492
10183 -274492 52497 -225266 -372426 -11631 -33191 -590829 81031 80322 154977 -50389 -71128
10172 -71128 108096 -38548 -44909 350549 -86531 46876 135515 149059 -250136 -135776 -269419
10161 -269419 -20205 410916 -122597 -158627 198209 -78666 -48016 -49527 -168730 -309058 51824
10149 -89212 -343658 -66898 -2212 130595 -338 225210 125261 -286644 -5296 -104405 -81760 -58403
10137 -58403 -333924 -148474 -227321 91215 211583 -311299 -75525 141925 -53875 -252507
10127 -252507 110187 227262 -5097 -40759 117405 -51958 34783 10354 -13652 -31343 -171272
10116 -171272 -34463 -52063 -201533 44942 -312027 -43991 -245482 94038 25580 -73787 100740
10104 -494860 53701 21903 -162327 -90153 10702 -460360 -172465 20811 483294 354153
10094 354153 -203749 26937 -12734 -295456 103428 -118616 -25905 -540867 -169993 -94873
10084 -94873 -65251 -244498 -95347 56195 -165045 89710 -106529 -450368 -73965 123554 -83555
10072 -38254 -7169 293232 85235 -267330 8890 106344 -107459 123540 -163155 -169539 -200890
10061 -200890 4727 -37776 96052 -91927 -200367 -84485 -52365 109836 -188090 157930 108619
10050 108619 -306818 -307136 298697 -142505 -222205 166370 20307 235210 -194546 -51370 -346999
10039 -346999 23902 -29640 123061 2484 24698 99466 -215469 -157070 -170533 7962 -69009
10027 -151000 76785 95937 -102817 -45029 -208906 -179104 -65708 225437 -68431 -495635 -129853
10015 -171848 -361037 73976 -37976 30173 -300647 344908 -121020 -268155 73832 -211210
10004 18719 -45479 35662 -161374 10736 30176 -166846 -7472 -183714 66274 117127 -127414
9992 -88650 -276369 29164 -358237 -113179 167624 -203515 -69392 137075 -72965 -153586 -209015
9981 -209015 64175 123709 -190250 158319 116527 -182443 -119445 148009 -96347 220233 10432
9969 -216370 -42202 -568435 -368404 -220718 131826 -78077 -137657 -62789 -88567 3922 113989
9958 113989 -168107 -310862 48001 33258 -79086 -129897 -66279 -3430 -98079 325190 121682
9946 -133295 141091 -90663 -94658 -291957 125486 -150261 -52824 11202 33398 -288692 56131
9934 -111404 20847 -10364 56707 -143666 -21866 -263981 41620 -223529 -105169 93610 33263
9922 -26810 23645 -123406 -108842 39109 -139320 -187257 -36431 -86741 -349100 84684 -249130
9910 -212979 -29183 -390391 -146327 -396046 180757 -23766 -423250 -18232 -66644 -93186 -26031
9898 200642 -133863 -143871 -129413 54228 -8280 84841 -138694 184470 -111006 193079 -101061
9886 127785 80926 83278 -385497 -141813 37933 -91445 51832 97215 193157 -38316 161198
9874 -172267 25025 -224799 -94234 -198541 56179 -75012 108368 206431 -209319 254543 -154768
9862 -101470 -266524 6736 -233774 74827 -37470 -105917 5518 209361 -461304 -167848 -18718
9850 115597 131490 46083 -281862 -258406 -162775 -305620 45458 196193 -201292 -213598 -95097
9838 -182314 -88577 109777 18747 142732 -48290 198209 -123723 11535 -330431 -222036
9828 -222036 -128406 -242804 -79361 871 -102086 -335039 12506 191463 38996 -103407 -398628
9817 -398628 -274277 225838 -248441 24700 -38248 226987 -192211 -313033 -222144 -95650
9806 -63467 -279921 -175445 58252 113283 -152820 -174950 -10421 298031 -126325 -296903 -36342
9794 -351325 156568 -216901 -86651 -76587 -408052 66586 11774 -229522 -46135 -145978 220114
9782 -306461 7718 3799 -91926 -14535 74091 112633 -152165 244570 -250565 -156291 83340
9770 167904 -41539 -115421 -210934 -166060 79105 -191265 -255860 -47900 210457 -80419 -182447
9759 -182447 -404925 27088 -50232 -20549 -67932 -213043 -234952 25774 231671 -188856 183432
9747 -8434 -46639 -200813 -26249 -233154 -384213 -131172 129509 109664 -70589 -53635 24071
9735 57709 4575 132010 -128979 -164649 -613105 -196106 127495 -82906 48012 -37934 83844
9723 350247 -254713 -119601 67667 71919 -124810 105667 69115 -123858 176695 -125288
9712 -165326 136073 -87317 -166545 -154518 -142908 -282890 -247584 49865 -123462 -248739 251155
9700 -74436 75436 -120545 -293262 -436421 -77676 -4914 5642 -223782 -23677 109742 -154446
9688 -18803 -6908 109559 357534 -138734 36393 -274953 -144945 -168133 -75469 -99483 47396
9676 139924 89687 -260805 -21498 -293617 -423129 -164400 35448 -462610 -202570 10211
9665 162187 39579 -260435 -147163 94064 -147629 -334131 14023 -113382 -3577 -95922 26144
9653 -48583 -278717 233832 -62669 84015 -50007 42613 -87880 -14560 264964 -208283 -226259
9642 -226259 27766 35345 -253694 -226228 126795 106450 -266908 42300 -6883 125513 -141207
9630 22847 -117148 61172 -157539 77025 -113600 -198201 -301342 -393484 -84524 106956 47993
9618 15613 -182081 121967 17587 205882 -236972 70519 -27473 -379676 -119890 141778
9607 137252 -206910 59838 104536 -236284 -145521 -251497 201785 85375 -178001 198518
9596 -327268 106159 39547 -266098 102371 197170 215277 -24263 -468470 -414853 -49009 193253
9584 -287876 179833 64210 80104 -341193 -415774 107490 -191201 48548 -28786 -472356 63642
9572 -142978 -175997 -130006 -183262 -221264 -34997 -118150 -56593 113553 88673 -132245 9867
9560 12708 -56927 -41007 -314946 5156 162617 -171910 -187308 -124453 -79472 45542 -147718
9548 -70359 -371002 -45803 141243 209778 -202481 -121312 -175539 43416 86755 -240253 97099
9536 3979 -382245 173145 35117 -152674 -375806 -177257 194459 195067 -174955 -139639 45363
9524 132619 359648 29610 -57740 -91239 390190 37082 -135428 272638 -405501 -94382 16596
9512 143248 -145033 -221989 188720 -284719 -129263 -8249 262273 -131114 -69852 -174201
9502 -174201 -125467 -445303 57158 -296393 -213237 -25742 235493 71838 65732 -103381 438738
9490 -119431 -75935 -263753 -231543 -167774 -69411 4303 1084 115425 64632 193115 -7066 -4264
9478 -4264 -187432 -54164 237401 230296 -242194 -267069 7868 14752 56290 445711 -316082 37230
9465 -165998 -38534 277875 73216 -325671 -23269 -102609 -103886 -245003 73843 -106706 -207332
9454 -207332 494148 -267584 -249003 72448 -299895 -13570 42197 114216 -23462 -447145 -56478
9442 -18115 170374 90192 -207662 24986 -296429 -190201 -99523 62873 22686 -152845 53483
9430 -78790 64409 -506702 14281 -182706 -61840 140538 -50226 173708 -154249 266010 79208
9418 -7941 -95750 126645 -217278 -172780 205617 -126856 71818 45455 -6915 54374 -293535
9406 139147 -93255 120075 -160830 91708 -108159 179894 54843 181107 -276020 -281554 -59045
9394 -85334 -23531 -130511 -56466 -230553 49930 -71215 330772 -195440 26318 -236928 131871
9382 -61282 88382 6523 -66429 53840 -117618 28213 -101574 -148538 -550931 55227 -341734
9370 251082 129333 -175 -180782 53449 -75562 216457 168621 -274259 -119291 -75584 38079
9358 314342 -157362 -183414 -82910 -223616 -38291 -119312 -8037 -63232 -182621 56817 -59002
9346 -80109 -365153 -169694 -93821 -223954 -246379 128617 -43475 -108082 147097 -125413 -121834
9335 -121834 -241383 -114770 -192641 89166 -21519 -113447 -88578 -127132 -391868 -159357 -41690
9323 -227788 -219570 2115 -15412 -54950 -96794 -339114 102998 -217616 -71594 1720 -160893
9311 -56278 -221817 -223593 9233 56231 98453 -58854 22932 -75800 -255631 -65160 -49043 4046
9298 48076 33881 163015 -37677 173 -82598 -122411 -141173 -98527 -367961 -279278 -112700 182855
9285 -171871 -283205 -88060 -258177 -345536 175011 -276457 -179350 64373 -13733 -127034 -172983
9274 -172983 -43448 -146722 289582 79796 -186760 56097 178152 -68227 -83862 -215181 391482
9262 -229627 -58405 97547 -84620 10558 -242096 -98140 -154013 -158773 -28100 -208775 -27909
9250 8936 -190888 -322793 -60236 303746 -12910 -65973 79917 99601 11454 -108134 -240734
9239 -240734 -63627 -405923 -195084 -195760 15374 65946 201607 361153 -6382 -89531 -53002
9228 -53002 -507917 102555 3318 222511 -195951 -35185 -253735 -70352 -246487 -23534 -121038
9217 -121038 -67262 -155567 184152 195317 -407804 -59054 -160274 -41055 -292826 -187834 64401
9205 150704 85436 41310 -390568 -33403 69066 -224016 179563 12939 -411268 50387 -50752
9193 34992 -199295 -47732 -61640 -88145 -204350 -219794 141816 131483 -195391 199592 -282413
9181 -153314 127675 -83554 172250 78191 385740 -60581 140512 -214050 137358 -381499
9170 120355 -326337 -3104 -229985 33545 -205440 191165 -54134 36628 -47614 -175519 -119390
9159 -119390 96280 -254046 -152401 -211705 -93019 -77705 -81570 -113250 -286554 -20840 -2833
9147 -233152 165274 108259 20038 48125 -33605 163762 726 -196326 106831 188465 -209317
9135 -65538 -72436 -131798 -61540 -384637 277131 -102338 52860 12962 69533 -253372 -170213
9124 -170213 -98388 -235891 -189108 -265089 -152570 -208307 20832 28647 -24426 -290223 -72643
9112 -91967 -30403 -409559 -372103 202487 118742 119246 210402 108201 -80770 -285260 19626
9100 204243 -74014 -116038 -76844 -95906 6441 4008 125876 -1303 270981 -29712 -161521 -272287
9088 -272287 -150579 230566 -56931 43958 163364 115756 103224 221103 -69502 -200333 -76712
9076 -325822 -307773 -141222 34377 -96511 249690 117149 -37654 36255 35445 -168672 238812
9064 -253010 -21004 3676 -107354 -36621 -156573 43581 149350 -55376 111301 -142658 -172419
9053 -172419 -258369 194597 -293877 171808 -87836 44965 106030 -104902 -329581 -385250 -170316
9041 58044 122943 -172994 137187 -179410 111905 -4096 -108436 8051 -71185 -179178 -127423
9030 -127423 -119445 134928 33250 -297334 114186 -109607 -77481 63915 -132059 35395 -175768
9018 184587 173577 -59728 -218679 202815 -184703 164292 -300596 94732 -440987 -72469
9007 73526 -318779 50340 7588 -48842 48601 -206986 86033 -149358 -45711 255231 -160695
8995 215749 63513 -262663 -164511 -370941 -7098 -20377 -233470 -235166 -183148 336 -334320 -27639
8982 -156707 -79030 -337554 -144441 -79893 -218207 135855 -233100 -158957 27845 147432
8972 147432 -226222 -70847 -31812 -95909 -13936 27407 -9662 -59636 -142652 -249100 87115
8960 -254108 -83993 18212 -526366 -352212 -297621 -87779 55564 -156340 -415 16508 104229
8949 104229 -54166 264571 -154615 176484 13252 -243362 293186 -10316 78585 356839
8939 356839 62279 -46079 11988 128402 298681 447507 109568 -125387 197864 681611
8929 681611 266330 473454 613322 858434 1651126 2539263 5414362 9616771 3834292
8919 1619423 749710 865358 674525 361879 161163 520096 317238 315827 281942 427291
8909 427291 456161 129899 157914 -266240 -202886 192559 -64768 -74257 250647 -188551 49020
8897 -164368 81330 -17294 -333844 -41457 -153358 -225025 -8131 -232569 4270 -7040 168527
8885 -249606 -71286 187923 60491 -314558 -7979 -423063 -174232 -188175 184465 -302982 -401905
8874 -401905 167329 -72864 -37232 -59487 -44417 90544 -13343 -408883 6975 85114 -177935
8862 128519 -116141 -8216 -285471 -37821 -159803 -246085 29347 -138556 -57454 200919 -358761
8850 8674 18846 -132234 -197471 -24558 184011 -104421 -139700 82958 -127760 -173450 -27701
8838 -291461 -291228 -243394 35905 -76749 113657 -97840 -264658 -247812 31464 -416914 175406
8826 -204998 131225 -320892 -225775 -44393 -6332 -41461 220643 -39538 137493 -25201 -211197
8815 -211197 8554 167625 238285 127761 261389 -119422 170476 -242033 -256764 156471
8804 -161727 58277 -54903 6924 31662 104111 -64884 163915 119672 -41755 108970 -207635
8792 84030 -177218 -228779 214663 -85706 -108012 -246650 -291857 314236 -252452 153559 -263416
8780 90514 -234390 -204306 82575 231538 -38810 -165107 -214448 197672 150929 -226942 -92955
8768 -64918 129834 -211582 231006 -274617 -21977 -47149 50842 67660 -45260 -251628 -154884
8757 -154884 -237719 -242144 162561 -264466 34723 -209225 -418960 16902 212746 -336417 -188135
8746 -188135 -8114 126706 -220362 198448 -138216 93504 -236885 79360 -1697 125467 -141337
8734 250303 -816 219247 116324 206514 75255 -146327 -261677 -249397 61018 255996 -142041
8722 303748 224645 -79422 -210411 -157938 -185581 94210 109815 -56826 -153434 12159 -275726
8710 -254724 101513 -283476 15787 -130358 74865 -20319 -124871 -188661 90276 146396 -30125
8698 31150 239501 141602 -54440 -222811 156581 24269 -77018 -225905 -78028 114858 192742
8687 192742 45704 411473 -31303 -56373 56337 -413301 178972 21860 -100550 -101642 -179721
8676 -179721 131691 21741 220041 19144 106872 -337823 -230333 30990 -84072 98105 224800
8665 224800 92715 -173202 -53510 83110 241365 -61535 203972 65850 -4605 -229330 3573
8653 -28631 146627 -63516 112951 -131176 -109334 12947 394568 -435106 185491 -125277
8642 -20643 147444 -57994 -41172 -27124 -220261 -270751 13608 183258 -157929 -3845 -150882
8631 -150882 -59765 -40690 -168140 36888 55408 294223 -98790 -76852 -517717 24857 854
8619 252051 -104417 38413 -216658 -103455 -131598 -105745 -243494 158860 -176495 -242688
8609 -242688 228936 -239239 -123043 -49102 -170818 -6002 -79351 49464 -25527 -235058 -117804
8598 -117804 76522 169393 62948 -267971 106204 -114369 -23232 158460 -118588 355978
8587 171028 -91204 -151192 168269 -3431 -70199 -316558 218311 27773 -25133 -263308 -196898
8576 -196898 -302020 194294 9373 -83930 163624 -76131 210276 52663 -212673 -207196 -150496
8565 -150496 116325 -47227 -32328 -31248 -30954 -215663 183214 -158776 -157375 41019 235443
8554 235443 -141347 33245 -150722 -226834 27047 51165 -222391 -75263 1359 24028 77034
8543 77034 -35723 -193535 -25087 40847 200753 -240001 -155108 -19712 -36996 45356 116573
8532 116573 -188038 -26651 40743 115209 375774 154165 191964 -121936 -21532 -173740 -19475
8520 7451 -192060 139161 63395 -61113 -162691 -65623 -204344 -5262 201501 114895 -318764
8508 -136964 -8365 95843 -324616 -213224 -357662 414357 -241838 -111431 -17203 -52735 -124728
8497 -124728 239656 -105085 -42608 -125535 -211238 -231155 197043 75892 -20258 -286291 265204
8485 -83553 -70503 -453563 -52129 -40891 -147773 213076 -89554 -85765 -94658 84042 -196285
8473 -166921 236335 103039 123327 63401 336605 -230809 -68162 -92845 -284092 34215 -165161
8461 76061 -191122 -77523 -67069 -48789 22059 110885 27779 -87282 -86163 -129426 -134057 -142544
8449 -142544 168800 -25797 -109980 1518 207144 -43765 109099 228266 -278950 -169879 -288577
8438 -288577 111745 -197282 -115629 405977 -300385 176319 20437 21543 -141124 274431
8427 -330358 -287065 27300 -227087 -73071 -29586 -214089 -108210 -171304 -25818 -63713 -276269
8416 -276269 -210231 -177104 -258113 470038 291817 -31146 -22240 -414728 -61948 442832 17974
8404 77244 -92658 161462 -329434 -363644 434652 -373798 -66809 -128192 -54617 85529 -21382
8392 125844 -209918 -29668 -134227 -374172 -101858 -167120 -43038 -179668 84323 187 -38617
8380 162729 -160047 -329380 -267801 198919 -93740 -56243 -207466 -32312 103433 115271 11336
8368 -257196 298940 -182990 -151014 -178284 42334 -98890 162564 149352 -29933 21396 -359005
8356 -185579 -53932 3132 -92305 -20675 -134912 -98721 186359 -26718 71086 -45740 -179001
8345 -179001 277993 200600 -223207 -76765 -151913 -255876 -76302 -92073 31501 110504 50665
8333 -262830 -318597 -41377 -74258 81190 145193 139773 25172 -104898 -158832 64084 -94279 -57684
8321 -57684 -181365 -62352 108932 -80379 -46503 -134405 -196820 -380860 102604 199869 -94937
8309 100921 31826 -231296 -114954 -55762 94326 -451968 2206 -244309 264583 80045 -269323
8297 -146786 357608 154649 -65500 2893 -126431 -294246 -12214 -82522 185075 -224529 59670
8285 -109841 -122225 -188807 80071 -25988 222953 -222807 -172186 -281129 -218054 -49000 168204
8273 -200646 664 26700 -101802 33825 -506 365174 -251841 -298672 -349986 -142498 -27856 -82448
8261 -82448 -179635 32200 -231941 -107130 -175907 35768 -35232 281543 -70604 -45168 39587
8249 39774 35762 -157562 -194730 40510 -129195 29043 -225265 -357220 375280 124445 164289
8238 164289 -148284 89443 -39381 -138172 170956 -38694 352504 -122537 -150277 -74061 -220651
8227 -220651 69850 367748 -233002 2517 110844 -122449 -87165 307899 -21709 16771 -304323
8215 -157135 219785 9737 -208648 -23716 88416 -389619 218526 -431181 147432 -173740
8204 331969 407115 -224282 -51 170254 -158711 -211601 156860 -494366 149892 -224224 38860
8192 91123 251926 -239592 -218741 -209482 -100903 -196160 38072 -86707 326625 -329013 23825
8180 -325843 -98670 -206971 -193819 347936 -336159 187551 -108902 -53321 62806 1116 -115897
8168 -94048 85131 84801 -55220 -219671 2587 -84261 -48246 70712 119970 61696 51052 -105120
8155 167767 105071 -29073 119094 -125254 -67037 162098 -287030 -83417 10122 -332055 -35705
8143 -61948 -275079 -210740 -28819 32639 -186006 86860 39765 -25012 -472612 -123198 90591
8131 -217856 -81716 129004 155267 -57525 -87732 56451 176311 -173244 -190760 -265922 160453
8119 272963 -45155 -97204 -100378 -50609 107187 155232 -130157 34672 -23332 39409 114616
8108 114616 -56509 427379 124756 -127626 -42537 3406 -216132 -546118 -190786 76371 78006
8097 78006 -39592 -92308 1685 -248207 -389936 -126519 -123505 22701 -86249 -62334 -76450 165748
8084 -81081 106571 -22747 -92451 -104395 200931 -22924 62190 -115412 -289985 130812 -109534
8072 -247347 -83185 -247068 168599 -366534 -113673 -164111 127197 31745 230434 -201660
8061 -255298 -109581 -123242 46879 -129281 96859 -26976 -145281 149818 -106289 -336315
8051 -336315 -42568 -159353 -67386 -72775 -140360 -252060 -59158 -82508 -28387 -191613 -301750
8040 -301750 187511 158850 19541 -171691 227739 -161078 15416 -69760 -25709 -74406 127435
8028 -387010 -200350 -17708 -104722 -99768 -46990 194970 52252 -178365 -59192 32976 7527
8016 -199176 33311 20775 106413 -63979 400942 115993 -76520 27195 46697 -214123 -249388
8005 -249388 -51004 73002 -109382 -82289 197704 33963 330501 -93253 -1712 -195496 93494
7993 -153907 138855 -48664 -3027 -140988 -236262 -47266 -52877 63552 -110499 137824 25322
7981 -9249 210481 -42212 -66927 -58634 143562 278799 -365 -395268 -129565 -185347 177937
7969 79940 -92893 -272801 37203 -180166 313935 -66 -24889 298393 92895 68627 -16362 -139619
7957 -139619 177617 66840 -197332 -5138 -32904 109113 -93215 140320 43506 -235812 -216989
7946 -216989 -118790 -104419 -162550 -95382 194979 74530 -311655 -234083 143704 102950 -141027
7934 32072 54379 -119065 259773 -26758 107297 196572 136035 -17732 32519 -246254 -63536
7922 -42434 75427 -87463 -132191 -380401 -56500 -194868 -224834 -236356 122862 -205168 139505
7910 66859 243006 59378 -208402 -300756 -17561 -92046 -241015 -166037 -253510 -124144 -70846
7899 -70846 -384230 -213980 -114068 406946 -305230 9637 10127 25492 30184 -189862 -52262 -40927
7887 -40927 15728 119881 2339 -233672 23204 -958 192588 79740 -116647 -176075 30166 27952
7875 27952 384322 -122448 -45420 -339955 370952 -25307 -27884 20285 96050 250341 -19631
7863 -114671 33194 8569 50716 -70641 -19676 -554 -5186 -24804 184901 -253175 -62832 -161485
7851 -161485 -308632 -178835 -2808 -5760 -288667 8397 -243215 82538 84890 183336 -73651 -334932
7839 -334932 119286 98795 -207132 55741 -39594 124646 1796 -77621 73806 37419 87599
7828 87599 101013 356169 166340 -96076 64189 -134844 -127340 -223245 123797 -250463 6223
7816 -39913 98551 -124794 286170 19670 9612 34620 -326754 -70987 -427314 -93702 51128
7804 36653 62491 -39839 -249084 -180454 -176574 48125 68516 246300 -133062 176675 -23360
7792 -65554 133948 49253 89773 373129 84607 -45430 -144927 -69742 -49191 45287 -200459
7780 -124699 214320 44659 18061 -6473 -47877 23296 -230302 220034 139929 240878 -212243
7768 -45379 -124399 -48084 161110 -159874 222536 -103676 211727 93388 -399114 -290665
7758 -290665 -131029 -289179 346357 -304368 -24121 -127959 150134 -29409 108458 118660
7748 118660 60446 45902 -105230 261255 -65056 -117443 134011 -227825 146957 -327419
7737 154972 31674 125623 72640 -184 286209 -207586 -76304 63761 81989 -197498 -348989
7726 -348989 -214558 -230145 143481 -90128 17182 -72317 -300218 503540 -102394 -374975
7716 -374975 -150530 -243803 27361 -492692 -260564 88925 234258 210184 481023 24558 -95962
7704 133857 81574 -83564 231417 -145643 -81680 30883 89340 -26285 -29227 -307580 -110921
7692 -164452 -206561 -119257 122020 152926 142909 -73399 -107163 -213033 -19325 -324443 17075
7680 -46830 -126304 -76677 108256 -311931 188575 -118483 28914 -79336 -282341 165504 108229
7669 108229 -178826 115407 115123 15438 -89872 -27641 30486 71476 -16240 -353524 -146138
7657 352546 62244 119315 91494 -355793 -183075 -74391 -14555 -199282 97596 59327 -317594
7645 -104849 -238847 -88223 -208332 -292330 -247264 -55860 -266942 -179464 -110124 122319 88998
7634 88998 -133988 -7175 -168703 145248 7242 105877 -49863 270933 96355 410188 111095
7622 155621 -13189 58183 -87159 -72140 -116639 98340 -282359 10042 -170073 -211339 166279
7610 -138201 19809 -182637 125730 -177378 -86477 -49132 -122601 217171 -224198 111457
7599 -150940 87730 -27409 -55597 -229151 188572 299979 -181482 96182 -360237 154292
7588 74578 28580 -174047 -199203 -135103 -322031 8818 102096 87769 -39493 328971 -4361 -45871
7576 -45871 -466654 224327 258655 -106276 -79342 -183841 -366914 315604 219966 70801 -167219
7564 -52874 -54764 -28902 -17525 -212467 11382 -478818 210133 483430 71987 82315 -72923
7552 244408 -156584 -122386 -196499 125824 -60696 -25657 -238049 22988 -224916 21617 120595
7541 120595 -26867 -300387 165232 104690 79006 -107160 204050 -253248 -67747 -39540 128516
7529 -105949 -494591 -269155 -198703 -274649 68943 79709 126738 98995 256297 -53466 -83315
7518 -83315 -165234 -19860 -82736 -64316 19485 323212 81276 -41996 -81488 361304 -100168
7506 -10133 82385 -151880 -373443 -299203 141865 82282 113362 189522 109460 170166 -273049
7494 229246 -61159 -89584 -118640 173690 16173 295022 327694 106024 -349082 -185155 -67034
7482 -551 -44761 -78230 -264754 328359 -37742 -127001 164301 217217 48897 313658 -254523
7470 87144 5183 -221659 120923 -232146 -53618 214174 55634 24176 -47386 -46522 -129479 -145950
7458 -145950 -301724 -212239 100263 -140076 -13203 2429 -50505 -14667 -265178 -295333 -161807
7447 -161807 157129 48830 -255773 -164982 -71698 -8555 -18591 137711 -149322 60030 -57646
7435 38618 -327145 -188819 382488 63131 -118294 -44582 -228741 70592 108879 56805 -125321
7423 -119473 94624 -151983 -48152 -56263 1331 -197359 256406 -33605 -4501 -62579 -153983 -256195
7411 -256195 -248632 -88957 242292 -209496 20186 -42681 -142861 -225980 -49080 113925 66884
7400 66884 -188017 -87602 -85143 -124939 -24056 -72261 2792 40101 -34236 -87211 -86938 49734
7387 -103603 47278 -276893 -409611 -105859 -103023 -74262 46805 323860 7907 101227 -334205
7375 -300243 -10015 102606 -158853 135498 -82688 -86876 5554 -32465 6465 88293 -209728
7363 -250815 30287 70841 379088 132461 155385 75935 -285485 -78033 -179363 -332067 -236671
7352 -236671 -112894 7883 27474 212754 -23110 -204304 27333 -191002 -8793 -99243 111998
7340 -274097 -388973 55998 55881 52185 -120369 439809 230053 -220810 72580 69581 148825
7329 148825 28681 3483 -43880 -117697 -52799 -23206 -115403 84542 -60557 157528 -168219
7317 90932 73174 -124120 -352132 -25923 -88715 -151853 109994 55318 -269527 282712 194125
7306 194125 -274024 -115777 -73083 -214201 219316 372086 139487 -161826 -17729 -61349
7296 -61349 -156295 67916 -46834 61927 -317581 -1163 -141852 167901 104809 39840 58973
7285 58973 13729 35638 -169990 196152 -65769 260841 378383 31777 153304 -137202 -139897
7274 -139897 -100393 -178248 -144482 -36069 -205217 -57681 -283764 100464 -12998 -13694 77651
7262 157529 19324 -213770 -577 -257491 -153994 -91966 77400 -70770 130595 -67942 153762
7250 267734 33218 -52817 35811 -143128 105066 106280 -76842 130728 52003 -211771 -640232
7239 -640232 51853 -42462 161580 17066 -348570 -164999 -253058 -238649 -19202 493940 72848
7227 -221550 -135771 212529 -54645 13703 -7868 -138922 28489 -113217 102467 22391 -31144
7215 -124912 -84022 99121 82410 78577 176844 158687 -168878 191152 -92695 53877 -213443
7203 295534 -97949 15305 159647 -11893 3129 -60930 -211844 -20643 17259 -269450 -62884
7191 249201 -46529 -221573 16230 64155 209082 43363 72231 -89759 -126936 461194 107154
7179 385075 -249267 -41212 -5550 52275 -57031 294368 184927 124663 290351 -357635 118463
7167 18625 146352 -278946 216626 -37469 -319090 -56423 -158510 -208163 -33902 234119 7340
7155 -154996 142988 -160326 8357 -85456 165230 124712 -175751 -167769 -342192 -89858 -54652
7144 -54652 -65758 -248566 -233988 150639 56865 308816 -96375 -125761 -92925 -32380 20952
7132 -206553 301861 143032 86836 -30098 -324888 -427033 135765 242532 108960 86420
7122 86420 139100 -279187 30347 -73095 -194650 -48764 -36293 -133452 -71723 -396551 74606
7110 -162978 -122766 136349 -153128 -303368 -85412 103718 -356366 -64830 -117029 -51348 -16833
7098 683681 -309157 -434192 -94659 -101370 -244234 -171745 -249658 285610 -28888 -133529 -152324
7087 -152324 233072 131495 -259252 -89215 184936 -7913 -52219 -132049 -30440 223437 -217397
7075 -68557 -196034 -136977 92429 -142389 -94230 -66051 -52606 76632 111165 68636 -52905
7063 -62363 58717 310199 12953 -110725 -336664 502228 -42064 97827 -240710 -45560 301732
7051 -214332 -30753 43163 -5942 -148140 117841 21064 -6805 -270296 118478 207865 62195
7039 -38854 22800 214667 164311 40323 -97791 32095 -121041 -85004 -192201 83414 51221
7028 51221 -13353 -30667 -39971 73670 -344918 12868 -142578 225844 163348 25484 -181325
7016 -14025 -107556 -84698 224836 37853 27962 27184 -170812 22890 -159434 199645 -79585 128629
7003 67584 -182075 -129970 120075 434411 33097 -235305 -191404 -76710 -20347 21987 -23215
6991 226951 25661 -187743 -172430 134050 119270 95234 71593 103431 52337 -77944 120161
6979 -54961 34718 -13696 -39893 -278449 -78435 128163 -142627 162140 -365536 165778 76071
6967 -152401 -316062 191821 140518 -159458 242061 29565 59048 164607 204402 3037 142844
6956 142844 13854 -177218 68990 -449665 290875 -196267 -166714 -87192 103227 157496 49524
6944 -311258 -317288 -13771 58472 -142184 -192739 -252278 139786 -21596 274646 -75511 -74692 22937
6931 -363583 -171051 -287963 -196344 -121144 -170478 150752 -172730 -26323 -111495 -88711 60926
6919 -86627 98206 -34621 -243857 -31233 -83247 16320 -43767 26194 -98047 344613 -122355
6907 257048 2258 205475 747 198202 1101 -110635 -130538 -109946 22397 -91798 -119801 -40966
6894 -286360 217935 -47303 -118047 254607 67802 -9421 11959 92330 -27023 137579 208500
6883 208500 -172419 -400695 156475 38118 -235819 -117742 -210937 -167822 -118538 138764
6872 96173 20027 -92521 145951 -34608 -40048 36509 -271041 60843 -185979 -326807 -168990
6861 -168990 -86342 104015 17947 -347282 53387 -154891 147685 136763 -27137 96726 -102263
6849 -32442 170974 -242295 82992 25235 -208840 -197527 -212204 -108752 -21224 -164587 106694
6837 -185046 -56692 -152645 -106406 209872 150975 86638 -153921 112817 -181727 -85427 -213161
6826 -213161 -40023 -26086 -216967 45659 43081 -120726 75939 -131417 -166683 185895 -113237
6814 171150 147320 -189844 -100053 310316 392971 -40162 -3459 -55708 402763 -33087 106518
6802 75127 -270716 -172391 -50306 -219982 -278950 -287141 244633 156451 -72867 204549 -88217
6790 143124 -263229 53405 234282 -117853 -354040 -120135 -78525 21377 215417 31822
6779 38443 -320357 -97311 -297524 -346218 15139 129647 -63794 -212558 -18026 57524 -174346
6767 -23266 -39058 120141 52905 -18249 20212 53772 -305903 -201207 -200306 -101138 61657 113574
6755 113574 -35100 131666 178163 260086 72195 80364 2757 -160582 -100604 -113136 36654 -288459
6742 -72840 -144848 -47844 -159085 80722 112214 -429248 97035 84379 -32265 192452 -206222
6730 70525 218953 399895 59514 -251988 100801 70577 -86969 -43247 61967 185807 -34911
6718 -30706 232728 -79090 191677 -7101 -340325 63122 187284 150572 -43468 -28374 19135
6706 56657 84088 -127697 -117003 109079 -180929 126075 -157868 -60536 -45189 49220 180504
6695 180504 -142975 230041 -35035 -35720 -189890 241096 93691 -13860 -102678 -80537 161844
6683 -10271 32802 -150904 264839 -257129 -61529 121187 -182001 76989 -157115 -112250 174723
6671 -87028 -41037 272032 89606 -117439 -45433 79116 -24429 -73933 21009 201357 -256260
6659 -118183 -6768 34616 -299181 -146526 -48002 -23414 -46919 -12386 300288 75549 91234
6648 91234 65980 31113 -60514 100880 276619 171314 20133 71176 -53505 -41830 232596
6636 -152364 -403659 -185208 -124479 -144451 83472 -7587 47326 -119111 66015 -159320 318048
6624 81591 -297627 72261 384813 -222540 107149 -270456 -259495 114577 -114104 142059
6613 -258341 25488 224804 -17096 40849 132439 -31251 98268 259582 -67090 185461 -26955
6601 6168 -314150 111527 -122847 104562 -84917 -413720 82015 -27578 -157779 -102595 -74396
6590 -74396 115297 -195049 142221 -140263 75288 -96664 38858 -229577 -240493 20027 -13756
6578 -34487 -209900 -556660 -95401 -92965 -183842 -322549 -277337 140174 84983 -198143 -137044
6567 -137044 200704 -24653 104688 -96664 -173258 -410755 -357190 51237 161710 -172399 51041
6555 192078 142149 523544 34223 -130894 287416 153513 -408986 118422 262574 232641
6545 232641 -15671 -37648 -32258 -78085 39034 225325 182795 205894 -291868 -21485 -114821
6534 -114821 231869 147302 -10937 -432350 -308241 36765 -146620 -153239 101379 -220034 -94519
6522 357476 67402 -32441 203821 102406 -85779 -322545 212906 75793 178435 161813 -104990
6510 -223175 -162680 105807 102155 -117011 -19673 174832 217758 271968 172944 -101556 169808
6498 17127 -224396 305448 -32437 181471 188855 -317493 -172585 197817 66702 -325962 -142528
6486 79644 -54672 5154 -154885 152919 -168049 -82112 50302 141688 -53590 -147077 -353116
6475 -353116 -82863 -1609 -89691 208630 -140017 -63783 52475 -334689 -149771 -24037 122397
6463 -155336 178044 139666 15043 72242 -92741 57250 -232631 -177447 192288 -15722 -158127
6452 -158127 -92252 -170427 -303625 -158442 -436548 -356730 27582 95526 108656 -85295 97949
6440 -322653 296211 95178 75939 151635 209240 17284 -66387 -274473 132810 196040 -317399
6428 -87954 -335180 86008 167570 -86838 175464 -187024 54713 -26962 257331 5986 58544
6417 58544 -17669 31579 -12475 -60199 -24499 -9690 126257 12709 -35523 73404 -37750 15624
6404 19530 -303161 -75702 -362553 60474 266705 -242618 397279 -100835 -257991 20143
6393 -193371 -231222 -364541 165823 74278 -282588 -105201 -59795 -227868 -311815 -90675 168606
6381 308029 -109605 60499 -2166 101018 120684 171019 190843 -90389 -196978 -125025 -342226
6370 -342226 12889 -223994 -19451 -188634 81924 -115169 73025 -57839 -36086 28017 63499
6359 63499 -171419 -128717 474179 87060 61717 -107099 79905 28132 169722 -229731 -227148
6348 -227148 -211253 -10020 10398 -117035 130557 -10832 -237561 -354671 -120161 153074
6337 -245262 238831 -276032 -106574 -74563 -156687 -99063 -189479 82089 6120 -264144 34481
6325 -186136 96418 -28142 381859 101000 -28122 107806 90 83619 -151951 140487 76757
6314 76757 76481 140685 73599 -126579 36878 -69699 -285182 -268390 -131469 32357 -25844 153190
6301 -119175 33351 375924 265721 205458 -253595 -95857 532386 -79334 -250845 -157146 -234118
6290 -234118 -182758 -129907 234242 -236487 -124187 -96793 -99955 43577 325586 33602 172690
6279 172690 -12173 -236434 27560 -155290 -39268 -332465 -177624 120082 70923 184927
6269 184927 135408 69895 -103576 8097 -132114 298314 -37219 -226608 55767 100726 67150
6258 67150 -150412 -100641 -105448 -8542 -37398 -152579 -12503 280811 -24518 -442303 173407
6246 -161615 198661 173631 224083 176803 148491 -32370 23861 49457 26906 -224901 105099
6234 -291588 -532976 244583 -30151 -160179 -42608 -65269 -68493 180024 19328 -283811 -207683
6223 -207683 73348 79705 90590 2308 -143658 133941 85849 44068 -51780 -156419 26224
6211 -66852 -339029 -239270 62847 -83308 171639 -89180 34937 36072 111834 -115443 76698
6199 250906 887 -42335 -38729 -69925 94073 -72895 -249536 -17028 -158081 -34216 -96054 -138997
6187 -138997 -15396 55219 46233 -169093 53212 193083 -107818 -131581 -179819 324688 -132278
6175 41877 -153179 16566 -244383 -17130 -318991 73085 -249449 -18523 -32382 -110241 -168764
6164 -168764 -228493 -186243 51568 -28283 -170896 92129 -126125 62391 328471 -146172 334160
6152 42867 50952 215675 -22773 122826 1866 -444463 -78245 -287332 -163037 144298 -32780
6140 -49879 126708 294443 -221047 30748 28262 24916 -172489 -116767 181675 -91716 210923
6128 437744 -16693 -46292 -26925 72641 170766 72935 -107124 -340689 -64225 119781 93216
6117 93216 -90055 54279 215402 -122416 164713 -7513 -302111 -61641 98138 -108015 -198445
6106 -198445 140703 408463 384484 55415 9724 45297 -264396 178922 3125 -346963 2381
6094 399631 233939 -13101 122593 54579 69926 -280882 189660 -43275 -39132 -7564 84394
6082 -127926 -82015 -207663 -254745 -38241 9455 -68347 -127017 -10063 15529 175844 -19465
6070 79797 -118576 219638 353691 -166225 -129124 -256535 -39179 -308384 -95041 -114013 322396
6058 11055 -183893 400573 98952 32010 1340 149755 -179080 -167168 41545 -122694 268242
6046 -757371 -42140 -377383 -25196 82622 176534 -167333 -122531 -43949 16398 288681 10714
6034 -10107 68334 207929 149417 46846 -146202 -44019 57358 -2560 -68281 -175211 91459
6022 -69891 -71668 68700 -179903 -92792 58710 146302 52391 -141576 -181190 54933 92540 26893
6009 -91567 -140422 -180067 26658 -135034 -80201 -262058 115162 -377632 285846 110446 48562
5997 -10225 15015 -36009 33228 -131501 -43037 -180175 -236969 109446 -2726 275571 -164119
5985 -204963 -163723 -323 -1140 16873 83122 -135197 -196012 92282 -31747 51361 103377 239275
5973 239275 -44899 223278 -88601 17390 -34941 26901 37245 150842 343436 -75356 272737
5961 51189 199041 13979 131599 -152519 129981 32462 114206 -280884 -45209 230811 -161472
5949 -31558 -5125 -67958 -156744 189731 287865 43581 -186098 -121123 -135701 -85831 11052 29379
5937 29379 95840 -51689 -58929 -255457 -20955 -128649 -296033 77424 -35036 -16442 -142447
5926 -142447 -173625 132758 392974 -238411 143812 94037 -96007 -85249 113076 237944
5916 237944 -462479 135689 85494 255635 -95602 113375 222985 -169682 484205 -54749
5905 136068 353998 195383 3237 -361903 -318110 76403 45574 274765 278752 -463740 -113877
5893 -149078 -93217 -167830 16710 137049 -131834 56334 -457196 187893 162363 170768 -117805
5881 205306 30409 188065 -42119 -219914 65608 -10120 -97620 39579 -292920 -127205 -210156
5870 -210156 -70469 235439 80005 -24700 -220334 -74482 -186958 41538 222274 8080 672138
5859 672138 -115168 -50654 -27655 -105813 -10794 -90942 96316 -68628 -202746 -78959 119462
5847 617713 377283 -32459 221035 236760 -285129 -15847 42603 78791 238318 -72482 -414719
5836 -414719 -383228 -56884 -215531 9789 -212778 -98660 330744 77803 63667 -108310 336849
5824 146613 -216896 -266703 -144437 42103 388325 215074 28694 206149 -93828 -2678 19852
5812 -13575 -147598 17793 -263806 -161787 -6579 -33644 205042 37706 -196212 -224153 -274505
5801 -274505 329026 -64070 -6747 -165731 -349595 5039 167457 168776 -220290 -72039 -55052
5790 -55052 -202844 -24770 65772 214295 -37584 -92179 247333 168350 -192425 222926 -156790
5778 196035 112535 -207443 -4275 440049 225249 -150771 280076 -267419 36197 342220
5768 342220 -143697 -14554 96476 -131912 -11577 -388250 -135841 -202861 77491 9650 180460
5757 180460 -35275 197279 8281 -320576 18869 -71773 -183768 190958 67220 209793 176241
5746 176241 -278706 -52728 357559 164578 -190346 165829 25809 -48459 -6359 -65279 -232879
5735 -232879 -110676 -287925 -71759 -43622 -100762 -288346 84555 -352558 -123898 1972 207240
5724 207240 -259605 187508 88369 225608 41667 40564 -113857 -40344 -60683 33721 28448
5713 28448 -175414 215269 121848 -128656 20567 151413 -25062 149821 -130346 -41546 -180155
5702 -180155 -20745 -76096 28648 3406 -87141 -104081 -179175 -314710 93544 106058 46464 -151599
5689 66087 -93143 -227756 -46067 15645 -116348 -80556 -1204 155656 -91104 2109 -98518 -304
5676 -10356 -16328 255832 -196287 262835 -48664 358170 -12346 96812 9815 -251077 -67259
5664 208289 174046 117385 278320 138980 400809 -193575 -177804 209484 -73535 -95632 -312783
5653 -312783 -179364 190964 206562 4959 330321 -64433 -54118 -191936 36775 333703 -11776
5641 -64930 135924 -38868 118756 279629 60854 4156 70514 36620 -161060 -64164 -189168
5630 -189168 -205902 142847 210988 -209475 34844 -235746 150210 -109321 -83915 30271 35836
5619 35836 9760 73812 -27296 -161896 -60033 165107 -172532 136472 -146538 215449 -85956
5607 -180239 -53201 92402 -27648 359539 -329835 -248235 -63014 114949 288433 139064 11134
5595 147419 -57208 228290 -222039 105091 -291030 -65189 -262834 -32018 -42474 -379344
5585 -379344 -138020 -12653 102174 222283 10511 104308 19524 -8086 2647 65221 99888
5574 99888 -354687 7841 256603 128306 179869 334511 73741 244725 -9790 -13382 60638
5562 235205 -163333 -164388 33719 -2205 -190865 -264275 -59608 -35886 -104719 -217532 -58812
5550 144762 4565 -170540 175797 30390 69606 -140943 -149951 25350 35207 193985 134992
5539 134992 -15235 -162279 36515 46533 37908 47528 17495 115093 -106753 -197563 -146959 -106365
5527 -106365 -127115 106025 -196031 -71504 137789 -135537 61125 117295 -57401 58258 -171420
5515 14958 130059 -216956 57762 -51743 31454 -1344 3024 -64783 320773 295611 -8934 22946
5502 -123974 131178 -198335 9937 179238 -62225 -246809 -446547 206158 234305 -304194
5491 -193522 -52050 316789 30502 -63299 -129037 -123160 -428975 217047 141624 197548 -34419
5479 190137 74006 -511914 -138007 50103 -140038 -133707 -323906 -97558 17600 88486 -134586
5467 -148211 107231 -20567 -25686 167554 -99642 -27982 -12629 58591 -176909 -18348 -122963
5456 -122963 -125218 110848 -56851 -116128 -30002 237754 -3686 163451 -239380 -62103 -142172
5445 -142172 78123 -24192 43122 -105134 34999 71726 93031 31943 -119710 14800 484 -3148
5432 202181 174434 7034 54043 259258 -31314 26024 -53116 -98775 -238203 138540 54226
5420 54940 206465 83170 31274 68004 -141674 307159 -80981 383854 -130366 -221971 -262743
5409 -262743 -58187 -177466 -25875 -120704 -67908 -96329 369145 365240 -45661 -131671 -175314
5398 -175314 42225 -54216 -47375 -75909 416686 -28409 -195377 -282917 220570 324108 -164359
5386 208557 198684 -78389 -60324 45258 69488 -42942 -215465 80844 72403 290895 -197559
5374 -72077 -39546 127467 -155658 -4985 29609 149395 193427 30751 61807 -48415 -119964
5363 -119964 -58180 -109707 108052 168150 -308352 -317243 -290910 -96571 -16730 -9977 -52280 -225845
5351 -225845 -79621 -53244 -90527 332659 138937 92243 307070 59987 -134275 26410 -106772
5339 40304 70134 -165557 -24601 174857 133125 -69382 -365721 -84921 157813 292685 -102884
5327 -24861 243395 -127870 -190077 226255 -121015 27881 -126413 -87091 -117408 95137 61388
5316 61388 -74962 82146 130738 -153711 132092 -15861 30803 202510 57476 -370485 -45926
5304 121187 125067 -68689 -484666 65288 66940 40304 -212638 -9010 19618 76485 54467 -38415
5291 102076 -72556 46708 136015 -137406 -130202 -202226 116174 270335 -8833 11141 106733
5280 106733 81750 -55969 -188100 -97920 261330 70618 32001 150431 -40130 -151907 309892
5268 386193 -327948 257905 69526 267043 36022 85198 109505 -27092 -187495 -34045 -277380
5257 -277380 26855 -69298 55502 -296266 152354 123838 -205320 144040 127639 27059 -122455
5245 207615 -67190 86012 29275 131882 -99876 86891 -130511 -244663 278768 201796 62663
5233 231892 -75479 124872 -2853 -34652 -11632 -76190 -228350 201277 -36682 232222 46379
5221 272178 -61951 -263581 -59719 6414 100708 -96218 -48489 -73842 218816 29563 -49313
5209 -46486 -259245 -95387 -267897 122016 -2258 -226871 91081 -38323 203900 -228529 -70161
5197 -172418 79046 -268867 -88836 -25026 -257396 28566 50174 -5013 -157668 -3274 -212163
5186 -212163 -58030 256922 -66090 243904 -178113 -34324 175113 -69561 -134987 192116 108275
5175 108275 379023 334699 -19088 33237 101481 35323 343823 124904 128169 86055 -14823
5163 93477 291800 -102534 -46970 -57890 239181 -80009 3176 252735 -111095 -122559 -116654
5152 -116654 332091 -105129 3398 174232 -16234 -253157 3660 -54233 -82555 -21499 -240666
5141 -240666 61378 275960 -56521 -169902 -24666 -348156 242628 -93054 6799 -76114 -182877
5130 -182877 -117811 320423 146587 -46416 5223 -203621 144694 -18603 209511 -101114 -179588
5119 -179588 155975 -174121 30689 289462 12932 131675 302843 30557 -28885 -15823 66747
5107 -52423 10578 -58745 -62864 -315036 141712 -22755 -1716 93771 -140177 129908 325945
5096 325945 -5189 166691 42781 -230115 54526 -26090 -203875 79411 31310 116469 155541
5085 155541 57571 23460 214591 191601 -69430 -228803 -45436 149311 180700 -29692 -18635
5074 -18635 133840 56362 -215861 246715 100687 105165 -81391 75421 -31244 -85511 127010
5062 227971 128205 -1619 109557 53791 -48449 -61441 -189213 192037 182371 172254 72914
5050 54342 88424 -95051 -191643 -384396 -93225 -31041 -316720 -10164 47293 -100658 340555
5038 11401 88479 -159259 23883 -152643 346173 249771 -331649 -115723 -30827 387449 -181941
5026 51077 -65783 49952 -212860 65636 56626 -209027 128425 -4598 123926 7518 169976
5015 169976 -103421 142370 -14966 321279 -103354 -118191 -23169 199882 -127563 -132507 112027
5003 -151997 49007 27476 -61319 321292 -134503 -258003 362618 -434570 213033 147976
4993 147976 -204603 -66825 -107060 -243077 244207 -87972 -147287 34328 -50865 -204162 43060
4981 55726 -44691 210932 121810 7838 -24139 223162 72598 -104378 -163958 -63369 -104730
4970 -104730 -48949 287479 109975 148306 -190668 -196983 -214357 -186936 336515 -305261 276496
4958 177750 91716 -165237 -74636 118292 -107531 150530 -67036 44703 276075 44520 171932
4947 171932 144369 245890 -1697 8102 127970 -138919 215724 -59973 217813 157906 36214
4935 -175407 285478 -166095 406550 -91150 1296 -47094 -185822 267325 116001 225223
4925 225223 -351645 110703 79592 65140 -50216 24983 -198805 -129936 -70432 47581 -174672
4913 -87955 123630 -335738 -75861 43105 204350 -111774 -38304 -88211 315388 -215771 -34548
4901 -75096 128317 -130572 -135411 437074 214021 -68763 -89602 7654 144724 105847 264264
4890 264264 -106940 165814 -142744 259791 176228 459897 -70996 -251416 137830 -45445
4879 141461 -257399 212942 305587 -26037 -70809 -236940 95466 26849 308327 188387 221727
4868 221727 -93759 323798 5586 292831 268889 107577 -18584 -193129 280820 146010 -17356
4856 -23522 -255851 85660 87189 187358 -126121 191610 90511 -6187 -127874 -2139 -218361
4845 -218361 -280955 -287725 -270384 67405 -4764 -239193 -23648 317622 -11038 -321814 -119575
4833 -87576 106989 102789 -252988 219512 483494 234600 -287721 -222266 -36019 -10932 124558
4821 197183 -111032 -135552 -297572 25291 314854 -33927 -201564 -15144 3089 97836 -20055
4809 -44427 110124 -94875 29924 -123192 90336 -256212 25758 -140337 -137776 -277311 114966
4797 -270906 76305 -56553 12085 -21410 -434230 30960 -169303 187631 -30664 -171485 232244
4785 119398 -254917 -340536 -13914 -64173 -81315 60948 -130930 -160633 94775 -82529 -46417
4774 -46417 217466 -270351 -6864 76855 227915 137522 105965 400161 230050 -287848 129015
4762 -169664 166202 252713 -69673 -191826 -219755 -42521 -337084 -193896 -72199 75768 -330372
4750 201005 357977 268733 254586 147439 -41357 -41554 122651 -184675 -107325 202686 196190
4739 196190 -212096 56526 -178699 -120962 -49925 -209546 -6203 215719 -132436 -100277 -89483
4728 -89483 189092 -6446 -4128 301093 -24832 144070 256859 309320 278379 -37198 -15959
4716 -70225 323854 -120407 123694 -11237 -158567 348149 252165 -549266 52231 -19584 52333
4704 190952 67764 -151520 41020 -125791 -179087 -116158 -76574 154356 172223 70321 300725
4693 300725 -76381 136246 -29011 -291725 -168958 36728 186088 -219867 160612 68593
4682 -120957 11862 68901 17808 53193 72484 10337 244951 -222517 -126537 171065 -99226
4670 60687 -133408 97401 -123391 -29888 -44716 130524 27496 -15307 22622 -186952 91048
4658 75819 265150 -234016 -43233 228961 45507 110855 -46405 -84538 142882 -17458 -72702
4647 -72702 -86760 531579 -94149 -320073 -148835 -33611 -182980 33692 -58670 43317 65053
4636 65053 255832 192438 174115 -149675 -104794 274460 159196 116063 105311 3739 42070
4625 42070 310069 199020 -81144 117595 -330986 161647 42485 -203349 37622 108567 -96986
4613 -115544 153218 -319972 -71903 -147794 -174100 237858 -47355 106445 14638 -202962 -55056
4601 -245049 105977 -207320 145209 68177 -151329 208551 -167855 -139058 -19762 -9590 72733
4589 -69971 41036 -227269 202387 -305448 -188103 83327 -136648 -36151 -84246 111039 -376890
4577 -38304 -22697 -123174 118076 -231609 -108485 -240429 -59331 -148469 -217776 111129 48569
4565 35155 -36177 -284446 -149202 -60207 125723 251799 -5019 172783 -245451 122401 -90030
4553 -252690 -82126 192359 118842 82440 -15144 32852 67219 -130616 141545 -38082 -13817
4541 352311 -242104 -301217 -89550 -7244 -130507 -33132 -282587 -280803 115666 -56201 147939
4529 -15438 -165547 24127 95236 -62558 -79842 -137323 55012 -108389 -148267 -109791 -56881
4518 -56881 -55276 168205 31253 -82831 68187 -286169 -217923 -372158 -119369 -88972 -40518
4506 -245742 150287 -291931 90845 225426 77631 115612 219515 -42943 82354 -18130 293254
4494 -16245 141540 -113374 113019 138305 20405 283711 317906 116303 225399 113618
$$ [...]
##END NTUPLES=NMR SPECTRUM
##END=
