
##TITLE=AC1364_HAWAH12178_6945872_XUyv9gVlkS
##JCAMPDX= 6.0         $$ Bruker NMR JCAMP-DX V2.0
##DATA TYPE= NMR SPECTRUM
##DATA CLASS= NTUPLES
##ORIGIN= BRUKER
##OWNER= Administrator
$$ 1.72 TOPSPIN		Version 2.1
$$ 2012-10-18 13:48:27.320 -0700  Administrator@X
$$ Compression mode = diff/dup
##.OBSERVE FREQUENCY= 400.02188249412
##.OBSERVE NUCLEUS= ^1H
##.ACQUISITION MODE= SIMULTANEOUS (DQD)
##.ACQUISITION SCHEME= undefined
##.AVERAGES= 64
##.DIGITISER RES= 22
##SPECTROMETER/DATA SYSTEM= spect
##.PULSE SEQUENCE= noesygpps1d.comp
##.SOLVENT NAME= COFFEE_meoh
##.SHIFT REFERENCE= INTERNAL, COFFEE_meoh, 1, 14.96048
##AUDIT TRAIL= $$ (NUMBER, WHEN, WHO, WHERE, PROCESS, VERSION, WHAT)
$$ ##TITLE= Audit trail, TOPSPIN		Version 2.1
$$ ##JCAMPDX= 5.01
$$ ##ORIGIN= Bruker BioSpin GmbH
$$ ##OWNER= Administrator
$$ $$ C:\Bruker\TOPSPIN/data/COFFEE/nmr/AC1364_HAWAH12178_6945872_XUyv9gVlkS/12/pdata/1/auditp.txt
$$ ##AUDIT TRAIL=  $$ (NUMBER, WHEN, WHO, WHERE, PROCESS, VERSION, WHAT)
(   1,<2012-10-14 01:26:41.250 -0500>,<Administrator>,<TOPSPIN>,<go>,<TOPSPIN 2.1>,
      <created by zg
	started at 2012-10-14 01:15:11.062 -0500,
	POWCHK enabled, PULCHK disabled,
       configuration hash MD5:
       6B 1B 68 BB D9 2E 58 E2 7F 35 AD 54 07 DF 0E 41
       data hash MD5: 64K
       09 F9 EA 14 AE 94 78 89 A8 CC 54 10 19 28 71 59>)
(   2,<2012-10-14 01:26:44.078 -0500>,<Administrator>,<TOPSPIN>,<proc1d>,<TOPSPIN 2.1>,
      <Start of raw data processing
       efp LB = 0.3 FT_mod = 6 PKNL = 1 PHC0 = 0 PHC1 = 0 SI = 128K 
       data hash MD5: 128K
       2E 9C 49 88 06 79 72 06 C0 B0 C5 8D 7C D6 41 EB>)
(   3,<2012-10-14 01:26:45.218 -0500>,<Administrator>,<TOPSPIN>,<proc1d>,<TOPSPIN 2.1>,
      <pk PHC0 = 4.685669 PHC1 = 0 
       data hash MD5: 128K
       37 2F C4 80 2E 75 AF 7B 6A 78 87 98 9D F1 0C 96>)
(   4,<2012-10-14 01:26:45.468 -0500>,<Administrator>,<TOPSPIN>,<proc1d>,<TOPSPIN 2.1>,
      <abs ABSG = 1 
       data hash MD5: 128K
       7C 03 74 CE D5 57 55 76 A0 E1 CD EF 2C 33 E5 7E>)
(   5,<2012-10-14 01:26:45.531 -0500>,<Administrator>,<TOPSPIN>,<proc1d>,<TOPSPIN 2.1>,
      <abs ABSG = 2 
       data hash MD5: 128K
       77 D7 2B 8A 04 8C 1F 01 DD F9 33 FF 4E EA 16 71>)
(   6,<2012-10-14 01:26:45.765 -0500>,<Administrator>,<TOPSPIN>,<proc1d>,<TOPSPIN 2.1>,
      <abs ABSG = 3 
       data hash MD5: 128K
       7B CF 1B 46 24 BE E7 90 76 65 E8 25 BD 69 0D F6>)
(   7,<2012-10-14 01:26:45.828 -0500>,<Administrator>,<TOPSPIN>,<proc1d>,<TOPSPIN 2.1>,
      <abs ABSG = 4 
       data hash MD5: 128K
       77 1F 0E 9C 8B 04 03 0B BC AE 06 CC 09 B6 18 1B>)
(   8,<2012-10-14 01:26:45.875 -0500>,<Administrator>,<TOPSPIN>,<proc1d>,<TOPSPIN 2.1>,
      <abs ABSG = 5 
       data hash MD5: 128K
       DD B6 88 84 A3 FB 3D 6B D2 94 5C F0 4C DA F7 50>)
(   9,<2012-10-14 01:26:46.109 -0500>,<Administrator>,<TOPSPIN>,<audit>,<TOPSPIN 2.1>,
      <user comment:
       ICON-NMR User ID: COFFEE
       data hash MD5: 128K
$$ [...]
##$TP07= 0
##$TPNAME0= <>
##$TPNAME1= <>
##$TPNAME2= <>
##$TPNAME3= <>
##$TPNAME4= <>
##$TPNAME5= <>
##$TPNAME6= <>
##$TPNAME7= <>
##$TPOAL= (0..7)
0.5 0.5 0.5 0.5 0.5 0.5 0.5 0.5
##$TPOFFS= (0..7)
0 0 0 0 0 0 0 0
##$TUNHIN= 0
##$TUNHOUT= 0
##$TUNXOUT= 0
##$USERA1= <user>
##$USERA2= <user>
##$USERA3= <user>
##$USERA4= <user>
##$USERA5= <user>
##$V9= 5
##$VALIST= <valist>
##$VCLIST= <CCCCCCCCCCCCCCC>
##$VD= 0
##$VDLIST= <DDDDDDDDDDDDDDD>
##$VPLIST= <PPPPPPPPPPPPPPP>
##$VTLIST= <TTTTTTTTTTTTTTT>
##$WBST= 2048
##$WBSW= 25
##$XGAIN= (0..3)
0 0 0 0
##$XL= 0
##$YL= 0
##$YMAX_a= 12966132
##$YMIN_a= -9897839
##$ZGOPTNS= <>
##$ZL1= 120
##$ZL2= 120
##$ZL3= 120
##$ZL4= 120
##$ABSF1= 14.96048
##$ABSF2= -5.597702
##$ABSG= 5
##$ABSL= 3
##$ALPHA= 0
##$AQORDER= 0
##$ASSFAC= 0
##$ASSFACI= 0
##$ASSFACX= 0
##$ASSWID= 0
##$AUNMP= <proc_prof1d_extract.lims>
##$AXLEFT= 0
##$AXNAME= <>
##$AXNUC= <1H>
##$AXRIGHT= 0
##$AXTYPE= 0
##$AXUNIT= <>
##$AZFE= 0.1
##$AZFW= 0.1
##$BCFW= 0
##$BC_mod= 0
##$BYTORDP= 0
##$COROFFS= 0
##$CY= 15
##$DATMOD= 1
##$DC= 0
##$DFILT= <>
##$DTYPP= 0
##$F1P= 0
##$F2P= 0
##$FCOR= 0.5
##$FTSIZE= 131072
##$FT_mod= 6
##$GAMMA= 0
##$GB= 0
##$INTBC= 1
##$INTSCL= 1
##$ISEN= 128
##$LB= 0.3
##$LEV0= 0
##$LPBIN= 0
##$MAXI= 10000
##$MC2= 0
##$MEAN= 0
##$ME_mod= 0
##$MI= 0
##$NCOEF= 0
##$NC_proc= -2
##$NLEV= 6
##$NOISF1= 0
##$NOISF2= 0
##$NSP= 0
##$NTH_PI= 0
##$NZP= 0
##$OFFSET= 14.96048
##$PC= 1
##$PHC0= 4.685669
##$PHC1= 0
##$PH_mod= 1
##$PKNL= yes
##$PPARMOD= 0
##$PPDIAG= 0
##$PPIPTYP= 0
##$PPMPNUM= 2147483647
##$PPRESOL= 1
##$PSCAL= 4
##$PSIGN= 0
##$PYNMP= <proc.py>
##$REVERSE= no
##$SF= 400.020009843095
##$SI= 131072
##$SIGF1= 0
##$SIGF2= 0
##$SINO= 400
##$SIOLD= 131072
##$SPECTYP= <>
##$SREGLST= <1H.CDCl3>
##$SSB= 0
##$STSI= 131072
##$STSR= 0
##$SW_p= 8223.68421052631
##$SYMM= 0
##$S_DEV= 0
##$TDeff= 65536
##$TDoff= 0
##$TI= <>
##$TILT= no
##$TM1= 0
##$TM2= 0
##$TOPLEV= 0
##$USERP1= <user>
##$USERP2= <user>
##$USERP3= <user>
##$USERP4= <user>
##$USERP5= <user>
##$WDW= 1
##$XDIM= 131072
##$YMAX_p= 282304204
##$YMIN_p= -15824
##$CURPLOT= <Network HP LaserJet P1505>
##$CURPRIN= <$Network HP LaserJet P1505>
##$DFORMAT= <normdp>
##$LAYOUT= <+/1D_H.xwp>
##$LFORMAT= <normlp>
##$PFORMAT= <normpl>
##$SURQMSG= 1
$$ End of Bruker specific parameters
$$ ---------------------------------
##NTUPLES= NMR SPECTRUM
##VAR_NAME=  FREQUENCY,     SPECTRUM/REAL,   SPECTRUM/IMAG
##SYMBOL=    X,             R,               I
##VAR_TYPE=  INDEPENDENT,   DEPENDENT,       DEPENDENT
##VAR_FORM=  AFFN,          ASDF,            ASDF
##VAR_DIM=   131072,        131072,          131072
##UNITS=     HZ,            ARBITRARY UNITS, ARBITRARY UNITS
##FACTOR=    0.0627417313425164, 1,          1
##FIRST=     8223.62146879497, -475,         -68421
##LAST=      0,             887,             -68843
##MIN=       0,             -15824,          0
##MAX=       8223.62146879497, 282304204,    0
$$ Real data points
##PAGE= N=1
##DATA TABLE= (X++(R..R)), XYDATA
$$ [...]
63981C96682R091R325Q788Q316Q601R460J0346J1081J1748J2216J2374J2568J3261
$$ 396682 405773 415098 423886 432202 440803 450263 460609 471690 483438 495654 508028 520596 533857
63968E33857J4360J5358J6042J6559J6877J6814J6719J7415J9121K1018K2363
$$ 533857 548217 563575 579617 596176 613053 629867 646586 664001 683122 704140 726503
63957G26503K3561K5512K8249L0986L3507L6663M1141M6395N1306N5671O0469
$$ 726503 750064 775576 803825 834811 868318 904981 946122 992517 1043823 1099494 1159963
63946A159963O6710P4434Q2891R1428R9925J08497J16992J24870J31614J37087
$$ 1159963 1226673 1301107 1383998 1475426 1575351 1683848 1800840 1925710 2057324 2194411
63936B194411J41335J44084J44660J42479J37336J29184J17963J03944Q7871P0378
$$ 2194411 2335746 2479830 2624490 2766969 2904305 3033489 3151452 3255396 3343267 3413645
63926C413645N1450L0896R214j2526l3607n3950p3354r1054j06285j18920j29131
$$ 3413645 3465095 3495991 3505205 3492679 3459072 3405122 3331768 3240714 3134429 3015509 2886378
63915B886378j36798j41559j43342j42521j39662j35304j29837j23416j16045
$$ 2886378 2749580 2608021 2464679 2322158 2182496 2047192 1917355 1793939 1677894
63906A677894j07859r9141r0029q0596p1295o2983n6050m9924m3783l7599l2060
$$ 1677894 1570035 1470894 1380865 1300269 1228974 1165991 1109941 1060017 1016234 978635 946575
63895I46575k7627k4118k1123j8444j6144j4434j3336j2318j0566q031n831m953
$$ 946575 918948 894830 873707 855263 839119 824685 811349 799031 788465 780434 774603 769650
63883G69650m834l956j767Q07K804M315N901P705R636J1754J3937J5683J6824
$$ 769650 764816 760860 759093 759900 762704 767019 772920 780625 790261 802015 815952 831635 848459
63870H48459J8018J9930K2164K3685K4116K4085K4305K4742K4803K3997K2349
$$ 848459 866477 886407 908571 932256 956372 980457 1004762 1029504 1054307 1078304 1100653
63859A100653K0350J8443J6435J3630R758N502J732j514m856q534j2133j5330
$$ 1100653 1121003 1139446 1155881 1169511 1179269 1184771 1186503 1184989 1180133 1171599 1159466 1144136
63847A144136j8317k1307k4041k6137k7638k8960l0382l1728l2548l2532l1805
$$ 1144136 1125819 1104512 1080471 1054334 1026696 997736 967354 935626 903078 870546 838741
63836H38741l0793k9763k8612k7239k5873k4812k4053k3439k2974k2558k1614
$$ 838741 807948 778185 749573 722334 696461 671649 647596 624157 601183 578625 557011
63825E57011j9663j7304j5890j5979j6622j6517j5417j3977j2686j1529j0461
$$ 557011 537348 520044 504154 488175 471553 455036 439619 425642 412956 401427 390966
63814C90966r561q746p817o894o329o127n828n171m524m373m666m949n035n138
$$ 390966 381405 372659 364842 357948 351619 345492 339664 334493 329969 325596 320930 315981 310946 305808
63800C05808n288n075m188l036k418k553k790k495j912j773k247k756k802k507
$$ 305808 300520 295445 291257 288221 285803 283250 280460 277965 276053 274280 272033 269277 266475 263968
63786B63968k157j771j431j573k392l191l011j920j075j316k204k717k508k057
$$ 263968 261811 260040 258609 257036 254644 251453 248442 246522 245447 244131 241927 239210 236702 234645
63772B34645j827j772j649j381r95n37j74j26l27l57N9O09P56M37R4k0j73n88
$$ 234645 232818 231046 229397 228016 227021 226484 226310 226184 225857 225500 225559 226168 226924 227361 227455 227435 227262 226674
63754B26674r55q23k85J37K26K04K17P5k84n32l65R7N41Q03Q20N48J92K19P90
$$ 226674 225719 224896 224611 224748 224974 225178 225395 225470 225186 224654 224289 224386 224927 225730 226550 227098 227290 227509 228299
63735B28299J447J750J949K512L256L452K837J954J414J316J458J743K170K723
$$ 228299 229746 231496 233445 235957 239213 242665 245502 247456 248870 250186 251644 253387 255557 258280
63721B58280L389M006M173L645K807K269K075J783J357J255J471J256K06j041
$$ 258280 261669 265675 269848 273493 276300 278569 280644 282427 283784 285039 286510 287766 287972 286931
63707B86931j711j922k210k595k772k819k932k828k118j115m41%Q15J909K452
$$ 286931 285220 283298 281088 278493 275721 272902 269970 267142 265024 263909 263468 263468 264283 266192 268644
63692B68644K147J698J701J851J618J110Q11R36J421K107K623K558K046J757J933
$$ 268644 270791 272489 274190 276041 277659 278769 279580 280516 281937 284044 286667 289225 291271 293028 294961
63677B94961K018J556R65Q32R71Q24M11K40M24O36P96J180J880K628L172L362
$$ 294961 296979 298535 299500 300332 301303 302127 302538 302778 303202 303838 304634 305814 307694 310322 313494 316856
63661C16856K960J906O62k15q43j767k947l676l603l240l178l346l324k984k420
$$ 316856 319816 321722 322384 322169 321326 319559 316612 312936 309333 306093 302915 299569 296245 293261 290841
63646B90841j676q44j45L72R53J663K164K189J993J977K149K304K447K711L069
$$ 290841 289165 288321 288176 288548 289501 291164 293328 295517 297510 299487 301636 303940 306387 309098 312167
63631C12167L444L848M116L878L258L244M626O743Q039P943P433P577Q247Q694
$$ 312167 315611 319459 323575 327453 330711 333955 338581 345324 353363 361306 368739 376316 384563 393257
63617C93257Q810R117R896J0850J1630J2174J2636J3262J4295J5725J7171J8304
$$ 393257 402067 411184 421080 431930 443560 455734 468370 481632 495927 511652 528823 547127
63605E47127J9181J9915K0227J9792J8859J7914J6811J4882J2049R077O418L572
$$ 547127 566308 586223 606450 626242 645101 663015 679826 694708 706757 715834 722252 725824
63593G25824J99k725l823l224k584l142m539n851o985q498j0495j2462j4038j5353
$$ 725824 726023 723298 719475 716251 713667 710525 705986 700135 693150 684652 674157 661695 647657 632304
63579F32304j6504j7199j7062j6086j4576j2894j1339j0102r085p851o040l904
$$ 632304 615800 598601 581539 565453 550877 537983 526644 516542 507457 499606 493566 489662
63567D89662k240j556j405p90P15K529L818M436M897N682O866Q176R135R333R029
$$ 489662 487422 485866 484461 483671 484386 486915 490733 495169 500066 505748 512614 520790 529925 539258 548287
63552E48287R222J0556J2373J3518J4009J5013J7092J9493K1573K3782K6469K8624
$$ 548287 557509 568065 580438 593956 607965 622978 640070 659563 681136 704918 731387 760011
63540G60011K8841K6888K3320J8175J1506M763j8k603m693p211q902q429o599
$$ 760011 788852 815740 839060 857235 868741 873504 873486 870883 866190 858979 850077 841648 835049
63527H35049n437n820p207r107j1569j4374j6869j8838k0750k2923k4958k6195
$$ 835049 829612 823792 816585 807478 795909 781535 764666 745828 725078 702155 677197 651002
63515F51002k6349k5560k4177k2564k0859j8987j7018j5386j4396j3723j2760
$$ 651002 624653 599093 574916 552352 531493 512506 495488 480102 465706 451983 439223
63504D39223j1312r674q151o982o464o599o691n979m664l740l664l802l381k430
$$ 439223 427911 418237 410086 403104 396640 390041 383350 377371 372707 368967 365303 361501 358120 355690
63490C55690j473p47j33M04O94N90J66k19n1Q49J934K411K274K358L247M427M966
$$ 355690 354217 353470 353337 353741 354435 355025 355191 354972 354921 355770 357704 360115 362389 364747 367994 372421 377387
63473C77387M603L817L054K296J330Q9j270k426l094l271l231l119k801k197j564
$$ 377387 381990 385807 388861 391157 392487 392576 391306 388880 385786 382515 379284 376165 373364 371167 369603
63458C69603j161r32p11n72o17o61l93K49J111K032K744K870K457K269K994M288
$$ 369603 368442 367510 366799 366227 365610 364949 364556 364805 365916 367948 370692 373562 376019 378288 381282 385570
63442C85570N202N507N966P168Q798J0293J1653J3110J4488J5510J6491J8157
$$ 385570 390772 396279 402245 409413 418211 428504 440157 453267 467755 483265 499756 517913
63430E17913K0695K3278K4590K3732K0752J6624J2612R412O896M828L593L889
$$ 517913 538608 561886 586476 610208 630960 647584 660196 669608 676504 681332 684925 688814
63418F88814N774Q457J1138J3687J6305J8835K0779K1875K2328K2329K1550J9340
$$ 688814 694588 703045 714183 727870 744175 763010 783789 805664 827992 850321 871871 891211
63406H91211J5470J0575N723J609j747m485o371p052o747o394o902q360j0220
$$ 891211 906681 917256 922979 924588 922841 918356 911985 904933 898186 891792 884890 876530 866310
63393H66310j2202j4727j8216k2088k4921k5800k5249k4479k3886k2821k0843
$$ 866310 854108 839381 821165 799077 774156 748356 723107 698628 674742 651921 631078
63382F31078j8555j6779j5374j3493j0973q737p635p316o613m859k483m19Q89
$$ 631078 612523 595744 580370 566877 555904 547167 539532 532216 525603 520744 518261 517842 518731
63369E18731J856L242N355P690R422J0212J0505J1053J2253J3907J5488J6569
$$ 518731 520587 523829 529184 536874 546296 556508 567013 578066 590319 604226 619714 636283
63357F36283J7183J7810J8920K0552K2345K3886K4805K4663K3181K0669J7842
$$ 636283 653466 671276 690196 710748 733093 756979 781784 806447 829628 850297 868139
63346H68139J5029J1878Q118M271J131j184l199n188o867q060r081j0246j1421
$$ 868139 883168 895046 903164 907435 908566 907382 904183 898995 892128 884068 874987 864741 853320
63333H53320j2459j3700j5598j7971k0108k1641k2793k3702k3937k3030k1196
$$ 853320 840861 827161 811563 793592 773484 751843 729050 705348 681411 658381 637185
63322F37185j9086j7063j5090j3175j1369r373o831m286l210m530p549j0740j3202
$$ 637185 618099 601036 585946 572771 561402 552029 545198 540912 537702 533172 525623 514883 501681
63309E01681j4746j5150j4389j3368j3230j3647j2941j0396p434n808n488n248
$$ 501681 486935 471785 457396 444028 430798 417151 404210 393814 386380 380572 375084 369836
63297C69836m615m105l933l706l281k969k804k519k261k448k827k633j830j264
$$ 369836 365221 361116 357183 353477 350196 347227 344423 341904 339643 337195 334368 331735 329905 328641
63283C28641j336j430j073o79o34n31m4K19l16j032q93rN84N57O45J319J996J932
$$ 328641 327305 325875 324802 324123 323489 322958 322914 323133 322817 321785 320892 320883 321467 322024 322669 323988 325984 327916
63265C27916J250O74O06Q12R58J105J633K612L449L525L132L251M215N203N456
$$ 327916 329166 329840 330446 331258 332216 333321 334954 337566 341015 344540 347672 350923 355138 360341 365797
63250C65797N349N681O444P112P641Q220Q410P663O586O505P657Q895R478J0013
$$ 365797 371146 376827 383271 390383 398024 406244 414654 422317 428903 435408 443065 451960 461438 471451
63236D71451J1153J2489J3416J4177J5120J5703J5283J4425J4311J5130J5967
$$ 471451 482604 495093 508509 522686 537806 553509 568792 583217 597528 612658 628625
63225F28625J6212J6130J6017J5747J5334J5164J5367J5547J5491J5521J5802
$$ 628625 644837 660967 676984 692731 708065 723229 738596 754143 769634 785155 800957
63214H00957J5774J4747J2739J0249P504M391R52k484n638q433j0793j2609j3900
$$ 800957 816731 831478 844217 854466 861970 866361 867313 864829 859191 850758 839965 827356 813456
63201H13456j4768j5173j4949j4046j2539j0461p899n197k747n03J971M837P766
$$ 813456 798688 783515 768566 754520 741981 731520 723621 718424 715677 715174 717145 721982 729748
63188G29748J0463J2986J5280J6916J7777J8610K0217K2253K3615K3934K3964
$$ 729748 740211 753197 768477 785393 803170 821780 841997 864250 887865 911799 935763
63177I35763K4338K4791K4931K4943K5017K4728K3686K2262K0913J9174J6178
$$ 935763 960101 984892 1009823 1034766 1059783 1084511 1108197 1130459 1151372 1170546 1186724
63166A186724J1906P100K071l482r410j4862j9403k3638k8317l3251l7518m0334
$$ 1186724 1198630 1205730 1207801 1204319 1194909 1180047 1160644 1137006 1108689 1075438 1037920 997586
63154I97586m1488m1309m0433l9292l7707l5329l2414k9680k7302k4745k1771
$$ 997586 956098 914789 874356 835064 797357 762028 729614 699934 672632 647887 626116
63143F26116j8945j6825j5305j4075j3022j1844r998p646n922n551n800n540m839
$$ 626116 607171 590346 575041 560966 547944 536100 526102 518456 512534 506983 501183 495643 490804
63130D90804m518m597m274l256k136j334o69m6K20M7q7K42R51J656J927J449N54
$$ 490804 486286 481689 477415 474159 472023 470689 470020 469974 470194 470241 470154 470396 471347 473003 474930 476379 476933
63113D76933L57J535L063L238K084J462K397L596L433K292J714K052K347K179
$$ 476933 477290 478825 481888 485126 487210 488672 491069 494665 498098 500390 502104 504156 506503 508682
63099E08682K132K497K741K579K485K719K812K470K242K639L249L422L286L397
$$ 508682 510814 513311 516052 518631 521116 523835 526647 529117 531359 533998 537247 540669 543955 547352
63085E47352L696L697L380L204L243L145K948L112L582L702L395L638N093O969
$$ 547352 551048 554745 558125 561329 564572 567717 570665 573777 577359 581061 584456 588094 593187 600156
63071F00156Q013Q173Q377R028R698J0266J1249J2798J4272J5241J6117J7334
$$ 600156 608169 616342 624719 633747 643445 653711 664960 677758 692030 707271 723388 740722
63059G40722J8583J9485K0417K1978K3999K5749K6926K7856K8991L0695L3192
$$ 740722 759305 778790 799207 821185 845184 870933 897859 925715 954706 985401 1018593
63048A018593L6107L8315L8938L8316L7489L6941L6612L6771L7825L9280L9974
$$ 1018593 1054700 1093015 1131953 1170269 1207758 1244699 1281311 1318082 1355907 1395187 1435161
63037A435161L9601L9085L9076L8996L8088L6549L4837L2580K9025K4190J8678
$$ 1435161 1474762 1513847 1552923 1591919 1630007 1666556 1701393 1733973 1762998 1787188 1805866
63026A805866J2557N321k946j1168j8250k3967k8606l2181l4434l5372l5378l4664
$$ 1805866 1818423 1823744 1820798 1809630 1791380 1767413 1738807 1706626 1672192 1636820 1601442 1566778
63014A566778l2909k9651k5003j9716j4484r365m073J382O735J1961J7310K2754
$$ 1566778 1533869 1504218 1479215 1459499 1445015 1435650 1431577 1432959 1439694 1451655 1468965 1491719
63002A491719K7835L2157L5783L8980M1837M4203M5793M6351M5993M5338M4935
$$ 1491719 1519554 1551711 1587494 1626474 1668311 1712514 1758307 1804658 1850651 1895989 1940924
62991A940924M4640M4020M3219M2689M1916L9386L4286K7480K0220J2518L528
$$ 1940924 1985564 2029584 2072803 2115492 2157408 2196794 2231080 2258560 2278780 2291298 2294826
62980B294826o956j8210k9520m0487n0654n9513o6931p2905p7055p9007p9292
$$ 2294826 2287870 2269660 2240140 2199653 2148999 2089486 2022555 1949650 1872595 1793588 1714296
62969A714296p9000p8428p6777p3459o9000o4321n9676n4814m9800m5118m1062
$$ 1714296 1635296 1556868 1480091 1406632 1337632 1273311 1213635 1158821 1109021 1063903 1022841
62958A022841l7506l4232l1312k8956k7167k5568k3756k1798k0245j9454j9090
$$ 1022841 985335 951103 919791 890835 863668 838100 814344 792546 772301 752847 733757
62947G33757j8508j7501j6379j5426j4634j3949j3335j2684j1932j1300j0999
$$ 733757 715249 697748 681369 665943 651309 637360 624025 611341 599409 588109 577110
62936E77110j0763j0116r119q393q187q002p367o595o306o532o708o413n747n037
$$ 577110 566347 556231 547112 538719 530532 522530 515163 508568 502262 495730 489022 482609 476862 471825
62922D71825m466m074l871l806l702l294k460j472r34j307k382l408l760l418
$$ 471825 467359 463285 459414 455608 451906 448612 446152 444680 443746 442439 440057 436649 432889 429471
62908D29471k759k110j578j182r70j055j547k415l354l891l680k756j530n82k57
$$ 429471 426712 424602 423024 421842 420872 419817 418270 415855 412501 408610 404930 402174 400644 400062 399805
62893C99805m60p91j006j110j081p71k18K38M16N45Q00R40P67O23Q38R83L51r18
$$ 399805 399345 398554 397548 396438 395357 394586 394368 394606 395022 395567 396367 397307 398074 398697 399535 400518 400869 399951
62875C99951j848j854j257o06p7K57K59Q9J31L18P0p85j572j733j600j746j942
$$ 399951 398103 396249 394992 394386 394309 394566 394825 394914 395045 395363 395433 394648 393076 391343 389743 387997 386055
62858C86055j498l84N61N75k23r52p14O06K056K375J280j71p26j85P47J476J888
$$ 386055 384557 384173 384734 385309 385086 384134 383420 384026 386082 388457 389737 389566 388840 388655 389402 390878 392766
62841C92766J998J766J271P34L48K56N92J194J562J388J079J313K127K763K553
$$ 392766 394764 396530 397801 398535 398883 399139 399731 400925 402487 403875 404954 406267 408394 411157 413710
62826D13710J662Q98R48J832L000L891M316M356M025L412K938L026L474L704L695
$$ 413710 415372 416270 417218 419050 422050 425941 430257 434613 438638 442050 444988 448014 451488 455192 458887
62811D58887M065N015N857O062O101O589P250P449P379P757Q606R261R547R979
$$ 458887 462952 467967 473824 479886 485987 492576 499826 507275 514654 522411 531017 540278 549825 559804
62797E59804J0717J1214J1225J1312J2003J3041J3996J5058J6638J8595K0447
$$ 559804 570521 581735 592960 604272 616275 629316 643312 658370 675008 693603 714050
62786G14050K2121K4014K6348K8962L1711L4670L7827M0943M3917M7021N0422
$$ 714050 736171 760185 786533 815495 847206 881876 919703 960646 1004563 1051584 1102006
62775A102006N3577N5535N5920N5214N3829N1356M7160M1443L4934K7710J9136
$$ 1102006 1155583 1211118 1267038 1322252 1376081 1427437 1474597 1516040 1550974 1578684 1597820
62764A597820R202r76j0371j8951k6933l3885l9335m3623m7233m9853n0953n0889
$$ 1597820 1607022 1606046 1595675 1576724 1549791 1515906 1476571 1432948 1385715 1335862 1284909 1234020
62752A234020n0407m9426m7425m4796m2546m0636l7960l4181l0352k7262k4377
$$ 1234020 1183613 1134187 1086762 1041966 999420 958784 920824 886643 856291 829029 804652
62741H04652k1124j8156j6390j5528j4459j2697j0615q564o573m783l423k392
$$ 804652 783528 765372 748982 733454 718995 706298 695683 687119 680546 675763 672340 669948
62729F69948j319n0J226K259K952L428M071N184O488P359P759Q489J0120J2151
$$ 669948 668629 668579 669805 672064 675016 678444 682515 687699 694187 701546 709305 717794 727914 740065
62715G40065J3719J4771J6012J7908K0306K2865K5409K7882L0341L3000L6021
$$ 740065 753784 768555 784567 802475 822781 845646 871055 898937 929278 962278 998299
62704I98299L9394M3144M7436N2233N7107O1640O5863P0060P4365P8677Q2559
$$ 998299 1037693 1080837 1128273 1180506 1237613 1299253 1365116 1435176 1509541 1588218 1670777
62693A670777Q5101Q5364Q3365Q0062P5900O9911O0842M8825L5171K0826N842
$$ 1670777 1755878 1841242 1924607 2004669 2080569 2150480 2211322 2260147 2295318 2316144 2321986
62682B321986r690k5048l9426n2476o3983p3506q0663q5536q8540q9928q9634
$$ 2321986 2312296 2287248 2247822 2195346 2131363 2057857 1977194 1891658 1803118 1713190 1623556
62671A623556q7570q4005p9550p4688o9521o4138n9033n4669n0739m6532m2078
$$ 1623556 1535986 1451981 1372431 1297743 1228222 1164084 1105051 1050382 999643 953111 911033
62660I11033l8152l4980l1797k8208k5047k3136k1914k0263j8162j6425j5236
$$ 911033 872881 837901 806104 777896 752849 729713 707799 687536 669374 652949 637713
62649F37713j4025j2687j1755j1314j0776r925r211q831q321p412o485n857n299
$$ 637713 623688 611001 599246 587932 577156 567231 558020 549189 540868 533456 526971 521114 515815
62636E15815m595l936l378k565j404n47o86j666k603k735j987r47m17o56j119
$$ 515815 511220 507284 503906 501341 499937 499390 498704 497038 494435 491700 489713 488766 488349 487693 486574
62621D86574j241j255j687k237k026r36J80Q25J472K480L377L733L946M479N042
$$ 486574 485333 484078 482391 480154 478128 477192 477372 478197 479669 482149 485526 489259 493205 497684 502726
62606E02726N215N357O096P346Q561R577J0553J1454J2319J3658J5802J8114J9671
$$ 502726 507941 513298 519394 526740 535301 544878 555431 566885 579204 592862 608664 626778 646449
62593F46449K0557K1665K3251K4593K5108K4977K4397K3090K0886J8165J5181
$$ 646449 667006 688671 711922 736515 761623 786600 810997 834087 854973 873138 888319
62582H88319J1468O544Q57m524r083j3141j6978k0179k2161k3033k3598k4472
$$ 888319 899787 906331 907188 902664 893581 880440 863462 843283 821122 798089 774491 750019
62570G50019k5463k5815k4983k3119k0951j9249j8200j7230j5571j3194j0930
$$ 750019 724556 698741 673758 650639 629688 610439 592239 575009 559438 546244 535314
62559E35314r500q702p852o798n916n256m355l014j715r77p45o74n86l74J63J024
$$ 535314 525814 517112 509260 502462 496546 491290 486935 483921 482206 481229 480484 479810 479224 478850 479013 480037
62543D80037J794K081J986J974K403L294M329M991N066N075N757O981P793P691
$$ 480037 481831 483912 485898 487872 490275 493569 497898 502889 507955 513030 518787 525768 533561 541252
62529E41252P332P556Q371R377J0582J2140J3793J5292J6993J9351K2089K4613
$$ 541252 548584 556140 564511 573888 584470 596610 610403 625695 642688 662039 684128 708741
62517G08741K6950K9575L2511L5436L8399M1587M4441M6066M6505M6636M6591
$$ 708741 735691 765266 797777 833213 871612 913199 957640 1003706 1050211 1096847 1143438
62506A143438M5272M1856L6837L1047K4530J7038R022J179o496j4353k1962k8209
$$ 1143438 1188710 1230566 1267403 1298450 1322980 1340018 1349040 1350219 1343723 1329370 1307408 1279199
62494A279199l2540l5396l7282l8148l7915l7043l5999l4442l1492k6894k1545
$$ 1279199 1246659 1211263 1173981 1135833 1097918 1060875 1024876 990434 958942 932048 910503
62483I10503j6705j2942r976p318m731k131N67L282N691P479Q508Q709Q036O660
$$ 910503 893798 880856 870880 863562 858831 856700 857267 860549 866240 873719 882227 890936 898972 905632
62469I05632M967L117Q46k005n083q010j0971j4319j7722k0322k1791k2726k3824
$$ 905632 910599 913716 914562 912557 907474 899464 888493 874174 856452 836130 814339 791613 767789
62456G67789k5119k6105k6308k5541k3989k2212k0758j9620j8281j6444j4392
$$ 767789 742670 716565 690257 664716 640727 618515 597757 578137 559856 543412 529020
62445E29020j2527j0948r605q539p690o786n691m692m142m036m073l993l615k816
$$ 529020 516493 505545 495940 487401 479711 472925 467234 462542 458400 454364 450291 446298 442683 439867
62431D39867j775j045j049j593k138k437k600k729k854l197l965m813m917l938
$$ 439867 438092 437047 435998 434405 432267 429830 427230 424501 421647 418450 414485 409672 404755 400817
62417D00817k628k053k383k801k611j972j395r39l49L04N81L45l8k33k99l28j79
$$ 400817 398189 396136 393753 390952 388341 386369 384974 384035 383686 383990 384571 384916 384878 384645 384346 384018 383839
62400C83839J53L40K13J89P54J731K490K741K632K290J742J289J371K040K895
$$ 383839 383992 384332 384545 384734 385488 387219 389709 392450 395082 397372 399114 400403 401774 403814 406709
62385D06709L636M238M560M336L721L409L919M997N950O377O430O527O900P356
$$ 406709 410345 414583 419143 423479 427200 430609 434528 439525 445475 451852 458282 464809 471709 479065
62371D79065P519P458P883R297J1204J2585J3108J3314J3646J4008J4358J5076
$$ 479065 486584 494042 501925 511222 522426 535011 548119 561433 575079 589087 603445 618521
62359F18521J6416J8244K0564K3669K7389L0803L3232L5001L6680L8054L8410
$$ 618521 634937 653181 673745 697414 724803 755606 788838 823839 860519 898573 936983
62348I36983L7474L5452L2413K8283K3268J7734J1848N793Q1m888r373j3842j8232
$$ 936983 974457 1009909 1042322 1070605 1093873 1111607 1123455 1129248 1129329 1124441 1115068 1101226 1082994
62335A082994k2230k5914k9372l1907l2594l1657l0400k9553k8613k7046k5245
$$ 1082994 1060764 1034850 1005478 973571 940977 909320 878920 849367 820754 793708 768463
62324G68463k3716k2151k0092j7938j6477j5672j4765j3456j2275j1712j1648
$$ 768463 744747 722596 702504 684566 668089 652417 637652 624196 611921 600209 588561
62313E88561j1749j1921j2059j1866j1204j0362r658r013q207p334o674o182n503
$$ 588561 576812 564891 552832 540966 529762 519400 509742 500729 492522 485188 478514 472332 466829
62300D66829m517l526k798k207j527q29l57j70j01j9J59N74J197J655J594J284
$$ 466829 462312 458786 455988 453781 452254 451425 451068 450898 450797 450778 450937 451511 452708 454363 455957 457241
62284D57241J421K227L175L796M254M787N013M479L637L522M379N249N250M706
$$ 457241 458662 460889 464064 467860 472114 476901 481914 486393 490030 493552 497931 503180 508430 513136
62270E13136M575N127N803O173O452O998P833Q922J0468J2541J4707J6457J7981
$$ 513136 517711 522838 528641 534814 541266 548264 556097 565019 575487 588028 602735 619192 637173
62257F37173K0012K2903K6172K9147L1709L4219L6872L9333M0870M0737L8691
$$ 637173 657185 680088 706260 735407 767116 801335 838207 877540 918410 959147 997838
62246I97838L5282L1341K6959K1375J4189O357n56n936j0440j4923j9641k4441
$$ 997838 1033120 1064461 1091420 1112795 1126984 1133341 1132785 1126849 1116409 1101486 1081845 1057404
62234A057404k9019l2818l5255l6379l6884l7206l6993l5701l3358l0503k7705
$$ 1057404 1028385 995567 960312 923933 887049 849843 812850 777149 743791 713288 685583
62223F85583k5335k3456k1660j9425j6865j4720j3347j2135j0372q257o642n977
$$ 685583 660248 636792 615132 595707 578842 564122 550775 538640 528268 520011 513369 507392
62211E07392n968o090n974n455m584l636k861k358k203k357k355j579j50R73J190
$$ 507392 501424 495334 489360 483905 479321 475685 472824 470466 468263 465906 463551 461972 461822 462795 463985
62196D63985J055J387K146K829L493M485N530O021O137O660P684Q431Q521Q513
$$ 463985 465040 466427 468573 471402 474895 479380 484910 490931 497068 503728 511412 519843 528364 536877
62182E36877Q903R360R371R004Q517P831O900O183O139O527O704O524O464O930
$$ 536877 545780 555140 564511 573515 582032 589863 596763 602946 609085 615612 622316 628840 635304 642234
62168F42234P799Q767R881J1584J4181J7384K0470K3034K5305K7593K9601L0593
$$ 642234 650033 658800 668681 680265 694446 711830 732300 755334 780639 808232 837833 868426
62156H68426L0095K8085K4729K0373J5687J1280P188L150o97m047p213j0867j4955
$$ 868426 898521 926606 951335 971708 987395 998675 1005863 1009013 1008316 1004269 997056 986189 971234
62143I71234j8559k1067k2713k3672k3502k2011j9998j8381j7029j5194j2678
$$ 971234 952675 931608 908895 885223 861721 839710 819712 801331 784302 769108 756430
62132G56430r939p252m533j894K94J963L456N030O626Q122R423J0335J0743J0910
$$ 756430 746491 739239 734706 732812 733106 735069 738525 743555 750181 758303 767726 778061 788804 799714
62118G99714J1147J1126R995P397M061J158o45j419j524j383j538k485m187n954
$$ 799714 810861 821987 831982 839379 843440 844598 843953 842534 841010 839627 838089 835604 831417 825463
62104H25463p038p359p385p313o738n284l310j579m10N30J699L268N087O694P535
$$ 825463 818425 811066 803681 796368 789630 784346 781036 779457 779047 779577 781276 784544 789631 796325 803860
62089H03860P620P775Q726J0106J1035J1512J2346J3734J4922J5588J6374J7571
$$ 803860 811480 819255 827981 838087 849122 860634 872980 886714 901636 917224 933598 951169
62077I51169J8360J8236J8230J9518K1457K2294K1544K0339J9543J8735J7353
$$ 951169 969529 987765 1005995 1025513 1046970 1069264 1090808 1111147 1130690 1149425 1166778
62066A166778J5662J4143J2760J1416J0490J0391J0957J1733J2520J3316J3989
$$ 1166778 1182440 1196583 1209343 1220759 1231249 1241640 1252597 1264330 1276850 1290166 1304155
62055A304155J4271J3839J2334R636O278L133N10k085n130q541j2223j6538k1678
$$ 1304155 1318426 1332265 1344599 1354235 1360513 1363646 1364156 1362071 1356941 1348400 1336177 1319639 1297961
62042A297961k6874l0975l3726l5962l8413m0717m1871m1372l9646l7468l5233
$$ 1297961 1271087 1240112 1206386 1170424 1132011 1091294 1049423 1008051 968405 930937 895704
62031H95704l2938l0635k8551k6703k4769k2568k0407j8597j6853j4688j2333
$$ 895704 862766 832131 803580 776877 752108 729540 709133 690536 673683 658995 646662
62020F46662j0757j0549j1185j1616j1264j0300r214q348p726p174o602o174n968
$$ 646662 635905 625356 614171 602555 591291 580991 571777 563429 555703 548529 541927 535753 529785
62007E29785n606m633l243k155j634j110lJ455K617L185L273K981K396J802J443
$$ 529785 524179 519546 516303 514148 512514 511404 511401 512856 515473 518658 521931 524912 527308 529110 530553
61992E30553J110L15j100k761m112m797m867m825n255o155o796o573n784n257
$$ 530553 531663 531978 530878 528117 524005 519208 514341 509516 504261 498106 491310 484737 478953 473696
61978D73696n352n734n971n879n371m436l425k861k787k627j904q56j74k81r38
$$ 473696 468344 462610 456639 450760 445389 440953 437528 434667 431880 429253 427349 426493 426319 426038 425100
61963D25100j384r09M49J758K102J612J306J752K396K450J988J768K203K927L403
$$ 425100 423716 422807 423256 425014 427116 428728 430034 431786 434182 436632 438620 440388 442591 445518 448921
61948D48921L559L796M479N487O305O667P003P945R404J0642J1396J2301J3844
$$ 448921 452480 456276 460755 466242 472547 479214 486217 494162 503566 514208 525604 537905 551749
61935E51749J5469J6303J6294J5918J5196J3935J2706J2387J2657J2090J0174
$$ 551749 567218 583521 599815 615733 630929 644864 657570 669957 682614 694704 704878
61924G04878Q113O928N804L401J43k153k759k869l707m934n456n038m302l558
$$ 704878 712991 719919 725723 729124 729267 727114 724355 721486 717779 712845 707389 702351 698049 694491
61910F94491k451o77J488L587N527P442R176J0247J0443J0198J0025R634Q103
$$ 694491 692040 691363 692851 696438 701965 709407 718583 728830 739273 749471 759496 769130 777233
61897G77233N113J636j057k797m456o603q780j0222j0811j1089j1580j2241j2496
$$ 777233 782346 783982 782925 780128 775672 769069 760289 750067 739256 728167 716587 704346 691850
61884F91850j1834j0502r440r257r465r158q275p589p491p476o943n937m867m049
$$ 691850 680016 669514 660074 650817 641352 632194 623919 616330 608839 601363 594420 588483 583616 579567
61870E79567l717l922m132l499j920l39L69L76M13Q74J863L570N900Q116R511
$$ 579567 575850 571928 567796 564297 562377 562038 562407 562783 563196 564070 565933 569503 575403 583519 593030
61855E93030J0258J1093J2420J4212J6372J8595K0227K0989K1591K2838K4371
$$ 593030 603288 614381 626801 641013 657385 675980 696207 717196 738787 761625 785996
61844G85996K5109K4744K3898K2821K0959J7998J4400J0606O553K367j280l990
$$ 785996 811105 835849 859747 882568 903527 921525 935925 946531 953084 955451 954171 950181
61832I50181o181q293r949j0503r922q572o533l712m37K636N088O832P869Q290
$$ 950181 944000 935707 925758 915255 905333 896761 890228 886516 886079 888715 893803 900635 908504 916794
61818I16794Q269P707O038K805j649o436j0923j5002j8731k2065k4811k6679k7474
$$ 916794 925063 932770 938808 941613 939964 933528 922605 907603 888872 866807 841996 815317 787843
61805G87843k7458k7234k6958k5993k3760k0693j7862j5901j4706j3995j3530
$$ 787843 760385 733151 706193 680200 656440 635747 617885 601984 587278 573283 559753
61794E59753j2876j1684j0234r179q586p872o811n951n684n530m887m024l665
$$ 559753 546877 535193 524959 515780 507194 499322 492511 486560 480876 475346 470459 466435 462770
61781D62770l832l871l522l263l411l550l206k610k272k128j671q59k40p5J16
$$ 462770 458938 455067 451545 448282 444871 441321 438115 435505 433233 431105 429434 428575 428335 428260 428376
61766D28376P25J230P53o16j636j309m2Q83Q20L28K14M77M97J42Q4Q55J877K017
$$ 428376 429101 430331 431084 430468 428832 427523 427481 428364 429184 429512 429726 430203 430700 430842 430926 431781 433658 435675
61748D35675R84k81p37l12L82R18J151Q71K9p63o80K13R08P42J81J8K94N44P45
$$ 435675 436659 436378 435641 435329 435711 436629 437780 438651 438680 437917 437237 437450 438358 439100 439281 439299 439593 440137 440882
61729D40882J319K247K839K624J988J669J816J967J828J743K142K781K858J983
$$ 440882 442201 444448 447287 449911 451899 453568 455384 457351 459179 460922 463064 465845 468703 470686
61715D70686P52J00K19M31J36m84q65q59q62j295k239l501m763n606n669n003
$$ 470686 471438 471538 471757 472188 472324 471840 470975 470116 469254 467959 465720 462219 457456 451850 446181 441178
61699D41178m114l484l058k423j577j208j862l030l501k827j876j656j999j986
$$ 441178 437064 433580 430522 428099 426522 425314 423452 420422 416921 414094 412218 410562 408563 406577
61685D06577j339p69q59j317j505j254q13l84j8K41L08Q2n46j443k051j823r94
$$ 406577 405238 404469 403610 402293 400788 399534 398721 398337 398319 398560 398868 398950 398404 396961 394910 393087 392093
61668C92093m59p00j249j430j204r20o75l64q5jM2L20P82J127J234J152Q50L54
$$ 392093 391634 390934 389685 388255 387051 386131 385456 385092 385007 385006 385048 385368 386150 387277 388511 389663 390513 390867
61650C90867M6L39J086J636J578J082N77L30M32Q08J219J425J438J437J407J099
$$ 390867 390913 391252 392338 393974 395552 396634 397211 397541 397973 398781 400000 401425 402863 404300 405707 406806
61634D06806L69n99j437j908k038k037k074k105k017j914k031k306k337j939j454
$$ 406806 407175 406576 405139 403231 401193 399156 397082 394977 392960 391046 389015 386709 384372 382433 380979
61619C80979j256j201r01k62N35J357J980J904Q24p77j994k470k653l080l818
$$ 380979 379723 378522 377621 377359 377894 379251 381231 383135 383959 383182 381188 378718 376065 372985 369167
61604C69167m572m951m608l558k475k231k978l969m357l964l181k465k088k157
$$ 369167 364595 359644 355036 351478 349003 346772 343794 339825 335468 331504 328323 325858 323770 321613
61590C21613k576l096l440l398k911k194j686j623j741j630j271j009j036j214
$$ 321613 319037 315941 312501 309103 306192 303998 302312 300689 298948 297318 296047 295038 294002 292788
61576B92788j336j306j144j011j140j509j720j528j209j059q60l75o9n50j438
$$ 292788 291452 290146 289002 287991 286851 285342 283622 282094 280885 279826 278966 278591 278522 277972 276534
61561B76534j616p19L78P39L29l86j008j083k08J243K142J948J395J327J429R20
$$ 276534 274918 274199 274577 275316 275645 275259 274251 273168 272960 274203 276345 278293 279688 281015 282444 283364
61545B83364l9n51l40M1K92P64J557K009J549N85Q5M71J289J833J791J310O69
$$ 283364 283325 282774 282434 282475 282767 283531 285088 287097 288646 289231 289316 289787 291076 292909 294700 296010 296679
61528B96679L6n67j184j860k530k893k544j476l64l9o06j368j698j640j542j444
$$ 296679 296715 296148 294964 293104 290574 287681 285137 283661 283297 283258 282652 281284 279586 277946 276404 274960
61512B74960j147o60k74k65o40j084j083m05M58O33j14j008j164n35K68P49P68
$$ 274960 273813 273153 272879 272614 271974 270890 269807 269402 269860 270493 270379 269371 268207 267672 267940 268689 269457
61495B69457L14m13q62n97J54P46Q34N07r2q40j406j433j003n44k43L8K61J25
$$ 269457 269771 269358 268496 267899 268053 268799 269633 270140 270048 269208 267802 266369 265366 264822 264579 264617 264878 265003
61477B65003l38n52j56M22M96J26J29J052K366K959K249P07p59j643j973j856
$$ 265003 264665 264113 263957 264379 264875 265001 265130 266182 268548 271507 273756 274463 273704 272061 270088 268232
61461B68232j307m77L51J076J768K254K129J458R91J237J684J412L10p88j119
$$ 268232 266925 266448 266799 267875 269643 271897 274026 275484 276475 277712 279396 280808 281118 280330 279211
61446B79211o55J50Q35J079Q44M86M66Q37J285J636K076K760L505L934L779L049
$$ 279211 278556 278706 279541 280620 281464 281950 282416 283253 284538 286174 288250 291010 294515 298449 302228 305277
61430C05277K099J432J291J430J447J166N71l28j198j336m68O32R44N21L54R16
$$ 305277 307376 308808 310099 311529 312976 314142 314713 314385 313187 311851 311383 312015 312959 313480 313834 314750
61414C14750J603J718J333Q71N04L11M90R53J097M62o56j592k046k146k067j914
$$ 314750 316353 318071 319404 320275 320779 321090 321580 322533 323630 324092 323436 321844 319798 317652 315585 313671
61398C13671j789j641j309q89p43r15r25m93k7M9O8N78J333J469O37n14j073o49
$$ 313671 311882 310241 308932 308043 307300 306385 305460 304967 304940 304989 305057 305635 306968 308437 309074 308560 307487 306838
61380C06838N05J647J917J058j31m80L07J495K327K702K762K380J503N21n1j56
$$ 306838 307343 308990 310907 311965 311834 311354 311661 313156 315483 318185 320947 323327 324830 325351 325300 325144
61364C25144j10n2K33R69K078L192L938M191M085L768L247K626K337K796L815
$$ 325144 325034 324982 325215 326184 328262 331454 335392 339583 343668 347436 350683 353309 355646 358442 362257
61349C62257M763N342N822O339O470N926N209N017N190M907L954L149L284M078
$$ 362257 367020 372362 378184 384523 390993 396919 402128 407145 412335 417242 421196 424345 427629 431707
61335D31707M616M462L922L363K756J940R85J83j64O0N84P40kj326k234k120j476
$$ 431707 436323 440785 444707 448070 450826 452766 453751 453934 453770 453830 454414 455154 455152 453826 451592 449472 447996
61318D47996j225j570j934j885j569j098j64J319K648L012K577K318K748L386
$$ 447996 446771 445201 443267 441382 439813 438715 438551 439870 442518 445530 448107 450425 453173 456559
61304D56559L619L592L803M238M429M244M011L825L178J659l04j783k365k543
$$ 456559 460178 463770 467573 471811 476240 480484 484495 488320 491498 493157 492853 491070 488705 486162
61290D86162l004l753m112l558k401j577j760k671l385l229k303j140p5Q79J697
$$ 486162 483158 479405 475293 471735 469334 467757 465997 463326 459941 456712 454409 453269 453194 454073 455770
61275D55770K291K685L000L189L091K866K987L588M139M146L920M179M981N629
$$ 455770 458061 460746 463746 466935 470026 472892 475879 479467 483606 487752 491672 495851 500832 506461
61261E06461N674N459N429N406N076M802N313O605P638P381N892M204L297L313
$$ 506461 512135 517594 523023 528429 533505 538307 543620 550225 557863 565244 571136 575340 578637 581950
61247E81950L642L609L099K508K114J667P40o17j819k400k427k246k130k272k737
$$ 581950 585592 589201 592300 594808 596922 598589 599329 598712 596893 594493 592066 589820 587690 585418 582681
61232E82681l192l024k165j516j997l237l781k775r66K76M61J39o5p5q9j65k15
$$ 582681 579489 576465 574300 572784 570787 567550 563769 560994 560028 560304 560765 560904 560839 560764 560675 560510 560295
61215E60295j41Q6L50M77M69O05J067J594J827J783J699J521J034M62L76Q65J368
$$ 560295 560154 560240 560590 561067 561536 562141 563208 564802 566629 568412 570111 571632 572666 573128 573504 574369 575737
61198E75737J580K029L351N322P084Q100Q544Q830R147R429R516R360R146R043
$$ 575737 577317 579346 582697 588019 595103 603203 611747 620577 629724 639153 648669 658029 667175 676218
61184F76218Q761P696N806L960L075L171L585L800L612K890J781R90J165J988
$$ 676218 684979 692675 698481 702441 705516 708687 712272 716072 719684 722574 724355 725345 726510 728498
61170G28498K423J959J002O8q05j680k371k774l120l653m310m898n375n811o320
$$ 728498 730921 732880 733882 733950 733145 731465 729094 726320 723200 719547 715237 710339 704964 699153 692833
61155F92833p034p828q154p548o289n103m277l547k789k160j571q43m84j392l419
$$ 692833 685799 677971 669817 662269 655980 650877 646600 643053 640264 638104 636533 635690 635206 633814 630395
61140F30395n096n386m903m779n087n167m879m625m485m190l679k950j663K74
$$ 630395 625299 619913 615010 610231 605144 599977 595098 590473 585988 581798 578119 575169 573506 573780
61126E73780K050K744K627K808L702M739N531O401P613Q906J0070J1213J2265
$$ 573780 575830 578574 581201 584009 587711 592450 597981 604382 611995 620901 630971 642184 654449
61113F54449J2893J3162J3663J4719J5975J6973J7547J7545J6862J6019J5947
$$ 654449 667342 680504 694167 708886 724861 741834 759381 776926 793788 809807 825754
61102H25754J6751J7279J6400J4240J1756R557P560N461L035L17k262m185n516
$$ 825754 842505 859784 876184 890424 902180 911737 919297 924758 927793 928110 925848 921663 916147
61089I16147o829q267r239r381r242r504j0069j0452j0601j0720j0624r944q773
$$ 916147 909318 901051 891812 882431 873189 863685 853616 843164 832563 821843 811219 801275 792502
61076G92502p482o220n048m249l871l313k056n02O67J730L595O245Q517R643J0169
$$ 792502 785020 778800 773752 769503 765632 762319 760263 759761 760428 762158 765753 771998 780515 790158 800327
61061H00327J0996J2235J3433J4358J5163J6078J7338J9062K0924K2265K2803
$$ 800327 811323 823558 836991 851349 866512 882590 899928 918990 939914 962179 984982
61050I84982K2986K3443K4386K5707K7325K9170L1146L3294L5741L8333M0689
$$ 984982 1007968 1031411 1055797 1081504 1108829 1137999 1169145 1202439 1238180 1276513 1317202
61039A317202M2748M4812M6828M8211M8880M9970N2791N7212O1696O4915O6811
$$ 1317202 1359950 1404762 1451590 1499801 1548681 1598651 1651442 1708654 1770350 1835265 1902076
61028A902076O8090O9317P0714P2365P4280P6457P9217Q3333Q9482R7534J06574
$$ 1902076 1970166 2039483 2110197 2182562 2256842 2333299 2412516 2495849 2585331 2682865 2789439
61017B789439J15701J24805J34531J45794J59490J76742J98967K27282K61946
$$ 2789439 2905140 3029945 3164476 3310270 3469760 3646502 3845469 4072751 4334697
61008D334697L02771L50154M05472M70466N46603O34866P35401Q46875R65698
$$ 4334697 4637468 4987622 5393094 5863560 6410163 7045029 7780430 8627305 9593003
60999I593003J083307J179751J218842J157276R71973O87426L74379J13389m7505
$$ 9593003 10676310 11856061 13074903 14232179 15204152 15891578 16265957 16379346 16331841
60990A6331841j05800q6663k4368L7148M0822o4233k87078n79451q61897j070077
$$ 16331841 16226041 16139378 16115010 16152158 16192980 16128747 15841669 15262218 14400321 13330244
60980A3330244j181423j207485j171071j092161r86954q69981p53136o43995n46312
$$ 13330244 12148821 10941336 9770265 8678104 7691150 6821169 6068033 5424038 4877726
60971D877726m61472l89242l28308k77347k35695k02790j77288j57209j40839
$$ 4877726 4416254 4027012 3698704 3421357 3185662 2982872 2805584 2648375 2507536
60962B507536j27201j15740j05857r6910q8489q0539p3157o6399o0333n5191n1287
$$ 2507536 2380335 2264595 2158738 2061828 1973339 1892800 1819643 1753244 1692911 1637720 1586433
60951A586433m8719m7173m6053m4729m2784m0223l7544l5374l3884l2619l1032
$$ 1586433 1537714 1490541 1444488 1399759 1356975 1316752 1279208 1243834 1209950 1177331 1146299
60940A146299k9060k7109k5550k4380k3320k2069k0615j9308j8580j8454j8504
$$ 1146299 1117239 1090130 1064580 1040200 1016880 994811 974196 954888 936308 917854 899350
60929H99350j8373j8166j8120j8078j7581j6446j4994j3739j3012j2803j2773
$$ 899350 880977 862811 844691 826613 809032 792586 777592 763853 750841 738038 725265
60918G25265j2470j1743j0900j0242r620q764p878p437p402p213o653o175o129
$$ 725265 712795 701052 690152 679910 670290 661526 653648 646211 638809 631596 624943 618768 612639
60905F12639o104n542m605l972l914m022l759k986j944j058p51j173k053k976
$$ 612639 606535 600993 596388 592416 588502 584480 580721 577735 575791 574733 573982 572809 570756 567780
60891E67780l694m055l888l289k859l218m263n285n806n921n840n541n003m461
$$ 567780 564086 560031 556143 552854 549995 546777 542514 537229 531423 525502 519662 514121 509118 504657
60877E04657m217m405n000n730n942n069l441k181j989k361k317j564n78Q6J95
$$ 504657 500440 496035 491035 485305 479363 474294 470853 468672 466683 464322 462005 460441 459863 459949 460144
60862D60144j88o18m52L96J093Q47Q2j03M76Q50M03j88J4Q65J471J451J219J167
$$ 460144 459956 459338 458886 459282 460375 461222 461304 461201 461677 462527 462930 462742 462756 463621 465092 466543 467762 468929
60844D68929J146Q60L51p5j99r0n7m44j325k367l035l007k398j694j415j695k206
$$ 468929 470075 470935 471286 471211 471012 470922 470865 470421 469096 466729 463694 460687 458289 456595 455180 453485 451279
60827D51279k584k870l289l688l614k988k294j900j653j356j223j456j740j652
$$ 451279 448695 445825 442536 438848 435234 432246 429952 428052 426399 425043 423820 422364 420624 418972
60813D18972j319j197j369j489j369j156r83q49q00q15n94J12R50J227Q17M00
$$ 418972 417653 416456 415087 413598 412229 411073 410090 409241 408441 407626 407032 407144 408094 409321 410138 410538
60797D10538O66J597K633L205L035K256J425J163J611K376K978L168K956K677
$$ 410538 411204 412801 415434 418639 421674 423930 425355 426518 428129 430505 433483 436651 439607 442284
60783D42284K878L749M702M976M576M104L782L383L058L332M058M325L799L359
$$ 442284 445162 448911 453613 458589 463165 467269 471051 474434 477492 480824 484882 489207 493006 496365
60769D96365L790M694N387O058P138Q059P866O714N717N402N287N008M830M829
$$ 496365 500155 504849 510236 516294 523432 531491 539357 546071 551788 557190 562477 567485 572315 577144
60755E77144M551L829L185L054L167L125L024L100L245L235L083K837K373J671
$$ 577144 581695 585524 588709 591763 594930 598055 601079 604179 607424 610659 613742 616579 618952 620623
60741F20623R24J45r09k216l260l729l980m491n183n715o042o278o315o077n869
$$ 620623 621547 621692 620783 618567 615307 611578 607598 603107 597924 592209 586167 579889 573574 567497 561628
60726E61628n955o042n680n082m956n534o263o540o334n985n760n710n717n510
$$ 561628 555673 549631 543951 538869 533913 528379 522116 515576 509242 503257 497497 491787 486070 480560
60712D80560m875l903k985k534k821l797m938n460n085m413m148m133l690k787
$$ 480560 475685 471782 468797 466263 463442 459645 454707 449247 444162 439749 435601 431468 427778 424991
60698D24991k205k425k999l312l420l708m158m414m321l983l444k803k402k514
$$ 424991 422786 420361 417362 414050 410630 406922 402764 398350 394029 390046 386602 383799 381397 378883
60684C78883k865k926k638k375k203j682o20M15O71Q0p58j283j406j326j194j015
$$ 378883 376018 373092 370454 368079 365876 364194 363574 363989 364660 364740 363982 362699 361293 359967 358773 357758
60668C57758o67q6M86N17l23j622k476k367j659j067q22n66K2P90J371J684J979
$$ 357758 357091 357005 357491 358008 357685 356063 353587 351220 349561 348494 347672 347106 347128 347918 349289 350973 352952
60651C52952K407K744K659K193J821J946K402K597K065R09l18j020r71m76j59
$$ 352952 355359 358103 360762 362955 364776 366722 369124 371721 373786 374695 374377 373357 372386 371910 371751
60636C71751l53p58q29n21l49o42j073j130p34j83K83N24L44k91r93j289j158
$$ 371751 371398 370640 369811 369290 368941 368299 367226 366096 365362 365179 365462 365986 366330 366039 365046 363757 362599
60619C62599r30p40n36m06n02o18m55k64o35j476j899j379m55J06K71L71L45k
$$ 362599 361669 360929 360393 359987 359485 358867 358412 358148 357513 356037 354138 352759 352304 352410 352681 353052 353397 353395
60601C53395l47j67M64R37R02M64j80p83r14l62L84O55N26N67P97N94j91q06n83
$$ 353395 353048 352881 353345 354282 355184 355648 355468 354685 353771 353409 353793 354448 354974 355541 356338 356932 356741 355935 355352
60582C55352K78J132J608J610J203Q52J180K121K844K924L030L889N126N858O102
$$ 355352 355630 356762 358370 359980 361183 362035 363215 365336 368180 371104 374134 378023 383149 389007 395109
60567C95109O660P833Q956R331Q923Q036O892N695M614L495J963Jj868l106l564
$$ 395109 401769 409602 418558 427889 436812 444848 451740 457435 462049 465544 467507 467508 465640 462534 458970
60552D58970l382k829k292j935j324J72K395M288N059N081N318O174P282Q188
$$ 458970 455588 452759 450467 448532 447208 447380 449775 454063 459122 464203 469521 475695 482977 491165
60538D91165Q811R260R566R565Q885P211M734K198K64j066k194l242l883l806
$$ 491165 499976 509236 518802 528367 537252 544463 549197 551395 551659 550593 548399 545157 541274 537468
60524E37468l067k056j276j046j241j349j010m28m9O9L09R88K018L022L606L664
$$ 537468 534401 532345 531069 530023 528782 527433 526423 525995 525946 526015 526324 527312 529330 532352 535958 539622
60508E39622L591M042N224O585P576Q465R923J2077J4490J6983J9664K2144K3643
$$ 539622 543213 547255 552479 559064 566640 575105 585028 597105 611595 628578 648242 670386 694029
60495F94029K4194K4902K6412K7844K7889K6348K3798K0227J5072Q392J002o571
$$ 694029 718223 743125 769537 797381 825270 851618 875416 895643 910715 919107 920109 913538
60483I13538j4214k1232k6300k8996l0541l2274l3949l4264l2692l0052k7378
$$ 913538 899324 878092 851792 822796 792255 759981 726032 691768 659076 629024 601646
60472F01646k4994k2742k0521j8354j6209j3977j1623r339p624o948p130p217
$$ 601646 576652 553910 533389 515035 498826 484849 473226 463887 456263 449315 442185 434968
60460D34968o344m701l289k750k799k880k938l238l686l775l265k604k387k571
$$ 434968 428624 423923 420634 417884 415085 412205 409267 406029 402343 398568 395303 392699 390312 387741
60446C87741k540k038j620j830k313k268j694j453j920k337j930j055n82n88m76
$$ 387741 385201 383163 381543 379713 377400 375132 373438 371985 370065 367728 365798 364743 364161 363573 363097
60431C63097o1K81M13N26M20l63j490j845j090l25n69j241j036J31J055R55L48
$$ 363097 363036 363317 363730 364256 364676 364313 362823 360978 359888 359563 358994 357753 356717 356848 357903 358858 359206
60414C59206Q9L44Q34J419K000K241J912J275P44L30k13p57p48L7R98J258O32
$$ 359206 359295 359639 360473 361892 363892 366133 368045 369320 370064 370394 370181 369424 368676 368713 369711 370969 371601
60397C71601j66k85L92J251J649J464J041Q05R99J587K254K633K642K565K664
$$ 371601 371435 371150 371542 372793 374442 375906 376947 377752 378751 380338 382592 385225 387867 390432 393096
60382C93096K806K644K093J448J077J161J659K325K760K691K289K018K053K080
$$ 393096 395902 398546 400639 402087 403164 404325 405984 408309 411069 413760 416049 418067 420120 422200
60368D22200J786J342J165J318J468J352R99M76k18r47j332j174p26l99k79j52
$$ 422200 423986 425328 426493 427811 429279 430631 431630 432106 431888 430941 429609 428435 427709 427310 427031 426879
60352D26879J34N69J153J835K333K401K296K577L344M070M310M161L780K919J463
$$ 426879 427013 427582 428735 430570 432903 435304 437600 440177 443521 447591 451901 456062 459842 462761 464224
60337D64224M0n82n18n88j116j609j668j568j664j809j800j850k112k192j640
$$ 464224 464264 463682 463164 462576 461460 459851 458183 456615 454951 453142 451342 449492 447380 445188 443548
60322D43548p64l27n68j034j301j299r13Q6J482K518K757K716L263M585O122P388
$$ 443548 442784 442457 441889 440855 439554 438255 437342 437428 438910 441428 444185 446901 450164 454749 460871 468259
60306D68259Q417R444J0562J1851J3448J5048J5675J4447J1650Q507N729K781
$$ 468259 476676 486120 496682 508533 521981 537029 552704 567151 578801 587308 593037 595818
60294E95818j030n220q579j0750j2438j3924j4326j2887j0384q394p498o954o067
$$ 595818 594788 589568 580989 570239 557801 543877 529551 516664 506280 497886 490388 483434 477367
60281D77367n043m368m085m014m142m365m286l743l243l323l627l222j901o45
$$ 477367 472324 467956 463871 459857 455715 451350 447064 443321 440078 436755 433128 429906 428005 427360
60267D27360n16j403k232k282j865j645j697j543r48k77L1m3l16q07j572k255
$$ 427360 426844 425441 423209 420927 419062 417417 415720 414177 413229 412952 412983 412940 412624 411817 410245 407990
60251D07990k316j714j010o30m16j18L9l55j144j670j530r64m18l3L37Q47J562
$$ 407990 405674 403960 402950 402320 401904 401786 401825 401470 400326 398656 397126 396162 395744 395711 396048 396895 398457
60234C98457K404L050L186K950K851L029K985K432J995K403L200L132J900O35
$$ 398457 400861 403911 407097 410047 412898 415927 418912 421344 423339 425742 428942 432074 433974 434609
60220D34609L05M86L94L20J047K301K952K648K179K079J954J563J577K523L811
$$ 434609 434914 435400 435794 436114 437161 439462 442414 445062 447241 449320 451274 452837 454414 456937 460748
60205D60748M529M641M646M571M150L678L702M007L822L050K417K304K266K029
$$ 460748 465277 469918 474564 479135 483285 486963 490665 494672 498494 501544 503961 506265 508531 510560
60191E10560K086K733L244K738J441L85k0l31r78j513j316n98k17o22j385j810
$$ 510560 512646 515379 518623 521361 522802 523187 523167 522836 521858 520345 519029 518431 518214 517592 516207 514397
60175E14397j759j637j855k486l327l960l847k751j165oK90O5k48p08j386j788
$$ 514397 512638 511001 509146 506660 503333 499373 495526 492775 491610 491604 491894 491959 491711 491003 489617 487829
60159D87829j322k29N58N09K2k51j43J57N94J254K045K581K492J836J203J210
$$ 487829 486507 486278 486836 487345 487367 487116 486973 487130 487724 488978 491023 493604 496096 497932 499135 500345
60143E00345J847K465K595K479K565K804K850K737K846L275L806M385N063N471
$$ 500345 502192 504657 507252 509731 512296 515100 517950 520687 523533 526808 530614 534999 540062 545533
60129E45533N028L765K491J867J775J695J257K95j091k311k656k164j683j768
$$ 545533 550561 554326 556817 558684 560459 562154 563411 563706 562615 560304 557648 555484 553801 552033
60115E52033j980j621p43mJ36k58p57p75O3J365K115J669L99q56j628j884j782
$$ 552033 550053 548432 547689 547685 547821 547563 546806 546031 546094 547459 549574 551243 551642 550786 549158 547274 545492
60098E45492j673j966k563k832k496k025j809j488o93J54M76N76J102J906K300
$$ 545492 543819 541853 539290 536458 533962 531937 530128 528640 527947 528101 528577 529153 530255 532161 534461
60083E34461K231K275K529K439J854J336J282J440J524J601J643J327N51l93j316
$$ 534461 536692 538967 541496 543935 545789 547125 548407 549847 551371 552972 554615 555942 556493 556100 554784
60068E54784k289l184l698m047m883o279p377p430o632n593m644m043m179m985
$$ 554784 552495 549311 545613 541566 536683 530404 523027 515597 508965 503372 498728 494685 490506 485521
60054D85521n621n360m422l524k934k543k361k348k099j364o03l75l86J45J282
$$ 485521 479900 474540 470118 466594 463660 461117 458756 456408 454309 452945 452342 451967 451581 451726 453008
60039D53008K289K726K921L236L470L251K613J883J361J239J507J833J735J086
$$ 453008 455297 458023 460944 464180 467650 470901 473514 475397 476758 477997 479504 481337 483072 484158
60025D84158K02o19j396k248l144l945m477m562m214l832l876m304m631m571m316
$$ 484158 484360 483741 482345 480097 476953 473008 468531 463969 459755 455923 452047 447743 443112 438541 434225
60010D34225m073l691k941j945j040m58k42l21m93m86k18J51M70P87J205J732
$$ 434225 430152 426461 423520 421575 420535 420077 419835 419514 419021 418535 418317 418468 418938 419725 420930 422662
59994D22662K319K839L049K798K340K110K172K222K197K396K832L026K733K428
$$ 422662 424981 427820 430869 433667 436007 438117 440289 442511 444708 447104 449936 452962 455695 458123
59980D58123K572K864K697K053J317N97j24m76j99N1o57j963k313j023O34J034
$$ 458123 460695 463559 466256 468309 469626 470223 470099 469623 469424 469475 468818 466855 464542 463519 464153 465187
59964D65187J97m94j78P38J467J831K207K909L737M068L520K542J983J949J625
$$ 465187 465384 464890 464712 465450 466917 468748 470955 473864 477601 481669 485189 487731 489714 491663 493288
59949D93288N57n55r07q75j382k420l113l064k697k287j642r02o75j059j390j284
$$ 493288 493845 493290 492383 491508 490126 487706 484593 481529 478832 476545 474903 474001 473326 472267 470877 469593
59933D69593j171j315j256p97p45j739k968l046j886p49n20q07q27l92K08P32
$$ 469593 468422 467107 465851 465054 464309 462570 459602 456556 454670 453921 453401 452594 451767 451375 451583 452315
59917D52315J106J384J784K462L202L607L675L791M138M443M494M534M887N354
$$ 452315 453421 454805 456589 459051 462253 465860 469535 473326 477464 481907 486401 490935 495822 501176
59903E01176N294M372L123K522K827L079K203N44l50K73J303J319N01J48O37J013
$$ 501176 506470 510842 513965 516487 519314 522393 524596 525140 524790 525063 526366 527685 528186 528334 528971 529984
59887E29984N88j24l90k58j03J50P08J281J396J145J102J622K482L127L068K249
$$ 529984 530572 530448 530058 529800 529697 529847 530555 531836 533232 534377 535479 537101 539583 542710 545778 548027
59871E48027J212P51J107J713J812J187K04o22r66q81q06j095j492j413q40m47
$$ 548027 549239 549990 551097 552810 554622 555809 556013 555391 554425 553544 552738 551643 550151 548738 547898 547451
59855E47451o31q70m20P25J966K822L181L093K719K258J642N82p72j598j325m31
$$ 547451 546820 545950 545530 546255 548221 551043 554224 557317 560036 562294 563936 564518 563746 562148 560823 560392
59839E60392J22p5r22k413m405o052o450n880n528n867o148n745n135m965m935
$$ 560392 560514 560439 559517 557104 552699 546647 540197 534317 528789 522922 516774 511029 505894 500929 495994
59824D95994m346l311k653k727l018k907k356j782j620k050k813l320l181k704
$$ 495994 491648 488337 485684 482957 479939 477032 474676 472894 471274 469224 466411 463091 459910 457206
59810D57206k450k390j917q45J08J14p59j692k074j909j437q72n41p80j426j771
$$ 457206 454756 452366 450449 449604 449712 449826 449067 447375 445301 443392 441955 441083 440542 439762 438336 436565
59794D36565j405p80o26r52j093o57O4O35R45R73O21J5l73k81m2m7j11J20L87
$$ 436565 435160 434380 433754 432802 431709 431052 431116 431751 432696 433669 434290 434305 433932 433651 433609 433562 433451 433571 433958
59775D33958O4p56j108l40J000J870J993J954K157K333K104J648J419J550J862
$$ 433958 434022 433266 432158 431818 432818 434688 436681 438635 440792 443125 445229 446877 448296 449846 451708
59760D51708K335L097L947M392M322M249M519M735M441M080M536N792O741O608
$$ 451708 454043 457140 461087 465479 469801 474050 478569 483304 487745 491825 496361 502153 508894 515502
59746E15502N895N552N761N990N906N648N385N113M830M501L898K853J628P61
$$ 515502 521397 526949 532710 538700 544606 550254 555639 560752 565582 570083 573981 576834 578462 579223
59732E79223N10O87R57J004N62l75j432k174k533k685k684k480k158j828j449
$$ 579223 579733 580420 581377 582381 582943 582568 581136 578962 576429 573744 571060 568580 566422 564594 563145
59717E63145j039q86j104j249r06m92p28j466j748j212n88n41p39n48j7M17P69
$$ 563145 562106 561220 560116 558867 557961 557469 556741 555275 553527 552315 551727 551186 550447 549899 549882 550299 551068
59700E51068J316J860J825J123L52O1J75K81K75M88J160J900J881P52q23j936
$$ 551068 552384 554244 556069 557192 557544 557605 557780 558061 558336 558824 559984 561884 563765 564517 563694 561758
59684E61758k577l419m516m953m180k900k093j733j220o16n42j071j604j886k268
$$ 561758 559181 555762 551246 546293 542113 539213 537120 535387 534167 533551 533009 531938 530334 528448 526180
59669E26180k871l222l051k801k991l553m077m277l928k912j655j053j434j957
$$ 526180 523309 520087 517036 514235 511244 507691 503614 499337 495409 492497 490842 489789 488355 486398
59655D86398j576l74O49R27Q92J166J740K124J978J372O54J30k25p66j674k543
$$ 486398 484822 484448 485097 486024 486916 488082 489822 491946 493924 495296 495950 496080 495855 495089 493415 490872
59639D90872k804k520k357k658k989k893k635k726k981k665j660p81o95r68p36
$$ 490872 488068 485548 483191 480533 477544 474651 472016 469290 466309 463644 461984 461203 460508 459540 458804
59624D58804m6J46o57j776k264k024j589j197p20l13m04r50j353j350j338j491
$$ 458804 458758 458904 458247 456471 454207 452183 450594 449397 448677 448364 447960 447010 445657 444307 442969 441478
59608D41478j262l75K55m18j857k356j322j27j65r61r81J53J219J037j89j330
$$ 441478 440216 439841 440096 439678 437821 435465 434143 434016 433851 432890 431909 432062 433281 434318 434129 432799
59592D32799j508o94N06J362J539J247Q30L26l10q23r10q40j287k364l291l265
$$ 432799 431291 430597 431103 432465 434004 435251 436081 436407 436097 435274 434364 433524 432237 429873 426582 423317
59576D23317k323j124k52J0m15j326k149k349j948j437j247j400j545j204j53
$$ 423317 420994 419870 419618 419628 419213 417887 415738 413389 411441 410004 408757 407357 405812 404608 404455
59561D04455J191J964J668O99j29l85j81K45P41J234J765K488L293L696L407K886
$$ 404455 405646 407610 409278 409977 409848 409463 409282 409527 410268 411502 413267 415755 419048 422744 426151 429037
59545D29037K862L419M035M426M809N346N933O669P894R531J0936J1678J1869
$$ 429037 431899 435318 439353 443779 448588 453934 459867 466536 474430 483961 494897 506575 518444
59532E18444J1382R470N867J786j045k206k652l039k939j939o22K14O67J398K415
$$ 518444 529826 539296 545163 546949 545904 543698 541046 538007 535068 533129 532507 532721 533388 534786 537201
59517E37201K955K599J773J033L42n89j669k528l034l342l589l901m535n629o791
$$ 537201 540156 542755 544528 545561 545903 545314 543645 541117 538083 534741 531152 527251 522716 517087 510296
59502E10296p433p505p422p167o101m064k067j292j634j956j631j085p97n35Q1
$$ 510296 502863 495358 487936 480769 474668 470604 468537 467245 465611 463655 462024 460939 460142 459607 459688
59487D59688Q92J510J917K264K392K126J832K161L111L871L811L325L421M565
$$ 459688 460580 462090 464007 466271 468663 470789 472621 474782 477893 481764 485575 488900 492321 496886
59473D96886O120O964O626N620M684L875K670R13p18j416j100l26M18J054J681
$$ 496886 503006 509970 516596 522216 526900 530775 533445 534358 533640 532224 531124 530798 531216 532270 533951
59458E33951K391L320M478N520N977N912O011O873Q332R667J0357J0407J0135
$$ 533951 536342 539662 544140 549660 555637 561549 567560 574433 582765 592432 602789 613196 623331
59445F23331R803R464Q896P690N637L034M64j805l997o223p976q594q152p523
$$ 623331 633134 642598 651494 659184 664821 667855 668319 666514 662517 656294 648318 639724 631572 624049
59431F24049p401p654p792p702p543p141o079m387k682j442m38Q61K582M346N786
$$ 624049 616648 608994 601202 593500 585957 578816 572737 568350 565668 564226 563788 564649 567231 571577 577363
59416E77363O883P911R184J0852J2846J4987J7034J8523J8609J6409J1745N444
$$ 577363 584246 592157 601341 612193 625039 640026 657060 675583 694192 710601 722346 727790
59404G27790j097o560j0054j1264j0539q586n856k377J509M512M883J752m023
$$ 727790 726693 720133 710079 698815 688276 679690 673834 671457 672966 677478 682361 684113 680090
59391F80090j0247j4699j6455j6355j6043j6261j6215j4729j1840q790o611n280
$$ 680090 669843 655144 638689 622334 606291 590030 573815 559086 547246 538456 531845 526565
59379E26565m326l671l430l300k742j780j083j085j364j216o19j38M2M26J300
$$ 526565 522239 518568 515138 511838 509096 507316 506233 505148 503784 502568 501949 501811 501853 502279 503579
59364E03579K062J975J264Q17R48J224J501K290L718M938N219N014N253O034O801
$$ 503579 505641 507616 508880 509697 510645 511869 513370 515660 519378 524316 529535 534549 539802 545836 552637
59349E52637P503Q619J0074J1032J1113J1051J1683J2737J3158J2381J0919R758
$$ 552637 560140 568759 578833 589865 600978 612029 623712 636449 649607 661988 672907 682665
59337F82665R353R306Q838P608N975M380K732P30j409l033l896m453n213o178
$$ 682665 692018 701324 710162 717770 723745 728125 730857 731587 730178 727145 723249 718796 713583 707405
59323G07405p062p700q089q262q255p963p092n639m311l955m394m497l594k221
$$ 707405 700343 692643 684554 676292 668037 660074 652982 647343 643032 639077 634683 630186 626592 624371
59309F24371j142l55M83J255J740K325L607N419P025Q037Q429P724N134Q28l615
$$ 624371 623229 622874 623357 624612 626352 628677 632284 637703 644728 652765 661194 668918 674052 674880 671265
59294F71265o508p454p302p087p290p748p907p306o056m716l608k539j309j65
$$ 671265 664757 657303 650001 642914 635624 627876 619969 612663 606607 601891 598283 595744 594435 594270
59280E94270N51R66J532K435L483M435N230N877O445P137Q116R089R444Q930Q091
$$ 594270 594821 595787 597319 599754 603237 607672 612902 618779 625224 632361 640477 649566 659010 667940 676031
59265F76031P693P750P460O219M440L061K361J635J22k133m503o475p818q374
$$ 676031 683724 691474 698934 705153 709593 712654 715015 716650 716772 714639 710136 703661 695843 687469
59251F87469q177p678p382p219o750n949n325n086m785m054l250k893k771k211
$$ 687469 679292 671614 664232 657013 650263 644314 638989 633903 629118 625064 621814 618921 616150 613939
59237F13939j092q4J54l68j113j491j162k84M59M15l46j201j871k694l856m807
$$ 613939 612847 612763 612917 612549 611436 609945 608783 608499 608958 609373 609027 607826 605955 603261 599405 594598
59221E94598m931m427m039m070m158m077m140m637n195n115m197l013k345k491
$$ 594598 589667 585240 581201 577131 572973 568896 564756 560119 554924 549809 545612 542599 540254 537763
59207E37763l054l332k970k226j639j453j513j613j652j430o97L80J072Q32O3
$$ 537763 534709 531377 528407 526181 524542 523089 521576 519963 518311 516881 516184 516564 517636 518468 518531
59192E18531j93O42K174L592M390M487M058L501L336L799M566N066N056M704M217
$$ 518531 518338 518980 521154 524746 529136 533623 537681 541182 544518 548317 552883 557949 563005 567709 571926
59177E71926L651L108K886L212L878M319M160L593L138L026L014K894K956L661
$$ 571926 575577 578685 581571 584783 588661 592980 597140 600733 603871 606897 609911 612805 615761 619422
59163F19422M924O090O641O623O238N376L850J964M07l46l83j66k72j125k644
$$ 619422 624346 630436 637077 643700 649938 655314 659164 661128 661535 661189 660806 660640 660368 659243 656599
59148F56599m130m920n117n386n947o222n716m781m163m017l828l218k393j810
$$ 656599 652469 647549 642432 637046 631099 624877 619161 614380 610217 606200 602372 599154 596761 594951
59134E94951j642j662j480q74r4K92N6k33K27J467K668L166L183L417M206N416
$$ 594951 593309 591647 590167 589293 589199 589491 589547 589314 589541 591008 593676 596842 600025 603442 607648 613064
59118F13064O789Q021Q658Q417P640P011O761O482N882N327N272N468N156M106
$$ 613064 619853 627874 636532 644949 652589 659600 666361 672843 678725 684052 689324 694792 699948 704054
59104G04054L004K587K683K466J593N83L3j83n70j156j471j335j194j462j910
$$ 704054 707058 709645 712328 714794 716387 716970 717003 716820 716250 715094 713623 712288 711094 709632 707722
59089G07722j962j417o42j76l83j247k358l153l493l820m530n436o092o480o935
$$ 707722 705760 704343 703701 703525 703142 701895 699537 696384 692891 689071 684541 679105 673013 666533 659598
59074F59598p533q046q381q564q277p130n484m378m349m877n286n538n696n268
$$ 659598 652065 644019 635638 627074 618797 611667 606183 601805 597456 592579 587293 581755 576059 570791
59060E70791l909k361j794k278k714k332j563j207j412j798k098k267k273k126
$$ 570791 566882 564521 562727 560449 557735 555403 553840 552633 551221 549423 547325 545058 542785 540659
59046E40659j917j611j024k45K42J45j34N3P51J371J447J175J153J765K904M083
$$ 540659 538742 537131 536107 535862 536104 536249 536115 536168 536919 538290 539737 540912 542065 543830 546734 550817
59030E50817M831N052N091N337N796O119O177O443P578R549J1374J2053J1686
$$ 550817 555648 560700 565791 571128 576924 583043 589220 595663 603241 612790 624164 636217 647903
59017F47903J1314J1574J1905J1422J0173Q986Q189P131N086K195p40l014m379
$$ 647903 659217 670791 682696 694118 704291 713277 721466 728597 733683 735878 735138 732124 727745
59004G27745m899m819m404l757k874j943j323j113r84n77J04P93J171R23l1j181
$$ 727745 722846 718027 713623 709866 706992 705049 703726 702613 701629 701052 701156 701949 703120 704043 704012 702831
58988G02831j734j598j611k456l712m520m824n275o075o599o323n490m650l934
$$ 702831 701097 699499 697888 695432 691720 687200 682376 677101 671026 664427 658104 652614 647964 644030
58974F44030l085j885m03J060K075K418K383K576L318M366N255N698N678N367
$$ 644030 640945 639060 638657 639717 641792 644210 646593 649169 652487 656853 662108 667806 673484 678851
58960F78851M999M629L973K782J342K55l06q24j747k903l873m610n439o512p580
$$ 678851 683850 688479 692452 695234 696576 696831 696525 695701 693954 691051 687178 682568 677129 670617 663037
58945F63037q202q154p625p102o881o692o050n011m158l781l488k909k368k347
$$ 663037 654835 646681 639056 631954 625073 618381 612331 607320 603162 599381 595893 592984 590616 588269
58931E88269k626k496j767r76n36k16L34R22J002L58o09j225j098m26J56J88j64
$$ 588269 585643 583147 581380 580404 579868 579652 579986 580908 581910 582268 581659 580434 579336 578910 579066 579254 579090
58914E79090l57j47J73K55J03n6l0L81J353K709L840M338M547N072N822O041N445
$$ 579090 578733 578586 578759 579014 579117 579061 579031 579412 580765 583474 587314 591652 596199 601271 607093 613134 618579
58897F18579M794M977N886O685O940O896O707O094N100M581N426P442R516J0777
$$ 618579 623373 628350 634236 640921 647861 654757 661464 667558 672658 677239 682665 690107 699623 710400
58883G10400J1237J1309J1173J0711R768Q304O534M902L613K220N7k755n203o508
$$ 710400 721637 732946 744119 754830 764598 772902 779436 784338 787951 790171 790228 787473 782270 775762
58869G75762p031p683q834j0125j1069j1368j0866r719q514p783p392o931o504
$$ 775762 768731 761048 752214 742089 731020 719652 708786 699067 690553 682770 675378 668447 661943
58856F61943o634p303p729p334o378n445m765m333m172m017l226j610m1L67l73
$$ 661943 655309 648006 640277 632943 626565 621120 616355 612022 607850 603833 600607 598997 598956 599323 598950
58841E98950j160j172p37p62j776l583n459o524o343n418m738m690m705m236l632
$$ 598950 597790 596618 595881 595119 593343 589760 584301 577777 571434 566016 561278 556588 551883 547647 544015
58826E44015l563l832l491k221r50o94j210j379p87k43m96j139j237o95k61k31
$$ 544015 540452 536620 533129 530908 529958 529264 528054 526675 525888 525645 525149 524010 522773 522078 521817 521586
58810E21586LQ94J883K100J484O63Q2k14j37L58Q47P55J65k79l14l29n30n59k42
$$ 521586 521589 522483 524366 526466 527950 528613 528695 528481 528344 528702 529549 530304 530469 530190 529876 529547 529017 528458 528216
58791E28216o7m44r79j019n39L2M95Q49R00N75L90R41J931K416K075J605J684
$$ 528216 528149 527705 526726 525707 525168 525200 525695 526544 527444 528019 528409 529350 531281 533697 535772 537377 539061
58774E39061K155K455K339J869J097J74n21p61q09j098j676k173k212j630n03
$$ 539061 541216 543671 546010 547879 548976 549150 548629 547868 547059 545961 544285 542112 539900 538270 537767
58759E37767P72J563J449O59q7j95L74J175J720J908K139K828L829M432M114L083
$$ 537767 538539 540102 541551 542210 542123 541928 542302 543477 545197 547105 549244 552072 555901 560333 564447 567530
58743E67530J997J329J170J459K032K579K856K979L261L731M078M133M087M112
$$ 567530 569527 570856 572026 573485 575517 578096 580952 583931 587192 590923 595001 599134 603221 607333
58729F07333L941L173J918Q52N80J018J575J722J323M66o64j752k365k301j795
$$ 607333 611274 614447 616365 617217 617797 618815 620390 622112 623435 623901 623237 621485 619120 616819 615024
58714F15024j221o66j2O65J035R48O18L68K65J95K1l44r58j775k682l702m977
$$ 615024 613803 613137 613125 613790 614825 615773 616391 616759 617024 617219 617240 616896 615938 614163 611481 607779 602802
58697F02802o434p606p998p620p001o700o877p309p631p554o933n773m318l073
$$ 602802 596368 588762 580764 573144 566143 559443 552566 545257 537626 530072 523139 517366 513048 509975
58683E09975k561k806l175k949k088j231r36j164j557j854j919j624r73j99M80
$$ 509975 507414 504608 501433 498484 496396 495165 494229 493065 491508 489654 487735 486111 485138 484939 485419
58668D85419J099J801K550L174L564L672L473L127L029L424L981M000L017J215
$$ 485419 486518 488319 490869 494043 497607 501279 504752 507879 510908 514332 518313 522313 525330 526545
58654E26545p51k148k536k025j182o64p41j192j516j339p77l87o07j239j765k075
$$ 526545 525794 523646 521110 519085 517903 517239 516498 515306 513790 512451 511674 511287 510680 509441 507676 505601
58638E05601k449k810k555j460j97N46R40J512K168K410K323K486K959L112K621
$$ 505601 503152 500342 497787 496327 496130 496676 497616 499128 501296 503706 506029 508515 511474 514586 517207
58623E17207J890J370J030Q11R35J411J815J957K254K993L695L785L533L644M185
$$ 517207 519097 520467 521497 522308 523243 524654 526469 528426 530680 533673 537368 541153 544686 548330 552515
58608E52515M549M417M027L520K676J505N29J67K85N92J102J745K029J523N76
$$ 552515 557064 561481 565508 569028 571704 573209 573738 573905 574190 574782 575884 577629 579658 581181 581757
58593E81757J6J63N86Q46J028J438K174L145M192M972N095M686M502N079N971
$$ 581757 581773 581936 582522 583368 584396 585834 588008 591153 595345 600317 605412 610098 614600 619679 625650
58578F25650O310N984N739O103O695O784O190N359M928N302O359P399P672P209
$$ 625650 631960 637944 643683 649786 656481 663265 669455 674814 679742 685044 691403 698802 706474 713683
58564G13683O810P075P800Q569R428J0553J1569J1886J1558J1254J1329J1360
$$ 713683 720493 727568 735368 743937 753365 763918 775487 787373 798931 810185 821514 832874
58552H32874J0718R221P151M862K603N61j053k089k746l626n080o474o719n802
$$ 832874 843592 852813 859964 864826 867429 867990 866937 864848 862102 858476 853396 846922 840203 834401
58538H34401n167n970p642q907r687j0827j2246j2716j1740j0375r664r286q455
$$ 834401 829234 823264 815622 806715 797028 786201 773955 761239 749499 739124 729460 720174 711719
58525G11719p289o426n850n075m094l260k442j164L66J203Q39j13n95j52P99J431
$$ 711719 704430 698004 692154 687079 682985 679725 677283 676119 676485 677688 678527 678414 677819 677667 678466 679897
58509F79897J184L22j96L31J475K142J874J286J081J118P23l30j543k303k378
$$ 679897 681081 681403 681207 681538 683013 685155 687029 688315 689396 690514 691237 690907 689364 687061 684683
58494F84683j870r68P8R42J454J789K218K652K715K392K328L135M527N533N561
$$ 684683 682813 681845 681923 682865 684319 686108 688326 690978 693693 696085 698413 701548 706075 711608 717169
58479G17169M944M449M550N343O695Q179R119R019P979O585N405M674M154L276
$$ 717169 722113 726562 731112 736455 743150 751329 760448 769467 777446 784031 789436 794110 798264 801540
58465H01540J636n42k565l948m701m930m531l494k172r26K43J489K715L639M124
$$ 801540 803176 802634 800069 796121 791420 786490 781959 778465 776293 775367 775610 777099 779814 783453 787577
58450G87577M231M073L783L428K862J940R56M38L02k96j849l620m382l801k579
$$ 787577 791808 795881 799664 803092 805954 807894 808850 809288 809590 809294 807445 803825 799443 795642 793063
58435G93063j499q69o86p17m51M94J871L141M176N129N811N880N709O234P645
$$ 793063 791564 790695 790009 789292 788841 789335 791206 794347 798523 803652 809463 815343 821052 827286 834931
58420H34931Q937R113Q270P094N864M543L375K622J929P27p54j577j435j227j855
$$ 834931 843868 852981 861251 868345 874209 878752 882127 884749 886678 887405 886651 885074 883639 882412 880557
58405H80557k962l411k791j840j336j228j057p17l07L44J449K656L289L255L214
$$ 880557 877595 874184 871393 869553 868217 866989 865932 865215 864908 865252 866701 869357 872646 875901 879115
58390H79115L688M448M952M975M616M026L431L112L076K978K634K265K093K030
$$ 879115 882803 887251 892203 897178 901794 905820 909251 912363 915439 918417 921051 923316 925409 927439
58376I27439K085K655L933N357O114O034N577N186N078N441O327P423Q363R112
$$ 927439 929524 932179 936112 941469 947583 953617 959194 964380 969458 974899 981226 988649 997012 1006124
58362A006124R779J0311J0790J1653J3064J4393J4918J4793J4570J4159J3149
$$ 1006124 1015903 1026214 1037004 1048657 1061721 1076114 1091032 1105825 1120395 1134554 1147703
58351A147703J1928J1386J1463J1097R843Q574Q160Q450Q968R757J0849J1730
$$ 1147703 1159631 1171017 1182480 1193577 1203420 1211994 1220154 1228604 1237572 1247329 1258178 1269908
58339A269908J2060J2307J3033J4030J4853J5643J6642J7486J7737J7765J8228
$$ 1269908 1281968 1294275 1307308 1321338 1336191 1351834 1368476 1385962 1403699 1421464 1439692
58328A439692J8945J9196J8934J8789J8898J8707J8049J7548J7627J7838J7641
$$ 1439692 1458637 1477833 1496767 1515556 1534454 1553161 1571210 1588758 1606385 1624223 1641864
58317A641864J7230J7141J7426J7737J7961J8319J8921J9655K0486K1588K3080
$$ 1641864 1659094 1676235 1693661 1711398 1729359 1747678 1766599 1786254 1806740 1828328 1851408
58306A851408K4779K6379K7764K9084L0439L1654L2577L3462L4779L6502L8053
$$ 1851408 1876187 1902566 1930330 1959414 1989853 2021507 2054084 2087546 2122325 2158827 2196880
58295B196880L9128M0216M1860M3700M4858M5163M5385M6219M7598M9189N0985
$$ 2196880 2236008 2276224 2318084 2361784 2406642 2451805 2497190 2543409 2591007 2640196 2691181
58284B691181N3028N5075N7013N9310O2477O6178O9491P2106P4810P8544Q3391
$$ 2691181 2744209 2799284 2856297 2915607 2978084 3044262 3113753 3185859 3260669 3339213 3422604
58273C422604Q8766R4306J00183J06634J13597J20906J28512J36339J44170J51885
$$ 3422604 3511370 3605676 3705859 3812493 3926090 4046996 4175508 4311847 4456017 4607902
58263D607902J59694J67886J76381J84779J92887K01050K09941K20204K32286
$$ 4607902 4767596 4935482 5111863 5296642 5489529 5690579 5900520 6120724 6353010
58254F353010K46198K61153K75540K87641K96553L02359L05552L06740L07153
$$ 6353010 6599208 6860361 7135901 7423542 7720095 8022454 8328006 8634746 8941899
58245H941899L08985L14492L24482L38042L53928L71778L91608M12733M33980
$$ 8941899 9250884 9565376 9889858 10227900 10581828 10953606 11345214 11757947 12191927
58236A2191927M54830M75600M96584N17722N39178N61238N83445O04716O24796
$$ 12191927 12646757 13122357 13618941 14136663 14675841 15237079 15820524 16425240 17050036
58227A7050036O44637O64823O84816P04759P26979P54372P87902Q26948Q71430
$$ 17050036 17694673 18359496 19044312 19749071 20476050 21230422 22018324 22845272 23716702
58218B3716702R21910R77978J038371J102937J173053J250027J334710J428883
$$ 23716702 24638612 25616590 26654961 27757898 28930951 30180978 31515688 32944571
58210C2944571J535514J657220J796053J955151K138887K351015K594940K877004
$$ 32944571 34480085 36137305 37933358 39888509 42027396 44378411 46973351 49850355
58202D9850355L207803L599423M063468M612905N263111O028443O919505P946121
$$ 49850355 53058158 56657581 60721049 65333954 70597065 76625508 83545013 91491134
58194I1491134R121117J0456796J1954902J3596451J5332496J7071693J8660300
$$ 91491134 100612251 111069047 123023949 136620400 151952896 169024589 187684889
58187A87684889J9850889K0268496J9421145J6825777J2258000N995008j150791
$$ 187684889 207535778 227804274 247225419 264051196 276309196 282304204 281153413
58180B81153413q091520j3871435j7962316k0299560k1122635k0785048j9639092
$$ 281153413 273061893 259190458 241228142 220928582 199805947 179020899 159381807
58173A59381807j7994396j6106331j4169609j2316620j0623895r125090p826124
$$ 159381807 141387411 125281080 111111471 98794851 88170956 79045866 71219742
58166G1219742o717627n782054m997234m339837l788693l325776k935293k603613
$$ 71219742 64502115 58720061 53722827 49382990 45594297 42268521 39333228 36729615
58158C6729615k320329k078070j870791j692802j539394j407062j292519j192140
$$ 36729615 34409286 32331216 30460425 28767623 27228229 25821167 24528648 23336508
58150B3336508j102788j022557r50203q84385q23880p68083p16809o69853o27081
$$ 23336508 22233720 21211163 20260960 19376575 18552695 17784612 17067803 16397950 15770869
58141A5770869n88679n54955n25856n00781m78592m57883m37626m17698l98462
$$ 15770869 15182190 14627235 14101379 13600598 13122006 12664123 12226497 11808799 11410337
58132A1410337l79882l61575l43804l27599l13381l00092k86368k72228k58910
$$ 11410337 11030455 10668880 10325076 9997477 9684096 9384004 9097636 8825408 8566498
58123H566498k47202k36660k26412k16245k06674j98347j91401j85251j79100
$$ 8566498 8319296 8082636 7856224 7639979 7433305 7234958 7043557 6858306 6679206
58114F679206j72840j67187j62528j58042j52603j46308j40346j35384j30888
$$ 6679206 6506366 6339179 6176651 6018609 5866006 5719698 5579352 5443968 5313080
58105E313080j26180j21329j16629j12010j07493j03717j01347j00203r9400r8121
$$ 5313080 5186900 5065571 4948942 4836932 4729439 4625722 4524375 4424172 4324772 4226651
58095D226651r5915r2716q8993q5588q2866q0271p7163p3758p0707o8070o5423
$$ 4226651 4130736 4038020 3949027 3863439 3780573 3700302 3623139 3549381 3478674 3410604 3345181
58084C345181o2802o0795n9608n8752n7780n6824n6202n5870n5531n4899n3778
$$ 3345181 3282379 3221584 3161976 3103224 3045444 2988620 2932418 2876548 2821017 2766118 2712340
58073B712340n2233n0753m9877m9463m8755m7300m5461m3788m2347m0983l9867
$$ 2712340 2660107 2609354 2559477 2510014 2461259 2413959 2368498 2324710 2282363 2241380 2201513
58062B201513l9245l8823l7927l6363l4766l3932l3968l4242l4046l3184l1990
$$ 2201513 2162268 2123445 2085518 2049155 2014389 1980457 1946489 1912247 1878201 1845017 1813027
58051A813027l0989l0520l0477l0260k9225k7434k5776k4997k4791k4318k3461
$$ 1813027 1782038 1751518 1721041 1690781 1661556 1634122 1608346 1583349 1558558 1534240 1510779
58040A510779k2915k2897k2735k2122k1779k2156k2346k1428k0237k0388k1771
$$ 1510779 1487864 1464967 1442232 1420110 1398331 1376175 1353829 1332401 1312164 1291776 1270005
58029A270005k2617k2127k1508k1816k2251k1579k0097j9029j8663j8321j7698
$$ 1270005 1247388 1225261 1203753 1181937 1159686 1138107 1118010 1098981 1080318 1061997 1044299
58018A044299j7082j6459j5488j4412j3979j4300j4540j4069j3194j2487j1936
$$ 1044299 1027217 1010758 995270 980858 966879 952579 938039 923970 910776 898289 886353
58007H86353j1160j0152r353r129r384r622r333q456p473o949p022p408p775p923
$$ 886353 875193 865041 855688 846559 837175 827553 818220 809764 802291 795342 788320 780912 773137 765214
57993G65214p759p421p291p625q246q783r145r447r642r602r368r052q552p784
$$ 765214 757455 750034 742743 735118 726872 718089 708944 699497 689855 680253 670885 661833 653281 645497
57979F45497p049o740o720o525o177o209o774p215o849n780m662l996l860m017
$$ 645497 638448 631708 624988 618463 612286 606077 599303 592088 585239 579459 574797 570801 566941 562924
57965E62924m062l696l161l079l615m081l742k817k230k460l100l569l812m108
$$ 562924 558862 555166 552005 548926 545311 541230 537488 534671 532441 529981 526881 523312 519500 515392
57951E15392m465m613m486m411m663n000m866l982k604j232k60P1k47p81q28j52
$$ 515392 510927 506314 501828 497417 492754 487754 482888 478906 476302 475070 474810 474881 474634 473853 473025 472873
57935D72873O65R33Q10J047J842K524K483J898J215M10p44j996k795l107l546
$$ 472873 473538 474471 475281 476328 478170 480694 483177 485075 486290 486700 485956 483960 481165 478058 474512
57920D74512m565n882o903p464p856q316q663q563p918o977o078n349m678l952
$$ 474512 469947 464065 457162 449698 441842 433526 424863 416300 408382 401405 395327 389978 385300 381348
57906C81348l274k881k882l108l323l493l729m015m154m088m060m229m291l810
$$ 381348 378074 375193 372311 369203 365880 362387 358658 354643 350489 346401 342341 338112 333821 330011
57892C30011k866j998j462r28k04K34j45j052j620j402p09j9M50N45R5q00j693
$$ 330011 327145 325147 323685 322757 322553 322787 322642 321590 319970 318568 317859 317840 318290 318835 318930 318130 316437
57875C16437k253k495k510k225j720j374j469j821k029j924j544q95m9O80R74
$$ 316437 314184 311689 309179 306954 305234 303860 302391 300570 298541 296617 295073 294178 294129 294809 295783
57860B95783Q99Q52J095J543J973K278K524K882L441M042M353M226L908L751L781
$$ 295783 296682 297534 298629 300172 302145 304423 306947 309829 313270 317312 321665 325891 329799 333550 337331
57845C37331L653L043J946O87l08p74q02p22p58q72r64j138j528k046k426k533
$$ 337331 340984 344027 345973 346660 346352 345578 344776 344054 343296 342424 341460 340322 338794 336748 334322 331789
57829C31789k450k270j946j408p42j63J88L39L26O0n38j218j523j307r41q15q42
$$ 331789 329339 327069 325123 323715 322973 322810 322998 323337 323663 323723 323185 321967 320444 319137 318196 317381 316539
57812C16539p76p66j155j891k628l354m285n121n141m264l344l074l202l178k934
$$ 316539 315763 314997 313842 311951 309323 305969 301684 296563 291422 287158 283814 280740 277538 274360 271426
57797B71426k508j637m47P9p16j973k280j567r17p16k54O93J208P03j8J29J111
$$ 271426 268918 267281 266834 266913 266197 264224 261944 260377 259460 258744 258490 259183 260391 261094 261076 261205 262316
57780B62316K201L108L872M215L829L151K988L475L947L799K966J766P08K80M16
$$ 262316 264517 267625 271497 275712 279541 282692 285680 289155 293102 296901 299867 301633 302341 302621 303037
57765C03037K85q42k583l832m077l803l629l608l573l554l637l710l604l264k726
$$ 303037 303322 302480 299897 296065 291988 288185 284556 280948 277375 273821 270184 266474 262870 259606 256880
57750B56880k098j594j327j069m90L93J318K239L262M109M155L227J954J143J007
$$ 256880 254782 253188 251861 250792 250302 250695 252013 254252 257514 261623 265778 269005 270959 272102 273109
57735B73109J122Q91K1j144j698j002M60J477J447Q80M78L61M14P71J426J876
$$ 273109 274231 275122 275143 273999 272301 271299 271759 273236 274683 275563 276041 276402 276816 277587 279013 280889
57719B80889J708J196Q23N58J77p3J44M53J00r76k086k796l225l357k845j777
$$ 280889 282597 283793 284616 285174 285351 285278 285422 285875 285975 284999 282913 280117 276892 273535 270690 268913
57703B68913r12p80j032j085q86o98n00j24L34O59Q52R57P97K41m18p26n82k18
$$ 268913 268001 267221 266189 265104 264218 263520 263020 262896 263230 263889 264741 265698 266495 266736 266318 265592 265010 264792
57685B64792J99O54J145J715K486L424M285N079O235P973R858J1501J3401J6389
$$ 264792 264991 265645 266790 268505 270991 274415 278700 283779 290014 297987 307845 319346 332747 349136
57671C49136K0335K4187K7335L0163L3042L5409L6101L3970K7984J7610L919j0229
$$ 349136 369471 393658 420993 451156 484198 519607 555708 589678 617662 635272 639191 628962
57659F28962k1899k9959l4826l6928l6318l3582l0021k6501k2848j8798j4928
$$ 628962 607063 577104 542278 505350 469032 435450 405429 378928 356080 337282 322354
57648C22354j2101j0270q548o356m078k524k058k344k707k633k058j268n37M4
$$ 322354 310253 299983 291435 285079 281001 278477 276419 274075 271368 268735 266677 265409 264872 264916
57634B64916M06M00P7j42J51P73J032M85n70j451j756j601j367j377j696k088
$$ 264916 265322 265722 265799 265657 265808 266581 267613 268098 267528 266077 264321 262720 261353 259976 258280 256192
57618B56192k229k090k035k323k638k459j830j358j316j166l81O11Q60J70o30
$$ 256192 253963 251873 249838 247515 244877 242418 240588 239230 237914 236748 236367 236978 237838 238008 237378
57603B37378q17n62l77l51l92p88j788k906l308k906k366k049j665j142j035j631
$$ 237378 236561 235999 235622 235271 234879 234091 232303 229397 226089 223183 220817 218768 217103 215961 214926 213295
57587B13295k277k283j970k119k682k848k282j511j062q80q10j000j515k007k165
$$ 213295 211018 208735 206765 204646 201964 199116 196834 195323 194261 193381 192571 191571 190056 188049 185884
57572A85884k106k037j904j602j271j052q64o49o05q15r78q32o04o02o32k77L85
$$ 185884 183778 181741 179837 178235 176964 175912 175048 174399 173794 172979 172001 171169 170565 169963 169331 169054 169439
57555A69439Q52R14Q66R60J086J110J175J486K000K469K623K318J704J187J063
$$ 169439 170291 171205 172071 173031 174117 175227 176402 177888 179888 182357 184980 187298 189002 190189 191252
57540A91252J167J188J212J592K240K524K062J263P46N84L64o8l73k32J86L78
$$ 191252 192419 193607 194819 196411 198651 201175 203237 204500 205246 205830 206194 206126 205753 205521 205707 206085
57524B06085J18k17oR01J917K275J809J014M52L05M45O06N18J45j53M1O45J132
$$ 206085 206203 205986 205980 206881 208798 211073 212882 213896 214348 214653 215098 215704 216222 216367 216214 216255 216900 218032
57506B18032J149P13j50j441k727l236k789k133j996k182k117j814j667j575j045
$$ 218032 219181 219894 219744 218303 215576 212340 209551 207418 205422 203240 201123 199309 197642 196067 195022
57491A95022j43M24K56k84o67p60n57L2Q95J545J578J044L14j70RQ65J632J311
$$ 195022 194879 195303 195559 195275 194608 193848 193291 193323 194218 195763 197341 198385 198699 198529 198538 199403 201035 202346
57473B02346l8j141j037k71j0l82n06Q3P58O98j85j389k315k444j579k41N19J39
$$ 202346 202308 201167 200130 199859 199849 199467 198961 199044 199802 200500 200315 198926 196611 194167 192588 192347 192866 193005
57455A93005p91j181n91M52J157J206Q95P54J061J571J828J722J625J813K053
$$ 193005 192214 191033 190442 190894 192051 193257 194152 194906 195967 197538 199366 201088 202713 204526 206579
57440B06579J971J647J429J356J173R24J031J610K161K195J835J515J412J492
$$ 206579 208550 210197 211626 212982 214155 215079 216110 217720 219881 222076 223911 225426 226838 228330
57426B28330J890K685L396L353K634K172K586L390L699L409L167L328L512L331
$$ 228330 230220 232905 236301 239654 242288 244460 247046 250436 254135 257544 260711 264039 267551 270882
57412B70882L008L020L342L495L224K890L011L591M043L784K905K148K182K961
$$ 270882 273890 276910 280252 283747 286971 289861 292872 296463 300506 304290 307195 309343 311525 314486
57398C14486L800M143M008L813L860M180M681N234N673N877N897N936O088O147
$$ 314486 318286 322429 326437 330250 334110 338290 342971 348205 353878 359755 365652 371588 377676 383823
57384C83823N739M722L541L077L924N703P226P546O736N586M671M030L621L657
$$ 383823 389562 394284 397825 400902 404826 410529 417755 425301 432037 437623 442294 446324 449945 453602
57370D53602M300N269N984O030N453M711M406M814N550N907N669N352N519O118
$$ 453602 457902 463171 469155 475185 480638 485349 489755 494569 500119 506026 511695 517047 522566 528684
57356E28684O741P266P782Q142Q088P813P901Q545R274R595R525R367R301R385
$$ 528684 535425 542691 550473 558615 566703 574516 582417 590962 600236 609831 619356 628723 638024 647409
57342F47409R580R587R053Q246Q101R194J0960J2311J2817J2829J2756J2741J2893
$$ 647409 656989 666576 675629 683875 691976 701170 712130 724441 737258 750087 762843 775584 788477
57329G88477J3241J3516J3491J3512J4104J5007J5286J4605J3850J4032J5044
$$ 788477 801718 815234 828725 842237 856341 871348 886634 901239 915089 929121 944165
57318I44165J5936J6125J5832J5501J5260J5091J5144J5706J6866J8328J9542
$$ 944165 960101 976226 992058 1007559 1022819 1037910 1053054 1068760 1085626 1103954 1123496
57307A123496K0139K0235K0231K0371K0623K0957K1561K2586K3870K5016K5764
$$ 1123496 1143635 1163870 1184101 1204472 1225095 1246052 1267613 1290199 1314069 1339085 1364849
57296A364849K6264K6923K7901K8743K8837K8341K8260K9210L0512L1106L1033
$$ 1364849 1391113 1418036 1445937 1474680 1503517 1531858 1560118 1589328 1619840 1650946 1681979
57285A681979L1226L2040L2920L3609L4598L5981L6864L6613L5917L5828L6322
$$ 1681979 1713205 1745245 1778165 1811774 1846372 1882353 1919217 1955830 1991747 2027575 2063897
57274B063897L6658L6700L6980L7657L8249L8388L8116L7579L6950L6599L6711
$$ 2063897 2100555 2137255 2174235 2211892 2250141 2288529 2326645 2364224 2401174 2437773 2474484
57263B474484L6955L7147L7892L9774M2084M3380M3413M3484M4643M6462M7984
$$ 2474484 2511439 2548586 2586478 2626252 2668336 2711716 2755129 2798613 2843256 2889718 2937702
57252B937702M9018M9932N0822N1485N1816N1767N1323N0844N0942N1630N2071
$$ 2937702 2986720 3036652 3087474 3138959 3190775 3242542 3293865 3344709 3395651 3447281 3499352
57241C499352N1636N0731N0108M9847M9643M9574M9752M9596M8366M6421M5083
$$ 3499352 3550988 3601719 3651827 3701674 3751317 3800891 3850643 3900239 3948605 3995026 4040109
57230D040109M5033M5607M5889M5887M6166M6831M7431M7646M7599M7472M7257
$$ 4040109 4085142 4130749 4176638 4222525 4268691 4315522 4362953 4410599 4458198 4505670 4552927
57219D552927M6923M6625M6566M6801M7279M7905M8442M8434M7594M6277M5295
$$ 4552927 4599850 4646475 4693041 4739842 4787121 4835026 4883468 4931902 4979496 5025773 5071068
57208E071068M5038M5005M4441M3288M2147M1430M0979M0556M0310M0574M1457
$$ 5071068 5116106 5161111 5205552 5248840 5290987 5332417 5373396 5413952 5454262 5494836 5536293
57197E536293M2841M4529M6289M7977M9690N1584N3406N4590N4874N4454N3425
$$ 5536293 5579134 5623663 5669952 5717929 5767619 5819203 5872609 5927199 5982073 6036527 6089952
57186F089952N1577M9114M6970M5849M5268M4196M2479M0859L9651L8239L6238
$$ 6089952 6141529 6190643 6237613 6283462 6328730 6372926 6415405 6456264 6495915 6534154 6570392
57175F570392L4499L4348L6124L9018M2203M5595M9445N3765N8510O3923P0229
$$ 6570392 6604891 6639239 6675363 6714381 6756584 6802179 6851624 6905389 6963899 7027822 7098051
57164G098051P7041Q3610Q9668R5514J01104J05582J08146J08922J08425J06603
$$ 7098051 7175092 7258702 7348370 7443884 7544988 7650570 7758716 7867638 7976063 8082666
57154H082666J03272R9385R6915R7103R9429J02532J05364J06957J05640R9436
$$ 8082666 8185938 8285323 8382238 8479341 8578770 8681302 8786666 8893623 8999263 9098699
57144I098699Q7348P0073M9765K9344J1455k641j3266k1281k7192l1484l5277
$$ 9098699 9186047 9256120 9305885 9335229 9346684 9344043 9330777 9309496 9282304 9250820 9215543
57133I215543l9805m5411n1638n8176o5028p1860p8012q3451q8931r4842j00389
$$ 9215543 9175738 9130327 9078689 9020513 8955485 8883625 8805613 8722162 8633231 8538389 8438000
57122H438000j04483j07124j09306j11697j13931j15313j15777j15768j15402
$$ 8438000 8333517 8226393 8117087 8005390 7891459 7776146 7660369 7544601 7429199
57113G429199j14163j11522j07523j02560r6750q9796q1294p0671n6766l7673
$$ 7429199 7315036 7203514 7095991 6993431 6896681 6806885 6725591 6654920 6598154 6560481
57103F560481j1115K5107P2659J31884K01308K78229L59883M43918N28322O12158
$$ 6560481 6549366 6574473 6647132 6779016 6980324 7258553 7618436 8062354 8590676 9202834
57093I202834O96798P85862Q83481R92819J115313J249208J387986J521646J640583
$$ 9202834 9899632 10685494 11568975 12561794 13677107 14926315 16314301 17835947 19476530
57084A9476530J737159J803002J827162J799087J711308J556103J321833J000285
$$ 19476530 21213689 23016691 24843853 26642940 28354248 29910351 31232184 32232469
57076C2232469O02682J66717k56765o26840r25321j152659j316774j425853j486666
$$ 32232469 32835151 33001868 32745103 32118263 31192942 30040283 28723509 27297656 25810990
57067B5810990j504764j484869j431788j351485j251304j139088j021908r05284
$$ 25810990 24306226 22821357 21389569 20038084 18786780 17647692 16625784 15720500
57059A5720500p93289o89096n94951n11515m37879l72788l15711k66426k24071
$$ 15720500 14927211 14238115 13643164 13131649 12693770 12320982 12005271 11738845 11514774
57050A1514774j87341j55471j28389j05822q6844p0467n6275m4282l4373k6045
$$ 11514774 11327433 11171962 11043573 10937751 10850907 10780440 10724165 10679883 10645510 10619465
57040A0619465j8513j1080l504L961J0943J7226K2727K7415L1498L5480L9844
$$ 10619465 10600952 10589872 10586368 10590329 10601272 10618498 10641225 10668640 10700138 10735618 10775462
57029A0775462M4812N0141N4564N5273M9068L5136J6714o48j2636j8025j7939
$$ 10775462 10820274 10870415 10924979 10980252 11029320 11064456 11081170 11080522 11067886 11049861 11031922
57018A1031922j4391r421m429K51M792Q760J1106J1487J0949J0839J1420J2024
$$ 11031922 11017531 11008110 11003681 11003932 11008724 11017484 11028590 11040077 11051026 11061865 11073285 11085309
57006A1085309J2213J2315J2866J4059J5810J7956K0204K2046K3080K3484K3870
$$ 11085309 11097522 11109837 11122703 11136762 11152572 11170528 11190732 11212778 11235858 11259342 11283212
56995A1283212K4512K4793K3819K1585J9116J7309J6049J4873J4041J4336J5972
$$ 11283212 11307724 11332517 11356336 11377921 11397037 11414346 11430395 11445268 11459309 11473645 11489617
56984A1489617J8304K0548K2202K2794K1955J9938J7468J4833J1668P900M253
$$ 11489617 11507921 11528469 11550671 11573465 11595420 11615358 11632826 11647659 11659327 11667227 11671480
56973A1671480J376j004l467n816p317p713p374o564n393m492m811o312p573p405
$$ 11671480 11672856 11671852 11668385 11662569 11655252 11647539 11640165 11633601 11628208 11623716 11618905 11612593 11605020 11597615
56959A1597615o376o171p590r922j2278j4792j8108k2142k5893k8402k9531k9862
$$ 11597615 11591239 11585068 11577478 11567556 11555278 11540486 11522378 11500236 11474343 11445941 11416410 11386548
56947A1386548l0093l0611l1359l2029l2422l2638l2848l2987l2835l2286l1396
$$ 11386548 11356455 11325844 11294485 11262456 11230034 11197396 11164548 11131561 11098726 11066440 11035044
56936A1035044l0203k8756k7252k5922k4835k4151k4545k6983l1896l8727m6414
$$ 11035044 11004841 10976085 10948833 10922911 10898076 10873925 10849380 10822397 10790501 10751774 10705360
56925A0705360n3983o0622o5662o8846p0472p0978p0557o9351o7726o6057o4432
$$ 10705360 10651377 10590755 10525093 10456247 10385775 10314797 10244240 10174889 10107163 10041106 9976674
56914I976674o2911o1821o1551o2140o3347o4928o6502o7413o7207o6225o5316
$$ 9976674 9913763 9851942 9790391 9728251 9664904 9599976 9533474 9466061 9398854 9332629 9267313
56903I267313o4928o4751o4205o3040o1539o0371o0082o0476o0633o0005n9201
$$ 9267313 9202385 9137634 9073429 9010389 8948850 8888479 8828397 8767921 8707288 8647283 8588082
56892H588082n9292o0474o1953o2989o3441o3446o3254o3457o4586o6292o7576
$$ 8588082 8528790 8468316 8406363 8343374 8279933 8216487 8153233 8089776 8025190 7958898 7891322
56881G891322o8112o8555o9265o9585o8864o7502o6191o4703o2333n9282n6618
$$ 7891322 7823210 7754655 7685390 7615805 7546941 7479439 7413248 7348545 7286212 7226930 7170312
56870G170312n4969n4007n3253n2667n2232n1611n0606m9523m8773m8406m8330
$$ 7170312 7115343 7061336 7008083 6955416 6903184 6851573 6800967 6751444 6702671 6654265 6605935
56859F605935m8811n0508n4131o0074o8128p7337q6286r3748r9078j02047j02538
$$ 6605935 6557124 6506616 6452485 6392411 6324283 6246946 6160660 6066912 5967834 5865787 5763249
56848E763249j00632r6855r2125q7256q2493p7470p1722o5331n9064n3694m9260
$$ 5763249 5662617 5565762 5473637 5386381 5303888 5226418 5154696 5089365 5030301 4976607 4927347
56837D927347m5148m0926l6828l3395l1036l0361l2695l9512n0938o5088p9205
$$ 4927347 4882199 4841273 4804445 4771050 4740014 4709653 4676958 4637446 4586508 4521420 4442215
56826D442215r1415j01118j08050j11738j12171j10335j07452j03829r8993r2874
$$ 4442215 4350800 4249682 4141632 4029894 3917723 3807388 3699936 3596107 3497114 3404240
56816C404240q6329q0344p5132p0176o4875n8953n2576m6367m1122l7314l5028
$$ 3404240 3317911 3237567 3162435 3092259 3027384 2968431 2915855 2869488 2828366 2791052 2756024
56805B756024l4538l6653m2084n0478o0292o9598p6935q1574q3433q2938q0857
$$ 2756024 2721486 2684833 2642749 2592271 2531979 2462381 2385446 2303872 2220439 2137501 2056644
56794B056644p7955p4592p0649o5929o0706n5677n1209m6948m2442l7955l4122
$$ 2056644 1978689 1904097 1833448 1767519 1706813 1651136 1599927 1552979 1510537 1472582 1438460
56783A438460l0914k7566k3728k0172j8110j8229k0573k4798l0090l5212l9198
$$ 1438460 1407546 1379980 1356252 1336080 1317970 1299741 1279168 1254370 1224280 1189068 1149870
56772A149870m1810m3118m3049m1784m0075l8577l7124l5219l2967l0859k8968
$$ 1149870 1108060 1064942 1021893 980109 940034 901457 864333 829114 796147 765288 736320
56761G36320k7099k5532k4742k4372k3412k1596j9785j8660j7802j6564j5168
$$ 736320 709221 683689 658947 634575 611163 589567 569782 551122 533320 516756 501588
56750E01588j4290j3941j3450j2345j0838r467q632q376q368q202p865p766q128
$$ 501588 487298 473357 459907 447562 436724 427257 418625 410249 401881 393679 385814 378048 369920
56737C69920q652q928q890q572p830o689n705n481n884o195n974n434m984m760
$$ 369920 361268 352340 343450 334878 327048 320359 314654 309173 303289 297094 291120 285686 280702 275942
56723B75942m700m705m588m137l378k655k282k204k096j790j510j584j960k161
$$ 275942 271242 266537 261949 257812 254434 251779 249497 247293 245197 243407 241897 240313 238353 236192
56709B36192j844j266r82j103j188r24n15l02l24m92q87j487j882j692j187j031
$$ 236192 234348 233082 232100 230997 229809 228885 228370 228068 227744 227252 226365 224878 222996 221304 220117 219086
56693B19086j407j782j612r97m58l47o13j033j430j769k128k595l107l365k989
$$ 219086 217679 215897 214285 213288 212830 212483 211870 210837 209407 207638 205510 202915 199808 196443 193454
56678A93454j880n02L45K47l70p30o54p38j415k205k238j270M4Q39P04j77j203
$$ 193454 191574 191072 191417 191664 191294 190564 189910 189172 187757 185552 183314 182044 182088 182927 183631 183454 182251
56661A82251j678j272l17M39M52k95j330j999j871j117l61qJ59N02Q68P85J83
$$ 182251 180573 179301 178984 179423 179875 179580 178250 176251 174380 173263 172902 172894 173053 173555 174423 175208 175391
56644A75391m12m38J91J101J709J573P95L2j69J7J30K23P06J454J798J518J286
$$ 175391 174979 174541 174732 175833 177542 179115 179910 179942 179773 179790 179920 180143 180849 182303 184101 185619 186905
56627A86905J609K008J705Q24J68L5j38q21j659j971j601r46l89m5K1l17r61j440
$$ 186905 188514 190522 192227 193051 193219 193254 193116 192295 190636 188665 187064 186118 185729 185684 185705 185388 184427 182987
56609A82987j301o45j10k12q40j422j515j092m02K82P70Q96N64j84j042j536j388
$$ 182987 181686 181041 180931 180719 179879 178457 176942 175850 175448 175730 176500 177396 177960 177776 176734 175198 173810
56592A73810q18l59l13m82m76j26M57R76J064N52k34p20p21n83n07k34M16J097
$$ 173810 172992 172633 172320 171838 171362 171236 171693 172669 173733 174285 174051 173331 172610 172027 171520 171286 171702 172799
56574A72799J464J688J962J875J045O4l5Q34J743K110K264K523K593K311K267
$$ 172799 174263 175951 177913 179788 180833 180897 180862 181696 183439 185549 187813 190336 192929 195240 197507
56559A97507L027M262N164N401N171M639L826K872J967J101J95o30j171j403j459
$$ 197507 200534 204796 209960 215361 220532 225171 228997 231869 233836 234937 235132 234502 233331 231928 230469
56544B30469j477j565j732j826j755j758k100k504k352j591q77o42o58p23j067
$$ 230469 228992 227427 225695 223869 222114 220356 218256 215752 213400 211809 210932 210290 209632 208909 207842
56529B07842j620j678r13j52k94j010j259q79o48r60j316j218q27n34m78o53j011
$$ 207842 206222 204544 203631 203479 203185 202175 200916 200037 199389 198429 197113 195895 195068 194534 194056 193403 192392
56512A92392j324j289q87l27L37J107J656J519P29j79p96j081j057o81r5L61N06
$$ 192392 191068 189779 188892 188565 188902 190009 191665 193184 193913 193734 192938 191857 190800 190119 190024 190385 190891
56495A90891L94Q8k88m65l30k20m92r32j063q84p57p03m04J63P03J136J527J578
$$ 190891 191285 191373 191085 190620 190290 190070 189578 188646 187583 186699 185942 185239 184835 184998 185701 186837 188364 189942
56477A89942R53J28M4P78J351J107N05K12K20K88N04Q81J035P92N85P50R44P82
$$ 189942 190895 191023 191067 191845 193196 194303 194808 195020 195240 195528 196032 196913 197948 198740 199325 200075 201019 201801
56459B01801M89L83K22k23n17k12K71K44r6k5M59O26K17k41m52p25j152j198n57
$$ 201801 202290 202673 202895 202672 202155 201943 202214 202458 202362 202337 202796 203422 203639 203398 202946 202221 201069 199871 199314
56440A99314K08M37L20M29O90M87k69q11m62N02J209J200P71M18K48Jn93j459
$$ 199314 199522 199959 200279 200708 201398 201885 201616 200805 200343 200845 202054 203254 204025 204443 204691 204692 204099 202640
56422B02640k070j718k00J701K757K553J786J182N85l15r50m65Q30J629J327O35
$$ 202640 200570 198852 198652 200353 203110 205663 207449 208631 209216 208901 207951 207486 208316 209945 211272 211907
56406B11907K61p5p32j107l84J145K319K419J658N60m96j194j306q72p1R57J905
$$ 211907 212168 212093 211361 210254 209870 211015 213334 215753 217411 217971 217475 216281 214975 214103 214032 214989 216894
56389B16894K211J631P26L00M91Q86J243J650J986J919J469J098J096J265J340
$$ 216894 219105 220736 221462 221762 222253 223139 224382 226032 228018 229937 231406 232504 233600 234865 236205
56374B36205J344J419J587J772J877J738J280P62O60J147J803J962J335L29l04
$$ 236205 237549 238968 240555 242327 244204 245942 247222 247984 248644 249791 251594 253556 254891 255220 254916
56359B54916k07K58N04M67N36Q67J235J542J926K191J847R38K50K51N07N56O53
$$ 254916 254709 254967 255471 255938 256474 257341 258576 260118 262044 264235 266082 267020 267270 267521 268028 268584 269237
56342B69237R85R92L50m2P36J961K106J155O63J401K383K600K421K596K925K778
$$ 269237 270222 271214 271564 271522 272258 274219 276325 277480 278143 279544 281927 284527 286948 289544 292469 295247
56326B95247K220J744J396R30M93M78Q89J346J570J477J071N94N29J040J669J857
$$ 295247 297467 299211 300607 301537 302030 302508 303397 304743 306313 307790 308861 309455 309984 311024 312693 314550
56310C14550J555J125R35J251K132L118L494L149K796K972L369L546L688M062
$$ 314550 316105 317230 318165 319416 321548 324666 328160 331309 334105 337077 340446 343992 347680 351742
56296C51742M242L737K996K898L370L445K692J772J441J739K380L219M018M363
$$ 351742 355984 359721 362717 365615 368985 372430 375122 376894 378335 380074 382454 385673 389691 394054
56282C94054M176L871L700L451L128L308M334N602O247O276O408O948P466P593
$$ 394054 398230 402101 405801 409252 412380 415688 420022 425624 431871 438147 444555 451503 458969 466562
56268D66562P526P601P835Q088Q347Q616Q851R171R888J1084J2384J3381J4136
$$ 466562 474088 481689 489524 497612 505959 514575 523426 532597 542485 553569 565953 579334 593470
56255E93470J5029J6219J7562J8916K0371K2135K4338K6905K9522L1829L3811
$$ 593470 608499 624718 642280 661196 681567 703702 728040 754945 784467 816296 850107
56244H50107L5874L8321M0818M2566M2984M2075M0201L7742L4914L1690K7864
$$ 850107 885981 924302 965120 1007686 1050670 1092745 1132946 1170688 1205602 1237292 1265156
56233A265156K3351J8343J2975P038L66o586j2902j8020k2049k5298k7880k9835
$$ 1265156 1288507 1306850 1319825 1326863 1327229 1320643 1307741 1289721 1267672 1242374 1214494 1184659
56221A184659l1289l2343l3040l3455l3564l3020l1521k9398k7416k5949k4733
$$ 1184659 1153370 1121027 1087987 1054532 1020968 987948 956427 927029 899613 873664 848931
56210H48931k3483k2184k0740j8942j6968j5305j3961j2435j0704r455q869q074
$$ 848931 825448 803264 782524 763582 746614 731309 717348 704913 694209 684754 675885 667811
56198F67811o446m711l885l772l448k769k304k060j434m46K7m00r33n77O98K115
$$ 667811 661365 656654 652769 648997 645549 642780 640476 638416 636982 636536 636563 636163 635230 634653 635351 637466
56182F37466K977L168L075L167L547L882L972M115M550M954M941M799N077N690
$$ 637466 640443 643611 646686 649853 653400 657282 661254 665369 669919 674873 679814 684613 689690 695380
56168F95380O117O353O931P988R018R650J0040J0441J0895J1414J1978J2410J2720
$$ 695380 701497 707850 714781 722769 731787 741437 751477 761918 772813 784227 796205 808615 821335
56155H21335J3412J4859J6564J7764J8571J9733K1436K3258K5279K8101L1666
$$ 821335 834747 849606 866170 883934 902505 922238 943674 966932 992211 1020312 1051978
56144A051978L5163L8516M2891M9107N6369O3205O9044P4138P8334Q0641P9915
$$ 1051978 1087141 1125657 1168548 1217655 1274024 1337229 1406273 1480411 1558745 1639386 1719301
56133A719301P5774O9003O1192N3704M6957M0876L5700L1673K8140K3829J8109
$$ 1719301 1795075 1864078 1925270 1978974 2025931 2066807 2102507 2134180 2162320 2186149 2204258
56122B204258J1304L912l567j0133j4878j8339k2174k7214l2872l8808m5729n3795
$$ 2204258 2215562 2219474 2215907 2205774 2190896 2172557 2150383 2123169 2090297 2051489 2005760 1951965
56110A951965o1387o6503o8575o8053o5093n9721n2700m5152l7709l0719k4791
$$ 1951965 1890578 1824075 1755500 1687447 1622354 1562633 1509933 1464781 1427072 1396353 1371562
56099A371562k0243j6438j2537q620n408l195j713o57L14J707L690N733P354Q750
$$ 1371562 1351319 1334881 1322344 1313724 1308316 1305121 1303408 1302751 1303065 1304772 1308462 1314195 1321549 1330299
56085A330299J0166J1154J1258J0974J1213J2140J3219J4120J4848J5316J5565
$$ 1330299 1340465 1351619 1362877 1373851 1385064 1397204 1410423 1424543 1439391 1454707 1470272
56074A470272J6161J7560J9257K0312K0579K0800K1510K2493K3349K4019K4726
$$ 1470272 1486433 1503993 1523250 1543562 1564141 1584941 1606451 1628944 1652293 1676312 1701038
56063A701038K5695K6945K8221K9347L0667L2679L5074L6850L7690L8475L9965
$$ 1701038 1726733 1753678 1781899 1811246 1841913 1874592 1909666 1946516 1984206 2022681 2062646
56052B062646M1708M2927M3708M4551M5396M5961M6573M7726M9207N0493N1670
$$ 2062646 2104354 2147281 2190989 2235540 2280936 2326897 2373470 2421196 2470403 2520896 2572566
56041B572566N3215N5234N7660O0774O4736O8927P2645P6172Q0363Q5410R0832
$$ 2572566 2625781 2681015 2738675 2799449 2864185 2933112 3005757 3081929 3162292 3247702 3338534
56030C338534R6378J02195J08257J14431J20907J27948J35396J42953J50643J58437
$$ 3338534 3434912 3537107 3645364 3759795 3880702 4008650 4144046 4286999 4437642 4596079
56020D596079J65867J72673J79589J87867J98298K11002K25445K40098K52855
$$ 4596079 4761946 4934619 5114208 5302075 5500373 5711375 5936820 6176918 6429773
56011F429773K62614K69959K75786K80115K83053K85946K90493K97291L06295
$$ 6429773 6692387 6962346 7238132 7518247 7801300 8087246 8377739 8675030 8981325
56002H981325L17879L32358L49030L66824L85347M04371M23152M41361M59960
$$ 8981325 9299204 9631562 9980592 10347416 10732763 11137134 11560286 12001647 12461607
55993A2461607M79857N00403N20385N39793N59255N78485N96659O13909O31232
$$ 12461607 12941464 13441867 13962252 14502045 15061300 15639785 16236444 16850353 17481585
55984A7481585O49618O70528O96227P28183P65736Q07596Q53785R04906R60808
$$ 17481585 18131203 18801731 19497958 20226141 20991877 21799473 22653258 23558164 24518972
55975B4518972J021570J088644J163174J244514J332490J430003J541452J669871
$$ 24518972 25540542 26629186 27792360 29036874 30369364 31799367 33340819 35010690
55967C5010690J817817J989711K190857K425496K698478L017446L391112L827375
$$ 35010690 36828507 38818218 41009075 43434571 46133049 49150495 52541607 56368982
55959E6368982M336225M932109N629609O439044P370770Q440925R665604J1047132
$$ 56368982 60705207 65637316 71266925 77705969 85076739 93517664 103183268 114230400
55951A14230400J2565938J4177137J5798890J7288215J8408646J8798675J7981437
$$ 114230400 126796338 140973475 156772365 174060580 192469226 211267901 229249338
55944B29249338J5490755J1129520N214906j418133p725895j2873498j6469589
$$ 229249338 244740093 255869613 261084519 259666386 251940491 239066993 222597404
55937B22597404j8521286j9251034j8951580j7923589j6446688j4753330j3015395
$$ 222597404 204076118 184825084 165873504 147949915 131503227 116749897 103734502
55930A03734502j1348271r820190q461473p277554o262090n402267m679129m071154
$$ 103734502 92386231 82566041 74104568 66827014 60564924 55162657 50483528 46412374
55922D6412374l559680l129388k765603k454929k188023j958869j761684j590769
$$ 46412374 42852694 39723306 36957703 34502774 32314751 30355882 28594198 27003429
55914B7003429j442515j314801j204554j107913j022376r46846q79762q18943
$$ 27003429 25560914 24246113 23041559 21933646 20911270 19964424 19084662 18265719
55906A8265719p63110p12068o65487o22815n84185n50156n20462m93871m69193
$$ 18265719 17502609 16790541 16125054 15502239 14918054 14367898 13847436 13353565 12884372
55897A2884372m45860m23817m03286l84333l66371l48666l31457l15714l01523
$$ 12884372 12438512 12014695 11611409 11227076 10860705 10512039 10180582 9864868 9563345
55888I563345k87796k73924k60504k48030k36252k25489k17057k11381k06897
$$ 9563345 9275549 9001625 8741121 8493091 8256839 8031350 7814293 7602912 7396015
55879G396015k01948j96570j91328j85707j79069j72175j66201j60992j55634
$$ 7396015 7194067 6997497 6806169 6620462 6441393 6269218 6103017 5942025 5786391
55870E786391j50111j44992j40042j34580j28806j23476j18527j13349j08183
$$ 5786391 5636280 5491288 5351246 5216666 5087860 4964384 4845857 4732508 4624325
55861D624325j03965j00883r8241r5739r3755r2262r0518q8079q5297q2614p9976
$$ 4624325 4520360 4419477 4321236 4225497 4131742 4039480 3948962 3860883 3775586 3692972 3612996
55850C612996p7211p4459p2001o9996o8406o6931o5148o2983o0944n9570n8813
$$ 3612996 3535785 3461326 3389325 3319329 3250923 3183992 3118844 3055861 2994917 2935347 2876534
55839B876534n8216n7393n6087n4150n1845m9858m8592m7610m6235m4416m2715
$$ 2876534 2818318 2760925 2704838 2650688 2598843 2548985 2500393 2452783 2406548 2362132 2319417
55828B319417m1628m1173m0933m0354l9242l8121l7689l7867l7872l7259l6330
$$ 2319417 2277789 2236616 2195683 2155329 2116087 2077966 2040277 2002410 1964538 1927279 1890949
55817A890949l5376l4277l3083l2201l1664l0933k9810k8795k8101k7201k5837
$$ 1890949 1855573 1821296 1788213 1756012 1724348 1693415 1663605 1634810 1606709 1579508 1553671
55806A553671k4711k4405k4378k3758k2540k1248k0009j8722j7636j6962j6433
$$ 1553671 1528960 1504555 1480177 1456419 1433879 1412631 1392622 1373900 1356264 1339302 1322869
55795A322869j5895j5859j6665j7585j7649j6965j6435j6432j6546j6384j5900
$$ 1322869 1306974 1291115 1274450 1256865 1239216 1222251 1205816 1189384 1172838 1156454 1140554
55784A140554j5181j4436j4080j4289j4850j5760j7415j9622k1127k0912j9447
$$ 1140554 1125373 1110937 1096857 1082568 1067718 1051958 1034543 1014921 993794 972882 953435
55773I53435j7868j6426j4639j2484j0480q907p849p709q791j0664j2613j4354
$$ 953435 935567 919141 904502 892018 881538 872631 864782 857073 848282 837618 825005 810651
55761H10651j5617j5728j4580j3392j3255j3471j2734j1470j1319j2448j3282
$$ 810651 795034 779306 764726 751334 738079 724608 711874 700404 689085 676637 663355
55750F63355j3086j3050j4041j4969j4398j2634j1124j0505j0303j0010r515q783
$$ 663355 650269 637219 623178 608209 593811 581177 570053 559548 549245 539235 529720 520937
55738E20937p858p060o676o611o623o595o423o001n610n815o669p439p536p210
$$ 520937 513079 506019 499343 492732 486109 479514 473091 467090 461480 455665 448996 441557 434021 426811
55724D26811o959o767o423o174o387o763o607n801m998m704m663m329l568k655
$$ 426811 419852 413085 406662 400488 394101 387338 380731 374930 369932 365228 360565 356236 352668 350013
55710C50013j777r20k36r7o89j705k721l668m599n229n228m923n096n851o430
$$ 350013 348236 347316 347080 346983 346294 344589 341868 338200 333601 328372 323144 318221 313125 307274 300844
55695C00844o401o313o662o888o216m963m111l875l613l016k502k309k126j753
$$ 300844 294443 288130 281468 274580 268364 263401 259290 255415 251802 248786 246284 243975 241849 240096
55681B40096j418j210p98l6O55P76K71n62j323j644j511j400j651j797j186k03
$$ 240096 238678 237468 236670 236634 237289 238065 238336 237774 236451 234807 233296 231896 230245 228448 227262 227059
55665B27059p3j195k448k544j528m62o8k07m26n74q48j456k222k655k495k032
$$ 227059 226986 225791 223343 220799 219271 218809 218741 218534 218108 217534 216686 215230 213008 210353 207858 205826
55649B05826j620j112l14L31J48o83j253j211j159j616k291k704k870k966k891
$$ 205826 204206 203094 202780 203111 203259 202576 201323 200112 198953 197337 195046 192342 189472 186506 183615
55634A83615k559k227k207k595l393m456n166m886l914l318l520l724l166k159
$$ 183615 181056 178829 176622 174027 170634 166178 161012 156126 152212 148894 145374 141650 138484 136325
55620A36325j332o43J40N89J39r00j696j998k136k167j871j448j401j697j789
$$ 136325 134993 134350 134490 135079 135218 134318 132622 130624 128488 126321 124450 123002 121601 119904 118115
55605A18115j512j316j448j555j315r28p51p63o89m00k5J48j06o71j020p55j49
$$ 118115 116603 115287 113839 112284 110969 110041 109290 108527 107838 107438 107413 107561 107455 106784 105764 105009 104860
55588A04860J68N1p6N7J69o0m90p76q17o71k83L64R42J053P98Q33J654K948L795
$$ 104860 105028 105079 105003 105060 105229 105169 104679 103903 103086 102415 102132 102496 103438 104491 105289 106122 107776 110724 114519
55569A14519L574K570J648J351J444J321P26p5p16j145j580k173k767l059k962
$$ 114519 118093 120663 122311 123662 125106 126427 127153 127078 126362 125217 123637 121464 118697 115638 112676
55554A12676k747k682k637k242j465p78n83p05o87m62m70j059j968k517k248j321
$$ 112676 109929 107247 104610 102368 100903 100125 99542 98837 98150 97688 97218 96159 94191 91674 89426 88105
55538H8105k75N31J171J792K227K165J650J150J001J069J003O31L8n69r25q22
$$ 88105 87830 88361 89532 91324 93551 95716 97366 98516 99517 100586 101589 102220 102258 101689 100764 99942
55522I9942l44K06O30Q81P51r1j463k485k430j601q98p61r75j343j900k438k491
$$ 99942 99598 99804 100434 101315 102066 101975 100512 98027 95597 93996 93098 92337 91362 90019 88119 85681 83190
55505H3190k009j519j293q38K86J596K123J615P03p1p66j456j718j144o1P02P34
$$ 83190 81181 79662 78369 77531 77817 79413 81536 83151 83854 83783 83017 81561 79843 78699 78638 79340 80074
55488H0074L28p9m26q04j129j230j125r12n12J59P35N11o86j945k020o82R36J562
$$ 80074 80402 80323 79897 79093 77964 76734 75609 74697 74185 74344 75079 75590 74904 72959 70939 70257 71193 72755
55470G2755J049K16l35p21j102j118m14N94J033O13q2l69k22n6j40m04o62p49
$$ 72755 73804 74020 73685 72964 71862 70744 70330 70924 71957 72570 72488 72119 71897 71841 71701 71297 70635 69886
55452F9886o19m06l54m83n07k04J75J46l52p25l70N32J072O91p4k42K58N21Q8
$$ 69886 69267 68861 68507 68024 67517 67313 67488 67634 67282 66557 66187 66719 67791 68482 68408 68166 68424 68945 69033
55433F9033k97R5O32K12q94j254l64O51P91M67M44M81k8q07j078p33k00M08J164
$$ 69033 68736 68831 69463 69675 68781 67527 67163 67814 68605 69072 69516 69997 69969 69162 68084 67351 67151 67559 68723
55414F8723J651J387P40N10P04O54K41k4r7n48j396j840j512j082j140j300r82
$$ 68723 70374 71761 72501 73011 73715 74369 74610 74586 74489 73941 72545 70705 69193 68111 66971 65671 64689
55397F4689l90o1M3K89O08O23L34Q6j4k11o01r58j056r33p85o38k91L79J011R61
$$ 64689 64299 64238 64281 64570 65178 65801 66135 66221 66207 65996 65395 64437 63381 62448 61663 61025 60734 61113 62124 63085
55377F3085J68m77q8J018J675J360O68K95K72L90O22Q07N77qk73J31O60O54J87
$$ 63085 63253 62776 62688 63706 65381 66741 67409 67704 67976 68366 68988 69795 70372 70364 70091 70222 70882 71536 71723
55358G1723l27q56j456j687j071R3R41J024N79J6l88l85O2N60O21K87K4P5K08
$$ 71723 71396 70540 69084 67397 66326 66419 67360 68384 68963 68979 68591 68206 68268 68828 69449 69736 69760 69835 70043
55339G0043J22k57p99j245j256o78J66P29P42M38K47L95P22Q07M36p1j60K58O91
$$ 70043 70165 69908 69109 67864 66608 65930 66096 66825 67567 68005 68252 68647 69369 70176 70612 70541 70381 70639 71330
55320G1330P43N53M30L66J63k12n88p65n91j65M0l53r77j009k54N70Q04N67J93
$$ 71330 72073 72626 73056 73422 73585 73373 72785 72020 71429 71264 71304 70951 69974 68965 68711 69281 70085 70652 70845
55301G0845l28r29j135p22k29k03l99l08K2K76N79J081J374J110Q27J210J782
$$ 70845 70517 69588 68453 67731 67502 67299 66900 66592 66614 66890 67469 68550 69924 71034 71861 73071 74853
55284G4853J410pj333j741j462r05q8P22Q08k4r52j129o24j2M48P48P59M23j0
$$ 74853 76263 76256 74923 73182 71720 70815 70727 71449 72257 72233 71281 70152 69528 69516 69964 70712 71471 71894 71884
55265G1884l66p99j354j600j141j97O60J074R57L56l73o06j58L64L58J39M17J073
$$ 71884 71518 70719 69365 67765 66624 66427 67087 68161 69118 69474 69101 68495 68337 68701 69059 69198 69615 70688
55247G0688J173L14p13r18l13K84L52J17mN2J33J96L27N05O56P93R25R27O61K52
$$ 70688 71861 72175 71462 70544 70231 70515 70867 70984 70980 71032 71165 71361 71688 72193 72849 73642 74567 75494 76155 76407
55227G6407k1q9j13j53j32j23l48p01p09j96L07K19l10o28m99l07m39p98j003
$$ 76407 76386 76297 76184 76031 75899 75776 75428 74727 74018 73822 74129 74348 74038 73410 72911 72604 72165 71367 70364
55208G0364p91k19L82O70O63P35J053J240Q49N7n20n90m00k47j48k4J07K04K34
$$ 70364 69573 69354 69736 70406 71069 71804 72857 74097 74946 75003 74483 73893 73493 73246 73098 73074 73181 73385 73619
55189G3619J61P5K65Q43J366J219L82m69p18l99LR8r5k43q5J95R7n43j222j312
$$ 73619 73780 73855 74120 74963 76329 77548 77930 77461 76743 76344 76347 76445 76350 76107 76022 76217 76314 75771 74549 73237
55169G3237p90j07M38P97R00O90L95K99L11J73l4j0J68J49j8R9N40P30K94m06
$$ 73237 72447 72340 72778 73575 74475 75165 75560 75859 76170 76343 76309 76299 76467 76616 76598 76697 77237 77967 78261 77855
55149G7855q05p94o40n33n02n22n24m22k96l10m73o52q31j032j053o49J4N13P94
$$ 77855 77050 76256 75616 75083 74581 74059 73535 73113 72817 72507 72034 71382 70551 69519 68466 67817 67831 68344 69138
55130F9138J145J524J420O61j77m18k2N99J089J221Q75K35k74n27q22j164q75
$$ 69138 70283 71807 73227 73888 73711 73293 73271 73870 74959 76180 77055 77290 77016 76489 75667 74503 73628
55113G3628N32K315L008J997K06r37r37m36k08l12k87Q6N12O46M93K15j32l80
$$ 73628 74160 76475 79483 81480 81686 80749 79812 79376 79168 78856 78569 78655 79167 79813 80306 80521 80389 80009
55095H0009j42O81J501J618J011K45k43k80K45J103J477Q09k41n35j30j46q74
$$ 80009 79867 80548 82049 83667 84678 84923 84680 84400 84645 85748 87225 88034 87793 87258 87128 86982 86108
55078H6108j159k51Q53P72l28j115r10k02L41N17L81J29J30N03O75mj251k020
$$ 86108 84949 84698 85551 86323 85995 84880 83970 83768 84109 84626 85007 85136 85266 85769 86444 86440 85189 83169
55060H3169j705p54m1J5l37n09j49M70O84K76j93j72R7N1k58k96K6K17J3k73l43
$$ 83169 81464 80710 80669 80684 80347 79838 79689 80159 80843 81119 80926 80754 80851 80902 80644 80348 80374 80591 80604 80331 79988
55039G9988l02k63l8M81J011J221J145R63O02r4r17j315j000k94K38M20N75R26
$$ 79988 79686 79423 79385 79866 80877 82098 83243 84206 84808 84714 83797 82482 81482 81188 81426 81846 82421 83347
55021H3347J212J062O25L92M25J61p48j749j902r52L76J083P68j90j009j135n70
$$ 83347 84559 85621 86246 86638 87063 87224 86476 84727 82825 81873 82249 83332 84100 83910 82901 81766 81196
55004H1196K63R49J246J084O87N78R93J319P33n85j455j215m74L3N52J515K269
$$ 81196 81459 82408 83654 84738 85425 86003 86996 88315 89048 88463 87008 85793 85319 85352 85904 87419 89688
54987H9688J717M4j219j046m3N52L58m4lN67J256J566J383J072R82R34N10k26
$$ 89688 91405 91449 90230 89184 89141 89693 90051 90007 90004 90571 91827 93393 94776 95848 96830 97764 98274 98048
54969I8048p89j002j149j290j004j03Q65J304J369J594J886J604N71n04q91p09
$$ 98048 97259 96257 95108 93818 92814 92711 93576 94880 96249 97843 99729 101333 101904 101400 100509 99800
54953I9800o34r45j266j171p23k55N3K48L58L53K63J95K08K89L56K81j3l12k30
$$ 99800 99166 98221 96955 95784 95061 94806 94859 95107 95465 95818 96081 96276 96484 96773 97129 97410 97397 97085 96855
54934I6855L22Q68Q77L76j83m34k28M74J420J964J776J445J757K485K709K301
$$ 96855 97177 98045 98922 99298 99115 98681 98453 98927 100347 102311 104087 105532 107289 109774 112483 114784
54918A14784K160K744L407L588L722M279M726M364L550L145L128K685J479j0j346
$$ 114784 116944 119688 123095 126683 130405 134684 139410 143774 147324 150469 153597 156282 157761 157751 156405
54903A56405k526l584m389m920n153m834l878k852k425k427k106j266n37m58q85
$$ 156405 153879 150295 145906 140986 135833 130999 127121 124269 121844 119417 117311 116045 115508 115050 114165
54888A14165j350j518j248p15l58l07K8J157K480K869K203J522J501J692J508
$$ 114165 112815 111297 110049 109334 108976 108669 108697 109854 112334 115203 117406 118928 120429 122121 123629
54873A23629J219J463K371L563M612N149M940M165L336K682J926Q25m54j651k677
$$ 123629 124848 126311 128682 132245 136857 142006 146946 151111 154447 157129 159055 159880 159426 157775 155098
54858A55098l455l887m188m716n327n404m751l930l427l042k498k122k348k929
$$ 155098 151643 147756 143568 138852 133525 128121 123370 119440 116013 112971 110473 108351 106003 103074
54844A03074l162k715j816q27lM39M31K29K20N64J080J394J155L80m18o59l89
$$ 103074 99912 97197 95381 94554 94551 94990 95421 95650 95870 96434 97514 98908 100063 100443 100025 99366 98977
54827I8977j66k57l70k40%K56P48J489J902J476N07k19l38j09J22K69L92M75M06
$$ 98977 98811 98554 98184 97944 97944 98200 98948 100437 102339 103815 104322 104103 103765 103656 103778 104047 104439 104914 105320
54808A05320J05k62l11J03N16L64k22n95n55n16o05l28M64J037P41ml33q9K54
$$ 105320 105425 105163 104852 104955 105471 105835 105613 105018 104463 103947 103342 103014 103478 104515 105256 105252 104919 104830 105084
54789A05084M88P10P35K14o32j052n88N06J635K259K009R62j36m08K04Q62P82
$$ 105084 105572 106282 107017 107231 106599 105547 104959 105465 107100 109359 111368 112330 112194 111786 111990 112852 113634
54772A13634R9l60O0J258K519L176L125K688K127J552J294J864L324M974N955
$$ 113634 113733 113373 113433 114691 117210 120386 123511 126199 128326 129878 131172 133036 136360 141334 147289
54757A47289N888M916L477K272J854J935J555K98j112j925k414l206m156m664
$$ 147289 153177 158093 161570 163842 165696 167631 169186 169484 168372 166447 164033 160827 156671 152007
54743A52007m746m805m694l963k970k623k920k797j731n79l02o62p61l37J43L89
$$ 152007 147261 142456 137762 133799 130829 128206 125286 122489 120758 120179 119877 119215 118454 118117 118260 118649
54727A18649O09J071J627J848J537J116J371K462L449L327K360J755J979K314
$$ 118649 119258 120329 121956 123804 125341 126457 127828 130290 133739 137066 139426 141181 143160 145474
54713A45474K232K266K913L482K906J270l19j210j762k468l227l644l554l132
$$ 145474 147706 149972 152885 156367 159273 160543 160224 159014 157252 154784 151557 147913 144359 141227
54699A41227k714k680l153l822m192m011l252j920k17J222J703J199L65j87m31
$$ 141227 138513 135833 132680 128858 124666 120655 117403 115483 115266 116488 118191 119390 119755 119568 119137
54684A19137o53j006j401j636j509j007m51k69m86o63m88k10k91p89j267j349
$$ 119137 118484 117478 116077 114441 112932 111925 111474 111205 110719 110056 109568 109358 109067 108278 107011 105662
54668A05662j021m75J45O45P12K03m73o59j67M33M98N1l74m32k11J84P82J409
$$ 105662 104641 104166 104311 104956 105668 105871 105398 104739 104572 105005 105503 105554 105180 104748 104537 104721 105503 106912
54650A06912J578J040K15k29q8L19O17O22K90k31n51l82L9J59j88o09p38p16r01
$$ 106912 108490 109530 109745 109516 109428 109747 110364 110986 111276 111045 110494 110112 110151 110310 110122 109513 108775 108059 107158
54631A07158j289j543j450j103o56j00N95J244J506J243P22L59K53J60l8j16Q4
$$ 107158 105869 104326 102876 101773 101117 101017 101612 102856 104362 105605 106327 106686 106939 107099 107061 106945 107029
54614A07029K33m6n11n29o6J77j45l94R9Q75Q88L5p03o84m13n50q50o71q4K32
$$ 107029 107262 107216 106705 106176 106110 106287 106142 105748 105847 106722 107610 107645 106942 106258 105845 105295 104445 103774 103690 103922
54594A03922M8j52m0P8j29m17l60l8P1j21p8O64J788K397J937P46l13o76l85K02
$$ 103922 103970 103818 103778 103856 103727 103310 102950 102912 102983 102862 102784 103448 105236 107633 109570 110316 110003 109327 108942 109144
54574A09144P61J050R32N01P3j26j23l3Q8J40kk24j84J44K95L9j30L03R07Q28
$$ 109144 109905 110955 111887 112388 112461 112335 112212 112179 112267 112407 112405 112181 111997 112141 112436 112475 112345 112648 113555 114383
54554A14383J34j17O47J627J683O89n44j233j122l92L93N66N0m13k21J82o1q53
$$ 114383 114517 114400 115047 116674 118357 119046 118502 117269 116147 115755 116148 116714 116764 116351 116130 116312 116251 115398
54536A15398j129l18Q62J401J246J101J318J486J119L55k16k01K43N93M23k35
$$ 115398 114269 113951 114813 116214 117460 118561 119879 121365 122484 122839 122623 122422 122665 123258 123681 123446
54520A23446q69q80j31Q38J269R45L38q8m69j236k249k734k123p10O51J307J155
$$ 123446 122577 121697 121566 122404 123673 124618 124956 124868 124399 123163 120914 118180 116057 115347 115998 117305 118460
54503A18460N49k9k86l07l24k92L7O64J189J206O23m15j522j975j185M69J741
$$ 118460 119009 118980 118694 118387 118063 117771 117808 118472 119661 120867 121490 121075 119553 117578 116393 116862 118603
54486A18603J815J109M95J74k13p36j080j091q97o27m11m31n28q4J146K322K411
$$ 118603 120418 121527 122022 122196 121983 121247 120167 119076 118179 117552 117141 116710 116182 116098 117244 119566 121977
54469A21977J562Q45P28O82L29K4K4p1n63j011q23m8Q54J539J713J144J92k13
$$ 121977 123539 124384 125112 125794 126123 126147 126171 126100 125537 124526 123703 123655 124509 126048 127761 128905 129097 128884
54451A28884K66P48L28n02n05M27J019L71q21j246n91K82N07Q0l94m61k31j38
$$ 128884 129150 129898 130226 129724 129219 129646 130665 131036 130215 128969 128378 128660 129167 129247 128853 128392 128161 128023
54433A28023m56j055j529j471p73J93P17L85l57o06m7P10J050J128J376J611J301
$$ 128023 127567 126512 124983 123512 122739 122932 123649 124034 123677 123071 123024 123734 124784 125912 127288 128899 130200
54416A30200N70K41O99J297J176L14o13j092j120q57l94J11L53J38l74p68p09
$$ 130200 130770 131011 131710 133007 134183 134497 133884 132792 131672 130815 130421 130532 130885 131023 130649 129881 129172
54399A29172j82M62P72N85J91R7N05J095J348J119P58O77Q28P86L02l45n98k38
$$ 129172 128990 129452 130224 130809 131000 131097 131602 132697 134045 135164 135922 136599 137427 138213 138515 138170 137572 137334
54381A37334L98P55N49l2n72p71o13k42K20O94R90Q06P4p55j029n95kJ75O8K19
$$ 137334 137732 138487 139036 139004 138432 137661 137048 136806 137026 137720 138710 139516 139590 138835 137806 137211 137209 137384 137452 137671
54361A37671P04R41N74L7n1K46M07K90J36j08p61j564j637o75L84N25k3k23K33
$$ 137671 138375 139316 139890 139927 139876 140122 140529 140819 140955 140847 140086 138522 136885 136210 136594 137119 137096 136873 137106
54342A37106O51M66q4n32q05r86j003q48p43p61n97p0M38L93j52n88m94l0L72
$$ 137106 137757 138223 138139 137607 136802 135816 134813 133965 133222 132461 131864 131794 132232 132625 132473 131885 131391 131361 131733
54323A31733N08M99N68P86J102J441J774K022K064J867J528J145P17K74q1l92
$$ 131733 132241 132740 133308 134094 135196 136637 138411 140433 142497 144364 145892 147037 147754 148028 147947 147555
54307A47555q48j432j718j390p79n07p23j065j289j480j649j601j291r19n63q0
$$ 147555 146707 145275 143557 142167 141388 140881 140158 139093 137804 136324 134675 133074 131783 130864 130301 130221
54291A30221M91Q58Q86P67O07K53l22p68p81m43o8J42J31PO8M42P15L35n37j069
$$ 130221 130712 131570 132456 133223 133830 134083 133761 132993 132212 131769 131701 131843 131974 131981 132049 132491 133206 133541 133004 131935
54271A31935q52k86K40R23J856K403J933Q05OJM36P94Q67O62K98p5m26p74r00
$$ 131935 131083 130797 131037 131960 133816 136219 138152 138957 138963 138964 139400 140194 141061 141723 142021 141946 141520 140746 139846
54252A39846n00K56P64Q10P85P77K58q57j560j019J28O40L28j10m18q14r67l01
$$ 139846 139346 139602 140366 141176 141961 142738 142996 142139 140579 139560 139688 140328 140656 140546 140128 139314 138347 138046
54234A38046P48J031M23K7L38M65k87j207j335q74n97n61l45n9j58n57p77p57
$$ 138046 138794 139825 140248 140275 140613 141078 140791 139584 138249 137375 136778 136217 135872 135813 135655 135098 134321 133564
54216A33564p89p48j36J061K145K476K019J091L6p36q27k82K71J24p82j754j986
$$ 133564 132775 132027 131891 132952 135097 137573 139592 140683 140719 139983 139156 138874 139145 139269 138487 136733 134747
54199A34747j333m01J50K62K48K10Qk16n2N34J013R57N48K21J38K32M14N30L86
$$ 134747 133414 133013 133163 133425 133673 133883 133891 133675 133623 134157 135170 136127 136675 136896 137034 137266 137680 138210 138596
54180A38596L8k58m65p14p94k94N39P92J51n08l87P0j0m74m76Q2M77L10j41o65
$$ 138596 138634 138376 137911 137197 136403 136109 136648 137440 137591 137083 136696 136766 136756 136282 135806 135888 136365 136675 136534 135869
54160A35869j279j622j167k16K91J21K8L69M23k77r05m96N28R61N13m5k31k78
$$ 135869 134590 132968 131801 131585 131876 131997 132025 132394 132817 132540 131635 131139 131667 132628 133141 133096 132865 132587
54142A32587j83O01K087L091K425M79j034r33K49J052P85Q2j37J29J39m46j039
$$ 132587 132404 133005 135092 138183 140608 141087 140053 139120 139369 140421 141206 141288 141151 141280 141419 140973 139934
54125A39934r00m6Q87J444J648J650J463J064N07j43p53j013p14r3L27M06N08
$$ 139934 139034 138988 139875 141319 142967 144617 146080 147144 147651 147508 146755 145742 145028 144935 145262 145668 146176
54108A46176Q59J092P69R3l17k62j27j69q3M36J050J053K63p39j257j132o43l6
$$ 146176 147035 148127 148896 148989 148672 148410 148283 148114 148031 148467 149517 150570 150833 150094 148837 147705 147062 147026
54090A47026O67J377J748J414M18o51j075o26K76J055J519J854K217K500K527
$$ 147026 147693 149070 150818 152232 152650 151999 150924 150298 150574 151629 153148 155002 157219 159719 162246
54075A62246K259J789J243P06J61m69j059j173n05N62J211J133Q84J064J531J742
$$ 162246 164505 166294 167537 168243 168404 167935 166876 165703 165198 165760 166971 168104 168988 170052 171583 173325
54059A73325J636J650J936K100J804J253Q48O49N12N19R97K000L096L735L793
$$ 173325 174961 176611 178547 180647 182451 183704 184552 185201 185713 186232 187229 189229 192325 196060 199853
54044A99853L558L292L009K788L003L897N086N868O119O405P060P623P489O739
$$ 199853 203411 206703 209712 212500 215503 219400 224486 230354 236473 242878 249938 257561 265050 271789
54030B71789N944N426N163N115N122M627L220J389J65m0K75N34O25M82j04r99
$$ 271789 277733 283159 288322 293437 298559 303186 306406 307795 307960 307920 308195 308729 309354 309836 309732 308733
54014C08733j646j886k312l383m602n205n201n154n200m934m267l731l772m154
$$ 308733 307087 305201 302889 299506 294904 289699 284498 279344 274144 269210 264943 261212 257440 253286
54000B53286m251l742k886k186j876j705j329q59o99q42p77l13J2j95l59L80J896
$$ 253286 249035 245293 242407 240221 238345 236640 235311 234452 233753 232911 232134 231821 231833 231638 231279 231659 233555
53983B33555L167L624L732M142M812N198M943M143L126K075P94j039l205m861
$$ 233555 236722 240346 244078 248220 253032 258230 263173 267316 270442 272517 273311 272272 269067 264206
53969B64206n458n485n701n912n252l596j913j006p33o02m46j40N19J267J418
$$ 264206 258748 253263 247562 241650 236398 232802 230889 229883 229150 228548 228102 227962 228481 229748 231166
53954B31166Q97N93J050J573J382R97J522K915M022M210L974L915M073M395N025
$$ 231166 232063 232656 233706 235279 236661 237658 239180 242095 246117 250327 254301 258216 262289 266684 271709
53939B71709N755N911N256M486M373M850N307N487N591N815O080O207O039N499
$$ 271709 277464 283375 288631 293117 297490 302340 307647 313134 318725 324540 330620 336827 342866 348365
53925C48365M757M168L975M115M444M838N063M815M206L907M484N715O819P301
$$ 348365 353122 357290 361265 365380 369824 374662 379725 384540 388746 392653 397137 402852 409671 416972
53911D16972P228O841O224N406M500L522K321Q37o39j684k250k704l315l836l905
$$ 416972 424200 431041 437265 442671 447171 450693 453014 453851 453212 451528 449278 446574 443259 439423 435518
53896D35518l764m152n324o539o996o954p381q550r619r792r259q683q214p576
$$ 435518 431754 427602 422278 415739 408743 401789 394408 385858 376239 366447 357188 348505 340291 332715
53882C32715o852o500o607o604n958m802l719l151l114l391l765m103m337m360
$$ 332715 325863 319363 312756 306152 300194 295392 291673 288522 285408 282017 278252 274149 269812 265452
53868B65452m005l218k331j932k315l083l497l202k514j907j470j067q77j326
$$ 265452 261447 258229 255898 253966 251651 248568 245071 241869 239355 237448 235978 234911 234034 232708
53854B32708k373l242l208k422j610j121o67k1N51O93M29qn01q99q90l45L17N69
$$ 232708 230335 227093 223885 221463 219853 218732 218065 218044 218595 219288 219717 219709 219208 218309 217419 217074 217391 217960
53836B17960M91N94R88J138P02J77L61J319K257K446J945J362J162J392J928K655
$$ 217960 218451 219045 220033 221171 221873 222050 222411 223730 225987 228433 230378 231740 232902 234294 236222 238877
53820B38877L394L920M232M632N398O433P382Q067Q603R096R347Q919P454N042
$$ 238877 242271 246191 250423 255055 260453 266886 274268 282335 290938 300034 309381 318300 325754 330796
53806C30796K328J45j101j684k072k311k104j348k98P60J638K078J839J131N59
$$ 330796 333124 333269 332168 330484 328412 326101 323997 322649 322351 323111 324749 326827 328666 329797 330356
53791C30356M36M04j6p36j258j296r64m74pJ32m07j582k860l702m112m534n189
$$ 330356 330792 331196 331180 330444 329186 327890 326926 326452 326445 326577 326170 324588 321728 318026 313914 309380 304191
53774C04191n725n640m969m275l951l840l704l645l752l657k966j994j440j388
$$ 304191 298466 292826 287857 283582 279631 275791 272087 268442 264690 261033 258067 256073 254633 253245
53760B53245j257p51k07J95P89J603J937J306L00k26l11n66j036j241j217j619
$$ 253245 251988 251237 251030 251225 252014 253617 255554 256860 257160 256934 256623 256057 255021 253780 252563 250944
53744B50944k636l512l461k630j890j867k364k576j898o25L13M70L78O06Q02L33
$$ 250944 248308 244796 241335 238705 236815 234948 232584 230008 228110 227485 227798 228268 228646 229252 230054 230387
53728B30387m76o15J19Q60J017R56J088J116P09K32J43K43J57J46O88J500J775
$$ 230387 229911 229296 229415 230275 231292 232248 233336 234452 235161 235393 235536 235779 235936 236082 236770 238270 240045
53711B40045J326Q52R53J439J811K004K282K644K643J919P93J56N73J591K194
$$ 240045 241371 242223 243176 244615 246426 248430 250712 253356 255999 257918 258711 258867 259440 261031 263225
53696B63225K013J726K058K784L044K518J767J419J405J144L42o18j036n93K90
$$ 263225 265238 266964 269022 271806 274850 277368 279135 280554 281959 283103 283445 282827 281791 281198 281488
53681B81488Q06N09l19r96j063n98j22j84r09j829k306k112j492p08J68R66J308
$$ 281488 282294 282803 282484 281488 280425 279827 279705 279521 278612 276783 274477 272365 270873 270165 270333 271299 272607
53664B72607J026M05k07p54j194j179m50N61J034O64l5l79j78K99P20R44R95R43
$$ 272607 273633 274038 273831 273077 271883 270704 270254 270815 271849 272513 272478 272099 271921 272220 272940 273884 274879 275822
53646B75822P36K50m25q22n09L40J037J162J003J122J598J956J836J466J362J646
$$ 275822 276558 276808 276383 275561 275052 275392 276429 277591 278594 279716 281314 283270 285106 286572 287934 289580
53630B89580J903J814J701K117L037L719L525K593J617J211J591K574L601L994
$$ 289580 291483 293297 294998 297115 300152 303871 307396 309989 311606 312817 314408 316982 320583 324577
53616C24577L546K794K426K497K546K356K283K693L448M073M258L987L416K784
$$ 324577 328123 330917 333343 335840 338386 340742 343025 345718 349166 353239 357497 361484 364900 367684
53602C67684K368K286K328K156J742J439J519J669J242J20r46j100m21J94J11
$$ 367684 370052 372338 374666 376822 378564 380003 381522 383191 384433 384553 383607 382507 382086 382280 382391
53587C82391m35r11j211j509j708j486q30j36K35K87K14J12j18o21j316j709j254
$$ 382391 381956 381045 379834 378325 376617 375131 374301 374165 374400 374687 374901 375013 374895 374274 372958 371249 369995
53570C69995o4R86J165P25M51N65N62J94m4L14R12J041P23P56J587K592K858K395
$$ 369995 369931 370917 372082 372807 373258 373823 374385 374579 374535 374849 375761 376802 377525 378281 379868 382460 385318 387713
53552C87713K145K771L861M588M744M763M902N028N153N552O195O642O776P077
$$ 387713 389858 392629 396490 401078 405822 410585 415487 420515 425668 431220 437415 444057 450833 457910
53538D57910P762Q226P921P308P203P500P434O942O802P330P932Q190Q561R444
$$ 457910 465672 473898 481819 489127 496330 503830 511264 518206 525008 532338 540270 548460 557021 566465
53524E66465J0382J0831J1140J1966J3118J3820J4000J4447J5650J7177J8411
$$ 566465 576847 587678 598818 610784 623902 637722 651722 666169 681819 698996 717407
53513G17407J9325K0155K0780K0855K0403J9934J9960K0527K1175K1341K0882
$$ 717407 736732 756887 777667 798522 818925 838859 858819 879346 900521 921862 942744
53502I42744K0194J9699J9372J8927J8468J8455J8935J9198J8581J7329J6276
$$ 942744 962938 982637 1002009 1020936 1039404 1057859 1076794 1095992 1114573 1131902 1148178
53491A148178J5789J5532J5174J4855J4758J4690J4450J4282J4512J4875J4676
$$ 1148178 1163967 1179499 1194673 1209528 1224286 1238976 1253426 1267708 1282220 1297095 1311771
53480A311771J3709J2552J1727J0914R349O875M311K650K094J934J274k71k466
$$ 1311771 1325480 1338032 1349759 1360673 1370022 1376897 1381208 1383858 1385952 1387886 1389160 1388889 1386423
53467A386423m838o988q602r458r632r583r805j0405j1180j1980j2776j3396j3638
$$ 1386423 1381585 1374597 1365995 1356537 1346905 1337322 1327517 1317112 1305932 1293952 1281176 1267780 1254142
53454A254142j3695j4085j4953j5711j5710j4981j3973j2889j1666j0505r794
$$ 1254142 1240447 1226362 1211409 1195698 1179988 1165007 1151034 1138145 1126479 1115974 1106180
53443A106180r451q843p564n987m773m073l457k514j237J02J364K629L954N106
$$ 1106180 1096729 1087886 1080322 1074335 1069562 1065489 1062032 1059518 1058281 1058383 1059747 1062376 1066330 1071436
53429A071436N705N813O101P171Q798J0186J1034J1923J3459J5387J6921J7749
$$ 1071436 1077141 1082954 1089055 1096226 1105024 1115210 1126244 1138167 1151626 1167013 1183934 1201683
53417A201683J8318J9177K0420K1867K3429K5049K6499K7556K8397K9521L1223
$$ 1201683 1220001 1239178 1259598 1281465 1304894 1329943 1356442 1383998 1412395 1441916 1473139
53406A473139L3237L5048L6378L7383L8414L9743M1316M2691M3379M3424M3453
$$ 1473139 1506376 1541424 1577802 1615185 1653599 1693342 1734658 1777349 1820728 1864152 1907605
53395A907605M3873M4273M4018M3249M2700M2542M2064M0700L8757L6803L4915
$$ 1907605 1951478 1995751 2039769 2083018 2125718 2168260 2210324 2251024 2289781 2326584 2361499
53384B361499L3008L1335L0030K8521K6118K2966J9760J6762J3738J0709P938
$$ 2361499 2394507 2425842 2455872 2484393 2510511 2533477 2553237 2569999 2583737 2594446 2602384
53373B602384N128J524l008p701j1959j6136k0832k5969l0883l4939l7797l9485
$$ 2602384 2607512 2609036 2606028 2598327 2586368 2570232 2549400 2523431 2492548 2457609 2419812 2380327
53361B380327m0532m1599m2721m3265m2896m2070m1284m0397l9171l7943l7160
$$ 2380327 2339795 2298196 2255475 2212210 2169314 2127244 2085960 2045563 2006392 1968449 1931289
53350A931289l6614l5917l5389l5716l6722l7332l6871l5757l4679l3691l2452
$$ 1931289 1894675 1858758 1823369 1787653 1750931 1713599 1676728 1640971 1606292 1572601 1540149
53339A540149l0906k9282k7634k5781k3673k1503j9522j7913j6812j6230j5891
$$ 1540149 1509243 1479961 1452327 1426546 1402873 1381370 1361848 1343935 1327123 1310893 1295002
53328A295002j5341j4346j3145j2188j1677j1443j1261j1008j0536r651q458p430
$$ 1295002 1279661 1265315 1252170 1239982 1228305 1216862 1205601 1194593 1184057 1174406 1165948 1158518
53316A158518o816o136m750k807j197m72k43K64J464L237N148O711P847R105J0943
$$ 1158518 1151702 1145566 1140816 1138009 1136812 1136340 1136097 1136361 1137825 1141062 1146210 1152921 1160768 1169873 1180816
53301A180816J2833J3751J3763J4210J5870J7754J8463J8077J7758J7978J8150
$$ 1180816 1193649 1207400 1221163 1235373 1251243 1268997 1287460 1305537 1323295 1341273 1359423
53290A359423J7867J7431J7059J6398J5160J3604J2203J1186J0458R591P943N331
$$ 1359423 1377290 1394721 1411780 1428178 1443338 1456942 1469145 1480331 1490789 1500380 1508323 1513654
53278A513654K439O4j900m025o097p335p882q937j1090j3503j5359j7099j9384
$$ 1513654 1516093 1516157 1514257 1510232 1504135 1496800 1488918 1479981 1468891 1455388 1440029 1422930 1403546
53265A403546k1669k2794k2600k1994k1667k1674k2068k2984k4004k4352k3910
$$ 1403546 1381877 1359083 1336483 1314489 1292822 1271148 1249080 1226096 1202092 1177740 1153830
53254A153830k3428k3427k3532k3190k2553k2214k2327k2463k2140k1315k0411
$$ 1153830 1130402 1106975 1083443 1060253 1037700 1015486 993159 970696 948556 927241 906830
53243I06830k0030k0450k1267k1642k1096j9943j8816j7977j7218j6263j5051
$$ 906830 886800 866350 845083 823441 802345 782402 763586 745609 728391 712128 697077
53232F97077j3670j2301j1191j0505j0145r886r679r670r919j0255j0500j0621
$$ 697077 683407 671106 659915 649410 639265 629379 619700 610030 600111 589856 579356 568735
53220E68735j0617j0441j0227j0339j0894j1387j1152j0258r425r018q580p680
$$ 568735 558118 547677 537450 527111 516217 504830 493678 483420 473995 464977 456397 448717
53208D48717o715o378o596o627o126n579n572o091o613o610n943n091m894n641
$$ 448717 442002 435624 429028 422401 416275 410696 405124 399033 392420 385810 379867 374776 369882 364241
53194C64241o450o196m992m108m230m618m386l797l556l496k853j620p25q40j653
$$ 364241 357791 351595 346603 342495 338265 333647 329261 325464 321908 318412 315559 313939 313214 312374 310721
53179C10721k416k670k408j937j681j770j897j850j920k295k453j809q16m90r19
$$ 310721 308305 305635 303227 301290 299609 297839 295942 294092 292172 289877 287424 285615 284799 284309 283390
53164B83390j194r54r12j431j598n74R32J428N47p23j425j428r94m12j29n14j247
$$ 283390 282196 281242 280330 278899 277301 276727 277659 279087 279634 278911 277486 276058 275064 274652 274523 274009 272762
53147B72762j494q84N9N98M63k23j209k057k258j765j161r99j161j193j015r09
$$ 272762 271268 270384 270443 271041 271504 271281 270072 268015 265757 263992 262831 261832 260671 259478 258463 257554
53131B57554r16o86j10L20R6n42q19m56l4j53n38n25j48j55q22j432j295o90l91
$$ 257554 256638 255952 255842 256162 256258 255716 254897 254441 254407 254254 253716 253191 253043 252888 252066 250634 249339 248649 248258
53112B48258n85r02j151j403j501j202p76p95j219j312p21n0q1p70j361j184k14
$$ 248258 247673 246771 245620 244217 242716 241514 240738 239943 238724 237412 236691 236641 236560 235790 234429 233245 233031
53095B33031R05J253M76o61j025n40l01j000j927k030j348o93l49J20Q81J500
$$ 233031 233936 235189 235665 235004 233979 233439 233138 232138 230211 228181 226833 226140 225791 225911 226792 228292
53079B28292J605J295P43n8r82j621j638j065j71O68J063Q65L62j4j40j37l8J21
$$ 228292 229897 231192 231935 231877 230895 229274 227636 226571 226400 227068 228131 228996 229358 229344 229204 229067 229029 229150
53061B29150P6l29o67l83K88N39J91J7N69J284J232L17p17j212j089o00MN56R73
$$ 229150 229226 228897 228230 227847 228135 228674 228865 228882 229451 230735 231967 232284 231567 230355 229266 228666 228670 229226 230199
53042B30199J186J121Q57P90J216J764J635O27n50j172j277j209r57m59j83o36
$$ 230199 231385 232506 233363 234153 235369 237133 238768 239395 238845 237673 236396 235187 234230 233771 233588 232952
53026B32952j478j797j326p53o52o72j40Q47J434J106L74J67P13J311J288P92
$$ 232952 231474 229677 228351 227598 226946 226274 226134 226981 228415 229521 229895 230062 230775 232086 233374 234166
53010B34166L65O0m18q54n53N03J257Q45k30p80l94L59Q80J048R03M91K5k94n52
$$ 234166 234531 234591 234173 233319 232766 233269 234526 235371 235141 234361 233967 234326 235206 236254 237157 237648 237673 237379 236827
52991B36827q29q20k93K49J04m97n67K03R75J014O22M88O77Q55R28R83Q96N74
$$ 236827 235998 235178 234885 235134 235238 234741 234174 234377 235352 236366 236988 237476 238153 239008 239936 240919 241815 242389
52973B42389K75K67L92M27N78J081J545J386P50M15P19J195J347J252J099P51
$$ 242389 242664 242931 243323 243750 244328 245409 246954 248340 249090 249505 250224 251419 252766 254018 255117 255868
52957B55868J25l93l49Q5L27J31k01m09o29j029j412j487j357j413j754k042j925
$$ 255868 255993 255600 255251 255336 255663 255794 255593 255184 254555 253526 252114 250627 249270 247857 246103 244061 242136
52940B42136j430p39R0R43J407J070Q8q51j223j119r36r03r69r94q58n35j84q6
$$ 242136 240706 239967 240057 241000 242407 243477 243565 242714 241491 240372 239436 238533 237564 236570 235712 235177 234993 234907
52922B34907l51p58r86r05o20l72l85o09n83J24J199J620P72p20j610j347m67
$$ 234907 234556 233798 232812 231907 231287 230915 230530 229921 229338 229462 230661 232281 233053 232333 230723 229376 228909
52905B28909K73O61Q57R08O99K54k19m65l74k0L55N39M84K34j99o81q23l63K94
$$ 228909 229182 229843 230700 231608 232307 232561 232342 231877 231503 231483 231838 232377 232861 233095 232896 232215 231392 231029 231323
52886B31323L65k90q51o07O5K83o1k23J81O62P12M77K23l15j368k296k113q36
$$ 231323 231688 231398 230547 229940 230005 230288 230227 230004 230185 230847 231559 232036 232259 231944 230576 228280 226167 225331
52868B25331M03P36M97N01Q97J129P72k6p70j013o30P0N29M49k9o92j513k299
$$ 225331 225734 226470 226967 227468 228365 229494 230266 230240 229470 228457 227827 227897 228426 228875 228846 228154 226641 224342
52850B24342k498j782o79j39m68j097j367j195q97p29p81r75j110j040r07r72
$$ 224342 221844 220062 219383 219244 218776 217679 216312 215117 214220 213491 212710 211735 210625 209585 208678 207706
52834B07706j232j470j593j571j087J22J505J933J077n9m23k58m97j181j391o90
$$ 207706 206474 205004 203411 201840 200753 200875 202380 204313 205390 205331 204908 204650 204153 202972 201581 200891
52818B00891K05M68K16N4R0k4l36m10P1R55J871K499K558J928R73L68L81N33K84
$$ 200891 201096 201564 201780 201834 201924 201900 201564 201154 201225 202180 204051 206550 209108 211036 212009 212377 212758 213291 213575
52799B13575j89k54K01N29J69p05j534k021k119j773j025k82J1p6j23J0R2O3J64
$$ 213575 213386 213132 213333 213862 214031 213326 211792 209771 207652 205879 204854 204572 204583 204507 204384 204394 204486 204549 204713
52780B04713M71O22M14K34N69J227J467R32J35j46K18N86L32m22r62q28k36L28
$$ 204713 205184 205806 206220 206454 207023 208250 209717 210649 210784 210638 210856 211442 211774 211352 210390 209562 209326 209654
52762B09654O74Q55Q81P64O55N91K91l47q04n17J89M13l3m22l18k33o05r51o04
$$ 209654 210328 211183 212064 212828 213483 214074 214365 214018 213214 212697 212886 213299 213266 212844 212526 212293 211688 210737 210133
52743B10133J67N90N08L60L11K16K95R95K088K667K272J433Q57O63O68Q99J344
$$ 210133 210300 210890 211398 211758 212069 212285 212580 213575 215663 218330 220602 222035 222892 223555 224223 225122 226466
52726B26466J574J150K37n44q04o39l03P8M57P66R06P85L88j20m93o79q78j223
$$ 226466 228040 229190 229427 228883 228079 227440 227137 227215 227672 228438 229344 230129 230517 230397 229904 229225 228347 227124
52708B27124j519j442r17k33K52L84L35M68R71J492J380M48o29r65n01m8k36p22
$$ 227124 225605 224163 223246 223013 223265 223649 223984 224452 225423 226915 228295 228743 228114 227149 226648 226600 226364 225642
52690B25642o93R4J134J910K351K494K132J184P9o23q26p56m06L37J043R35l8
$$ 225642 224949 225043 226177 228087 230438 232932 235064 236248 236327 235704 234878 234122 233716 234053 235096 236031 235993
52673B35993q87p77j07J32k85o99o00j69K09L76K57j70n93n03J55P98R81Q83Q34
$$ 235993 235106 234329 234222 234354 234069 233370 232770 232601 232810 233186 233443 233273 232680 232177 232332 233130 234111 234994 235828
52654B35828O71M9p84j059l99P11J438J419R03K92k53p62j213j458j373r69l44
$$ 235828 236499 236548 235764 234705 234306 235017 236455 237874 238777 239069 238816 238054 236841 235383 234010 233041 232697
52637B32697L09O57L90l61r07o51J55O77N56M08R72K063K708K271J093j2n91p16
$$ 232697 233006 233663 234053 233692 232785 232134 232289 232966 233522 233930 234902 236965 239673 241944 243037 243025 242434 241718
52619B41718n56j40M30Q38Q52N65J87k94r49j421j053K77J722K198J489L56l62
$$ 241718 241162 241022 241452 242290 243142 243707 243894 243600 242651 241230 240177 240454 242176 244374 245863 246219 245857
52602B45857m57k22O1L05N56Q85J264J507J387Q95K94j00j39J50O29J078J273
$$ 245857 245400 245178 245239 245544 246100 246985 248249 249756 251143 252038 252332 252232 252093 252243 252872 253950 255223
52585B55223J127Q25P38J194K058K655K341J276L27L0nl57q32p78j32M57N15K25
$$ 255223 256350 257175 257913 259107 261165 263820 266161 267437 267764 267794 267789 267432 266600 265822 265690 266147 266662 266887
52567B66887p1l10m28k73%o5n58r44q96q93j516k479k878k278j050J88R99J159
$$ 266887 266816 266506 266078 265805 265805 265740 265182 264238 263342 262449 260933 258454 255576 253298 252248 252436 253435 254594
52549B54594P33J70p2n4j48l68l44J8L34L20J02j84o42j177j268o17K94P62P82
$$ 254594 255327 255497 255425 255371 255223 254855 254511 254529 254863 255183 255285 255101 254459 253282 252014 251397 251691 252453 253235
52530B53235Q86J192J169M44o28j376j474j011k65L22L03k89p85n88O9M35J90
$$ 253235 254121 255313 256482 256926 256298 254922 253448 252437 252172 252494 252797 252508 251723 251135 251204 251639 251829
52513B51829k54l91j13M40J117J752K205K523K800K797K189J218O14N56K73q73
$$ 251829 251575 251184 251071 251511 252628 254380 256585 259108 261908 264705 266894 268112 268726 269282 269555 268682
52497B68682k338l038k738k149j809j523r73k88J71K23q2m88o18k83K08M66N21
$$ 268682 266344 263306 260568 258419 256610 255087 254114 253826 253997 254220 254138 253650 253032 252749 252957 253423 253944
52480B53944N77M14k80j075j077j91O12O03J58m2M4K20P24J732K554K255R77K4
$$ 253944 254521 254935 254655 253580 252503 252312 252924 253527 253685 253643 253687 253907 254631 256363 258917 261172 262149 262173
52462B62173M31J895L173L243K117P77K10L72K86o10j620j771j193q89j275j711
$$ 262173 262604 264499 267672 270915 273032 273809 274019 274391 274677 274067 272447 270676 269483 268594 267319 265608
52446B65608j543r46m56k32j06j6m0j05kL56P76R19O23J32j60k08l72p72r13l17
$$ 265608 264065 263119 262663 262431 262325 262309 262269 262164 262162 262518 263294 264213 264836 264968 264808 264600 264228 263456 262543 262226
52426B62226P07J385J439J195Q99M92J16K09Q26J388J393J036Q21R18J238J811
$$ 262226 262933 264318 265757 266952 267851 268343 268459 268668 269494 270882 272275 273311 274132 275050 276288 278099
52410B78099K662L528M060M307M660N304N964O304O400O602O880O465M463J000
$$ 278099 280761 284289 288349 292656 297316 302620 308584 314888 321288 327890 334770 341235 345698 346698
52396C46698k527m634n164n167n461n794n562m789m009l355k412r26O49J614J871
$$ 346698 344171 339537 334373 329206 323745 317951 312389 307600 303591 300236 297824 296898 297547 299161 301032
52381C01032J983K381K773K628K070J832K230K778L089L514M375N064M774L870
$$ 301032 303015 305396 308169 310797 312867 314699 316929 319707 322796 326310 330685 335749 340523 344393
52367C44393L582M264M902M591L650K830K221J572J102J227J784K167K056J617
$$ 344393 347975 352239 357141 361732 365382 368212 370433 372005 373107 374334 376118 378285 380341 381958
52353C81958J213J278K142L538M574M759M658N047N752O065N933N933O189O267
$$ 381958 383171 384449 386591 390129 394703 399462 404120 409167 414919 420984 426917 432850 439039 445306
52339D45306O199O659P864R082R676R973J0640J1722J2852J3918J5007J5907J6303
$$ 445306 451505 458164 466028 475110 484786 494759 505399 517121 529973 543891 558898 574805 591108
52326E91108J6322J6494J7153J8216J9391K0323K0691K0528K0303K0357K0249
$$ 591108 607430 623924 641077 659293 678684 699007 719698 740226 760529 780886 801135
52315H01135J9173J7052J4887J3762J3773J4043J3720J2657J1285J0074R165Q352
$$ 801135 820308 837360 852247 866009 879782 893825 907545 920202 931487 941561 950726 959078
52303I59078P272N712L930K567K100K261K249J548M09o31j426k126k640k694k367
$$ 959078 966350 972062 975992 978559 980659 982920 985169 986717 987126 986495 985069 982943 980303 977609 975242
52288I75242k145k290k504k421j991j216Q0J864L590M802N829P323R190J0552
$$ 975242 973097 970807 968303 965882 963891 962675 962755 964619 968209 973011 978840 986163 995353 1005905
52274A005905J0894J0735J0876J1379J1735J1727J1716J2040J2554J2894J2898
$$ 1005905 1016799 1027534 1038410 1049789 1061524 1073251 1084967 1097007 1109561 1122455 1135353
52263A135353J2582J1943J1035J0143R536R043Q156O746N386M708M620M527M154
$$ 1135353 1147935 1159878 1170913 1181056 1190592 1199635 1207791 1214537 1219923 1224631 1229251 1233778 1237932
52250A237932L733L337K642J519M60k0j46n18j235j783j898j975k504l297l605
$$ 1237932 1241665 1245002 1247644 1249163 1249623 1249603 1249457 1248939 1247704 1245921 1244023 1242048 1239544 1236247 1232642
52235A232642k915j517k48L48N94J252K495L595L918L850M240N071N476N106M758
$$ 1232642 1229727 1228210 1227962 1228310 1228904 1230156 1232651 1236246 1240164 1244014 1248254 1253325 1258801 1263907 1268665
52220A268665N213O089O506O435O662P471Q207Q331Q188Q355Q651Q410P612P144
$$ 1268665 1273878 1279967 1286473 1292908 1299570 1307041 1315248 1323579 1331767 1340122 1348773 1357183 1364795 1371939
52206A371939P700Q877R581R286Q432P671P029O135N034M272M170M340M165L505
$$ 1371939 1379639 1388516 1398097 1407383 1415815 1423486 1430515 1436650 1441684 1445956 1450126 1454466 1458631 1462136
52192A462136K709K055J495R17L56r1l93n70o56p64j071j681k501l302l948m583
$$ 1462136 1464845 1466900 1468395 1469312 1469668 1469577 1469184 1468614 1467958 1467194 1466123 1464442 1461941 1458639 1454691 1450108
52176A450108n545o890q034q158p124n808n202n293n128m017k358j154r16j219
$$ 1450108 1444563 1437673 1429639 1421481 1414357 1408549 1403347 1398054 1392926 1388909 1386551 1385397 1384481 1383262
52162A383262j287q23j25N23J274K298L135K998J847O52K56L88L07NQ0N69P79
$$ 1383262 1381975 1381152 1381027 1381550 1382824 1385122 1388257 1391255 1393102 1393754 1394010 1394398 1394705 1394710 1394790 1395359 1396138
52145A396138L84j25l05l91o28p07l55J7m6j50M49J782L248M599O077P647Q902
$$ 1396138 1396522 1396397 1396092 1395701 1395073 1394366 1394011 1394028 1393982 1393832 1394281 1396063 1399311 1403910 1409987 1417634 1426536
52128A426536R896J1267J3229J5096J6251J7084J8401K0265K2021K3228K4020
$$ 1426536 1436432 1447699 1460928 1476024 1492275 1509359 1527760 1548025 1570046 1593274 1617294
$$ [...]
##END NTUPLES=NMR SPECTRUM
##END=
