
##TITLE=AC1365_HAWAS12179_7163953_Rh0BGGhK0Q
##JCAMPDX= 6.0         $$ Bruker NMR JCAMP-DX V2.0
##DATA TYPE= NMR SPECTRUM
##DATA CLASS= NTUPLES
##ORIGIN= BRUKER
##OWNER= Administrator
$$ 1.72 TOPSPIN		Version 2.1
$$ 2012-12-01 15:20:06.664 -0500  Administrator@X
$$ Compression mode = diff/dup
##.OBSERVE FREQUENCY= 400.02188249412
##.OBSERVE NUCLEUS= ^1H
##.ACQUISITION MODE= SIMULTANEOUS (DQD)
##.ACQUISITION SCHEME= undefined
##.AVERAGES= 8
##.DIGITISER RES= 22
##SPECTROMETER/DATA SYSTEM= spect
##.PULSE SEQUENCE= zg30
##.SOLVENT NAME= COFFEE_meoh
##.SHIFT REFERENCE= INTERNAL, COFFEE_meoh, 1, 14.98509
##AUDIT TRAIL= $$ (NUMBER, WHEN, WHO, WHERE, PROCESS, VERSION, WHAT)
$$ ##TITLE= Audit trail, TOPSPIN		Version 2.1
$$ ##JCAMPDX= 5.01
$$ ##ORIGIN= Bruker BioSpin GmbH
$$ ##OWNER= Administrator
$$ $$ E:\/data/COFFEE/nmr/AC1365_HAWAS12179_7163953_Rh0BGGhK0Q/10/pdata/1/auditp.txt
$$ ##AUDIT TRAIL=  $$ (NUMBER, WHEN, WHO, WHERE, PROCESS, VERSION, WHAT)
(   1,<2012-12-01 15:19:58.911 -0500>,<Administrator>,<X>,<go>,<TOPSPIN 2.1>,
      <created by zg
	started at 2012-12-01 15:18:36.004 -0500,
	POWCHK enabled, PULCHK disabled,
       configuration hash MD5:
       86 BA 57 50 F2 9D 5C 9B 26 00 A9 28 5F 66 2E 89
       data hash MD5: 64K
       F2 7B A7 90 FC A5 98 98 6F 82 24 E2 63 50 9F 94>)
(   2,<2012-12-01 15:20:02.000 -0500>,<Administrator>,<X>,<proc1d>,<TOPSPIN 2.1>,
      <Start of raw data processing
       efp LB = 0 FT_mod = 6 PKNL = 1 PHC0 = 0 PHC1 = 0 SI = 32K 
       data hash MD5: 32K
       5B 5E 57 4A E3 A7 7F F4 BB 09 D1 39 5F 67 17 4F>)
(   3,<2012-12-01 15:20:02.457 -0500>,<Administrator>,<X>,<proc1d>,<TOPSPIN 2.1>,
      <pk PHC0 = 96.47095 PHC1 = 0 
       data hash MD5: 32K
       11 C4 AC 0E 53 CA D8 2A 8C D0 46 28 2C E6 59 2A>)
(   4,<2012-12-01 15:20:02.692 -0500>,<Administrator>,<X>,<proc1d>,<TOPSPIN 2.1>,
      <abs ABSG = 1 
       data hash MD5: 32K
       EE 7B 6B DF F5 CD CE 7B 2B 75 47 6A C8 E0 74 E5>)
(   5,<2012-12-01 15:20:02.830 -0500>,<Administrator>,<X>,<proc1d>,<TOPSPIN 2.1>,
      <abs ABSG = 2 
       data hash MD5: 32K
       6E 21 92 2F 13 6C 8C FA E2 28 91 17 BA D8 13 2D>)
(   6,<2012-12-01 15:20:02.955 -0500>,<Administrator>,<X>,<proc1d>,<TOPSPIN 2.1>,
      <abs ABSG = 3 
       data hash MD5: 32K
       CE 9F 16 70 C5 EA 19 2E 5E DA 2C B9 CB 36 61 41>)
(   7,<2012-12-01 15:20:03.093 -0500>,<Administrator>,<X>,<proc1d>,<TOPSPIN 2.1>,
      <abs ABSG = 4 
       data hash MD5: 32K
       41 82 43 53 20 96 A6 A1 D4 45 59 DB A9 0C 55 1D>)
(   8,<2012-12-01 15:20:03.218 -0500>,<Administrator>,<X>,<proc1d>,<TOPSPIN 2.1>,
      <abs ABSG = 5 
       data hash MD5: 32K
       3C BD 3C CA 62 99 21 7E 25 52 4E 9E 97 8E 17 F5>)
$$ ##END=
$$ 
$$ $$ hash MD5
$$ $$ 17 81 1D FB D3 5D 06 C5 7A 04 AF 15 74 E1 87 62
##$RELAX= 
##$RELAX= 
##$RELAX= 
##$RELAX= 
##$RELAX= 
##$RELAX= 
##$RELAX= 
$$ Bruker specific parameters
$$ --------------------------
##$DU= <E:\>
##$EXPNO= 10
##$NAME= <AC1365_HAWAS12179_7163953_Rh0BGGhK0Q>
$$ [...]
150 150 150 150 150 150 150 150
##$TP07= 0
##$TPNAME0= <>
##$TPNAME1= <>
##$TPNAME2= <>
##$TPNAME3= <>
##$TPNAME4= <>
##$TPNAME5= <>
##$TPNAME6= <>
##$TPNAME7= <>
##$TPOAL= (0..7)
0.5 0.5 0.5 0.5 0.5 0.5 0.5 0.5
##$TPOFFS= (0..7)
0 0 0 0 0 0 0 0
##$TUNHIN= 0
##$TUNHOUT= 0
##$TUNXOUT= 0
##$USERA1= <user>
##$USERA2= <user>
##$USERA3= <user>
##$USERA4= <user>
##$USERA5= <user>
##$V9= 5
##$VALIST= <valist>
##$VCLIST= <CCCCCCCCCCCCCCC>
##$VD= 0
##$VDLIST= <DDDDDDDDDDDDDDD>
##$VPLIST= <PPPPPPPPPPPPPPP>
##$VTLIST= <TTTTTTTTTTTTTTT>
##$WBST= 1024
##$WBSW= 4
##$XGAIN= (0..3)
0 0 0 0
##$XL= 0
##$YL= 0
##$YMAX_a= 663505
##$YMIN_a= -562946
##$ZGOPTNS= <>
##$ZL1= 120
##$ZL2= 120
##$ZL3= 120
##$ZL4= 120
##$ABSF1= 14.98509
##$ABSF2= -5.573092
##$ABSG= 5
##$ABSL= 3
##$ALPHA= 0
##$AQORDER= 0
##$ASSFAC= 0
##$ASSFACI= 0
##$ASSFACX= 0
##$ASSWID= 0
##$AUNMP= <proc_prof1d_extract_pilot.lims>
##$AXLEFT= 0
##$AXNAME= <>
##$AXNUC= <1H>
##$AXRIGHT= 0
##$AXTYPE= 0
##$AXUNIT= <>
##$AZFE= 0.1
##$AZFW= 0.1
##$BCFW= 0
##$BC_mod= 0
##$BYTORDP= 0
##$COROFFS= 0
##$CY= 15
##$DATMOD= 1
##$DC= 0
##$DFILT= <>
##$DTYPP= 0
##$F1P= 0
##$F2P= 0
##$FCOR= 0.5
##$FTSIZE= 32768
##$FT_mod= 6
##$GAMMA= 0
##$GB= 0
##$INTBC= 1
##$INTSCL= 1
##$ISEN= 128
##$LB= 0
##$LEV0= 0
##$LPBIN= 0
##$MAXI= 10000
##$MC2= 0
##$MEAN= 0
##$ME_mod= 0
##$MI= 0
##$NCOEF= 0
##$NC_proc= -8
##$NLEV= 6
##$NOISF1= 0
##$NOISF2= 0
##$NSP= 0
##$NTH_PI= 0
##$NZP= 0
##$OFFSET= 14.98509
##$PC= 1
##$PHC0= 96.47095
##$PHC1= 0
##$PH_mod= 1
##$PKNL= yes
##$PPARMOD= 0
##$PPDIAG= 0
##$PPIPTYP= 0
##$PPMPNUM= 2147483647
##$PPRESOL= 1
##$PSCAL= 4
##$PSIGN= 0
##$PYNMP= <proc.py>
##$REVERSE= no
##$SF= 400.02
##$SI= 32768
##$SIGF1= 0
##$SIGF2= 0
##$SINO= 400
##$SIOLD= 32768
##$SPECTYP= <>
##$SREGLST= <1H.CDCl3>
##$SSB= 0
##$STSI= 32768
##$STSR= 0
##$SW_p= 8223.68421052631
##$SYMM= 0
##$S_DEV= 0
##$TDeff= 65536
##$TDoff= 0
##$TI= <>
##$TILT= no
##$TM1= 0
##$TM2= 0
##$TOPLEV= 0
##$USERP1= <user>
##$USERP2= <user>
##$USERP3= <user>
##$USERP4= <user>
##$USERP5= <user>
##$WDW= 1
##$XDIM= 32768
##$YMAX_p= 363683967
##$YMIN_p= -791206
##$CURPLOT= <Network HP LaserJet P1505>
##$CURPRIN= <$Network HP LaserJet P1505>
##$DFORMAT= <normdp>
##$LAYOUT= <+/1D_H.xwp>
##$LFORMAT= <normlp>
##$PFORMAT= <normpl>
##$SURQMSG= 1
$$ End of Bruker specific parameters
$$ ---------------------------------
##NTUPLES= NMR SPECTRUM
##VAR_NAME=  FREQUENCY,     SPECTRUM/REAL,   SPECTRUM/IMAG
##SYMBOL=    X,             R,               I
##VAR_TYPE=  INDEPENDENT,   DEPENDENT,       DEPENDENT
##VAR_FORM=  AFFN,          ASDF,            ASDF
##VAR_DIM=   32768,         32768,           32768
##UNITS=     HZ,            ARBITRARY UNITS, ARBITRARY UNITS
##FACTOR=    0.250966925370066, 1,           1
##FIRST=     8223.43324360094, -24734,       -122656
##LAST=      0,             -48863,          -278974
##MIN=       0,             -791206,         0
##MAX=       8223.43324360094, 363683967,    0
$$ Real data points
##PAGE= N=1
##DATA TABLE= (X++(R..R)), XYDATA
$$ [...]
23741 -74040 259968 -17012 53315 -191727 -6787 -48407 -245629 -201482 112653 203169 -161967
23729 -257343 -100401 -97909 -127809 227187 -19359 54678 394943 -35485 -11734 16286 281676
23718 281676 -22502 60979 11280 -200402 -134380 40555 -206362 -81658 104536 -77796 -130804
23707 -130804 128837 -162800 -413535 49182 -23439 81029 238204 -110133 -92682 303262
23696 -165686 -187035 -73677 89735 -130903 186173 -259270 51463 185009 -148870 -297378
23686 -297378 -169366 -138244 -108951 186763 -25112 -259302 -22270 -43428 -86214 -61170 -16666
23674 111690 -111474 115866 -81301 124185 78816 -42455 -27499 -57391 -242570 -25746 -161356
23663 -161356 263054 291483 -300165 6913 -16754 231721 -10329 -35104 162467 83100 -32886
23651 81277 2624 -100299 -127613 181345 18485 16439 157328 223358 223884 180594 21730 235870
23639 235870 228045 229745 175965 447011 336964 237449 165126 168207 -196613 -221115 -17316
23627 -371535 -107475 191243 2267 280135 16526 15451 -70829 105365 -62475 220483 -143278
23615 51039 78757 125459 -1166 -323905 28769 376384 -5412 -194273 79390 211407 -89710
23603 -19714 67433 117159 -333445 -120000 235250 -49202 87024 -38685 169289 76201 -70182
23591 -86877 202410 83178 -143488 -235765 -323985 119622 56984 -14525 179970 201780 89292
23579 -74059 -98700 -445783 64975 -19878 -202691 -38408 182856 56774 -124184 -359311 152452
23567 -280254 -81688 156367 -181904 111379 -31368 37859 -183801 -39978 -18202 -242440
23557 -242440 -147776 -10516 133886 23351 118304 -109120 -423160 212995 -182625 8263 -39540
23545 -110063 -195764 -118848 276569 503482 69532 -270543 -85105 21893 -4001 263867 24628
23533 -163355 7615 -212771 -155429 94055 -184147 326241 312851 -57174 -112568 -30140 -37473
23522 -37473 238766 -28647 -107302 102651 -99462 231124 87715 92529 -51829 7022 148732
23511 148732 287071 -230476 -47138 -248839 -315308 -70049 16766 -165067 82443 -48936 251746
23499 -180235 102613 275493 255489 153194 -287108 51547 457207 -201134 -63027 -121637
23489 -121637 362231 34511 -160021 147802 -15850 104450 -348022 -269099 -196972 -51717
23478 89466 103573 143806 108826 -138532 281145 200126 141147 -69996 -293304 -93513 127249
23466 -253112 -198643 28452 216075 116259 -103568 -186849 -127979 -192808 59910 -249054 -33120
23454 -340107 205745 169071 -41739 -130838 -52887 72799 179837 32180 -86754 -276733 73236
23442 -167787 -327315 349750 126559 77767 -216684 81883 -144996 -313982 -129854 -41635
23431 67724 -108352 -115469 237434 -29437 -74284 211655 205059 46798 85313 -334932 67526
23419 -2761 173312 68354 -104884 -30856 -437534 -229535 -100213 -77372 230164 -109646
23408 -423284 73073 -156263 60145 369657 93229 48975 1203 -101665 -164383 -117525 -51619
23396 -74688 430714 -309437 -57531 80313 80435 13392 101032 28901 -310761 244963 -156252
23384 -20872 49518 -315750 -102336 147004 -60933 -130471 -332350 -321496 -141944 34029 -95329
23372 187177 -27912 -101928 -77404 22511 -396351 -183336 115360 149432 -155674 105573
23361 104863 -199553 108993 -16310 -35549 -180635 62469 50744 -49334 -127744 -227325 -135362
23350 -135362 -73855 -397046 -88002 -64357 68523 -68400 122960 262583 112613 -254964
23339 40683 -24628 213042 178153 -73485 -22447 -151817 -230527 67947 -371174 -57084 110417
23327 -241529 76401 205164 8523 -780 -68725 -326200 287741 -148058 -256437 270479 -374338
23315 -17492 -139436 -230250 -63833 -228092 26197 39524 207012 -275777 -309520 55187 -118354
23303 386212 -192058 -306098 97763 -107051 92302 -178513 -238082 -98439 -19623 -389793
23293 -389793 -41356 -252226 78843 -250439 -81657 -127912 24440 -65803 139289 -195013 372239
23281 225054 223961 -63956 39116 -5515 -57897 -133706 81516 -303872 133390 -104109 92616
23269 -83269 -181209 -84468 2092 -171683 -103555 -393680 -99533 108014 -120227 -35975 -17875
23257 -83089 172211 -200488 46954 116176 138820 -31622 86009 110914 -254548 364853 3016
23245 46012 -103456 90020 195161 120218 -214868 -6712 75212 -229552 68659 280560 -156779
23233 216676 -94938 139777 156854 -91966 -171939 -134739 -278482 -67456 -43114 -240725 -68318
23221 -45441 68388 -22406 -118895 108359 264078 -406030 -35281 -41668 -119239 -16404 405105
23209 156763 225869 -170512 -304034 17316 91569 -277441 -50989 -149827 -298300 -211440 73814
23197 149071 77247 166585 262444 110523 249500 -127865 -202074 65224 52137 -53165 -364584
23186 -364584 197289 -204357 -6082 -124851 -86704 8673 -129689 144484 -67597 70723 -186986
23174 -91763 -152285 145412 -10781 64403 211045 -305822 -2881 -177187 89145 188960 10379
23162 210229 8967 -114122 -49639 -190637 25107 -399662 107420 -59580 170559 -174659
23151 73474 22936 -57422 19511 -6893 -24303 -155942 -99868 147674 -166622 100438 37811
23139 42837 28229 78345 -248673 57586 -209769 256461 -135662 33074 -329322 62438 -81398
23127 72754 -30392 -71266 -47062 31242 -109221 415558 -104937 117441 99217 58768 -95399
23115 266450 -280025 62624 -179564 -494436 19232 51373 63458 242403 -175833 -415421
23105 -415421 -45820 -57190 -107599 -20766 196601 -10704 57307 66663 -175275 27866 81329
23094 81329 -36651 277257 259273 271618 213227 -273514 -296527 35665 36034 15164 -168821
23082 -191373 89578 -487022 -236693 55083 93276 136377 56499 54984 -149658 -43112 -93182
23071 -93182 125933 363656 213756 -148537 7364 98612 137733 -51079 299197 75137 58282
23060 58282 -73466 318541 -55694 -7898 233471 179476 -72761 -34242 6273 -65081 61858 -36875
23047 -194152 104521 82013 52952 92855 82224 106135 -58073 -194901 -88391 67232 -200393
23035 -291650 108115 -259730 -231114 -161380 108754 -27011 -103840 -89485 -177080 56213 15938
23023 -314453 -8354 99827 -62104 -139950 225043 85546 -51721 -19549 18193 -338483 -324166
23012 -324166 15195 -182131 -73682 -97020 37457 -127120 -114228 59728 23799 -240867 50840
23000 -301526 147977 -55541 -106636 -65759 -200599 -122460 -202913 -164902 16611 -53101 -5335
22988 -79075 -69974 5325 -70905 78724 -200927 -146558 -539302 -56618 86445 -70258 -323348
22977 -323348 256198 110472 39584 26074 75438 -88999 -248620 -256394 -164378 1982 274220
22966 274220 -232138 133477 274052 133545 -53158 -14194 -367996 -307987 26510 -325228
22955 219481 174323 154017 147342 60846 -385922 132174 -177190 120453 -193683 52943 1913
22943 5440 23282 129457 -26825 169666 534403 -238268 48633 -144117 345512 50074 -66618
22931 -93287 191034 8287 208870 -158781 -105446 -2713 1271 -6725 64903 -132751 111140
22919 173559 266822 96930 -151255 148337 -375311 -189233 112255 89949 414219 42600
22908 416427 18056 132210 68782 -143929 -209398 -114156 -76608 -190657 -12952 -173555 -193546
22897 -193546 130864 -17326 -145222 16951 -4503 -232128 -166423 121835 87393 4417 33317
22886 33317 -403700 -243641 -187144 -91241 -247136 80278 -73914 261786 -194413 176958
22875 160362 2252 121102 117663 -1519 -346682 -147811 155886 -109793 106397 -247678 -211895
22864 -211895 -50012 142721 -73118 56962 -100416 137963 -107841 -91657 258665 118071
22853 -43675 173346 -179425 -194731 -162045 21693 12053 373 316359 -52776 -352804 -105572
22841 -47368 -497698 -165654 -382279 -106346 -248085 -55478 -264459 -4316 -81440 -48737 -352748
22830 -352748 -51155 -97082 184766 -60105 -27231 -123912 -1698 15347 231331 -144988 53503
22818 -242378 -240530 -186554 -21663 -202495 -211913 -269156 -179972 -230087 -23474 56769 215017
22807 215017 -81014 40329 18804 10300 10229 -361226 54344 176506 130240 -27384 -189076 187134
22794 -386480 262925 -180151 -51910 113553 324724 102457 -246842 -21169 181794 -234289
22783 231847 -121423 277186 -157019 97355 -36584 -186544 -432366 -154701 -178157 175610
22772 -83423 -380337 174103 -5320 34267 -175725 91724 131188 9255 -132585 -10853 -113766
22761 -113766 -140370 15479 33991 -60924 227027 -147612 -152182 120443 -185458 -59845 -213709
22750 -213709 -340849 -165984 -51220 -189332 -103503 12199 28863 21526 35953 30141 -250731
22738 -233890 -17508 -129134 -108719 139359 161112 -109941 -98827 -235442 -164172 -426726
22728 -426726 -141642 38324 -17913 805 108555 -9136 38521 -146916 192512 -254444 -36575
22716 64576 176844 -7830 458891 114161 341263 56578 -36070 -47131 -159615 -42896 -220322
22705 -220322 -115509 -14663 87826 -357105 -206101 -356238 208861 -18347 -265010 109470
22694 -174371 10720 -54495 -205700 -216468 -92144 -188293 -44853 -236780 264768 560806 -64733
22682 233365 -135477 -385862 -107115 79062 -212191 115764 -416419 -111244 -174752 48433
22671 152841 201378 -130228 -157811 -77944 -15339 -260480 -53432 -99256 83699 -204122 -303274
22660 -303274 30904 -215342 -181932 -312276 9398 135904 -133910 82204 -82436 357811 -61167
22648 -103325 277730 -53434 -92031 -175643 225477 112750 81239 50534 31291 -66155 -254249
22637 -254249 -257395 272552 -113247 303148 -82188 68146 72297 180942 -119183 270061 -107393
22625 -212997 267533 72144 166995 -344417 -113481 -111160 -25983 -78054 176039 217325 160716
22614 160716 -218661 100264 352324 -452184 -213187 -34843 -233551 11027 -100541 1993
22603 -142581 14407 219864 195578 85548 223184 -418792 -229040 -82120 -15893 -165262
22593 -165262 -85301 -252813 -293666 -65491 -115114 65858 -42037 -55336 -183616 -184456 78867
22581 150166 -308760 166451 97328 -104058 42570 -46985 222147 -350175 -145793 19258
22570 21994 -187852 -64332 163442 141043 -25163 89115 -16597 -8379 78602 126783 -89864
22558 -25920 -229384 217851 115921 51579 -208149 497076 -36655 26893 -111096 -62752
22548 -62752 -123181 -326225 -78023 169873 -193748 106504 -137618 -123915 32975 43564 -249453
22536 -405274 -32093 146995 -228628 -281773 -269410 -230518 -196262 -305464 -8178 -576935 -241644
22524 246787 -26997 -525775 -20167 -114579 -184187 193522 135172 104818 -269371 258767 11598
22512 -44894 53763 -109618 28635 56475 -84283 128429 183177 -73749 -347129 155175 -16852
22500 37548 -210761 181855 -119933 -515540 -253281 -43726 -248649 818 89355 -32581 -272896
22489 -272896 -373308 84746 92312 170730 -53267 27223 244835 -37024 372803 -188268 145262
22477 67505 -191048 79262 -154094 33738 -295015 -123846 -154570 -129805 -92438 188655 142066
22466 142066 50968 -76253 135775 -7671 -382820 -22382 60559 -261775 -53071 -463027 182887
22454 77532 -5015 -44786 -260036 -45516 -245340 -19723 -31209 -90795 -88487 -357084 43655
22442 54049 -76018 -147194 169254 18846 95489 53712 -105321 -7631 -24219 -202291 83264
22430 26040 315739 -152785 -2535 -35483 245800 -307862 126154 34156 -114634 -76163 -170344
22419 -170344 -52638 -44055 231310 -190602 -66345 -155376 14598 63936 -41657 101111 222925
22408 222925 8667 55425 -1831 -386711 -124910 137729 -149768 73642 84353 -282837 -43558
22396 -353823 -45316 -65418 72615 -169359 118320 -278718 148739 -55500 -143776 -316598
22386 -316598 -37712 -362900 -150281 354813 -18856 -189664 491842 -289299 -53959 -216876
22376 -216876 -86679 260316 -319031 -231995 235295 143183 91506 148573 -143038 -111478 -95820
22365 -95820 -65000 374146 -19208 -12561 -88434 252412 28154 229946 -87172 -45895 -247262
22354 -247262 411866 362101 -3212 -116074 82021 -236607 -123797 -99458 67995 -150462 -11781
22342 -183742 174609 51767 -210503 71545 300044 -200512 430461 -90787 197414 67248
22331 -111618 -180192 -68106 -57403 -24546 -156830 341904 156933 -10503 -116463 56342 -86697
22319 15398 -65445 160920 -21651 -43933 -120318 -451869 145806 -234946 -253134 186016 -272135
22307 -110831 184187 -287802 -187121 126133 -290033 140214 22635 36191 -600724 -88232
22296 54698 -477291 -54562 -258251 -213238 -362767 297892 -98045 -207449 -130186 -140298 -164681
22285 -164681 99624 -14014 125433 39196 -131735 56311 -102705 41256 -105379 30885 -28883
22273 -16102 -32247 87216 -196940 -100661 -36015 59047 60159 201121 -116669 -227379 47328
22261 88290 52784 -60557 -154594 -260424 68569 92111 178116 -161674 215193 -74262 38940
22249 88625 -268212 -31425 9460 -255938 -296473 -333051 56389 274988 -277659 -525700 -13557
22237 28729 264885 57608 -48472 166706 -248894 -134506 135681 -290712 -243745 -157919
22227 -157919 108535 -36441 63459 520934 -66659 7595 -132429 -334112 130579 -269661
22216 108083 -50158 -100566 -79883 -43849 28954 5404 114716 -267120 -236803 -71381 13834
22204 33327 -30047 70149 -123403 118276 -251316 -155203 167654 114128 -291200 -187051
22194 -187051 -186386 -53137 -128380 -61096 -334692 -136921 -288536 159857 -28962 -319953 -56279
22182 -96224 -68849 266670 -39739 96974 -44919 187343 -219349 235545 -255942 -186035 -192046
22171 -192046 -297767 24532 129500 -117163 -319434 62876 -112268 -231565 -133845 -86795
22161 -86795 -272686 276988 11896 -270784 -173608 10538 253401 -52477 -64327 87635 302059
22150 302059 2022 25650 -68403 213112 -193819 -327338 210433 -32626 -205591 -27333 -213815
22139 -213815 5112 -252989 -171764 -85068 -268821 -122031 -29995 -167586 -31327 -310509 123241
22127 164286 -1963 93382 188109 -112323 -26159 -259089 75009 18852 -78139 123760 289858
22116 289858 -197292 79474 -133533 -488119 4639 -26077 -61891 224229 149362 -314793 -269715
22105 -269715 -292434 59815 -137378 -462469 135952 123022 229909 -168636 -26986 150845
22094 -152816 137321 -25231 -3337 -96559 -391306 -371155 -101084 147179 -560 124050 -72662
22082 -132189 -447862 -125297 -281005 -251977 -76519 -103565 -121953 180840 -150236 -243835
22072 -243835 158638 -242434 -167610 -57519 -32596 -336550 52346 -259977 -224312 44949 -82269
22060 -287411 182048 326028 316173 -110074 -83232 -289478 -166855 -309467 99886 136248
22050 136248 -258545 -151862 -308579 121606 -231433 -81658 217102 302851 71328 -54429
22039 120124 13888 35269 296528 -235905 -58600 -93621 -161372 -300611 50677 -186394 78597
22027 72931 -45286 -15010 -128877 -81544 -150242 -163277 358637 -31134 -389604 246017 295776
22016 295776 -96094 117063 -30677 91317 63566 -272165 83936 -56166 169916 -100821 -208062
22005 -208062 -118338 -159125 -321381 -373511 -102155 98776 -245218 117364 65286 -98994 -158284
21994 -158284 -172274 -121521 188081 92621 294097 12612 107722 157032 -150405 6339 -140577
21982 -104063 12417 86155 -14340 184701 203861 333388 -23623 -107442 48633 146671 17443
21970 140401 130761 -135120 -87251 -387650 -207582 59509 -215829 -11771 -198580 -112337 108293
21958 -315366 342533 84358 -107953 -139655 -91423 104220 -62161 -268773 -218871 -230017 -86793
21946 -107166 62703 -114344 -31130 -141763 36312 -31733 -184530 -97987 -226404 31067 79945
21935 79945 -80453 -142925 93432 -267950 44466 92740 -398498 -213077 16068 -27286 48393
21923 -244578 -263782 37052 -194791 -36973 32367 -143700 157723 83370 -377612 -218811
21913 -218811 -48109 152641 263382 37149 -156745 -234049 -72546 -112911 -13388 -56512 -155999
21902 -155999 -603738 44447 1255 -133879 -310775 115975 -2223 249770 71274 -120541 103894
21890 -291975 -381930 162005 -129967 -64341 -183859 129679 96376 48393 -210029 -53579
21879 84799 -189313 46024 -215533 -192303 -259615 126287 115557 -68641 -10280 -340021 161404
21867 -106403 -213221 80540 -303571 -188407 -44091 226950 -379567 191602 -268482 -177690
21857 -177690 -158889 -205222 48706 -37475 -372947 246343 -5262 -95981 -82763 -98149 2606
21845 -134846 10186 -420949 121938 96526 -246834 101789 -157630 86810 -90010 219223
21834 310230 -158948 -286632 139770 65210 -377172 57840 -191754 -87987 -44162 -226974
21824 -226974 -59228 -145077 11925 -115319 -49195 -32452 -133865 -108934 -45209 68973 63270
21813 63270 80778 98179 -4568 -143791 153332 -116010 -158463 -166761 121169 14051 -66814
21801 68445 187196 102452 52741 41775 -90605 72508 -229210 195994 -304731 274632 -159819
21789 54350 83910 -35973 52267 -46588 230021 -33617 22924 -26964 -289762 196452 93951
21777 138964 -41968 -390540 189792 325843 227877 114933 88612 -42387 -283780 -119383
21766 -88559 -90912 -198602 -37193 -369063 -85616 90975 335588 420847 100936 18873 -193812
21754 -137366 186827 -142688 -255681 -20155 -58067 -9269 57858 -41018 -126606 -123590 -111583
21743 -111583 -238893 150492 109926 -43424 20269 210105 40724 -234152 -147267 -96607 -112111
21732 -112111 -391953 -122396 216431 -239292 97210 17576 -14009 55164 -245182 24731
21721 5290 -233958 -188095 -21912 186974 -197531 -92198 -153309 -101344 -38642 73680 22885
21709 -388278 135712 -151634 48812 -305537 87794 -179763 -97899 -160533 -110665 -31480 -80948
21698 -80948 119916 -70757 209135 -199054 -45893 -73681 -101554 227772 30973 -187365 3078
21686 220803 62969 150036 27123 77347 -219360 356605 -368239 28391 -171368 164124
21675 -84429 -280062 -165230 196135 -78513 -114440 -50729 140996 -6121 -34709 -98610 -173304
21664 -173304 -465694 -50810 2657 -206953 -27188 -254379 -217519 -397495 175662 110020 241723
21653 241723 -168481 -92252 -137721 98455 28380 -122719 159829 -293366 -204532 76876 -57277
21641 -34551 -135669 326348 -232715 -45770 64117 47330 -185578 11605 -43667 48588 -322063
21629 65891 -24645 -194364 -200155 -5913 101684 -59126 -151629 -347489 -22355 30186 -218679
21617 -429054 124115 47082 81104 108488 -192917 -37831 -147343 -76016 -314529 -86035 -131498
21606 -131498 72868 122110 -51508 -90043 -282531 -159344 41863 -351830 -358145 -361404 -78569
21594 -71125 -142762 -265008 -206306 -69368 185852 -11472 285205 -409704 100986 350795
21584 350795 -267565 -68459 -100977 177577 98601 -61834 251893 -14478 -6802 -170426 202676
21572 91397 -187991 15568 15410 94847 328068 -145038 92627 -82578 -69553 -167739 -111100
21561 -111100 -350423 -99624 37488 82974 8724 -215673 3193 287725 228006 -220115 -306088
21550 -306088 19379 73674 153248 -74511 -232940 4770 -203681 44877 -248349 103343 -171962
21538 -99914 29757 16077 -284815 15246 81488 -74888 -344952 -149745 -188849 -320621 -290367
21527 -290367 281641 182782 40175 -101578 -123658 -215492 -46088 -131003 -169307 -435953 -55152
21515 -89046 -322909 277402 59444 -138525 31132 -220270 -109935 -183107 -240672 45546 -54843
21503 -135138 -255832 -200997 381381 59629 -344836 -102029 -28371 -246356 19675 -120037
21492 -462484 2791 -79175 51234 -86040 -66165 294973 -121841 -63598 -145810 -144210 38684
21480 -168296 -335768 -128324 -84498 580049 146662 -262329 60788 139004 16263 -49700
21469 89442 -28532 -5601 -298065 63313 -245770 214009 218093 29556 -93058 -82038 20385
21457 293347 -206729 150360 69239 137044 316953 -135381 -116502 68980 266474 -143654
21446 -26116 27923 -278453 -74379 -22516 4652 73342 -100100 -38505 67039 29111 129883
21435 129883 249580 145672 160404 277100 61572 149777 -392045 -50631 -19624 -265373
21425 -265373 169751 16435 97867 217771 107397 -177208 -140086 -377549 -142072 -127486
21415 -127486 6211 -159017 20868 -255139 -291066 -327857 -2344 2506 162896 -265164 -62669
21403 104735 -159591 114945 -142828 -377856 -293804 37724 -308615 7931 -250045 106419
21392 99865 249860 -171060 -99989 10299 -11463 224341 -123141 -510545 -101933 -126638
21382 -126638 -52517 36195 65719 -166884 121715 165165 -293985 -340142 -220327 -308271 -244706
21371 -244706 73613 -196091 -27866 -41184 82756 -107456 -227014 85994 -10978 -104623 -235327
21360 -235327 65518 180268 -73983 -29808 299738 -207050 126727 -162079 -172503 81545
21349 -170446 -63746 -148233 273970 -101793 57383 -101939 -57909 162272 -83490 349921
21338 61471 -270118 177393 -335260 -152331 -285517 -138819 -90566 8219 29468 -176084
21327 114079 -71445 192213 187092 -161854 -414512 -252109 302781 26963 -113229 208562
21316 80871 -37228 117226 -180375 -66207 -98629 -194558 -324572 -116133 -52866 -172156 89457
21304 45153 -96664 141405 225548 -108281 -59820 -458975 43268 -13163 -147810 -179556 118216
21292 -141587 -72141 1399 -17934 -50696 -40377 96780 -294743 -121455 -132675 -316336 3194
21280 -127341 12890 60145 -247396 21952 93052 -17482 296197 39625 -104666 -149319 43121
21268 233417 236396 66586 141503 -65440 -350861 -245549 -149102 124904 -197057 -105988 97464
21256 131609 -405211 -368299 -49964 175840 -40185 -23256 -66651 2036 26474 -107997 -142091
21245 -142091 129681 -309173 -37763 -326323 -413914 -223079 -159518 241112 -196591 -17178
21234 -99872 -55399 82923 -29361 -202614 81578 -268349 -304375 170916 -246182 -204873 44745
21222 -78723 156335 -72557 57253 -161809 -170804 144369 -131529 203528 -91093 -344486 120550
21210 165014 -185774 251887 65105 -106072 145866 46456 -78484 -204181 -80384 -445763
21200 -445763 46781 135084 384541 41923 -222908 144337 -191101 217395 -74275 -92501
21190 -92501 -188347 138699 -26458 -134340 151416 -82812 -147011 -72888 -10247 194381 -81238
21178 165702 148560 8827 61774 119215 51519 175220 -12043 -87439 17146 -294694 -301966
21167 -301966 255986 204000 87110 -163454 149563 -253606 36600 -232103 -232368 146044 353754
21156 353754 -56494 40150 -95051 7394 -22797 -265407 472669 -295764 -49135 -181686 231147
21144 -57752 -142667 154480 -154888 79687 143450 -341060 247721 -76458 -360558 455107
21133 24793 178829 73894 55271 -164240 -15356 -50810 277415 -387210 -102191 29325 335565
21122 335565 5942 -131521 -57708 -139140 -13998 -155116 -91278 -160867 -61299 -223107 -253005
21111 -253005 -311975 -36150 -194413 -365772 156345 77294 -266661 46971 -143573 90252
21100 -154096 -215637 -259377 -50125 -272227 -288571 -221500 209607 -300293 190339 175332 -66525
21088 -214389 94137 -198420 70328 3251 -62615 -327598 168817 52792 -112436 -381388 -277718
21077 -277718 300546 277934 -120669 215607 -187278 -38414 -14163 2396 -43417 -46150 -129392
21066 -129392 -262668 -104477 -178037 -175184 -64852 -218291 -11818 2224 120500 66515 -246877
21054 93315 5418 49414 -391245 -168687 83193 -262237 -160248 -262188 -107487 -181070 -208438
21043 -208438 -216892 108651 50473 274438 240309 189236 123686 59290 11652 259407 62867
21031 -81696 -18047 191024 406592 -126752 300055 322406 -78192 -93256 -353687 200657
21020 -97596 49595 -181762 -28916 300874 -30898 -14406 -87282 55490 -17358 127214 106402
21009 106402 24302 -329383 -139789 -179799 196131 -383506 110856 -96005 -34951 219010
20998 -276908 -14267 -58081 190608 36915 -165319 -300777 -17888 512870 -78173 -18539 -39773
20987 -39773 -6915 -257975 -256895 332099 -282316 184248 3363 133087 -32870 -53978 73618
20975 -256451 -176387 31268 71012 -79278 -397115 84244 237798 172119 86846 234655 -306077
20963 -140382 -141490 -73540 -187192 45524 180330 39222 -22629 -103070 -391828 33698 -26970
20951 -51021 -35678 -313116 295371 140348 97580 270645 97854 -74210 -91840 156399 176999
20940 176999 -102178 12978 -324774 207029 142584 -16144 -219532 236647 -223748 95351
20929 6033 53036 -27723 -455558 -111069 -33390 -100006 5866 -220144 -198812 92055 -19597
20917 -279202 53188 25467 -123156 -160906 97835 72943 -249681 -155001 93295 66472 27122
20905 -34333 224522 175306 15347 -215968 121126 -112532 25209 -154737 342007 84757
20894 -148475 52614 95242 -35475 170716 -92714 -75119 268359 -186531 -378316 -202964
20884 -202964 28004 -40605 106524 -35622 -106730 6857 -280465 -2553 -116915 -370855 -132485
20872 -220033 -75627 30311 263974 201372 32358 8562 -47542 -265680 -57536 128160 -251926
20860 -197835 161362 -93734 -72746 -196450 147859 -104122 -104905 276448 -181590 -179143 66827
20848 45420 -180995 145600 -386900 -296180 47423 3278 70848 -170057 51145 167802 110256
20837 110256 99758 -92311 201129 76543 -310981 -304825 -47477 -191145 235334 -222146 -48662
20825 -97374 231065 45277 447699 -23376 -151522 -316089 -28449 65619 -48725 -202529 22103
20813 -174482 -125942 -120380 -160660 245202 -142171 104665 -136118 -141006 -126312 -44796 -123246
20802 -123246 -313821 -199732 91116 -256141 61706 -18284 -140190 -37187 182412 -164078
20791 -341464 70016 -205308 -170257 -83552 -173073 -24959 336876 -19043 -86772 46035 171019
20780 171019 384237 116383 -68897 -14173 -246131 -102463 -25794 -140399 -93719 -350287
20770 -350287 20476 -32336 -85283 -52580 -353027 -89600 -282413 -159351 46593 -110391 154331
20758 -39717 -182288 -40497 -124873 -314992 -435722 137480 162161 -20837 1875 -93152 4205
20746 -459845 -5760 -314636 -418589 -255828 -84162 -148898 -180892 -353432 36734 -42558 -9568
20734 -336697 -102148 46273 -173127 29076 -390508 -175986 -20783 -60970 64887 38963 -112212
20722 -64411 -32765 -13782 86638 -23720 -484928 -205112 -209610 -165816 143308 -253318 92203
20710 -36107 160176 -91361 63967 141391 -34675 -264141 50771 -23652 459354 -58870 -61563
20699 -61563 96495 162534 216142 -348189 21646 186956 -246310 -50456 403612 -38962 -458408
20688 -458408 -66091 -201623 -337442 -86651 -356472 -70344 171155 -40800 242224 -155988
20677 -451589 -114704 64787 -237070 -341961 -152102 -98751 28322 -280085 -38240 -392488
20667 -392488 279748 -218082 -229034 355202 -263707 -26464 13069 -237656 -11824 -53492
20657 -53492 58221 15716 -347789 198651 4630 -7583 -226173 169065 -30526 311351 172783
20646 172783 -26324 -174746 136717 -109959 -353905 -124527 91797 101535 -101410 69234
20635 18212 -157544 -149362 -89969 -165619 -134299 -216478 -672016 -71588 -241535 -163997 -110035
20624 -110035 157354 154241 -128865 -194036 -302418 -145356 78603 -171879 -301449 -160117
20614 -160117 -341937 -26910 -85999 380218 -183661 -157038 163207 -158323 -237127 -221977
20604 -221977 117140 301402 -46872 -290367 -11053 204341 -223758 -85807 -92871 -84905 322463
20592 81702 -279570 69357 5834 -294366 -32212 -222861 40111 -19538 11051 -77830 60679
20580 -109038 -150997 -411518 19150 -8863 -181727 -114127 -35822 17100 -87357 -40946 38445
20568 -26644 -240914 -152638 -75700 113289 -64978 34062 55217 -69482 146193 -190189 9103
20556 -99179 -274480 207663 28852 -24696 -49222 -117143 -109737 63934 -239915 -90857 -455099
20545 -455099 98626 -62558 -134247 214994 91565 137421 -121280 -102773 88182 -83605 207888
20533 -205580 143976 -93773 -77896 -32294 -225726 440658 -239401 -262501 50845 122488 -264052
20521 -174915 211477 -306766 -127689 -253099 -212188 -301743 -114235 -37780 -196080 26472
20510 -128020 -325017 -30648 -226877 311990 14921 65700 75046 -206924 -590338 -144792
20499 -452605 -330697 56765 -47934 -20259 -21908 335340 -140430 -309633 194455 -333718
20488 -154549 1165 84787 -166991 31655 -131034 -140515 94962 -153981 -87102 -107637 254340
20476 -86503 259750 146972 60794 268010 -88558 -105987 127508 119027 3375 141220 -95373
20464 267479 191804 -47781 101162 83753 -156017 75339 191993 -375651 121830 -222434
20453 -245023 74722 -44745 74398 -451778 150872 138558 42222 -70964 21138 185149 -215116
20441 146066 31392 -26621 222395 -89819 -408573 -186374 213634 24000 -13474 -142994
20431 -142994 -217392 128560 147195 -77887 -260402 -426567 226895 -64163 -85177 -171044 -99929
20420 -99929 -191905 -249048 56730 70609 -38195 -276308 38703 -144130 -192107 178799 -342896
20408 -143359 134635 -311453 -24886 -35244 -237889 176975 -207188 -138273 -444674 -203068
20397 -47775 -197018 3244 -213525 -131306 -71853 -17739 -167955 -78775 80995 -27644 -132478
20386 -132478 123056 -357571 -119784 -292730 -567872 -221224 -102752 37103 -243477 114037
20375 -347785 -173202 -49473 -35115 -29642 -19259 -200766 -345912 125682 204805 -43966 -158368
20364 -158368 119855 -113860 -153988 23878 77373 -162959 -351567 224758 -346788 -219701
20354 -219701 -135647 83611 -11419 14629 -274822 -152394 -25845 18957 -113708 -64038 -292360
20343 -292360 -204352 -76095 23623 -174190 -169391 83758 -552212 249082 91262 183538 -65050
20331 -25266 316789 -115305 79722 -233173 -254591 -306662 -183044 -133109 -410634 50515 -203852
20319 242135 -231178 -67662 -126369 -100364 198292 142972 -224393 -227383 113768 11675 222126
20308 222126 179132 -134206 -256357 -145074 -11414 206604 -17861 -97427 -229248 31189
20297 -296699 -53496 182736 -158153 98218 60540 -523369 -76327 -243832 20416 239612
20287 239612 -293429 55456 -189933 -207533 263217 -101786 -93058 -172014 -180429 222539 95939
20275 113955 -95043 -224837 250075 -77425 -127478 95488 -107376 -198592 -189795 52650 -32234
20263 -83413 -231500 -100006 220786 204084 -180139 -251795 33189 -14156 -168727 -97627 70283
20251 -9586 -65214 -32750 -54722 -122130 -344060 -34984 158148 -264089 -103010 -315507 -155273
20239 -137137 90215 -56646 338236 -16675 -111912 -70763 -453017 -24389 -111334 220311 24229
20227 -247489 -129427 -209193 149356 -305415 -67656 -99518 131427 34644 -66393 67586 -68235
20215 101383 -224807 168093 -183185 38264 -71558 -9872 -183734 74015 -160785 136481
20204 -47787 -13090 -76077 -69970 -435122 -151437 340757 -26735 241300 -309976 189699 212092
20193 212092 -56970 47256 -51289 -28208 -109094 -15376 -18192 170176 -182307 -42317 56717
20181 -160728 107865 -167337 343964 107635 396187 216725 154754 11803 -135500 -220610
20171 -220610 79486 256543 83909 117309 -430062 47797 -346240 -281866 -80970 23462 358347
20160 358347 -1712 -125547 283867 161490 82465 -65059 -40217 256547 -105422 -212223
20150 -212223 75971 250816 43066 -103229 9515 -194878 -1284 494660 300613 244249 -76258
20138 -62357 329699 81537 202671 222165 19682 2151 -49106 -15430 -83673 22064 -262038
20126 -257854 197554 -52131 -185482 -97270 350017 41936 -282579 -260090 292686 -7599 -214435
20115 -214435 -94888 107191 47618 164699 123643 315328 -257850 43613 -126026 -180629
20105 -180629 -93466 -377704 26547 -102918 -108892 230916 -88065 9190 -26607 -69474 -424135
20094 -424135 -150582 189760 -60786 -305986 13001 31917 139553 231309 -266728 120854
20083 -136515 216321 -185562 -215656 64805 64883 -524233 153550 -41126 -150768 -65509 -77516
20072 -77516 76791 -16228 9506 -143743 36748 -184575 -66201 -215918 -7613 291226 147094
20061 147094 -155935 -92775 6844 219207 -76152 -29062 137182 214577 -63319 -118681 77383
20049 -290411 129425 306015 48443 -140425 -158990 -10586 44744 -173280 -32373 -105713 41334
20037 -476492 115144 -32934 142523 -186597 308475 -98903 -252449 4004 153432 185298
20027 185298 -59203 58271 232941 83374 54395 -37439 106532 84232 -122802 -221869 -224340
20016 -224340 97404 11192 40094 208493 145943 -84824 223925 130283 24751 16698 56057
20005 56057 -4289 -361445 383633 -4570 152049 -42841 33142 -111755 -96455 -177064 1555
19993 -25465 372424 -196789 -222758 68333 -54798 -41378 -216068 284907 -68092 -67799 -149929
19982 -149929 106258 138422 -21787 -171804 -61188 -149539 77343 103722 53227 77619 -88262
19970 93094 -33488 251063 -83179 245155 17743 -122185 -124076 -154506 255182 -59642 -86351
19959 -86351 -43429 146000 367518 361717 153496 -81295 208550 -291184 396342 -208581
19948 -60514 64907 -233139 155450 131594 -441684 496144 -35596 20448 -119994 -148588 -227543
19937 -227543 149316 -99434 -157346 100700 -228046 -454488 -46931 -300481 98281 -23227
19926 -275299 -71420 251394 -543641 -78413 -363974 86343 158137 -6942 -163750 -254105 -48201
19914 -153603 -91645 -85017 53871 -24849 -94305 -238693 64098 126181 245684 285672 16931
19902 -29675 -66101 -249527 86674 -50925 218 -143403 135463 214857 -118997 -102053 -96544
19891 -96544 21045 -217565 -92367 -52490 -218376 -220622 -114126 -207275 -80116 9023 -480964
19879 189469 -210950 -22720 252503 30089 -26511 9524 43872 57229 -53343 -71568 -55288
19868 -55288 -44276 -181437 -131161 -40881 -74754 -312515 201818 78161 45476 110215 -109409
19856 85482 78595 27619 106339 -185919 -447052 -249252 228837 -129432 -13125 -273231 -384829
19845 -384829 -338851 -293262 -625 -102857 -52353 -122004 -268282 -62542 -212735 -175628 -125694
19834 -125694 -224184 12911 14261 -73383 -256876 49769 21259 267927 71641 -115661 79903
19822 -34718 -33973 -110782 -219306 41625 -254693 43558 10842 149904 5381 -26750 -427354
19811 -427354 -355659 -41657 -49497 237564 100500 -152063 -49254 -54504 -226258 -31209 52268
19799 -91330 -400279 -148346 -150946 -149831 257774 -56006 63462 -24527 64658 -43395 20410
19787 95516 200088 -193325 -187337 -100821 -337741 111085 -15427 32439 -155286 130025 97537
19776 97537 -206839 90988 213433 -67104 162109 -340487 -83385 3580 122838 -93537 -47434
19765 -47434 -40835 -7928 20555 -398368 -288847 -164482 -165155 -16566 -38877 36844 198214 99570
19753 99570 -81381 96756 -4571 -265917 30868 3508 -67455 -98948 39735 -170220 203691
19741 -7252 25456 61450 -67786 286417 162070 75881 -160633 -59681 -205872 9596 47242
19730 47242 50338 96948 -134751 -174201 -128498 441019 -114328 90431 61987 -221503 56557
19718 62197 -41858 17198 -375770 -28023 -150806 -95146 -21152 262826 -99696 -129739 -125945
19707 -125945 -83772 119986 209845 -80476 -95988 68256 166909 -37332 -16864 358987 -49094
19695 -217748 243127 -178178 132110 262225 92190 48241 108933 -65394 -220734 240109
19684 -190867 473518 85653 -34374 -318696 -180912 -105263 -118424 77854 -235866 18405 -4649
19672 -76164 -187140 -119839 -20968 -307769 -160063 -216038 -138148 30428 -111522 -18457 188051
19660 -32232 -159709 5969 -181806 -16996 -455140 -140084 -101054 192156 -247589 121150
19649 -73862 65236 235278 -200397 -22325 -204230 -281453 24377 119761 66282 -104990 64096
19637 -133145 -149481 -156397 -253812 41286 10431 24177 -276579 -281455 -296248 125091 12775
19625 -5274 -37577 -153981 -263388 83292 20204 -14615 89760 180397 -117460 -278385 -1477
19613 -50513 -29727 -144014 19318 -100436 279800 -146021 191628 -203243 -311933 -121077
19602 -270614 -70310 -125030 -165489 -20369 -145498 -159710 -253985 -226017 118668 -242866 -194390
19591 -194390 -330410 -206312 11955 56435 -146358 21198 -62565 -42811 -384919 63910 -9805
19579 300937 142878 -195631 -73033 22283 -230853 -123220 -345918 -49839 -33532 110911
19568 -262083 -95276 42862 -157240 -162203 -83356 -299505 -109954 178798 122803 -128542 219892
19556 -320854 -141389 85217 -146948 66435 123931 -43009 -138411 -269556 235496 -196794
19545 230821 -33441 -249263 68182 -257047 -45412 3251 449967 -128361 39702 -95053 18587
19533 213034 -364861 388366 -61733 -33775 -164387 78264 -49598 38196 -78664 77490 -16239
19521 180962 -72945 72780 401953 78839 -62311 -175720 -108255 215530 161319 -84828 -119030
19510 -119030 -368720 35610 -238093 -61507 -199300 136302 43450 -36568 40497 -180664
19499 -188575 -223014 -52070 -178959 -456193 171511 134180 -181475 -4570 -118109 -49083 54449
19487 89996 -59606 240547 -126540 -88474 -100546 63199 136699 -223845 -88254 98243 79024
19476 79024 -68679 -142817 -283167 -83400 -35291 -189845 -48879 -78759 -166279 7336 184196
19465 184196 -328022 183504 101157 -219971 -326192 -32809 -92813 -48775 144926 -19554
19454 95530 -31310 -226521 -141786 -67001 -243311 -152988 -301524 217519 -4735 -139966 22950
19442 -169601 -286406 -136024 -13635 -151267 12097 -223217 -173501 -16640 -260306 -325137
19432 -325137 -45926 105494 -18710 -72899 -283097 -121488 -251923 441062 59602 82924
19422 82924 40655 -132500 -107025 -233461 29279 -62349 -235108 -128508 -125080 21090 148589
19411 148589 34528 -45170 -220130 -96179 -227633 -24383 -197922 -134025 -105254 -22995 108751
19399 -9590 -219438 -106304 -238241 -148124 -133971 -243698 -217752 108107 -29637 -177664 -114907
19388 -114907 -172638 -276468 43107 -187271 -162845 -191437 150128 -1204 75619 84484 -135904
19376 -163327 -215578 25149 -323442 -221397 -88337 -61268 -78547 -365 -113315 4440 -260355
19364 -245522 -3745 -58268 157666 -275545 -125579 110519 -13156 -348456 86910 -8403 -14105
19353 -14105 138242 -104050 -172564 59899 -101046 211077 -283172 -315777 -302447 -224667 47168
19341 139106 -115427 -476295 -201308 -96450 -19390 127706 -13111 -153409 193371 -386204
19330 -96485 -227185 -236085 9166 147016 95459 -50484 -197490 238716 147423 -60529 64586
19318 300726 -348062 -136622 101525 96187 -338206 -224632 -325716 -211111 -121491 -22811
19307 -187128 242353 38431 -480081 -157263 -65448 -250946 45613 -106269 -304321 330682
19296 19894 -44751 262038 92116 -194259 -55981 -108294 -156466 31155 3116 -133663 -195520
19285 -195520 10343 -136144 95837 199331 -53519 -122796 103028 -68254 -242109 198025
19274 166206 -198072 99812 -218843 -191621 -197009 -122383 117487 153243 -255432 51174 -141141
19262 -350201 -183890 -132785 186710 90893 135838 -68585 -41086 24194 55111 -246279 36657
19250 -551525 114424 -126702 -271343 -95065 -70175 119026 -140434 -297119 -63067 67206
19239 -172697 241844 -204287 -267594 -72069 6981 20398 -367849 33256 280850 34644 -251999
19227 -124414 -48752 40827 -179395 -381294 13438 436194 9483 -116672 -212014 -39336 -235396
19216 -235396 -24167 47067 138268 165043 -174124 -122575 -191189 15113 270916 -374183 -16859
19204 -291500 -126042 -99686 36951 -69615 89227 -126417 -92228 -147376 -47681 165845 -45528
19192 290624 44709 82198 -123428 -25804 -523498 -141687 102432 -255829 -89536 -298856
19182 -298856 -13998 -162151 -114843 -63298 205249 -521783 -386189 93043 -15594 51442 -167060
19170 49934 -122449 -353649 215239 -315538 160731 113745 88393 223487 -158909 7263
19159 -118576 -7370 238021 -287067 -85349 -426138 -2844 51928 -191008 -131596 66762 -49700
19147 -40711 -121974 -86905 -150089 -106393 81981 -350474 -280823 -215314 108636 135412 -89749
19135 -191178 -150116 -78927 18825 -136157 203136 -333849 -24603 147397 -393319 -181815
19124 -183419 -68776 110216 -31609 87098 -225158 -16928 15733 234532 -72826 148113 -111254
19112 -179427 -64388 148266 -66710 -9681 -103218 -16592 -141143 -167768 -213520 -175722 -111938
19101 -111938 -122757 -36816 -231427 -87522 -69314 9734 251385 -83030 -130949 -376268 -165381
19089 -232586 -340435 44916 114904 -265225 2473 -24853 37722 -134738 -50089 -102194 -28097
19077 76471 -389760 34873 53405 161080 10418 -54334 -44723 -443884 -30019 -169329 -20203
19065 -17401 -421783 50743 -29746 83972 -66826 103563 175436 1281 -149707 26015 244411
19054 244411 -9092 -594900 275208 -126677 -176964 -19479 -86048 -298654 80247 63718 65842
19043 65842 60758 28697 59492 -260750 374777 -278866 6223 -115480 363813 -244520 40712
19031 -129046 79942 73397 30591 124884 -153453 4159 84025 -37212 341453 113299 -210818
19019 64253 284133 209322 -288129 142059 74567 -15320 -290309 -36150 -322215 -341609 -451537
19008 -451537 -88331 160968 169448 -82057 -26669 46989 -299331 -109126 70650 -190375 290519
18996 -75579 -237474 233898 -125593 110601 259084 39664 -123677 -154181 51309 73088
18986 73088 -115862 -121059 -148647 -37108 -15596 -77530 47083 40329 -254740 -164309 -55034 287852
18973 -290910 -97316 -45965 -11955 -17410 -6000 61075 -75737 -50886 142707 -51525 5856 -297325
18960 4171 82467 -120647 -96655 -180321 -228997 66369 -17909 -246040 142979 57089 35937
18949 35937 223510 -169716 -41519 55952 -184946 314938 98 10115 17230 81185 -157741
18937 74966 261315 -204605 -72523 373018 -181949 -271422 50884 133679 113442 -9035 57650
18925 -237161 -21594 -282560 -105604 -101789 -166180 128473 133809 195897 -14497 -13011 -175183
18914 -175183 257577 -151071 22037 -44723 -372507 11849 101054 -325079 -6590 -164657 108266
18902 -59623 -184540 -95274 -386032 -177047 -302117 7500 -27817 -330268 47014 7332 -308332
18890 190421 -190098 86975 48530 237865 93653 -295418 -139079 -34846 -208770 45233
18879 -311294 204015 -147744 138756 -98867 -24016 -72769 -427595 -90903 -176883 -3373 591
18867 -97936 -203660 -304692 -151574 -21045 31029 -223249 -67670 -231336 -289497 -38383 -77603
18856 -77603 35650 -29330 101881 87078 9547 -155922 160301 21509 -353545 -283250 -119068
18844 66983 301449 -78600 299708 -112783 229628 -225495 45899 319527 -1284 242298
18833 72992 -1951 -212328 34655 103486 -192007 -50652 -150243 168481 -90064 192811 -155705
18821 -138601 38330 -269426 -191066 -52737 109786 -137711 256469 -112565 89063 -46884
18810 -203051 -177720 79398 361997 72320 135676 418700 -231616 104719 214961 27575
18799 -46458 93896 64092 -126717 -214743 -396297 -189683 284 56384 94520 72247 -86212
18787 -274371 20004 -66178 -61628 -129718 34898 -92554 -5910 -212311 -41774 -125 -271728 324449
18774 42797 31203 -99638 70865 -66454 -126680 44710 246499 -57218 180070 -114924 151828
18762 -5264 76350 -134988 -310355 36136 -84087 -206541 -60575 36448 182692 -105043 -255891
18751 -255891 -19346 -120550 -93386 -307790 -244057 -78934 -26692 63003 171604 -81508 -14010
18739 -120778 106160 137733 234783 -120985 76920 -126174 -161986 -50523 287676 79786 195854
18728 195854 -205230 39312 -64534 130030 -179040 -131441 157771 -185688 -384660 -171038
18717 270340 98021 -67771 62937 -173871 -1086 -80290 -97027 44837 -20855 -152453 -142479
18706 -142479 -433485 223112 139621 -32530 -99810 -48793 216241 21504 -257855 -123542
18695 -339617 -307506 -14742 104544 -130261 -67443 -218695 -61053 -5281 -71768 112923 -105975
18683 -11740 -282363 -201939 -337748 50292 -145282 -130660 101282 -91096 209934 -145451
18672 -54718 262028 100429 136140 16842 -199040 -355593 90313 -20614 -18906 -106755 -103629
18661 -103629 16354 -446975 12579 -20421 -382714 -250711 227242 118055 -1666 -406509
18651 -406509 -47009 89406 -5119 35991 -156554 -267814 183758 -92502 195743 -29304 -210707
18640 -210707 -338099 -118947 -28821 -139337 28725 -203181 -120229 -26003 13409 -405638
18629 -312149 141025 -98670 -136509 -57076 -227234 -76793 -35058 -315280 -153603 33334 230056
18618 230056 -381150 -223179 15438 -302450 11382 31347 -175073 55324 -130577 25038
18607 -298041 -188539 -149983 -221387 -83383 108319 -29998 -113090 225541 -216820 164687
18596 131542 165283 -165902 -206909 -205258 81732 -224502 -134452 207036 145709 -147696 -295461
18585 -295461 3663 -134839 -9707 -186980 208892 90386 -263676 92578 -297202 -158342 -185417
18574 -185417 279202 205606 -109819 10119 -69010 -377948 -189772 -224727 -218826 -107672 40744
18562 -171306 -129234 -5751 90527 -22944 -114203 -147091 40492 60917 266323 154842 -175814
18550 -257186 -24471 183243 292399 -67868 138881 -244486 85406 -47441 -163884 93295
18539 -157721 -230983 -46673 316633 -21265 31312 -181264 42598 10395 -199496 168958 -117282
18527 334350 59027 148386 -105838 -305082 27504 94155 185405 -139879 131516 -98044 -98187
18516 -98187 -411880 -517761 170899 -191619 172408 -201172 -82382 -33521 50465 150222
18506 150222 71882 -232213 -134289 -272543 160134 -158397 -506589 -196292 -28140 178652
18495 -454365 92818 105409 4041 -131548 75068 -288351 338428 -72488 96824 -1874 256171
18483 -15359 -11937 -334118 78254 177705 60275 141543 -69522 -473593 105987 195511 -23969
18471 87900 -49735 -117156 -119363 126714 -181799 58200 42433 -134157 -128462 -49871 -214655
18460 -214655 -81335 -309088 -157131 -53373 -319081 120571 -156835 99767 -174898 -220176
18450 -220176 -128831 -291137 68114 -234250 -382114 -148038 -534108 39828 -258239 -120600
18439 -274055 81272 68074 -100950 2655 -4689 -212275 80126 205055 -105997 243543 103171
18427 -77539 365541 -227211 -211702 105590 -323971 -257556 -293594 14137 142773 -71679 -311825
18416 -311825 224596 -238273 28038 -74463 177324 131695 4696 -9560 174397 135089 309574
18405 309574 -16963 -80738 255306 147645 -158400 -211881 -456707 41270 -309825 34359
18394 -186321 228653 243163 180618 295495 12212 -59516 -141765 318805 -100607 -47397 412319
18382 158081 -282482 194041 128539 180294 149990 26880 -189726 70336 126739 -90415 -74961
18371 -74961 -23766 64537 115389 -244335 507327 -57716 -52017 -261607 17394 178739 -251678
18359 -90770 -31381 -97013 217080 -4178 -94379 -114203 -33831 -107836 -192365 -193276 206831 -98265
18346 -27638 116854 -2206 44144 195155 -347115 -130188 -52926 107361 243093 178137 -296548
18334 -180001 -121857 39981 32835 380286 370130 -192093 -1941 -167321 141959 -168343 -9302
18322 159816 153903 -213886 -161037 160136 -146284 -187766 288981 -8365 -152243 139357 -9862
18310 -288291 -59179 44960 -63043 281949 -342026 329374 -4702 106191 -36360 157354 193391
18299 193391 -88803 -294565 315812 -45525 -419523 61893 -68168 171356 135221 8717 -122164
18287 -410958 -86459 -141519 -29325 -227947 -20498 -338228 82393 -132057 -244544 232555
18276 -46857 129213 134491 21994 -320818 -26574 -156364 -130023 238582 -90822 11950 -88884
18264 -96580 76258 100486 103155 8870 113904 -73447 -47552 -85277 -11196 -115626 344763
18252 -16274 -169521 -51751 -3048 -53343 -76470 -227059 -249625 -136318 -340106 -41551 58418
18240 48965 -93014 -14136 96372 487522 39949 -252516 -104133 186379 100648 -45312 149228
18228 -18713 -221801 -11263 337819 324028 -214475 46115 -132188 9214 -11225 -254272 -86010
18216 123166 39069 -73232 36506 -30081 -198831 30522 67710 27756 280382 140346 -53158
18204 143918 -112812 -69332 96673 -269418 -118513 91999 -44438 -49886 -58752 -212187 202314
18192 -197879 195177 68507 -88774 145435 321424 -411708 -43230 82310 -261202 304965
18181 8954 29915 -33266 87264 63774 139770 154453 -140988 -347644 -33808 -286349 134092
18169 -239198 -371321 -235611 -302851 122757 264514 12843 -123075 300245 -32083 -247459
18159 -247459 -56423 6096 -81961 257777 -50719 -88664 -2020 166292 142199 -172349 -220521
18148 -220521 39756 -309841 45709 -35216 -129611 218218 215414 -126228 55294 -151469 53462
18136 -298946 289462 -162818 -173485 -299518 -99758 -148929 61459 198717 160093 -169547
18125 110997 29268 88729 119940 -189291 17087 -401332 -42882 115217 231872 -85063 -26100
18113 -106697 -33674 -171515 6908 -180750 -350354 -184093 -204199 -205792 34413 -176619 -4505
18101 -273876 -17910 -96879 -108613 -222415 -25276 -147025 65432 -311940 174849 -148669
18090 275884 -267068 174650 -26751 -149563 117626 21554 -196821 -38079 -182232 -147268
18080 -147268 213786 25823 -160064 119921 -30171 -148263 80887 160478 171175 -241109
18069 -42259 -239552 43197 146740 -37159 -305548 41379 -1910 186193 74831 240900 59144
18057 -157248 248946 228790 29182 79572 -40390 41270 208953 302264 -122240 199394 -124703
18045 56316 55497 74348 -26746 -15295 57284 259704 123877 1476 323458 -78210 -103900 -127804
18033 -127804 -228823 151954 189273 -168702 43940 -82890 43064 -118106 268611 147720
18023 147720 66231 -26802 99779 78551 265364 301225 164440 -99267 101464 176377 26954
18011 -275068 267131 -135728 48971 -109526 -8465 321814 47247 276881 -5210 7570 -381942
17999 41307 -182770 461930 282297 -110534 -175627 249674 66968 11383 -36245 16047 55449
17988 55449 214564 -75614 44859 40568 -22458 7030 -107888 -550785 -91689 75603 154489
17977 154489 151084 -194884 789 10202 79569 -2639 -38528 72584 -159500 -32024 37953 -52629
17964 320333 -186916 -74947 -84177 -49426 229600 62849 -15396 -303056 -371007 163539 118956
17953 118956 282901 34699 180543 322230 -178447 -312935 5925 -123529 -8149 -188918
17943 -188918 124320 -65946 43506 -360343 -141201 1000 -129873 92663 -126290 140676
17932 -107808 -237171 182190 -260599 6912 62922 -80301 114474 97749 267209 -41934 60984
17920 21109 -74908 235244 128208 -141396 -159445 292117 8031 -25702 317001 -203230 113207
17908 38651 -3039 -269506 -273109 55530 -87335 -7945 -91727 24115 -214459 -77168 115925 -157263
17895 84815 26005 301529 -263296 136296 16482 385917 224676 55978 -121044 43092
17884 150518 50668 -36869 -126372 -131343 179009 -53544 189339 26617 -237909 74557 243142
17873 243142 -187608 35453 -29898 -74291 -25220 -176384 -38212 -333517 -173060 86915 11270
17861 162146 -13360 177538 141969 -120491 -24456 -5695 213383 -48094 144563 115036 -46779
17849 -168299 132024 -286853 220210 -282479 232134 229634 160368 259813 -125710 -33572
17838 75312 -221369 -204405 -88002 -119263 -216774 1171 217829 -188858 263903 -188300 275874
17826 -76154 -170403 -2002 -15391 -271168 270257 429094 41507 -151473 234145 118207 84954
17815 84954 -87428 -100957 63469 -124641 -22211 -2284 142035 101429 -187923 270850 -229044
17803 112825 -188414 528380 518761 -11702 -86251 291524 -25537 229451 -176992 97707 86026
17792 86026 202484 114498 195992 -5266 -148532 136133 -18697 95152 69618 61876 -55334
17780 117215 -159663 17961 29507 333019 -254377 48329 -32343 110208 -87840 -97485 -102079
17769 -102079 239338 -196702 -126885 90079 71309 -24212 210290 10042 -270187 573853
17758 -231103 10316 -35980 49682 -137399 136252 -261091 -160646 120801 114383 268511
17748 268511 -7865 76927 21030 308415 192240 79940 -128489 142575 -44513 26318 -31217
17736 -112223 46120 59775 26671 -172106 66209 361248 -55652 225677 149380 -124728 -272376
17725 -272376 -233429 122399 110796 -57909 330865 -21783 119503 -27508 -63416 750 271450
17714 271450 -199012 109667 61916 -28807 50058 115930 67566 222032 -168103 -35443 -64658
17703 -64658 -179480 30513 210854 -336948 -53520 22307 -334830 173323 80616 -60017 -80708
17692 -80708 49225 -76407 43036 260656 -23801 -97867 -144135 1920 242535 -133243 45107
17680 465257 -165035 343453 302831 108433 184313 156387 234932 -189206 28872 181521
17670 181521 297207 361830 179695 -99806 392612 -408485 -21476 -171684 92687 8729 -72120
17658 16484 114046 39124 340141 -89203 -144444 -51231 -2417 57869 -9897 192702 128357 139174
17646 139174 105031 -178292 162972 300616 268740 -80070 94816 -185327 52396 182029
17636 182029 91769 217287 288552 26351 157505 -85455 41286 -31710 176890 40563 179841
17625 179841 37392 175019 258477 -16305 -122862 88591 222535 38326 339535 259480 226988
17614 226988 -46820 15184 96567 406058 192359 303595 -17225 344604 221710 157585
17604 157585 119713 143971 339956 -17469 225131 231446 299589 155258 165567 323491 184197
17593 184197 405539 -105937 340226 254996 -30683 -85230 -26112 496741 254199 217141
17583 217141 518796 552974 -6195 92449 352388 50406 105121 155081 128643 302272 152780
17572 152780 128848 128531 330102 271632 34696 -235819 245144 78958 101851 29564 137524
17561 137524 336969 243388 -109419 -34522 149543 141265 204139 255607 346612 214602 256106
17550 256106 -121340 199834 108903 379767 76395 298474 99505 535833 266923 114732
17539 286165 509664 244039 46455 511373 379010 379933 494175 472078 300966 297460 618580
17528 618580 442347 652462 596512 620480 890933 312667 502285 512986 600057 730492
17518 730492 437501 858541 355796 212104 712394 124566 318987 578803 618645 771124
17508 771124 373668 396773 853921 -10193 249342 238243 262210 203869 255815 323401 -55291
17496 239405 294223 149144 194451 676616 -79068 228753 14384 289904 248805 418799
17486 418799 397356 269112 -101457 276883 329450 394567 68611 392435 287478 392589
17476 392589 194951 372787 522389 62841 297506 278067 80917 211078 256247 265493 396337
17465 396337 -127037 255963 351171 365390 483576 530220 130200 198017 342614 427245
17455 427245 602138 254856 26551 713596 190219 251532 572249 293680 264659 357958
17445 357958 14436 573252 28427 74422 480692 316175 507756 172204 179297 272491 294844
17434 294844 646381 -17068 157161 177264 288563 359533 393695 17490 192641 600190
17424 600190 196469 402279 398494 127952 241668 75475 285985 135640 271804 421675
17414 421675 401709 36834 600553 19760 523856 380177 413473 310572 395381 464419 68983
17402 176582 362971 49633 283727 378376 350369 314889 57278 346371 307959 -7116 223728
17390 9473 141660 286746 319893 -61464 100482 55377 232821 325592 280649 40591 274356
17379 274356 485970 254948 320924 -50155 -3654 237141 235209 138894 354793 368806 -50294
17367 328153 331697 256872 201678 147114 273185 63016 -50657 17851 61049 57604 149647 426761
17355 426761 -62937 323050 169866 41915 381997 188609 493780 139504 230771 586500
17345 586500 -176606 376569 291122 -73958 386352 87347 477222 91510 394578 207834
17335 207834 432337 317877 265497 197831 -156642 188270 306781 60595 310820 116553
17324 298805 63865 173246 371353 427699 331583 248273 170298 282870 282442 363306 336053
17313 336053 219418 116328 395253 -133658 194699 314004 143092 603124 363859 107909
17302 364673 530936 269590 98994 236466 417894 343736 77619 299325 7358 445509
17292 445509 -134324 642853 316597 526860 254993 258736 124822 -65679 548030 84097
17281 358982 210387 282656 435775 412647 586551 384322 -7992 288309 328847 129780
17270 358271 127431 546344 278402 223881 500976 246856 180043 181649 442563 145641
17259 322380 189779 221987 576031 469995 202354 289514 228653 269936 304886 24481 430215
17248 430215 244617 42814 617509 409512 170520 450328 165730 270899 544701 508952
17238 508952 599068 342228 249124 354003 323025 471767 273664 419191 346295 259541
17228 259541 380836 295290 533123 332750 647899 523312 555145 35294 371027 177198
17217 41377 470046 416126 436396 315887 241396 594390 196913 225957 352636 235403
17207 235403 312977 515614 401991 348282 450134 358061 183347 422353 577023 487664
17197 487664 615560 436843 475456 268366 524794 558098 514881 553706 190433 501252
17187 501252 377244 759708 427953 267846 368867 350853 520083 402929 548081 742018
17177 742018 369583 217800 330620 603367 505720 697053 286084 589173 424119 512165
17167 512165 534150 339977 588494 469913 478418 494628 571905 618617 874393 632393 357958
17156 357958 723889 358031 605361 492932 891364 485817 581232 305255 548164 391567
17146 391567 762784 634922 431187 561898 282641 413312 412001 402048 784191 579263
17136 579263 668532 557564 704497 725483 697832 716309 493408 862049 683008 675595 701231
17125 701231 596116 623638 734436 748366 828465 704953 501752 445458 362271 593632
17115 593632 581686 381155 676784 449658 652813 690482 742686 718633 795285 501470
17105 501470 733321 678314 879477 457412 387567 729600 619904 732923 564828 740639
17095 740639 845644 706385 679333 659993 916502 824531 687969 875357 691866 628529
17085 628529 668905 996224 730859 792389 629997 824200 805989 904107 622903 845177
17075 845177 625737 982633 515498 986241 1101234 733862 713999 600877 856836 845664
17065 845664 816892 1007180 1003677 960968 856327 845192 928040 967626 787703 666026 829813
17054 829813 939759 1000434 873792 783634 1021535 905378 733887 861045 766968 977769
17044 977769 1273312 1033186 1231773 1092242 673407 1239324 850124 1174951 1320384 926710
17034 926710 874083 1292035 949148 1183977 1221414 1346414 1167981 893730 827667 1025550
17024 1025550 1271426 1104661 688959 1060819 1241901 1391567 1014979 985600 1618538 1347403
17014 1347403 1162979 1354803 1375890 1195757 1208799 1535268 1545283 1140576 1648236 1327610
17004 1327610 1404814 1239525 1462454 1383893 1459893 1178808 1528393 1289209 1501619 1548433
16994 1548433 1631926 1700675 1245745 1718624 1699367 1823154 1730705 1868970 1431545 2067039
16984 2067039 1923899 1877962 1536970 1605149 1669809 2053193 1760210 1940121 1598094 1567453
16974 1567453 1929705 1821066 1977961 1627172 1875098 1925859 2061529 2177167 1954198 2168947
16964 2168947 2337527 2219484 2463324 2302360 2372596 2640903 2505501 2589114 2524355 2400281
16954 2400281 2218622 2876857 2527990 2613743 2641408 2675147 2461751 2783689 2696965 2537779
16944 2537779 2718372 2824719 2839629 2814595 2759536 2770065 2779195 3105339 3477411 2833791
16934 2833791 3035507 3051379 3204619 3233292 3095340 3331589 3148843 3577533 3471252 3547121
16924 3547121 3372295 3704785 3691667 3610578 3866761 3913776 3912572 3665317 4013678 3996983
16914 3996983 4032345 4078977 4301055 4218265 4031902 4030447 4547694 4282555 5006186 4486362
16904 4486362 4562319 4816115 4735761 5046825 4911900 5020033 5184986 5198670 5165565 4930633
16894 4930633 5179971 5487286 5717118 5770521 5521120 5824599 5646125 6041823 6124931 5814231
16884 5814231 6431044 6513465 6463298 6560844 6532841 6621685 7012980 7282691 6726545 7121010
16874 7121010 7336764 7546118 7640932 7828897 7792336 8028350 7977871 8158243 8410949 8323575
16864 8323575 8723248 8986928 9066092 9021114 9334717 9326000 9311100 9725773 9388384 9813977
16854 9813977 10464586 10117818 10410484 10811976 11008381 11153282 11334656 11600674 11963432
16845 11963432 12043785 12509408 12131268 12314401 13004053 13061826 13287192 13652067 14024172 14067679
16835 14067679 14325830 14820398 15221609 15705351 15571950 15760574 16339054 16636515 16930135
16826 16930135 17189127 17565438 17739368 18258862 18529204 18657635 19636906 19448085 19663211
16817 19663211 20437702 20783735 21157979 21279915 21911661 22268350 22446282 22971936 23275556
16808 23275556 23854360 24738436 24891635 25505035 26135761 26347058 26781524 27170945 27706064
16799 27706064 28549297 28659044 29171318 29933673 30515541 31079087 31501923 32186758 32687021
16790 32687021 33196855 33950829 34543475 34982592 35674297 36447660 37010001 37969651 38468538
16781 38468538 38922257 39980720 40800380 41379232 42283403 42805005 43885310 44648878 45100952
16772 45100952 46040316 46921863 47829206 48763465 49711099 50575068 51839772 52508121 53651432
16763 53651432 54285307 55395807 56364787 57344078 58452247 59472471 60812261 61706618 62989813
16754 62989813 64218489 65354668 66536593 67901355 69270849 70605304 71750331 72967019
16746 72967019 74576237 75852884 77254104 78328290 79600424 81415892 82688271 83971303
16738 83971303 85113155 86508531 87896984 89144064 90527953 91842509 92760481 93951013
16730 93951013 95507689 96306177 97151668 97634750 98751294 99004609 99293320 99327280 98884853
16721 98884853 99321253 98629668 97511433 96405684 95633407 94104205 92722183 90851492
16713 90851492 88529338 86614970 84519913 82061014 79436133 76807013 74368359 71824564
16705 71824564 68862980 66741460 64063093 61666888 58841362 56431090 54180407 52186606
16697 52186606 50223248 48027920 46092557 44248113 42327449 40903966 39008135 37589974
16689 37589974 35974820 34611022 33468324 32102283 30415295 29848010 29069767 27601982
16681 27601982 26764092 25806482 24822896 23803597 23288239 22252107 21278009 20748845 20238013
16672 20238013 19435615 18859356 18419771 17829937 17476343 16750679 15862577 15723434 15363208
16663 15363208 14696278 14391716 14041102 13526895 13402447 13103271 12686156 12187524 12152269
16654 12152269 11719558 11538592 11221780 11003652 10564219 10437078 10520257 10045046 9749984
16645 9749984 9580420 9601131 9080228 9079574 8864961 8745708 8143852 8208237 7798630 7928575
16635 7928575 7687895 7679058 7505529 7282108 7437126 7119561 6892985 6656500 6731546 6637254
16625 6637254 6402034 6159563 6145774 6028469 5797074 6105547 5700617 5700621 5733855 5586822 5636183
16614 5636183 5562931 5257662 5054857 4927336 5125038 5190614 4769755 4957389 4713604 4767136
16604 4767136 4297326 4352831 4481135 4417629 4464619 4520443 3976220 4366218 3893874 3702525
16594 3702525 3827532 3820757 3850773 3690417 3851190 3824714 3561328 3708755 3441361 3858294
16584 3858294 3419955 3485403 3414089 3133042 3514125 2897288 3023034 3363202 2966318 3035346
16574 3035346 2918249 3149223 2820523 2877962 2926393 2881623 2739800 2673838 2740736 2499403
16564 2499403 2483958 2596145 2380138 2415367 2568218 2505736 2485788 2265298 2487988 2659821
16554 2659821 2045146 2365123 2154230 2471154 2252732 2125765 2242817 2270215 2110173 2332665
16544 2332665 1970675 1995464 1984204 2134986 1818393 1853127 1810347 1745084 1769702 1554811
16534 1554811 1945740 1921642 1812036 1863003 1684077 1743851 1634209 1702582 1677851 1204546
16524 1204546 1477931 1679194 1444856 1421065 1679654 1683516 1665697 1846298 1610009 1697790
16514 1697790 1625988 1389368 1287265 1551885 1311474 1635788 1535152 1469066 1167237 1025622
16504 1025622 1425724 1407195 1328624 1745457 1547841 1340221 1642988 1099064 1745566 1313602
16494 1313602 978245 1378166 1454530 1169935 1411630 1030184 933632 1189076 1311484 1036838
16484 1036838 1003715 1216947 1427934 973449 1018648 1225179 879709 1026861 961786 1379795
16474 1379795 1272261 882829 947406 1138648 611223 801557 1393148 920663 1191276 832703
16464 832703 905210 1113748 978148 1189441 1237077 1143120 1210294 701812 948653 1126304
16454 1126304 1163271 1053730 910406 1140430 648916 1243513 983988 1074087 787800 866323
16444 866323 1057787 700002 1070302 883468 760709 930585 689199 738795 1115501 898767
16434 898767 744558 1003347 991015 809528 829183 665473 1084614 384057 704545 918587
16424 918587 857408 1089364 932978 965343 994802 419193 605040 462153 694294 998260
16414 998260 710289 722428 787943 701936 814148 605098 887611 762610 577538 901216
16404 901216 881766 889854 460439 698284 716368 851826 231497 607643 536418 350167
16394 350167 501686 526013 840396 785071 188920 385756 769174 809751 641590 513641
16384 513641 564321 591617 701654 715417 338308 642284 685509 460889 553992 648064 402135
16373 402135 524945 745248 772891 436292 509785 453067 639600 369660 499461 428058
16363 428058 752513 437643 313856 428978 486019 403040 756715 409377 549983 711030
16353 711030 508222 445001 383025 313477 481990 707759 408085 704085 600927 614270
16343 614270 472549 508734 110373 524885 644417 296495 320345 41654 269030 501345
16333 501345 294026 265246 481403 545155 683030 295083 720654 558361 406437 183946
16322 521069 692098 535095 331260 420598 401663 458212 348184 359558 498088 457730
16312 457730 266810 81812 440488 520437 227655 410010 59435 268161 148708 443643
16302 443643 394172 164366 472314 46313 191052 456608 295569 465655 313384 136532
16291 234705 543201 204663 624913 524801 564565 438187 15892 266035 28682 468993
16281 468993 296624 370616 317290 256123 391884 362560 378663 385104 136276 406805 214993
16270 214993 275048 214550 429926 441459 140943 222575 662499 127569 235074 100536
16259 337215 168943 287762 301292 432941 215703 413010 78231 371882 408977 311062
16249 311062 264213 457820 578191 316021 618633 383705 281841 331871 -81405 367033
16238 446199 12942 238170 280430 30854 210002 -198346 63002 484099 222044 314566
16228 314566 249539 475568 -62021 100913 329781 91208 321380 250284 223789 123485
16218 123485 217901 615372 57440 533726 105666 215212 98308 456539 199587 421199
16208 421199 16197 255224 -198310 233753 761560 -40806 66462 5888 -132634 192690
16197 -16435 -304602 549698 446351 -96675 187699 161160 40387 162572 199420 288693 118220
16185 22328 165159 -13337 -66773 360304 129696 257495 199246 41754 290082 205839 38222
16173 -339968 39765 328013 152968 230236 294558 154573 152771 53395 181516 428659 104521
16161 -102450 184388 98783 -35444 223044 126076 115829 460477 544887 82808 31960 -178194
16149 93796 -221762 408049 -47769 100641 462542 214489 -49841 167429 22645 172892
16139 172892 -86301 73795 -89041 58616 25651 382715 150715 -184677 104807 -227694
16128 98642 -85721 73419 -312878 67905 -247008 160792 55050 10142 70131 -47523 189605
16116 -267220 -28495 233043 304559 173408 -12492 -45422 -194052 172533 90645 149987 223286
16105 223286 -3311 -167104 158331 151453 217221 14513 -128750 292425 23824 218756 393238
16094 393238 -106465 177726 -146232 3953 -159623 -53119 -274413 359678 -337746 273891
16083 -187944 -201661 -151236 307584 119033 136479 151447 -94474 58376 21859 73247 2088
16071 -171796 157008 -67319 5473 -106353 -9536 190258 260398 321316 24806 -247317 90959
16059 43112 -3857 101327 56798 -69629 318867 248392 -93625 139876 124312 219736 68905
16047 -114311 201849 -110930 168648 233835 -27448 -46126 110522 16553 -103939 573270
16036 14732 121237 -145865 -67867 55118 20525 -74872 132092 119179 -136546 -10127 -75359
16025 -75359 355131 43357 51414 33754 -40145 182513 281972 -90888 -123727 323338 434094
16014 434094 159216 328577 287742 103505 117594 324752 79947 253141 -1292 118627
16003 -203440 264999 426213 -16340 283760 -70980 12247 461564 108234 50631 276902
15993 276902 354926 332883 212683 -14491 231716 469517 39983 289596 232166 240387 164027
15982 164027 225394 176853 186236 308243 81109 -478615 60704 174848 15911 -168630 180047
15970 -153167 287360 -118051 -558816 82925 54632 268284 86040 82508 -234076 206757
15959 -125804 -33504 49679 -100907 163383 85985 -123376 -73090 16532 -155565 -60103 -283790
15948 -283790 -232630 -379885 -79282 97993 -24120 -189574 173486 134946 94695 158461 -144166
15936 -71128 110843 123181 -165826 -202693 -333886 -23102 508013 -195554 161387 -353001
15925 46308 63221 -112549 -252143 -127167 2649 -184506 -233785 148525 -383043 66481 81085
15914 81085 -230891 245378 -126945 19072 -114160 -22986 49910 2944 -33444 -329274 -84028
15902 -201742 65106 -11542 59220 46132 71560 43609 -138500 -78379 -145628 90659 -70163
15890 29968 -122337 -177883 354294 -188306 -163528 170891 -19767 -46420 -14539 -49270 -61742
15879 -61742 248255 -130535 -17809 -61379 -408590 34641 -203183 -161577 46901 208606 -236450
15867 -147393 121177 365173 62220 230951 -6350 74798 -2587 -280908 -159839 180935 210885
15856 210885 -279077 -17580 -85000 -83428 -123174 13438 57974 257084 -69905 -184330 -137936
15845 -137936 -84578 77749 -257746 140248 31893 -242044 279222 -124450 -263642 -323015
15835 -323015 -36971 -168409 -124893 37388 15663 144543 2420 273681 54484 -229256 -57005
15823 -75765 -459548 -176275 -133571 152324 126650 -161480 137598 72572 -280543 -45546
15812 91637 -269572 -73190 -367268 86771 -71790 -25422 -202275 -41104 -14086 26785 219918
15801 219918 205118 -145664 -99987 132008 -273401 -251145 67046 82741 -136143 266646
15790 -17557 196871 90726 -128743 219163 181725 -76382 -480491 218914 73908 -55490 1896
15778 -1895 95288 65097 173972 76300 -90406 114183 211215 163650 12858 -5030 102041
15766 39444 232854 -71891 -372860 -56986 232485 -39752 93067 83326 -78607 23840 81170
15755 81170 -65238 60609 218683 154917 -131137 195609 96190 22051 -218923 -12968 117746
15743 -224471 -268581 -37486 -98198 225835 -302570 169606 -158591 -204908 -143821 103462
15732 -305907 -27497 -138092 -4450 69503 95418 48050 -308100 65901 163847 37449 245712
15721 245712 -627 74954 -281826 -19172 -144847 120010 -55909 193320 -52192 -41652 -103993
15710 -103993 93106 -105620 -190722 43563 -159901 4637 -269368 32538 44694 146583 75343
15699 75343 134262 -180772 -122324 -54190 97565 -178842 -209378 114153 106755 36690 166991
15688 166991 -185224 70739 111481 34414 202166 -119297 -117868 127112 -46716 32203 11160
15676 -154936 129364 279294 -160669 -194947 124034 -156243 -21057 -208290 -42191 -147857
15666 -147857 -88806 16690 164192 -17288 -159998 -59206 201312 -155399 -117501 -37032 10160
15654 -253718 261132 47687 -210055 -58078 13609 92905 -258332 211420 -313677 -62242
15643 -38080 14014 7845 -2617 19257 192014 -157509 65068 -284408 -6853 48121 -109258
15631 184994 29202 -51016 -308854 20663 -21511 153060 117083 54269 12576 278880 -31536
15619 -22381 -6488 -143328 -259845 -243631 -58242 345955 -4440 49010 -171390 129772 4131
15607 44339 63734 -242479 142217 -115537 -30158 -122370 108752 -275512 -132250 -149034
15597 -149034 -278140 257838 -130259 -174594 91686 -315117 -268103 -238304 140904 -27246
15586 -55371 -11458 27669 101853 155184 62106 123575 75794 -163358 -101122 -126079 188094
15574 -245252 -234138 -128736 61909 -315985 55383 108829 11559 183719 204892 -82696 46662
15562 38737 -156909 80962 119623 -128007 -137873 -89298 12569 140263 -165256 421119 -64893
15550 173318 -81238 176704 41000 134366 201373 -172694 68178 85912 439703 54400 -102933
15538 85743 424596 101509 -84219 66118 87283 -23625 79775 120820 240196 61404 284020
15527 284020 2467 264194 58022 -273981 121403 374253 -63285 332389 194254 -124491
15516 -100737 54587 288523 131839 40783 277354 84684 26779 60819 170118 188852 212824
15505 212824 504696 223205 207044 -22637 -71099 67905 238575 238568 146670 150403 -2618 269302
15492 -80102 -232397 102726 191793 114514 327297 -369031 337943 -146336 201834 123610
15482 123610 184758 222299 -227449 335795 100830 108102 22865 -140045 100687 193645 318091
15471 318091 -55453 212455 220674 -36500 -129616 67618 278605 -12134 149721 55798 239930
15460 239930 78823 378635 159448 368085 180530 72533 98917 170513 60040 -100847
15449 280187 171942 387254 158341 359748 51335 114845 -43101 -281483 422649 327010
15439 327010 339544 196795 -42469 35962 65130 167152 285645 91216 -10658 23044 221933
15428 221933 -216391 121262 167305 -455817 131996 -194580 -93323 443127 -68154 3250
15417 19746 234287 -48112 -279892 -110311 -25808 -27805 -125485 94668 253079 246691 -11138
15405 -191321 230628 93696 -88445 -217279 -210035 -168152 -86367 146205 154229 -408860 -95494
15393 -363717 160502 232664 166585 168825 26284 258722 97718 -157350 -210024 160570 -28431
15381 74958 225905 65182 62789 193358 345443 14882 45580 79082 -53339 179230 168482
15370 168482 -33453 90892 -24914 269429 -32493 133323 45909 7443 52441 33656 -71040
15358 253599 -223967 -221739 -333552 316854 16517 11859 352806 481309 265552 -26201 -15653
15347 -15653 110769 131657 -293833 186753 -138382 -27470 -30724 76089 142496 341069 121052
15335 158980 576412 53838 186183 -30457 105067 -159258 237777 459850 142892 125267
15325 125267 42939 54670 459631 335059 142113 -14791 325956 -2969 78030 309670 426426
15314 426426 -24095 224175 62412 53783 223373 -5286 95812 412489 -168269 194600 -19659
15302 -201453 49146 266240 -142882 -48752 223989 247356 37058 -287635 76641 -135839
15291 -62230 174198 196888 -123789 -136478 -137409 90058 277579 235000 -20511 -108207 -22053
15279 243877 94161 226540 190259 353313 9462 150348 -282565 74684 114451 265537 254653
15268 254653 441945 -34488 -8097 305742 167135 142479 12552 118857 207674 -2470 133071
15256 66433 -215857 255118 275381 267624 -5255 152004 510875 141100 155972 239352 343787
15245 343787 206990 171643 276686 480327 383084 424802 19970 454182 385505 -153854
15234 556085 413622 266528 -97539 332284 321863 -96284 -486515 209593 92313 176547
15224 176547 11375 -18153 36179 -18375 -181628 -19357 180205 -14764 95246 375512 105423
15212 -333401 242158 -257534 -38341 94366 -204603 65881 203586 296958 -63345 255348
15201 -76273 345118 142908 80757 154329 156019 -80355 321306 235081 125006 241326 -130966
15189 449961 10527 244687 104822 -5837 329724 -11216 7453 96813 283666 130950 -22417
15177 202332 -17256 141289 -6880 -9472 17108 -158130 -78443 -295368 111285 222046 350844
15166 350844 -100063 103019 -43242 -180739 -119428 89812 183842 62172 119560 -127894 220563
15154 -17642 199430 -516059 220487 72984 86911 281086 119598 252683 199318 56494
15143 116060 243853 249483 262789 -116821 -167817 160766 256150 186067 194174 282159 148307
15132 148307 399114 115573 186718 -12053 67329 306347 184426 298689 241364 287276
15122 287276 126975 250227 288074 93375 100642 -4959 279335 149739 319854 -204610 473626
15110 345647 242996 358874 -107594 527589 230219 340136 -27767 98351 140180 316978
15100 316978 390237 142102 -168250 404631 34963 107757 -17828 382838 -211898 104177
15089 -291982 -37076 -131918 82233 -60150 342740 -13909 221208 313981 -39803 80715 306234
15078 306234 84962 291635 50442 306077 215310 366030 258368 723522 631836 220216
15067 409119 289428 278345 495097 432384 648262 230857 528514 -4173 261292 225746
15057 225746 306572 131389 379334 258996 137016 389225 32658 611519 243809 667904
15047 667904 215694 87365 517925 671155 368299 343905 496017 369545 289381 458802
15037 458802 543224 454830 456415 239701 452313 358477 558975 416705 707468 518083
15027 518083 330022 546707 285937 118636 446359 249356 241975 612425 548016 50274
15016 369502 609281 335945 780281 421802 419366 537554 224167 627426 241675 614714
15006 614714 188976 491055 337470 200197 301482 271381 233801 794176 195390 436821
14996 436821 698773 472236 447838 562947 405307 445481 515926 665705 282780 288492
14986 288492 521982 654555 540228 658301 673289 500367 572867 751767 420667 325890
14976 325890 357069 498558 510037 517469 396249 156600 506573 551783 664197 641533 394258
14965 394258 214067 641393 454935 486590 400805 471480 325372 644898 662922 513760
14955 513760 698249 456517 477189 735228 475793 580160 532341 648820 745193 648828
14945 648828 1026560 744605 902889 676634 759503 510500 559861 692247 687928 253096
14934 947886 881463 514105 801227 924564 716212 840386 612580 926159 909286 893719
14924 893719 1148787 968731 1043573 1067843 791357 920218 761812 905088 1016844 940821
14914 940821 839926 801571 799873 763379 625083 733903 765344 319352 457962 742703
14904 742703 309115 534180 388874 865221 604365 375664 489389 436782 376862 356062
14894 356062 445848 305661 801487 581202 643306 764151 610734 679437 752787 574029
14884 574029 703439 474681 852188 629193 409635 749638 520239 733740 325411 619379
14874 619379 831637 687997 462352 553243 570720 542926 726268 714800 541746 547421 298781
14863 298781 672635 993923 724298 421174 690473 928934 643153 372337 841257 587408
14853 587408 430438 639521 332517 371695 360182 794932 599968 804622 517770 887664
14843 887664 701568 591584 784893 1093475 696815 903969 616121 698834 1182158 687022
14833 687022 586663 753436 619079 642208 841331 579412 626782 515751 965695 492011
14823 492011 647105 499052 948163 613383 771696 905162 936373 953731 638303 761750
14813 761750 604807 799591 975598 557285 461940 564828 768496 634806 344707 693086
14803 693086 914063 482322 816755 981759 325260 583792 933278 792854 697147 624221
14793 624221 934497 730179 635558 490816 1101982 889161 733957 724258 674291 835080
14783 835080 893629 524465 761869 896463 908517 1190526 1005734 813061 756250 894216
14773 894216 1089456 900440 1026222 273439 732539 907565 710358 751306 1027368 821065
14763 821065 572452 1256908 919899 738464 995701 813102 825401 1223760 864212 972819
14753 972819 916261 803719 928138 798059 1241745 495114 1074808 1045276 950591 1203615
14743 1203615 930700 827066 1116173 870719 1127026 1038802 886114 864369 1111367 1313159
14733 1313159 716743 1016674 1015767 1288463 1072896 1013722 1467519 1336051 1207747 1028878
14723 1028878 1336257 1303777 1252129 1143788 1096791 894955 1080948 1070918 1219151 1205379
14713 1205379 1330651 1213200 1395297 1144548 979239 1186702 1118018 1193688 1107551 981813
14703 981813 1561949 1385145 1324391 1575811 1282094 1411616 1438710 1534574 1195510 1280365
14693 1280365 1353819 1269478 1359902 1309275 1011717 1220547 935965 1170540 1134724 1133926 1200593
14682 1200593 1194829 1161076 1216776 1240161 1381970 1218838 1391660 1438554 1431882 1451246 1312752
14671 1312752 1151216 1232262 1550706 1576046 1805939 1468995 1321027 1543318 1304196 1437904
14661 1437904 1523889 1471956 1651399 1581493 1591329 1659093 1628379 1447525 1430412 1700727 1774088
14650 1774088 1653059 1887621 1814124 1745278 1864828 1728763 1694297 1722957 1864646 1547629
14640 1547629 1918022 1903745 1970085 1568640 1845113 1679835 2116488 1984269 2092392 1468747
14630 1468747 2050488 2029695 1981468 2279230 2361782 2015969 1703050 2031936 2054496 2104546
14620 2104546 2346422 2142866 2342714 2265552 2323720 2239202 2482769 2214004 2279817 2241542
14610 2241542 2549364 2445936 2628771 2616962 2394077 2638355 2633588 2681345 2401452 2864706
14600 2864706 2577393 2799746 2654331 2923376 2958598 2755766 2742731 3015991 3001178 3217104
14590 3217104 3295313 3220821 3267760 3189185 2994400 3279902 2832267 3458146 3429566 3384344
14580 3384344 3733453 3599577 3603660 3778185 3728600 4328816 4081215 4282831 4102224 4056940
14570 4056940 4278711 4192705 4392050 4817492 4674072 4517172 4714359 4902062 4826154 5399814
14560 5399814 5213673 5471815 5664824 6072308 6043075 6354217 6466465 7032121 7249365 7602315
14550 7602315 7996428 8878122 9946947 10949400 10733820 9722504 8768549 7993129 6652643
14541 6652643 6241701 5587966 4727226 4553360 4013019 3944417 3435908 3688415 3551028 3660937
14531 3660937 3840898 4195246 3924238 3979868 4269246 4203335 4441701 4133934 4335739 4334868
14521 4334868 4470468 4689426 4407117 4328194 4185287 4683689 4831710 4906415 4985573 4683494
14511 4683494 4940677 4983793 5432145 5346436 5436734 5234806 4970745 5586833 5703160 5730100
14501 5730100 5844920 5520177 5871710 6063465 5851188 5813919 6413134 6234014 6271417 6847922
14491 6847922 6709554 6752325 6776579 6926034 7590250 7228743 7592806 7598535 7536168 7484293
14481 7484293 7511408 7521452 8155488 8547213 8646802 8732078 8250842 8970532 9173282 9119184
14471 9119184 9048249 8897386 9415355 9845007 9295280 9755073 10150758 10437700 10552801 10491121
14461 10491121 10927592 10777499 10756440 10926719 11381640 11434791 11893853 11725676 11987474 12122682
14451 12122682 12271769 12709394 12767106 12846198 13186973 13581021 13748825 13680067 14143833 14327073
14441 14327073 14805442 15121262 15137557 15311042 16005621 15757241 16450900 16511804 16837402 17019441
14431 17019441 17600237 17515126 17900999 18473049 19021012 19039971 19325347 19766079 20487615 20285230
14421 20285230 20857067 21262938 21537238 21701545 22503698 22656992 23347762 23886078 24495728
14412 24495728 24540209 25053291 25249938 25490950 26563740 26839575 27568228 27913387 28025696
14403 28025696 28927780 29333419 29992392 30702010 31346222 31872770 32504151 33476936 33983178
14394 33983178 34716999 35517997 36445415 37073312 37890365 38390091 39377942 40048004 41242278
14385 41242278 41870056 42792582 43720687 44544994 45657040 46662167 47489313 48983523 49678049
14376 49678049 50798314 52050553 52969731 53854483 55083419 56265658 57289109 58826173
14368 58826173 59619174 61140225 62283480 63317301 64235021 65154363 66647944 68346901
14360 68346901 69931455 70632121 72009011 73323129 74974425 76351386 78068943 79647881
14352 79647881 81260489 82415995 83734051 85354906 86282334 87854657 89344163 90983081
14344 90983081 92684445 94483922 95653674 97410955 98639540 100371605 101606693 103287299
14336 103287299 104977120 107752783 109566239 111200042 113007546 114900021 116564531 117972171
14328 117972171 120184415 122433744 124499384 126617870 128057954 130340194 133062182 134731388
14320 134731388 136451669 138143989 139709448 140807732 142512123 145783748 148727247 151670813
14312 151670813 155249367 157869937 160907507 163918248 165989839 167984177 171405357 175041188
14304 175041188 178653733 181691881 184980558 189420096 193608588 197326911 201550349 204600855
14296 204600855 207584327 210299194 211125084 216923207 222603430 226582003 231368048 234212263
14288 234212263 237391597 242090060 244104353 247109651 251293332 254719449 260575124 268262246
14280 268262246 274973568 279842594 285697018 295020849 301929060 312611594 322308835 336953229
14272 336953229 351280231 359607139 362938667 363683967 362524099 362998024 359434291 351977980
14264 351977980 341555979 331379146 319357985 303714892 285599112 266161253 247265869
14257 247265869 230096759 213358185 198582114 185305288 173638547 162702265 153087147
14250 153087147 144385000 136271789 128549309 121762706 115278360 109556579 103855946 99054119
14242 99054119 94247559 89496684 85593407 81670969 78277015 74921844 71772621 68615962
14234 68615962 66486940 63478446 61061014 58512862 56410289 54322861 52006236 50470532
14226 50470532 48660164 46887169 44909876 43851609 42237679 40620786 39396239 38607559
14218 38607559 37364917 36152177 35515375 34481621 33665638 32992784 31852545 30967951 30350826
14209 30350826 29513768 28721701 28204079 27258463 26615164 26150900 25467658 24855133 24018696
14200 24018696 23376343 23305499 22496869 21872562 21494802 20993145 20544401 20062971 19787335
14191 19787335 19413646 19088906 18500791 18025760 17710029 17475330 17095770 16655948 16375524
14182 16375524 15760166 15775633 15266091 15193020 14976421 14613412 14666455 14112827 13839061 13804412
14172 13804412 13838458 13523924 13140704 12718705 12967995 12518627 12393542 12258547 12233998 11805314
14162 11805314 11974759 11278268 11683698 11273498 11002597 10779938 10822670 10527456 10680310
14153 10680310 10257603 10056336 9641006 9855847 9652734 9827721 9504403 9278203 9416423
14144 9416423 9380428 9441873 8693747 8761581 8610062 8562359 8142740 7942453 8063096 7988830
14134 7988830 7744065 7731550 7352853 7456404 7368316 7225948 7299454 7338373 7041740 6713556
14124 6713556 6717401 6592888 6655594 6446932 6248206 6649994 6550964 6285278 6159903 5950357
14114 5950357 6018538 5874835 5677853 5612020 5555880 5639545 5412904 5558967 5512017 5568207
14104 5568207 5427582 5515691 4969114 5280183 4998799 5129029 4882369 4678437 5172636 4678254
14094 4678254 4871473 5102286 4912708 4963908 4405439 4455367 4491401 4643175 4318896 4199588
14084 4199588 4477931 4334021 4465269 4058591 4088482 4275685 4357107 4109852 4107533 4057101
14074 4057101 4132758 4042944 3984391 4244223 4219056 3974310 3925179 3527287 3802086 3762878
14064 3762878 4007013 3863715 3952679 3527689 3834912 3964859 3371352 3754379 3451845 3547610
14054 3547610 3715193 3537442 3702367 3602389 3318627 3302845 3623905 3557684 3328160 3233537
14044 3233537 3407994 3511193 3316977 3425745 3547715 3468854 3344755 3328983 3420976 3365709
14034 3365709 3437647 3533410 3360013 3523835 3506764 3519760 3052568 3220265 3312192 3353239
14024 3353239 3322974 3164141 3319772 3323767 3226230 2984729 3141687 3402076 3443612 3761583
14014 3761583 3512533 3439828 3466928 3171286 3353000 3410368 3490201 3636358 3395056 3619303
14004 3619303 3853860 3941611 3931388 3691245 3969641 4079818 3646901 4469974 4243361 4403186
13994 4403186 4693292 5137737 5786411 5780164 6024688 6834853 7821139 8804036 9311615 8707712
13984 8707712 7874155 7471091 6227567 5322044 4764914 3849985 3263496 3074568 2702110
13975 2702110 2430343 2187044 2463837 2600209 2670868 2299021 2201800 2078348 2194506 1885859
13965 1885859 1837956 1960669 1821672 1713089 1795821 2243801 1920048 1875079 1788878 1675330
13955 1675330 1617178 2069153 1811056 1753040 1695578 1724148 1760802 1640444 1600907 1658279 1701932
13944 1701932 1473262 1505570 2078067 1731462 1413054 1769338 1575125 1629828 1213423 1720788
13934 1720788 1574723 1332638 1494654 1434270 1443871 1489286 1476928 1532110 1326397 1386073 1775705
13923 1775705 1190700 1337656 1266390 1184249 1448011 1367977 1298108 1221757 1572629 1452631
13913 1452631 1157801 1739441 1345426 1419038 1266513 913302 1201117 1165474 1376676 1279745
13903 1279745 670426 1351579 828528 1204578 1400790 1183220 1246499 810482 1159281 905075
13893 905075 1108236 1063779 1127188 1088214 1077190 1182860 1245860 971481 1143272 1094790 1365050
13882 1365050 1255639 1120312 955826 749538 967746 777680 960476 1059660 1298272 1074800
13872 1074800 1033424 862099 857329 746483 929653 1008872 962756 403867 692735 1163193
13862 1163193 879860 1010640 1020437 780784 831711 786858 1157650 827110 785845 1132951
13852 1132951 880280 1269555 897160 655613 905693 947945 703854 787711 957503 863583
13842 863583 1134790 775583 766925 807918 1018149 826437 576501 830773 571721 625058
13832 625058 793431 778400 496596 562453 858759 1001049 926318 822592 596809 760945
13822 760945 742036 887425 913918 886821 1051851 877808 868252 628837 724833 785385 920123
13811 920123 814512 484005 1034488 692249 497820 959542 873536 464432 440229 467909
13801 467909 992943 745055 537545 668749 586920 609526 605907 715287 656179 613245 440599
13790 440599 621244 569163 460131 797680 832577 1001505 516998 388518 231858 766097
13780 766097 715610 270633 712372 684764 852736 596581 586018 605421 532849 538005 771340
13769 771340 609018 625031 395446 714541 652055 886038 855670 512550 744327 871414
13759 871414 596378 656080 493673 488977 412264 658957 651267 351661 701438 495896 790574
13748 790574 434272 613406 646826 146222 849616 717605 601113 334920 214701 457842
13738 457842 503920 540109 229722 539701 283359 353337 555538 424978 766722 406390
13728 406390 397874 30886 738615 481942 492478 397096 368642 612798 239787 449516 417004
13717 417004 153152 378424 359580 501744 540327 344256 494448 676998 780657 504384
13707 504384 140804 638435 744238 620718 475102 687665 359689 332741 655871 -50559
13696 450973 690044 484481 858923 69513 445324 385518 162105 545421 558209 678721
13686 678721 216160 603686 439266 212843 511780 756189 488518 272408 663211 2598
13675 427737 571563 355275 501426 154782 466735 466141 95490 130447 544501 385871
13665 385871 615450 446434 39892 219898 647456 290202 139651 491349 441995 313819
13655 313819 422415 210751 529353 219376 421898 285549 515086 123059 28938 386914
13645 386914 315516 433308 468449 408138 622681 276683 356313 246771 442035 231688
13635 231688 371172 586477 197730 432726 396699 319355 327467 -30700 382520 493708
13625 493708 268099 379580 545840 107656 633022 439009 546896 7793 351599 493380
13615 493380 141321 329067 361478 529250 91760 221219 367807 58464 606056 304444
13605 304444 466037 664725 284994 541381 609385 238511 472347 360374 368099 397174
13595 397174 263141 383378 401125 347602 172210 276300 398032 434263 434426 497937 271048
13584 271048 171767 338448 274566 550125 430455 413093 211936 433825 321067 119383
13573 83295 101948 306188 75317 280434 264071 232174 69440 361253 207795 673503 211992
13561 89283 526399 179340 24480 261289 502732 356642 170919 190134 204531 241917
13551 241917 2825 275181 513107 185524 439763 210441 275957 240728 124084 300216
13541 300216 241991 348958 579896 218157 159140 91838 168239 254481 183189 199876 395344
13530 395344 352301 496473 539557 380172 72022 -160498 176395 346605 402600 230227
13520 230227 492942 185898 464872 259189 418446 112312 42424 158709 282175 461103
13510 461103 198218 -73740 360109 26838 373851 378988 19983 109927 295351 377319 292436
13499 292436 35199 67780 223998 104155 12651 334860 17597 200647 384400 226141
13489 226141 348629 3353 127811 201734 102642 436197 182367 -55292 211184 183606 568059
13478 568059 286072 33624 425147 -51976 400955 446899 166522 374210 273018 99227
13467 -81060 -262410 365576 252216 160493 458678 493253 8625 200048 207690 474759 554474
13456 554474 281978 379620 121617 209236 -69815 439159 -193839 183590 424736 470218
13446 470218 275226 97697 52219 452449 231355 151408 127511 351907 358985 -841 464955
13434 459599 -158213 550815 279987 243360 11311 203405 37341 326825 -21614 301472
13423 81740 -113818 506015 284317 -43610 182578 122831 157232 245332 102003 26911 149818
13412 149818 116102 334977 -7814 408534 299611 84031 43427 265233 -31549 490988 629607
13401 629607 161172 111222 13735 274040 356751 231502 -121975 319685 305289 230861
13391 230861 13766 268455 311240 86369 190505 217725 352518 476159 68853 87910 377407
13380 377407 388392 67550 94694 510050 270742 306094 464588 162715 404123 111843
13369 -22271 582882 -79101 57485 339810 -4153 213680 11741 444493 239213 134884 190166
13358 190166 327409 338835 359562 281395 129086 232210 110882 711301 85496 480227
13348 480227 25053 134813 404517 428099 104936 -40941 171867 468544 296136 165022
13338 165022 183153 372011 84716 19237 419090 526334 352030 663158 447437 350146
13328 350146 238758 48161 42168 128278 141155 -92457 284892 322863 523216 144106 259120
13317 259120 130408 102698 -106572 368898 31567 60428 145514 -66195 118410 378575
13307 378575 -194220 99760 153514 -85348 412 -15184 -68074 145837 271222 -19913 124092
13295 -109130 222263 230511 252903 56806 123616 -179656 148963 -170878 -22319 -28078 186672
13283 109487 -65990 361846 155621 -56351 -214460 134349 3806 373377 -183463 606155
13272 145829 72063 -25445 96993 169131 -52256 -338053 -25704 143302 -196787 19740 86135
13261 86135 67977 -208904 -9157 -46280 244378 13052 -187695 -170639 -255604 381831 352814
13250 352814 67825 -229340 18823 51306 -63098 399552 174875 20722 28268 206876 74054
13238 182265 200291 -33188 373902 -178343 -66892 -63610 20301 -44275 221129 191279 -3204
13226 34010 138232 -42900 -11773 -142035 379908 -21734 22718 -112786 38388 315956 272469
13215 272469 63195 258833 162431 -2591 168706 105888 -86980 -33653 -33045 116152 335926
13204 335926 -207601 147435 -72669 7624 22384 245816 379428 325842 -19474 271605 95791
13192 -23880 163367 48283 91450 -44496 -91847 -74059 6000 -227185 -186111 63750 -10975
13180 137540 265525 -12182 -117505 -6298 121381 197311 33255 -77825 140060 73943 122252
13169 122252 275908 154347 250429 -35425 152780 -117536 8140 -72371 3665 94670 366346
13158 366346 -20397 -110224 197388 97042 -103822 208700 4644 209038 184002 -17681 330008
13146 -80609 26498 22756 208003 249960 -81064 10326 -72597 226408 83396 16534 112197
13135 112197 21043 78254 178179 53997 159013 -17654 -322353 -15465 825 268047 -95886
13123 -93858 252925 79127 -48678 63546 61320 68445 118588 13512 257723 29840 -55689 -7054
13110 73323 96846 -72529 -159614 33702 341208 8098 -100252 203128 183151 104108 209470
13099 209470 -235125 259177 178979 -272749 60555 218444 81268 -73415 -155163 -11909 -10273
13088 -10273 201755 6402 -16559 -44694 -46650 27383 110071 319186 -216840 20575 -43987
13076 -454286 253749 100230 23283 440245 112245 -3418 423899 -230296 -62670 333200
13065 -210337 305199 -34504 251220 -242420 -628 105149 76911 136003 15010 207173 -163028
13053 -108843 113396 79630 216944 175377 3626 96488 186151 -130720 -17470 152177 327518
13042 327518 88442 -16629 301792 -112002 47242 -144207 504989 98329 38881 -276738
13031 -160926 -95439 -139829 -244806 65847 223949 390209 39516 175883 -88453 -65121 238577
13019 -119675 28786 -42933 15155 -194131 -231207 -240251 251111 -90859 -27099 134565 -92596
13007 47341 -166630 261486 -86116 155319 104643 46991 250726 -106187 187447 -383858
12996 -7683 -85568 77365 92414 75342 112914 -68524 -28871 75723 -46410 -57663 274989 -432908
12983 -13200 -227340 252437 -10650 101178 419312 90494 -115915 247254 50907 70666
12973 70666 143075 45798 39193 157487 -79239 189110 360802 158455 247293 -91249 39691
12961 -184153 -348959 -42139 91636 143359 -53910 170957 -13859 171166 199075 129428 -202129
12949 -27889 -179249 -47529 122682 6903 15665 -251078 -5382 7931 37621 -38112 582182 -310028
12936 -130434 199631 67796 -32771 -113798 -36389 32761 403700 278426 277797 300391 53043
12924 -320423 -68982 -20884 -290196 152554 -138258 -149553 42327 10404 -144838 -101339 22046
12912 35994 -114717 123325 -73375 -182693 -67021 -63537 20701 218682 166448 83590 -117619
12900 158169 -251448 -15423 -53232 237843 -54970 78991 27019 -54389 -259574 -53072 43372
12888 13114 144054 821 170457 201532 126724 -103929 308665 -38269 380455 321978 140100
12876 40868 -76035 133772 7663 58235 -46942 166610 144984 3200 -56892 -491 -148784 303175
12863 -27779 -6489 -45914 104610 -8383 -29365 -101743 -238355 -123945 7299 -154741 23040
12851 368605 -11623 -146761 9896 64987 -127789 163943 36874 18919 -114465 -194068 -508179
12840 -508179 -143539 90475 2886 -105945 -352822 127663 27907 245471 -170027 86879
12829 20801 329120 119182 -166151 -113717 42895 27667 -180650 -133458 238660 64098 55845
12818 55845 196037 -27467 235885 156499 147827 45192 142530 -158637 -122413 -210092 -217363
12807 -217363 -41805 238378 -121541 -273009 -200672 -445344 45876 -67239 307141 -53154
12796 33291 -420351 -124761 -102115 111852 -124320 -74317 343701 188886 -87205 -93926 -70011
12785 -70011 73222 234231 -183084 80339 30853 -317794 285680 145435 -86668 185233
12774 -217042 -84928 -43959 179547 102125 -143576 -38701 69292 174261 100297 2015 -310098
12762 -114342 199923 59548 357452 153200 -143503 93675 -30535 40386 -147093 187796
12751 51602 -193305 -206491 2716 53208 -144459 190919 566587 94307 -239448 87702 33534
12739 33091 6538 375241 286501 166006 169463 165275 93276 -38934 406397 -8611 131227 125644
12727 125644 -7169 96589 1861 -129867 111072 82770 65361 143484 -19436 545633 101934
12715 33259 121929 75283 297921 103908 -186992 300604 -2208 209111 416558 62056 -124864
12703 -266524 -44514 83385 321054 73558 344390 -248046 397824 175836 14304 -131992
12692 -237202 33502 8668 -334242 -85820 154354 169209 11558 54834 180053 -105025 792
12680 -17204 108291 -10917 -172798 209002 277884 14551 17997 -120611 36185 405634 97015
12668 -182335 356238 391964 -194370 415708 183981 25680 -15288 257335 185781 228952
12658 228952 -144964 -58793 -242810 136034 -70408 253843 -148941 -100663 69917 153371
12648 153371 178389 239904 159250 39400 -164682 -99665 204132 -287693 183833 94956 316324
12637 316324 139391 -91210 187478 236633 -21157 -64091 237735 110646 373153 142270
12626 -32093 182942 203643 218339 40908 26355 315482 -32309 -46760 -43381 -141215 83923
12614 93284 178585 -154079 235919 -11590 28043 85111 -20290 -362980 -143629 45426 -37346
12602 255515 -300755 35664 -75272 -276221 -135021 193551 272145 102160 78132 -1858 233559
12590 -150602 98252 192920 -53552 -67343 155938 160445 214390 -36477 150385 -167421 -272703
12579 -272703 -255182 192241 -95103 38274 -315470 156341 16039 -116048 -29036 -219936
12569 -219936 -57840 -369352 -216719 -223864 81883 106648 -96966 -95899 150511 23549 -232808
12557 -66233 56305 -149494 -254130 121033 -205863 114405 -287308 -213529 -203734 -157753 -94409
12546 -94409 204282 -179711 218148 132454 268748 191788 169300 64099 -22187 139823 50967
12534 -485263 -148599 -153585 165786 2249 -217479 134970 -21391 -148034 -69253 -26930 52820
12522 -178089 101077 -215022 118720 -67969 110469 -156721 -145733 67750 -192748 154973
12511 34627 312589 359655 -144335 -159502 -16553 -134941 28683 198196 -25682 36866 -383946
12499 -232047 183276 25482 -504714 99896 -226491 -110473 -320600 -170009 -274425 41188
12488 341306 194261 -243331 180887 -83041 -218713 223700 27956 -87904 51888 -126045
12477 -68242 87971 29938 -74752 -5432 107841 74414 -76156 -160255 -80833 113597 72345
12466 72345 31633 -109339 273379 291991 141818 328663 176897 -207627 -187818 -130169
12456 -130169 -168071 40187 -34273 53756 -174594 101495 -35872 61695 -24799 51490 71016
12445 71016 52571 -45082 103099 191564 -258906 -95231 261007 54100 -348554 -15609 -141439
12434 -141439 -112200 -196776 -190260 -138669 -139542 94777 63501 -292997 -49729 -87056 -42016 179057
12421 -61583 -29641 -287065 -112406 257654 -249973 -204833 135670 -134374 176892 -222108
12410 364615 247869 353724 -59986 -149298 86149 -104322 109902 -81854 287325 -93448
12399 230595 -163268 215018 132278 84774 -128032 -269783 326080 -154968 212252 44301
12388 366913 197699 236997 36499 -110489 -97104 211109 35486 25237 75092 472539 -8434
12376 219463 280249 49935 273266 35637 -17472 -111678 -145185 -108602 288467 474906 31427
12364 -31526 72407 162177 -143827 -150912 79144 -30606 6964 -18316 -112958 -156992 981 250233
12352 250233 233329 8651 270403 107959 -45906 296573 218285 -367609 -204924 -154486 220245
12340 47709 62089 -108558 -81358 -88264 189201 1346 -14079 704 172480 -77586 -34685 353597
12327 213774 173384 34485 266371 306481 209550 -125594 -33251 86913 290647 63076 218688
12316 218688 143276 536125 -27944 -21178 111652 82321 52193 58224 68319 156985 -188142
12304 113320 69822 118450 22885 75015 -91774 231319 -98659 -304510 54104 162924 553851
12293 553851 258775 312483 259542 382166 321252 -85741 28594 448684 321053 209901
12283 209901 -373725 16274 -56244 9684 85616 174187 423974 173525 189462 29404 -195978
12271 13653 261478 84364 82110 180983 522412 -64112 83102 -159521 -326293 -119797 80154
12259 35972 3941 222906 246476 -86231 194092 177708 184089 91194 134502 -27455 126554
12247 -76556 183416 162881 -254161 336786 -108065 -434054 -159442 54320 175376 -298806
12236 313322 70879 373704 458339 202140 243937 7201 -222484 110286 10265 391690 352283
12225 352283 130697 382987 536267 326296 177039 314123 112560 29720 165105 269230
12215 269230 126882 510037 47741 118038 98243 150853 75244 131835 36710 133018 144401
12204 144401 77215 286016 218905 386207 364840 269316 980 29404 298813 343306 475317
12193 475317 307437 226712 13300 6918 63361 16644 148844 409365 192295 326026 12090
12181 30777 255951 162209 386542 419765 122970 138090 158565 -7946 384261 229788 -22282
12169 294958 -103112 -272023 43966 266185 182680 94795 220989 99750 140757 239220 130877
12158 130877 28754 389409 163151 104836 223573 92707 -49492 -121493 135046 51452 213126
12147 213126 -175492 344072 116146 125495 125642 353221 -146500 -87825 -75317 311487 2003
12135 200324 134146 148914 170070 118609 135591 -255240 83196 -42096 -15010 -73009 -161349
12124 -161349 158329 145333 297144 191354 118184 -202084 214548 -178722 12738 178099
12114 178099 135468 -106991 -43510 322837 -33349 -71421 226278 -141282 209287 15091
12103 -181017 63579 -80143 -81254 -31866 109125 179082 132383 196088 27978 -275695 -80860
12091 260348 -34082 -151477 128729 52153 -38790 -68102 183901 10970 194933 -75658 47876
12079 -106559 -163209 166776 -70728 19618 -255291 102968 20816 -116634 180340 -21149
12068 81476 -145342 -8947 -128853 307326 132280 74247 -74771 62710 -25361 25800 -59955
12056 -28921 11879 232392 -162990 -194840 -7880 130007 270828 23086 -40371 -324901 53058
12044 222057 -76918 -23174 37604 -225222 19816 189755 -63120 61993 89584 -126825 282298
12032 -180871 153190 400080 -183761 -124105 47421 -82022 -143228 -74292 -154552 45486 203084
12021 203084 98606 40868 138215 -172401 -138696 286656 218820 263324 -67294 147465 19062
12009 163379 -109650 22970 111562 -208787 -8937 84346 651 -58221 107894 640 -19327 139095
11996 -243129 -32141 236714 112017 192054 -108291 310085 99167 -313792 -133593 -155778
11986 -155778 -8616 -14523 -165860 -118258 287973 12242 -236648 -211331 -7311 -196127 142139
11974 29010 -194411 272052 257130 71688 -222126 271416 -153624 124941 -407660 -174924
11963 21168 92540 -90962 -314736 273953 -1971 -111953 149939 -88265 30267 120747 211866
11952 211866 -3494 139682 -26621 -198545 -22616 52182 76077 -41357 24158 -59207 18393
11940 -86888 -64361 -44387 -9569 -108241 -60857 -201966 -1449 -118691 -108249 -65717 139462
11928 -82105 -126369 193276 -132907 191898 87249 -6579 163530 122919 69198 -248593 -482998
11917 -482998 -88915 205338 -80357 -21903 202723 -386374 -105876 -53274 81199 -157317
11906 -211025 -138759 -167692 -262794 -17942 89977 -49162 -118545 -68190 201654 -143378 -171219
11895 -171219 -52285 16851 -59016 -116012 -281230 -249864 -3925 -495661 -54542 -352984 163095
11883 -130187 -34647 -160350 205048 -260274 -105767 -102969 113649 -133092 -44131 -184561
11873 -184561 2762 -288949 17028 379605 -114480 153635 106091 89975 103241 23560 140797
11862 140797 -155574 -51917 -86788 -189964 20232 5847 -97364 -49291 -99846 -13602 189666
11850 -156422 -446688 -129426 157641 8820 -178548 -292283 -486804 154163 -225610 -225347
11840 -225347 -96342 -91861 -21827 55607 -98767 118168 -173939 -226711 -19436 116666 -226596
11828 137096 -184256 101057 51902 -105415 97360 191846 343422 263850 280832 -152071
11817 -257818 -383567 52633 231718 -284184 104203 -213483 89199 18252 -51203 330258
11806 79375 -406427 -612158 445236 11005 -349383 143133 254414 8227 48276 -26520 -157937
11795 -157937 -59930 160635 -106347 308920 18848 2970 -70218 -154417 -79914 -385110 66655
11783 15415 78187 -315173 90876 59362 163601 -366342 -142190 -109783 298958 167309
11773 167309 -98029 -130114 277957 -6821 67410 -42385 231244 -144336 54936 -119183 -213928
11762 -213928 127873 -188331 -33180 23529 230785 -213075 -94191 16499 106675 230894
11752 230894 -118551 -220 -214550 54061 -152522 -177513 -78933 147844 -2057 214655 -329667
11740 132483 -63848 30562 212086 -159357 216234 179199 -435362 260425 -1199 -284264
11730 -284264 -87863 127784 -74335 100371 -15128 -91607 -144960 -234236 -36880 130620 82537
11719 82537 127619 90019 -73830 57384 -9928 97331 -79311 43587 63011 -142776 34353 206747
11707 206747 50388 147673 -173196 -189091 -250336 -36512 -22832 167047 -176134 -215865 -162463
11696 -162463 282903 97261 -159642 -25992 60064 -224860 380741 409317 185189 320155
11686 320155 -11300 -90306 131928 118665 108549 155332 -304925 95106 -271534 56603 -72242
11674 -163603 135143 -67479 134324 -362880 101219 -39407 228583 -11397 82121 193035
11664 193035 -117591 17874 54834 -11417 200219 -85736 12295 -21124 182662 -138782 -259780
11653 -259780 228266 64412 -83402 174239 86706 -79358 128809 54064 -200806 388886
11642 135600 4964 79587 -159678 164605 -320856 -111182 97708 125161 363768 142569
11631 -117293 136836 -300189 -235688 -32006 35319 74207 -40083 251786 -104628 250150
11620 -60289 227801 -127833 143265 97692 6439 -84061 103882 -171244 -394837 135610
11609 7590 -181138 145719 243389 292054 -256591 -114239 -26397 67424 124146 -97715 -7874
11597 257562 -113473 -154503 145400 366014 -24735 216995 269673 137126 69648 410413
11587 410413 316759 197559 -1960 151414 -109489 479985 -36285 -81788 28144 157219 38892
11575 256358 314028 366325 102640 -119015 -147173 -109591 -108813 23814 284954 -66371 155027
11563 3854 3234 78909 85770 131320 474710 144526 25158 -5494 -41845 96680 74894 406856
11551 406856 -160648 190933 81515 26732 506622 -68725 97051 46526 -294811 293686
11540 56337 10808 26841 -269412 -38611 -204596 297585 145526 205257 329251 179122
11530 179122 31806 249636 -262638 -32575 123090 20804 227384 -255536 49209 -78311
11519 211801 91342 13420 387606 1958 176581 -11025 45727 214841 84161 319005 -25148
11507 115571 79297 -8862 167600 354546 287464 448300 -25724 351293 11680 104598 170064
11496 170064 39521 21453 12677 126214 152681 49916 195178 126768 -17715 432861 278950
11485 278950 68027 -162008 246026 559995 73981 255391 159534 201967 213256 -78774 91632
11473 602809 82974 348252 302841 336745 -11039 -104034 -98516 28838 190290 -101954 248149
11461 116443 -137632 146715 161585 -183625 -2322 -9907 -227987 -16350 -28216 -116103 -96982
11450 -96982 -108386 117143 38540 -38902 419362 173880 -307438 -34045 251166 87419 151808
11439 151808 10647 -54239 -202404 104549 392472 312903 279104 312616 235945 130170 -214918
11427 -91690 44103 -90621 -52674 -98026 -326406 234651 -194116 173700 203793 -349452 -263957
11416 -263957 -274276 -36442 -262659 49867 461191 -64699 27584 54196 -2030 373312 28797
11404 -103630 4922 11252 37908 -11693 115483 -290741 -206673 -67644 -185445 319271 -290453
11392 27968 -146342 94 119826 97544 198393 -10386 218317 -66139 140926 135421 -143241
11380 -56137 -160840 130964 -315114 208533 216747 251954 -149453 -191443 -476788 69344 -96329
11368 -81822 -446172 -120225 104088 -107230 162333 -119585 -177058 433704 -240575 -355028
11358 -355028 -166013 -185833 204552 -298659 -61183 93205 -272871 -54644 -392676 -253682
11348 -253682 264124 150944 205667 -30089 -11231 -94149 -183063 233913 -19858 138860 -228915
11336 -388989 -22948 43649 31194 -4889 90470 -208011 -197367 141888 159746 303745 -192028
11324 -137463 29544 -258658 -87323 -161507 52871 78993 -49595 -382881 34495 -254721 -425283
11313 -425283 -206789 -132470 -178219 -191855 349797 127162 18390 180085 263983 -136735
11302 111746 -2596 75605 -47572 89555 151090 -283431 13554 60463 -171059 144146 -43662
11290 -135198 120208 -182944 -93126 -27512 -369917 -103518 -214321 -289255 -322539 -304566
11280 -304566 208743 89453 -93083 -65379 57622 14055 -320474 -200567 10005 92861 -117351
11268 -161493 -174291 78980 53258 56840 113153 -57285 37873 120294 -2637 -406871 321681
11256 142933 -19252 252375 67656 4193 -316103 168604 59399 -134799 82936 323169 159558
11244 202803 -19331 37023 -136158 -248398 -80792 277054 124073 -5679 -209746 -32968 -89950
11233 -89950 267161 61210 266206 -388135 231501 17528 -1563 99864 30068 93139 -130903
11221 -8116 -252170 -260507 -281486 -102377 174097 -221868 96701 166018 -128838 -239433 -48160
11209 8184 -79258 -217709 115340 -126733 246193 -90659 -484139 250143 -88662 143367
11198 110327 177112 -67318 302005 46667 -97728 -53229 166430 58172 244385 16594 -18609
11186 -182200 -50201 31010 -234494 210161 31764 176456 101086 37583 20435 -96617 -206698
11175 -206698 -251484 160720 82694 -125531 135402 257549 145950 -165981 199114 21622
11164 168456 -50218 -101952 -286071 -45337 -50319 69930 98571 -13885 114355 -52556 -136528
11153 -136528 255194 -319476 383314 277082 277762 365730 181727 -131956 -211397 -127048 -213675
11142 -213675 -436592 83250 73188 176441 306575 96471 71729 149025 -83610 267254 -135923
11130 132553 214955 77917 8917 414975 99352 298062 94409 538708 271371 114866 381666
11119 381666 294568 83620 354810 32659 10191 394184 556 211769 401766 435271 293428
11108 293428 250612 647285 372575 515114 657366 226358 417393 669337 407456 651362
11098 651362 397531 394828 473645 390073 432518 412167 561925 149190 456904 61305 155250
11087 155250 650779 688275 319325 493524 266741 233795 426818 450735 529375 435644
11077 435644 532913 577644 279466 631726 428408 469863 267872 541815 752262 585377
11067 585377 706987 561167 637135 782415 703300 774286 670449 574628 422144 709373
11057 709373 1011990 801379 582665 1058276 929653 857420 852185 654527 728857 972075
11047 972075 839540 571918 990742 928955 1068251 842764 740265 1079151 730338 1187888
11037 1187888 749334 818072 874849 1128467 778972 769258 935216 992010 1335707 655463
11026 1017584 967319 1091873 887301 778105 842658 844250 728838 942184 812411 944700
11016 944700 909844 892935 941104 1174061 743036 791204 878559 413451 805243 956030
11006 956030 683271 969984 884239 748118 943409 800907 1035127 957164 850474 866003
10996 866003 978682 994074 1199676 626571 1153563 1013212 915746 1180811 1196785 1394267
10986 1394267 885413 968141 1037948 1122992 1161722 1186303 1453310 1312035 1299023 1515865
10976 1515865 1148330 1438003 1374604 1661093 1392100 1862458 1698442 1848910 1604571 1412668
10966 1412668 1480220 1304716 1785901 1530090 1304692 1284757 994282 1359278 1087364 947765
10956 947765 690075 1223740 950840 854241 737625 637022 550025 430438 531188 361481
10946 361481 557709 574638 371682 275810 202637 199697 170533 -237672 147750 -96922 110715
10934 -67979 170760 92488 -77473 208319 -157499 -94535 -31742 174992 -256602 -30335 159349
10922 -33667 -377745 32320 395180 -251743 273680 239045 -201343 -430793 -32871 137839
10911 -218269 52676 -242056 80761 50017 -166470 67605 -23928 -233880 -143914 209202 41143
10899 -11924 -135116 -94316 -90671 387767 128146 -181955 44134 -4965 -238611 77834 97420
10888 97420 -172215 195212 189810 -342429 141081 -282922 90189 142825 -107859 170571
10877 3106 50409 154127 -71309 103196 -438406 63358 48031 -50103 65497 -128167 -224224
10866 -224224 -50045 67461 -228636 -94566 110784 -193398 -68331 -130879 -83293 -56093 -217246
10855 -217246 -83755 -151318 -107304 339368 -102970 2062 -67464 -297994 345651 -113988 98532
10843 -131178 -34399 21782 -73637 -106318 -51849 -195823 -140605 -270423 38011 -27341 122275
10831 -257606 -207101 261448 53011 -104618 -110688 -320911 -52174 -94313 170494 -109891 -10036
10819 -41467 374309 155214 175151 163986 86972 206514 304986 -107686 334933 -84857 -164999
10808 -164999 -262622 -183380 -77798 -137419 -202470 -163303 -137661 -167224 -186460 132363 306755
10797 306755 -122013 -234389 220642 -308780 99431 -10211 96460 -114179 90511 -440700
10786 -220430 -427930 -108830 -347358 40947 -167106 13543 187022 19927 -28358 -154933
10776 -154933 -48504 273943 -77895 124293 -28006 -141591 -215345 12714 -6897 -73411 -19324
10764 -209756 -139377 157611 -130495 184355 -29324 -268014 6020 -34630 -238339 -95644 145848
10752 9307 115559 -40546 -113868 158402 -48496 -127865 -238349 -138566 98553 -167333 158220
10740 -60535 158886 -33832 -372162 -137283 198168 -456939 -138086 -217886 195277 -361325
10729 -146848 -148729 -88368 -13004 167121 -197253 -83421 -100407 -42986 -51717 124908 169669
10718 169669 54662 -6702 -428059 73246 -251576 -361549 -89619 -87054 -29836 62471 146570
10707 146570 -267860 -44352 -82558 -4264 188451 132005 -246464 3179 46944 -38947 -57882
10696 -57882 -128744 361646 -39578 -17494 314016 -122444 -43037 -234042 17833 112663 -1127
10684 191798 13538 256324 -189004 -72551 -223979 -100425 -125237 168422 -100045 215205
10673 -160161 13542 -16573 -109314 -76189 169923 -199975 327007 -172583 -267898 -133086
10662 182781 -210470 257805 52446 -9813 -313367 254252 -28738 -116594 -16209 -232330 -88805
10650 422001 -22277 -101011 -455575 -25471 -27781 -7976 171226 -187707 -170666 108291 242600
10639 242600 14399 205147 -454736 191704 192708 -196748 166474 -72040 -78292 61050 143824
10628 143824 -18003 216156 62395 -183679 50222 -188100 40866 -48355 -90466 100389 220273
10617 220273 -299263 -87376 -155157 -295300 -190061 229335 -320546 18179 -35186 29195
10606 347789 10310 -153499 -99953 -93991 -14735 -63744 -222173 -148508 31499 103623 191469
10595 191469 7437 -190628 -38127 -366964 153119 -81438 320884 -1118 194331 -50677 -111390
10584 -111390 222769 -262623 -42633 -91561 -6454 18089 -43045 -146445 -489334 -361724 -127116
10572 33967 -16263 -180680 152546 -8469 -134477 -402134 124270 -15463 -159856 394033
10561 -129297 50983 -145805 -139146 -160 -74381 79289 -255838 245613 -81713 129485 -308378
10549 222832 119709 -314990 69997 -196018 -354882 13779 -264905 -176385 65965 -169036
10538 -8218 -44481 -220687 -350301 -84408 -332380 11740 -10424 -162144 -58477 48426 100473
10527 100473 -1068 132841 124554 262391 -197187 -57808 338282 -384878 43371 -385145 -186703
10515 99130 200660 62736 -290451 90456 -11814 -54091 66887 -270759 -145429 271817 -258300
10503 143793 -228227 173005 130197 104166 71711 112197 169708 49243 -246549 230915 -27239
10491 33805 -12394 141040 148782 -233584 72387 -9603 -239509 -126591 -13209 -162290 -121994
10480 -121994 195646 -124081 -391613 -16991 128141 227477 -76656 14332 165919 -30840
10469 -50233 -96882 -59355 -270691 166056 -71233 -254648 -31878 -120648 279910 -228611 188709
10457 17340 72121 -73269 -88988 57032 176236 69808 123939 -382588 -104169 209940 -61714
10445 -255786 -162935 -101760 -38303 224131 62349 247958 -32963 209873 -297123 330781
10434 -93961 -283578 293938 -151915 -87608 54405 -15329 84556 -159975 149416 -12724 188495
10422 99897 -8527 -246974 -53969 113825 179380 -49148 504370 3441 45456 -4132 -153776
10411 -153776 12429 -75278 65528 190506 436442 -109430 -114265 287177 53089 435514 188310
10399 297154 114772 182277 -215470 213352 -372301 86230 107614 170495 58064 69817 107368
10388 107368 39472 103860 244796 271692 87876 240902 67556 324687 63064 314793 365594
10377 365594 152421 193627 339632 177123 -145564 118010 326162 497692 -74256 515169
10366 -6804 209565 329925 283579 198519 170781 310144 243599 124702 521482 59621 183218
10355 183218 222859 307742 422050 365477 39749 306136 421517 258657 170061 195447 -170235
10343 232843 206705 93968 236399 -51319 64236 220542 47810 297749 206611 -73405 111241
10331 -38502 24427 -234307 12711 148519 287768 322896 81933 25182 194409 70639 71654
10320 71654 -37345 -18019 68509 93738 58171 225596 -90457 284981 76686 18439 -33876
10308 -126481 -221300 89644 -280913 -28332 -270615 58694 293250 -246854 -53181 102842
10297 167627 -124522 -105756 114529 342091 -336681 -136752 90432 55568 -177011 131571
10286 115083 25242 86905 -140204 -90927 11517 -128311 114615 112755 84795 -218730 -144524
10275 -144524 -315071 -69885 -439457 172282 -108136 399285 -319379 -118277 -175994 -43125
10264 -187197 112437 -46829 -31196 100 207668 101651 -4291 -235226 195214 11270 178029
10253 178029 445646 191627 -86238 56556 71653 -191630 -120291 -53404 -175057 -121342 -102178
10242 -102178 -469679 216862 -366394 -230150 -15210 -106885 -295043 -62141 -186645 399142
10231 206810 97367 -250480 -427014 -195231 -145877 221011 111292 -221084 105571 485595
10221 485595 40927 280075 235991 -5833 52801 -187587 -84736 -190708 33751 -112342 -231953
10210 -231953 -360739 -429699 9761 -208920 -16341 -34486 -342322 -86624 -211429 343912 -418051
10198 -108337 -51689 -98504 68139 14377 48089 -1858 176455 210302 -288836 -460289 -144894
10186 -223216 -204624 -147984 -179326 3668 -311454 135552 -210096 -123050 144245 -273918 -145169
10175 -145169 -54616 -223699 -41173 124620 62534 -271644 64655 -19710 42452 -349014 185991
10163 -55593 103108 -79943 14908 -13788 -187596 32358 28798 -125156 -94982 -150848 -9976
10151 -441624 57787 -142560 -198725 -186973 -25816 -381358 -273492 -38372 70884 -2188 61736
10139 -381638 230732 -283819 -263704 -383198 -180399 -61753 -15204 -36191 51508 188390
10129 188390 146632 -71434 137962 302124 -205010 38443 207478 192137 3102 -293678 253395
10117 -110827 -169411 -16767 -328300 -110013 -180908 -36146 106905 -365926 -50366 -35572 174959
10105 40769 -123548 -99583 170967 -277583 -14255 -309284 462557 -137533 153493 -312759
10094 118289 -200473 -304465 188982 228807 34213 -311806 -36084 111002 -60521 -184320
10084 -184320 45447 217901 -188648 -479576 95908 -153839 -44389 185690 -47605 -157092
10074 -157092 -304603 95641 -107620 -27059 231734 44548 -114189 -322991 -54530 -133836
10064 -133836 -135585 -202891 -345382 -550519 -228301 173605 173865 -354501 -12570 -112815 -171339
10053 -171339 -331211 102323 -72214 -260101 160265 61178 -39590 125401 165355 185599
10043 185599 -77446 175465 123187 -216569 -95724 -16917 -72260 -193046 36039 -63920 -97740
10032 -97740 88109 92279 159473 -112634 14166 -73755 -52225 -61868 -82313 -113336 -578423 29603
10019 333287 -169483 146909 206440 -240546 -191631 -152001 -204359 -132342 -108338 -399478 -75191
10007 406831 -280972 35803 -94541 -214072 338825 25180 27749 -322711 46844 215387 -242802
9995 -117384 16557 -141641 67722 -32353 179497 270285 -55967 137209 -41692 -80744 -40224
9983 -96605 75406 -156471 237924 -396744 -111260 -20318 -208570 8262 -29219 319326 -236726
9971 -195445 -317449 -169502 149393 -124804 653462 -43626 -392854 -95240 -229349 -182758
9961 -182758 182121 -329425 72324 -341334 -260145 -43229 147461 -195364 -188991 -153150 86411
9949 -139501 85342 -314289 -57185 -370245 -299303 64368 -210625 139791 -189777 80266 -26189
9937 45580 -98265 -128420 186161 -411232 -178009 109037 -171500 264117 58729 -49767 109767
9925 -7846 -223064 -104663 -130702 -207265 134301 -19569 -210556 37973 -224901 44657 270345
9914 270345 -92536 -193992 314697 -343313 -137895 5198 -39146 3384 -261871 31584 29134
9903 29134 -61106 -188230 101764 248299 141464 -115612 176828 -175841 -193432 -218061
9893 -218061 32077 -106857 -12057 -136606 -158303 -46557 -89623 -54117 -347144 -28556 139745
9881 133316 -279362 95563 -5178 -146646 264467 -185596 -176472 -170186 44318 67081 182431
9870 182431 -229013 -203048 -39161 132973 152674 -400317 -8796 -306168 -91041 -63091 86482
9858 -320348 -112763 -77922 65232 -106899 -88954 38812 -312446 147502 -148131 -54970 -227863
9847 -227863 -119670 144128 221997 137671 82892 213789 -128584 162186 78926 980 -224862
9835 -10300 -214176 -55146 -183602 -369427 116503 177505 150704 -209560 56977 -410 -179605
9824 -179605 62075 -136278 -29506 9969 -40208 90756 -171124 -96394 -152814 229267 -60450
9812 -931 271714 -1785 -132691 -326086 -372564 113728 -171548 5889 -269683 -63417 42522
9800 270414 229868 9643 -22598 -15295 -190307 -214929 -38551 98440 -278875 -14285 -187648
9789 -187648 387273 -184194 -101558 -79091 -23011 -286022 -38112 253239 -102233 -229485
9779 -229485 -225060 -238602 -192572 163439 317635 -269740 3389 92070 22017 -82544 -165435
9768 -165435 -118674 -174260 -40660 -173131 26300 -228299 -50580 -184550 -205255 -191931 -27070
9756 -46853 135254 -144320 -134088 -201322 184905 92968 -127119 -74836 110595 -307591 -178871
9745 -178871 21471 -92352 -401273 -7464 112058 -98555 -180364 -56552 36078 49522 -116064
9733 123173 -254105 -105460 -126575 -46113 -139520 -235728 -220848 -448406 -223686 -121691 107012
9721 283891 -86285 -87437 -153757 -260702 -206852 -83018 -215269 -84542 -191046 -389043 -309463
9710 -309463 52500 -384948 9191 49684 -70898 8541 -10903 -317673 -253567 242243 -95824
9698 -36185 79488 53627 228949 109315 -14188 -219262 -242746 -209161 -46147 -37339 -245084
9687 -245084 168002 -77711 -18892 -526947 -200645 -210562 -128341 -161930 -171627 -44967 388025
9675 -136606 349262 208316 78898 83443 137048 -379623 149304 93582 -29324 176853 -10562
9663 -163945 -184719 257679 63250 -122618 -183373 86180 173999 109083 208039 -238524 -173982
9652 -173982 -380201 -45583 -179500 -158298 9155 232586 -231559 -19466 -156848 65170 -20998
9640 144396 -287929 -125131 -7735 62616 -447296 33744 22341 -140909 -136920 -18584 160906
9628 1153 5496 -162103 -2831 -84955 -65851 327059 -80776 -150808 -147948 61673 -48442 149467
9615 -186382 131300 -42738 125315 -111649 17365 -333276 -61632 -195639 -85060 -78251 -206775
9604 -206775 -7220 -133344 119337 136244 -315351 -45571 -143963 -21705 -246590 14621 62671
9593 62671 16768 -18316 -107367 128624 -16268 -60033 -27550 -400456 -20352 84330 -184715
9581 -117288 95530 70692 -136894 -256759 -195370 27739 -158356 -52052 -297221 -343036 -231762
9570 -231762 -232104 42583 80013 -128334 -271972 -127200 -225162 -147567 49997 -78659 -129537
9559 -129537 -220306 -122070 -48957 -79949 213281 -293997 -218756 -47129 -50139 -109015 -306325
9548 -306325 -350136 -256255 -225594 -324424 -269295 -392824 191831 -22128 -96130 54507 62735
9537 62735 186266 25036 -199645 -25214 -253323 -4335 210873 -173487 -142050 -196641 -226693
9526 -226693 -253663 -132186 142249 167340 -215051 -247033 204468 -138210 150272 -262238
9515 216518 -12234 -482866 -116835 25492 -146947 156157 -430190 -143882 -275085 22932
9504 -116281 77033 -267537 23686 -125890 -110038 -45798 -64344 -353479 -300961 -113690 -39441
9492 -9491 -285980 40558 108621 291628 -76066 -123729 -8895 -108114 -302585 432239 42747
9480 -119057 -191719 -325902 100343 37139 125160 -382736 -235166 13826 -280272 -97003 -83285
9469 -83285 -215709 -306082 24343 -334685 219662 -211302 40413 76457 -4063 -218935 -90669
9457 -107399 -290104 137675 -120284 -383636 35047 73195 -156195 -96384 -475968 -207575
9446 -590410 -261328 13431 -193576 91272 136391 82838 -98935 89737 -212772 -24704 15814
9434 -140087 -197252 1488 -106806 -165286 -148981 -260064 -108201 179711 -142010 -335206 -126364
9422 -83655 32336 -46657 195732 -280206 -70303 -162129 -105326 -89414 -280599 -230297 1467
9410 -398458 -128296 -51890 -190089 5677 -160245 167977 -195288 -524727 -17039 55395 -319961
9398 -161228 -9741 -260379 -336367 -114468 -108871 170106 303227 -233280 -91966 151144 -48956
9386 -273199 117016 -457906 -258011 -88762 -292309 -64067 -226800 -29928 15793 -138561
9375 99484 -57643 178599 -141464 14129 126128 68135 32285 -80720 44237 -3889 26620
9363 -258883 317870 -37889 122342 -232003 191744 -117269 21526 -310804 -73904 -246121
9353 -246121 -60729 -295467 -215021 74099 -65191 -15767 -10946 -212470 126218 -234798 -24621
9341 34716 -16730 50142 11206 -31276 -355404 248764 -135945 -240996 -67867 -70402 47863
9329 142511 151617 261325 164126 -321111 -62018 -53798 188404 -52642 -222936 266464 -102182
9317 -195965 -49207 14515 -174244 126350 -33331 -117434 103788 128562 225057 -107626 44077
9305 143037 -190093 -111069 -42949 -133895 135677 50568 -133120 -112716 -46943 65576 -21559
9293 -139098 110470 5713 -115379 -39813 -52954 -47548 194153 1847 202798 -287878 109405
9281 -178596 -118958 -69900 -515944 60732 185202 -58687 34775 145112 -307270 58821 89273
9270 89273 -136194 -78426 211774 -183528 -150514 13585 -388882 -14762 -12671 -386363 -104816
9258 -31130 -185155 -161006 10994 -348064 -16948 -275344 -40368 -2116 -105740 -195426 -135283
9247 -135283 -46756 -307003 -50127 -11395 -82377 -74948 162489 -181079 -205988 95890 -129469
9235 27051 -170198 133586 -102463 21204 -288195 -269788 12927 -54102 62274 -115134 124974
9223 96126 -146434 -198520 -353007 102021 -197315 -315674 -195182 119312 -25635 -161413
9213 -161413 -36681 -303 -155961 -259200 88608 -192508 -215218 -80907 -142468 -358494 -20194
9201 -42559 -427952 159589 55804 -209300 -119907 22643 -464910 26822 51571 -99430 -158325
9190 -158325 -201242 484 -198541 -142445 -377355 -119999 36301 -72303 -415329 -53846 184192
9178 -49828 -82829 144473 -21408 64363 49978 235061 175619 24474 -61390 -283798 -171703
9167 -171703 -197575 -111128 19335 54316 1190 55557 -9957 -43413 -234573 -81117 -145904 -256024
9155 -256024 11124 139875 56089 -198324 -88038 -43840 -35777 1766 -140985 -16596 -33690
9144 -33690 37700 -239480 223252 249693 190484 118719 28995 125264 -355123 -260344 102633
9132 147723 -347285 -318971 -278887 -87639 187199 -214469 -176482 -221013 -228262 -133484 84884
9120 -285350 166635 -67616 -100952 -85323 -354857 -130743 -225176 -269801 12855 -10354 222282
9108 138232 -127205 63608 -40480 31110 -193480 -108603 80409 -209717 -113451 -149121 -37107
9096 -83069 -14455 23136 183034 -2992 353301 -127505 -136583 -245878 -314758 -212837 180223
9084 -292458 135122 -18190 -98996 -287939 74807 64039 72508 42853 96405 11071 -507475
9072 -33396 -389102 -246962 98838 -121007 -225874 -4564 -123766 -339930 285146 -104662
9061 232131 -228515 -71612 -466176 -4058 62595 -63363 -258952 48366 -227340 -559508 243407
9049 127489 76057 162697 159003 -28056 324510 108953 -228042 -196168 -399914 228480 -65974
9037 177272 -64437 -101980 -5046 123737 173044 -164287 65436 -189948 215828 -216450 -55864
9025 2797 29359 -64842 -263837 107199 25276 -147379 -130625 227134 -150235 -180963 -279266
9014 -279266 -101499 181060 80731 -48802 -211385 47376 56698 21842 -23693 -111584 -65578
9003 -65578 35782 -99410 216839 241223 -308870 11311 69275 119256 75297 -371275 -67529
8991 -202748 -175033 41235 -75444 42192 54372 74615 53051 50231 46307 29614 168912 173770
8979 173770 -210469 312110 119798 -76594 210677 81691 140892 -87353 253427 69361 239491
8968 239491 329354 357303 98324 -135830 -92318 -153865 -19985 -176146 236941 256100 -194996
8956 84428 144883 169847 -208743 213844 84577 253539 332763 22684 312695 239169 311104
8945 311104 182030 246879 443416 493297 331774 234141 446580 257619 638188 340403
8935 340403 569305 213992 169905 401836 456900 665620 470822 527644 566963 973571
8925 973571 577220 704755 1427117 1458972 1894442 1716816 1113082 1089983 854427 446622
8915 446622 393897 262249 -88392 121565 250533 13475 157867 12975 20057 148795 -53946
8903 72945 176062 72369 20191 -94416 -233509 38683 -396080 -298946 -164982 -251414 -142320
8892 -142320 -48524 -99656 97526 -411162 3232 -258506 380959 -52927 -209194 141166 153469
8881 153469 133624 -254761 174056 66122 -42027 -157376 -159994 -197160 -294312 -248431 -193235
8870 -193235 -97571 95465 -201022 120073 -244686 89489 35265 152422 -50854 83581 -349892
8858 128595 51897 -15072 142662 19440 -159695 26684 -171339 48659 -285937 -468634 -250436
8847 -250436 -13807 49772 -120459 -20285 -170865 -52258 1575 90428 78074 -477867 -134565
8835 -187312 71432 -143674 -196093 -232618 196049 23543 6336 -247312 -86206 -65311 -110001
8824 -110001 142576 66926 255986 173552 48389 27097 44845 -136568 -275129 224472 186387
8813 186387 -83203 -212188 159021 -120597 -327321 -28834 138573 -75722 -330384 -358053
8803 -358053 17460 98395 -14726 -21765 -476383 127891 -501326 -178192 58927 14101 -55545
8791 -124530 -40575 -136597 144275 195295 131077 -94592 -245637 24646 -44608 -111434 180400
8779 -95548 749 215534 -167794 113296 -260397 -111586 -55915 143545 -210418 -158314 -51178
8767 -473098 -183590 -5582 -86983 78906 21070 15523 140292 -198464 -49814 193660 -61556
8755 17595 -77256 115235 198248 -193031 -251192 -154136 358976 -343529 -80068 -195105 -167977
8744 -167977 112958 -117509 272027 -131333 78139 -185156 82178 -14026 128472 248657
8734 248657 -420714 -242891 -216135 79458 -140034 -178619 55432 -82256 -94117 53231 -90648
8722 -196382 -44264 170465 4470 -199670 60696 61 -8736 285356 -197909 142754 9257 -41497
8709 -269897 -218607 119947 -41353 338759 -143473 -303188 -173013 89082 -204320 -308898
8699 -308898 124958 5859 53445 -129741 160521 -349006 -308127 -1122 -43732 -93170 56922
8687 -119221 -167764 -287349 -37203 -317172 -8485 68729 -312047 14392 143923 169022 33889
8675 -119475 -230687 -170150 32287 65134 -153018 56012 202514 -122055 -204347 -59627 -4692
8663 31044 160810 202335 -94035 -328354 36417 81324 -3630 -309390 -234420 -96263 -82782
8652 -82782 -203160 4659 -17952 -234202 -318325 -96899 -103636 24656 171004 -30814 -103875 -198128
8640 -198128 14202 -196344 -185889 29886 -142489 -127084 88789 228007 252880 -1354 -224606
8629 -224606 -82963 114060 284664 63012 -296196 -50584 -40864 64488 39411 -19647 271609
8617 -201127 82435 21583 -115780 -447948 117374 -135261 -91959 -400605 -49890 79216 -259710
8605 -220160 -255778 183041 -308326 -182909 -292826 -129713 -165769 -114356 -32355 -218524
8595 -218524 124046 -49931 88158 -17135 -398732 94634 -65092 34463 -104519 -161784 57184
8583 315253 191736 -225069 66768 -38720 -221080 -214695 -364101 -38427 -23842 -477835 -1359
8571 159804 393937 -38666 -199406 -69639 347843 -144851 -100136 -186576 31593 156148 -131309
8559 77407 -66674 -90931 -114876 216872 9955 -308902 -22945 108099 178437 38634 169019
8548 169019 -29178 -63395 105430 -81523 -160194 -149025 -51952 -176607 -319996 73134 -110766
8536 -11275 28836 -171697 -310867 -264070 31399 -36578 -103087 -93302 -178506 -510431 -180751
8524 46282 -100760 -218179 -507969 178805 -46361 -199808 43682 129964 239314 -79165 179031
8512 149616 355518 -51988 192930 -93892 208037 65376 -32340 -73858 -60820 40648 109285
8501 109285 -61179 -62187 332725 -127297 86913 -141628 -74731 -303412 -80785 39209 -247881
8489 -91876 154839 -122340 43471 -143894 -5185 80424 -79056 -185036 -122574 2978 -133427
8477 -232130 344457 -131900 -32988 -194345 69284 73151 -145697 68361 99233 -206627 482767
8465 -85781 -230545 25932 -210132 -121193 354098 -66587 44497 -157823 7094 115835 48502
8453 -244802 -15576 -318876 -172730 204515 196819 -346488 -305337 -41577 -291050 -14272 -9633
8442 -9633 -47205 -190015 134818 -35900 171643 270199 -362495 -133365 -172382 -19359 -289708
8431 -289708 385515 -61028 -27331 -87094 84525 21995 -192131 -25447 -256742 -33006 -134219
8420 -134219 249962 263837 158898 220085 221960 -71078 -163699 169480 -290291 -32740 28536
8408 -120514 -27737 2502 128574 -83283 -238842 -199113 -58098 -76845 -353248 -166651 -12147
8396 -9077 128456 48896 -148613 305988 -127843 -21727 -148526 -128042 -96327 1409 -159309
8384 -331444 44860 -25928 -22026 -201165 -78690 64497 56909 -103435 -84968 -8158 -18439 -187067
8372 -187067 47062 -87024 -367868 -171140 -56099 -362633 -107720 -45072 166102 15526 -281134
8360 172176 -248060 147158 -181870 93584 -162770 31343 -191822 -312992 -183649 -305434
8350 -305434 -176578 123755 -335210 -189210 23245 68812 48050 113062 -172267 -354426
8340 -354426 -109082 -433306 -185762 -348296 -264675 41455 -54309 -448022 -51533 266834
8329 -175180 129386 -360259 -86154 90041 -80261 108679 -11644 366430 -194380 97646 62564
8318 62564 -196485 -132373 -148845 174504 -119720 -306351 -104995 26931 -172909 117965
8307 108457 203100 -72728 2515 -308958 -31227 163089 -64906 15221 -18627 85950 -118025
8295 -86070 -140774 -298274 -69085 -64963 126157 169569 330559 68305 -170257 7013 -60177
8283 -171321 -39487 462997 -409650 -143588 163821 -284653 57952 -258639 -78170 -267275
8273 -267275 -111669 51008 -96094 -159937 28432 15150 144683 -238108 80914 -181920 239392
8261 213876 -299346 93189 8969 -302181 -8147 -23060 2873 -397163 153542 199336 -392719
8249 25199 -40848 -311090 253676 244409 162511 -179815 -102368 -88679 -47424 42673 -280721
8237 -117368 -300455 57627 -40525 -173266 103341 42953 69555 -295787 178758 120593 287008
8226 287008 12284 346193 -64593 -112402 510643 73587 -169921 108711 -371802 -132574
8215 -226803 -157222 -12708 112183 32227 -232228 78704 -166542 -68086 77450 -172977 4773
8203 142111 118135 43962 -145952 195278 53073 268820 156224 -271562 -68574 9125 145640
8192 145640 -244315 -158376 319271 304883 -175972 -170184 -76703 -256622 197128 -57425 -307155
8181 -307155 -65227 -173222 -116888 59214 105308 -115658 -91431 148864 -31960 -129701 -7566
8169 -143129 -161081 130398 119452 -14708 -121708 -437204 5210 -263109 -54254 -89329 -77306
8158 -77306 -182010 -76575 268377 -95778 -110617 -268598 -217970 -45403 34638 -60867 31687
8146 -210817 -51346 -102732 144720 172960 -84347 40193 98811 166300 -2510 -232821 -305115
8135 -305115 -131156 -61498 -34843 166912 401453 -64393 -31650 -508340 -11002 268375 -162318
8123 145121 38523 147171 -134402 -322140 -123105 111722 -187867 65203 -286716 -160360
8113 -160360 83306 88899 -289536 96171 41363 -115073 261401 108623 -139548 -104773 -253977
8102 -253977 -14304 -100209 84388 -102369 -2007 -150393 -83801 13369 -93058 53086 -216918
8090 -61801 -9485 -39370 -91104 17357 -114537 331143 470 -221118 -182367 -69357 60113 -45624
8077 -154332 -19438 -139824 -208041 56429 -98923 -2322 338556 -118396 -109768 -96663 72653
8065 -108935 90302 131742 -145888 -181253 175480 -151833 76481 123609 58989 -247030 -122451
8053 -156631 -791206 58297 216759 -131356 -64583 41872 -107161 160492 751 -184757 218951
8041 -75145 5907 71501 -256999 -56382 -121636 -18424 72026 -444462 -143992 -116933 -89398
8030 -89398 -228 83640 273971 -145062 -29390 63263 -324180 -98564 -89095 70070 83759 -4922
8017 16665 -120802 -670998 -104846 -203350 -256012 -3501 89330 2356 85673 92230 -132754 -340614
8005 -340614 -202970 -163315 -77324 -172281 -134593 96785 23813 170501 4191 -25750 -112368
7994 -112368 -170685 -65613 165631 104761 103775 -15759 -4067 -45424 155893 -256111 -64229 -301940
7982 -301940 160967 187544 66573 -485368 72306 -153872 -158053 118061 -86337 -293799 -199465
7971 -199465 -73025 90430 220453 410316 18345 281177 -228281 -149026 -184842 -89611 -32312
7959 22718 -116259 -132364 87067 47142 -5407 -1223 247133 56421 -136408 -380776 -306771
7948 -306771 197088 -123762 -289843 -145571 -36721 77764 139927 -242245 99986 98198 135543
7937 135543 -52047 430270 3865 278105 -239292 -351212 -440192 136618 241911 313038 55394
7925 -185115 -148261 160527 -83934 124294 214941 -31018 156983 22161 -243004 -162050 69738
7913 -68935 93255 -225645 50909 -115214 -176128 -80510 -135892 68980 -26694 219923 125784
7902 125784 -353354 -342263 24052 -182049 -157809 113847 -93003 -239827 -67367 48851 -33257
7890 261676 -366290 -73420 -283130 44618 -154190 285596 -17542 -62179 153180 64822 -247730
7878 366912 141150 -70915 185130 135957 -61984 162142 81041 -245339 -122111 -322543
7868 -322543 99158 -102852 376937 133628 -95393 -57913 -46074 29352 -181355 3625 318949
7857 318949 251323 53197 -47685 185457 -138721 57249 -134172 -75521 -137260 -51402 -75980
7846 -75980 -159526 -274452 -245704 -440414 -61395 251130 -218576 -324107 68730 -151477 -117882
7835 -117882 -21136 -145132 2989 25040 -44570 -146882 -72826 96287 -207780 -37329 -231189
7824 -231189 206856 -302702 -3328 -264237 39771 -289875 -143699 198672 47068 -291859
7813 -463681 37887 -136127 -27733 49935 -88940 -84522 172532 -26690 -111 -219677 89981 -283873
7800 170134 -113994 -42334 -277061 -79195 -92362 178632 32864 -72072 121041 -622241 -389733
7789 -389733 -34761 76087 -114590 85447 -119948 -115638 3853 47465 307478 -284733 -327049
7778 -327049 -39232 136992 194949 -252664 -75727 -130469 -310353 -30002 257124 -16121 -8722
7767 -8722 -34856 112960 -19415 92105 74957 -45712 -299987 -268137 -263869 281662 -103982
7755 54434 -430244 -270892 -36293 -95674 -225413 -195234 -17505 108439 -7202 61683 -96021
7743 -16078 -239591 -153218 63835 171917 209453 12601 66069 190553 -114738 113090 188774
7732 188774 -285388 124139 -62960 -75712 148224 20942 -9714 -268557 184761 224055 -150575
7720 -292093 -134724 -125785 234267 -21168 227861 -9692 -105657 42797 -93504 31744 -73589
7708 -181228 112643 15545 -358711 146381 51941 109280 -138550 -169155 43264 35693 12501
7696 160054 -473582 193736 144355 1359 -372570 300934 241525 -178865 -360783 -95397 198917
7684 -218400 -185694 28769 230998 -8413 55552 47495 -264002 65467 52407 -191154 -206704
7673 -206704 -32401 16231 89164 -75156 -201312 -253572 178268 -190859 -215395 -209996 -283897
7662 -283897 65919 12150 -574221 67450 -85709 73716 50759 -85715 88131 91059 -58268 -44739
7650 -44739 55123 139531 46572 28606 -67493 -76226 -97659 49427 -26325 -40185 -331897 -327553
7638 -327553 171006 -423549 165448 105601 213975 414616 -43535 -159517 -268983 -170392
7628 -170392 -146937 106975 -226124 -169397 136703 -315357 59188 69799 30942 -146528 53446
7616 -86943 40329 -274784 226028 -519386 -356722 -122776 -125083 105062 -262752 -37124 159537
7604 208464 -178612 -70928 -366361 -346281 44958 4456 23167 -238897 235378 163079 -208164
7592 197481 -192170 138268 -410600 -306795 -154942 -94742 -108156 -164367 109613 58720
7582 58720 307434 54535 186004 -152521 -49491 -372778 -1702 27438 -134053 280208 -287390
7570 212089 -68853 133272 42352 90710 150105 -322216 241231 -26546 -66554 -115467 -144651
7559 -144651 184469 305016 -224768 -104606 -114271 -301501 -306476 -350233 283925 71352 93061
7548 93061 -88985 -216692 46300 -117097 29641 -251492 -139191 75424 97511 -26268 -228915
7537 -228915 399876 -176128 -158557 256909 -51946 -79800 -109528 -108376 205895 -228456 -169586
7526 -169586 -213629 297039 79163 -86288 80807 -306811 121864 114457 541969 136247 -152375
7514 -239429 -231359 90871 68860 526565 -184923 -274281 -29032 -128698 239375 -128964 93508
7502 179844 10173 195562 -202550 -91435 -265491 -111137 -131831 101479 -190126 50222
7491 -175301 73285 131159 -144421 4361 -166628 -305338 -7751 109927 -354793 31257 51263
7480 51263 -186793 20064 150782 341675 -57965 -73847 -269568 -161725 -427632 -37664 97388
7468 -70397 165454 -244761 -58369 96773 -137827 -134331 90180 -95107 125683 -226079 23530
7456 87703 -10276 59379 255132 -243912 7228 -263315 225485 17944 -47783 151672 23816
7444 -137609 -49594 98993 73285 -38553 223634 66899 -291071 -261402 -211030 -353415 -246274
7433 -246274 33855 121463 -84948 194808 75106 202272 54282 114815 13274 22156 -1912 19260
7420 334671 -228162 141747 -186022 6004 -148399 -178990 -113304 -95355 95404 267021 372106
7409 372106 -63860 -253902 69349 24913 -527881 -251890 180020 -236831 39849 132119 51339
7397 33793 -161615 -70497 289447 241062 122218 -118197 -375905 231148 32567 -363742
7386 154539 -189626 -138783 -14636 -180740 23866 -49735 79279 -37356 156894 -218423 -10634
7374 80490 1412 -559828 188454 10595 -110878 658 -76230 -18505 55380 118119 6366 -48008
7361 79461 -29573 -109187 216895 12006 -30448 23101 -220950 -307755 -426814 43627 87973
7350 87973 102974 -323958 -157137 308734 -37337 -130843 -51481 -233050 147266 -183511 -317920
7339 -317920 263513 -76678 122396 96052 -2728 54599 -86218 256134 -65160 -153787 -138936
7328 -138936 23627 -123944 177487 -211659 -52630 120892 -258911 63782 104589 -106137
7317 183134 -28449 -95840 134464 25227 -209579 43917 42476 31749 -33911 40447 16103
7305 -34797 -199220 -142164 -201511 -10856 54313 218206 118762 322526 16418 -5073 192511
7293 90406 52560 -186236 -52241 -9481 37196 239112 -223621 227217 -91871 -124668 -316886
7282 -316886 -188525 -24393 -27225 -24159 143309 -209373 -208452 132410 -169134 75877 -116673
7270 -148734 198899 -125549 -208703 -167640 -284080 -103447 -41631 107693 -372973 153177
7259 205426 283633 -12593 367208 -305814 -133175 -116174 -20893 -11993 -78844 4067 224029
7248 224029 54339 -64458 196698 -203373 57606 -40354 -224463 -261364 138979 -97473 -77405
7237 -77405 908 -86114 -66097 -424916 -176340 -259910 125705 305820 81567 32017 -104979
7225 -19930 172532 -233747 67792 -219634 -336841 -148053 -238798 -130596 -265607 -3859 -312578
7214 -312578 148085 10544 92231 7874 -52225 112560 -16966 6922 -238868 -52965 -274673
7203 -274673 337597 425361 71146 -107749 159979 192680 8945 -243982 149966 -13502 -211950
7192 -211950 184244 -246226 23000 189737 -232905 -23788 -447287 -299444 180364 -91996
7181 234591 -59086 -34575 240623 68403 -154516 -59662 -76215 -64082 -365156 -153436 99729
7169 97178 -11774 60139 -257100 -11300 -177559 -205396 -202948 -472820 268848 6620 -223319
7157 -36513 -149594 79030 -89796 -293010 -240757 -143899 -215526 -91452 27808 5294 -104684
7145 -192104 -124507 -225776 62206 -65503 326588 181471 224753 197262 -122092 -115856 -223651
7134 -223651 -212292 84126 132992 -335917 -163020 28789 -88429 -24339 -159274 -75198 -230941
7123 -230941 133425 -83441 112471 -1274 56610 72186 247736 -152768 -216211 -186284 -101004
7112 -101004 87312 88224 -207404 149335 -112634 206158 377485 -85398 40995 -195743 310207
7100 -34477 188204 -75868 153059 92914 -73852 114790 16327 164916 30475 -110400 -309469
7089 -309469 113718 -243368 -179853 -354395 -146306 -157643 35150 280146 -270996 -265476 293837
7077 -222147 -198767 157324 170606 -82985 56750 -264984 10642 -117735 185939 -122675 -6837
7065 -32099 107994 25520 -121723 -64944 -84174 196468 -41302 -176993 -169807 -81099 -36697
7053 3435 -77198 7860 -25816 88699 126131 415257 622331 38460 -241809 117545 -264380
7041 -68982 -216403 138150 -125773 257227 -206170 83802 81206 102913 -85125 95219 10128
7029 -141211 -124414 237005 -270217 -38732 -233935 6541 116542 -21161 -187053 -89223 -68156
7018 -68156 104338 -69150 -116759 132281 27854 -71612 208268 -246377 -128170 104082 -159266
7006 167276 67679 3992 -81824 -180271 -9238 -39784 -21953 158180 13385 -205886 60496 -42946
6993 -110442 98279 218242 -160721 319857 -149929 47341 -102387 -8443 -11828 -38620 19386
6981 196531 322696 -92117 191035 -19996 -188091 70401 -54456 220828 112856 -157355
6970 -81878 16902 -193446 214289 114346 -10521 -249843 -189995 -71358 193570 36096 36020 -255596
6957 248804 -142562 45589 -125099 164509 5889 -111035 -306306 -113229 164528 -212495
6946 32615 54551 -170460 65533 159261 211335 -141113 -411 76211 -61605 -162221 -203067 -87779
6933 66798 178971 223897 301935 -141952 -36046 -195145 37133 169734 47273 206085 -189081
6921 -19638 -325621 -166093 63281 -27056 124956 -21260 -820 92187 -74572 123712 -50878
6909 13995 229506 25001 -86117 -428994 169971 -133633 -40115 -267304 113902 -70681 353080
6897 -53161 -107306 151915 131769 227200 -53625 -8521 246006 -97966 1499 -72981 -223890 29189
6884 -302363 -271755 177738 122579 -262464 225338 71052 87760 140187 -195724 -134114 72331
6872 -446982 -70089 89041 270732 -275962 -8181 198764 -61811 -254306 -39582 180682 -149501
6860 -363847 34165 -73153 -118218 -88953 -14645 -42052 147940 172892 280454 79611 -38245
6848 330688 -95358 49052 -95537 129599 -322645 -119278 -157332 -140583 24196 282106 197633
6837 197633 54082 151901 62347 134178 274925 182422 -56478 125891 -201645 -190172 -130517
6826 -130517 -142579 90387 -58294 343529 -84026 -138741 19594 152690 -49092 86373 -169031
6814 227122 361694 -234500 20566 -36659 71039 124542 -289398 311082 108945 160620 328888
6803 328888 -192031 -195397 -54091 -61546 51936 -320065 -231341 -73916 -124948 -209866 147035
6791 105734 171353 189397 -31609 -8533 -52086 86727 -25002 65894 -37223 -270603 -11547 -188657
6779 -188657 -77577 -141399 184615 277168 162357 12354 260231 -85232 231160 -264841 -276272
6768 -276272 -240303 -74552 -190446 -69966 144376 -108779 -142140 -185210 -189330 99876 105285
6757 105285 236210 367 113828 -117858 99375 -11680 -208351 46402 181624 165936 123072
6746 123072 7744 -120259 -41807 -125624 -89507 189121 128469 78486 -152176 -360445 135784
6734 386100 -244990 -303767 -121437 44631 -60503 18576 -214791 292114 -91699 147677 96682
6723 96682 -194357 148500 -230181 63552 -238919 93902 -442950 29024 -38674 19546 -266322
6711 169008 -253307 49799 375149 -91195 175753 -171616 47887 -216675 -116460 -32496
6700 75900 -39186 -206134 145393 29661 226495 -202527 -284721 -96249 46303 334628 -52325
6688 -1576 105343 -163401 -141280 285425 318686 -332930 179464 -160518 -65677 -155826 235828
6676 -220123 130132 -153060 145357 3005 -178814 -193006 -101804 -25024 -207194 187826 79103
6664 156228 -163628 -274957 -199724 -247375 1439 -12175 71174 -35474 -101274 41999 37972 -205791
6651 97405 -23941 -329709 12618 95458 -135828 161488 44891 -81914 46889 -82943 -245364
6640 -245364 153391 -188108 -138939 -84761 259714 -115459 -166265 -152217 124601 -32168 -51585
6629 -51585 -38259 114489 -118988 -253332 -20118 -279497 67364 72426 -214931 -255935 -68261
6617 -45068 -4931 -2569 221985 -152370 29497 -164016 2909 108880 350952 235518 36656
6605 -133371 -41283 -425920 -125750 192060 182132 -22428 63207 -135814 16402 93064 4538
6593 -82901 -105608 64829 -251145 -65127 101323 206363 313481 -17296 -140459 95137 -105967
6581 -31055 -9866 43777 99557 249680 2737 -11713 -130714 90178 -187353 71480 223762
6570 223762 62436 -344585 -94203 -2176 47103 -93011 121063 56315 -283862 136378 39385
6558 -137474 -31603 152234 225413 -88101 -54974 -1474 -11043 247919 -324107 31356 366687
6547 366687 -115184 -206780 139868 -320460 96208 165748 -61666 -113636 -178341 354554 -18728
6535 -260368 38531 -114981 287655 55502 121973 -132777 130 -235443 -48689 130881 -92717
6523 46429 -140629 18626 21032 77932 -469105 -326936 60839 95657 72309 -126389 -102892
6512 -102892 -338943 -6545 207230 305345 -100561 -38791 29207 324472 266692 266757 395613
6501 395613 -170402 -77845 -117126 -12884 -308833 83961 -268904 133478 -421055 -243111
6491 -243111 186031 18403 167961 -57128 309779 280232 381506 -127807 154189 104863
6481 104863 -48677 65512 50735 109182 189884 140661 65763 -477296 67206 -96995 -36790
6469 -248135 -189443 46717 -298372 172053 161985 149879 -148763 -136388 -44315 136824 63143
6457 142008 61559 -335773 288849 -265161 3257 -118361 -231141 -106649 42014 -456516
6446 -100758 71629 -71475 41642 -39422 12895 -345461 -100732 242020 -99782 -288836 -21433
6434 -130075 40649 -380707 36350 199048 -46544 -403725 -112216 31351 71689 225060 -252678
6422 126519 -106471 -125906 -227339 -138750 -38817 -22566 76224 78621 86987 -49993 269062
6410 -196191 -312796 6219 135723 49057 -64651 -59890 132657 90548 -57942 157366 -12929
6398 54463 277645 79163 19437 158113 -16426 -131214 28952 157740 57062 -337309 6433
6386 -72270 -3132 -210973 158245 -254700 105742 293131 293286 -37551 -83118 -90859 -90730 -43348
6373 -12309 58036 -291754 -7609 13057 257688 -134896 29289 41930 48552 302752 -130631
6361 -248266 -389724 53765 12383 39324 -236294 -53421 -55463 31685 54817 120106 69882
6350 69882 156942 -142260 221811 47608 287295 497709 -176272 113229 -128421 -110075
6340 -110075 -95027 30745 -534325 -31720 214037 -240866 -232929 -8540 -104248 -74095 -45353
6329 -45353 -86241 32504 159580 80850 152190 8081 119808 -228993 -174 189704 36648 65909
6317 65909 416489 -138803 96844 159385 139551 -71443 126667 -119399 -213949 -291600 -158229
6306 -158229 305468 -74087 -250543 -196858 -187275 141146 337 71617 143864 233600 -11652 -274782
6294 -274782 68550 59876 76988 -268607 61780 169857 -39377 45470 -302223 162092 -67257
6282 -60122 -7056 138925 -32905 -110316 -547779 -52346 -3135 32068 103067 -273376 -98246 -49748
6270 -49748 47135 -261535 -299476 83348 -272244 -214664 210695 162236 -111744 -223066 136367
6258 -62400 -318066 -254354 -4369 -23144 343767 123292 101206 -46289 399227 -89693 -108708
6247 -108708 214029 32406 73750 -130595 -99788 163735 -227220 48411 -49616 -429338 113341
6235 99132 -322084 72359 -113908 -209526 39781 -37830 3756 -311519 -49329 227558 -26560
6223 192973 -297850 -121318 315599 174957 81294 217447 277086 -239341 -152450 -67523
6212 63350 80433 -149616 -288930 178910 67960 22843 -100910 -244500 280751 41802 -48082
6200 120377 -343431 -46127 76165 34245 -45990 160274 -22522 359891 -114853 -220023 -371021
6189 -371021 -96418 359386 -122621 7000 449125 -91612 -59990 -131063 -467327 5793 305740
6178 305740 -184858 123006 116113 -55831 -415993 245234 -126399 -52835 142464 284193
6168 284193 192323 -147542 -275223 127674 237413 451723 69784 -395016 -221587 -30082
6157 213463 159754 69812 133669 -130769 121351 297671 -305594 122092 -3175 108762 83579
6146 83579 -143391 -116898 278214 -27426 3185 297813 -125777 -3190 174632 -153869 30557
6134 12566 179237 263481 -135336 54678 -72126 -3026 147607 171881 -222854 193797 -156385
6122 220318 -170792 -97380 -108023 -205673 -69225 -136614 -7243 -25975 105462 -340239 24064
6110 44003 98251 -378 -43400 -90177 -131254 -262868 218993 -131347 581280 60776 -103020
6098 -142677 -12202 -25086 -127988 -85747 158192 -93842 140356 -243912 33753 162796 -315246
6086 -153442 -342604 -138629 -23001 107764 -113865 437996 194788 394602 109212 167393
6076 167393 324090 -82118 -275342 21673 -21607 111629 147822 -8132 428343 24741 240148
6065 240148 202964 47745 121337 -72334 -3193 -112521 162006 -86931 139857 -69041 -33756
6053 -144047 84397 5446 -156297 -82527 123233 -72514 -143230 -198043 -270483 147284 9640
6041 74193 124911 177700 251736 -19201 106444 -32582 -345972 2638 -393171 88494 -151791
6029 -245213 -43294 278030 74997 325514 10318 61349 240143 -77326 -71202 64660 -60768
6017 -289232 -195404 -213636 -73808 406718 172207 -130480 146018 -19800 -239913 169458
6006 -74999 -57875 -139131 84326 -55211 -364576 -48220 287557 -65211 354540 -190281 15181
5994 309111 77441 192822 -481344 221876 -164850 -126043 110830 35605 39708 -34434 200799
5982 114245 243713 131362 -74760 78847 108788 -48165 -256794 -263318 -77213 -4469 215655
5970 -231542 -169675 226012 235839 -56577 194364 176846 -101588 -193954 -168603 356153 37446
5958 -284845 -220659 296230 -125264 144596 111185 58357 -30816 422801 259760 237551 -291587
5946 49083 440724 -369525 175565 -194860 125199 -103914 -444563 -91469 -73061 -64998 -116884
5935 -116884 -77159 56435 -139613 258824 65563 -184179 57391 9905 -69848 -227475 88599
5923 -48039 115653 358548 97371 224770 -29659 -217013 147237 80132 213929 -243456
5912 -143438 83096 92896 217750 166790 -88692 -102940 -7554 258075 336477 -170608 -33442
5900 185639 252500 91711 310698 -18888 265506 102085 -111744 109876 -154577 -64679
5889 -293398 15012 29522 289079 -105559 35512 -12550 -36675 202362 145231 -8484 20395
5877 20552 243732 -140865 -140017 40873 160707 -253295 -6928 51359 358419 -2694 -95302 4558
5864 30831 -294760 -275060 219937 92542 -227201 -43227 -175274 -165039 58763 -174418 329212
5852 -176591 205352 -330031 -333787 96685 -197261 99168 -20793 157782 -54684 13327 -158971
5840 -56081 -411856 52535 -297633 11372 -190404 55496 -161695 77428 -20187 -124530 -157689
5829 -157689 -125777 -224175 39543 131003 49495 77215 81882 -103662 -7387 104193 85653 72851
5817 72851 -66386 63305 79740 102619 280989 45502 263852 -7919 -86979 160138 252808
5806 252808 -49067 92499 -117962 -159878 -164277 -209734 -18138 -45592 88708 -44835 -393624
5795 -393624 49348 -40275 113148 -98808 -12252 1029 -336487 -337993 -169154 -69361 389452
5783 373728 274063 -25314 277752 -1805 -254472 -107694 -189114 32736 124922 -7609 -216596
5772 -216596 -177955 72430 -258758 -166585 -17216 41079 116720 55671 45875 -244791 -185427
5761 -185427 -22061 -162692 -332470 -70828 -15328 256444 -139988 -23099 183663 216372 178075
5750 178075 53453 227303 -177264 -174554 152156 98861 -217278 -81318 19044 -70415 -68586
5739 -68586 40138 13163 -197169 -103500 -4514 -130682 -131560 -150827 72206 147862 256852 -168221
5726 253455 -21620 -35529 -19796 -167491 -166978 222411 -196034 198852 118604 15978 -289760
5714 -93383 257075 -115591 -97267 126559 29803 162392 127245 11755 -63265 76014 275113
5703 275113 218504 55426 8059 332034 91501 168297 43860 82711 -28870 192692 -101632
5691 12231 -99112 72185 286613 12205 -3791 -271681 75998 -147455 122050 -185887 213329
5679 44815 -37771 -104404 94715 112518 -3687 5718 242863 459036 250503 -70459 335763
5667 -4581 268365 105614 -312923 13779 -43976 8939 -48548 122780 -244758 34853 -100277
5655 -156700 186415 5089 -72904 130331 -137857 124647 252967 136221 53005 -120062
5644 -67937 95190 -144269 246640 26502 302693 328832 82528 60477 -28668 163152 -11477
5632 -100278 -123273 106899 82585 12234 114032 124704 -233382 -187688 -28973 10008 -430091
5620 -308583 133077 -79278 -8207 -314346 -283872 -314667 -162746 419791 29772 -213823 -109072
5609 -109072 -113825 188097 -172165 -52746 84310 216036 -78401 415770 85976 186849 220404
5598 220404 -329240 175602 -195906 36434 79498 -302961 -54032 -283308 -63162 223820
5587 -148963 -9839 -99859 101684 289893 117873 857 -34819 7942 70422 172542 -234358
5575 -276846 105695 196479 119911 28307 -58704 -51760 25655 -57458 -70625 -34847 204717
5563 -26769 -42863 -141700 406828 56146 -594338 120268 -47901 -17863 -14400 -48283 82766
5551 -173629 -82322 34998 -22775 -143853 -258582 6325 -17758 86999 -134975 256872 234215
5540 234215 2517 113360 183469 219545 62674 -275519 78456 -75688 130978 -34954 -235229
5529 -235229 -243166 104697 233336 82413 88292 292254 -303975 -787 -27090 95187 -270385
5517 -131008 -30485 6359 360984 445192 -170500 -10815 -4103 -166339 3131 -131179 264111
5505 48662 246174 269883 -12986 -204478 -42045 1717 -169722 66093 -110773 48325 89898
5494 89898 -264111 -45524 -111231 143433 100106 61703 -38371 -38979 210149 218604 -40226 119356
5481 63131 27879 7634 134402 -34018 -19371 134039 -31047 177394 227835 -266470 -194288
5470 -194288 -359440 23283 -91249 95811 317725 17882 -34847 48309 63070 -127049 -140711
5459 -140711 -153252 -185081 -73677 115922 33315 159172 279441 -316109 -142192 93116 52544
5448 52544 115621 65405 165772 115493 -347841 -130038 11253 105511 206384 97083 165965
5437 165965 -6514 -316754 -26155 -93605 197477 -130867 -175258 -43693 79002 -140070 -2820
5425 -4168 -143366 -144655 241100 -189825 -128770 74192 -95410 337872 -57546 77924 -170942
5413 168966 166936 -2711 -174340 -34136 -28968 -150294 -162206 262650 -149210 290592 -277650
5401 137406 -20415 46733 -8771 -47972 -14821 -107928 109510 48519 -59131 440034 -12911
5389 -6738 203437 -61394 -27059 32535 -461044 210379 154402 31030 298614 -397874 109647
5377 88697 208152 157321 -57386 61902 52886 146487 -165100 124750 284557 -185889 -508217
5366 -508217 38329 115000 -182752 1382 -208215 -239605 -277891 72854 -217960 -31543 -85263
5355 -85263 -60425 -97975 -174448 -67813 -71119 222853 -118449 -42110 208100 13988 62180
5344 62180 -59195 -33773 -50585 -210868 18928 91148 -86403 -196692 -184403 -138728 -408129
5333 -408129 -302204 40828 -241656 -113191 30359 -38297 -74730 120962 -36676 87340 -278061
5321 111346 -125499 190880 198523 131163 67361 167897 -121682 -237770 -17554 -57723 -55255
5310 -55255 85730 125136 217055 -70211 -83369 -172908 120834 -120008 339710 92962 260137
5299 260137 -117624 -68756 -60116 -49756 -72650 174539 28456 -187132 89894 -158051 83192
5287 -169956 -49674 -176650 -68464 -50492 -54825 195541 10091 -143659 36477 -93156 92727
5275 138272 404016 -444146 278730 194420 222829 -159458 -92239 -9551 -58027 -254710 313135
5263 122703 188122 227725 307922 114984 374449 61280 -382445 292175 -151054 -11626 82883
5251 -61951 -162853 357331 -155744 -9121 184058 -381812 -92122 27269 72713 73234 75648 26361
5238 -211330 277546 -148378 -57023 -57110 89955 -193178 -194966 25961 -181322 225558 -268912
5226 -96820 -83569 -173825 -100317 171511 -93113 -188164 193683 57042 160702 322432 -16348
5214 289377 -157751 146356 69716 30782 -126182 -34791 122774 123917 -380418 52347 -109453
5202 390230 -117195 -143787 -48592 -502914 27074 356556 -144237 60662 79455 -75249 50780
5190 102675 -31895 196547 104604 299119 -79684 29825 299753 58098 46082 -89865 -3224
5178 -107144 -402377 -216450 -194774 -305706 -79364 57332 -315615 264968 -239111 87570
5167 172909 -180359 -92556 -45689 61414 -362708 -1253 172344 65711 -185932 -38171 -47444
5156 -47444 -25081 294318 -114520 -67882 40615 41269 297645 -208470 112910 -182248 346724
5144 181023 108517 208386 -69444 -265768 -198854 168824 -96256 41954 192012 -141134 -123414
5133 -123414 -181916 122057 -164125 -203291 77633 -216668 178253 44406 16242 -222626 51560
5121 -198535 70086 68458 -91515 -139363 -173868 126761 -87233 -123115 162902 38035 -243295
5109 54675 128111 101516 105724 -116841 -94020 148988 -451321 -406152 -332070 113025 -150679
5097 151426 41058 137308 -101667 447277 96230 208171 -108890 245020 -123220 52293
5086 4082 98730 -146576 244163 -72006 -117857 10699 134112 126304 41778 -209857 470207
5074 -326473 349179 -30056 -113492 -206335 406511 74540 46483 -96248 65499 -17826 -95322
5063 -95322 442155 55451 315430 200105 -186210 50219 -333805 -152325 -169937 312241
5052 41136 -91368 -307005 -134276 -106775 138778 235599 121795 -99952 -138781 -12746 -27889
5041 -27889 -200278 228651 -332418 104799 -70267 -137880 -37758 -79705 74486 28005 277219
5030 277219 110960 147676 -37219 120702 -94870 -78133 -44182 128852 -152361 45910 28885
5019 28885 484080 26108 -98515 131678 119204 181002 15429 86576 -29174 -39417 225925
5007 15475 115167 144855 -132582 52689 -201127 261329 76391 85407 -50581 92416 -147468
4995 -93207 -28624 -163158 215781 -273036 101445 62553 161065 -131251 -158691 288311 -95684
4983 75337 116407 -112457 -188190 59052 -20742 41491 -195586 72275 -9674 48003 241141
4972 241141 -56475 19479 66542 85938 190745 244108 33222 -177265 80152 -56874 -145316
4961 -145316 118951 -113403 -136348 137215 -17703 108892 170455 -278976 15805 -67645 388094
4949 -148919 183034 -364255 112528 -115286 16161 337594 -83611 152923 -28668 61241
4938 238733 -74218 -124092 -218644 114513 -223152 -45061 3952 -152051 -3296 -246914 184452
4926 195944 -30627 -49935 105650 -150713 -182690 -233434 -129941 309698 -254801 -283625 205456
4914 -148570 -182075 -228458 -273292 -279551 -80850 -122311 -47882 105942 241124 8305 -34735 -256763
4902 -256763 151808 215735 -40654 295588 208301 -402343 -209513 35761 -97155 98207 -95618
4890 171126 174203 109292 -50382 197274 94314 -122868 -8956 91047 248165 -446857 -42894
4878 -84114 -43636 -4099 110323 -345960 411815 -40725 107401 93512 107172 -240351 23831
4866 -55624 -2959 46266 -2284 50845 130225 -13349 -151649 -183543 91143 454725 -178810 59786
4853 154217 -290355 82855 -286858 382892 29513 -93652 115436 312626 -87508 -212241
4843 -212241 10661 -99484 -233445 -210662 32975 86070 -349356 -98977 109115 -13053 104418
4831 -80932 24587 150279 -133038 40350 -145112 114540 -205931 402035 -218911 -19978
4820 -125204 -144684 230205 -312072 -143253 45388 174265 -8709 -35665 3748 316334 -149005
4808 -43814 -73424 -34540 187542 55860 116830 52148 -321601 115695 35363 159291 61961
4796 29193 218341 191524 -544202 291644 -165247 75486 -136174 -43777 123171 -96474 219903
4784 13729 88927 -33625 59900 126463 -232247 170957 168156 56569 308615 59704 -222676
4772 190037 -196721 141614 -143395 -394413 564658 168774 15191 -162225 79493 -111084
4761 8609 231479 -170453 -144142 -163078 52830 138527 144111 119560 -67227 -72947 76338 129825
4749 129825 283193 58900 294836 -93670 172009 -200205 -220736 19953 283605 697 -271987
4737 62001 231298 -311007 15879 96327 308483 74726 58327 245990 -60434 -588 109826
4725 -100385 180983 189997 124285 77189 175374 119131 -123012 -9713 51895 117311 -47803 29225
4712 117120 216510 150731 111956 -98564 165426 202125 -229584 -156671 179614 118360 63595
4701 63595 10333 108303 -42070 217560 78115 4614 -35479 389071 -141453 -14055 101936
4689 -247 5451 64231 47645 27844 -43885 -322052 -287043 82979 201328 -173506 103592 240103
4677 240103 84027 -89584 281583 70022 -254108 -171554 16522 114776 -157609 115640 101316
4666 101316 -315578 -159275 -93971 206294 -175247 -53774 -209348 -296422 91910 -281741
4655 -133504 -149814 102149 112057 180751 -102569 -234287 253925 -30673 -156784 100079 114926
4644 114926 -191338 71765 -157248 -229884 401566 -129493 -178032 -44786 -71540 -134151 -123567
4633 -123567 475861 -44839 207284 -49904 6567 53024 150648 308954 125580 -64336 -8899
4621 -203888 -44521 -53837 -114900 -75588 158820 -84951 92133 -186736 -138755 -53547 -137788
4610 -137788 85777 62815 -117240 -64744 -210489 201892 -146555 -62949 116005 -114027
4599 149411 131179 92273 62492 -157711 -335631 -65623 289602 38749 234972 -228439 -89961
4587 -398277 278086 -263330 126924 32312 134015 201656 -29522 -139483 -212668 238613
4576 -179995 111061 20797 -241522 215351 26876 -14198 -158964 -113052 -2230 57037 -72873
4564 320100 -116845 -35979 62136 -78572 216096 -183121 153111 -3803 173696 -157136 100635
4552 260430 351837 -13865 17646 -57654 161550 133646 292630 123521 193244 320846 210469
4541 210469 77821 -54973 -60437 -68193 47359 39688 -131241 -116401 -106130 -533271 -121687 104368
4528 122444 104779 -45349 429898 137735 52592 136588 56635 83455 340460 96239 -82148
4516 -185089 -115544 167085 -166027 65728 252174 216712 240433 260402 -87185 509913 136497
$$ [...]
##END NTUPLES=NMR SPECTRUM
##END=
