
##TITLE=AC1365_HAWAS12179_7163953_Rh0BGGhK0Q
##JCAMPDX= 6.0         $$ Bruker NMR JCAMP-DX V2.0
##DATA TYPE= NMR SPECTRUM
##DATA CLASS= NTUPLES
##ORIGIN= BRUKER
##OWNER= Administrator
$$ 1.72 TOPSPIN		Version 2.1
$$ 2012-12-01 15:37:19.139 -0500  Administrator@X
$$ Compression mode = diff/dup
##.OBSERVE FREQUENCY= 400.02188249412
##.OBSERVE NUCLEUS= ^1H
##.ACQUISITION MODE= SIMULTANEOUS (DQD)
##.ACQUISITION SCHEME= undefined
##.AVERAGES= 8
##.DIGITISER RES= 22
##SPECTROMETER/DATA SYSTEM= spect
##.PULSE SEQUENCE= zg30
##.SOLVENT NAME= COFFEE_meoh
##.SHIFT REFERENCE= INTERNAL, COFFEE_meoh, 1, 14.98509
##AUDIT TRAIL= $$ (NUMBER, WHEN, WHO, WHERE, PROCESS, VERSION, WHAT)
$$ ##TITLE= Audit trail, TOPSPIN		Version 2.1
$$ ##JCAMPDX= 5.01
$$ ##ORIGIN= Bruker BioSpin GmbH
$$ ##OWNER= Administrator
$$ $$ E:\/data/COFFEE/nmr/AC1365_HAWAS12179_7163953_Rh0BGGhK0Q/10/pdata/1/auditp.txt
$$ ##AUDIT TRAIL=  $$ (NUMBER, WHEN, WHO, WHERE, PROCESS, VERSION, WHAT)
(   1,<2012-12-01 15:37:10.993 -0500>,<Administrator>,<X>,<go>,<TOPSPIN 2.1>,
      <created by zg
	started at 2012-12-01 15:36:03.755 -0500,
	POWCHK enabled, PULCHK disabled,
       configuration hash MD5:
       86 BA 57 50 F2 9D 5C 9B 26 00 A9 28 5F 66 2E 89
       data hash MD5: 64K
       9B 87 B6 AF F6 FC E2 2C 03 FF E2 C7 80 86 47 0E>)
(   2,<2012-12-01 15:37:14.211 -0500>,<Administrator>,<X>,<proc1d>,<TOPSPIN 2.1>,
      <Start of raw data processing
       efp LB = 0 FT_mod = 6 PKNL = 1 PHC0 = 0 PHC1 = 0 SI = 32K 
       data hash MD5: 32K
       CD 39 A4 9A A7 38 CB 5E AE C7 D0 6A E5 BB FD A9>)
(   3,<2012-12-01 15:37:14.690 -0500>,<Administrator>,<X>,<proc1d>,<TOPSPIN 2.1>,
      <pk PHC0 = 96.38306 PHC1 = 0 
       data hash MD5: 32K
       F9 E3 85 E7 9D 21 EE 45 7E 7A 2E 06 3F 53 2C 79>)
(   4,<2012-12-01 15:37:14.922 -0500>,<Administrator>,<X>,<proc1d>,<TOPSPIN 2.1>,
      <abs ABSG = 1 
       data hash MD5: 32K
       0E CE 2F 10 75 AF 14 D4 21 45 4D 01 9F 2D 4A 64>)
(   5,<2012-12-01 15:37:15.092 -0500>,<Administrator>,<X>,<proc1d>,<TOPSPIN 2.1>,
      <abs ABSG = 2 
       data hash MD5: 32K
       DE 3B F8 F0 B3 4F 33 D2 84 B8 A1 16 43 E3 D2 26>)
(   6,<2012-12-01 15:37:15.232 -0500>,<Administrator>,<X>,<proc1d>,<TOPSPIN 2.1>,
      <abs ABSG = 3 
       data hash MD5: 32K
       CF 79 12 AE 7C 36 78 BB 85 CE 5D 3F B0 CF 58 87>)
(   7,<2012-12-01 15:37:15.386 -0500>,<Administrator>,<X>,<proc1d>,<TOPSPIN 2.1>,
      <abs ABSG = 4 
       data hash MD5: 32K
       81 2A 05 6C EC 26 81 18 36 15 6B 07 A7 14 23 D0>)
(   8,<2012-12-01 15:37:15.525 -0500>,<Administrator>,<X>,<proc1d>,<TOPSPIN 2.1>,
      <abs ABSG = 5 
       data hash MD5: 32K
       90 2F A9 27 13 BF CF 8B 2F D8 69 9A 3D 48 04 29>)
$$ ##END=
$$ 
$$ $$ hash MD5
$$ $$ 6F 30 2F 47 F8 3F 9C 85 99 29 AE B2 37 9B EE 17
##$RELAX= 
##$RELAX= 
##$RELAX= 
##$RELAX= 
##$RELAX= 
##$RELAX= 
##$RELAX= 
$$ Bruker specific parameters
$$ --------------------------
##$DU= <E:\>
##$EXPNO= 10
##$NAME= <AC1365_HAWAS12179_7163953_Rh0BGGhK0Q>
$$ [...]
##$TP= (0..7)
150 150 150 150 150 150 150 150
##$TP07= 0
##$TPNAME0= <>
##$TPNAME1= <>
##$TPNAME2= <>
##$TPNAME3= <>
##$TPNAME4= <>
##$TPNAME5= <>
##$TPNAME6= <>
##$TPNAME7= <>
##$TPOAL= (0..7)
0.5 0.5 0.5 0.5 0.5 0.5 0.5 0.5
##$TPOFFS= (0..7)
0 0 0 0 0 0 0 0
##$TUNHIN= 0
##$TUNHOUT= 0
##$TUNXOUT= 0
##$USERA1= <user>
##$USERA2= <user>
##$USERA3= <user>
##$USERA4= <user>
##$USERA5= <user>
##$V9= 5
##$VALIST= <valist>
##$VCLIST= <CCCCCCCCCCCCCCC>
##$VD= 0
##$VDLIST= <DDDDDDDDDDDDDDD>
##$VPLIST= <PPPPPPPPPPPPPPP>
##$VTLIST= <TTTTTTTTTTTTTTT>
##$WBST= 1024
##$WBSW= 4
##$XGAIN= (0..3)
0 0 0 0
##$XL= 0
##$YL= 0
##$YMAX_a= 668600
##$YMIN_a= -563996
##$ZGOPTNS= <>
##$ZL1= 120
##$ZL2= 120
##$ZL3= 120
##$ZL4= 120
##$ABSF1= 14.98509
##$ABSF2= -5.573092
##$ABSG= 5
##$ABSL= 3
##$ALPHA= 0
##$AQORDER= 0
##$ASSFAC= 0
##$ASSFACI= 0
##$ASSFACX= 0
##$ASSWID= 0
##$AUNMP= <proc_prof1d_extract_pilot.lims>
##$AXLEFT= 0
##$AXNAME= <>
##$AXNUC= <1H>
##$AXRIGHT= 0
##$AXTYPE= 0
##$AXUNIT= <>
##$AZFE= 0.1
##$AZFW= 0.1
##$BCFW= 0
##$BC_mod= 0
##$BYTORDP= 0
##$COROFFS= 0
##$CY= 15
##$DATMOD= 1
##$DC= 0
##$DFILT= <>
##$DTYPP= 0
##$F1P= 0
##$F2P= 0
##$FCOR= 0.5
##$FTSIZE= 32768
##$FT_mod= 6
##$GAMMA= 0
##$GB= 0
##$INTBC= 1
##$INTSCL= 1
##$ISEN= 128
##$LB= 0
##$LEV0= 0
##$LPBIN= 0
##$MAXI= 10000
##$MC2= 0
##$MEAN= 0
##$ME_mod= 0
##$MI= 0
##$NCOEF= 0
##$NC_proc= -8
##$NLEV= 6
##$NOISF1= 0
##$NOISF2= 0
##$NSP= 0
##$NTH_PI= 0
##$NZP= 0
##$OFFSET= 14.98509
##$PC= 1
##$PHC0= 96.38306
##$PHC1= 0
##$PH_mod= 1
##$PKNL= yes
##$PPARMOD= 0
##$PPDIAG= 0
##$PPIPTYP= 0
##$PPMPNUM= 2147483647
##$PPRESOL= 1
##$PSCAL= 4
##$PSIGN= 0
##$PYNMP= <proc.py>
##$REVERSE= no
##$SF= 400.02
##$SI= 32768
##$SIGF1= 0
##$SIGF2= 0
##$SINO= 400
##$SIOLD= 32768
##$SPECTYP= <>
##$SREGLST= <1H.CDCl3>
##$SSB= 0
##$STSI= 32768
##$STSR= 0
##$SW_p= 8223.68421052631
##$SYMM= 0
##$S_DEV= 0
##$TDeff= 65536
##$TDoff= 0
##$TI= <>
##$TILT= no
##$TM1= 0
##$TM2= 0
##$TOPLEV= 0
##$USERP1= <user>
##$USERP2= <user>
##$USERP3= <user>
##$USERP4= <user>
##$USERP5= <user>
##$WDW= 1
##$XDIM= 32768
##$YMAX_p= 478470679
##$YMIN_p= -710981
##$CURPLOT= <Network HP LaserJet P1505>
##$CURPRIN= <$Network HP LaserJet P1505>
##$DFORMAT= <normdp>
##$LAYOUT= <+/1D_H.xwp>
##$LFORMAT= <normlp>
##$PFORMAT= <normpl>
##$SURQMSG= 1
$$ End of Bruker specific parameters
$$ ---------------------------------
##NTUPLES= NMR SPECTRUM
##VAR_NAME=  FREQUENCY,     SPECTRUM/REAL,   SPECTRUM/IMAG
##SYMBOL=    X,             R,               I
##VAR_TYPE=  INDEPENDENT,   DEPENDENT,       DEPENDENT
##VAR_FORM=  AFFN,          ASDF,            ASDF
##VAR_DIM=   32768,         32768,           32768
##UNITS=     HZ,            ARBITRARY UNITS, ARBITRARY UNITS
##FACTOR=    0.250966925370066, 1,           1
##FIRST=     8223.43324360094, 112323,       4977
##LAST=      0,             -24329,          56359
##MIN=       0,             -710981,         0
##MAX=       8223.43324360094, 478470679,    0
$$ Real data points
##PAGE= N=1
##DATA TABLE= (X++(R..R)), XYDATA
$$ [...]
$$ plain form
19484 -476547 -51473 89469 215387 93850 -8501 224600 -129866 -289759 -44833 -180381 89275
19472 298975 5855 -167608 135834 -372906 223721 -97143 175947 -100988 -130160 -159698
19462 -159698 -219642 -190879 -124445 -104012 104845 -120614 -225738 -157183 -11137 -186233 -129291
19451 -129291 -186942 -137435 -114257 -157171 -143194 204882 -427809 -314339 -75153 70809 42819
19440 42819 -118675 -347501 300874 -167496 314085 -177285 -71362 42612 19132 49994
19430 49994 -270235 66290 -94854 -62537 -229523 80082 3807 -41024 -23719 -285611 -54671
19418 135117 -103761 -84891 135314 233016 389923 -41652 -158374 -431918 81431 64030
19408 64030 -367323 -198343 -57837 -84144 -216742 -140859 -257082 -285357 -173079 -36052 -322330
$$ packed form
19484d76547e1473H9469J25918I3850h501B24600a29866j59893d4833j35548H9275
19472B98975E855a67608A35834c72906B23721i7143A75947a00988k9172k9538
19462a59698n9944K8763O6434K0433A04845a20614j05124O8555a1137j75096N6942
19451a29291n7651M9507K3178m2914J3977B04882d27809J13470g5153G0809k7990
19440D2819a18675k28826C00874a67496C14085a77285g1362D2612A9132L0862
19430D9994b70235F6290i4854L2317j66986H0082C807d1024J7305k61892e4671
19418A35117a03761J8870A35314R7702J56907d1652j16722k73544H1431j7401
19408F4030c67323J68980e7837k6307j32598P5883j16223k8275J12278c6052k86278
$$ plain form
19397 -322330 -143409 -18694 6188 -126545 -616781 -41683 210172 -354977 112402 96620
19387 96620 -39494 -27346 -135020 106291 17938 -126082 -1812 -106755 408517 -137357 -127356
19376 -127356 -145148 -234102 -302863 33461 -392985 2770 -202227 -98064 -46915 -122475 -49788
19364 -98496 248559 -86856 -124447 -28079 -222723 65739 -193308 7926 -17655 -219528 483079
19352 89707 -103667 -48036 -50022 -7822 39804 -405479 -95930 -26115 -109202 -13544 24429 -18236
19339 -174324 -20620 130869 167833 193314 -217629 167166 -171223 225734 -207313 -402673
19329 -402673 409843 -76399 -182061 -63467 -470280 -296253 100065 -169891 223877 -27921
19318 -49466 -398205 53862 44445 -110645 -217859 -20480 -368536 141499 -116893 -151366 -77878
$$ packed form
19397c22330a43409a8694F188a26545m90236d1683B10172c54977A12402j5782
19387I6620c9494J2148j07674A06291A7938a26082a812j04943D08517a37357J0001
19376a27356j7792q8954o8761C3461c92985B770b02227i8064d6915p5560d9788
19364i8496B48559h6856l7591b8079j94644F5739a93308G926a7655k01873D83079
19352H9707a03667d8036j986g822C9804d05479i5930b6115q3087a3544B4429a8236
19339a74324b0620A30869L6964K5481b17629A67166a71223B25734b07313j95360
19329d02673D09843g6399j05662f3467m06813J74027A00065a69891B23877b7921
19318d9466l48739E3862r417a10645j07214b0480l48056A41499a16893l4473P3488
$$ plain form
19307 -77878 -68183 -11235 -84441 159379 -40463 -56374 -29364 160364 -70373 16580 -4391 122905
19294 236206 67429 -384601 -154061 24008 -64581 -332635 -368535 421063 -30691 -282381
19284 -282381 -78708 52397 -234444 -21236 -37802 140999 -100186 114064 -79361 -6108 -39047
19273 -39047 -201700 10057 47448 -157744 224385 244171 33389 -50332 121719 -65358 -59002
19262 -59002 -239739 187971 -7815 -56389 146856 -113014 188291 279289 277956 -255062 -425665
19251 -425665 -272991 29186 353751 -186347 -146521 -48962 -392746 -16105 -228497 -80232
19240 -11107 47052 -133072 -103366 -21580 -32853 -82073 125756 -115358 54532 -77890 263103
19228 -144954 86596 -116788 222303 133422 107546 -323326 -135047 -100500 143097 237883
$$ packed form
19307g7878R695a1235p3206A59379d0463j5911K7010A60364g0373A6580d391A22905
19294B36206F7429c84601a54061B4008f4581k68054l5900D21063c0691k51690
19284b82381g8708E2397b34444b1236j6566A40999a00186A14064g9361f108l2939
19273c9047j62653A0057L7391a57744B24385J9786C3389e0332A21719f5358O356
19262e9002j80737A87971g815m8574A46856a13014A88291R0998j333b55062j70603
19251d25665J52674B9186L24565a86347L9826d8962l43784a6105k12392h0232
19240a1107D7052a33072K9706b1580j1273m9220A25756a15358E4532g7890B63103
19228a44954H6596a16788B22303q8881k5876c23326a35047L4547A43097R4786
$$ plain form
19218 237883 178973 -27214 -146701 -277850 -416235 88201 -204657 -29462 -171844 -302223
19208 -302223 48221 21045 -190495 -160435 -49318 -250539 -43088 -94137 -264347 113317 -68761
19196 -287345 -120500 -197724 232636 -371537 -136430 -95630 -256568 63672 6742 58318 -115092
19184 -35232 -20198 52951 -258523 -144803 -1402 138564 -60528 -290066 72823 252526 297002
19173 297002 69605 -50220 -77177 -122310 -214878 -143683 -12989 -276215 -105886 117294 -245377
19161 -119313 -112537 -107325 -181499 -48985 5524 -102496 -185181 -267751 -190227 -153618 -3431 -198381
19149 -198381 -407032 123358 -47117 -334801 -112327 -127295 -115434 7403 49117 107755 231607
19138 231607 96918 34566 -167016 267671 -120587 -302635 -5411 118751 258212 20763
$$ packed form
19218B37883n8910b7214j19487j31149j38385H8201b04657b9462j42382j30379
19208c02223D8221B1045a90495L0060d9318k01221d3088n1049j70210A13317f8761
19196b87345a20500p7224B32636c71537a36430M0800j60938F3672F742N1576a15092
19184c5232J5034E2951b58523J13720a402A38564f0528k29538G2823J79703M4476
19173B97002F9605e0220k6957m5133r2568P1195a2989k63226a05886A17294b45377
19161a19313O776N212p4174d8985E524a02496q2685q2570P7524L6609c431j94950
19149a98381k08651A23358d7117k87684a12327j4968J1861G403M1714N8638J23852
19138B31607I6918C4566a67016B67671a20587j82048e411A18751J39461B0763
$$ plain form
19127 -160017 67757 -259226 -53107 -227399 -214393 59232 123366 -255813 221175 -215594
19116 -167025 -58012 -136739 39985 -16710 -117034 -186437 -125358 -83663 81925 117183 -98996
19104 -118778 -420215 -46885 -125264 -80517 -195484 275306 -27113 -233241 14771 -115606
19093 -193865 -303822 -145692 -246712 -316360 37552 96607 -162145 201720 99911 -69565
19082 -239264 -71708 -152955 -222070 48220 -222322 106781 12369 -13807 -134939 -10658 7942
19070 55176 -82309 -123709 47616 -187973 -106941 50507 -302962 -49570 -70698 188722 25451
19058 -69456 -221315 -86034 -65656 105429 -127198 89006 46584 238104 18495 -3982 -242552
19047 -242552 -153840 -188927 2306 60043 30982 -86578 138678 21934 -191110 99224 -243216
$$ packed form
19127a60017F7757b59226e3107j74292J3006E9232O4134b55813B21175b15594
19116a67025e8012p8727C9985a6710j00324o9403O1079M1695H1925L5258i8996
19104a18778l01437d6885p8379M4747j14967B75306b7113k06128A4771a15606
19093a93865j09957a45692j01020o9648C7552N9055a62145B01720I9911f9565
19082b39264g1708q1247o9115D8220b22322A06781A2369a3807j21132a0658G942
19070E5176h2309m1400D7616a87973Q1032E0507c02962d9570k1128A88722B5451
19058f9456j51859h6034K0378A05429a27198H9006m2422J91520A8495c982k38570
19047b42552Q8712l5087B306N7737k9061h6578A38678B1934a91110I9224b43216
$$ plain form
19035 14862 -4970 -177506 -11012 -318076 156742 -47555 49954 -184114 -329868 -41682 -19308
19023 90165 23523 177764 11567 26343 -83171 -81528 74926 -88842 60516 60273 43436 -78277
19010 -74686 -22955 148765 -72760 175607 -69211 101823 -96028 -21498 -269954 -86085 24122
18998 231385 -44149 -150024 68974 -173712 -49046 95366 -8513 -28413 170459 -2080 -83957
18987 -83957 -91584 30757 77521 175909 -218718 -285474 80249 -165961 -112227 160443 54085
18975 -298599 81607 -287879 116823 47430 11257 535177 409068 193628 137323 18157
18964 203321 -185437 -25435 -505777 -70419 -94836 66707 180886 -18026 -173850 -69267 -104440
18953 -104440 159337 174857 -4453 164822 -27681 -104064 -307562 120686 177239 -107471 128126
$$ packed form
19035A4862d970j72536a1012l07064A56742d7555D9954a84114j45754d1682a9308
19023I0165B3523J54241A1567J4776h3171J643G4926h8842F0516k43j6837g8277
19010g4686b2955A48765g2760A75607f9211A01823i6028b1498k48456h6085B4122
18998B31385d4149j05875F8974a73712d9046I5366h513j9900A70459b080q1877
18987h3957p627C0757M6764R8388b18718o6756H0249a65961N3734A60443E4085
18975b98599H1607b87879A16823D7430A1257N23920j26109A93628n6305A8157
18964B03321a85437b5435m80342g0419k4417F6707J14179a8026j55824f9267l5173
18953a04440A59337J5520d453A64822b7681p6383k03498A20686N6553a07471A28126
$$ plain form
18941 314293 243500 -42432 77994 264371 -64062 -78232 -108134 -16635 -282513 -242377 -338307
18930 -338307 -22099 -107131 -143843 220659 344131 -117933 65166 33860 -188910 -1872 -22258
18919 -22258 -162263 -289017 82401 -73041 -576794 -143032 202428 -83604 64431 62369 -319198
18907 311389 156562 427190 102151 113038 403400 200019 -245567 -141155 68346 120694
18897 120694 -46740 -77257 -10055 -74684 295673 114029 -126213 112670 -95479 29381 272484
18886 272484 -97005 -377248 -322413 -54510 153585 -14791 -96753 -202268 -124320 -94881 -178270
18875 -178270 -318348 -208584 -257019 8217 -238462 -353274 -39557 -220726 303708 29549
18864 -175739 -10914 -197695 -116883 127109 66085 -242972 -108302 -228340 -45154 -24744
$$ packed form
18941C14293p0793d2432G7994J86377f4062j4170k9902a6635k65878M0136r5930
18930c38307b2099q5032l6712B20659J23472a17933F5166l1306a88910a872k0386
18919b2258j40005j26754H2401g3041n03753a43032B02428h3604F4431k062c19198
18907C11389j54827K70628A02151J0887K90362B00019b45567J04412F8346N2348
18897A20694d6740l0517a0055o4629B95673A14029a26213A12670i5479B9381K43103
18886B72484i7005k80243N4835e4510A53585a4791q1962j05515P7948K9439q3389
18875a78270j40078J09764m8435H217b38462j14812c9557j81169C03708B9549
18864a75739a0914j86781Q0812A27109o1024b42972a08302j20038d5154K0410
$$ plain form
18854 -24744 -180439 -222949 -306054 -65318 -485401 -20446 -120205 -68103 159654 40927 264332
18843 264332 -52978 -452507 90654 -312826 -165203 3936 -84260 -91128 -142825 -376814 234311
18831 -67034 -38784 -80287 177833 -190728 -111409 41267 -35462 196692 187883 -68422 46759
18819 -138111 -172310 276070 -27223 380353 527927 -246173 -299587 -136707 529131 262553
18808 -67104 99569 375370 -96755 87392 -145128 89153 211967 -34275 -9610 1062 -115221
18796 -232823 68190 -194988 -179079 86456 208703 51226 -39000 -158762 209513 111701 6612
18784 -140730 -77460 -66912 79229 534117 -141595 -319789 -91680 -7247 -171087 -189328 -353524
18773 -353524 -103090 -256554 79211 120411 -105468 28754 -2012 127622 27996 32206 -274339
$$ packed form
18854b4744j55695m2510q3105f5318m20083b0446r9759N2102A59654D0927K23405
18843B64332e2978l99529I0654c12826J47623C936h4260o868n1697k33989B34311
18831f7034K8250m1503A77833a90728P9319D1267c5462A96692q809f8422D6759
18819a38111l4199B76070b7223C80353J47574b46173n3414a36707E29131B62553
18808f7104I9569K75801i6755H7392a45128H9153J22814c4275i610A062a15221
18796b32823F8190a94988J5909H6456J22247E1226c9000j19762B09513r7812F612
18784a40730O3270J0548G9229M54888a41595j78194i1680g247j63840j8241j64196
18773c53524a03090j53464G9211M1200a05468B8754b012A27622B7996M210b74339
$$ plain form
18761 -325203 -225639 -31276 -349219 140174 38410 -88037 215521 209784 200885 -101858 -222191
18750 -222191 -160481 59500 146232 -5856 -13004 -218287 -140099 87929 -4841 -198494 -28424 -197908
18738 -197908 -1239 -265098 -136600 -142068 -167731 -220829 -209242 14482 -161659 282430 -389611
18726 -7277 -79079 -201705 88466 32409 -43073 -201711 163160 -269726 85061 -225506 -220608
18715 -220608 -55278 -280116 -58801 -185070 131325 -133330 -221467 161261 -69889 28062
18704 295730 -32176 -110723 299242 -273191 103279 -211276 153240 -320856 -272686 25719
18693 -29933 -132256 49960 8176 137432 -93163 -98760 -88230 -48586 -287936 -124998 -243028
18682 -243028 -259913 -375167 -251745 57876 -108557 -19655 -119499 -78112 -286668 -31924 230094
$$ packed form
18761c25203R9564c1276l17943A40174C8410h8037B15521n737q899a01858j20333
18750b22191O1710E9500Q6732e856p148k05283P8188H7929d841j93653b8424j69484
18738a97908a239k63859J28498n468k5663n3098J1587A4482a61659B82430c89611
18726g277p1802j22626H8466C2409d3073j58638A63160b69726H5061b25506M898
18715b20608e5278k24838e8801j26269A31325a33330q8137A61261f9889B8062
18704B95730c2176p8547B99242b73191A03279b11276A53240c20856M8170B5719
18693b9933j02323D9960H176J29256i3163n597J0530L9644k39350a24998j18030
18682b43028j6885j15254J23422E7876a08557a9655r9844M1387k08556c1924B30094
$$ plain form
18670 -297576 18736 -104184 -399591 134083 -125710 -50424 -27183 170517 -284607 -371563
18660 -371563 -272395 -147462 -27916 -148570 -257232 122675 -258828 116685 142191 -200047
18649 69977 -209596 -177480 74922 -240720 -61076 -44600 -39620 161952 -244751 -134114 -50130
18637 -179183 -124678 65020 -418236 -111620 80361 -451354 -153064 -105279 37893 42531 -328244
18625 -85135 -465358 88727 440378 -89357 37805 -313983 147696 -135797 46739 -46194 -366621
18614 -366621 -188371 121790 72814 299815 -79311 169195 3516 -218262 44067 -59650 -226479
18603 -226479 -164481 24499 -181637 -325487 -91630 -114733 -135939 196563 -14349 -141466 -154547
18592 -154547 -225168 -102442 343650 217118 -109517 -113105 -240993 72638 148145 103268 -132367
$$ packed form
18670b97576A8736a04184k95407A34083a25710e0424K3241A70517b84607q6956
18660c71563R9168J24933b7916j20654j08662A22675b58828A16685K5506b00047
18649F9977b09596L2116G4922b40720f1076J6476M980A61952b44751J10637e0130
18637a79183N4505F5020d18236a11620H0361d51354a53064M7785C7893M638c28244
18625h5135l80223H8727L51651h9357C7805c13983A47696a35797D6739d6194l20427
18614c66621J78250A21790m8976K27001g9311A69195C516b18262D4067e9650j66829
18603b26479O1998B4499a81637j43850i1630k3103k1206A96563a4349j27117j3081
18592a54547p0621a02442C43650j26532a09517l588j27888G2638P5507m4877a32367
$$ plain form
18580 -29340 -102807 162109 -148957 -12225 -89675 -220154 125353 198085 40293 -120317 -69682
18569 -69682 -231260 -145137 -244599 -64751 159425 -15006 -48606 -120846 101846 116870 -270371
18557 237131 -19110 -51728 -164701 -474310 -207567 187494 258860 -150349 176354 284731
18547 284731 72213 -11984 135839 -145440 268523 -259148 114635 156950 124371 144517
18537 144517 -23948 -125816 -300881 191669 25489 60014 7378 289893 -306975 -145493
18526 -198201 43227 205557 188166 -152927 290921 -265449 -86644 -67080 -94635 71601 -251664
18514 73826 111256 125164 58682 -53915 -340309 -88349 -105042 170050 112232 220628 259746
18503 259746 -23551 28252 54790 68699 -409902 -106086 56788 22563 -7275 74349 34151
$$ packed form
18580b9340p3467A62109a48957a2225p7450j30479A25353P2732D0293a20317N0635
18569f9682j61578Q6123r9462f4751A59425a5006l3600p2240A01846J5024b70371
18557B37131a9110l2618j12973l09609b07567A87494P1366a50349A76354J08377
18547B84731G2213a1984A35839a45440B68523b59148A14635M2315l2579K0146
18537A44517b3948j01868j75065A91669B5489L4525G378K82515c06975a45493
18526a98201D3227J62330j7391a52927B90921b65449h6644J9564k7555G1601b51664
18514G3826L7430J3908E8682e3915k86394h8349j6693A70050n7818J08396L9118
18503B59746b3551B8252K6538J3909d09902a06086E6788B2563g275G4349C4151
$$ plain form
18491 -155565 -37394 -126035 -247757 -88789 157426 -49360 -201212 308851 -28687 -51995 -200260
18480 -200260 43939 150803 -102194 103250 109702 -185454 -120356 -81418 -668110 83514 -133333
18468 -64766 -400210 24916 52298 -77931 247889 231869 -71456 -116845 -126513 -76730 70135
18456 -188420 57055 -230220 -65103 -121006 33545 201242 -249331 -317390 -195608 -254043 -54225
18444 139655 -196928 101398 -210727 -32353 -161844 -3584 -181654 46919 186701 -120056
18433 90921 -212967 126834 -212905 -114629 -9727 439794 49524 -61583 -76205 -178673 -300184
18422 -300184 -11392 -114449 70326 -7269 -40127 -116935 63754 -180382 -330491 9507 73721
18411 73721 -244788 -119046 -248657 -148875 -20777 163660 -68023 97264 -49328 196325 87175
$$ packed form
18491a55565c7394q8641j21722h8789A57426d9360j51852C08851b8687k3308j48265
18480b00260D3939J06864a02194A03250O452a85454O5098L8938n86692H3514a33333
18468f4766l35444B4916K7382g7931B47889j6020g1456m5389r668M9783G0135
18456a88420E7055b30220f5103n5903C3545J67697b49331o8059J21782n8435e4225
18444A39655a96928A01398b10727c2353j29491c584j78070D6919J39782a20056
18433I0921b12967A26834b12905R8276i727D39794D9524f1583j4622j02468j21511
18422c00184a1392j03057G0326g269l2858p6808F3754a80382j50109I507O4214
18411G3721b44788a19046j29611R9782b0777A63660f8023I7264d9328A96325H7175
$$ plain form
18399 -278397 128721 -128056 -240452 -69927 -498650 -7629 -129193 -158330 -184496 -155204 -238966
18388 -238966 -28465 3645 -245153 -233667 -168409 -12432 -9441 267474 -163053 64868 -83789
18376 -273689 -151898 -278977 -342274 187360 127709 -7036 362393 -105456 -116566 212322
18365 -89739 147358 152573 16985 39534 167872 240648 -156813 104009 -205875 -345863 -113325
18353 -33664 -253777 74625 -81053 -183619 252403 35225 -116732 -72420 -100023 -130889 -154069
18342 -154069 126155 -151008 40395 -42383 -329129 -94367 -259008 47236 -85304 -155236 -282432
18331 -282432 156481 -141470 -328513 101947 73309 -131637 -87768 -44139 -215840 95944
18320 58010 -44700 35151 -33689 349915 -87517 -46808 60808 -3836 43449 -152107 129966
$$ packed form
18399b78397A28721a28056j12396f9927m28723g629j21564k9137k6166K9292q3762
18388b38966b8465C645b45153J1486O5258a2432K991B67474a63053F4868h3789
18376b73689J21791j27079o3297A87360n9651g036C62393a05456j1110B12322
18365h9739A47358N215A6985K2549J28338P2776a56813A04009b05875j39988a13325
18353c3664k20113G4625h1053j02566B52403C5225a16732M4312k7603l0866k3180
18342a54069A26155a51008D0395d2383k86746i4367j64641D7236h5304o9932j27196
18331b82432A56481a41470j87043A01947k8638a31637M3869M3629j71701I5944
18320E8010d4700C5151c3689C49915h7517M0709F0808c836D3449a52107A29966
$$ plain form
18308 -74447 -93759 -318178 -100576 51358 105154 19277 -205692 -79278 -189100 54093 145893
18297 145893 -112119 -277788 21705 345966 88390 2659 273109 -89550 16160 -26066 -199311
18286 -199311 -219696 -165533 164144 -86534 -104078 25865 35179 -109046 502098 -206786 60718
18274 126076 -164651 59849 49258 28856 66343 -2978 106887 164377 75448 73274 -208145
18262 46563 109747 36737 15192 -89122 -64351 71457 -21836 -330156 32918 -376673 22836
18250 32313 -47631 201787 72670 -108933 10329 106684 -12181 -146277 -122486 -2150 -8770
18239 -8770 65943 -135651 244375 -309946 -150424 146382 159140 135428 45481 42388 106660
18228 106660 237367 463649 52568 -192041 -127862 127100 -1548 -310060 -123142 67954
$$ packed form
18308g4447j9312k24419a00576E1358N3796A9277b05692g9278j09822E4093R1800
18297A45893a12119j65669B1705L24261H8390B659K70450h9550A6160b6066j73245
18286a99311k0385N4163A64144h6534j7544B5865R314a09046E02098b06786F0718
18274A26076a64651E9849j0591k0402L7487b978A06887N7490G5448k174b08145
18262D6563O3184C6737A5192h9122K4771G1457b1836l08320C2918c76673B2836
18250C2313d7631B01787G2670a08933A0329R6355a2181j34096K3791b150o620
18239h770F5943a35651B44375c09946a50424A46382J2758k3712D5481l093O4272
18228A06660J30707K26282E2568a92041O4179A27100a548l08512a23142F7954
$$ plain form
18217 -252314 213750 -84421 -98801 6372 -29610 43896 -188735 -246916 86611 18550 218291
18206 218291 -84475 98348 195481 18266 31169 225022 -436197 94121 -386837 -277387 41783
18194 2017 -119670 -186144 301327 133047 191194 -25947 40243 8790 -52798 -80195 -200832
18183 -200832 -231429 -188948 -266528 -15510 81489 -39307 379717 237395 315460 12469 -157351
18171 -6092 153421 236339 122396 4992 203742 40724 98456 117609 -271014 -190292 174550
18159 118952 -7573 166586 68886 132433 91395 -323967 196291 -226340 -101393 -218969
18149 -218969 -273714 109095 -243069 -163507 66931 -125888 -26798 -172588 -28516 71370 238320
18138 238320 32516 28372 309790 -37108 262863 210578 134699 -21889 -48705 -245391 -129243
$$ packed form
18217b52314B13750h4421j4380F372b9610D3896a88735n8181H6611A8550J99741
18206B18291h4475I8348R7133A8266J2903J93853d36197I4121c86837J09450D1783
18194B017a19670o6474C01327A33047N8147b5947D0243H790e2798k7397j20637
18183b00832l0597M2481p7580a5510H1489c9307C79717j42322P8065A2469a57351
18171f092A53421Q2918j13943D992J98750D0724N7732J9153b71014Q0722A74550
18159A18952g573A66586F8886O3547m1038c23967A96291b26340a01393j17576
18149b18969n4745A09095b43069P9562F6931a25888b6798j45790b8516G1370J66950
18138B38320C2516m144K81418c7108B62863n2285p5879b1889k6816j96686J16148
$$ plain form
18127 -129243 144439 -291258 -317021 -99293 191108 -92769 10750 167379 -237468 -1087 146721
18115 -42772 250457 134917 -249301 -100207 187742 175619 27685 10067 -27146 53365 -205976
18103 -83223 224560 88374 -56154 113120 281302 -179126 -70892 -109154 -99335 40857 -159139
18091 183695 218508 34896 -16453 82765 146308 -24108 147703 95536 235736 -294297 -6134
18079 213189 -161025 -24300 233722 -354138 -88917 -78514 19258 36026 239532 107909
18068 -188412 -53970 -252207 -51642 -37759 229035 -177761 -463063 -30719 -9830 38941 263685
18057 263685 30813 84060 -169814 -39771 184755 357232 -247920 -155912 -329906 87307
18046 -391696 -56697 -66280 -261725 -114679 -180804 -154168 64277 -122945 -37305 250634 -2350
$$ packed form
18127a29243A44439b91258k5763i9293A91108i2769A0750J56629b37468a087A46721
18115d2772B50457j15540b49301a00207A87742j2123B7685A0067b7146E3365b05976
18103h3223B24560H8374e6154A13120J68182a79126g0892l8262R819D0857a59139
18091A83695L4813C4896a6453H2765O3543b4108A47703n2167J40200b94297f134
18079B13189a61025b4300B33722c54138h8917J0403A9258J6768K03506A07909
18068a88412e3970j98237e1642J3883B29035a77761k85302c0719i830C8941K24744
18057B63685C0813N3247a69814c9771A84755J72477b47920R2008j73994H7307
18046c91696e6697r583j95445a14679o6125K6636F4277a22945c7305B50634b350
$$ plain form
18034 -54514 3449 -101465 -128966 68746 -30992 -63965 153810 -46464 -294788 -22501 116268
18022 1875 -351710 200776 168009 386307 -162516 23201 40383 248439 84161 148618 -172742
18010 -6742 -190208 83748 -392172 182305 -204911 295715 225139 -110352 18726 -126813
17999 326507 -121421 74915 -247804 -108577 29056 168555 51842 57290 -49805 -301752 -171757
17988 -171757 43674 -252811 266299 60584 -223397 -177531 -39504 281647 -173669 64250
17977 -101103 128653 70494 223386 -49235 24493 -34429 -78759 -609 115812 285758 -17352
17965 -157078 -123603 -27836 -94749 113860 -199681 -139020 -5562 50310 180138 243100 141189
17954 141189 100117 90731 -168739 -109329 2858 -170730 72147 -231810 -261601 111557 143198
$$ packed form
18034e4514C449a01465k7501F8746c0992l2973A53810d6464k48324b2501A16268
18022A875c51710B00776l2767K18298a62516B3201J7182K08056H4161O4457a72742
18010f742j83466H3748c92172A82305b04911B95715p0576a10352A8726a26813
17999C26507a21421G4915b47804a08577B9056J39499E1842N448d9805k51947J29995
17988a71757D3674b52811B66299F0584b23397M5866c9504B81647a73669F4250
17977a01103A28653n8159J52892d9235B4493c4429m4330f09A15812J69946a7352
17965a57078L3475b7836o6913A13860a99681O0661e562E0310J29828O2962j01911
17954A41189m1072r386a68739N9410B858a70730G2147b31810k9791A11557L1641
$$ plain form
17943 143198 -30667 169120 27347 132798 217671 -66474 113932 -11442 250608 -355041
17932 -179095 70795 -115138 42991 140917 -162340 -276729 -215152 17998 -70414 4097 147593
17921 147593 115923 413511 -293495 -1492 -136104 67009 -71860 -12514 97096 40633 142681
17910 142681 -236893 -128516 447340 -134650 -384448 -5612 15091 -92537 60695 -6826 138898
17898 194073 -68187 -31237 -106194 300111 -215550 198978 273532 -252820 407080 -65257
17887 -123771 -53535 19155 57915 -88299 107833 87416 121942 367333 -1976 -57075 -104801
17876 -104801 139284 244614 139057 205502 135837 -1971 186788 214154 245130 124047 313379
17865 313379 183031 247652 48384 -22520 156072 -67042 80760 -278481 -230220 -62182 -127906
$$ packed form
17943A43198c0667A69120B7347J05451Q4873f6474A13932a1442B50608c55041
17932a79095G0795a15138D2991R7926a62340j14389O1577A7998g0414D097J43496
17921A47593l1670K97588b93495a492j34612F7009g1860a2514I7096D0633J02048
17910A42681b36893J08377D47340a34650k49798e612A5091i2537F0695f826A38898
17898A94073f8187c1237p4957C00111b15550A98978P4554b52820D07080f5257
17887a23771e3535A9155L8760h8299A07833k0417L4526K45391a976n5099m7726
17876a04801A39284J05330j05557O6445o9665a971A86788K7366L0976j21083J89332
17865C13379j30348O4621D8384b2520A56072f7042H0760b78481M8261f2182o5724
$$ plain form
17854 -127906 243210 -174411 245990 295110 19035 109311 225898 -329523 221770 -71819
17843 117988 238187 169352 402889 78566 -16422 291565 134325 373683 60888 -144684
17832 -74460 58101 -312193 -57822 -246105 -57333 11794 213464 -18653 140744 -27019 37460
17820 53608 -162934 189352 210925 41792 234566 -193292 -168043 -58071 10822 321274 -41431
17808 -33716 65853 -234610 -15260 -51603 150538 -104327 -17435 78178 226582 -146788 -75055
17797 -75055 232298 24345 -228142 41753 -16449 -135966 -171182 81254 -140711 152629 -32574
17785 268613 203291 83626 -84767 -206970 255160 214357 238449 -224280 247209 262820 23688
17773 -465771 163098 447683 -50076 -177846 -233945 60553 473424 113985 -54517 -340855
$$ packed form
17854a27906B43210a74411B45990M9120A9035R0276J16587c29523B21770g1819
17843A17988J20199o8835K33537G8566a6422B91565A34325K39358F0888a44684
17832g4460E8101c12193e7822j88283e7333A1794K01670a8653A40744b7019C7460
17820E3608a62934A89352K1573D1792J92774a93292K5249e8071A0822L10452d1431
17808c3716F5853b34610a5260l6343A50538a04327a7435G8178J48404a46788P1733
17797g5055B32298B4345b28142D1753a6449j19517l5216H1254a40711A52629c2574
17785B68613o5322H3626h4767j22203B55160m0803K4092b24280B47209J5611B3688
17773d65771A63098K84585e0076j27770n6099F0553M12871A13985e4517k86338
$$ plain form
17763 -340855 -155960 -41393 212423 -91481 -36896 -264483 189343 -226199 161618 93612
17753 93612 -101773 -241665 -34902 -185421 -106329 232651 -12826 69748 -115098 107221
17742 95032 36798 37393 236850 -66473 -59117 141287 102907 47811 -59956 63667 -101949 215056
17729 262480 245366 91654 -494413 22971 -81770 126156 -81151 73526 -241448 225606 -73658
17717 -154692 70581 270076 102716 36515 199238 -103633 118624 161965 204952 -207708
17706 18116 190384 263806 -19247 28189 10110 -34542 38956 198824 130883 -42416 196307
17694 -267655 -125662 8063 208202 69781 -236550 279671 257570 -30815 134037 -19257 198629
17682 169127 -894 -132478 -3163 237859 246889 365863 -185207 -158069 17482 185863 112603
$$ packed form
17763c40855a55960d1393B12423i1481c6896k27587A89343b26199A61618o8006
17753I3612a01773j39892c4902j50519P9092B32651a2826F9748a15098A07221
17742I5032C6798N95J99457f6473P356A41287l8380D7811e9956F3667a01949B15056
17729B62480j7114I1654d94413B2971h1770A26156h1151G3526b41448B25606g3658
17717a54692G0581J99495A02716C6515J62723a03633A18624M3341M2987b07708
17706A8116J72268P3422a9247B8189A0110c4542C8956J59868o7941d2416A96307
17694b67655a25662H063K00139F9781b36550B79671k2101c0815A34037a9257A98629
17682A69127h94j31584c163B37859R030J18974a85207K7138A7482J68381p3260
$$ plain form
17671 112603 196719 230386 -13568 220361 30542 92076 112462 294701 74524 34878 266965
17660 266965 24805 -86331 -220674 90281 269440 -13050 153841 42118 43480 -311214 58780
17648 -87059 46102 128080 -51994 96516 23465 79058 152823 58511 -25218 100230 -83427
17636 -34095 163807 367632 201825 -158221 150326 -8065 113775 227878 146708 111416
17626 111416 332368 -58631 72999 -113511 217184 448239 73547 70663 309076 61950 78407
17615 78407 122312 -188331 54207 206983 174689 209005 119165 -129722 340406 -48129 221733
17603 308482 218145 -136941 388807 240313 339424 -7700 -96321 53939 286367 60045 -110230
17591 -15003 -160895 238197 -9678 -8966 -41573 -78156 464972 41871 362458 24796 86374
$$ packed form
17671A12603Q4116L3667a3568B20361C0542O1534K0386J82239G4524C4878K32087
17660B66965B4805h6331j34343I0281J79159a3050A53841D2118J362c11214E8780
17648h7059D6102Q1978e1994I6516B3465N5593P3765E8511b5218A00230h3427
17636c4095A63807K03825j65807a58221A50326h065A13775J14103q1170l5292
17626A11416K20952e8631G2999a13511B17184K31055G3547k884K38413F1950J6457
17615G8407M3905a88331E4207J52776l2294L4316q9840a29722C40406d8129B21733
17603C08482r0337a36941C88807j48494R9111g700q8621E3939K32428F0045a10230
17591a5003j45892B38197i678P12l2607l6583D64972D1871L20587B4796O1578
$$ plain form
17580 86374 285807 206685 -157144 -191547 -33455 240611 91707 89800 174801 155626 259725
17569 259725 293482 126020 209772 117900 254072 76234 164795 86395 154928 17099 -51372
17557 -152044 225288 42617 304081 276489 311945 202669 371843 220368 246211 224108
17547 224108 239392 416903 92796 -45732 16914 57213 191936 60538 258575 -123434 426390
17535 241329 97592 174077 -105273 113445 186180 -99677 388237 687906 243355 269325
17525 269325 594605 1044713 913429 965140 843850 637096 374845 219726 284735 222058
17515 222058 514589 459771 243908 274289 390242 296472 898311 932222 777040 627962
17505 627962 876054 513947 704247 362873 174024 94928 194444 303650 -176550 383414
$$ packed form
17580H6374J99433p9122a57144l4403c3455B40611I1707j907Q5001j9175J04099
17569B59725L3757A26020Q3752r1872J36172G6234Q8561p8400O8533A7099e1372
17557a52044B25288D2617K61464k7592L5456j09276J69174j51475K5843k2103
17547B24108J5284J77511I2796d5732A6914M0299J34723F0538J98037a23434D26390
17535B41329I7592P6485a05273A13445P2735i9677C88237K99669B43355K5970
17525B69325L25280M50108j31284N1711j21290k06754k62251j55119O5009o2677
17515B22058K92531n4818k15863L0381J15953r3770O01839L3911j55182j49078
17505F27962K48092l62107J90300l41374A74024p9096R9516J09206a76550C83414
$$ plain form
17494 309619 110023 274695 326593 246811 477514 -40264 4898 8330 517909 106941 197139
17483 197139 271938 136658 283357 219733 130461 186375 181046 143208 386708 387107 359158
17472 359158 470001 194539 275441 289054 389372 -69003 215320 165754 271314 65569
17461 51240 77028 74956 282186 472182 385849 258075 505836 177901 250764 81639 256479
17450 256479 486078 114687 576251 604047 708075 181187 365372 231736 557643 414952
17440 414952 545121 495748 766550 542825 397117 615054 354546 414588 247084 343212
17430 343212 39101 138734 363079 115527 384797 61958 171634 376742 781905 455917
17420 455917 47369 226248 425885 398191 361572 659958 283075 563518 181639 371790
$$ packed form
17494C09619A10023J64672N1898p9782K30703d0264D898L432N09579A06941R0198
17483A97139P4799j35280J46699o3624q9272N5914n329l7838K43500L99k7949
17472C59158J10843A94539Q0902J3613J00318f9003B15320m9566J05560F5569
17461E1240K5788k072K07230J89996q6333j27774K47761A77901P2863H1639J74840
17450B56479K29599A14687M61564K7796J04028A81187J84185j33636L25907j42691
17440D14952J30169m9373K70802k23725j45708K17937k60508O0042j67504R6128
17430C43212C9101R9633K24345A15527K69270F1958J09676K05108M05163l25988
17420D55917D7369J78879J99637k7694l6619K98386B83075K80443A81639J90151
$$ plain form
17410 371790 612889 458966 374779 652051 230302 432834 -965 -41125 182422 98607 80164
17399 80164 387813 401652 13573 292075 184567 285289 185543 464318 90232 319422
17389 319422 416751 422969 141912 228910 176153 341950 271267 377089 184517 131180 307344
17378 307344 222068 168635 110178 345305 465331 45977 243681 409538 58769 -21645 372507
17366 133392 467399 -68287 73617 529137 181450 -44099 615956 220209 429087 370467
17356 370467 187973 494310 35853 413403 314438 558518 195049 277042 200137 -62051
17345 284709 366753 271093 410907 215767 36239 -32673 106275 362390 253344 114784
17334 157869 340811 200372 225898 264722 35240 132988 231036 -143395 195642 247319 244515
$$ packed form
17410C71790K41099j53923q4187K77272B30302K02532i65m0160A82422q3815j8443
17399H0164L07649J3839A3573K78502j07508J00722r9746K78775I0232K29190
17389C19422R7329O218A41912Q6998n2757J65797p0683J05822A84517n3337J76164
17378C07344q5276n3433n8457K35127J20026D5977J97704J65857E8769b1645C72507
17366A33392L34007f8287G3617M55520A81450d4099F15956B20209K08878n8620
17356C70467j82494L06337C5853L77550r8965K44080A95049Q1993p6905f2051
17345B84709Q2044r5660J39814j95140C6239c2673A06275K56115j09046A14784
17334A57869J82942j40439K5526L8824C5240R7748R8048a43395A95642N1677k804
$$ plain form
17323 244515 152312 1550 180725 -37800 530411 320285 379724 219293 154554 224891 284457
17312 284457 26632 94725 84931 174180 264217 260182 316332 252100 437902 238399 -62000
17300 152901 337924 -108663 332750 104718 176932 -90216 399149 183571 147245 250730
17290 250730 207129 419927 390397 218292 -77162 12158 150352 90073 183431 535466 633225
17279 633225 287330 378553 37429 379803 21288 -130375 175292 223686 29087 365448
17269 365448 111948 452397 468350 241974 481275 431075 244968 435982 175395 473555
17259 473555 174011 463365 421194 83336 533062 606546 -56355 364104 -14054 70127 219448
17248 219448 591745 470744 104584 111816 206843 263916 232695 458577 359717 278089 436023
$$ packed form
17323B44515r2203A550J79175c7800E30411k10126N9439j60431o4739P0337N9566
17312B84457B6632O8093r794Q9249R0037m035N6150o4232J85802j99503f2000
17300A52901J85023a08663C32750A04718P2214i0216C99149A83571l6326J03485
17290B50730m3601K12798k9530j72105g7162A2158J38194o0279R3358L52035R7759
17279F33225B87330R1223C7429L42374B1288a30375A75292M8394B9087L36361
17269C65448A11948L40449J5953k26376K39301n0200j86107J91014A75395K98160
17259D73555A74011K89354m2171H3336M49726P3484e6355C64104a4054G0127J49321
17248B19448L72297j21001A04584P232R5027N7073l1221K25882r8860q1628J57934
$$ plain form
17237 436023 339024 222194 168593 312163 356237 103164 285210 540801 356519 55909
17226 657403 505551 105220 295669 165541 480272 541531 383439 531627 38821 180113
17216 180113 450196 405699 184107 406704 278850 479651 266356 314105 272347 379239
17206 379239 347206 563732 433316 433516 123526 545486 284533 818120 -8628 110593 662332
17195 662332 634526 228868 651866 351221 212963 298809 498846 301605 264905 495425
17185 495425 29637 328681 272588 145820 76636 115633 312435 303143 270723 503265 -77541
17173 161280 448312 830188 -57768 501132 508432 625934 101101 451324 525561 -19507
17162 543955 438843 9543 196794 441124 438279 252335 428783 320652 604632 762310
$$ packed form
17237D36023r6999j16830n3601J43570M4074A03164J82046K55591j84282E5909
17226F57403j51852A05220J90449j30128L14731O1259j58092J48188C8821J41292
17216A80113K70083m4497A84107K22597j27854K00801k13295M7749m1758J06892
17206C79239l2033K16526j30416K00A23526M21960k60953N33587h628A10593N51739
17195F62332k7806B28868M22998l00645j38258Q5846K00037j97241l6700K30520
17185D95425B9637K99044n6093j26768o9184L8997J96802r292l2420K32542g7541
17173A61280K87032L81876e7768E01132P300J17502A01101L50223P4237a9507
17162E43955j05112I543J87251K44330k845j85944J76448j08131K83980J57678
$$ plain form
17152 762310 514407 617435 144396 104234 613433 320343 186054 409716 506068 609915
17142 609915 356573 648259 670007 256673 240921 469570 302307 537075 301729 376706
17132 376706 320845 594914 236192 572130 421493 313360 467571 709986 477656 554168
17122 554168 514908 357999 754506 242657 437112 740293 607508 567952 478082 843512
17112 843512 702788 751324 540200 846892 875941 485070 533445 692241 511837 383227
17102 383227 566342 614388 524013 530770 388229 496467 509058 480497 366765 845115 176712
17090 763950 672422 658745 712394 715502 729922 879549 611167 596556 662287 643428 434533
17079 434533 717874 763390 474298 651011 1047198 633577 853347 907223 821875 502642
$$ packed form
17152G62310k47903J03028A44396m0162N09199k93090j34289K23662R6352J03847
17142F09915k53342K91686K1748B56673j5752K28649j67263K34768k35346P4977
17132C76706n5861K74069B36192L35938j50637j08133J54211K42415k32330P6512
17122E54168l9260j56909L96507B42657J94455L03181j32785l9556q9870L65430
17112H43512j40724M8536k11124L06692K9049l90871M8375J58796j80404j28610
17102C83227J83115M8046r0375O757j42541J08238J2591k8561j13732M78350A76712
17090G63950r1528j3677N3649L108J4420J49627k68382j4611O5731j8859k08895
17079D34533K83341M5516k89092J76713L96187m13621K19770N3876q5348l19233
$$ plain form
17069 502642 655982 713329 805587 927234 728251 791142 1115459 804775 727187 824726
17059 824726 677641 550063 685670 722140 658811 806972 941141 511857 673560 726409
17049 726409 291875 387723 1325792 601138 822438 817281 628456 1033575 731718 652826
17039 652826 936541 718588 992083 725228 893928 659489 662765 1242066 915320 753905
17029 753905 753253 872254 1022398 1239740 910897 1189802 1067953 1073918 1112069 895764 1131986
17018 1131986 1011671 843656 1234358 1120590 823007 879106 1080043 1006568 856364 1126098
17008 1126098 1047108 1117275 1332587 912789 1231234 1340557 1160732 937527 1103087 879601
16998 879601 1018376 826246 944704 1296976 1314371 1259252 940170 1135209 1265963 1294364
$$ packed form
17069E02642J53340N7347R2258J21647j98983O2891L24317l10684p7588R7539
17059H24726j47085j27578J35607L6470o3329J48161J34169m29284J61703N2849
17049G26409B91875R5848R38069F01138K21300n157j88825M05119l01857p8892
17039F52826K83715k17953K73495k66855J68700k34439L276N79301l26746j61415
17029G53905o52J19001J50144K17342l28843K78905j21849N965L8151k16305K36222
17018A131986j20315j68015L90702j13768k97583N6099K00937p3475j50204K69734
17008A126098p8990P0167K15312m19798L18445J09323j79825k23205J65560k23486
16998H79601J38775j92130J18458L52272J7395n5119l19082J95039J30754K8401
$$ plain form
16988 1294364 1335227 1113767 1193007 1415860 1320218 1443228 1457617 1566977 1042444 1185242
16978 1185242 1029877 1287279 1158955 1307130 913665 1180301 1451112 1451045 1430295 1445767
16968 1445767 1181203 1331607 1429431 1473254 1322150 1537556 1214356 1572823 1425373 1226862
16958 1226862 1178250 1246781 1241836 1676241 1512899 1650995 1603116 1751758 1654580 1641351 1795941
16947 1795941 1501982 1649075 1942334 1627742 1855151 1802898 1872076 1677814 1649392 1655167
16937 1655167 1645944 1894983 1846595 1722167 1984085 2018021 1910505 1710392 1911882 1903912
16927 1903912 2200540 1810668 1718242 2041024 2123480 1973831 2097728 2069686 1898464 1969161
16917 1969161 2190392 2127237 2229279 2453431 2266608 2425399 2362179 2491525 2299476 2304625
$$ packed form
16988A294364M0863k21460P9240K22853r5642J23010J4389J09360n24533J42798
16978A185242j55365K57402j28324J48175l93465K66636K70811o7k0750J5472
16968A445767k64564J50404R7824M3823j51104K15406l23200L58467j47450j98511
16958A226862m8612O8531m945M34405j63342J38096m7879J48642r7178j3229J54590
16947A795941k93959J47093K93259l14592K27409n2253O9178j94262k8422N775
16937A655167r223K49039m8388j24428K61918L3936j07516k00113K01490p970
16927A903912K96628l89872r2426L22782Q2456j49649J23897k8042j71222P0697
16917A969161K21231o3155J02042K24152j86823J58791o3220J29346j92049N149
$$ plain form
16907 2304625 2295933 2055595 2272936 2371067 2552382 2358724 2636602 2572696 2803809 2712710
16897 2712710 2805330 2516904 2756387 2818504 2483383 2628998 2736701 3044958 2883808 3070839
16887 3070839 2815816 2729134 2903848 3014806 2943665 2809376 3000179 2808019 3605748 3485524
16877 3485524 3125643 3320609 3531272 3574589 3596763 3694542 3745531 3641420 3606621 3711578
16867 3711578 3727024 3947541 3709120 3989489 3999188 3910972 4230195 4249666 4222959 4373996
16857 4373996 4407559 4564879 4693345 4939153 4920303 4841746 4609216 5137222 4840583 5209457
16847 5209457 4880669 4942417 4952759 5248963 5573099 5390833 5683009 6010621 5764482 6009878
16837 6009878 5897636 6132077 6289132 6315543 6560215 6525975 6465374 6810335 6972873 6993170
$$ packed form
16907B304625q692k40338K17341R8131J81315j93658K77878o3906K31113r1099
16897B712710R2620k88426K39483O2117l35121J45615J07703L08257j61150J87031
16887C070839k55023q6682J74714J10958p1141j34289J90803j92160P97729j20224
16877C485524l59881J94966K10663M3317K2174R7779N0989j04111l4799J04957
16867C711578J5446K20517k38421K80369R699q8216L19223J9471k6707J51037
16857D373996L3563J57320J28466K45808j8850p8557k32530N28006k96639L68874
16847E209457l28788O1748J0342K96204L24136j82266K92176L27612k46139K45396
16837F009878j12242K34441J57055K6411K44672l4240o0601L44961J62538K0297
$$ plain form
16827 6993170 7205679 7210052 7394928 7591190 7735250 7912044 8064666 8162718 8366620 7813044
16817 7813044 8575427 8764287 8731563 8939177 9632775 9547827 9536282 9950337 9951307 10143171
16807 10143171 10758063 10994226 11095183 10988750 11514579 11379873 11995404 12350098 12487938
16798 12487938 12787512 13306730 13339303 13731499 14340193 14335043 14929071 15161586 15804264 16308404
16788 16308404 16639219 16813089 17155129 18045836 18269895 18938339 19454671 20067303 20475329
16779 20475329 21159145 21779902 22524927 23197938 23689744 24552183 24960500 26304692 26772874
16770 26772874 27752744 28871274 30063537 31339973 31854823 33311719 34289385 35563086
16762 35563086 37292590 38470385 39806119 41158530 42597992 44270003 46135713 47886906
$$ packed form
16827F993170K12509M373J84876J96262J44060J76794J52622R8052K03902n53576
16817G813044P62383J88860l2724K07614O93598q4948j1545M14055R70J91864
16807A0143171O14892K36163J00957j06433N25829j34706O15531L54694J37840
16798A2487938K99574N19218L2573L92196O08694n150N94028K32515O42678N04140
16788A6308404L30815J73870L42040Q90707K24059O68444N16332O12632M08026
16779B0475329O83816O20757P45025O73011M91806Q62439M08317J344192M68182
16770B6772874R79870J118530J192263J276436N14850J456896R77666J273701
16762C5563086J729504J177795J335734J352411J439462J672011J865710J751193
$$ plain form
16754 47886906 49665666 51904601 53953331 56187244 58645553 60809840 63355635 66126955
16746 66126955 68570016 71547062 74870102 78082773 80972918 84225151 87685420 91840858
16738 91840858 95040355 98455851 102315737 105870510 109671436 112887810 116794355 120396851
16730 120396851 123539276 126766766 129640787 131974227 134710777 136604322 137959542 138939108
16722 138939108 139885900 139587166 139391147 138750684 137214517 136100617 133905474 131329523
16714 131329523 128848516 126048671 122540834 119317328 115898970 112182617 107988956 104646397
16706 104646397 101289869 96949806 93427568 90012845 86163337 82708993 79628277 76292946
16698 76292946 73398999 70209072 67423096 64517042 62119444 59412245 57252683 55006922
$$ packed form
16754D7886906J778760K238935K048730K233913K458309K164287K545795K771320
16746F6126955K443061K977046L323040L212671K890145L252233L460269M155438
16738I1840858L199497L415496L859886L554773L800926L216374L906545L602496
16730A20396851L142425L227490K874021K333440K736550J893545J355220R79566
16722A38939108R46792k98734j96019o40463j536167j113900k195143k575951
16714A31329523k481007k799845l507837l223506l418358l716353m193661l342559
16706A04646397l356528m340063l522238l414723l849508l454344l080716l335331
16698G6292946k893947l189927k785976k906054k397598k707199k159562k245761
$$ plain form
16690 55006922 52854636 50775494 48818372 46859968 44899819 43206465 42017414 40103304
16682 40103304 39086584 37175347 36166370 34442370 33568646 32605708 31120854 30196699
16674 30196699 29169579 27973834 27530194 26247712 25395073 24725649 23693168 23120885 22473209
16665 22473209 21595750 21112618 20558695 19967641 19043766 18805037 18128743 17548870 17177417
16656 17177417 16935134 16257444 16005996 15590516 15014921 14758402 13937911 13815978 13701434
16647 13701434 13338262 12938350 12630081 12418923 11666054 11972839 11802797 11434983 10664268
16638 10664268 10629644 10411702 10221434 10193362 9714785 9568754 9332925 9361889 8905252 8511593
16628 8511593 8760604 9061252 8433608 8370905 8014030 7752125 7875947 7527323 7138123 7160705
$$ packed form
16690E5006922k152286k079142j957122j958404j960149j693354j189051j914110
16682D0103304j016720j911237j008977j724000q73724r62938j484854r24155
16674C0196699j027120j195745m43640j282482q52639o69424j032481n72283o47676
16665B2473209q77459m83132n53923n91054r23875k38729o76294n79873l71453
16656A7177417k42283o77690k51448m15480n75595k56519q20491j21933j14544
16647A3701434l63172l99912l08269k11158p52869L06785j70042l67814p70715
16638A0664268l4624k17942j90268k8072m78577j46031k35829K8964m56637l93659
16628H511593K49011L00648o27644o2703l56875k61905J23822l48624l89200K2582
$$ plain form
16618 7160705 7299576 6818605 6890367 6860546 6595211 6497871 6176959 6235726 6294084 5856799
16608 5856799 5503624 5788040 5771980 5650858 5777650 5497162 5345310 5330916 5493065 5042710
16598 5042710 5007549 4795279 4727261 4877657 4815027 4994176 4955018 4563279 4354028 4359291
16588 4359291 4400640 4151361 4043338 4350828 3862070 3883076 3929908 4110590 3786796 3716602
16578 3716602 3879002 3706713 3460406 3633325 3706562 3569492 3760917 3807534 3705808 3487362
16568 3487362 3291529 3273312 3433602 2752886 3423440 3336876 3230777 3172156 2919676 2913624
16558 2913624 3144697 2977748 2950595 2768626 2516285 2959411 2684202 2869047 2555344 2487706
16548 2487706 2746250 2689223 2386456 2358213 2623077 2538589 2770580 2720319 2461492 2227107
$$ packed form
16618G160705J38871m80971P1762k9821k65335r7340l20912N8767N8358m37285
16608E856799l53175K84416j6060j21122J26792k80488j51852j4394J62149m50355
16598E042710l5161k12270o8018J50396o2630J79149l9158l91739k09251N263
16588D359291M1349k49279j08023L07490m88758K1006M6832J80682l23794p0194
16578C716602J62400j72289k46307J72919P3237j37070J91425M6617j01726k18446
16568C487362j95833j8217J60290o80716O70554q6564j06099n8621k52480o052
16558B913624K31073j66949k7153j81969k52341M43126k75209J84845l13703o7638
16548B487706K58544n7027l02767k8243K64864q4488K31991n0261k58827k34385
$$ plain form
16538 2227107 2252776 2654454 2131896 2189547 2192311 2449396 2000387 2124712 2392224 2060488
16528 2060488 2353964 2241097 2302369 2163413 1988160 2249182 2025231 2118159 1996645 1788455
16518 1788455 2046379 1774340 1608543 1867301 1989024 1848374 1704474 1971065 1662963
16509 1662963 1697420 1798417 1704656 1695399 1771924 1658126 1661098 1565753 1406899 1608455 1816722
16498 1816722 1637987 1440149 1345797 1812884 1614522 1507041 1156807 1320469 1422411 1360936
16488 1360936 1164999 1334555 1176825 1303203 1422909 1488283 1381239 1605375 1338478 1363679
16478 1363679 1241261 1251395 1415652 1487829 1089390 1646654 1084338 1328778 1179994 1267533
16468 1267533 1121598 1045932 944998 1303836 1111949 1207265 957287 1105431 920523 1320890
$$ packed form
16538B227107K5669M01678n22558N7651K764K57085m49009J24325K67512l31736
16528B060488K93476j12867O1272j38956j75253K61022k23951R2928j21514k08190
16518A788455K57924k72039j65797K58758J21723j40650j43900K66591l08102
16509A662963L4457J00997r3761r257P6525j13798K972r5345j58854K01556K08267
16498A816722j78735j97838r4352M67087j98362j07481l50234J63662J01942o1475
16488A360936j95937J69556j57730J26378J19706O5374j07044K24136k66897K5201
16478A363679j22418J0134J64257P2177l98439N57264n62316K44440j48784Q7539
16468A267533j45935p5666j00934L58838j91887R5316k49978J48144j84908M00367
$$ plain form
16458 1320890 1278623 1008626 923894 903329 1081096 948334 1109425 1368752 1248829 700350
16448 700350 1212175 1000154 741568 936058 1092814 848249 1014367 705928 754975 933818
16438 933818 809794 929228 690159 677771 1402277 1190200 841703 682277 941986 989151
16428 989151 945364 1181854 776876 914096 1181079 961522 936460 701319 896826 727541
16418 727541 1090268 964603 768822 650302 634802 664106 747236 1080404 566724 798788
16408 798788 1061752 858294 1013628 807411 360602 929522 1078832 869106 786756 217238
16397 879305 801790 844417 668636 679488 603921 675661 920735 941615 791375 759644 713745
16386 713745 697814 565243 873053 520255 462235 393448 833501 682987 949499 566776
$$ packed form
16458A320890m2267k69997q4732k0565J77767j32762J61091K59327j19923n48479
16448G00350N11825k12021k58586J94490J56756k44565J66118l08439M9047J78843
16438I33818j24024J19434k39069j2388P24506k12077l48497j59426K59709M7165
16428I89151m3787K36490m04978J37220K66983k19557k5062k35141J95507j69285
16418G27541L62727j25665j95781j18520j5500K9304Q3130L33168n13680K32064
16408G98788K62964k03458J55334k06217C60602N68920J49310k09726q2350B17238
16397H79305p7515M2627j75781J0852p5567P1740K45074K0880j50240l1731m5899
16386G13745j5931j32571L07810l52798n8020o8787M40053j50514K66512l82723
$$ plain form
16376 566776 572288 426300 617810 489676 682369 537910 743879 976362 697329 546989
16366 546989 635670 622654 418500 300371 692399 780004 770549 432285 539912 450299 419192
16355 419192 661664 638920 223681 606008 300451 548346 506026 661982 213834 501063
16345 501063 302695 547871 628307 331948 481052 480809 709094 706540 434901 197022 547850
16334 547850 615599 665083 295215 497521 196875 339153 547577 422753 289738 246500
16324 246500 345712 319987 661734 290145 601526 452753 496718 606980 562189 567547 582018
16313 582018 99434 512975 307583 582127 550150 308826 380518 429082 214078 459848
16303 459848 456062 422539 305977 465970 410377 468020 554351 360599 434799 143333 613561
$$ packed form
16376E66776N512j45988J91510j28134J92693j44459K05969K32483k79033j50340
16366E46989Q8681j3016k04154j18129L92028Q7605r455l38264J07627q9613l1107
16355D19192K42472k2744B23681L82327C00451K47895m2320J55956B13834K87229
16345E01063j98368K45176Q0436k96359J49104k43K28285k554k71639A97022L50828
16334E47850O7749M9484B95215K02306A96875J42278K08424j24824j33015m3238
16324B46500R9212k5725L41747B90145L11381j48773M3965J10262m4791N358J4471
16313E82018I9434M13541k05392K74544l1977k41324P1692M8564B14078K45770
16303D59848l786l3523j16562J59993n5593N7643Q6331j93752P4200A43333M70228
$$ plain form
16292 613561 451140 368595 251279 348988 414314 540166 522410 3459 404313 640983 255705
16280 608961 374124 344677 257996 373767 284141 401716 255687 535413 338731 397926
16270 397926 707389 565819 582780 202240 447174 167472 362522 450868 445490 220056
16259 419776 400962 385657 565269 327376 429896 154561 233009 282427 535936 289506
16249 289506 410713 143960 71386 274120 543825 434193 438173 622128 355052 -134018
16238 178979 245117 225483 298760 393399 430847 -22349 275057 438704 459320 288937 165391
16227 165391 355192 388064 344588 179504 46319 250000 264153 617440 198246 57584
16216 396087 58876 233359 135631 -76508 236344 488914 -6607 14947 316717 65082 26168
$$ packed form
16292F13561j62421q2545j17316R7709O5326J25852j7756C459M00854K36670B55705
16280F08961k34837k9447q6681J15771q9626J17575j46029K79726j96682N9195
16270C97926L09463j41570J6961B02240K44934A67472J95050Q8346n378B20056
16259D19776j8814j5305J79612k37893J02520A54561P8448M9418K53509k46430
16249B89506J21207A43960G1386K02734K69705j09632L980J83955k67076a34018
16238A78979O6138j9634P3277R4639L7448b2349B75057J63647K0616j70383j23546
16227A65391J89801L2872m3476j65084D6319K03681J4153L53287A98246E7584
16216C96087E8876J74483r7728g6508B36344K52570f607A4947L01770F5082B6168
$$ plain form
16204 505514 76724 444786 353130 -12218 171873 197677 283056 -72083 325935 185177 127153
16193 127153 581920 428197 190360 -7922 174918 62298 68703 221050 33706 57420 97866
16182 97866 215722 172852 286049 136882 249862 158101 -223666 395548 194243 93212
16171 385996 -3254 493477 -42889 340176 489413 -23262 137679 283109 -35537 116344
16160 56647 273894 188036 105120 170987 105116 154251 372165 221834 -224585 64157 231034
16149 231034 -15624 230022 132791 -36909 105409 197848 221392 -165888 -25888 -205424 345814
16137 136207 156534 -199619 168735 -23056 414 180046 -128019 85635 -8263 76875 205330
16126 205330 45286 145338 -244281 -120834 24414 -130187 96742 120193 292291 85758
$$ packed form
16204E05514G6724L68062r1656a2218A71873K5804Q5379g2083C25935j40758n8024
16193A27153M54767j53723A90360g922A74918F2298O405J52347C3706K3714M0446
16182I7866J17856m2870J13197A36882J12980r1761b23666C95548A94243I3212
16171C85996c254D93477d2889C40176J49237b3262A37679J45430c5537A16344
16160E6647K17247q5858q2916O5867o5871M9135K17914j50331b24585F4157J66877
16149B31034a5624B30022r7231c6909A05409R2439K3544a65888b5888j79536C45814
16137A36207K0327a99619A68735b3056D14J79632a28019H5635h263G6875J28455
16126B05330D5286J00052b44281a20834B4414a30187I6742K3451J72098H5758
$$ plain form
16115 61214 -114508 234365 278619 -11773 -30136 112616 -19336 -77255 184784 15053 -131
16103 513085 185636 82592 345968 19771 -114212 234592 313753 40962 121275 114962 -99429
16091 107303 117583 -22758 133836 120099 37254 337254 283893 -160410 188120 275944 265739
16080 265739 105773 23682 240739 -246574 -97684 105706 341047 178092 -223655 196751
16069 118226 123737 101976 72363 57603 23818 -104564 -61040 151368 -36678 -83210 56466
16057 198519 -57437 103838 6588 -32477 -322017 423 220992 114393 -137610 22909 -76424
16045 -49469 -190102 33108 -252355 136167 -15622 -88235 -101177 26312 292424 -7539 -117295
16034 -117295 -178874 132633 242458 335783 81572 439326 113513 253995 119173 -100693
$$ packed form
16115F1214a14508B34365M4254a1773j8363A12616a9336n7919A84784A5053a31
16103E13085A85636H2592K63376A9771a14212B34592P9161D0962Q0313o313i9429
16091A07303J0280b2758A33836j3737C7254L00000n3361a60410A88120Q7824j0205
16080B65739A05773B3682K17057b46574i7684A05706K35341j62955b23655A96751
16069A18226N511k1761k9613j4760B3818a04564M3524A51368c6678m6532E6466
16057A98519e7437A03838F588c2477k89540D23K20569j06599a37610B2909g6424
16045d9469j40633C3108b52355A36167a5622p2613j2942B6312K66112g539j09756
16034a17295o1579A32633J09825R3325H1572L57754A13513J40482A19173a00693
$$ plain form
16023 108758 4386 410488 -64530 12933 151698 185652 57219 -152766 11715 -212493 -233387
16012 -233387 -33447 69142 146414 -239958 423950 -112474 69740 -70753 -26323 -21225 29676
16000 -18676 -67669 117402 241058 156632 -46402 77637 -206395 52924 123675 80694 135966
15989 135966 393260 75083 520019 733827 907276 1116988 1028255 792417 729769 346526
15978 556480 224781 97155 -25523 -17690 -2868 41957 -141898 131867 -83248 188731 -271775
15966 -132668 -42127 38933 -129018 200802 46981 -195031 -139637 -43990 36710 230789 -26397
15954 -16435 -4134 -61140 64730 174614 -317850 -264853 -191092 -37582 -177008 179759 -8998
15942 7555 -148480 -19235 -169515 -69482 -63237 11854 251233 337749 133903 313447 -29932
$$ packed form
16023A08758D386M06102f4530A2933J38765L3954E7219a52766A1715b12493k0894
16012b33387c3447F9142P7272b39958D23950a12474F9740g0753b6323N098B9676
16000a8676m8993A17402J23656q4426d6402G7637b06395E2924P0751m2981N5272
15989A35966K57294G5083M44936K13808J73449K09712q8733k35838o2648C46526
15978E56480B24781I7155b5523P833b868D1957a41898A31867h3248A88731b71775
15966a32668d2127C8933a29018B00802D6981a95031N5394d3990C6710J94079b6397
15954a6435d134n7006F4730J09884c17850N2997P3761c7582j39426A79759h998
15942G555a48480a9235j50280f9482O245A1854K39379Q6516A33903J79544b9932
$$ plain form
15930 -64471 31721 -173747 90168 19314 -52128 133008 -10169 -84731 -320459 179074 -329957
15918 611614 -146000 -80886 -150651 265831 -371415 -127835 -17709 -57820 199077 76411
15907 -149671 -173758 -212967 76301 36725 -228983 -218878 -32916 104830 -180661 -283816 137452
15895 215839 250415 -187504 76210 -207479 -3641 62418 -91271 20002 -94564 -114781 -94178
15884 -94178 -205160 -9328 84226 131613 77982 123141 160654 185890 109042 2313 -3534 -109415
15872 -109415 -255910 148921 -138079 -139061 -71732 -40495 -380666 -147916 -88940 91437 223638
15861 223638 205443 -182753 50268 105777 75288 49215 -156325 227122 -344677 -20465 -73925
15850 -73925 -137655 -397300 118284 -352146 -386263 -255296 76994 91331 224453 -33365 -147192
$$ packed form
15930f4471C1721a73747I0168A9314e2128A33008a0169p4562k35728A79074c29957
15918F11614a46000O5114o9765B65831c71415a27835a7709m0111A99077G6411
15907a49671k4087l9209G6301C6725b28983J0105c2916A04830a80661j03155A37452
15895B15839L4576a87504G6210b07479c641F2418i1271B0002i4564k0217K0603
15884i4178j10982i328H4226M7387n3631M5159L7513K5236p6848B313c534j05881
15872a09415j46495A48921a38079r82O7329L1237l40171a47916N8976I1437J32201
15861B23638j8195a82753E0268N5509l0489k6073a56325B27122c44677b0465n3460
15850g3925o3730k59645A18284c52146l4117J30967G6994J4337J33122c3365j13827
$$ plain form
15839 -147192 122441 -319335 -169235 -307018 212811 -231598 -80042 -100368 -115572 -266381
15829 -266381 163405 -56088 -74316 109406 114762 -20123 68748 -25699 -79024 185042 -89211
15817 55021 66304 176187 117676 57055 23575 81436 -15573 73192 -289424 50445 -178919
15805 -44106 58075 111915 30560 -98007 34423 -6537 298047 28153 155084 214456 -70814
15793 115726 -120873 -113674 89183 71246 84610 -125562 -16603 32353 47528 209398 -92755
15781 -410385 143131 128605 6729 -101511 -72006 -75245 -106741 125090 12992 86811 42639
15769 -356693 -56227 -186116 -50889 -180579 -134054 100155 409797 53796 -122764 171043
15758 411081 -85033 -189048 288194 193971 -185520 -115206 34447 25971 -23635 164953 -131829
$$ packed form
15839a47192A22441c19335J50100j37783B12811b31598h0042k0326j5204j50809
15829b66381A63405e6088j8228A09406N356b0123F8748b5699n3325A85042h9211
15817E5021J1283J09883n8511E7055B3575N7861a5573G3192b89424E0445a78919
15805d4106E8075N3840C0560i8007C4423f537B98047B8153J26931N9372g0814
15793A15726a20873P199H9183j7937J3364a25562a6603C2353J5175J61870i2755
15781d10385A43131j4526F729a01511K9505l239l1496A25090A2992P3819D2639
15769c56693e6227j29889e0889j29690M6525A00155L09642E3796a22764A71043
15758D11081h5033j04015B88194r4223a85520P0314C4447q476b3635A64953a31829
$$ plain form
15746 -277146 -25820 187206 325445 -148381 136287 27623 135250 -97834 -5027 -149429
15736 -149429 38664 -85064 161271 161935 -292890 -40135 -299580 128304 -42527 -59212 15814
15724 -53884 129009 -321732 -43966 44294 -38319 -46001 -159970 46855 -369303 -51778 -123487
15713 -123487 57724 -57961 88595 106261 26235 -59482 67376 -98987 -360227 189676 -21560
15701 -321340 -200965 -281906 -109009 -86730 -254605 221501 -17473 51957 -142058 13728
15690 54445 221286 350694 -39036 -10855 22868 -12915 -150184 -203410 -28277 179840 -228336
15678 1762 -80161 -188354 10414 -96007 -41810 -278685 311788 243114 433328 -13654 44048
15666 310977 -32086 -68937 -208509 82392 -73695 130144 306436 -222742 96062 -137512
$$ packed form
15746b77146b5820A87206J38239a48381A36287B7623J07627i7834e027j44402
15736a49429C8664h5064A61271O64b92890d0135k59445A28304d2527j6685A5814
15724e3884A29009c21732d3966D4294c8319p682j13969D6855c69303e1778p1709
15713a23487E7724e7961H8595J7666B6235e9482F7376i8987k61240A89676b1560
15701c21340J20375q0941a09009K2279j67875B21501a7473E1957a42058A3728
15690E4445J66841J29408c9036a0855B2868a2915j37269n3226b8277A79840b28336
15678A762h0161j08193A0414i6007d1810k36875C11788o8674J90214a3654D4048
15666C10977c2086l6851j39572H2392g3695A30144J76292b22742I6062a37512
$$ plain form
15655 -158994 103321 -449858 -193923 -238002 -21248 -200205 -25060 139095 -241371 9604
15644 180827 -235543 -108337 -118550 -85112 -371480 -158476 -246611 -156923 129092 -89346
15633 89143 -205912 -124886 122438 103788 -121316 284624 44914 -247127 -220025 352647
15622 -52537 23203 75922 -189652 -82012 346871 -19994 72922 152424 24899 -165435 -152751
15611 -152751 -46506 167157 -469471 -215812 -124451 -88817 -30728 -83370 312628 264076 -148607
15599 185996 125666 54331 245408 218126 -314590 -13315 -169383 -291049 42251 -6984 -11021
15588 -11021 -419445 295259 -73201 -231655 106232 -282460 -984 -256245 -118599 -248778
15578 -248778 -10511 -10781 -76463 -121989 -30290 -37328 -94283 48535 -349916 -167743 11538 119522
$$ packed form
15655a58994A03321d49858a93923m4079b1248j78957b5060A39095b41371I604
15644A80827b35543a08337j0213L3438k86368a58476q8135Q9688A29092h9346
15633H9143b05912Q1026A22438j8650a21316B84624D4914b47127K7102C52647
15622e2537B3203N2719a89652h2012C46871a9994G2922P9502B4899a65435J2684
15611a52751d6506A67157d69471b15812R1361L5634c0728n2642C12628m8552a48607
15599A85996o0330E4331J91077k7282c14590a3315j56068j21666D2251f984m037
15588a1021m08424B95259g3201j58454A06232b82460i84k55261a18599j30179
15578b48778a0511k70o5682m5526c0290p038n6955D8535c49916a67743A1538J07984
$$ plain form
15566 119522 -21387 -145165 79795 -36105 -49016 9956 404458 -230374 17750 44961 -210563
15554 -69425 186137 192479 -54304 71452 220903 -35368 70229 -36074 80540 -393 163117 -39904
15541 -80906 -82014 61373 33226 222934 306445 31832 -147840 -516 13352 19205 207801 72013
15528 119867 -314578 -128968 -62840 82972 433243 320355 266538 180767 -91580 471726
15517 184268 198536 83446 173696 223296 75560 339281 -213899 119064 -69616 -35246 290863
15505 84189 269777 274375 -15420 117481 293879 142890 285050 -169181 310509 85918
15494 338084 -178150 54086 3569 87585 124760 -33364 -1779 -162412 59396 -358892 -321600
15483 -321600 -103603 51242 -68089 -58231 52871 132786 -98767 424901 285024 150605 407080
$$ packed form
15566A19522b1387j23778G9795c6105j2911I956L94502b30374A7750K7211b10563
15554f9425A86137O342e4304G1452J49451c5368G0229c6074H0540c93A63117c9904
15541h0906j108F1373k8147J89708Q3511C1832a47840e16A3352N853J88596G2013
15528A19867c14578a28968f2840H2972L50271j12888n3817q5771i1580D71726
15517A84268J4268H3446R0250M9600G5560K63721b13899A19064f9616L4370B90863
15505H4189J85588M598a5420A17481J76398A42890J42160a69181C10509H5918
15494C38084a78150E4086C569Q4016L7175c3364a779j60633E9396c58892L7292
15483c21600a03603E1242f8089R858E2871P9915i8767D24901j39877j34419K56475
$$ plain form
15472 407080 619187 492236 441017 82209 -214848 -12290 5234 408741 164935 400202
15462 400202 -59977 256764 -96875 1476 73948 -206438 45980 -150534 100516 -60199 56684
15450 48950 6449 -111950 63146 176890 153904 142171 -22967 324000 375147 399040 662172
15439 662172 1199096 862399 659094 93686 209381 66124 53739 160675 282819 256938
15429 256938 373896 165269 31430 -171031 -114333 -173872 136842 202508 -80823 180306
15418 66353 226236 143907 -1607 24861 -42901 224363 78048 432405 -143474 -243003 108889
15406 -213363 -117245 -78964 -197605 -67388 -9815 -54813 16691 91275 -268678 -85335 -170766
15395 -170766 18543 -193699 -157933 -255457 -308643 191072 131883 -2718 285176 39507 23267
$$ packed form
15472D07080K12107j26951n1219H2209b14848a2290E234M03507A64935K35267
15462D00202e9977B56764i6875A476P2472b06438D5980a50534A00516f0199E6684
15450D8950F449a11950F3146J13744k2986j1733b2967C24000N1147K3893K63132
15439F62172N36924l36697k03305I3686J15695F6124j2385J06936J22144k5881
15429B56938J16958A65269C1430a71031N6698n9539A36842O5666h0823A80306
15418F6353J59883q2329a607B4861d2901B24363G8048L54357a43474r9529A08889
15406b13363R6118L8281j18641f7388i815m4998A6691P4584b68678h5335q5431
15395a70766A8543a93699L5766r7524n3186A91072n9189b718B85176C9507j6240
$$ plain form
15384 23267 140863 241245 -12961 -37068 -42506 389069 -166084 138474 -19820 236159 43318
15372 275245 500723 -103702 -383447 -122010 -73689 -74453 124475 307143 334253 -61462 153236
15360 -28812 -44513 347377 66545 -417872 48952 117332 -62879 -253467 44673 44387 26461
15349 26461 181004 -134991 191759 49479 202740 110335 164331 102443 126874 235379 38284
15337 247852 194092 -105112 47852 53880 228238 190998 287881 197146 194481 64811 -55227
15325 249163 61953 367758 92876 329874 157080 237684 -64493 -107481 -10821 224106 362351
15314 362351 -218818 28759 198932 145892 385069 118137 189567 -67783 -44843 71748 17500
15302 167194 152303 -338917 -72632 102710 206029 -148739 152315 -41669 396477 -224532
$$ packed form
15384B3267J17596J00382a2961k4107n438C89069a66084A38474a9820B36159D3318
15372B75245K25478a03702k79745a22010M8321p64A24475J82668K7110f1462A53236
15360b8812j5701C47377F6545d17872D8952O8380f2879j90588D4673k86j7926
15349B6461J54543a34991A91759D9479J53261r2405N3996o1888K4431J08505C8284
15337B47852n3760a05112D7852O028J74358l7240R6883r0735k665F4811e5227
15325B49163F1953L05805I2876K36998A57080Q0604f4493m2988a0821B24106J38245
15314C62351b18818B8759J70173n3040K39177A18137P1430f7783K2940G1748A7500
15302A67194j4891c38917g2632A02710J03319a48739A52315d1669C96477b24532
$$ plain form
15291 -72533 -248502 194121 128574 -139346 -88395 38096 -70898 -145791 -166691 -85190 91100
15279 -70731 381925 96911 -198581 -184869 321311 -166637 506 -59565 194124 127327 -34364
15267 287024 120118 -192084 358214 12803 -235518 -252673 127459 -72987 -17830 -5588 150502
15255 -312057 193940 -71613 -81672 102399 98717 242005 86269 -184068 227372 230153 474053
15244 474053 894789 1857620 1513345 1742580 1810785 708393 251776 -31672 108033 -98442
15233 34324 30238 94235 44896 7591 49533 -20267 38030 -275317 281873 -41947 62214 424304
15221 424304 46179 15233 -44174 -397893 119051 -109774 -98076 144090 166313 131911 -152210
15209 139373 -141812 318650 179864 -214568 6098 184387 189673 63016 -59742 223129 -214319
$$ packed form
15291g2533j75969A94121o5547a39346N0951C8096g0898p4893k0900Q1501I1100
15279g0731C81925I6911a98581J3712C21311a66637E06e9565A94124o6797c4364
15267B87024A20118a92084C58214A2803b35518j7155A27459g2987a7830e588A50502
15255c12057A93940g1613j0059A02399l682J43288H6269a84068B27372K781K43900
15244D74053M20736R62831l44275K29235O8205G08393B51776c1672A08033i8442
15233C4324m086O3997D4896G591M1942b0267C8030b75317B81873d1947F2214L62090
15221D24304D6179A5233d4174l53719A19051a09774J1698A44090K2223l4402a52210
15209A39373a41812C18650j38786b14568F098J78289N286F3016e9742B23129b14319
$$ plain form
15197 -84861 325233 194317 179681 132464 -167596 -68403 -117618 23578 383656 144360 399486
15186 399486 222921 -95505 69810 -36842 420750 74592 102744 176304 -96609 126770 -68653
15174 226476 -27169 290204 47509 -62454 87603 -88556 270282 165984 -138828 282253
15163 42279 -70338 199760 293276 -100737 -48730 -172664 347856 334106 206616 -54359 48251
15151 136206 78789 60985 225192 324263 28575 252205 41629 295715 145381 22463 179352
15140 179352 219690 250955 -10906 -142690 150010 424689 107057 293825 58212 47739
15130 47739 85104 149118 453820 -46879 41858 138400 4064 234604 252649 311208 182251
15119 182251 239844 162405 822025 528835 66517 105981 62107 155949 72837 -4972 176549
$$ packed form
15197h4861C25233j30916j4636m7217a67596f8403m9215B3578L60078A44360K55126
15186C99486j76565i5505F9810c6842D20750G4592K8152P3560i6609A26770f8653
15174B26476b7169B90204D7509f2454H7603h8556B70282j04298a38828B82253
15163D2279g0338A99760R3516a00737d8730j23934C47856j3750j27490e4359D8251
15151A36206n7417j7804J64207R9071B8575K23630D1629K54086A45381B2463J56889
15140A79352M0338L1265a0906j31784A50010K74679A07057J86768E8212j0473
15130D7739L7365O4014L04702d6879D1858R6542D064K30540J8045N8559j28957
15119A82251N7593p7439O59620k93190F6517L9464m3874R3842G2837d972A76549
$$ plain form
15107 -288537 -43157 198233 67907 -283350 22698 12918 229833 77392 268507 61232 17094
15095 439874 -135385 170874 -1183 78187 -82413 -84105 30560 394245 131582 25112 67623
15084 67623 551496 -208005 105558 -65279 294075 230292 95326 -127723 285154 -58725
15073 71196 193032 2806 -148106 376985 -84296 147091 186011 89122 34116 276218 311147
15062 311147 245483 252326 -17596 216988 506456 278323 100627 570768 352447 154838
15051 250082 77166 234015 152417 103239 325273 9451 256514 17052 217952 -2295 -33412
15040 -33412 536537 45556 80368 200225 39200 534497 177208 269340 431569 422958 466270
15029 466270 545636 448079 533793 619466 383308 330909 466972 429206 320076 236634 369650
$$ packed form
15107b88537d3157A98233F7907b83350B2698r780K16915G7392J91115F1232A7094
15095D39874a35385A70874a183G8187h2413j692C0560L63685A31582B5112M2511
15084F7623M83873b08005A05558f5279B94075o3783I5326a27723B85154e8725
15073G1196J21836B806a48106C76985h4296A47091L8920H9122C4116K42102L4929
15062C11147o5664O843a7596B16988K89468k28133A00627M70141k18321A54838
15051B50082G7166J56849q1598m9178K22034I451K47063A7052K00900b295l1117
15040c3412E36537D5556L4812J19857C9200M95297A77208R2132J62229q611M3312
15029D66270P9366r7557Q5714Q5673k36158n2399J36063l7766j09130q3442J33016
$$ plain form
15018 369650 321052 394312 820064 572724 261043 566621 395060 306109 301319 250010 428558
15007 428558 340684 565726 206204 388080 668742 333578 362982 62404 702734 364776
14997 364776 984192 393430 290045 135762 507028 137844 53980 331428 435526 864914
14987 864914 281737 555869 137076 227751 587986 607192 483592 738728 886599 685038
14977 685038 555540 351867 195937 696188 371509 190111 308436 690440 338050 628268
14967 628268 355649 495573 285887 391669 400366 342816 593536 285106 193948 212088
14957 212088 -8296 422785 433227 47281 334460 436546 117923 130238 457479 448991 368299
14946 368299 273554 353216 347840 620500 307501 532882 639416 702279 651325 939376 465955
$$ packed form
15018C69650m8598P3260M25752k47340B61043L05578j71561q8951m790n1309J78548
15007D28558q7874K25042B06204J81876K80662C33578K9404F2404O40330l37958
14997C64776O19416C93430j03385A35762L71266A37844E3980K77448J04098M29388
14987H64914B81737K74132A37076R0675L60235J9206j23600K55136J47871k01561
14977F85038j29498k03673j55930N00251l24679j81398J18325L82004C38050K90218
14967F28268k72619J39924k09686J05782Q697n7550K50720B85106r1158J8140
14957B12088h296D22785J0442D7281K87179J02086A17923J2315L27241q488q0692
14946C68299r4745P9662n376K72660C07501K25381J06534O2863n0954K88051D65955
$$ plain form
14934 421295 256091 527092 395880 380646 555711 1017288 770835 925396 1094818 1457080
14924 1457080 1661540 1267310 1471836 1453671 1075174 1141137 1108596 1344109 1757581 1499214
14914 1499214 1789095 1299310 925744 1042486 788508 832145 423803 967293 659043 346134
14904 346134 450698 639577 721780 657882 399804 356037 193527 370416 420572 217756
14894 217756 431387 403576 251002 420889 345380 476478 437044 538811 546761 404096
14884 404096 545255 579102 747561 603184 824461 566448 674618 540230 682303 526888
14874 526888 730401 164116 718071 677552 294603 373330 254691 474619 482446 751391
14864 751391 556984 763777 556986 797055 817932 606778 686152 424413 493324 646883
$$ packed form
14934D21295j65204K71001j31212j5234J75065M61577k46453J54561J69422L62262
14924A457080K04460l94230K04526j8165l78497O5963l2541K35513M13472k58367
14914A499214K89881m89785l73566J16742k53978M3637m08342N43490l08250l12909
14904C46134J04564J88879Q2203o3898k58078m3767j62510J76889N0156k02816
14894B17756K13631k7811j52574J69887p5509J31098l9434J01767P950j42665
14884D04096J41159L3847J68459j44377K21277k58013J08170j34388J42073j55415
14874E26888K03513A64116N53955m0519B94603P8727j18639K19928P827K68945
14864G51391j94407K06793k06791K40069K0877k11154P9374k61739O8911J53559
$$ plain form
14854 646883 297661 321322 367482 642943 209769 536124 264937 751280 372329 493808
14844 493808 485812 500131 813454 560625 935210 846366 1234388 1341221 1001037 908379
14834 908379 963720 746313 935168 1203025 603864 893672 607593 712469 437205 405322
14824 405322 881611 354060 689854 639806 625850 483653 639274 574049 851558 408679
14813 516073 548551 588789 474295 416712 822326 756215 473886 541180 612218 551145 570858
14802 570858 939355 974037 876604 585849 725785 455746 618650 472255 354134 450101
14792 450101 343078 782354 910927 527657 431668 613662 514047 417928 463587 927727
14782 927727 454408 582367 602120 780495 700619 186582 546362 749758 668736 1116549
$$ packed form
14854F46883B97661K3661M6160K75461B09769L26355B64937M86343C72329J21479
14844D93808p996J4319L13323k52829L74585q8844L88022J06833l40184r2658
14834I08379N5341k17407J88855K67857n99161K89808k86079J04876k75264l1883
14824D05322M76289C54060L35794n0048j3956j42197J55621o5225K77509D08679
14813E16073L2478M0238j14494n7583M05614o6111k82329O7294P1038o1073J9713
14802E70858L68497L4682r7433k90755J39936k70039J62904j46395j18121R5967
14792D50101j07023M39276J28573l83270r5989J81994r9615r6119M5659M64140
14782I27727D54408J27959J9753J78375p9876A86582L59780K03396q1022M47813
$$ plain form
14772 1116549 871051 823157 671361 963981 700403 397696 632669 660770 890395 745940
14762 745940 488188 583608 407556 582377 509740 653767 700162 808500 456061 692864
14752 692864 714682 852027 581185 695276 799050 719673 544076 595911 466126 461706
14742 461706 493171 576183 400704 911318 781893 843346 799152 652259 927379 826235
14732 826235 841871 1008002 930433 778358 934044 1011839 1138897 1087911 1616279 1530725
14722 1530725 1409655 1452258 1351917 1069886 514681 579497 620184 821147 886292 781772
14712 781772 1006055 1127634 779130 1134455 992888 1033372 1102441 947238 1217149 973516
14702 973516 1233949 845891 1266590 1573104 1664212 1905721 1443260 1433035 1180693 1362801
$$ packed form
14772A116549k45498m7894j51796K92620k63578l02707K34973K8101K29625j44455
14762G45940k57752R5420j76052J74821p2637J44027M6395J08338l52439K36803
14752F92864K1818J37345k70842J14091J03774p9377j75597N1835j29785m420
14742D61706L1465Q3012j75479N10614j29425O1453m4194j46893K75120j01144
14732H26235J5636J66131p7569j52075J55686P7795J27058n0986N28368q5554
14722A530725j21070M2603j00341k82031E14681O4816M0687K00963O5145j04520
14712G81772K24283J21579l48504L55325j41567M0484O9069j55203K69911k43633
14702I73516K60433l88058M20699L06514R1108K41509m62461j0225k52342J82108
$$ plain form
14692 1362801 1100221 829391 786290 840203 774809 1080782 836612 1327260 913234 872608
14682 872608 935927 849672 1168471 1045425 751541 782358 844709 1008563 922444 521811
14672 521811 1227335 916299 1265455 898982 1120507 999922 1147717 1037130 697349 906019
14662 906019 965424 914966 1201240 963516 1363189 1034230 1356957 1090851 978029 771917
14652 771917 1091385 1390994 1609510 1524877 1416186 1320074 1294008 1502374 1201230 1262027
14642 1262027 1471148 1125019 1333121 1417303 1241631 1061665 946791 1530446 884714 1285938
14632 1285938 1479247 1357411 1595514 1280167 1491478 1431250 1124845 1249217 1563152 1405519
14622 1405519 1356458 1347175 1552313 1802893 994065 1412419 996311 1067673 1673225 1334780
$$ packed form
14692A362801k62580k70830m3101N3913o5394L05973k44170M90648m14026m0626
14682H72608O3319q6255L18799j23046k93884L0817O2351J63854q6119m00633
14672E21811P05524l11036L49156l66473K21525j20585J47795j10587l39781K08670
14662I06019N9405n0458K86274k37724L99673l28959L22727k66106j12822k06112
14652G71917L19468K99609K18516q4633j08691r6112k6066K08366l01144O0797
14642A262027K09121l46129K08102Q4182j75672j79966j14874N83655o45732M01224
14632A285938J93309j21836K38103l15347K11311o0228l06405J24372L13935j57633
14622A405519m9061r283K05138K50580q08828M18354m16108P1362O05552l38445
$$ plain form
14612 1334780 1647685 1427523 1273743 1364909 1698866 1424016 1743051 1609276 1777076 1425312
14602 1425312 1364166 1795789 1607016 1721880 1519383 1644820 1479321 1617409 1646162 1760222
14592 1760222 1861420 1884814 1734770 1945022 1698299 1581703 1915091 1794238 1926815 1944685
14582 1944685 1980739 1672525 2042545 1833223 1868533 2461255 2367403 2270048 2231951 2244571
14572 2244571 2064089 1983467 2345487 2535604 2525640 2425367 2404818 2364658 2717820 2398562
14562 2398562 2482078 2761241 2498004 2801441 3033306 3004088 3138672 3376721 3550278 3486022
14552 3486022 3736005 4423053 5360012 7130483 11220913 21217431 38452075 45692332
14544 45692332 21271669 9750435 5090730 3962883 4660342 5778074 3882604 2854747
$$ packed form
14612A334780L12905k20162j53780R1166L33957k74850L19035j33775J67800l51764
14602A425312o1146M31623j88773J14864k02497J25437j65499J38088K8753J14060
14592A760222J01198K3394j50044K10252k46723j16596L33388j20853J32577J7870
14582A944685L6054l08214L70020k09322L5310N92722r3852r7355l8097J2620
14572B244571j80482q0622L62020J90117r964j00273k0549m0160L53162l19258
14562B398562Q3516K79163k63237L03437K31865k9218J34584K38049J73557o4256
14552C486022K49983O87048R36959J770471M090430R996518J7234644P240257
14544D5692332B1271669I750435m659705j127847O97459J117732j895470j027857
$$ plain form
14536 2854747 2001426 2215597 1818383 2301903 2151956 2262483 2119121 2329062 2196548
14527 2196548 2286573 2287184 2243739 2080810 2201967 2655034 2503596 2616210 2481564 2392373
14517 2392373 2563563 2259299 2557474 2563988 2700350 2703995 2708759 2826897 3008550 2749278
14507 2749278 3131832 3103279 3337310 3147843 3109023 3005580 3392338 3339010 3192319 3104129
14497 3104129 3116755 3080896 3412943 3298385 3171080 3270461 3532066 3365023 3557264 3682194
14487 3682194 3775062 3856127 3864700 3587926 3812087 3828370 3855268 4123432 3933968 4344942
14477 4344942 4194199 3898067 4222586 3962164 4209277 3969497 4218116 4242168 4502129 4496790
14467 4496790 4371113 4619781 4421692 5022001 4589581 4828520 4852392 4990471 4695551 4865793
$$ packed form
14536B854747q53321K14171l97214M83520j49947J10527j43362K09941j32514
14527B196548R0025O11m3445j62929J21157M53067j51438J12614j34646q9191
14517B392373J71190l04264K98175O514J36362L645M764J18138J81653k59272
14507B749278L82554k8553K34031j89467l8820j03443L86758n3328j46691q8190
14497C104129J2626l5859L32047j14558j27305R9381K61605j67043J92241J24930
14487C682194R2868Q1065Q573k76774K24161J6283K6898K68164j89464M10974
14477D344942j50743k96132L24519k60422K47113k39780K48619K4052K59961n339
14467D496790j25677K48668j98089O00309m32420K38939K3872J38079k94920J70242
$$ plain form
14457 4865793 5308613 4874837 4830472 5076163 5135045 5104852 5478249 5600499 5617583 5866296
14447 5866296 5449286 5457250 5779642 6121495 6117139 5988962 6309924 6014123 5977195 6329909
14437 6329909 6314514 7034577 6616150 6755754 6611362 6771837 6987167 7033872 7206713 7598480
14427 7598480 7221167 7631171 7615493 7465525 7434029 7718732 8023452 8144030 8350467 8604232
14417 8604232 8762042 9181787 9080472 9143769 9091643 9249980 8792187 9033060 9553636 9770806
14407 9770806 10248576 9736128 10031696 9986127 10824773 10659775 10831509 10994086 10931902 11219754
14397 11219754 11411796 11281979 11701506 11811815 12028864 11995833 12347363 12954529 12743674
14388 12743674 13007396 13300142 13503466 13992151 14120269 14674762 14348816 14863082 15026947
$$ packed form
14457D865793M42820m33776m4365K45691N8882l0193L73397J22250J7084K48713
14447E866296m17010P964L22392L41853m356j28177L20962k95801l6928L52714
14437F329909j5395P20063m18427J39604j44392J60475K15330M6705J72841L91767
14427G598480l77313M10004j5678j49968l1496K84703L04720J20578K06437K53765
14417H604232J57810M19745j01315O3297n2126J58337m57793K40873N20576K17170
14407I770806M77770n12448K95568m5569Q38646j64998J71734J62577o2184K87852
14397A1219754J92042j29817M19527J10309K17049l3031L51530O07166k10855
14388A2743674K63722K92746K03324M88685J28118N54493l25946N14266J63865
$$ plain form
14379 15026947 15560701 16136805 16134707 16627669 16525258 17137524 17304915 17597360 17715495 18241578
14369 18241578 18879370 19026733 19536110 20104324 20329064 20827256 21002954 22202618 22301593
14360 22301593 22430474 23016237 23708598 24094370 24469154 25203875 25726169 26412150 26699937
14351 26699937 27700285 28398712 28921775 29322541 30838785 31284971 32131768 32576033 33827174
14342 33827174 34596641 35487361 36270707 37241114 38725060 39329914 40566018 41724601 42822134
14333 42822134 44228177 45753225 46932218 48538773 50086867 51832766 53251691 55263985
14325 55263985 56769217 58958735 60775842 62486857 65180471 67694616 69872074 72727987
14317 72727987 75145034 77929203 80978992 84091815 86995247 90783223 94784929 98643806
$$ packed form
14379A5026947N33754N76104k098M92962j02411O12266J67391K92445J18135N26083
14369A8241578O37792J47363N09377N68214K24740M98192J75698J199664R8975
14360B2301593J28881N85763O92361L85772L74784P34721N22294O85981K87787
14351B6699937J000348O98427N23063M00766J516244M46186Q46797M44265J251141
14342C3827174P69467Q90720P83346R70407J483946O04854J236104J158583J097533
14333D2822134J406043J525048J178993J606555J548094J745899J418925K012294
14325E5263985J505232K189518J817107J711015K693614K514145K177458K855913
14317G2727987K417047K784169L049789L112823K903432L787976M001706L858877
$$ plain form
14309 98643806 102798995 107194151 111905926 116809780 122301729 127927029 133602417 139982205
14301 139982205 146546209 153418230 160954719 168983919 177432751 186281917 195665753 205815650
14293 205815650 216061883 227327043 239113664 251371458 264440740 277741838 291892068
14286 291892068 306366164 321023697 336380779 352010678 367499356 382865831 398078224
14279 398078224 413009464 426859471 440415918 452204011 462444760 470792488 476702316
14272 476702316 478470679 475231852 472075524 471626465 467090779 461276357 453666805 444461927
14264 444461927 433489768 421592852 407483447 392143342 376199568 360336284 344100985
14257 344100985 327997289 312671520 297375731 282461352 268735118 254857412 242045106
$$ packed form
14309I8643806M155189M395156M711775M903854N491949N625300N675388O379788
14301A39982205O564004O872021P536489Q029200Q448832Q849166R383836J0149897
14293B05815650J0246233J1265160J1786621J2257794J3069282J3301098J4150230
14286B91892068J4474096J4657533J5357082J5629899J5488678J5366475J5212393
14279C98078224J4931240J3850007J3556447J1788093J0240749Q347728N909828
14272D76702316J768363l238827l156328m49059m535686n814422p609552r204878
14264D44461927j0972159j1896916j4109405j5340105j5943774j5863284j6235299
14257C44100985j6103696j5325769j5295789j4914379j3726234j3877706j2812306
$$ plain form
14250 242045106 230561541 220103131 208888952 198173599 188581829 179707015 171606487
14243 171606487 163175295 155570195 148407534 141619167 135117975 129875331 124138914 118548449
14235 118548449 113527224 108957053 104704350 100080010 96756388 92857930 88952660 85771211
14227 85771211 82300502 79105730 76427369 73884365 71001886 68287828 65915311 63802372
14219 63802372 62040581 59715125 57804649 55773290 54048282 52644792 50849725 49158143
14211 49158143 47886534 46181521 45052590 43945718 43015957 41964718 40572480 39142612
14203 39142612 38085241 37079725 36355140 35614536 34374230 33378189 32330087 31470232 30616936
14194 30616936 30303957 29759209 28696373 27836118 27285554 26516663 25819536 25571051 24257022
$$ packed form
14250B42045106j1483565j0458410j1214179j0715353r591770q874814q100528
14243A71606487q431192p605100p162661o788367o501192n242644n736417n590465
14235A18548449n021225m570171m252703m624340l323622l898458l905270l181449
14227H5771211l470709l194772k678361k543004k882479k714058k372517k112939
14219F3802372j761791k325456j910476k031359j725008j403490j795067j691582
14211D9158143j271609j705013j128931j106872r29761j051239j392238j429868
14203C9142612j057371j005516p24585p40604j240306r96041j048102q59855q53296
14194C0616936l12979n44748j062836q60255n50564p68891o97127k48485j314029
$$ plain form
14185 24257022 24163434 23795284 23150012 22528932 22139555 21868053 21232893 20670181 20418812
14176 20418812 19915424 19465599 19266384 19032014 18401873 17815679 17691916 17461743 17016767
14167 17016767 16379124 16634907 15994182 15853548 15548333 14904579 15037464 14682350 14534614
14158 14534614 14273602 13991884 13685595 13346546 13497852 13361588 12991473 12878398 12565686
14149 12565686 12385043 11946638 11895859 11517740 11545238 11244693 11365608 11134063 11130710 10757260
14139 10757260 10804706 10571347 10041502 10060967 10028769 9786920 9679119 9537653 9500450 9547586
14129 9547586 9368223 9127017 8973689 8702043 8665286 8112330 8435433 8172224 8235425 8180679
14119 8180679 8098046 7777640 7595758 7622306 7864290 7726116 7230402 7287110 7066801 7354646
$$ packed form
14185B4257022r3588l68150o45272o21080l89377k71502o35160n62712k51369
14176B0418812n03388m49825j99215k34370o30141n86194j23763k30173m44976
14167A7016767o37643K55783o40725j40634l05215o43754J32885l55114j47736
14158A4534614k61012k81718l06289l39049J51306j36264l70115j13075l12712
14149A2565686j80643m38405n0779l78119K7498l00545J20915k31545l353l73450
14139A0757260M7446k33359n29845J9465l2198k41849j07801j41466l7203M7136
14129I547586j79363k41206j53328k71646l6757n52956L23103k63209O3201n4746
14119H180679q2633l20406j81882K6548K41984j38174m95714N6708k20309K87845
$$ plain form
14109 7354646 6910288 6928656 7191432 6647209 6551499 6317952 6454276 6082700 6782924 6113341
14099 6113341 6128719 6177416 6360979 6055165 6274489 6268112 5960190 5790581 5802032 5671002
14089 5671002 5479363 5204140 5540734 5401927 5209805 5261565 5087778 5235202 4996623 5062877
14079 5062877 5208249 4759472 4928832 4931120 4952995 4827328 4410569 4710696 4497297 4769800
14069 4769800 4197261 4473227 4350633 4515865 4582936 3955765 3997373 4216998 4111869 4049051
14059 4049051 4015698 3786793 3594350 4052848 4203838 3581419 3736457 3795001 3745499 3497375
14049 3497375 3503062 3734345 3608313 3492202 3340078 3467671 3524313 3423188 3328947 3141045
14039 3141045 3246555 3380878 3649902 3517634 2946632 3356570 3125365 3154055 2996863 3616698
$$ packed form
14109G354646m44358J8368K62776n44223r5710k33547J36324l71576P00224o69583
14099F113341J5378M8697J83563l05814K19324o377l07922j69609J1451j31030
14089E671002j91639k75223L36594j38807j92122N1760j73787J47424k38579O6254
14079E062877J45372m48777J69360K288K1875j25667m16759L00127k13399K72503
14069D769800n72539K75966j22594J65232O7071o27171M1608K19625j05129o2818
14059D049051l3353k28905j92443M58498J50990o22419J55038N8544m9502k48124
14049C497375N687K31283j26032j16111j52124J27593N6642j01125r4241j87902
14039C141045J05510J34323K69024j32268n71002M09938k31205K8690j57192O19835
$$ plain form
14029 3616698 3557244 2886071 3133849 3093126 2867254 2800979 2701212 2865083 2725992 2728213
14019 2728213 2598465 2480629 2979436 2800331 2680855 2451745 2408849 2676336 2494422 2184741
14009 2184741 2590115 2354571 2460588 2393164 2567448 2354893 2159366 2254493 2047890 2286014
13999 2286014 2220101 2001560 2007314 2101827 2131225 2247663 2241288 1962122 2632099 2842254 3302793
13988 3302793 5877034 13294274 30524257 47262790 28679758 14876818 9078292 6860074
13980 6860074 5331867 4320884 3999811 3351100 2949551 3265721 2888949 2549652 2954769
13971 2954769 2686033 2972330 2617039 2647394 2228694 2428260 2578797 1982573 2241816 2000372
13961 2000372 2455069 2594051 2013102 1900171 2207094 2091619 2256529 2358766 2270809 2245855
$$ packed form
14029C616698n9454o71173K47778m0723k25872o6275r9767J63871j39091K221
14019B728213j29748j17836M98807j79105j19476k29110m2896K67487j81914l09681
14009B184741M05374k35544J06017o7424J74284k12555j95527R5127k06603K38124
13999B286014o5913k18541N754R4513K9398J16438o375k79166O69977K10155M60539
13988C302793K574241P417240J7229983J6738533j8583032j3802940n798526k218218
13980F860074j528207j010983l21073o48711m01549L16170l76772l39297M05117
13971B954769k68736K86297l55291L0355m18700J99566J50537n96224K59243k41444
13961B000372M54697J38982n80949j12931L06923j15475J64910J02237q7957k4954
$$ plain form
13951 2245855 1853174 2249641 2164553 1938224 2011422 1725190 1957065 1767739 1874507 1804596
13941 1804596 1639303 1618171 2113820 1754951 1675577 2035387 1889576 1761947 1911421 1544242
13931 1544242 1839393 1513633 1838400 1654856 1987435 1446955 1681616 1480094 1849953
13922 1849953 1710026 1647332 1453209 1505512 1616732 1881057 1616367 2014085 1437600 1643602
13912 1643602 1968874 1401431 1295266 1468952 1497877 1881176 1305286 1381705 1456051 1239991
13902 1239991 1569421 1295337 1262281 1359976 1457006 1348290 1316467 1325995 1398989 1398986 1216733
13891 1216733 1508578 1419867 1332583 1206334 1332044 1519279 1479976 1352432 1509870 1107150
13881 1107150 916996 1285036 949151 1589742 942120 1119329 978364 1293054 1623132
$$ packed form
13951B245855l92681L96467q5088k26329P3198k86232K31875j89326J06768o9911
13941A804596j65293k1132M95649l58869p9374L59810j45811j27629J49474l67179
13931A544242K95151l25760L24767j83544L32579n40480K34661k01522L69859
13922A849953j39927o2694j94123N2303J11220K64325k64690L97718n76485K06002
13912A643602L25272n67443j06165J73686K8925L83299n75890P6419P4346k16060
13902A239991L29430k74084l3056R7695R7030j08716l1823R528P2994lj82253
13891A216733K91845q8711q7284j26249J25710J87235l9303j27544J57438m02720
13881A107150j90154L68040l35885O40591o47622J77209j40965L14690L30078
$$ plain form
13872 1623132 917253 993353 1071156 756001 1099590 1471879 1208667 1128944 1071120 1174972
13862 1174972 1158205 1177874 1252953 878580 1056845 1124015 1205902 1104110 1111309 775914 1194001
13851 1194001 782923 797795 1046731 980294 1053128 1079293 1117641 1200445 689209 1052891
13841 1052891 1234403 1373580 969837 904073 1227295 1007702 1022179 848714 1235351 842326
13831 842326 1094077 964005 1130728 1008077 822008 550466 492235 831399 884016 1020165
13821 1020165 866850 823341 1085578 831721 850760 808239 825831 857216 769167 939210
13811 939210 873916 681198 924245 836011 988231 856917 792262 703688 777795 820853 855168
13800 855168 739857 1004666 923314 697927 946825 866739 986730 656785 859560 897390
$$ packed form
13872A623132p05879P6100P7803l15155L43589L72289k63212p9723n7824J03852
13862A174972j6767J9669P5079l74373J78265O7170Q1887j01792P199l35395M18087
13851A194001m11078J4872K48936o6437P2834K6165L8348Q2804n11236L63682
13841A052891J81512J39177m03743o5764L23222k19593J4477j73465L86637l93025
13831H42326K51751j30072J66723j22651j86069k71542n8231L39164N2617J36149
13821A020165j53315m3509K62237k53857J9039m2521J7592L1385q8049J70043
13811I39210o5294j92718K43047q8234J52220j31314o4655q8574P4107M3058L4315
13800H55168j15311K64809q1352k25387K48898q0086J19991l29945K02775L7830
$$ plain form
13790 897390 621318 1086349 952773 649644 614870 1010841 451061 638155 1019937 582715
13780 582715 585931 846591 696758 948578 824364 612706 1028243 599765 648190 504811
13770 504811 926154 942039 674482 871806 660940 839146 939291 919507 544116 512953
13760 512953 673288 750676 754605 758747 690656 1053020 805901 868379 515436 781499 891295
13749 891295 629974 930811 507043 403424 314124 528301 844532 641095 476483 944001
13739 944001 442751 589041 497332 686443 797982 612249 487687 484752 820934 526568
13729 526568 653378 520310 720940 777587 1105807 497591 726485 322765 447850 475503
13719 475503 486953 993431 611896 652964 283748 532685 798378 961278 894610 656360
$$ packed form
13790H97390k76072M65031j33576l03129l4774L95971D51061J87094L81782m37222
13780E82715L216K60660j49833K51820j24214k11658M15537m28478M8425j43379
13770E04811M21343J5885k67557J97324k10866J78206J00145j9784l75391l1163
13760E12953J60335P7388L929M142o8091L62364k47119O2478l52943K66063J09796
13749H91295k61321L00837m23768j03619q9300K14177L16231k03437j64612M67518
13739I44001D42751J46290r1709J89111J11539j85733j24562k935L36182k94366
13729E26568J26810j33068K00630N6647L28220D97591K28894C22765J25085K7653
13719D75503J1450N06478l81535M1068B83748K48937K65693J62900o6668k38250
$$ plain form
13709 656360 484672 521426 625221 708021 512699 482699 545060 604098 368938 585437
13699 585437 341832 812516 285546 433503 649525 217312 531722 551672 508912 666302
13689 666302 622666 411844 796831 296866 388103 402115 524954 608091 559055 455843
13679 455843 698330 711449 658429 291304 577531 729524 542493 322887 550425 240937
13668 497352 512802 384558 425455 454254 510297 378237 377034 373688 386671 449033 525560
13657 525560 326693 520793 164551 462114 389936 192928 373434 839799 717361 353299
13646 167634 510891 452495 190008 288458 482921 381229 302843 413348 406180 349201 420167
13635 420167 532481 380183 418747 480502 359710 457940 403156 242990 598566 449872
$$ packed form
13709F56360j71688L6754J03795Q2800j95322l0000O2361N9038k35160K16499
13699E85437k43605M70684B85546J47957K16022B17312L14410J9950m2760J57390
13689F66302m3636k10822L84987B96866R1237J4012J22839Q3137m9036j03212
13679D55843K42487J3119n3020B91304K86227J51993j87031k19606K27538B40937
13668D97352J5450j28244M0897K8799N6043j32060j203l346J2983O2362P6527
13657E25560j98867J94100A64551K97563p2178A92928J80506M66365j22438C53299
13646A67634L43257n8396A90008R8450J94463j01692p8386J10505p168n6979P0966
13635D20167J12314j52298L8564O1755j20792R8230n4784j60166L55576j48694
$$ plain form
13625 449872 530986 617346 413370 132087 3279 577075 435828 235589 248498 176592 244808
13614 244808 598031 841300 43462 434207 260755 112205 267046 527964 8593 651772
13604 651772 431998 347049 467551 64930 485621 241118 393311 246642 40982 503333
13594 503333 196192 484543 550154 499482 421059 189064 330387 630554 130911 300716
13584 300716 302056 389800 -66981 464702 79353 157334 154355 233035 341885 495177 398599
13573 398599 639682 212220 272289 851902 187253 273921 275185 338677 343687 425574 58612
13561 174446 366988 88847 336029 118856 371920 270567 297317 317908 201802 215640
13551 215640 742124 178757 342422 534927 567099 162969 247015 232593 449562 262564
$$ packed form
13625D49872Q1114Q6360k03976A32087C279N73796j41247k00239J2909p1906O8216
13614B44808L53223K43269D3462L90745j73452A12205J54841K60918H593O43179
13604F51772k19774q4949J20502F4930M20691B41118J52193j46669D0982M62351
13594E03333A96192K88351O5611n0672p8423A89064J41323L00167A30911J69805
13584C00716J340Q7744f6981D64702G9353P7981k979P8680J08850J53292r6578
13573C98599K41083B12220O0069N79613A87253Q6668J264O3492N010Q1887E8612
13561A74446J92542H8847K47182A18856K53064j01353K6750K0591j16106J3838
13551B15640N26484A78757J63665J92505L2172A62969Q4046j4422K16969j86998
$$ plain form
13541 262564 198538 249817 125337 272559 240231 395298 400848 265340 174156 253009 410298
13530 410298 10370 358568 353691 108090 336042 342620 333308 367764 387578 217701 643176
13519 643176 323326 549620 140950 41627 497719 -51413 134368 233460 180695 226520
13509 226520 448846 24875 522210 226505 264026 150408 48247 43018 133110 25577 -56804
13497 134821 169093 244096 -24854 540388 80185 382133 170095 362405 167620 315176
13487 315176 133924 154788 446736 167253 235953 -64297 249713 -115762 439271 490408
13477 490408 54186 405510 -13309 137346 322638 236786 519029 329743 156619 101505
13467 101505 145801 85328 199252 328159 132830 107012 108439 150812 262778 67487 232406
$$ packed form
13541B62564o4026N1279j24480J47222l2328J55067N550j35508r1184P8853J57289
13530D10298A0370L48198m877A08090K27952O578r312L4456J9814j69877M25475
13519F43176l19850K26294A40950D1627M56092e1413A34368R9092n2765M5825
13509B26520K22326B4875M97335B26505L7521j13618D8247n229R0092B5577e6804
13497A34821L4272P5003b4854E40388H0185L01948A70095J92310A67620J47556
13487C15176A33924K0864K91948A67253O8700f4297B49713a15762D39271N1137
13477D90408E4186L51324a3309A37346J85292q5852K82243j89286A56619n5114
13467A01505M4296o0473J13924J28907A32830k5818J427M2373J11966F7487J64919
$$ plain form
13456 232406 129777 207279 322580 373149 349054 201638 279716 619459 284862 4508 107529
13445 107529 65629 154654 335291 75553 411751 343486 154579 398264 392318 157712 139151
13434 139151 315277 312967 586585 34032 -11178 314100 33493 284719 111315 87484 187977
13423 187977 323855 242609 154591 243017 412977 162596 -25254 10843 -151695 326377
13412 341451 150923 57953 60904 121876 -144786 347135 363613 139047 126096 229857 380251
13401 380251 398332 1589 161234 201833 338447 85985 -42352 111240 329659 49225 391725
13390 391725 16437 618395 189265 111933 117395 140544 346093 203726 142524 -15294 -79981
13379 -79981 351028 309587 346660 96048 -18825 210947 369597 222481 298369 327571 157759
$$ packed form
13456B32406j02629P7502J15301N0569k4095j47416P8078L39743B84862D508J03021
13445A07529m1900Q9025J80637G5553L36198o8265A54579K43685n946A57712j8561
13434A39151J76126k310K73618C4032a1178C14100C3493K51226A11315k3831J00493
13423A87977J35878q1246q8018Q8426J69960A62596b5254A0843a51695C26377
13412C41451A50923E7953K951O0972a44786C47135J6478A39047j2951J03761J50394
13401C80251J8081A589J59645M0599J36614H5985d2352A11240K18419D9225L42500
13390C91725A6437O01958A89265p7332N462K3149K05549j42367o1202a5294o4687
13379g9981C51028m1441L7073I6048a8825B10947J58650j47116P5888K9202A57759
$$ plain form
13367 628311 -61275 349257 208230 341868 316742 244309 82078 381914 26433 49436 263006
13356 263006 -1470 420627 153948 20706 16663 335233 168921 448516 218688 453671
13346 453671 215177 418530 208057 476340 259960 114296 800596 10951 564921 704011
13336 704011 326346 358970 108587 384834 226890 341850 474690 -180098 152716 273039
13326 273039 60204 303787 33111 89090 77186 34157 7468 466541 298526 286752 -81563
13314 279155 131732 -43363 -47727 251652 249702 -15961 -12779 324653 -37664 234311 23226
13302 153593 254746 240857 -26479 50107 9434 247787 57226 117380 472916 345701 111943
13290 40363 32767 117695 476252 182030 72452 172023 -127381 115839 364970 -588 152467
$$ packed form
13367F28311f1275C49257j41027J33638k5126p2433H2078K99836B6433K3003K13570
13356B63006a470D20627A53948B0706m043L18570j66312K79595B18688K34983
13346D53671B15177K03353B08057K68283k16380A14296O86300A0951N53970J39090
13336G04011C26346L2624A08587K76247j57944J14960J32840a80098A52716J20323
13326B73039F0204K43583C3111N5979j1904C4157G468M59073j68015j1774h1563
13314B79155A31732d3363m364B51652j950a5961L182C24653c7664B34311B3226
13302A53593J01153j3889b6479E0107I434K38353E7226O0154L55536j27215A11943
13290D0363p596Q4928L58557A82030G2452R9571a27381A15839K49131e88A52467
$$ plain form
13278 105109 92997 -23704 -107840 303290 -133441 -27199 230929 -107997 83281 52909 42076
13267 42076 -126441 354334 153508 60363 146226 102608 -207313 335370 463986 -2426 -91022
13256 -91022 528902 -101942 5682 119163 3376 -850 225975 225453 -171019 -84365 254643 352194
13244 352194 267632 -165308 271436 125748 -78120 90429 290295 382548 268081 481503
13234 481503 13936 398288 201044 -310684 342135 142934 -453 471868 99816 172578 286500
13223 286500 240985 288466 -18860 242535 -10857 -157404 -139501 34583 29496 80961 11886
13211 149602 31193 28957 220929 24398 79017 240778 133724 95108 519246 3209 13919
13200 13919 411628 -102909 18494 -184436 25202 291887 81881 254873 -85305 105226
$$ packed form
13278A05109j2112b3704q4136C03290a33441b7199B30929a07997H3281l0372j0833
13267D2076a26441C54334A53508F0363Q5863m3618b07313C35370J28616b426q8596
13256i1022E28902a01942E682J13481C376h50B25975n22a71019h4365B54643R7551
13244C52194q4562a65308B71436A25748g8120I0429J99866R2253j14467K13422
13234D81503A3936L84352j97244c10684C42135A42934d53D71868I9816P2762J13922
13223B86500m5515M7481a8860B42535a0857j46547J7903C4583n087N1465A1886
13211A49602C1193k236J91972B4398N4619J61761j07054l8616M24138C209J0710
13200A3919L97709a02909A8494a84436B5202K66685H1881J72992h5305A05226
$$ plain form
13189 192327 233317 143737 183885 -125556 157268 248571 176223 -226176 265005 269816 254259
13178 254259 -95381 165171 -81210 19595 77754 108656 240293 -9752 -26227 240238 81655
13166 -139565 203514 297821 73125 -370826 -202616 243662 130412 -49820 -97304 -185158
13156 -185158 172986 280828 -96737 -131768 61678 -112979 -195195 -145548 -89170 -122215 110096
13144 -48461 15430 139758 -61452 75586 215036 77951 304522 227193 282512 -112521 304078
13132 222873 94898 238960 -126657 77191 54559 -212487 73297 51850 -192092 -144403 213896
13120 -75698 361408 -177677 88580 317235 -54295 -278757 71584 295017 62133 29217 205043
13109 205043 54267 -156499 137451 268491 11335 3763 67814 22292 -299912 136888 86310
$$ packed form
13189A92327M0990q9580M0148a25556A57268R1303p2348b26176B65005M811j5557
13178B54259i5381A65171h1210A9595N8159L0902J31637i752j6475B40238H1655
13166a39565B03514R4307G3125c70826J68210B43662j13250d9820m7484q7854
13156a85158A72986J07842i6737l5031F1678a12979q2216M9647N6378l3045A10096
13144d8461A5430J24328f1452G5586J39450G7951K26571p7329N5319a12521C04078
13132B22873I4898J44062a26657G7191k2632b12487G3297k1447a92092M7689B13896
13120g5698C61408a77677H8580K28655e4295k24462G1584K23433F2133B9217J75826
13109B05043E4267a56499A37451J31040A1335C763O4051B2292b99912A36888n0578
$$ plain form
13098 86310 159841 63301 48367 -193311 65332 139855 1302 -231323 444054 -90527 -99570
13087 -99570 159185 13768 94259 4737 203292 -75297 -30795 408908 58843 177188 41570
13075 -40944 85254 -70019 421211 46204 345492 -145050 268987 286605 244832 487721 -155312
13063 269984 -173110 -187316 -78219 -171284 -53045 216406 163734 -51885 -112164 301929 140564
13051 269409 -32164 -371656 201091 144385 138294 187166 212833 170540 218939 213148 143634
13040 143634 51588 -211208 -132448 473732 267799 -141180 -61338 -227434 44071 204792
13030 204792 -77909 51450 -35406 -22688 -80037 -6562 -2804 256146 19258 108488 103165 50372
13017 -91988 -40271 111950 122270 -228172 -50725 17753 441124 389983 142524 96560 195824
$$ packed form
13098H6310P3531F3301j4934a93311F5332P4523A302b31323D44054i0527r043
13087i9570A59185A3768Q0491D737J98555g5297c0795D08908E8843J18345D1570
13075d0944H5254g0019D21211D6204K99288a45050B68987J7618m1773K42889a55312
13063B69984a73110j4206g8219r3065e3045B16406n2672e1885o0279C01929A40564
13051B69409c2164l39492B01091n6706o091M8872K5667m2293M8399n791o9514
13040A43634E1588b11208P8760D73732k05933a41180f1338j66096D4071J60721
13030B04792g7909E1450c5406J2718n7349f562b804B56146A9258Q9230n323E0372
13017i1988d0271A11950J0320b28172e0725A7753M23371n1141A42524m5964R9264
$$ plain form
13006 195824 -75367 91116 84991 23634 122010 51018 129132 82219 220468 -302289 -90463
12994 38384 4775 234893 -188912 -118466 93190 318432 57913 -119820 346353 45093 191718
12983 191718 -184283 147450 50220 -143184 280340 221433 110909 49076 16168 28790
12973 28790 136459 -93403 30690 224809 222944 -3390 93770 277699 112103 20460 -38701
12961 -135090 39652 83111 96467 167310 -209029 -117099 76057 91440 27327 -70191 116816
12949 -42804 259940 -28587 -120272 -65209 -252143 182509 89442 -212635 53619 -205414 139540
12937 -10282 107470 357381 -299820 -330612 313740 305037 141097 22345 424258 -79449 238233
12925 19781 -38271 188339 128398 -299334 326359 211767 310327 81017 354963 78409 -104999
$$ packed form
13006A95824g5367I1116o125B3634R8376E1018P8114m6913J38249c02289i0463
12994C8384D775K30118a88912P0446I3190K25242E7913a19820C46353D5093J46625
12983A91718a84283A47450E0220a43184B80340n8907j10524D9076A6168J2622
12973B8790J07669i3403C0690J94119j865c390I3770J83929A12103B0460c8701
12961a35090C9652M3459J3356P0843b09029R1930G6057J5383B7327g0191A16816
12949d2804B59940b8587r1685N5063j86934A82509H9442b12635E3619b05414A39540
12937a0282A07470K49911b99820l0792C13740q703A41097B2345M01913g9449B38233
12925A9781c8271A88339n9941b99334C26359j14592R8560H1017K73946G8409a04999
$$ plain form
12913 -10190 125994 117978 -137398 131617 -62023 57554 -172436 198774 -175055 155787
12902 30163 -49888 -42096 -225782 -29766 -63379 -221434 168953 28115 178840 470480 -67910
12890 60044 53893 376335 -33162 148286 67671 -76701 89165 -17416 -140200 194359 -92248
12878 -94711 -7209 547371 54094 217249 -44632 115234 -206322 185864 -58888 221887 39717
12866 108285 -12221 158829 210806 -114080 -179145 -278952 20787 56485 8159 -56600 -101381
12855 -101381 50399 -347170 120256 -8924 -17229 -14345 -261258 -65095 231087 -60044 -1058
12843 -338015 127085 -23502 -149751 -39534 -191198 -7709 254564 489792 324604 -76649
12832 -110827 173810 15526 147450 95586 -59640 -123508 -306171 -11269 -38309 99964 -273486
$$ packed form
12913a0190A25994q016a37398A31617f2023E7554a72436A98774a75055A55787
12902C0163d9888P792j83686b9766l3613j58055A68953B8115J50725K91640f7910
12890F0044o151L22442c3162A48286F7671g6701H9165a7416j22784A94359i2248
12878i4711g209E47371E4094J63155d4632A15234b06322A85864e8888B21887C9717
12866A08285a2221A58829N1977a14080o5065r9807B0787L5698H159e6600m4781
12855a01381E0399c47170A20256h924q305K884k46913f5095B31087f0044a058
12843c38015A27085b3502j26249c9534j51664g709B54564K35228j65188g6649
12832a10827A73810A5526J31924n1864e9640o3868j82663a1269k7040I9964b73486
$$ plain form
12820 -123904 -63021 81641 -131891 -9336 -9535 229220 52313 259611 40755 -119670 -35065
12808 286695 -138563 127373 -138322 -193069 -162671 -126017 -162135 -130636 -163992 -231150 40751
12796 -233441 328453 -100196 -79852 -13860 119721 122108 -223603 381441 -50501 107120
12785 22880 -64701 -60505 134525 37667 28152 158868 -57351 78200 34380 -319631 -117079
12773 370728 21326 33935 -173120 70335 -109829 71311 231814 -10174 -46314 -94938 -17476
12761 -179481 -159089 -210920 115120 63839 -202337 217512 40419 58884 254516 115578
12750 -37945 -148603 269815 -39098 168483 23812 -5874 184773 42163 -19603 -24238 191247
12738 -619885 329633 -23959 -67107 266197 231277 458466 173374 141660 61682 79751 -370988
$$ packed form
12820a23904O0883H1641a31891i336j99B29220E2313K07298D0755a19670c5065
12808B86695a38563A27373a38322n4747L0398L6654l6118L1499l3356o7158D0751
12796b33441C28453a00196K0344a3860A19721K387b23603C81441e0501A07120
12785B2880f4701M196A34525C7667r515J30716e7351G8200C4380c19631a17079
12773C70728B1326J2609a73120G0335a09829G1311J60503a0174l6140m8624a7476
12761a79481K0392n1831A15120n1281b02337B17512D0419J8465J95632A15578
12750c7945j10658B69815c9098A68483B3812e874A84773D2163a9603m635A91247
12738f19885C29633b3959m3148B66197l4920K27189A73374l1714F1682J8069c70988
$$ plain form
12726 116670 -142485 -226916 -56329 272660 134559 219698 -278032 -187381 -276980 223190
12715 -271047 139266 -95155 90256 -133472 -13558 121514 71118 93917 238956 324027 -6343
12703 138220 196380 282534 5473 84130 521932 -139736 215420 213607 140488 204269 -296001
12691 28658 -59872 27803 111868 20209 -66294 -11873 128557 -430133 -1 130334 59199 21868
12678 334417 433811 100755 69757 145902 342467 514325 186709 -37296 -173045 -112818
12668 -112818 9766 -117725 46423 33113 18881 241345 -172667 242617 -217068 -98801 24736
12656 -88488 -63921 277397 -213848 -82361 -181654 -142535 141101 13559 188961 47081 184377
12645 184377 129982 -23413 70557 18594 46559 14330 146604 49421 66340 241643 -6002
$$ packed form
12726A16670a42485q4431e6329B72660A34559Q5139b78032R0651q9599B23190
12715b71047A39266i5155I0256a33472a3558A21514n0396K2799J45039Q5071f343
12703A38220N8160Q6154E473P8657M37802a39736B15420j813p3119O3781b96001
12691B8658e9872B7803Q4065B0209f6294a1873A28557d30133aA30334E9199B1868
12678C34417R9394A00755l0998P6145J96565J71858A86709c7296j35749O0227
12668a12818I766a17725D6423j3310j4232K22464a72667B42617b17068i8801B4736
12656h8488K4567B77397b13848h2361r9293L9119A41101A3559J75402D7081J37296
12645A84377n4395b3413G0557A8594K7965A4330J32274D9421J6919J75303f002
$$ plain form
12633 199390 242780 107411 -100218 104290 189322 189547 48308 148470 501973 189745 -237765
12621 -30990 192402 486707 176478 60574 416190 144914 58738 37202 308092 52466
12610 353 43339 374072 172784 69068 -98407 132377 158049 -265607 -63887 -12052 -92382
12599 -92382 89680 -67227 281078 -69464 216630 -227349 -78441 120883 47483 96002 -25094
12587 66623 61818 37507 103301 19388 187972 -387242 -20504 29030 171184 -71748 -51808
12576 -51808 87576 -224131 -50008 -107547 -309506 -232530 44782 -58884 115132 130322 -60042
12564 -43577 -107771 -3413 -39375 -287725 155644 -85184 -252350 127186 132285 72016 -60969
12552 287831 63503 -101852 -44502 114812 143511 -218992 82451 211044 15833 20004 -265005
$$ packed form
12633A99390M3390A07411a00218A04290Q5032K25D8308J00162L53503A89745b37765
12621c0990A92402K94305A76478F0574L55616A44914E8738k1536K70890E2466
12610C53M2986L30733A72784F9068i8407A32377K5672b65607f3887a2052q0330
12599i2382H9680f7227B81078f9464B16630b27349g8441A20883D7483M8519b5094
12587F6623m805k4311O5794A9388J68584c87242b0504B9030J42154g1748J9940
12576e1808H7576b24131e0008n7539k01959P6976D4782e8884A15132J5190f0042
12564d3577o4194c413l5962k48350A55644h5184j67166A27186N099o0269f0969
12552B87831F3503a01852d4502A14812K8699b18992H2451J28593A5833M171b65005
$$ plain form
12540 -4807 5499 105413 -37673 13668 -79441 328719 92250 143556 91027 64751 240274 44684
12527 165315 -10971 63770 141471 88828 242390 91636 208379 313796 243938 326017 115740
12515 -15168 350157 -52152 -80414 218742 200935 -63043 223846 58704 -265671 52598 -62134
12503 -102634 -138307 -101702 145689 162009 51072 239703 -63096 -49584 67779 104651 -114364
12491 -188877 77713 15761 186217 48541 -167533 203181 10336 -82263 383839 136280
12480 173356 44185 -42731 431816 283348 -13995 -196421 231503 128190 39601 -19991
12469 61646 -150393 20285 354390 61665 252554 -17010 -432832 -306937 -74997 29475 -80805
12457 -265611 104980 90653 239163 250821 50191 72549 6011 -110941 843 -72904 175370
$$ packed form
12540d807E499R9914c7673A3668g9441C28719I2250N1306n2529k6276J75523D4684
12527A65315a0971F3770P7701n2643J53562I1636J16743J05417o9858Q2079A15740
12515a5168C50157e2152k8262B18742j7807f3043B23846E8704b65671E2598f2134
12503a02634l5673L6605A45689J6320E1072J88631f3096J3512F7779L6872a14364
12491a88877G7713A5761J70456D8541a67533B03181A0336h2263C83839A36280
12480A73356D4185d2731D31816j48468a3995j82426B31503j03313C9601a9991
12469F1646a50393B0285L34105F1665J90889a7010m15822J25895g4997B9475h0805
12457b65611A04980j4327J48510J1658E0191K2358F011a10941H43g2904A75370
$$ plain form
12445 30834 -111133 283104 12129 -102207 -495286 -69900 -112471 -72465 -245294 40260 -249805
12433 174163 1956 -186726 -143406 345741 42151 73765 32264 -20065 406382 4389 -233141
12421 -121579 -126543 91777 -40247 65256 151288 -272077 228135 -784 81374 74652 288462 322892
12409 322892 2009 163706 203650 -24599 -225409 -7795 -248516 191100 -155202 -29244 169136
12397 -182799 7108 175451 115727 -239950 145444 -106002 78384 41921 209812 64739 284570
12386 284570 -2828 -150792 81144 171987 174185 52814 37195 182802 -11142 187527 299292
12375 299292 110105 -142468 -18355 -192126 189689 101262 255951 -111687 104490 266391
12365 266391 26160 -56248 69102 125915 -156439 6335 200801 -85690 -223917 324122 -163896
$$ packed form
12445C0834a11133B83104A2129a02207l93079f9900m2571M0006j72829D0260b49805
12433A74163A956a86726M3320C45741D2151L1614C2264b0065D06382D389b33141
12421a21579m964I1777d0247F5256Q6032b72077B28135g84H1374o722K13810L4430
12409C22892B009J61697L9944b4599k00810g795k40721A91100a55202b9244A69136
12397a82799G108J68343n9724b39950A45444a06002G8384l6463J67891F4739K19831
12386B84570b828j47964H1144R0843K198E2814j5619J45607a1142A87527J11765
12375B99292A10105a42468a8355j73771A89689q8427J54689a11687A04490J61901
12365B66391B6160e6248F9102N6813a56439F335J94466h5690j38227C24122a63896
$$ plain form
12353 -82663 -13157 237638 76067 -271031 72270 90610 -8833 682 -61338 192407 -401533
12341 33686 -28481 9394 248658 180037 532857 185307 367857 149905 -23005 19919 110249
12330 110249 -106637 146374 -39359 -188907 106468 154906 216955 -111943 301175 29722
12319 92194 317311 188297 -275413 -39290 -142526 228010 33719 183548 -311103 352004
12308 -124856 1933 -143771 179699 -53194 211966 340927 301915 -11210 -61037 -7748 5560
12296 -64854 47001 -119905 -484201 219713 248983 434837 -93951 96977 -278737 270268
12285 245769 154412 -7256 139543 50674 153291 69414 571914 108434 326278 27817 108536
12274 108536 52074 -27750 -206786 190846 -8755 409830 156777 68221 30353 301788 118469
$$ packed form
12353h2663a3157B37638G6067b71031G2270J8340h833F82f1338A92407d01533
12341C3686b8481I394K39264o8621L52820A85307J82550A49905b3005A9919R0330
12330A10249a06637A46374c9359j49548A06468M8438O2049a11943C01175B9722
12319I2194K25117j29014b75413c9290j03236B28010C3719J49829c11103C52004
12308a24856A933a43771A79699e3194B11966J28961l9012a1210m9827g748E560
12296f4854D7001a19905l64296B19713K9270J85854i3951I6977b78737B70268
12285B45769r1357g256A39543E0674J02617F9414N02500A08434K17844B7817Q0719
12274A08536E2074b7750j79036A90846h755D09830A56777F8221C0353K71435A18469
$$ plain form
12262 160542 287424 -53764 298693 60952 25981 16749 390433 180943 124595 4322 252455
12251 252455 54409 157561 105161 259022 -96387 403930 191450 95358 52803 -40824 42341
12239 93965 -108710 539954 312208 31458 25939 206872 -424543 218521 268550 373385
12229 373385 104233 177786 214444 -55454 187199 208938 356635 486336 374411 496523
12219 496523 263563 -37021 25231 537185 -27765 135825 233027 289111 267184 226998 136452
12208 136452 -39863 80965 49570 23123 305232 245523 -82607 274330 157122 62896 199769
12197 199769 291349 195118 128350 368473 545073 430027 373373 617716 8636 250604 222597
12186 222597 18041 145115 -53740 172762 267205 -125229 430380 -145344 143796 371965
$$ packed form
12262A60542J26882e3764B98693F0952B5981r232L73684A80943n6348D322K48133
12251B52455E4409J03152n2400J53861i6387D03930A91450I5358m2555d0824D2341
12239I3965a08710E39954k27746C1458n519J80933d24543B18521N0029J04835
12229C73385A04233P3553L6658e5454A87199K1739J47697J29701j11925J22112
12219D96523k32960c7021B5231N11954b7765A35825R7202N6084k1927m0186r0546
12208A36452c9863H0965l1395B3123K82109n9709h2607B74330j17208F2896J36873
12197A99769R1580r6231o6768K40123J76600j15046n6654K44343H636K41968k8007
12186B22597A8041J27074e3740A72762R4443a25229D30380a45344A43796K28169
$$ plain form
12176 371965 -36170 164044 170716 254057 306390 121786 -178195 312452 551159 370418
12166 370418 -16891 256306 120561 33658 -112970 60712 -38532 454262 455508 385969 -68378
12154 23098 -137067 -6029 420126 87691 4195 -31348 412979 -117472 -310518 451244 -28547
12142 135948 80267 706711 -405196 -43333 -55579 -192251 -346516 391889 417370 253672
12132 253672 -37042 73798 182298 3885 196547 262930 351433 266528 387754 -270866 -52735
12120 217630 13857 -155176 229200 -109311 86307 201311 145158 -315606 13343 327607
12110 327607 179565 -132212 245499 373083 414874 -108374 91709 -52612 -67259 -127752
12100 -127752 170187 -49749 295083 -27970 -67360 -56982 113920 204835 100323 217676
$$ packed form
12176C71965c6170A64044O672Q3341N2333A21786a78195C12452K38707j80741
12166C70418a6891B56306A20561C3658a12970F0712c8532D54262J246o9539f8378
12154B3098a37067f029D20126H7691D195c1348D12979a17472j93046D51244b8547
12142A35948n5681O26444d05196d3333j2246j36672j54265C91889K5481j63698
12132B53672c7042G3798J08500C885J92662O6383Q8503q4905J21226b70866e2735
12120B17630A3857a55176B29200a09311H6307J15004n6153c15606A3343L14264
12110C27607j48042a32212B45499J27584M1791a08374I1709e2612j4647o0493
12100a27752A70187d9749B95083b7970l9390J0378A13920R0915A00323J17353
$$ plain form
12090 217676 5879 74878 -32964 409357 28132 -1254 -133864 -213230 46895 128228 -291497
12078 140840 -78953 70097 52095 -12456 123121 -68035 -51738 123887 217007 476577 55065
12066 112848 -64394 225982 15206 -492 123435 -135503 27156 -41398 -105957 -6376 89867
12054 92356 115950 1096 -152455 -67162 14143 -257251 -234782 -38886 213753 -149622 323468
12042 278152 101387 13697 294036 -48277 -214489 -23530 -196915 208337 112367 330630
12032 330630 43026 338283 350683 133296 250550 199896 27066 -31355 13094 63015 56013
12021 56013 191104 83047 166951 -46288 191186 18405 125783 -178 -196667 180631 -58661
12009 10040 44118 -238320 -1804 324362 251047 -257050 -193367 -458394 -94173 139226 189369
$$ packed form
12090B17676E879O8999c2964D09357B8132a254j32610p9366D6895Q1333b91497
12078A40840g8953G0097j8002a2456A23121f8035J6297A23887R3120K59570E5065
12066A12848f4394B25982A5206d92A23435a35503B7156d1398o4559f376H9867
12054I2356K3594A096a52455f7162A4143b57251K2469c8886B13753a49622C23468
12042B78152A01387A3697K80339d8277j66212b3530j73385B08337r5970K18263
12032C30630D3026K95257J2400A33296J17254n0654B7066c1355A3094M9921p002
12021E6013J35091H3047Q3904d6288A91186A8405J07378a78j96489A80631e8661
12009A0040L4078b38320a804C24362p3315b57050O3683k65027i4173A39226N0143
$$ plain form
11998 189369 -43553 -95762 -77703 -326288 -19558 211548 127171 -86268 -57196 -207344 -318281
11987 -318281 -85426 44138 148524 118152 -184715 -315629 137608 -65159 8044 -169235 65664
11975 43189 174925 -294143 -277980 -295547 96507 -206807 -58078 -142641 -79029 195269 -129345
11963 237726 162611 -64374 -27782 -321407 159985 -161135 -69131 -189590 269680 -45500
11952 -27035 210631 -98418 -18759 -403466 121775 -194411 467292 136700 -138124 -1438
11941 87073 216386 -44822 474728 -303466 -107428 -76722 160217 96728 -73110 -6702 -10282
11930 -10282 -40317 -3745 -357781 -273202 -2422 213582 -37063 -109076 -53577 -43990 106631 -64007
11917 -90793 -248651 278158 109006 -86422 -173038 130678 -120800 87170 -150669 -28965
$$ packed form
11998A89369d3553n2209J8059k48585a9558B11548q4377h6268K9072j50148j10937
11987c18281h5426D4138J04386l0372a84715j30914A37608f5159H044a69235F5664
11975D3189J31736b94143J6163j7567I6507b06807e8078q4563O3612A95269a29345
11963B37726p5115f4374b7782k93625A59985a61135f9131j20459B69680d5500
11952b7035B10631i8418a8759l84707A21775a94411D67292A36700a38124a438
11941H7073J29313d4822D74728c03466a07428L0706A60217o3489g3110f702l580
11930a0282l0035c745l54036Q4579b422B13582c7063p2013e3577R587A06631f4007
11917i0793j57858B78158A09006h6422q6616A30678a20800H7170a50669b8965
$$ plain form
11906 -54982 -86455 28788 -332783 24312 -42600 -106493 108081 -50391 -142805 177146 30391
11894 23271 -55436 -107033 -38603 101431 -175303 199048 -195523 90791 -141468 -45517 223159
11882 -264157 162513 254511 253238 -193943 -330834 284023 -269658 -210978 -155413 250472
11871 155802 19899 82224 -130503 -144146 198471 345850 181393 -276604 34977 -196927
11860 -119878 53827 -3448 126072 -267011 69059 123527 -120133 4721 -52154 -200578 -330974
11849 -330974 70816 -315351 -55491 -29685 -26620 94252 32925 7668 -192221 -8629 -227499
11838 -227499 285117 99350 -330774 224988 -153106 -164814 -214987 257792 -321748 -84647
11827 -195094 -62493 -448414 93633 50853 111395 25205 -179935 -85009 -47903 7622 205100
$$ packed form
11906e4982l1473B8788c32783B4312d2600o3893A08081e0391r2414A77146C0391
11894B3271e5436n1597c8603A01431a75303A99048a95523I0791a41468d5517B23159
11882b64157A62513R1998j273a93943j36891B84023b69658N8680N5565B50472
11871A55802A9899O2325a30503j3643A98471J47379j64457b76604C4977a96927
11860a19878E3827c448A26072b67011F9059N4468a20133D721e2154j48424j30396
11849c30974G0816c15351e5491K5806L065I4252C2925G668a92221h629k18870
11838b27499B85117I9350c30774B24988a53106j1708n0173B57792c21748h4647
11827a95094f2493l85921I3633m2780O0542B5205a79935h5009L7106G622J97478
$$ plain form
11816 205100 472488 -175835 107807 -30326 173374 -186751 41548 5085 130293 -285383
11805 -266439 -86243 -84393 -129417 -364683 148490 278588 25304 144059 56352 6766 -357554
11793 -67093 217405 -43836 -387756 -215482 136336 -217102 -208167 55450 -47842 -189148 227318
11781 37879 -11777 -60166 -12957 121072 -197302 -202373 -92537 -44535 -119470 105262 -44860
11769 -29014 -28660 -49699 -73693 246572 30127 -26511 -143078 300566 114838 58820 29778
11758 29778 -394465 229410 -88566 -16119 3682 -143405 -273988 87038 -14366 -171335 201938
11746 -92851 -306983 276516 316835 -279510 25130 -36413 101130 171412 219105 -26244 -147137
11735 -147137 322598 452254 186444 76441 228698 -1005 -33060 91457 -310844 -255615 -8801
$$ packed form
11816B05100K67388a75835A07807c0326A73374a86751D1548E085J25208b85383
11805b66439h6243J850m5024k35266A48490J30098B5304J18755E6352F766c57554
11793f7093B17405d3836l43920J72274A36336b17102Q935E5450d7842j41306B27318
11781C7879a1777m8389a2957A21072a97302n071i2537d4535p4935A05262d4860
11769b9014L54k1039k3994B46572C0127b6511j16567C00566A14838n6018k9042
11758B9778c94465B29410h8566a6119C682a43405j30583H7038a4366j56969B01938
11746i2851k14132B76516M0319b79510B5130c6413A01130P0282M7693b6244j20893
11735a47137C22598J29656A86444G6441J52257a005l2055I1457c10844N5229h801
$$ plain form
11723 -111002 -89185 115141 -178624 -8709 101952 13560 -113390 -216546 680619 197042
11712 97807 124471 -159154 -80223 61732 55484 191008 140753 -5198 10073 -267433 -101950
11700 -44211 -267958 -119843 -151142 -159465 215968 214138 314956 -66723 -56338 -44077 322725
11688 -136245 -134168 -60727 -54393 -121418 28552 23553 102819 98998 -312260 134161 143833 -61846
11675 -253757 -58542 -287050 -47140 -23610 385779 -59885 548244 94676 33076 -70393 176531
11663 -57461 387708 -126479 -147541 -130354 -149065 121720 202286 174567 54502 202068 34639
11651 29076 92826 53652 6088 143504 295005 -81771 -104093 -173287 35973 -28771 -257371
11640 -257371 351235 -54361 -307196 249200 -31495 98471 -184846 65982 208901 -26710
$$ packed form
11723a11002K1817A15141a78624h709A01952A3560a13390j03156F80619A97042
11712I7807K6664a59154P8931F1732o248J35524n0255e198A0073b67433a01950
11700d4211k23747a19843l1299q323B15968j830J00818f6723J0385J2261C22725
11688a36245K077f0727O334o7025B8552m999P9266l821c12260A34161R672f1846
11675b53757e8542k28508d7140K3530C85779e9885E48244I4676C3076g0393A76531
11663e7461C87708a26479k1062J7187j8711A21720Q0566k7719E4502J47566C4639
11651B9076O3750l9174F088J37416J51501h1771k2322o9194C5973b8771k28600
11640b57371C51235e4361k52835B49200c1495I8471a84846F5982J42919b6710
$$ plain form
11629 -435638 245202 300708 8170 171782 27096 -124077 259174 339592 339709 -327061 155666
11617 92932 -14898 17078 -110849 195 109697 -349726 -29491 167668 -101317 -352678 126471
11605 96515 -241665 112166 -292160 -62285 130236 2283 -160010 -94564 29709 90470 337794
11594 337794 -47840 180854 54759 4402 -5581 -98139 -130166 -97334 45504 136120 135399 155501
11582 155501 293860 39433 12022 85377 222297 140407 -172472 71060 22436 169302 -36386
11570 168005 226426 596025 -324145 -73424 -37889 -287107 -41503 198344 195281 -213586 -54409
11558 83030 159980 168598 -252644 -56381 180804 -73494 -5877 60218 137492 -23759 74388 442645
11546 442645 -130109 -160273 -20804 327696 -109700 319260 30870 -126398 170070 94716
$$ packed form
11629d35638B45202N5506H170J63612B7096a24077B59174Q0418J17c27061A55666
11617I2932a4898A7078a10849A95J09502c49726b9491A67668a01317k51361A26471
11605I6515b41665A12166b92160f2285A30236B283a60010O5446B9709O0761K47324
11594C37794d7840A80854E4759D402e581r2558l2027L2832D5504R0616p21K0102
11582A55501J38359C9433A2022P3355J36920q1890a72472G1060B2436J46866c6386
11570A68005N8421L69599c24145g3424L5535k49218d1503A98344l063b13586e4409
11558H3030P6950Q618b52644e6381A80804g3494e877F0218P7274b3759G4388L68257
11546D42645a30109l0164b0804C27696a09700C19260C0870a26398A70070p5354
$$ plain form
11536 94716 54384 22686 355233 -152736 -21128 -109687 145535 96912 -71341 173205 49603
11524 152020 128273 -112255 -58782 26644 264119 302118 235082 255740 224795 114452 228370
11513 228370 -107053 64677 153062 -98007 395590 182208 291516 94104 302307 -258962
11502 270235 -73018 103103 -17162 267945 236934 291256 321960 103477 -125574 303522
11491 57518 136243 192535 -152759 119165 382698 263720 401728 95830 152850 50935 294907
11480 294907 276590 163154 36918 267524 141622 -260648 -40958 216292 151918 261223
11470 261223 136732 310383 -102456 -38920 214406 362489 461586 52226 142588 40969
11459 233005 -10347 16420 326099 154896 177566 257599 223336 -24548 234581 129372 259586
$$ packed form
11536I4716m0332B2686L32547a52736b1128q8559A45535m8623g1341A73205D9603
11524A52020k3747a12255N3473B6644K37475L7999o7036K0658l0945j10343J13918
11513B28370a07053F4677Q8385i8007C95590A82208J09308I4104K08203b58962
11502B70235g3018A03103a7162B67945l1011N4322L0704A03477a25574C03522
11491E7518P8725N6292a52759A19165K63533j18978J38008I5830N7020E0935K43972
11480B94907j8317j13436C6918K30606j25902b60648d0958B16292o4374J09305
11470B61223j24491J73651a02456c8920B14406J48083R9097E2226R0362D0969
11459B33005a0347A6420L09679A54896K2670Q0033l4263b4548B34581j05209J30214
$$ plain form
11448 259586 58884 6996 18047 301340 -22973 -106769 61762 -66314 -276456 -95463 412365
11436 83806 -29060 -28153 201072 -103013 111809 118645 142126 78791 154876 -156231 -74829
11424 -281051 -134205 27674 75280 -124288 121501 -4338 206780 -12643 -183423 -166747 163013
11412 -279058 54118 124792 -120928 49635 -247143 -6783 306408 14274 -212840 27617 19955
11401 19955 -38998 -167986 132430 335288 -101653 69087 219218 -74084 -65871 56338 82476
11390 82476 105475 81088 -82898 35611 3167 -188523 -350650 267263 37439 234952 -234500
11378 80438 -304732 189589 -151433 121545 -105897 -8507 158250 -21905 169805 142569
11368 142569 152188 -130425 -148327 416566 301845 -72268 -18507 -144717 -23086 134252 175940
$$ packed form
11448B59586E8884F996J1051K83293b2973q3796F1762f6314k10142i5463D12365
11436H3806b9060R07B01072a03013A11809O836K3481o3335P6085a56231g4829
11424b81051a34205B7674M7606a24288A21501d338B06780a2643j70780J6676A63013
11412b79058E4118P0674a20928D9635b47143f783C06408A4274b12840B7617p662
11401A9955c8998j28988A32430K02858a01653F9087J50131g4084Q213E6338K6138
11390H2476K2999k4387h2898C5611C167a88523j62127B67263C7439J97513b34500
11378H0438c04732A89589a51433A21545a05897h507A58250b1905A69805k7236
11368A42569R619a30425j7902D16566j14721g2268a8507j26210b3086A34252M1688
$$ plain form
11357 175940 -112796 -101276 223460 -80859 215292 134422 130976 -225273 -404787 -81898 -59432
11346 -59432 369070 218452 -3436 -107736 -98113 -77408 -175825 -125952 3382 -116723 -144496
11335 -144496 195370 -119656 193115 -21637 -67092 175974 -12 29901 -40362 -110468 -91487
11324 -91487 -322567 -229146 -221892 -36426 194361 26992 40143 -39787 -19217 -168546 -137663
11313 -137663 -59793 -133075 -45156 -231832 299387 12673 -101580 -448485 -94875 56859 237731
11302 237731 246195 47234 99339 -257232 -155521 -216162 -92035 113675 19760 -126607 -181769
11291 -181769 128153 -201684 -162470 -258665 -302323 81346 226326 92448 -152900 122398
11280 158048 -77690 49869 51008 -353388 67510 -51922 -71597 586 273539 -370350 -134219
$$ packed form
11357A75940a12796J1520B23460h0859B15292q0870l446b25273j79514h1898K2466
11346e9432C69070j50618c436j04300R623K0705r8417M9873C382a16723k7773
11335a44496A95370a19656A93115b1637m5455A75974a2B9901d0362p0106J8981
11324i1487k31080R3421P254c6426A94361B6992J3151c9787a9217j49329L0883
11313a37663e9793p3282d5156j86676B99387A2673a01580l46905i4875E6859J80872
11302B37731Q464D7234N2105b57232J01711o0641i2035A13675A9760a26607n5162
11291a81769A28153b01684L9214r6195m3658H1346J44980I2448a52900A22398
11280A58048g7690D9869J139c53388F7510e1922j9675E86K72953c70350a34219
$$ plain form
11268 -40203 -42545 86220 -287700 -198849 -121254 -326309 128188 -52867 -262024 -22553 -27531
11257 -27531 18530 -11776 -13123 101495 -206271 13680 143209 -257339 -80984 -152189 -384161
11246 -384161 -300565 168893 53410 -14028 210343 -456750 -193191 87485 -83016 -138650 -255926
11235 -255926 84601 -71352 116956 -144374 -128367 -92522 -380149 66314 -59074 -6058 95543
11223 26624 -43137 -295118 -28965 -310258 -143814 -158140 -155569 85227 -253251 -66305 -341130
11212 -341130 -47300 -6083 -102260 -182666 -124144 242714 -194447 282662 -182038 -46320 -206845
11201 -206845 64260 -142575 10316 -37504 -53090 -48232 144522 -253838 -217615 24959 100416
11190 100416 -243493 -275986 -214102 -78549 -185278 -207486 210868 -97023 -243650 -535953
$$ packed form
11268d0203k342H6220b87700Q8851P7595k05055A28188e2867k09157b2553m978
11257b7531A8530a1776j347A01495b06271A3680J29529b57339h0984p1205k31972
11246c84161Q3596A68893E3410a4028B10343d56750a93191H7485h3016n5634j17276
11235b55926H4601g1352A16956a44374J6007L5845k87627F6314e9074f058I5543
11223B6624d3137k51981b8965k81293a43814j4326K571H5227b53251f6305k74825
11212c41130d7300f083r6177q0406N8522B42714a94447B82662a82038d6320j60525
11201b06845F4260a42575A0316c7504j5586M858A44522b53838L6223B4959P5457
11190A00416b43493l2493O1884g8549j06729k2208B10868i7023j46627k92303
$$ plain form
11180 -535953 -58998 309414 127041 -53450 1695 -422790 -350424 45534 71828 -45752 -159356
11169 -159356 -81439 -209217 -187476 70207 -21064 -229468 -88740 -25587 118750 -21664 -152880
11158 -152880 21823 124125 -205594 -229257 -173266 38507 -423328 153751 -204537 35471
11147 -108307 -236738 -30677 14452 -322857 -146453 -30096 15214 198411 398807 373485
11137 373485 219717 230245 238809 18425 73529 -190861 -135970 -90419 216330 286549 189165
11126 189165 98552 87361 287902 57109 -127858 179610 70124 57412 -140651 27438 -29652
11114 10361 53141 77132 -134596 -175763 286986 312008 68785 -14257 53968 115104 133452
11103 133452 377987 311330 202284 72371 1256 -60268 289919 108719 110859 -23136 58158
$$ packed form
11180e35953e8998C09414A27041e3450A695d22790P2366D5534K6294d5752j13604
11169a59356P7917j27778K1741G0207b1064k08404h8740b5587A18750b1664j31216
11158a52880B1823J02302b05594k3663N5991C8507d23328A53751b04537C5471
11147a08307j28431c0677A4452c22857a46453c0096A5214J83197K00396k5322
11137C73485j53768J0528Q564A8425N5104a90861N4891M5551B16330P0219r7384
11126A89165r0613j1191K00541E7109a27858A79610G0124j2712a40651B7438b9652
11114A0361M2780K3991a34596m1167B86986K5022F8785a4257E3968O1136J8348
11103A33452K44535o6657j09046G2371A256f0268B89919A08719K140b3136E8158
$$ plain form
11091 -21733 229801 181383 222225 100898 114222 250287 294923 478905 117680 266380
11081 266380 33950 -52115 276872 255534 211597 190146 205320 282842 363586 432309 372740
11070 372740 215355 373012 315082 356489 376730 223072 317362 619010 628958 222704 383182
11059 383182 307306 121153 971180 978088 627587 754598 345465 531106 971822 755155
11049 755155 849264 689669 715526 1029012 898755 1010478 926229 862443 707805 995989
11039 995989 726088 1013073 1069487 914794 1058586 910704 909626 882155 804048 705058 867672
11028 867672 774281 1254280 1134616 964822 933090 969289 779420 912573 1097277 826069
11018 826069 759507 819082 404936 544312 726182 713604 831964 579082 716219 378915
$$ packed form
11091b1733B29801m8418M0842A00898J3324J36065M4636J83982A17680J48700
11081B66380C3950e2115B76872k1338m3937k1451J5174P7522Q0744O8723n9569
11070C72740j57385J57657n7930M1407K0241j53658R4290L01648R948B22704J60478
11059C83182p5876A21153Q50027O908l50501J27011C45465J85641M40716k16667
11049G55155R4109j59595K5857L13486j30257J11723q4249o3786j54638K88184
11039I95989k69901K86985N6414j54693J43792j47882j078k7471p8107r8990J62614
11028H67672r3391M79999j19664j69794l1732L6199j89869J33153J84704k71208
11018H26069o6562N9575D04936J39376J81870j2578J18360k52882J37137l37304
$$ plain form
11008 378915 480025 586732 745048 697236 674495 742308 752540 734988 727360 434705 739891
10997 739891 519216 652861 727976 614977 669073 684058 806802 618235 905618 825039
10987 825039 819952 1140271 1370921 1139467 1414950 1343236 1158061 1201124 918285 1428150
10977 1428150 1503299 1546779 1675291 2023919 2155155 2473663 2511537 2898221 2790554 3347359
10967 3347359 3029217 3394496 3153943 3053410 2860416 2501860 2230726 1957455 1862863 1921504
10957 1921504 2082889 2063841 2043516 1997408 2203141 1947863 1557383 1607112 1239114 1107482
10947 1107482 1021357 1059062 662868 533625 401484 518245 103403 329479 259569 -103180
10936 540225 174448 28432 174233 -150026 29500 339563 -77257 548959 321883 -237874
$$ packed form
11008C78915J01110J06707J58316m7812k2741O7813J0232j7552p628k92655L05186
10997G39891k20675J33645P5115j12999N4096J4985J22744j88567K87383q0579
10987H25039n087L20319K30650k31454K75483p1714j85175M3063k82839N09865
10977A428150P5149M3480J28512L48628J31236L18508L7874L86684j07667N56805
10967C347359l18142L65279k40553j00533j92994l58556k71134k73271r4592N8641
10957A921504J61385j9048k0325m6108K05733k55278l90480M9729l67998j31632
10947A107482q6125L7705l96194j29243j32141J16761A03403K26076o9910a03180
10936E40225A74448B8432J45801a50026B9500L10063g7257E48959k27076b37874
$$ plain form
10925 -13790 56346 265960 124216 22385 258329 221415 -6471 165785 49971 186546 -265037
10913 -12646 -71445 4329 -145820 -260241 -93037 226843 -130917 -61781 5630 139051 -9463
10901 -173135 -295723 -140406 216835 -80534 -33299 -162068 -275043 -283490 -34252 209000
10890 -225869 -139124 -127112 195849 -95854 -219653 -398981 112558 -48492 -309138 -125264
10879 30336 -13735 11729 -149022 -75303 -103570 178644 -87278 -57668 55353 82193 -320719
10867 -145545 46097 206556 175374 47239 -122655 223817 237078 343641 207379 203995 200328
10856 200328 -282862 -17337 -41854 -205096 -60954 9628 199030 -91147 149988 -112129 -35316
10844 -156116 -195586 42349 -69639 -263771 181279 126143 -215219 -40821 -275190 334063
$$ packed form
10925a3790E6346K09614A24216B2385K35944l6914f471A65785D9971J36575b65037
10913a2646n8799D329a45820j14421i3037B26843a30917f1781E630J33421i463
10901a73135j22588a40406B16835h0534c3299j28769j12975q447c4252B09000
10890b25869Q6745J2012A95849i5854j23799j79328A12558d8492k60646a25264
10879C0336a3735A1729a49022P3719k8267A78644h7278K9610E5353K6840c20719
10867a45545D6097J60459l1182D7239a22655B23817J3261J06563j36262l384l667
10856B00328b82862a7337k4517j63242f0954I628J89402i1147A49988a12129c5316
10844a56116l9470D2349f9639j94132A81279n5136b15219d0821k34369C34063
$$ plain form
10833 -24996 246868 -63372 -53738 -81958 93390 -361765 73158 223924 -172057 -358360 176887
10821 -165347 -42325 133360 -315442 169338 -26609 -192450 -449386 -218842 9895 23348
10811 23348 -87952 204644 -124026 -85516 -99108 328984 -43260 213865 -337855 206662
10800 -253260 -131995 145419 215113 -265081 12334 -159119 -312843 -148412 -125228 -142031
10790 -142031 173473 -23334 8213 -251239 -124107 -130497 -155822 -101669 17197 -135222 -146633
10779 -146633 -109019 79042 -127306 -131744 -51908 -27223 -121377 -76938 81166 -86484 83549
10767 -238294 -25953 154065 34226 31400 -119756 -115856 -192038 -151008 409541 -190781 20433
10755 47337 47337 -165417 -60576 129041 84539 127350 26380 -287239 -5192 80968 188444 -81030
$$ packed form
10833b4996B46868f3372R634k8220I3390c61765G3158J50766a72057j86303A76887
10821a65347d2325A33360c15442A69338b6609j65841k56936b18842I895J3453
10811B3348h7952B04644a24026L8510j3592C28984d3260B13865c37855B06662
10800b53260J21265A45419O9694b65081A2334a59119j53724a48412K3184j6803
10790a42031A73473b3334H213b51239a24107o390k5325N4153A7197a35222j1411
10779a46633L7614G9042a27306m438e1908K4685r4154M4439H1166h6484H3549
10767b38294b5953A54065C4226k826a19756L900p6182M1030D09541a90781B0433
10755D7337%a65417f0576A29041m4502M2811B6380b87239e192H0968J07476h1030
$$ plain form
10742 -92181 12567 -266039 -159019 -182574 -71379 285266 81821 282090 -23526 -342052 -34584
10730 -38818 -39661 16864 69248 -240791 -156737 -181506 -96828 -467642 -342094 -176624 -59676
10718 157737 169341 191404 -128575 -170228 100474 102981 44494 98536 -209409 -42037 62797
10706 423677 269486 -710 139514 94580 466525 -237020 -20907 -75353 -22860 -277919 -291833
10695 -291833 86315 -183843 -89190 -50731 -51564 -171891 -32068 425076 108990 147343 -72657
10683 144512 -158000 -109892 116195 -255880 -208978 59308 -128579 284643 -420427 -320125
10673 -320125 60093 -324171 -508564 -125636 -18925 37844 39381 -17329 25635 8859 -62251
10661 -252328 -63580 179069 38711 95524 -14121 -145172 -152872 -157516 -114915 -196437 -107200
$$ packed form
10742i2181A2567b66039J07020k3555g1379B85266H1821K00269b3526l18526c4584
10730c8818q43A6864N2384b40791Q4054k4769Q4678l70814J25548J65470e9676
10718A57737J1604K2063a28575m1653A00474K507D4494N4042b09409d2037F2797
10706D23677j54191g10A39514m4934L71945b37020b0907n4446b2860k55059j3914
10695b91833H6315a83843h9190L8459q33j20327c2068D25076A08990L8353g2657
10683A44512a58000M8108A16195b55880M6902E9308a28579B84643d20427J00302
10673c20125F0093c24171j84393a25636a8925C7844J537a7329B5635H859f2251
10661b52328f3580A79069C8711N6813a4121j31051p700m644M2601q1522Q9237
$$ plain form
10650 -107200 -144610 -270849 183757 83182 201900 34893 -174843 -357675 -19524 190601
10639 10720 -35944 95444 -63869 -28538 -92773 -70991 96004 -76712 -31698 98348 3638 -258140
10626 -191855 -113392 70501 -220954 -263381 41309 -303289 109981 -116108 -313667 23764
10615 61678 82728 60117 -177336 55367 415416 -246262 -308189 199863 -38488 -168349 -129241
10604 -129241 -358133 -331339 -364492 95753 240907 189533 -271221 22480 -147643 59876 -15599
10592 -46102 299578 113098 -85293 132122 -16035 187336 -15712 -184690 43078 115420 -265780
10580 10386 31112 -228563 -78065 -17944 -330462 -67950 -240768 184870 -143545 -31667 229292
10568 -141836 -70215 139866 87842 161037 66848 191462 102975 41012 -243653 -404811 -234364
$$ packed form
10650a07200l7410j26239A83757H3182J18718C4893a74843j82832a9524A90601
10639A0720c5944I5444f3869b8538o4235K1782I6004g6712c1698I8348C638b58140
10626a91855P8463G0501b20954m2427D1309c03289A09981a16108j97559B3764
10615F1678K1050k2611a77336E5367L60049b46262o1927A99863c8488j29861L9108
10604a29241k28892K6794l3153I5753J45154n1374b71221B2480a47643E9876a5599
10592d6102B99578A13098h5293A32122a6035A87336a5712j68978D3078P2342b65780
10580A0386K0726b28563g8065a7944l12518f7950j72818A84870a43545c1667B29292
10568a41836g0215A39866n2024P3195F6848J24614q8487D1012b43653j61158J70447
$$ plain form
10557 -234364 14057 12784 63585 74444 161347 -344607 90161 -3343 -407491 59815 44732
10546 44732 -74182 -33621 -7480 -76481 -118790 -14122 182426 171082 15909 151938 78350
10535 78350 -42967 -399589 202312 -17558 77026 -136262 -31254 -184325 69051 244550 -130369
10523 -100938 -5176 55145 -106713 143435 -186755 121322 117933 -91859 -177223 80827 -289689
10511 -46418 -354382 -248978 -150509 -548932 120609 -70841 -42720 68927 -269395 35361 147411
10500 147411 107496 -132029 -122646 -75631 -49203 -118031 -87984 74092 -42544 -138920 69457
10488 -179426 -189027 28282 -234309 -132220 232999 -131528 -137105 -45001 180106 -171289 462365
10476 433317 147447 63884 -67429 129137 84096 -145458 69012 23163 56306 -176419 95164
$$ packed form
10557b34364A4057j273N0801J0859Q6903c44607I0161c343m04148E9815j5083
10546D4732g4182c3621g480o9001m2309a4122A82426j1344A5909J36029p3588
10535G8350d2967l56622B02312a7558G7026a36262c1254j53071F9051J75499a30369
10523a00938e176E5145a06713A43435a86755A21322l389i1859q5364H0827b89689
10511d6418l07964J05404R8469l98423A20609g0841K8121F8927b69395C5361J12050
10500A47411l9915a32029R383M7015K6428o8828L0047G4092d2544r6376F9457
10488a79426r601B8282b34309J02089B32999a31528n577d5001A80106a71289D62365
10476D33317A47447F3884f7429A29137m5041a45458F9012B3163L3143a76419I5164
$$ plain form
10464 -156285 123990 -384264 75275 -267993 38672 -41113 66711 -307027 25702 -256305
10453 107618 -61291 -272808 50728 -167401 -428754 37694 -307780 -12280 172333 -49503
10442 212838 -129986 -162445 -74493 -198483 -159173 -308340 71816 122055 -235251 -71756 -199364
10431 -199364 -122541 -226247 -176780 -393862 86223 -255387 130138 136136 139013 -8007 62590
10419 -146545 -33623 -166733 -132921 262518 -122815 193617 -171934 -194880 -361372 -44145
10408 39396 -307034 269131 6495 -65979 -71715 -344771 11890 100825 82045 139153 47992
10396 81997 88810 -146201 3362 36315 -158089 166704 345272 80847 119675 192628 -14749
10384 -16318 184209 145256 -18164 390998 -129743 297931 3812 261817 635478 545065 65669
$$ packed form
10464a56285A23990c84264G5275b67993C8672d1113F6711c07027B5702b56305
10453A07618f1291k11517E0728a67401k61353C7694c07780a2280A72333d9503
10442B12838a29986l2459g4493j23990L9310j49167G1816N0239b35251g1756j27608
10431a99364P6823j03706M9467k17082H6223b55387A30138N998K877h007F2590
10419a46545c3623j33110L3812B62518a22815A93617a71934k2946j66492d4145
10408C9396c07034B69131F495f5979n736k73056A1890Q8935j8780N7108D7992
10396H1997O813a46201C362L2953a58089A66704J78568H0847L8828P2953a4749
10384a6318A84209l8953a8164C90998a29743B97931C812K58005L73661r0413F5669
$$ plain form
10372 21376 16063 130542 315181 -52412 198486 313582 308688 572632 372948 539832 508801
10361 508801 354253 429743 445793 714911 249860 235941 173507 413573 434430 128487
10350 485671 489745 746584 709380 551417 539552 428386 426603 522994 207902 569535 291139
10339 291139 206774 234254 194297 334105 36042 163624 264129 -53992 251034 291443 223941
10328 223941 245376 -88268 -48274 36854 74131 235161 190558 12796 -304174 264493 578171
10317 578171 -139388 16320 46954 63605 -224651 -80455 -121382 75762 -182166 41450 -6052
10305 97103 -4123 -67945 83167 -125170 -171873 -64497 -147359 -159147 -177920 23704 -107014
10293 -46895 -84108 74063 -127308 -53779 -130487 15348 -30330 86229 -136710 -55107 195171
$$ packed form
10372B1376n313J14479J84639e2412A98486J15096m894K63944j99684J66884l1031
10361E08801j54548P5490J6050K69118B49860j3919o2434K40066K0857A28487
10350D85671M074K56839l7204j57963j1865j11166j783R6391B07902L61633k78396
10339B91139q4365K7480l9957J39808C6042J27582J00505e3992B51034M0409o7502
10328B23941K1435h8268L9994C6854L7277J61030m4603A2796c04174B64493L13678
10317E78171a39388A6320L0634J6651b24651h0455m0927G5762a82166D1450f052
10305I7103d123o3822H3167a25170m6703f4497q2862j1788j8773B3704a07014
10293d6895l7213G4063a27308e3779p6708A5348c0330H6229a36710e5107A95171
$$ plain form
10281 49484 -66529 88978 -101256 -97994 -313416 -119480 167949 -25851 -76234 78290 -126165
10269 94331 -52179 211358 7428 -185953 -126164 64553 -4981 200315 293381 -14832 95735
10257 70842 43654 443334 420870 473222 537050 211002 139447 448588 125046 -28668 144842
10245 226382 54070 143465 31645 -91068 -60619 21826 -246744 300072 196808 -264997 -221884
10234 -221884 161459 184699 -34111 -78295 -2756 -131432 451661 -72010 -21507 10713 -24274
10222 -302136 183026 136486 60098 284276 -322157 -84237 105547 255663 -65638 256572
10211 -72388 -145127 -278058 -14830 124838 -34093 146851 -344264 8821 -93704 -22299 217241
10199 144589 92917 15125 -207046 -194673 104434 -74957 -186243 65939 330579 210000
$$ packed form
10281D9484f6529H8978a01256L262k15422a19480A67949b5851n0383G8290a26165
10269I4331e2179B11358G428a85953N9789F4553d981B00315R3066a4832I5735
10257G0842k7188L99680k2464N2352O3828B11002p1555L09141A25046b8668A44842
10245B26382E4070Q9395C1645i1068L0449B1826b46744C00072j03264b64997M3113
10234b21884A61459K3240c4111m4184b756j28676D51661g2010b1507A0713b4274
10222c02136A83026m6540F0098K24178c22157h4237A05547J50116f5638B56572
10211g2388p2739j32931a4830A24838c4093A46851c44264H821i3704b2299B17241
10199A44589n1672A5125b07046J2373A04434g4957j11286F5939K64640j20579
$$ plain form
10189 210000 -28764 6430 240098 -35130 -100133 11348 593 -56993 153392 23883 -252373
10177 48153 -211669 -212682 -2755 -274693 -126852 -149623 -201316 116870 -17556 191729 -144925
10165 -176476 -177387 -70268 261557 -400738 114798 -141758 -55098 -98746 -130524 -73411 149066
10153 169866 -77103 -329466 -21148 -160708 -27747 -322445 -42966 -194362 -86523 190846
10142 -251733 -6560 -29333 185008 -134145 67242 172380 -113368 -123143 -253644 125068 -275451
10130 -39263 -32190 -360433 101684 68145 -157294 62850 -108278 69843 142680 148438 -12019
10118 29927 14906 -97923 -381120 121468 92819 -203909 100765 -186556 103018 -288949
10107 -89622 -6749 -87642 -104413 -2078 -308057 8728 36164 326138 -212800 -237996 -352347
$$ packed form
10189B10000b8764F430K33668c5130o5003A1348E93e6993A53392B3883b52373
10177D8153b11669j013b755k71938a26852k2771n1693A16870a7556A91729a44925
10165a76476r11g0268B61557d00738A14798a41758e5098m3648l1778N7113A49066
10153A69866g7103k52363b1148j39560b7747k94698d2966j51396h6523A90846
10142b51733f560k2773A85008a34145F7242J05138a13368r775j30501A25068b75451
10130c9263P073l28243A01684l3539a57294F2850a08278F9843P2837N758a2019
10118B9927A4906i7923k83197A21468k8649b03909A00765a86556A03018b88949
10107h9622f749q0893j6771b078l05979H728K7436K89974b12800k5196j14351
$$ plain form
10096 -352347 -275014 -57952 -364504 -202419 280350 9791 10672 112739 65495 114320 -113018
10084 286654 -373658 -273330 -271080 -161547 -147140 -22915 335445 269746 -438911 -113901
10073 -145670 138921 128561 -284891 34281 -138942 102343 -55231 3638 40243 188640 -126018
10061 4503 -156736 207809 -330501 -10763 -219453 -197823 -92022 43540 31963 66789 -142926
10049 -177607 -5838 238274 -363471 155683 -578737 -432751 -3164 -277026 -77008 108047
10038 173432 144102 64924 -25996 251792 -11211 8519 -320050 10041 -268953 -105804 19625
10026 -199211 -109051 -247959 180182 141386 -108876 -179909 -36206 -90125 105960 -125223
10015 36205 -214489 -260150 -174973 -53195 -459465 108300 -18210 -393983 -241414 182054
$$ packed form
10096c52347P7333e7952l06552J62085B80350I791Q81J02067m7244M8825a13018
10084B86654c73658J00328K250J09533J4407b2915C35445o5699d38911a13901
10073a45670A38921j0360b84891C4281a38942A02343e5231C638L6605J48397a26018
10061D503a56736B07809c30501a0763k08690K1630i2022D3540j1577L4826a42926
10049a77607e838B38274c63471A55683e78737J45986c164k73862g7008A08047
10038A73432k9330F4924b5996B51792a1211H519c20050A0041b68953a05804A9625
10026a99211R0160j38908A80182l8796a08876p1033c6206n3919A05960a25223
10015C6205b14489m5661Q5177e3195m06270A08300a8210l75773J52569A82054
$$ plain form
10004 -275673 71315 -102092 136115 51988 -302633 -170735 -201182 212061 26049 -319333
9993 366882 -263498 -198624 -32143 -304510 127918 160661 -173000 51486 87920 -103454 -228481
9982 -228481 93290 144434 -31767 -190952 -102792 116590 -13166 68719 -8808 116175 36588
9970 -60176 341772 -139568 41305 -164658 -276419 -285751 73081 -156237 117680 -18073 -93841
9959 -93841 137520 -190956 -193731 -81414 125263 -79894 -185226 -123637 -172760 -168338 159818
9947 -458415 81579 -353894 283470 501129 -158110 -47965 94867 -180215 40428 -133443
9936 -270673 132178 -24664 110585 -197909 -253731 -14893 -49731 -52036 19431 -69131 -9294
9924 -189411 -90582 -366131 -155811 -89457 -173570 -28396 -282330 -165681 -249751 -545 243232
$$ packed form
10004b75673G1315a02092A36115E1988c02633J31898l0447B12061B6049c19333
9993C66882b63498O4874c2143k72367A27918L2743a73000E1486L6434a03454j25027
9982b28481I3290N1144c1767j59185Q8160A16590a3166F8719h808A16175C6588
9970f0176C41772a39568D1305a64658j11761r332G3081a56237A17680a8073p5768
9959i3841A37520a90956k775h1414A25263g9894j05332O1589m9123M422A59818
9947d58415H1579c53894B83470K17659a58110d7965I4867a80215D0428a33443
9936b70673A32178b4664A10585a97909n5822a4893l4838k305A9431f9131i294
9924a89411i0582k75549a55811O6354q4113b8396k53934J16649q4070e45B43232
$$ plain form
9912 -66175 168961 14668 106057 -178129 -263254 206857 37179 18059 -58552 -45594 -295122
9901 -295122 -22139 73362 52466 -54044 -336598 -406899 -268404 -117775 -235483 136155 181959
9890 181959 -8836 -47130 -186854 -251628 -55687 88986 -57642 50951 -79635 -160118 -226054 -311424
9878 -311424 213587 67477 170422 -92920 -259970 -197848 -498845 -147723 -181905 -163291 -202693
9867 -202693 3472 -98760 66242 4685 65612 -526726 146557 115275 -248403 -80233 -138851
9856 -138851 -246386 35246 -118170 10832 -252319 51767 -186399 -413955 -104366 12029
9845 -130539 -264771 -124380 -194571 -135254 56446 1576 -64147 106719 148737 44521 -320446
9833 111880 -24284 -139227 -22771 -298432 -470411 -188776 -99086 -131704 -27574 -27711 -94284
$$ packed form
9912f6175A68961A4668R1389a78129q5125B06857C7179A8059e8552J2958k49528
9901b95122b2139G3362k0896e4044k82554p0301J38495a17775j17708A36155M5804
9890A81959h836l8294j39724o4774e5687H8986e7642E0951g9635q0483o5936q5370
9878c11424B13587F7477J02945i2920j67050O2122l00997a47723l4182J8614l9402
9867b02693C472i8760F6242D685O0927e26726A46557l1282b48403h0233n8618
9856a38851j07535C5246a18170A0832b52319E1767a86399k27556a04366A2029
9845a30539j34232a24380p0191N9317E6446A576f4147A06719M2018D4521c20446
9833A11880b4284j14943b2771k75661j71979a88776Q9690l2618b7574j37o6573
$$ plain form
9822 -94284 -3721 -281737 8305 -165881 -113371 -79580 -76215 -14316 -58082 240490 -20585 112443
9809 -6863 -257083 -95134 -154678 -10653 105129 -157488 44420 -46470 -52837 -26396 -36964 -58108
9797 -58108 255301 -70445 -80325 35872 228347 -72523 -263104 -90466 -32279 -36907 -141760
9786 -141760 -42089 -193293 -97245 181778 -39227 -40167 -444437 -448266 286029 -14290 49838
9774 -343333 -91379 148897 -234038 71985 -252196 -370207 -47575 -293139 -117773 -316300
9764 -316300 133 -271214 -149944 -212697 -15468 -26575 117485 88735 68324 124777 3814 -36366
9751 156784 -108428 -189541 -301777 210965 69090 129759 -60774 -142621 -87590 162539 -107383
9739 -125903 -131811 -473265 78362 63473 26165 24590 -323844 -80982 -46425 -43921 -79915 -259095
$$ packed form
9822i4284c721k78016H305a65881N2510L3791L365a4316m3766B40490b0585A12443
9809f863k50220i5134n9544a0653A05129a57488D4420d6470o367b6396j0568k1144
9797e8108B55301g0445r880C5872J92475g2523j90581i0466c2279m628j04853
9786a41760d2089j51204R6048A81778c9227r40m04270l829B86029a4290D9838
9774c43333i1379A48897b34038G1985b52196j18011d7575k45564a17773j98527
9764c16300A33b71214J21270o2753a5468j1107A17485k8750k0411N6453C814c6366
9751A56784a08428q1113j12236B10965F9090O0669f0774q1847N5031A62539a07383
9739a25903n908l41454G8362j4889B6165j575c23844h0982L4557K504l5994j79180
$$ plain form
9727 -259095 117953 286179 -182510 29307 -20802 -322723 -340334 -276765 -32360 281602 -92484
9715 105493 163475 -208483 -96543 -403 -100072 -52149 -223246 -207902 -95850 -224054 -36590
9703 -329089 203802 -46146 72539 100993 -12366 101891 57296 -129284 -117010 -218244 -167297
9692 -167297 162047 110437 591 -26267 165587 -48325 -157875 -29808 -478523 -15368 -38425
9681 -38425 -265526 -114934 86321 -88848 -194826 31283 -111817 -46883 -449709 9369 -533187
9669 -371752 151175 -78085 -313667 -70021 -427096 24808 97309 -13403 -47469 -228811 -46388
9657 -185041 -100249 -314939 -2491 -73018 -76776 -32628 -7893 -315748 -274818 193960 -243503
9645 102459 -21363 -282498 82692 283173 -117590 -7129 -46286 -71769 -1081 -478218 -299927
$$ packed form
9727b59095A17953J68226a82510B9307b0802l01921j7611O3569c2360B81602i2484
9715A05493N7982b08483i6543d03r9669M7923j71097J5344i5850j28204c6590
9703c29089B03802d6146G2539K8454a2366A01891m4595a29284J2274j01234N0947
9692a67297A62047n1610E91b6267A65587d8325j09550b9808m48715a5368k3057
9681c8425k27101a14934H6321h8848j05978C1283a11817d6883m02826I369e33187
9669c71752A51175g8085k35582g0021l57075B4808P2501a3403l4066j81342d6388
9657a85041Q4792k14690b491p0527l758c2628g893l07855M0930A93960b43503
9645A02459b1363k61135H2692K00481a17590g129l9157k5483a081m77137J78291
$$ plain form
9634 -299927 113360 -31926 201628 30065 -379558 -213020 -243830 133023 12181 125303
9624 125303 36171 -79069 -47909 -118698 -257068 -443544 -227477 -196143 -80205 -9681 -6458
9613 -6458 -235078 -253895 -296805 119563 56233 -80796 -30276 -340012 22105 27399 -108091
9601 12277 -74082 -167257 158278 -55767 129005 -75479 -81104 184972 -175879 21546 133315
9590 133315 -133062 189442 -365909 -202084 -267042 133604 -175869 50301 -201722 -293852
9580 -293852 -16250 -65496 125383 -23272 -216380 -36383 -60066 80281 341311 194580 -29383
9568 96881 -226468 3639 -136658 -10455 249946 -122902 31623 -199781 -20730 -20475 32233
9556 -10869 103467 -129718 -264041 82509 -92989 106641 -89959 132751 175741 -37951 -216393
$$ packed form
9634b99927A13360c1926B01628C0065c79558J66538l0810A33023A2181J13122
9624A25303C6171g9069L1160p0789j38370j86476K16067L1334h0205i681L223
9613f458k28620j8817m2910A19563E6233h0796c0276l09736B2105N294a08091
9601A2277g4082r3175A58278e5767A29005g5479n625A84972a75879B1546J11769
9590A33315a33062A89442c65909J63825o4958A33604a75869E0301b01722r2130
9580b93852a6250m9246A25383b3272j93108c6383k3683H0281K61030j46731b9383
9568I6881b26468C639a36658a0455B49946a22902C1623a99781b0730K55C2233
9556a0869A03467a29718j34323H2509i2989A06641h9959A32751M2990c7951j78442
$$ plain form
9545 -216393 -94374 271013 -106814 149371 172950 -175813 -16567 86309 266652 80724 25962
9533 -199120 -169277 -221880 13965 -250128 118153 -40726 40768 -166163 -178184 -99508 -36274
9521 -126773 -176073 -176804 341912 -330936 -12689 -133798 -234811 118930 -43736 194011 39497
9509 -60631 187440 -257518 -396056 67884 -306746 34741 -19753 -296174 -284635 -139964 91489
9497 -53634 122942 -66318 -318100 22157 -227324 196448 -159389 -159600 34359 -48635 37929
9485 104020 -180274 -254879 -123972 80076 -347462 -49206 -177998 -27493 -244740 80527 -42940
9473 -100293 -427919 47676 -170616 -193360 49816 39812 -151652 39454 -110691 166435 40141
9461 -113050 26914 -244157 62097 -84758 -126284 -242713 233601 12218 155500 -187678 32565
$$ packed form
9545b16393i4374B71013a06814A49371K3579a75813a6567H6309J80343H0724B5962
9533a99120K9843n2603A3965b50128A18153d0726D0768a66163j2021P8676c6274
9521a26773m9300p31C41912c30936a2689j21109j01013A18930d3736A94011C9497
9509f0631A87440b57518j38538F7884c06746C4741a9753k76421J1539a39964I1489
9497e3634A22942f6318k51782B2157b27324A96448a59389k11C4359d8635C7929
9485A04020a80274p4605a23972H0076c47462d9206j28792b7493k17247H0527d2940
9473a00293l27626D7676a70616k2744D9816j0004a51652C9454a10691A66435D0141
9461a13050B6914b44157F2097h4758m1526j16429B33601A2218J43282a87678C2565
$$ plain form
9449 11870 -42152 -286007 -386628 -103925 -91698 -357838 -215398 73238 -61585 158842 105532
9438 105532 72990 253887 -269596 287686 147640 110829 -328060 151007 253385 -248654
9427 116416 62932 34215 -147774 -119438 -99081 111284 -92817 -70347 250769 -201411 -140031
9416 -140031 232703 334548 58425 67895 -41197 -184383 56387 -273843 -239735 -101058 -49602
9404 -382129 -65316 99483 119923 128640 -317051 114061 216473 -80724 -98960 -75769 -239740
9393 -239740 -45671 -163990 250692 -159097 -128512 -242385 -143533 -422050 -115398 135677
9382 -86661 88101 93814 -53437 -173140 -41617 -145390 -324448 249974 203041 -46502 -94753
9371 -94753 226752 -295737 184242 255561 29160 33534 176754 -134322 -126842 -178610 -74616
$$ packed form
9449A1870d2152k43855j00621a03925J2227k66140J42440G3238f1585A58842n3310
9438A05532l2542J80897b69596B87686j40046l6811c28060A51007J02378b48654
9427A16416n3484k8717a47774K8336K0357A11284i2817K2470B50769b01411O1380
9416a40031B32703J01845E8425R470d1197j43186E6387b73843L4108a01058d9602
9404c82129f5316I9483K0440Q717c17051A14061J02412h0724j8236K3191j63971
9393b39740d5671j18319B50692a59097L0585j13873R8852k78517a15398A35677
9382h6661H8101N713e3437j19703d1617j03773j79058B49974m6933d6502m8251
9371i4753B26752b95737A84242P1319B9160M374J43220a34322P480n1768g4616
$$ plain form
9359 -28704 -124803 -256241 107737 187423 -392888 -200563 -370225 56136 -8305 275466 67307
9347 -125916 -258196 -141914 -84340 -112831 -289793 -82708 -232317 34353 39357 -196455 -38135
9335 120433 226421 -289380 -155968 -273417 12079 85087 90252 -29743 -86844 -108880 26223
9323 185995 -194476 -413233 -91771 115042 -261824 -93076 -331648 -200774 -261153 41845
9312 -57608 129029 37355 -236575 259642 -340561 63246 11265 7780 -198195 -103563 278618
9300 -193387 184311 -369393 -66154 145411 -30051 -68547 -109489 165295 164835 -267185 166891
9288 90604 20215 395046 105068 -122832 -415642 -207663 -101183 -216129 47797 59656
9278 59656 -159687 -161635 126921 74493 114127 -239181 -8623 -106325 -205761 -90020 -126608 -88671
$$ packed form
9359b8704r6099j31438A07737P9686c92888J92325j69662E6136h305B75466F7307
9347a25916j32280J16282N7574k8491j76962h2708j49609C4353N004a96455c8135
9335A20433J05988b89380J33412j17449A2079P3008N165b9743n7101k2036B6223
9323A85995a94476k18757i1771A15042b61824i3076k38572J30874o0379D1845
9312e7608A29029C7355b36575B59642c40561F3246A1265l485a98195R4632B78618
9300a93387A84311c69393f6154A45411c0051l8496m0942A65295m60b67185A66891
9288I0604B0215L74831A05068a22832k92810b07663a01183j14946D7797J1859
9278E9656a59687j948A26921n2428L9634b39181h623r7702r9436i0020l6588L7937
$$ plain form
9266 -88671 -172862 -92356 967 63525 -2048 150290 -243481 24624 49996 217854 -38980 236476
9253 12483 163846 67148 -154560 -252261 36054 -7066 -185987 -383073 133821 -108956 -1928
9241 -135 -56284 -217993 -240958 -182474 2415 86191 75567 346766 89885 165203 143822 130008
9229 130008 -151395 -141518 65226 40307 -162111 -148714 25244 -263783 -85607 -170835 -79260
9217 -345527 -223866 -246462 67896 100354 -226505 -19231 95925 -194973 -263361 -470263 94188
9205 53094 142536 241582 89719 -40330 -17270 383394 94709 108684 -174633 -189702 -244854
9194 -244854 -97270 -182907 58707 -30609 -300001 48736 -309448 -163369 -239542 -71182 -500454
9183 -500454 -10741 -523 95960 -129692 -105201 217323 -41433 130118 -215956 -196156 -137048
$$ packed form
9266h8671q4191Q0506I67O2558b048A50290b43481B4624K5372J67858c8980B36476
9253A2483J51363F7148a54560r7701C6054g066j78921j97086A33821a08956a928
9241a35n6149j61709k2965N8484B415Q3776j0624K71199H9885P5318k1381j3814
9229A30008a51395R877F5226k4919a62111J3397B5244b63783h5607q5228g9260
9217c45527J21661k2596F7896L2458b26505a9231I5925a94973o8388k06902I4188
9205E3094Q9442R9046H9719d0330a7270C83394I4709J3975a74633j5069n5152
9194b44854i7270q5637E8707c0609k69392D8736c09448J46079p6173g1182m29272
9183e00454a0741e23I5960a29692K4491B17323d1433A30118b15956J9800N9108
$$ plain form
9172 -137048 -72095 49737 -61601 -270698 -94134 221868 -131505 -217134 -142540 -252548 -315977
9161 -315977 -50048 -63468 -41314 132675 -311605 203967 319201 47742 -407654 41757 -357584
9149 -104968 30580 -25869 333388 171309 214264 -64755 -53252 -32133 83621 -180847 -102851
9138 -102851 -368717 -296916 -139976 -166974 -398264 13094 -22246 137613 -197678 -93899 -234320
9127 -234320 -100176 163100 -53201 -90649 -20620 -262167 -174014 -155291 297333 244345 -125630
9115 59678 -301700 -39948 -200887 65102 43780 40543 -66345 -44677 -134659 38135 -153331
9103 -50683 -117878 -337725 -133976 194519 -148279 68444 -97168 142935 -222596 45392 -354321
9091 -120848 -76581 -179661 -210897 93754 -180136 104213 -50408 -53373 192471 -359604 -346870
$$ packed form
9172a37048O4953D9737f1601k09097i4134B21868a31505q5629P4594j10008o3429
9161c15977e0048j3420K2154A32675c11605B03967J15234D7742d07654D1757c57584
9149a04968C0580b5869C33388j62079M2955f4755J1503K1119H3621a80847P7996
9138a02851k65866P1801a39976k6998k31290A3094b2246A37613a97678i3899j40421
9127b34320a00176A63100e3201l7448b0620k41547Q8153J8723B97333n2988a25630
9115E9678c01700c9948j60939F5102k1322l237f6345K1668q9982C8135a53331
9103e0683o7195k19847a33976A94519a48279F8444i7168A42935b22596D5392c54321
9091a20848M4267j03080l1236I3754a80136A04213e0408k965A92471c59604J2734
$$ plain form
9080 -346870 -129190 95305 -57340 -77612 -102679 -459400 -78101 -114252 151424 35966 -192174
9068 90593 201607 145407 71854 28170 53887 61859 -18499 -10310 95138 77511 -341246 -77088
9055 -230304 -246152 182485 -456515 124994 -160864 174293 159434 65551 71756 -6720 51388
9043 -97662 -216781 125618 79789 -13078 206163 14320 -23115 -269 -133841 -408014 -173335
9031 -271005 226215 -193950 -154630 64001 -45871 -302345 -107607 269505 -32308 -348651
9021 -348651 90677 -386056 -152835 6294 114547 96062 66371 -183218 -438211 94481 275417
9010 275417 -117280 70971 -211745 173513 -118216 68217 -21340 -315135 -144810 -151591 -256420
8999 -256420 -421056 -247761 65020 94262 108700 222639 -7432 -261147 67036 152586 -56457
$$ packed form
9080c46870a29190I5305e7340k0272k5067l56721g8101l6151A51424C5966a92174
9068I0593J11014n6200G1854B8170K5717P972a8499Q189I5138j7627c41246g7088
9055b30304j5848A82485d56515A24994a60864A74293j4859F5551O205f720E1388
9043i7662j19119A25618m5829a3078B06163A4320b3115b69j33572k74173a73335
9031b71005B26215a93950L9320F4001d5871k56474a07607B69505c2308l16343
9021c48651I0677c86056a52835F294J08253j8485k9691a83218k54993I4481J80936
9010B75417a17280G0971b11745A73513a18216F8217b1340k93795a44810o781j04829
8999b56420j64636J73295F5020K9242J4438J13939g432k53715F7036Q5550e6457
$$ plain form
8987 -270586 183147 -145676 -56585 -249120 -86595 -188393 35726 102971 -69431 -190770 -386623
8976 -386623 -9739 -314104 57302 -75334 247964 -455289 5391 -181667 2706 8079 331409
8965 331409 24166 -107231 -38766 164285 -43605 64748 -117318 55816 170991 618 300928
8954 300928 142512 86131 -156949 298548 142765 -88894 79784 -16603 -161771 -216456 -134353
8943 -134353 87722 -169031 -50022 -229257 44208 -29870 219385 21689 112560 -54877 540010
8931 81085 19641 127049 70500 -106420 -14330 53650 319693 212983 664036 1408099 4032338
8920 4032338 10988389 8441870 2220840 961065 257273 -139760 109576 204181 -171659
8910 -110723 31868 108304 15466 159474 24101 100230 286802 -262731 7466 -46452 71197
$$ packed form
8987b70586A83147a45676e6585j92535h6595j01798C5726O7245f9431j21339j95853
8976c86623i739l04365E7302g5334B47964d55289E391a81667B706N373L23330
8965C31409B4166a07231c8766A64285d3605F4748a17318E5816J15175F18L00310
8954C00928A42512n6381a56949B98548A42765h8894G9784a6603j45168n4685Q2103
8943a34353H7722a69031e0022j79235D4208b9870B19385B1689R0871e4877E40010
8931H1085A9641J07408n6549a06420a4330E3650K66043j06710M51053P44063K624239
8920D032338O956051k546519B220840I61065B57273a39760A09576R4605a71659
8910a10723C1868P6436A5466J44008B4101P6129J86572b62731G466d6452G1197
$$ plain form
8898 -250329 77839 95578 -194999 -107809 -46450 -287430 -320569 -137745 6365 -192366 -120429
8887 -120429 61663 166664 -104342 144809 15964 30605 88503 -66567 -66604 -27091 -74082 34690
8874 -270484 107731 34661 -183800 -96137 85147 181198 -196036 -270496 -344562 -4046 182631
8862 37158 109758 -134775 -305369 -70759 -25058 -234414 -231328 61806 -96063 -219281 288533
$$ packed form
8898b50329G7839J7739a94999Q7190d6450k40980l3139a37745F365a92366P1937
8887a20429F1663J05001a04342A44809A5964J4641N7898f6567l7b7091m6991C4690
8874b70484A07731C4661a83800Q7663H5147R6051a96036p4460p4066d046A82631
8862C7158P2600a34775j70594g0759b5058k09356L086F1806i6063j23218B88533
$$ [...]
##END NTUPLES=NMR SPECTRUM
##END=
