
##TITLE=AC1365_HAWAS12179_7163953_Rh0BGGhK0Q
##JCAMPDX= 6.0         $$ Bruker NMR JCAMP-DX V2.0
##DATA TYPE= NMR SPECTRUM
##DATA CLASS= NTUPLES
##ORIGIN= BRUKER
##OWNER= Administrator
$$ 1.72 TOPSPIN		Version 2.1
$$ 2013-01-30 02:18:33.065 -0500  Administrator@X
$$ Compression mode = diff/dup
##.OBSERVE FREQUENCY= 400.02188249412
##.OBSERVE NUCLEUS= ^1H
##.ACQUISITION MODE= SIMULTANEOUS (DQD)
##.ACQUISITION SCHEME= undefined
##.AVERAGES= 8
##.DIGITISER RES= 22
##SPECTROMETER/DATA SYSTEM= spect
##.PULSE SEQUENCE= zg30
##.SOLVENT NAME= COFFEE_meoh
##.SHIFT REFERENCE= INTERNAL, COFFEE_meoh, 1, 14.98509
##AUDIT TRAIL= $$ (NUMBER, WHEN, WHO, WHERE, PROCESS, VERSION, WHAT)
$$ ##TITLE= Audit trail, TOPSPIN		Version 2.1
$$ ##JCAMPDX= 5.01
$$ ##ORIGIN= Bruker BioSpin GmbH
$$ ##OWNER= Administrator
$$ $$ E:\/data/COFFEE/nmr/AC1365_HAWAS12179_7163953_Rh0BGGhK0Q/20/pdata/1/auditp.txt
$$ ##AUDIT TRAIL=  $$ (NUMBER, WHEN, WHO, WHERE, PROCESS, VERSION, WHAT)
(   1,<2013-01-30 02:18:24.721 -0500>,<Administrator>,<X>,<go>,<TOPSPIN 2.1>,
      <created by zg
	started at 2013-01-30 02:17:18.706 -0500,
	POWCHK enabled, PULCHK disabled,
       configuration hash MD5:
       86 BA 57 50 F2 9D 5C 9B 26 00 A9 28 5F 66 2E 89
       data hash MD5: 64K
       8D 7F 2C 46 0A 74 25 05 15 9C 76 7F 1F 7A EA 4C>)
(   2,<2013-01-30 02:18:27.800 -0500>,<Administrator>,<X>,<proc1d>,<TOPSPIN 2.1>,
      <Start of raw data processing
       efp LB = 0 FT_mod = 6 PKNL = 1 PHC0 = 0 PHC1 = 0 SI = 32K 
       data hash MD5: 32K
       C6 A3 E8 AE 1C 88 5F 05 99 9E 5C F2 91 2B 73 41>)
(   3,<2013-01-30 02:18:28.300 -0500>,<Administrator>,<X>,<proc1d>,<TOPSPIN 2.1>,
      <pk PHC0 = 100.5524 PHC1 = 0 
       data hash MD5: 32K
       C0 FB F7 10 2F FD EC B3 F0 D7 22 FB B8 15 55 62>)
(   4,<2013-01-30 02:18:28.518 -0500>,<Administrator>,<X>,<proc1d>,<TOPSPIN 2.1>,
      <abs ABSG = 1 
       data hash MD5: 32K
       8B 45 DA B6 C4 3A 6F DB 2D EA B3 BB 2E 96 BF 9B>)
(   5,<2013-01-30 02:18:28.675 -0500>,<Administrator>,<X>,<proc1d>,<TOPSPIN 2.1>,
      <abs ABSG = 2 
       data hash MD5: 32K
       A0 2B 69 7E 09 D7 29 D2 F0 1E 80 72 93 81 9E 39>)
(   6,<2013-01-30 02:18:28.831 -0500>,<Administrator>,<X>,<proc1d>,<TOPSPIN 2.1>,
      <abs ABSG = 3 
       data hash MD5: 32K
       2D 8D 89 D5 44 D3 5A 28 F7 97 D2 F8 EA FA E8 D9>)
(   7,<2013-01-30 02:18:29.018 -0500>,<Administrator>,<X>,<proc1d>,<TOPSPIN 2.1>,
      <abs ABSG = 4 
       data hash MD5: 32K
       A7 D7 7D B3 29 91 E1 E9 01 82 26 DD D4 79 4A DC>)
(   8,<2013-01-30 02:18:29.159 -0500>,<Administrator>,<X>,<proc1d>,<TOPSPIN 2.1>,
      <abs ABSG = 5 
       data hash MD5: 32K
       84 45 A7 88 75 A0 AD 20 1E CF AB B0 00 C3 F4 D6>)
$$ ##END=
$$ 
$$ $$ hash MD5
$$ $$ E5 61 44 ED 9D 08 0D EC B4 6A 14 0B 16 A4 4A 6B
##$RELAX= 
##$RELAX= 
##$RELAX= 
##$RELAX= 
##$RELAX= 
##$RELAX= 
##$RELAX= 
$$ Bruker specific parameters
$$ --------------------------
##$DU= <E:\>
##$EXPNO= 20
##$NAME= <AC1365_HAWAS12179_7163953_Rh0BGGhK0Q>
$$ [...]
150 150 150 150 150 150 150 150
##$TP07= 0
##$TPNAME0= <>
##$TPNAME1= <>
##$TPNAME2= <>
##$TPNAME3= <>
##$TPNAME4= <>
##$TPNAME5= <>
##$TPNAME6= <>
##$TPNAME7= <>
##$TPOAL= (0..7)
0.5 0.5 0.5 0.5 0.5 0.5 0.5 0.5
##$TPOFFS= (0..7)
0 0 0 0 0 0 0 0
##$TUNHIN= 0
##$TUNHOUT= 0
##$TUNXOUT= 0
##$USERA1= <user>
##$USERA2= <user>
##$USERA3= <user>
##$USERA4= <user>
##$USERA5= <user>
##$V9= 5
##$VALIST= <valist>
##$VCLIST= <CCCCCCCCCCCCCCC>
##$VD= 0
##$VDLIST= <DDDDDDDDDDDDDDD>
##$VPLIST= <PPPPPPPPPPPPPPP>
##$VTLIST= <TTTTTTTTTTTTTTT>
##$WBST= 1024
##$WBSW= 4
##$XGAIN= (0..3)
0 0 0 0
##$XL= 0
##$YL= 0
##$YMAX_a= 655470
##$YMIN_a= -554608
##$ZGOPTNS= <>
##$ZL1= 120
##$ZL2= 120
##$ZL3= 120
##$ZL4= 120
##$ABSF1= 14.98509
##$ABSF2= -5.573092
##$ABSG= 5
##$ABSL= 3
##$ALPHA= 0
##$AQORDER= 0
##$ASSFAC= 0
##$ASSFACI= 0
##$ASSFACX= 0
##$ASSWID= 0
##$AUNMP= <proc_prof1d_extract_pilot.lims>
##$AXLEFT= 0
##$AXNAME= <>
##$AXNUC= <1H>
##$AXRIGHT= 0
##$AXTYPE= 0
##$AXUNIT= <>
##$AZFE= 0.1
##$AZFW= 0.1
##$BCFW= 0
##$BC_mod= 0
##$BYTORDP= 0
##$COROFFS= 0
##$CY= 15
##$DATMOD= 1
##$DC= 0
##$DFILT= <>
##$DTYPP= 0
##$F1P= 0
##$F2P= 0
##$FCOR= 0.5
##$FTSIZE= 32768
##$FT_mod= 6
##$GAMMA= 0
##$GB= 0
##$INTBC= 1
##$INTSCL= 1
##$ISEN= 128
##$LB= 0
##$LEV0= 0
##$LPBIN= 0
##$MAXI= 10000
##$MC2= 0
##$MEAN= 0
##$ME_mod= 0
##$MI= 0
##$NCOEF= 0
##$NC_proc= -8
##$NLEV= 6
##$NOISF1= 0
##$NOISF2= 0
##$NSP= 0
##$NTH_PI= 0
##$NZP= 0
##$OFFSET= 14.98509
##$PC= 1
##$PHC0= 100.5524
##$PHC1= 0
##$PH_mod= 1
##$PKNL= yes
##$PPARMOD= 0
##$PPDIAG= 0
##$PPIPTYP= 0
##$PPMPNUM= 2147483647
##$PPRESOL= 1
##$PSCAL= 4
##$PSIGN= 0
##$PYNMP= <proc.py>
##$REVERSE= no
##$SF= 400.02
##$SI= 32768
##$SIGF1= 0
##$SIGF2= 0
##$SINO= 400
##$SIOLD= 32768
##$SPECTYP= <>
##$SREGLST= <1H.CDCl3>
##$SSB= 0
##$STSI= 32768
##$STSR= 0
##$SW_p= 8223.68421052631
##$SYMM= 0
##$S_DEV= 0
##$TDeff= 65536
##$TDoff= 0
##$TI= <>
##$TILT= no
##$TM1= 0
##$TM2= 0
##$TOPLEV= 0
##$USERP1= <user>
##$USERP2= <user>
##$USERP3= <user>
##$USERP4= <user>
##$USERP5= <user>
##$WDW= 1
##$XDIM= 32768
##$YMAX_p= 453792931
##$YMIN_p= -668129
##$CURPLOT= <Network HP LaserJet P1505>
##$CURPRIN= <$Network HP LaserJet P1505>
##$DFORMAT= <normdp>
##$LAYOUT= <+/1D_H.xwp>
##$LFORMAT= <normlp>
##$PFORMAT= <normpl>
##$SURQMSG= 1
$$ End of Bruker specific parameters
$$ ---------------------------------
##NTUPLES= NMR SPECTRUM
##VAR_NAME=  FREQUENCY,     SPECTRUM/REAL,   SPECTRUM/IMAG
##SYMBOL=    X,             R,               I
##VAR_TYPE=  INDEPENDENT,   DEPENDENT,       DEPENDENT
##VAR_FORM=  AFFN,          ASDF,            ASDF
##VAR_DIM=   32768,         32768,           32768
##UNITS=     HZ,            ARBITRARY UNITS, ARBITRARY UNITS
##FACTOR=    0.250966925370066, 1,           1
##FIRST=     8223.43324360094, -180001,      -141233
##LAST=      0,             -138120,         -252502
##MIN=       0,             -668129,         0
##MAX=       8223.43324360094, 453792931,    0
$$ Real data points
##PAGE= N=1
##DATA TABLE= (X++(R..R)), XYDATA
$$ [...]
$$ plain form
19481 -217872 -384094 -6443 290236 -105015 -299845 -142770 27859 -163432 -204673 -30094
19470 -256913 182412 199554 9044 49536 -171412 112318 -139581 -74608 -50156 -134120 90556
19458 160496 -52773 77426 -46285 -168844 -236425 -216461 -46831 -234685 102197 -332541 13514
19446 205112 -189265 157265 -287039 113462 233264 40644 -164077 -208220 -137199 37273
19435 10238 270330 -47003 -59214 -251179 -342900 -190676 26110 24022 -79348 -169088 138569
19423 -114696 45992 83510 -221561 -289528 -105734 68597 -4860 -77685 -69121 4394 -8688 122519
19410 -132762 -132743 -212188 -36926 -34752 41395 48338 -84240 -161580 25167 229302 -21939 -139213
19398 -139213 49902 81386 -99595 138433 -409965 -178194 -117595 -252949 398689 -71710
$$ packed form
19481b17872j66222f443B90236a05015j94830a42770B7859a63432m1241c0094
19470b56913A82412J7142I044M0492a71412A12318a39581O4973K4452q3964I0556
19458A60496e2773G7426d6285j22559o7581J9964d6831j87854A02197c32541A3514
19446B05112a89265A57265b87039A13462J19802D0644a64077m4143P1021C7273
19435A0238K60092d7003j2211j91965r1721J52224B6110k088g9348q9740A38569
19423a14696D5992L7518b21561o7967a05734F8597d860p2825Q564D394h688A22519
19410a32762J9p9445c6926K174D1395O943h4240p7340B5167K04135b1939j17274
19398a39213D9902L1484i9595A38433d09965a78194O0599j35354C98689g1710
$$ plain form
19387 -336651 122325 -176629 158003 122805 -40630 -247194 112165 -117693 -296949 460107
19376 -60407 -9862 -12970 70716 -133389 -72407 -82281 43617 334290 -96859 51336 -276649 -11430
19363 82807 -69009 7774 144588 -110199 -151105 6222 211183 -325789 -227062 26672 448675
19352 448675 -33402 -65778 -135718 -196035 -207400 -95964 -348477 297626 -99042 -256391 -404899
19341 -404899 -45979 -28079 47180 -202999 26223 90707 -139443 36378 298212 80507 -254122
19329 -203171 -94334 -96758 -70698 -292765 -183664 31462 12490 -40092 59354 38461 133026
19318 133026 -77160 -295699 -36169 121052 -347799 70360 -101570 154418 -114044 -175451
19308 -175451 -301785 -88599 102193 -272671 -370578 137679 -176109 -285949 186974 54898
$$ packed form
19387c36651A22325a76629A58003l5198d0630k06564A12165a17693j79256D60107
19376f0407i862l108G0716a33389O0982r874D3617K90673i6859E1336b76649a1430
19363H2807f9009G774J36814a10199m0906F222K04961c25789R8727B6672M22003
19352D48675c3402l2376o9940o0317j1365i5964k52513B97626i9042j57349j48508
19341d04899d5979J7900D7180b02999B6223O4484a39443C6378K61834H0507b54122
19329b03171i4334k424K6060k22067J09101C1462A2490d0092E9354k0893R4565
19318A33026g7160k18539c6169A21052c47799G0360a01570A54418a14044o1407
19308a75451j26334h8599A02193b72671r7907A37679a76109j09840A86974E4898
$$ plain form
19297 -344826 -1700 -134510 235912 -253515 -313460 -33532 -159453 -329161 292421 68916
19286 -278246 -264781 190283 -275162 -57579 133346 97731 120491 86824 242275 15811 258487
19275 258487 -279082 -133582 -183332 -108928 -280012 -265078 -3826 -59923 -394575 -21546 -401488
19264 -401488 -128597 53997 -14395 -201110 -182020 -64295 -233178 -42177 9963 -43041 16623
19252 84364 4409 -44332 -14746 62210 65306 -385662 -208679 -265234 244186 -67229 -336982
19241 -336982 190369 -347316 -278813 -6036 214391 -76633 -82748 79627 -33003 -116722 -42201
19229 42680 -337899 185868 213426 -159873 249686 -82704 -212722 -60904 261688 -165990
19218 -138392 -157108 -320226 -30253 372012 -46088 -176274 -102669 -50692 -162531 -444790
$$ packed form
19297c44826a700j32810B35912b53515n9945c3532j25921j69708B92421F8916
19286b78246J3465A90283b75162e7579A33346l5615K2760l3667J55451A5811K42676
19275B58487b79082a33582m9750P4404j71084J4934c826n6097l34652b1546l79942
19264d01488a28597E3997a4395j86715J9090f4295j68883d2177I963d3041A6623
19252H4364D409d4332a4746F2210L096c85662J76983n6555B44186f7229k69753
19241c36982A90369c47316O8503f036B14391g6633o115G9627c3003q3719d2201
19229D2680c37899A85868K7558a59873B49686h2704j30018f0904B61688a65990
19218a38392j8716j63118c0253C72012d6088j30186P3605e0692j11839k82259
$$ plain form
19208 -444790 -20594 7837 -221881 -216504 22323 -234081 -150905 179743 -170148 132886 -265490
19196 -291416 -176447 -34683 -14919 -192997 -308283 -4836 -196553 -134282 -343762 -138028
19185 -248272 -444772 -110481 -22857 -198946 80933 -423952 -422505 118619 67899 -63617 -64986
19174 -64986 -110556 -60611 -85719 2126 -276962 30568 86036 -39987 161937 68150 -227518
19162 -322513 -221374 -324895 180291 -349363 118417 200830 -70754 -105115 -99160 -171211 -187558
19151 -187558 -115437 -201900 18282 -264875 263172 -53362 -286666 4708 8397 145647 46178
19139 133473 141742 -163509 -155456 -31028 -186020 90037 -150603 -229288 -88892 -254840 -135735
19128 -135735 2490 39384 -505995 -126445 7980 242157 -147693 78053 52478 -155 162838
$$ packed form
19208d44790b0594G837b21881N377B2323b34081Q3176A79743a70148A32886b65490
19196b91416J14969c4683a4919j78078j15286d836j91717O2271k09480a38028
19185b48272j96500a10481b2857j76089H0933d23952J447A18619n0720f3617j369
19174f4986m5570M9945k5108B126b76962C0568N5468c9987A61937F8150b27518
19162c22513J01139j03521A80291c49363A18417Q2413g0754l4361N955p2051j6347
19151a87558P2121q6463A8282b64875B63172e3362k33304D708L689J37250D6178
19139A33473Q269a63509Q053c1028j54992I0037a50603p8685h8892j65948J19105
19128a35735B490L6894e05995a26445G980K34177a47693G8053k5575a55A62838
$$ plain form
19116 330431 -316882 40223 375112 -138815 382044 -211383 -83806 127149 -353359 -75129
19105 -292496 224363 69135 125626 17870 86700 170998 -368239 101136 -280264 -236751 -152892
19094 -152892 -15859 -14154 -76280 -317052 178466 -32653 -8014 473559 -68658 60613 -23232
19082 -77395 152335 -201097 -100213 -92700 -409723 -48437 68394 -100810 -167396 -182858 36922
19070 97071 346375 164696 -3165 30002 -38393 23950 12223 334448 52949 -148661 163993
19058 142232 -63012 71496 134129 165652 -14714 -422497 36584 -153069 202488 -28275 -22549
19047 -22549 -162288 -126340 13397 207839 -284139 -309997 15585 -113338 -216142 35929 -52025
19035 70261 -52507 253343 154638 -31582 -53957 -272863 176685 -119316 38815 -84015 368841
$$ packed form
19116C30431c16882D0223L34889a38815C82044b11383h3806A27149c53359g5129
19105b92496B24363F9135N6491A7870O8830Q4298c68239A01136b80264M3513Q3859
19094a52892a5859J705o2126k40772A78466c2653h014D73559f8658F0613b3232
19082g7395A52335b01097a00213P513l17023d8437F8394a00810o6586j5462C6922
19070I7071K49304A64696c165C0002c8393B3950j1727L22225E2949a48661A63993
19058A42232f3012G1496O2633L1523a4714m07783C6584a53069B02488b8275N726
19047b2549j39739L5948A3397J94442b84139k5858A5585a13338j02804C5929e2025
19035G0261e2507B53343r8705c1582k2375k18906A76685a19316C8815h4015C68841
$$ plain form
19023 127300 -190889 -119519 250836 -33580 23315 106476 -94982 -212990 29742 -63667 -162832
19012 -162832 -312007 -150849 261797 -22427 81941 -13220 149895 -19192 108274 -162496
19001 -36899 130124 -253727 -157846 1038 92354 180494 -113743 -134097 330739 3 248627 -34658
18988 -311585 -233576 -61955 42210 -225374 -20175 -40969 -259321 -201870 -255294 -33254 82504
18976 -221887 287900 -2448 -154216 -74511 210564 119297 116250 382547 459016 -12137 326440
18964 249369 885 -82896 -53621 349322 -13521 57762 -113231 100496 -211214 68323 63269
18953 63269 63048 4503 13029 86952 200966 -465380 -141109 228447 251030 -74785 -408931
18942 -408931 -17275 -131238 -119849 -832 -66083 -23924 32715 -299787 -130919 -195140 -220791
$$ packed form
19023A27300a90889P1370B50836c3580B3315Q3161i4982j18008B9742f3667r9165
19012a62832j49175a50849B61797b2427H1941a3220A49895a9192A08274a62496
19001c6899A30124b53727R5881A038R1316Q8140a13743k0354C30739CK48624c4658
18988c11585P8009f1955D2210b25374b0175k0794k18352N7451n3424c3254H2504
18976b21887B87900b448j51768g4511B10564r1267l047K66297P6469a2137C26440
18964B49369H85h2896K9275C49322a3521E7762a13231A00496b11214F8323n054
18953F3269k21D503Q526P3923J14014d65380a41109B28447K2583g4785l34146
18942d08931a7275j13963J1389h32o5251b3924C2715b99787a30919o4221k5651
$$ plain form
18931 -220791 244343 -147947 55328 -221030 25705 49757 163915 120768 -72148 -87800 148107
18919 30568 43453 -40127 -61926 -11229 86184 -90362 -79850 348881 51840 45525 -252224
18907 -223974 297384 228174 295795 -59031 -74870 -209718 95658 446187 149289 339518
18897 339518 -82934 -30670 -76949 -224137 -113008 131759 -58435 8273 90081 -137460 103322
18885 -3487 -216261 43895 -198220 192343 -271261 -10125 368082 -152513 -56462 118046
18874 -116797 -142576 -82399 -109183 47256 16935 -102858 87654 -259455 -322432 -246817 173455
18862 165690 -254803 -55131 -273228 -140421 -53079 -27262 -48449 32461 -5554 -154519 -197503
18851 -197503 -374123 -9745 -45753 148939 422756 104222 43952 -200770 -132387 -79047 -254514
$$ packed form
18931b20791B44343a47947E5328b21030B5705K4052J14158m3147g2148j5652A48107
18919C0568J2885d0127k1799a1229H6184i0362J0512C48881E1840o315b52224
18907b23974B97384o9210O7621e9031j5839j34848I5658L50529A49289J90229
18897C39518h2934c0670m6279j47188J11129A31759e8435H273Q1808a37460A03322
18885c487k12774D3895a98220A92343b71261a0125C68082a52513e6462A18046
18874a16797k5779O0177k6784D7256A6935a02858H7654b59455o2977P5615A73455
18862A65690b54803e5131k18097J32807e3079K5817k1187C2461e554j48965m2984
18851a97503j76620i745l6008A48939K73817A04222D3952b00770O8383N3340j75467
$$ plain form
18840 -254514 -190101 101459 -63907 106122 -134479 -349256 245228 -72734 -107478 -48085
18829 187965 215629 -303268 -117174 19339 253943 -50359 -331927 -112409 -115537 149827
18818 9078 -114144 349248 -102850 -192727 5164 264576 -46437 -119465 13657 30513 218054
18807 218054 304472 -267816 84769 109846 -174848 -14325 266093 150146 -210233 59738
18796 141208 105644 253922 15737 -98958 -220458 -27069 -172855 130477 328082 -397812
18785 135721 4973 -271889 399267 -110122 -101060 -234732 -173254 113723 -104051 -81072 71535
18773 -460838 127821 6833 -49159 126636 70490 -244565 -186047 -70444 -191609 94218 -94554
18761 -53916 -189920 186032 -118328 11743 -390951 -43060 -97339 -327891 -4873 -62254 -142221
$$ packed form
18840b54514O4413A01459f3907A06122a34479k14777B45228g2734l4744d8085
18829A87965K7664c03268a17174A9339K34604e0359k81568a12409l128A49827
18818I078a14144C49248a02850q9877E164K59412d6437p3028A3657J6856J87541
18807B18054Q6418b67816H4769K5077a74848a4325B66093j15947b10233E9738
18796A41208l5564J48278A5737i8958j21500b7069j45786A30477J97605c97812
18785A35721D973b71889C99267a10122R062j33672O1478A13723a04051K2979G1535
18773d60838A27821F833d9159A26636n6146b44565N8518g0444j21165I4218i4554
18761e3916j36004A86032a18328A1743c90951d3060n4279k30552d873n7381p9967
$$ plain form
18750 -142221 53290 39059 187301 -121413 -213037 -113294 229922 268191 -518293 -76112 -259569
18739 -259569 42027 279501 32411 -14781 -442565 169842 -196399 2410 -182304 62201 -6765
18727 -431217 -8750 -189548 159288 -35511 63228 -20712 59913 -206092 176701 -212987 -190340
18716 -190340 215648 -180636 72152 -29271 123966 62701 61738 -206559 97919 -34982 20715
18704 -5950 -39601 -64766 -81901 17457 199891 42126 -11932 126503 -55420 -123843 52599
18692 215525 252980 -119707 -179213 -32065 219151 132423 -295823 -189256 64993 242290
18682 242290 -164452 -54825 -274596 -293595 -90836 13781 -83625 -277481 -158387 -26356 35673
18670 -94888 163405 -335331 -9416 -13591 -198275 -246441 63123 163944 -24221 63274 11411
$$ packed form
18750a42221E3290j4231J48242a21413r1624R9743B29922L8269e18293g6112j83457
18739b59569D2027K37474C2411a4781m27784A69842a96399B410a82304F2201f765
18727d31217h750j80798A59288c5511F3228b0712E9913b06092A76701b12987K2647
18716a90340B15648a80636G2152b9271A23966o1265r63b06559I7919c4982B0715
18704e950l3651k5165j7135A7457J82434D2126a1932A26503e5420o8423E2599
18692B15525L7455a19707n9506c2065B19151q6728b95823J06567F4993J77297
18682B42290a64452e4825k19771j8999i0836A3781h3625j93856J19094b6356C5673
18670i4888A63405c35331i416m175j84684m8166F3123J00821b4221F3274A1411
$$ plain form
18658 131539 35605 -174169 -144134 -192882 -93472 127259 13310 82415 -109227 -471691 -48837
18646 -123519 -143901 -204224 -168447 -157084 -251647 -2168 -19691 389647 23310 -285666 -45518
18634 -129096 7339 84466 -41577 -210237 -47081 -14594 -282784 -133394 77535 153429 72330
18622 70482 -218983 81111 -40356 26830 -88768 -308414 202364 -24953 -180109 -3963 -403643
18611 -403643 -101303 38782 -61141 -225224 98872 -79709 -293158 -76823 -13012 -424911 -84489
18599 -164406 -189929 267127 -52812 -154872 137771 -160759 93717 -117978 -102033 -173314
18589 -173314 -283972 -531871 87201 -99907 -3394 63656 59081 -300291 -5859 -46288 63431
18577 -96205 -189599 69908 -33724 108351 144612 -255071 -105738 -92273 -59355 -126725 -261462
$$ packed form
18658A31539C5605a74169L0035m8748i3472A27259A3310O9105a09227l62464d8837
18646a23519k0382o0323L5777J1363r4563b168j7523C89647B3310b85666d5518
18634a29096G339P7127d1577j68660d7081a4594k68190a33394G7535P5894G2330
18622G0482b18983H1111d0356B6830h8768k19646B02364b4953j55156c963l99680
18611d03643a01303C8782f1141j64083I8872g9709k13449g6823a3012m11899h4489
18599a64406k5523B67127e2812j02060A37771a60759I3717a17978J5945p1281
18589a73314j10658k47899H7201i9907c394F3656m575c00291e859m0429F3431
18577i6205r3394F9908c3724A08351L6261b55071a05738J3465L2918o7370j34737
$$ plain form
18566 -261462 53009 -98021 150531 54383 -95574 2618 -143357 236444 -394577 -127620 144817
18554 -375517 71986 -114018 226441 -149527 62213 -269748 -106567 155876 -176084 -217068
18544 -217068 109961 -30245 308467 143653 -165899 -119415 -71082 10844 -124666 101442
18533 -397825 -101084 -103831 -60445 97336 -206815 -127314 149550 -22275 -16544 -179858 -60243
18521 -229748 -177231 -1083 -33449 45934 -124596 -92534 -236151 -281435 70416 -73157 87504
18509 -25701 -165943 72530 -168931 -136390 -11931 -217794 -232336 -118426 -89671 -60651 -201243
18498 -201243 288131 196486 31574 96131 -24804 -333403 -5815 125947 -175391 34759 -182552
18486 -107501 13482 -138012 85966 193941 227822 -283052 225857 205331 -258115 -41508
$$ packed form
18566b61462E3009i8021A50531E4383i5574B618a43357B36444c94577a27620A44817
18554c75517G1986a14018B26441a49527F2213b69748a06567A55876a76084m0984
18544b17068A09961c0245C08467A43653a65899M6484M8333A0844a24666A01442
18533c97825a01084k747M3386I7336b06815P9501A49550b2275N731j63314f0243
18521b29748N2517a083l2366D5934a24596L2062j43617m5284G0416g3157H7504
18509b5701j40242G2530a68931L2541a1931k05863j4542J13910K8755K9020j40592
18498b01243B88131r1645C1574O4557b4804l08599e815A25947a75391C4759a82552
18486a07501A3482a38012H5966J07975L3881b83052B25857k0526b58115d1508
$$ plain form
18475 -132397 -28733 -221286 344543 -146423 -141397 13148 -79585 318030 160862 -54680 303188
18463 -414526 -57921 276644 -10088 271936 -17061 -177326 271276 -392557 -156989 -128857
18453 -128857 81115 -115894 173231 -137381 -208030 393119 -138712 23971 -259952 89 -183110
18441 -150561 -190396 25541 65555 -431176 -259182 243528 34165 -318975 -233934 31748 24746
18430 24746 -154788 -221845 -102964 -278947 -149320 222905 27524 51283 -153363 -103145
18420 -103145 -15642 158337 -124435 -105343 93316 253682 -95739 -36563 -45421 135158 -81642
18408 -28664 25266 25996 -132741 384172 78309 102446 -215259 209871 122050 -160573 -61588
18396 -46029 -143884 -49506 112072 92046 -132531 -76953 -217854 -370334 -368588 113478 144430
$$ packed form
18475a32397b8733j92553C44543a46423N026A3148g9585C18030j57168e4680C03188
18463d14526e7921B76644a0088B71936a7061j60265B71276c92557a56989K8132
18453a28857H1115a15894A73231a37381p0649C93119a38712B3971b59952H9a83110
18441a50561l9835B5541M0014d31176J71994B43528C4165c18975Q5041C1748p002
18430B4746a54788o7057a02964j75983J29627B22905B7524K3759a53363N0218
18420a03145a5642A58337a24435J9092I3316J60366i5739c6563q858A35158h1642
18408b8664B5266P30a32741C84172G8309K4137b15259B09871q7821a60573f1588
18396d6029r7855d9506A12072k0026a32531N5578j40901j52480J746A13478L0952
$$ plain form
18385 144430 -198709 17540 -77556 -174156 -318914 79779 -45949 259904 -19512 -20678 141620
18373 -248528 -118083 22494 128135 165482 24159 -200539 133448 178727 139029 -20452 9399
18361 -327730 -106476 -3784 -222309 270659 -44614 -263080 -77125 -18529 -133125 -62540 71783
18349 -27991 -232036 -5761 -205691 -230671 -117899 37616 -145726 -339812 -141212 -72788 -20194
18337 42276 209097 198279 -123955 -85572 -684 304061 15484 59281 188297 276398 -239971
18325 62709 -142460 155961 69216 -52360 -21753 41079 102947 -148817 -194511 -442776 108571
18313 61427 275949 -132531 -5959 -207352 71050 189984 -160204 -136666 3838 -2821 168965
18301 84083 -162465 -65083 -98831 272358 -284611 22484 -81176 76497 -66678 -42043 -49530
$$ packed form
18385A44430a98709A7540g7556r6600j44758G9779d5949B59904a9512j166A41620
18373b48528a18083B2494J05641L7347B4159b00539A33448M5279l9698b0452I399
18361c27730a06476c784k18525B70659d4614k18466g7125a8529j14596f2540G1783
18349b7991k04045e761j99930k4980J12772C7616a45726j94086a41212O8424b0194
18337D2276J66821j0818a23955L8383f84C04061A5484M3797J29016Q8101b39971
18325F2709a42460A55961F9216e2360b1753D1079O1868a48817m5694k48265A08571
18313F1427K14522a32531e959k01393G1050J18934a60204K3538C838b821A68965
18301H4083a62465f5083l3748B72358b84611B2484h1176G6497f6678K4635p487
$$ plain form
18290 -49530 -161410 27300 -75337 -200168 -126925 -384242 -396435 -118032 119762 -50451 -165592
18279 -165592 373758 -20117 -97963 -305864 18955 -192042 169032 86283 168900 -182774
18268 -388134 -21679 194494 42066 -71131 -301655 8704 -270048 -19382 -58402 -16793 -429254
18257 -429254 161858 -146642 -71127 -3630 125588 -10244 -33537 -176244 -25361 -282615 -464602
18246 -464602 -350285 -49189 230944 -230720 118202 -71572 -181588 -102064 -62616 -38814
18236 -38814 -371575 122078 49389 165572 -53251 -175738 18031 -30439 -98711 -257917 242270
18224 -159873 291946 -6060 -71053 -63448 -298103 20841 -82441 -101628 43209 -187297 -76666
18212 36886 -53822 235489 -108042 50243 112652 -176900 139199 -191540 -180990 -29091 -185957
$$ packed form
18290d9530j11880B7300g5337j24831P3243k57317j2193a18032A19762e0451j15141
18279a65592C73758b0117p7846k07901A8955a92042A69032q2749Q2617a82774
18268c88134b1679A94494D2066g1131k30524H704b70048a9382l9020a6793m12461
18257d29254A61858a46642g1127c630A25588a0244k3293j42707b5361k57254j81987
18246d64602J14317d9189B30944b30720A18202g1572j10016P9524L9448K3802
18236c8814l32761A22078D9389J16183e3251j22487A8031c0439o8272j59206B42270
18224a59873B91946f060o4993P605k34655B0841h2441j9187D3209a87297g6666
18212C6886e3822B35489a08042E0243O2409a76900A39199a91540J0550b9091j56866
$$ plain form
18201 -185957 -321740 43146 102670 -219772 83242 181748 63455 2210 155276 -49822 247253
18189 -136943 -48716 136760 -120596 -34257 244253 108212 -46524 -70985 167636 -66167
18178 -139789 89574 -176376 -120899 -50914 100327 86299 -185518 -8493 -18281 125302 -150294
18166 -50977 -317140 -124969 -222739 5894 -332176 176650 -202294 -102399 -31261 56147 -61203
18154 -245955 -38854 330217 36899 -83194 -97113 107478 -326768 964 52394 -69276 179451
18142 -374639 216560 27891 -9894 -133593 12027 15158 248200 382113 -239159 67313 -106925
18130 94328 -223217 -133101 -56519 -122830 -54582 -205846 -1714 -36660 19649 -287906 11495
18118 -157657 109254 -37593 -76575 -40078 -119345 -14192 196980 49328 -228511 24757 192095
$$ packed form
18201a85957j35783D3146N9524b19772H3242R8506F3455B210J53066d9822B47253
18189a36943d8716A36760a20596c4257B44253A08212d6524k4461A67636f6167
18178a39789H9574a76376N5477e0914A00327j4028a85518h493r788A25302a50294
18166e0977k66163a24969r7770E894c32176A76650b02294R9895c1261E6147f1203
18154b45955c8854C30217C6899h3194j3919A07478c26768I64N1430f9276A79451
18142c74639B16560B7891i894j23699A2027L131K33042J33913b39159F7313a06925
18130I4328b23217R0116e6519o6311e4582j51264a714l4946A9649b87906A1495
18118a57657A09254c7593l8982L6497p9267a4192A96980D9328b28511B4757J67338
$$ plain form
18107 192095 -84215 -14208 -39187 -383739 78189 64075 -210821 59975 358474 -82950 -436388
18096 -436388 8703 103857 15084 -1950 -59716 -155530 -204037 79335 41032 -174438 72474 -172054
18083 -87192 286992 -325092 117090 -17224 7330 -466513 -121631 -168911 -169082 207651 -188308
18071 166292 -81047 -365798 4307 -204513 -289574 142344 -120169 158204 28060 155706
18061 155706 199719 -256295 -23991 125114 -72247 -109561 -82853 -197276 -18612 24356 114292
18050 114292 -84521 -99930 -106469 -100188 -193507 -189771 -68174 -224356 -200177 -75003 -75959 -175696
18038 -175696 170846 -124277 51199 -112448 23269 208538 -123922 68100 -29356 -49859
18028 -49859 -2695 -27938 93540 53955 -34491 -43727 -268725 -203417 27707 28828 -95070 -44499
$$ packed form
18107A92095h4215a4208k4979l44552G8189j4114b10821E9975K98499h2950l53438
18096d36388H703R5154A5084a950n7766r5814m8507G9335l8303a74438G2474a72054
18083h7192B86992c25092A17090a7224G330d66513a21631m7280j71B07651a88308
18071A66292h1047k84751D307b04513q5061A42344a20169A58204B8060J27646
18061A55706M4013b56295b3991A25114g2247l7314K6708j14423a8612B4356Q9936
18050A14292h4521j5409o539O281r3319L736f8174j56182K4179g5003r56r9737
18038a75696A70846a24277E1199a12448B3269J85269a23922F8100b9356k0503
18028d9859b695k5243I3540l9585c4491r236k24998O5308B7707J121i5070d4499
$$ plain form
18015 -16159 320383 -95626 -359046 101349 18968 134080 -120132 328599 128735 43849
18004 1667 59226 44176 151415 -62367 126132 24605 -132133 251562 267584 259583 98640
17992 -54095 123749 171384 177550 55463 13087 113344 -348351 -29059 -182917 -25592 122437
17980 -41251 -195414 46740 -7196 32075 -127502 27505 -124649 -208273 37325 124949 77384
17969 77384 19093 110435 -82656 -156064 212379 -19350 295676 157941 8247 165299 -227546
17957 -287614 -151281 172149 200630 105996 195991 245901 -23337 43485 -152463 11811 -164764
17945 180774 18302 312478 176383 290155 -90048 -757 4140 72344 -29127 -6686 166152
17933 -79535 283524 192455 16171 -364543 62906 -100206 96716 -18300 38635 165503 154306
$$ packed form
18015a6159C20383i5626k63420A01349A8968J15112a20132C28599A28735D3849
18004A667N7559j5050J07239f2367A26132B4605a32133B51562J6022q001I8640
17992e4095A23749M7635O166E5463A3087J00257c48351b9059j53858b5592A22437
17980d1251j54163D6740g196C2075a27502B7505a24649q3624C7325Q7624m7565
17969G7384A9093R1342h2656p3408B12379a9350B95676j37735H247J57052b27546
17957b87614J36333A72149K8481r4634Q9995M9910b3337D3485a52463A1811a64764
17945A80774A8302K94176j36095J13772i0048g57D140O8204b9127f686A66152
17933g9535B83524r1069A6171c64543F2906a00206I6716a8300C8635J26868j1197
$$ plain form
17922 154306 218919 24695 69820 248831 -79767 114902 169124 -27147 -131228 -226863 -75172
17910 -110909 145032 141911 5586 86626 -7983 -140820 85018 -26085 132273 -38296 -167878
17899 -167878 30126 95020 -199563 -351009 81707 -74769 -72553 188691 159511 464170 96809
17887 138417 207441 306235 -175798 -205377 -138944 -142854 197708 157571 109675 14279 105685
17876 105685 264156 63649 257199 -30632 -6113 -90829 404172 215616 187111 -114192 -70944
17865 -70944 553976 -155948 -84316 -77100 -152339 132252 -117028 -43718 5732 51676 792 91168
17853 91168 -198446 -296121 -162677 -74550 -28489 -268197 125590 53858 -71980 -125102 262303
17841 210142 361549 202340 -132663 -77314 -114298 85240 164944 48499 172392 -118222
$$ packed form
17922A54306O4613B4695M5125J79011g9767A14902N4222b7147j04081r5635g5172
17910a10909A45032l121E586Q1040g983j32837H5018b6085A32273c8296j29582
17899a67878C0126O4894a99563j51446H1707g4769K216A88691k9180L04659I6809
17887A38417O9024R8794a75798k9579O6433l910A97708m0137m7896A4279R1406
17876A05685J58471F3649J93550c0632f113q4716D04172j88556k8505a14192M3248
17865g0944E53976a55948P1632P216p5239A32252a17028d3718E732M5944G92R0376
17853I1168a98446r7675J33444g4550b8489k39708A25590E3858g1980n3122B62303
17841B10142J51407j59209a32663N5349l6984H5240P9704D8499J23893a18222
$$ plain form
17830 -74959 178208 -172230 -70723 -30060 151882 177610 -27606 18476 111732 258896 -127196
17818 132497 215325 -146827 -176632 -201882 31695 109136 -83587 29371 -17111 355209 -86107
17806 378327 -6792 -217663 116983 -61091 27502 -2196 -82916 168495 -59412 381606 330189
17795 330189 114257 -89510 -83903 -116105 172407 14449 43980 204905 -62844 -295713 -47551
17783 -226037 -330447 -51337 59970 142121 -115442 226897 218375 -113233 -38902 -100530 -63072
17772 -63072 -22463 54880 -122120 280624 57614 -133951 40809 -153478 -287032 236843
17761 88746 -92649 21452 229628 48342 135833 -145990 28224 181713 110677 20624 124091
17750 124091 -94255 157706 157517 -152955 62042 53295 -198424 8023 107612 43319 91971 -78789
$$ packed form
17830g4959A78208a72230g0723c0060A51882K5728b7606A8476R3256J47164a27196
17818A32497Q2828a46827k9805k5250C1695P7441h3587B9371a7111C55209h6107
17806C78327f792k10871A16983f1091B7502b196q0720A68495e9412C81606n1417
17795C30189A14257h9510N607l2202A72407A4449K9531J60925f2844k32869d7551
17783b26037j04410e1337E9970Q2151a15442B26897q522a13233c8902o1628L7458
17772f3072b2463E4880a22120B80624E7614a33951D0809a53478j33554B36843
17761H8746i2649B1452K08176D8342Q7491a45990B8224J53489p1036B0624J03467
17750A24091i4255A57706j89a52955F2042q747a98424H023R9589D3319M8652g8789
$$ plain form
17737 59392 366083 48662 -20656 -282038 118049 -24724 292564 82010 -344864 11500 -145981
17725 254514 -30707 230825 -84268 66227 -10605 424531 256803 238937 -230166 328748
17714 24426 -88724 34294 161120 134079 290782 36358 235512 108550 118104 370622 243385
17703 243385 705790 224785 311628 133410 -94695 194429 -112539 170863 239188 78292
17692 172672 173764 -108106 -191419 369468 8663 156552 219434 158034 -176909 283993 151493
17681 151493 121088 -141034 138474 216097 213357 119509 39422 -130548 -79569 79952 258668
17670 258668 -5385 -9938 -151160 136836 229821 57495 17038 312422 115283 -13983 -19487
17659 -19487 -71241 109957 357416 -164926 -84897 -23001 -11052 6810 93155 443126 469535
$$ packed form
17737E9392L06691D8662b0656k61382A18049b4724B92564H2010c44864A1500a45981
17725B54514c0707B30825h4268F6227a0605D24531j67728j7866b30166C28748
17714B4426h8724C4294J26826k7041J56703C6358J99154A08550R554K52518j27237
17703B43385M62405B24785Q6843A33410i4695A94429a12539A70863O8325G8292
17692A72672J092a08106q3313C69468H663J47889O2882o1400a76909B83993j32500
17681A51493l0405a41034A38474P7623k740r3848C9422a30548N0979G9952J78716
17670B58668e385m553j41222A36836R2985E7495A7038K95384A15283a3983n504
17659a9487n1754A09957K47459a64926Q0029b3001a1052F810Q6345L49971K6409
$$ plain form
17648 469535 122021 129605 8577 -238991 188829 -72546 402223 179254 300287 193842
17638 193842 132490 53482 134509 -101852 326224 200134 170358 217173 -98178 116807 11925
17626 60913 350717 184942 140217 126942 120913 12973 72737 281036 305941 12872 227695
17615 227695 -180500 241581 -53010 -166872 -82388 100535 515106 41231 -314139 201919
17604 -42363 -335679 116817 -173886 227604 159692 -101753 111504 98038 -27905 7514 -107078
17592 -18227 71971 174094 -39940 158957 19989 161640 -42231 227632 289478 133921 468523
17581 468523 166033 -159012 258988 136066 303961 -37618 102777 230697 106423 340262
17571 340262 507232 -128521 110897 101989 -132228 82571 -21113 -4906 161711 -30651 260439
$$ packed form
17648D69535A22021P584H577b38991A88829g2546D02223A79254J21033j06445
17638A93842o1352E3482Q1027a01852C26224j26090k9776M6815i8178A16807A1925
17626F0913K89804j65775m4725j3275o029A2973N9764K08299K4905A2872K14823
17615B27695a80500B41581e3010j13862h2388A00535M14571D1231c14139B01919
17604d2363k93316A16817a73886B27604o7912a01753A11504j3466b7905G514a07078
17592a8227G1971J02123c9940A58957A9989J41651d2231B27632O1846A33921L34602
17581D68523A66033a59012B58988j22922J67895c7618A02777J27920A06423K33839
17571C40262J66970a28521A10897q908a32228H2571b1113d906A61711c0651B60439
$$ plain form
17559 -85453 -44835 258669 98888 264185 80570 -148526 273689 276411 295523 262341 456724
17548 456724 121011 471201 48267 57401 -9427 236572 103954 48247 54030 -70466 -133429
17537 -133429 -63190 197008 189008 7152 214069 342732 137070 354967 114410 383749
17527 383749 212704 274422 1025507 700266 804016 886294 894466 138949 393043 202589
17517 202589 250024 478529 561319 241236 174847 336231 499120 303732 480373 546702
17507 546702 910523 919964 673509 798921 325485 572930 57281 186575 568508 205776
17496 378050 150107 487771 72944 45597 -14596 204941 105841 40338 -93220 241556 229180
17485 229180 368110 105854 160545 270794 96381 462362 290869 213765 584373 392707
$$ packed form
17559h5453M0618B58669I8888J65297H0570a48526B73689K722J9112l3182J94383
17548D56724A21011L50190D8267R134i427B36572A03954D8247N783g0466o2963
17537a33429f3190A97008q000G152K06917J28663A37070K17897A14410K69339
17527C83749j71045O1718P51085l25241J03750Q2278Q172A38949K54094j90454
17517B02589M7435K28505Q2790B41236o6389J61384J62889j95388J76641O6329
17507E46702L63821R441k46455J25412C25485K47445E7281J29294L81933B05776
17496C78050A50107L37664G2944k7347a4596B04941r9100D0338i3220B41556j2376
17485B29180J38930A05854N4691J10249I6381L65981j71493p7104L70608j91666
$$ plain form
17475 392707 520819 467198 419010 176153 178297 308588 272713 209915 224043 58175 13392
17463 319510 216187 246480 23820 173397 596699 -38542 194834 396294 144979 239591
17453 239591 112444 380455 182249 -18595 776685 627454 143769 460408 173484 578674
17443 578674 578299 290735 230521 292986 -39942 206666 127443 281833 386287 688772 414715
17432 414715 614054 608521 459445 506158 173937 138109 332235 328794 496139 259676 378438
17421 378438 450915 522651 324564 457537 308400 475377 343446 311452 291510 249945
17411 249945 307222 14454 159221 512755 211925 221636 248031 371623 93726 228807 241735
17400 241735 347220 390059 302360 135589 466817 119896 329055 288302 501704 471418
$$ packed form
17475C92707J28112n3621m8188A76153K144J30291l5875o2798J4128E8175A3392
17463C19510j03323L0293B3820J49577M23302c8542A94834K01460A44979R4612
17453B39591A12444K68011A82249a8595G76685j49231A43769L16639A73484M05190
17443E78674l75k87564o0214O2465c9942B06666p9223J54390J04454L02485k74057
17432D14715J99339n533j49076M6713A73937l5828J94126l441J67345k36463J18762
17421C78438P2477P1736j98087J32973j49137J66977j31931l1994j9942m1565
17411B49945N7277A4454J44767L53534B11925R711K6395J23592I3726J35081J2928
17400B41735J05485M2839q7699A35589L31228A19896K09159m0753K13402l0286
$$ plain form
17390 471418 338691 545524 -17225 315891 359356 326932 360117 295597 -150526 353599
17379 493207 374362 226323 285959 543281 -53484 161038 82327 373334 162887 85028
17369 85028 489527 444180 224236 505790 397807 58472 250965 326566 -8779 203160 -141946
17357 68623 133894 163217 126502 240663 235206 38665 372642 425136 481549 350923 288174
17346 288174 559558 -85490 308946 304793 173734 30547 -253279 232040 99448 371018
17336 371018 150372 110792 296236 261735 137524 240513 390325 -7419 132792 267765
17326 267765 105614 443739 113732 -137241 495214 49029 393969 156363 310966 311778
17316 311778 -6923 233119 540453 231733 54261 66937 127261 392529 397890 369443 486574
$$ packed form
17390D71418j32727K06833a7225C15891M3465l2424L3185o4520a50526C53599
17379D93207j18845j48039N9636K57322e3484A61038p8711K91007A62887p7859
17369H5028M04499m5347k19944K81554j07983E8472J92493P5601h779B03160a41946
17357F8623O5271K9323l6715J14161n457C8665L33977N2494N6413j30626o2749
17346B88174K71384h5490C08946m153j31059C0547b53279B32040I9448K71570
17336C71018A50372l9580J85444l4501j24211J02989J49812g419A32792J34973
17326B67765A05614L38125A13732a37241D95214D9029L44940A56363J54603Q12
17316C11778f923B33119L07334B31733E4261J2676O0324K65268N361k8447J17131
$$ plain form
17305 486574 103161 248027 -194407 218094 162612 140974 48405 4040 345411 67272 653679
17294 653679 100617 80257 527939 356777 2296 231563 227535 482773 20761 244716 250130
17283 250130 95675 306691 198060 389059 100830 370718 115158 139951 620480 419358
17273 419358 443539 352548 119971 621255 246754 364415 334812 -15674 514916 488323
17263 488323 662306 279545 376641 58554 -129683 525877 172956 450454 193385 292226
17253 292226 322773 91109 565264 156721 384224 268816 269053 257136 347063 298167 589721
17242 589721 112423 669841 503530 163286 372265 -39587 231749 279963 60672 365437
17232 365437 150507 125818 278443 444155 70186 422094 -29903 34765 -164749 168828
$$ packed form
17305D86574A03161J44866a94407B18094n5482k1638D8405D040L41371F7272N86407
17294F53679A00617k0360M47682j71162B296K29267m028K55238B0761K23955N414
17283B50130I5675K11016j08631J90999A00830K69888A15158K4793M80529k01122
17273D19358K4181r0991A19971N01284B46754J17661k9603a5674E14916k6593
17263D88323J73983B79545R7096E8554a29683E25877A72956K77498A93385R8841
17253B92226L0547I1109M74155A56721K27503j15408K37j1917Q9927m8896K91554
17242E89721A12423N57418j66311A63286K08979c9587B31749M8214F0672L04765
17232C65437A50507k4689J52625J65712G0186L51908b9903C4765a64749A68828
$$ plain form
17221 235194 373227 187302 223863 280547 184877 319190 354910 179709 577844 827229
17211 827229 239984 363331 363842 570173 184863 230853 429725 250786 471345 197555
17200 388315 332848 168895 441745 426545 291758 113701 76528 206535 321564 417297
17190 417297 123674 310961 437922 405999 464752 584319 244816 122622 595492 212802
17179 208964 604470 419644 393646 114466 216604 751803 425582 91963 385269 642507
17169 642507 362837 677318 584157 315060 237616 276801 190153 285028 347643 814995 366425
17157 252642 616467 306137 360257 565066 693994 472114 512351 368674 283548 433593
17147 433593 390547 484043 480205 664297 438860 204293 737878 575443 484100 544352 654980
$$ packed form
17221B35194J38033j85925L6561N6684r5670J34313L5720j75201L98135K49385
17211H27229B39984J23347N11K06331A84863M5990J98872j78939K20559A97555
17200C88315n5467j63953K72850j5200j34787A13701l7173J30007J15029R5733
17190D17297A23674J87287J26961l1923N8753J19567B44816j22194M72870B12802
17179B08964L95506j84826k5998A14466J02138N35199l26221I1963K93306K57238
17169F42507k79670L14481r3161k69097p7444L9185q6648R4875O2615M67352C66425
17157B52642L63825C06137N4120K04809J28928k21880M0237j43677q5126J50045
17147D33593m3046R3496l838J84092k25437B04293N33585j62435r1343O0252J10628
$$ plain form
17136 654980 505642 348235 609934 373701 437434 490305 434177 335688 858899 362797
17125 595196 601040 585874 357631 560867 683013 662578 402841 412552 593379 517974 647072
17114 647072 699380 507017 680986 592907 680468 947932 377814 374467 592318 628957 460195
17103 460195 577722 274564 784125 656214 821173 238139 469122 614726 712757 585955
17093 585955 376190 549308 544480 639112 414458 534450 716906 717657 605361 506556 530446
17082 530446 618055 653206 817540 947698 588208 660957 803206 661770 565300 778987
17072 778987 437787 583353 393682 457758 965019 1219291 890369 591740 567413 701264
17062 701264 746085 900904 938896 625471 929192 584344 987289 806918 729690 775649
$$ packed form
17136F54980j49338j57407K61699k36233O3733N2871n6128r8489N23211C62797
17125E95196N844j5166k28243K03236J22146k0435k59737R711J80827p5405J29098
17114F47072N2308j92363J73969q8079Q7561K67464C77814l347K17851L6639j68762
17103D60195J17527B74564N09561j27911J64959B38139K30983J45604R8031j26802
17093E85955k09765J73118m828R4632k24654J19992J82456P51j12296r8805K3890
17082E30446Q7609L5151J64334J30158l59490P2749J42249j41436r6470K13687
17072G78987l41200J45566j89671O4076N07261K54272l28922k98629k4327J33851
17062G01264M4821J54819L7992l13425L03721l44848M02945j80371p7228M5959
$$ plain form
17052 775649 579461 656776 381050 813704 675171 706253 996385 773790 576299 994563
17042 994563 1006478 1115412 670627 1179172 722662 841667 474311 723846 871911 519763
17032 519763 1014792 788769 965782 1092754 931611 694255 850873 1065049 964318 825901
17022 825901 848469 896154 916922 1016414 593575 1303746 844105 758096 998517 739533
17012 739533 1104948 916963 985500 768977 1120637 1304721 915085 752570 1176391 988574
17002 988574 938203 1057617 1258782 1235058 1258041 1057064 941439 980895 1537035 1458349
16992 1458349 893997 1052509 1117320 1184323 1400387 1170574 1445401 1365464 1206065 1401219
16982 1401219 1326048 1106229 1099116 1404990 1293734 1420901 1388340 1092687 1442511 1365770
$$ packed form
17052G75649j96188P7315k75726M32654j38533L1082K90132k22595j97491M18264
17042I94563J1915J08934m44785N08545m56510J19005l67356K49535J48065l52148
17032E19763M95029k26023J77013J26972j61143k37356J56618K14176j00731j38417
17022H25901K2568M7685K0768R9492m22839P10171m59641q6009K40421k58984
17012G39533L65415j87985O8537k16523L51660J84084l89636j62515M23821j87817
17002I88574n0371J19414K01165k3724K2983k00977j15625L9456N56140p8686
16992A458349n64352J58512O4811O7003K16064k29813K74827p9937j59399J95154
16982A401219p5171k19819p113L05874j11256J27167l2561k95653L49824p6741
$$ plain form
16972 1365770 1774676 1127237 1340978 1270147 1553431 1506495 1583110 1759451 1455042 1577324
16962 1577324 1218776 1600736 1514640 1628010 1468635 1469651 1581488 1431549 1337644 1506085
16952 1506085 1693562 1265286 1571896 1418779 1522378 1408101 2019586 1761821 1711789 1707919
16942 1707919 1922526 1835575 1614466 1787350 1783931 2042704 1821651 1753060 2105315 1572022
16932 1572022 1939181 1703879 1803565 1851611 1748053 2166483 2157366 2105524 2229617 2004339
16922 2004339 1806410 2060816 2101718 1855785 1945586 1802821 2179686 1970950 2002378 2228076
16912 2228076 2456465 2334673 2293452 2516063 2336625 2306982 2577576 2182572 2443764 2186491
16902 2186491 2434571 2353368 2491479 2653704 2618121 2831069 2781944 3097709 2465336 2476100
$$ packed form
16972A365770M08906o47439K13741p0831K83284m6936P6615J76341l04409J22282
16962A577324l58548L81960q6096J13370j59375J016J11837j49939r3905J68441
16952A506085J87477m28276L06610j53117J03599j14277O11485k57765n0032l870
16942A707919K14607q6951k21109J72884l419K58773k21053o8591L52255n33293
16932A572022L67159k35302R9686M8046j03558M18430r117n1842J24093k25278
16922B004339j97929K54406M0902k45933Q9801j42765L76865k08736L1428K25698
16912B228076K28389j21792m1221K22611j79438k9643K70594l95004K61192k57273
16902B186491K48080q1203J38111J62225l5583K12948m9125L15765o32373J0764
$$ plain form
16892 2476100 3052904 2573780 2733484 2740188 2822744 2947370 3072524 3248757 3296360 2817421
16882 2817421 3219829 3093088 2803027 3179482 3308655 2920061 3333527 3582330 3524930 3281227
16872 3281227 3354821 3358605 3710359 3510838 3821249 3582198 3850946 3961919 4009559 3842222
16862 3842222 3878812 4347014 4355779 4091881 4320580 4463791 4172162 4581290 4528130 4612630
16852 4612630 4631937 4511526 4779221 4949330 4927718 5106739 5391734 5163967 5498615 5381829
16842 5381829 5850784 5722364 5647866 5848330 5992641 5858556 6032927 5888516 6460064 6531163
16832 6531163 6700649 6637001 6948801 6553196 7058748 6886657 7329816 7049486 7346926 7502727
16822 7502727 7617777 8006086 7756037 7922554 8497475 8739287 8812496 8637637 9287958 9103972
$$ packed form
16892B476100N76804m79124J59704O704Q2556J24626J25154J76233M7603m78939
16882B817421M02408j26741k90061L76455J29173l88594M13466K48803n7400k43703
16872C281227P3594L784L51754j99521L10411k39051K68748J10973M7640j67337
16862C842222L6590M68202Q765k63898K28699J43211k91629M09128n3160Q4500
16852D612630J9307j20411K67695J70109k1612J79021K84995k27767L34648j16786
16842E381829M68955j28420p4498K00464J44311j34085J74371j44411N71548P1099
16832F531163J69486o3648L11800l95605N05552j72091M43159k80330K97440J55801
16822G502727J15050L88309k50049J66517N74921K41812P3209j74859O50321j83986
$$ plain form
16812 9103972 9278160 9645539 9690370 9901168 10596598 10440157 10629866 10566160 11214044 11241848
16802 11241848 11775643 12017718 11831397 12674015 12554427 13276390 13371406 13479691 13948096
16793 13948096 14373232 14852741 15034490 15623465 15900882 16122775 16207363 17083284 17600102
16784 17600102 18227790 18451771 19065332 19520552 20133987 20850132 21550250 22207281 22215020 23216874
16774 23216874 23871826 24616144 25693426 26175002 27191798 27832602 29213433 30031840 31237453
16765 31237453 32256635 32976739 34561340 35340264 36951052 38176366 39541421 41030626
16757 41030626 42699522 44328243 45735329 47760767 49504756 51631052 53557466 55605561
16749 55605561 57795068 60387599 62817073 65088454 67718821 70807411 73258828 76364007
$$ packed form
16812I103972J74188L67379M4831K10798O95430j56441J89709o3706O47884K7804
16802A1241848N33795K42075j86321Q42618j19588P21963R5016J08285M68405
16793A3948096M25136M79509J81749N88975K77417K21893Q4588Q75921N16818
16784A7600102O27688K23981O13561M55220O13435P16145P00118O57031P739J001854
16774B3216874O54952P44318J077282M81576J016796O40804J380831Q18407J205613
16765C1237453J019182P20104J584601P78924J610788J225314J365055J489205
16757D1030626J668896J628721J407086K025438J743989K126296J926414K048095
16749E5605561K189507K592531K429474K271381K630367L088590K451417L105179
$$ plain form
16741 76364007 79479177 82551925 85979188 88899149 92097988 95459380 99034951 102327049
16733 102327049 105536290 108840851 112324010 115462434 118219218 121026235 123507928 125774788
16725 125774788 127939710 129532138 130587846 131274228 131858968 132054130 131264256 130848185 129695136
16716 129695136 128138687 126451703 124260506 121752527 118808009 116147770 113080985 109786609
16708 109786609 106832624 103081573 99479163 96137023 92892759 89370799 86309346 83046729
16700 83046729 79533974 76399662 73428538 70709437 68065262 65358684 62432179 60543365
16692 60543365 57966696 55426705 53266190 51115306 49157899 47396449 45711607 43783984
16684 43783984 42339332 40471186 39022020 37697141 36255358 35095490 33918807 32523121
$$ packed form
16741G6364007L115170L072748L427263K919961L198839L361392L575571L292098
16733A02327049L209241L304561L483159L138424K756784K807017K481693K266860
16725A25774788K164922J592428J055708O86382N84740J95162p89874m16071j153049
16716A29695136j556449j686984k191197k507979k944518k660239l066785l294376
16708A09786609k953985l751051l602410l342140l244264l521960l061453l262617
16700H3046729l512755l134312k971124k719101k644175k706578k926505j888814
16692F0543365k576669k539991k160515k150884j957407j761450j684842j927623
16684D3783984j444652j868146j449166j324879j441783j159868j176683j395686
$$ plain form
16676 32523121 31727647 30553928 29718251 28650120 27640123 26751685 25835563 25304629 24145720
16667 24145720 23473887 22777737 21902712 21613343 20587322 19735802 19515380 19136633 18589065
16658 18589065 17821417 17261274 16842603 16744003 16395624 16035685 15287337 14911607 14398474
16649 14398474 14175364 13742322 13363000 13020595 12639411 12606902 12424527 11743231 11788039 11166438
16639 11166438 11742772 10891676 10626748 10198488 10061425 10274198 9935050 9774468 9165997
16630 9165997 9109850 8932074 8729650 8498367 8518282 8307091 8064501 8003581 7578800 7322035
16620 7322035 7810446 7180866 7280966 7017536 7075809 7011358 6713513 6723829 6611048 6242957
16610 6242957 6015011 6037534 5983755 5837806 5699203 5574688 5730407 5367049 5608696 5589697
$$ packed form
16676C2523121p95474j173719q35677j068131j009997q88438r16122n30934j158909
16667B4145720o71833o96150q75025k89369j026021q51520k20422l78747n47568
16658A8589065p67648n60143m18671r8600l48379l59939p48348l75730n13133
16649A4398474k23110m33042l79322l42405l81184l2509j82375o81296M4808o21601
16639A1166438N76334q51096k64928m28260j37063K12773l39148j60582o08471
16630I165997n6147j77776k02424k31283J9915k11191k42590o0920m24781k56765
16620G322035M88411o29580J00100k63430N8273o4451k97845J0316j12781l68091
16610F242957k27946K2523n3779j45949j38603j24515J55719l63358K41647j8999
$$ plain form
16600 5589697 5452345 5082137 5155197 5180416 4890836 5060425 4795425 4844240 4583690 4621728
16590 4621728 4454334 4501636 4330639 4203505 4199262 4028516 3884442 4201239 3908862 4014278
16580 4014278 3935489 3778774 3563231 3862812 3643048 3757304 3794109 3303594 3651932 3476160
16570 3476160 3464353 3578401 3577254 3167994 3048227 2936683 3158312 3184265 3093865 3197049
16560 3197049 3037361 2714723 3016669 2858710 2694494 2980773 2960347 2886295 2623079 2734486
16550 2734486 2592087 2876507 2541355 2600030 2958864 2422960 2581902 2683421 2392700 2334784
16540 2334784 2230022 2460153 2419576 2531225 2112421 2490537 2507588 2235270 1939617 2302099
16530 2302099 2283629 2350718 2361805 1777190 1846681 2032893 2106500 1866420 2044238 1766085
$$ packed form
16600E589697j37352l70208P3060K5219k89580J69589k65000M8815k60550L8038
16590D621728j67394M7302j70997j27134m243j70746j44074L16797k92377J05416
16580D014278p8789j56715k15543K99581k19764J14256L6805m90515L48338j75772
16570C476160j1807J14048j147m09260j19767j11544K21629K5953r0400J03184
16560C197049j59688l22638L01946j57959j64216K86279k0426p4052k63216J11407
16550B734486j42399K84420l35152N8675L58834n35904J58942J01519k90721n7916
16540B334784j04762K30131m0577J11649m18804L78116J7051k72318k95653L62482
16530B302099j8470O7089J1087n84615O9491J86212P3607k40080J77818k78153
$$ plain form
16520 1766085 1921909 2078704 1918315 1641231 1919610 2015351 1906269 1783566 1536851 1795370
16510 1795370 1693313 1788911 1720171 2207029 1791203 1636513 1568602 1558583 1688520 1874994
16500 1874994 1304344 1757284 1645143 1474132 1230736 1520960 1525821 1724411 1383577 1455242
16490 1455242 1282374 1566602 1295577 1507445 1561689 1023957 1083351 1071571 1591074 1274982
16480 1274982 1593937 1123367 1428491 1323310 1473467 1319939 939386 1239217 1180838 1479281
16470 1479281 1041769 1221275 1381081 966115 1104592 978284 1195027 1079139 1286312
16461 1286312 1399780 1188411 1426417 1177860 1032660 1170930 785746 1055918 960185 734076
16451 734076 1125530 1011296 1223934 1063378 1267220 1086856 910194 849404 1437377 877064
$$ packed form
16520A766085J55824J56795j60389k77084K78379R5741j09082j22703k46715K58519
16510A795370j02057R5598o8740M86858m15826j54690o7911j0019J29937J86474
16500A874994n70650M52940j12141j71011k43396K90224M861J98590l40834P1665
16490A455242j72868K84228k71025K11868N4244n37732N9394j1780N19503l16092
16480A274982L18955m70570L05124j05181J50157j53528l80553K99831n8379K98443
16470A479281m37512J79506J59806m14966J38477j26308K16743j15888K07173
16461A286312J13468k11369K38006k48557j45200J38270l85184K70172r5733k26109
16451G34076L91454j14234K12638j60556K03842j80364j76662o0790N87973n60313
$$ plain form
16441 877064 1026190 994026 1205007 901105 923593 1207696 1316251 945405 937217 880759
16431 880759 717514 1028154 775571 653580 777518 1396618 1051242 1145235 797785 863547
16421 863547 899235 1099741 844473 607062 838412 1043537 824636 692317 891182 1012312
16411 1012312 796283 937794 638759 447439 845580 620850 873921 996149 723551
16402 723551 895138 719612 868262 524519 635752 471273 769448 878306 965712 800574
16392 800574 640325 774239 826421 744130 800519 634495 520539 647489 690205 593805
16382 593805 778049 599107 865083 669130 546595 898801 665334 572794 813851 724894
16372 724894 712021 512478 845436 503978 654931 524702 482402 497613 323850 842407
$$ packed form
16441H77064J49126l2164K10981l03902K2488K84103J08555l70846q188n6458
16431H80759j63245L10640k52583j21991J23938O19100l45376R3993l47450O5762
16421H63547L5688K00506k55268k37411K31350K05125k18901j32319J98865J21130
16411A012312k16029J41511k99035j91320L98141k24730K53071J22228k72598
16402G23551J71587j75526J48650l43743J11233j64479K98175J08858Q7406j65138
16392H00574j60249J33914N2182q2291N6389j66024j13956J26950M2716r6400
16382E93805J84244j78942K65976j95953j22535L52206k33467r2540K41057q8957
16372G24894j2873j99543L32958l41458J50953j30229m2300J5211j73763N18557
$$ plain form
16362 842407 709486 581537 782399 871347 665124 590974 887530 567389 288213 645657
16352 645657 426735 338311 591390 485256 536759 468649 628903 575514 690559 399428
16342 399428 567862 352388 481776 580956 587971 422829 326677 797794 509229 447516
16332 447516 634617 591687 669171 596602 323978 121836 827877 60722 377875 105745
16321 709779 472805 436360 727880 513836 469961 504544 352089 397634 436258 174970
16310 526160 317290 293386 345615 726740 369639 460542 547399 497615 374304 103748
16299 523279 423790 289197 279553 419031 379828 376391 371783 -48449 464323 239001 600910
16288 600910 91482 337528 316041 223900 654829 499653 621504 256617 351873 369357
$$ packed form
16362H42407j32921j27949K00862Q8948k06223p4150K96556l20141k79176L57444
16352F45657k18922q8424K53079j06134N1503o8110J60254n3389J15045k91131
16342C99428J68434k15474J29388R9180P015j65142r6152M71117k88565o1713
16332D47516J87101m2930P7484p2569k72624A21836P06041F0722L17153A05745
16321G09779k36974l6445K91520k14044m3875L4583j52455M5545L8624A74970
16310E26160k08870k3904N2229L81125l57101R0903Q6857m9784j23311A03748
16299E23279r9489j34593r644J39478l9203l437m608d8449D64323k25322L61909
16288F00910I1482K46046k1487r2141M30929j55176J21851B56617R5256J7484
$$ plain form
16278 369357 98636 164110 271918 662923 218387 244214 471956 197938 231997 33182
16267 278331 500903 577135 367681 372078 439005 195069 399167 103947 172660 193373 -2776
16255 285395 456408 197508 580532 206299 163161 477982 250567 358740 197327 97548
16244 404892 273440 346165 189109 179112 280124 221329 45509 332597 304452 610839 261856
16232 543712 345949 306319 92776 -48902 133597 209217 267053 501039 212235 238777 223715
16221 223715 -119519 238763 435150 134281 369369 145129 285624 227123 216842 234891
16211 234891 199243 438052 241606 199437 359701 350408 34100 230521 227076 -44 252156
16199 128019 354254 299888 77233 182933 482185 247906 26204 -4067 289622 183537
$$ packed form
16278C69357I8636O5474J07808L91005B18387K5827K27742A97938L4059C3182
16267B78331K22572P6232k09454M397O6927A95069K04098A03947O8713K0713b776
16255B85395J71013A97508L83024B06299m3138L14821k27415J08173j61413I7548
16244D04892j31452P2725j57056r997J01012n8795D5509K87088k8145L06387B61856
16232E43712j97763l9630I2776d8902A33597P5620N7836K33986B12235K6542j5062
16221B23715a19519B38763J96387A34281K35088A45129J40495n8501j0281J8049
16211B34891l5648K38809j96446m2169J60264r293C4100J96421l445d4B52156
16199A28019K26235n4366G7233J05700K99252k34279B6204d067B89622j06085
$$ plain form
16189 183537 332757 240144 181391 90082 -169115 351726 384966 -19954 152022 232782 85717
16177 45801 402416 186114 66461 372737 379119 -21387 -18545 237188 133337 -4427 229575
16165 77689 346438 -87903 174411 373178 277842 381127 80463 237677 223023 374518
16155 374518 168504 134633 10583 55964 288950 248888 360712 291414 98515 329258 381916
16144 381916 52794 -64706 540523 332416 104830 328819 80782 226287 378755 279736
16134 279736 215568 225991 363733 545344 90033 -15642 -127683 33859 -61470 -187817 12378
16122 11469 481143 275839 -81990 81764 111845 127203 305455 60926 474147 -248749 45150
16110 43914 342786 141996 3953 133311 350129 153585 153607 268854 42964 389938 131500
$$ packed form
16189A83537J49220r2613n8753I0082a69115C51726L3240a9954A52022Q0760H5717
16177D5801L56615A86114F6461L06276O382b1387K842B37188j03851d427B29575
16165G7689K68749h7903A74411J98767r5336J03285H0463J57214j4654J51495
16155C74518A68504l3871A0583M5381K32986m0062J11824o9298I8515K30743N2658
16144C81916E2794f4706E40523k08107A04830K23989H0782J45505J52468r9019
16134B79736o4168J0423J37742J81611I0033a5642j12041C3859f1470j26347A2378
16122A1469M69674k05304h1990H1764L0081J5358J78252F0926M13221b48749D5150
16110D3914K98872A41996C953J29358K16818A53585K2J15247D2964L46974A31500
$$ plain form
16098 87479 256207 -192095 -67397 -23569 -179322 -6037 337917 -321109 182010 283364
16088 283364 -35297 17388 32156 228878 236230 147406 171306 -274183 -103719 322039 144583
16076 -184463 44147 488235 188776 -95912 202743 15818 -58712 613842 99348 -372334
16065 -37937 135581 -267481 -33805 30029 -131031 -24943 202366 25536 15188 -58600 225044
16053 103239 326254 73815 281695 -276082 80209 54186 178230 34667 -404178 70075
16042 114721 287254 3646 239674 57000 22993 -31880 125075 296772 69534 21118 27322
16031 27322 67665 -127087 55426 -189385 -28979 170000 -6308 -198342 -43835 -216643 211578
16019 60853 910 440553 161921 -131649 10728 32295 263181 235142 -60895 -114135 -202482
$$ packed form
16098H7479J68728a92095f7397b3569j55753f037C37917c21109A82010J01354
16088B83364c5297A7388J4768J96722P352q8824K3900b74183a03719C22039A44583
16076a84463D4147M44088A88776i5912B02743A5818e8712F13842I9348c72334
16065c7937A35581b67481c3805C0029a31031b4943B02366B5536j0348e8600B25044
16053A03239K23015G3815K07880b76082H0209k6023J24044C4667d04178G0075
16042A14721J72533C646K36028E7000B2993c1880A25075J71697F9534B1118O204
16031B7322M0343a27087E5426a89385b8979A70000f308j92034d3835j72808B11578
16019F0853I10M39643A61921a31649A0728K1567K30886k8039f0895n3240q8347
$$ plain form
16008 -202482 40771 3383 -9716 21572 -193681 163871 257112 54542 158543 -143346 -92218
15997 -92218 -57072 62859 -172365 199038 -36054 371870 -105326 198568 -63422 407429
15986 627037 757440 1155374 1175270 990789 768163 731724 599943 297217 78321 265689
15976 265689 349054 -221459 -183776 -218015 363916 103693 -152628 13938 -3731 29085 -141533
15964 3427 -226533 -149539 -202574 32474 14313 170312 -126281 -92647 -136328 -144701 -151848 -251603
15952 -251603 -104218 114261 -238783 -42120 236362 186448 44548 -314758 47042 -196902
15941 -32700 255090 -2184 150365 379139 136462 108002 90501 36413 124360 30615 -5173
15929 -111676 292667 54855 -16744 -13094 129836 66173 -44140 202849 105314 -11785 112063
$$ packed form
16008b02482D0771C383i716B1572a93681A63871R3241E4542J04001a43346N1128
15997i2218L5146F2859a72365A99038c6054C71870a05326A98568f3422D07429
15986F27037J30403L97934J9896j84481k22626l6439j31781B97217G8321J87368
15976B65689Q3365b21459L7683l4239C63916A03693a52628A3938c731B9085a41533
15964C427b26533P6994n3035C2474A4313J55999a26281L3634m3681q373p147r9755
15952b51603a04218A14261b38783d2120B36362m9914D4548c14758D7042a96902
15941c2700B55090b184A50365K28774A36462k8460j7501C6413Q7947C0615e173
15929a11676B92667E4855a6744L650A29836o3663d4140B02849r7535a1785A12063
$$ plain form
15917 -81403 -342546 37338 -296078 138003 -129808 -84194 249555 -99515 332566 -141404
15906 167883 -10755 -129905 -285435 258933 -147730 -53546 205447 -122477 21517 -309538
15895 -167301 -106172 109158 -38638 216365 -274550 104178 -41264 364308 266973 114665
15884 126846 46801 -215964 -39054 364122 26545 -234698 -169601 -30301 1367 32926 -260528
15872 -90416 141578 -289985 -23472 -222488 -38524 117137 91757 103155 -194549 225580
15861 -202571 104314 167381 -123422 45738 176006 -227899 -240012 16334 -79532 64207 42650
15850 42650 346142 -359036 267903 -310896 407 117210 -178674 -166605 120796 -416502
15839 -44919 -51866 -72929 19680 -193756 72874 -53839 -428404 -45959 115170 -126715 11407
$$ packed form
15917h1403k61143C7338b96078A38003a29808M5614B49555i9515C32566a41404
15906A67883a0755j19150j55530B58933a47730e3546B05447a22477B1517c09538
15895a67301O1129A09158c8638B16365b74550A04178d1264C64308r7335A14665
15884A26846D6801b15964c9054C64122B6545b34698O5097c0301A367L1559b60528
15872i0416A41578b89985b3472j99016c8524A17137k5380J1398a94549B25580
15861b02571A04314O3067a23422D5738J30268b27899j2113A6334g9532F4207k1557
15850D2650L03492c59036B67903c10896D07J16803a78674J2069A20796d16502
15839d4919o947k1063A9680a93756G2874e3839l74565d5959A15170a26715A1407
$$ plain form
15827 3081 -235122 -10707 -4716 111357 115673 -136321 -83056 -155066 71436 -147226 -146667 -259584
15815 -259584 34712 49420 -357464 -14468 -66867 236075 -153172 313236 -145696 -193347
15805 -193347 -228355 -390564 50688 -65838 52126 -80060 153375 -283422 -86115 -101474 -217617
15794 -217617 21615 -24843 -50571 132286 50221 -57057 285410 63130 -192855 264972 266594
15783 266594 -10028 -229918 245183 344952 -204196 -4376 -183790 93434 111017 -116205 -153385
15772 -153385 -28874 -78811 53370 -214253 161791 104129 83307 108612 -86159 58164 366494
15761 366494 258053 109708 66538 -36341 210710 62698 55156 -81105 143485 26586 15824
15750 15824 -40099 -36129 135708 299678 -13907 -31696 207778 154612 -161883 -107391 -73006
$$ packed form
15827C081b35122a0707d716A11357M316a36321N3265p2010G1436a47226N59j12917
15815b59584C4712J4708c57464a4468n2399B36075a53172C13236a45696m7651
15805a93347l5008j62209E0688f5838E2126h0060A53375b83422h6115j5359j16143
15794b17617B1615b4843k5728A32286E0221e7057B85410F3130a92855B64972J622
15783B66594a0028k19890B45183R9769b04196d376j79414I3434J7583a16205l7180
15772a53385b8874m9937E3370b14253A61791n7662k0822K5305h6159E8164L08330
15761C66494j08441A09708m3170c6341B10710F2698p542h1105A43485B6586j0762
15750A5824d0099L970A35708J63970a3907j7789B07778n3166a61883N4492L4385
$$ plain form
15739 -73006 -92182 259737 188157 -198897 23353 130065 67900 165439 121586 -340224 -37775
15727 -13596 -194111 -22608 -60907 379106 350794 -382204 -213129 207047 -111546 -97528
15717 -97528 -58571 32078 -127325 -78457 45740 43644 -308245 148968 91338 -87291 308082
15705 -4219 260197 -10865 -346627 71352 276264 -232310 93078 42170 -343680 -61441 -45210
15694 -45210 49907 -213782 -87012 158460 105273 -2650 78423 215127 -49737 -87845 156211
15682 -109358 -127194 -46285 -89841 -51723 37505 81735 -137411 30493 -76291 31988 75118
15671 75118 229117 -79630 91258 -34923 140530 141988 -296075 -158298 87075 -146568 -134395
15660 -134395 -230813 -133840 149366 -39241 178101 -94218 -250473 -158571 -148460 -304124 -440930
$$ packed form
15739g3006j9176B59737p1580a98897B3353J06712o2165R7539m3853c40224c7775
15727a3596j80515b2608l8299C79106k8312c82204J69075B07047a11546J4018
15717i7528L8957C2078a27325M8868D5740k096c08245A48968n7630h7291C08082
15705d219B60197a0865l35762G1352K04912b32310I3078D2170c43680f1441J6231
15694d5210D9907b13782h7012A58460n3187b650G8423J36704d9737l8108A56211
15682a09358j7836d6285m3556L8118C7505M4230a37411C0493g6291C1988M3130
15671G5118J53999g9630I1258c4923A40530J458b96075J37777H7075a46568J2173
15660a34395r6418R6973A49366c9241A78101i4218j56255R1902J0111j55664j36806
$$ plain form
15649 -440930 47976 -68142 -28383 -20532 -165977 -434813 -4550 30639 -78595 61280 164953
15638 164953 442011 -79660 -426349 -95757 37545 -104609 -181 -63675 -36460 63151 92806
15627 92806 -158554 -125853 -69116 -42543 -100915 47815 3179 -177977 -102579 -55004 -137531
15616 -137531 217045 -133458 -250010 -152 123222 -51014 -256298 -197534 8451 -79141 -7609
15604 57798 107549 -113406 230966 -17770 -7957 -173988 -116207 232480 -69030 176796 -84351
15592 -120324 40236 -158748 -114107 80373 -69127 172323 -93994 -195702 9466 -54216 -96315
15581 -96315 -112347 -73467 -204885 124067 179751 -341837 -80476 -149746 96419 51764 -9027
15569 -94995 -202075 -234390 -41011 160192 -162035 -46854 42939 -36905 -200062 1338 -132934
$$ packed form
15649d40930D7976f8142b8383P851j45445k68836d550C0639g8595F1280J03673
15638A64953K77058g9660l46689i5757C7545a04609a81o3494K7215F3151K9655
15627I2806a58554L2701N6737K6573n8372D7815C179a77977P5398M7575q2527
15616a37531B17045a33458j16552a52A23222e1014k05284N8764H451g9141g609
15604E7798M9751a13406B30966a7770g957j66031N7781B32480f9030A76796h4351
15592a20324D0236a58748M4641H0373f9127A72323i3994j01708I466e4216m2099
15581i6315j6032L8880j31418A24067N5684c41837h0476o9270I6419m4655i027
15569i4995j07080l2315d1011A60192a62035d6854D2939c6905j63157A338a32934
$$ plain form
15557 203789 -202418 86903 88823 127852 -268667 228961 68768 29005 16326 -20796 62981
15545 -152056 69621 -106242 -198945 137285 122473 46409 105125 -260212 -3200 -144339 -233123
15534 -233123 -95253 119761 -40784 76077 274197 -178017 143843 277131 133208 86046
15524 86046 48317 -52603 253717 137552 200469 246801 308888 105768 229989 147300 189564
15513 189564 102499 175122 -291178 287228 226716 -269123 7433 22082 219019 132861 229673
15502 229673 -16070 -116466 123626 -66196 -120080 -169051 160257 -2356 256418 224493 155787
15491 155787 381492 -185389 184548 129990 413589 298859 -217704 98369 -5492 131368
15480 136091 -61401 87400 -111688 296170 368160 297168 205566 331120 472573 189180
$$ packed form
15557B03789b02418H6903J920L9029b68667B28961F8768B9005j2679b0796F2981
15545a52056F9621a06242r2703A37285j4812D6409N8716b60212c200j41139q8784
15534b33123i5253A19761d0784G6077J98120a78017A43843J33288A33208m7162
15524H6046l7729e2603B53717j16165O2917M6332O2087A05768J24221q2689M2264
15513A89564q7065P2623b91178B87228o0512b69123G433J4649J96937q6158R6812
15502B29673a6070j00396A23626f6196n3884m8971A60257b356B56418l1925o8706
15491A55787K25705a85389A84548n4558K83599j14730b17704I8369e492A31368
15480A36091f1401H7400a11688B96170P1990p0992r1602J25554J41453A89180
$$ plain form
15469 236863 514737 247527 152937 207057 64087 -61805 -15029 231864 -231982 112008
15458 -99467 -187609 4187 91956 78047 419702 174389 157947 61254 -36832 164486 76261
15446 -81873 -152813 251981 195961 110436 97904 472410 624713 864334 990085 25030 69061
15435 69061 83917 452261 106611 218613 35655 162846 251955 149861 -141018 -45342
15424 -250171 -39947 300003 377956 152499 181374 101330 28832 -3567 -195796 -192972 190980
15412 27782 148982 176645 -80862 84569 107909 -175711 -61688 230893 -348808 87779 -158340
15400 222440 -204702 74266 21007 236730 -46465 -19290 -180016 -74656 -202167 110571
15389 -240957 -23887 -257827 -141030 171526 59381 -183 -73983 -343552 -122340 -269635 -71560
$$ packed form
15469B36863K77874B47527r4590N4120F4087f1805a5029B31864b31982A12008
15458i9467q8142D187Q7769j3909L41655A74389j6442F1254c6832A64486G6261
15446h1873p0940B51981n6020q5525j2532L74506J52303K39621J25751B5030M4031
15435F9061J4856L68344A06611J12002C5655J27191Q9109j02094a41018d5342
15424b50171c9947C00003P7953A52499K8875q0044B8832c567j92229K824A90980
15412B7782J21200K7663h0862H4569K3340a75711f1688B30893c48808H7779a58340
15400B22440b04702G4266B1007K15723d6465a9290j60726g4656j27511A10571
15389b40957b3887k33940J16797A71526E9381a83p3800k69569a22340j47295g1560
$$ plain form
15377 100320 173095 -226020 166295 82538 206308 72095 224424 -70554 45773 317394
15367 317394 19555 9062 100176 90902 86357 -41444 76198 353938 174214 200589 -306242
15355 42742 192939 -6620 138257 -114455 -86555 113790 66638 310501 -137447 -321683
15345 -321683 8232 148246 111039 227986 39005 137469 271553 118226 -12492 168716 -183165
15333 -118401 173998 667898 -10804 211041 -19248 332323 51359 -7412 -121334 269046
15322 96316 94870 781 87336 -125828 -2901 -38619 33754 -83015 18792 408284 135119 2251
15309 52698 164920 138004 -3599 141058 178917 292359 318197 141419 -44116 321355 339696
15298 339696 71247 46171 -169493 164679 -106088 -31399 192409 55478 165374 -64269
$$ packed form
15377A00320P2775b26020A66295H2538J23770G2095J52329g0554D5773K71621
15367C17394A9555I062R1114r274m545d1444G6198K77740A74214K6375c06242
15355D2742J50197f620A38257a14455K7900A13790m7152K43863a37447j84236
15345c21683H232J40014l7207J16947C9005R8464J34084A18226a2492A68716a83165
15333a18401A73998M93900a0804B11041a9248C32323E1359g412j13922B69046
15322I6316j446G81Q6555a25828b901l5718C3754h3015A8792L89492A35119B251
15309E2698J12222k6916c599A41058L7859J13442K5838A41419d4116C21355J8341
15298C39696G1247k5076a69493A64679a06088c1399A92409E5478J09896f4269
$$ plain form
15287 298129 -612 -95784 -123173 -158111 482504 -162766 -250004 105810 -576191 -104726 -11955
15275 130798 129424 361163 320656 65534 -180119 -76120 -209513 175176 216538 190274 146939
15264 146939 158937 55765 64519 103135 69046 430700 -102689 -288363 9855 47565 -95493
15252 -48708 105085 144351 484262 -256673 85754 169628 2767 751171 929184 1592586 1167208
15241 1167208 1413999 1355432 644355 303401 -201430 91978 344700 13600 -82722 173586
15230 -124470 -101541 138877 66457 93841 -119951 171015 87624 -115003 179507 -145075
15219 37827 275600 108573 -62531 62667 -208218 3526 106557 -305826 -53314 73215 231162
15208 231162 11331 404063 -45487 -189059 -104204 -9519 -119445 -61484 165580 348143 149635
$$ packed form
15287B98129f12r5172k7389l4938D82504a62766q7238A05810e76191a04726a1955
15275A30798j374K31739m0507F5534a80119g6120j33393A75176M1362k6264m3335
15264A46939J1998E5765Q754L8616l4089L61654a02689j85674I855L7710i5493
15252d8708A05085L9266L39911b56673H5754Q3874B767P48404J78013O63402m25378
15241A167208K46791n8567F44355C03401b01430I1978K52722A3600h2722A73586
15230a24470K2929A38877F6457K7384a19951A71015q3391a15003A79507a45075
15219C7827K37773A08573f2531F2667b08218C526J03031c05826e3314G3215J57947
15208B31162A1331L92732d5487j43572Q4855i519j09926N7961A65580J82563A49635
$$ plain form
15196 -203285 -177994 -144130 -205807 127471 -94229 331938 -252628 154495 419678 188561
15185 -84776 143241 484178 11145 45059 21371 73588 125048 -271954 -15221 -36497 46689
15173 104769 69056 422365 108007 64317 -85855 177313 71761 -339972 88470 -48691 160664
15161 119654 -286931 -10937 155684 -114724 -121561 184177 185386 51404 243760 -45582 -5487
15149 -55417 65703 106462 -134402 -148067 -38038 260310 241091 25622 40039 -11362 -123071
15138 -123071 -19117 -55290 308760 90666 -215360 76000 324917 -9589 210496 211908 267513
15127 267513 -58814 -46850 -29424 205194 428751 85367 249436 381480 -94436 437669
15116 442662 212406 382653 93006 -16279 48622 181147 77866 286662 123119 143800
$$ packed form
15196b03285K5291L3864o1677A27471i4229C31938b52628A54495K65183A88561
15185h4776A43241L40937A1145L3914B1371N2217N1460b71954a5221k1276D6689
15173A04769l5713L53309A08007m3690h5855A77313G1761c39972H8470d8691A60664
15161A19654b86931a0937A55684a14724o837A84177J209E1404J92356d5582e487
15149e5417F5703M0759a34402j3665c8038B60310j9219B5622J4417a1362j11709
15138a23071a9117l6173C08760I0666b15360G6000K48917i589B10496J412N5605
15127B67513e8814J1964J7426B05194K23557H5367J64069J32044i4436D37669
15116D42662B12406J70247I3006a6279D8622J32525G7866K08796A23119K0681
$$ plain form
15106 143800 178879 11542 -10323 -119789 339188 343268 85198 76940 426490 357725 -57044
15094 26277 299149 125567 148820 87709 369450 246102 16749 24086 54928 142211 -66719
15082 79667 147320 162384 -72470 -88570 163867 -155638 90126 114820 -151111 204557 -43415
15070 104144 461611 69305 34975 369708 185848 141404 44186 20263 241581 185518 452533
15059 452533 192727 563112 213278 427691 493294 299346 230083 4727 45679 109072 66991
15048 66991 84439 513856 410951 470704 229857 331963 231557 338308 518599 628106
15038 628106 361419 380919 269120 202706 331413 194216 707584 425268 340784 612082
15028 612082 258047 692302 285782 461370 599974 412296 113276 88848 347169 434595
$$ packed form
15106A43800L5079A1542a0323j09466C39188M080H5198q258L49550o8765e7044
15094B6277K72872A25567K3253o1111K81741j23348A6749P337L0842Q7283f6719
15082G9667O7653J5064g2470j6100A63867a55638I0126K4694a51111B04557d3415
15070A04144L57467F9305l4330L34733j83860m4444D4186B0263K21318n6063K67015
15059D52533A92727L70385B13278K14413O5603j93948o9263D727M0952O3393m2081
15048F6991J7448M29417j02905N9753B29857J02106j00406J06751J80291J09507
15038F28106k66687J9500j11799o6414J28707j37197N13368k82316q4484K71298
15028F12082B58047M34255B85782J75588J38604j87678A13276k4428K58321Q7426
$$ plain form
15018 434595 616240 344339 180440 493785 382416 47291 329440 699555 -94293 366445
15007 813092 410229 559666 -2450 319981 453421 307503 392636 299589 342103 149863
14996 162417 834103 372584 423422 255351 344361 408033 293125 433680 139592 176848
14986 176848 250086 292964 375189 470335 208558 581827 843304 720185 531255 273333
14976 273333 457511 449695 321226 545361 446948 479788 533418 208790 309789 156606
14966 156606 289670 238489 641037 47573 236326 305620 272493 157044 286725 389116
14956 389116 23977 282374 99488 404547 146214 520111 125428 82022 233165 195417
14946 195417 376622 328895 406648 308058 476310 860732 550544 488197 363599 673702
$$ packed form
15018D34595J81645k71901j63899L13345j11369D7291K82149L70115i4293C66445
15007H13092m02863J49437b450C19981J33440j45918Q5133r3047M2514A49863
14996A62417O71686C72584N0838j68071Q9010O3672j14908J40555A39592L7256
14986A76848P3238M2878Q2225R5146B08558L73269K61477j23119j88930k57922
14976B73333J84178p816j28469K24135r8413L2840N3630B08790J00999j53183
14966A56606J33064n1181M02548D7573J88753O9294l3127j15449J29681J02391
14956C89116B3977K58397I9488L05059A46214L73897A25428m3406J51143l7748
14946A95417J81205m7727P7753r8590J68252L84422l10188o2347j24598L10103
$$ plain form
14936 673702 485139 408444 419903 169544 646557 777291 572309 342579 798295 1277738
14926 1277738 996852 1202574 1391498 1339168 1442595 906689 911704 1142812 1040366 1422218
14916 1422218 1239077 1655381 1379246 1486774 1005459 1042594 639523 1027881 444947 468267
14906 468267 491484 320922 280890 609102 303082 262066 174007 384941 4736 260691 365071
14895 365071 95353 539906 628943 669771 372472 594500 388720 794524 626035 508891
14885 508891 637589 430866 761903 792539 667459 849563 264657 520488 600066 380052
14875 380052 763914 899727 413767 685699 563581 461139 405191 595054 338558 757594
14865 757594 318843 670225 781847 589215 646457 489612 106834 362859 400448 642049
$$ packed form
14936F73702j88563p6695J1459A69544M77013J30734k04982k29730M55716M79443
14926A277738k80886K05722J88924n2330J03427n35906N015K31108j02446L81852
14916A422218j83141M16304k76135J07528m81315L7135m03071L88358D44947K3320
14906D68267K3217j70562m0032L28212C03082m1016q8059K10934D736K55955J04380
14895C65071I5353M44553Q9037M0828k97299K22028k05780M05804j68489j17144
14885E08891J28698k06723L31037L0636j25080J82104B64657K55831P9578k20014
14875C80052L83862J35813D13767K71932j22118j02442n5948J89863k56496M19036
14865G57594C18843L51382J11622j92632N7242j56845A06834K56025L7589K41601
$$ plain form
14855 642049 314774 611259 497571 242016 494998 204440 541333 504634 620467 674932
14845 674932 124716 650553 655638 486056 1050525 1080892 753594 991225 1105421 799260
14835 799260 692050 979003 727535 353658 892943 832938 789091 640027 781366 553437
14825 553437 378482 722573 562223 291545 723886 455820 528545 812766 970335 1028400
14815 1028400 585251 679520 350629 505869 537353 559550 520272 819596 386860 680600
14805 680600 669677 736545 652651 889476 984650 910763 840408 641798 621330 572436 539755
14794 539755 520271 291225 647020 829130 685304 746902 708978 647833 179482 790197
14784 790197 693811 836214 519726 760812 561862 1161643 911674 543390 669918 477620
$$ packed form
14855F42049C14774K96485j13688B42016K52982B04440L36893l6699J15833N4465
14845F74932A24716N25837N085j69582N64469L0367l27298K37631J14196l06161
14835G99260j07210K86953k51468C53658N39285o0005m3847j49064J41339k27929
14825E53437j74955L44091j60350k70678M32341k68066P2725K84221J57569N8065
14815A028400m43149R4269l28891J55240L1484K2197l9278K99324C86860K93740
14805F80600j0923O6868q3894K36825R5174p3887p0355j98610k0468m8894l2681
14794E39755j9484k29046L55795J82110j43826O1598l7924o1145A79482O10715
14784G90197r6386J42403l16488K41086j98950N99781k49969l68284J26528j92298
$$ plain form
14774 477620 752897 869207 854538 723992 447701 631385 502282 692022 387448 514392
14764 514392 390978 371974 785616 511214 566011 578054 557283 292911 799982 844671
14754 844671 828349 616720 529190 665420 430753 508778 749283 832690 948950 468832
14743 870788 806131 909012 711991 925290 774351 686346 855326 834394 1164264 885223
14733 885223 556762 602354 783505 943489 777472 854553 1354324 1263318 1434620 1352929
14723 1352929 1696758 1415854 1153217 1047322 878012 1104061 820471 652522 1190783
14714 1190783 1371620 930688 677029 965661 684846 996800 851277 1025084 498766
14704 802603 881682 948037 1000636 1345402 941460 1446917 1396274 1499538 1554094 1038301
$$ packed form
14774D77620K75277J16310j4669j30546k76291J83684j29103J89740l04574J26944
14764E14392j23414j9004M13642k74402N4797J2043k0771k64372N07071M4689
14754H44671j6322k11629q7530J36230k34667P8025K40505Q3407J16260D68832
14743H70788o4657J02881j97021K13299j50939q8005J68980k0932L29870k79041
14733H85223l28461M5592J81151J59984j66017P7081M99771r1006J71302q1691
14723A352929L43829k80904k62637j05895j69310K26049k83590j67949N38261
14714A190783J80837m40932k53659K88632k80815L11954j45523J73807D98766
14704H02603P9079O6355N2599L44766m03942N05457n0643J03264N4556n15793
$$ plain form
14694 1038301 1306934 1117158 1169739 916020 1182280 972230 791901 960897 769070 1144122
14684 1144122 1053957 1093267 1224387 889822 1078053 965653 843264 1280456 1118216 1016826
14674 1016826 946328 1172825 727060 1248523 913843 1060344 1239079 1089884 775611 1028785
14664 1028785 945767 792977 1272547 849858 1182496 1196254 881888 1101253 1141222 1161181
14654 1161181 1232736 1241401 1226931 1037136 1313423 1036791 1428945 1065983 1200090 1354512
14644 1354512 1549131 1171449 1043899 1241629 1185485 1146129 1088484 1071128 1604748 1101995
14634 1101995 973696 968244 1199001 1082341 1266682 1436681 1360331 1262955 1231578 1685013
14624 1685013 1318719 1384494 1411450 1570998 1447442 986193 1258609 1135831 1220647 1527000
$$ packed form
14694A038301K68633j89776N2581k53719K66260k10050j80329J68996j91827L75052
14684A144122r0165L9310J31120l34565J88231j12400j22389M37192j62240j01390
14674A016826p0498K26497m45765N21463l34680J46501J78735j49195l14273K53174
14664A028785q3018j52790M79570m22689L32638J3758l14366K19365L9969J9959
14654A161181P1555Q665j4470j89795K76287k76632L92154l62962J34107J54422
14644A354512J94619l77682j27550J97730n6144l9356n7645j7356N33620n02753
14634A101995j28299n452K30757j16660J84341J69999p6350r7376l1377M53435
14624A685013l66294O5775K6956J59548j23556m61249K72416j22778Q4816L06353
$$ plain form
14614 1527000 1411534 1352393 1219771 1636135 1637180 1385724 1541936 1381755 1820553 1518080
14604 1518080 1582143 1797488 1540369 1502318 1192291 1717148 1751445 1919878 1696495 1707559
14594 1707559 1691625 1428601 1570658 1645708 1298751 1658054 1743642 1691700 1772489 1993306
14584 1993306 1514452 1980866 1930875 1929034 1894312 2143203 1667354 1812171 1919048 2066930
14574 2066930 1751443 2138450 1774976 2225451 2293005 2367416 2155906 1974677 2214021 2526180
14564 2526180 2108149 2591531 2711531 2356865 2480010 2689429 2787863 2846464 3457691 3204363
14554 3204363 3452487 3646004 4296866 4656644 6159029 8283507 12955555 21624005 36661957
14545 36661957 43402634 19989891 7484175 4401377 3641201 3871794 5041303 3257622
$$ packed form
14614A527000j15466n9141j32622M16364J045k51456J56212j60181M38798l02473
14604A518080O4063K15345k57119l8051l10027N24857L4297J68433k23383J1064
14594A707559j5934k63024J42057P5050l46957L59303Q5588n1942Q0789K20817
14584A993306m78854M66414m9991j841l4722K48891m75849J44817J06877J47882
14574B066930l15487L87007l63474M50475O7554P4411k11510j81229K39344L12159
14564B526180m18031M83382J20000l54666J23145K09419R8434N8601O11227k53328
14554C204363K48124J93517O50862L59778J502385K124478M672048Q668450J5037952
14545C6661957O740677A9989891G484175l082798p60176K30593J169509j783681
$$ plain form
14537 3257622 2253322 1851492 2160699 1744829 2057918 2209629 2069156 2209871 1744056
14528 1744056 2201260 2504500 2403608 2393887 2505315 2494665 2251509 2310994 2342121 2553162
14518 2553162 2305553 2371204 2611530 2769815 2873507 2676196 2663467 2727651 2450918 2776720
14508 2776720 2558873 2649148 2713905 2906244 3108771 2725028 2974022 2959950 3270333 3307255
14498 3307255 3070923 3349314 3422543 3069169 3411890 3069338 3207305 3356190 3225286 3374638
14488 3374638 3480697 3466395 3574740 3655790 3296418 3835520 3926032 3702718 3811347 3859274
14478 3859274 3677371 4072118 4116428 4311099 4069067 4138512 4471014 4228282 4363054 4507730
14468 4507730 4133612 4782960 4165490 4468379 4467723 4875037 4621017 4595818 4849337 4025917
$$ packed form
14537C257622j004300m01830L09207m15870L13089J51711j40473J40715m65815
14528A744056M57204L03240j00892r721J11428j0650k43156N9485L1127K11041
14518B553162k47609O5651K40326J58285J03692j97311j2729O4184k76733L25802
14508B776720k17847R0275O4757J92339K02527l83743K48994j4072L10383L6922
14498C307255k36332K78391P3229l53374L42721l42552J37967J48885j30904J49352
14488C374638J06059j4302J08345Q1050l59372N39102R0512k23314J08629M7927
14478C859274j81903L94747M4310J94671k42032O9445L32502k42732J34772J44676
14468D507730l74118O49348o17470L02889o56M07314k54020k5199K53519q23420
$$ plain form
14458 4025917 4486425 4785151 4916932 4720146 5188781 4901222 4781936 5402139 5264256
14449 5264256 5155082 5663738 5529556 5628051 5454969 5544502 6102513 6029917 6075724 5772061
14439 5772061 6196586 6235313 6050818 6349195 6759318 6496158 6365023 6631676 7037053 6840473
14429 6840473 6834187 7074996 7278775 7346823 7131123 7516768 7523605 7447537 7709106 7826550
14419 7826550 8070963 8459570 8821189 8323517 8921669 8766044 8607722 9119188 8790421
14410 8790421 8959010 9298723 9263519 9718333 9729012 9613433 9936909 10277786 10306887 10614748
14400 10614748 10587564 11055318 10998173 11216208 11188579 11356307 11470120 11682048 11847172 12070412
14390 12070412 12276754 12400901 12791875 12971211 13310416 13548125 13846954 13875894 14054670
$$ packed form
14458D025917M60508K98726J31781j96786M68635k87559j19286O20203j37883
14449E264256j09174N08656j34182R8495j73082Q9533N58011p2596M5807l03663
14439E772061M24525L8727j84495K98377M10123k63160j31135K66653M05377j96580
14429F840473o286K40809K03779O8048k15700L85645O837p6068K61569J17444
14419G826550K44413L88607L61619m97672N98152j55625j58322N11466l28767
14410H790421J68589L39713l5204M54814J0679j15579L23476L40877K9101L07861
14400A0614748k7184M67754n7145K18035k7629J67728J13813K11928J65124K23240
14390A2070412K06342J24147L90974J79336L39205K37709K98829K8940J78776
$$ plain form
14381 14054670 14472476 14930724 15119313 15400485 15825263 15900729 15993959 16611542 16968241 16802670
14371 16802670 17571388 17723554 18226610 18672457 18637604 19562256 19864131 20373534 20858498
14362 20858498 21158857 21737439 21977907 22041460 22408113 23480959 24124341 24414721 24833272
14353 24833272 25539941 26042158 26724720 27470693 28072081 29063113 29752593 30060541 30985425
14344 30985425 31950093 32663112 33565864 34228435 35168179 36190825 37432371 38220260 39885045
14335 39885045 40889837 41771035 42997284 44306657 45385540 47170186 48494805 50023400
14327 50023400 51458707 53196057 55032901 56835261 58668159 60706837 62708730 65271556
14319 65271556 67692339 69735882 72547101 75246633 77934950 80734376 83920987 87367344
$$ packed form
14381A4054670M17806M58248J88589K81172M24778P5466R3230O17583L56699j65571
14371A6802670P68718J52166N03056M45847l4853R24652L01875N09403M84964
14362B0858498L00359N78582K40468O3553L66653J072846O43382K90380M18551
14353B4833272P06669N02217O82562P45973O01388R91032O89480L07948R24884
14344C0985425R64668P13019R02752O62571R39744J022646J241546P87889J664785
14335C9885045J004792Q81198J226249J309373J078883J784646J324619J528595
14327E0023400J435307J737350J836844J802360J832898K038678K001893K562826
14319F5271556K420783K043543K811219K699532K688317K799426L186611L446357
$$ plain form
14311 87367344 90732490 94252625 98331198 102522872 106701982 110817194 116262378 121242290
14303 121242290 126729783 132870395 139058891 145577103 152436918 159532358 167496762 175758557
14295 175758557 184595336 193725070 203632160 214224164 224865706 236443098 248882404
14288 248882404 261375487 274617643 288548450 302544189 317044084 331820992 346670024
14281 346670024 361644710 376209290 390521846 404140289 417438995 428999135 439066081
14274 439066081 445789971 449552111 451837809 452799006 453135556 453417152 453792931 451578977
14266 451578977 444912604 435813176 425104317 413235752 400670598 386705558 371848981
14259 371848981 356901447 341629487 326246631 311585955 296849206 282458692 268594839
$$ packed form
14311H7367344L365146L520135M078573M191674M179110M115212N445184M979912
14303A21242290N487493O140612O188496O518212O859815P095440P964404Q261795
14295A75758557Q836779R129734R907090J0592004J0641542J1577392J2439306
14288B48882404J2493083J3242156J3930807J3995739J4499895J4776908J4849032
14281C46670024J4974686J4564580J4312556J3618443J3298706J1560140J0066946
14274D39066081O723890L762140K285698R61197L36550K81596L75779k213954
14266D51578977o666373r099428j0708859j1868565j2565154j3965040j4856577
14259C71848981j4947534j5271960j5382856j4660676j4736749j4390514j3863853
$$ plain form
14252 268594839 255426666 242609278 231584755 220903535 209886649 199141619 189552311
14245 189552311 180443681 172049231 163947947 156421818 148588913 142175873 135758745 129981885
14237 129981885 124488605 118978932 113681843 108680096 104315749 100150858 96262455 92625703
14229 92625703 88857633 85086676 82160487 78945731 76050928 73453290 70507636 67730068
14221 67730068 65462859 63594996 61511631 59333466 57406698 55464604 53615363 52044375
14213 52044375 50633208 48952369 47043303 45823534 44441947 43183155 42511912 41080592
14205 41080592 40182070 38684503 37611856 36495373 35911215 35200539 33907821 33087447 32049614
14196 32049614 31231397 30557668 29940405 29293409 28150380 28017813 26716001 26563574 25700782
$$ packed form
14252B68594839j3168173j2817388j1024523j0681220j1016886j0745030r589308
14245A89552311r108630q394450q101284p526129p832905o413040o417128n776860
14237A29981885n493280n509673n297089n001747m364347m164891l888403l636752
14229I2625703l768070l770957k926189l214756k894803k597638k945654k777568
14221F7730068k267209j867863k083365k178165j926768j942094j849241j570988
14213E2044375j411167j680839j909066j219769j381587j258792o71243j431320
14205D1080592q98522j497567j072647j116483n84158p10676j292718q20374j037833
14196C2049614q18217o73729o17263o46996j143029j32567j301812j52427q62792
$$ plain form
14187 25700782 25081162 24525788 24311250 23391032 22864591 22656043 21701330 21610013 21095547
14178 21095547 20196004 20195526 19859788 19261628 19128341 18293078 17625633 17842355 17863644 17365376
14168 17365376 16557265 16648985 16222751 16296453 15687552 15417522 15221841 14921536 14429525 14163478
14158 14163478 14060887 13620759 13704417 13425169 13089513 13049721 12580742 12312805 12456607 12392513
14148 12392513 12064229 11849361 11453007 11402054 11405496 10998758 10554424 10689945 10484538 10645289
14138 10645289 10000275 9939913 10003386 9919792 9550613 9735752 9183082 9305260 9456049 8847953
14128 8847953 8666128 8706122 8722023 8244860 8374526 8493300 8006326 7947924 7981558 8100741
14118 8100741 8119343 7572061 7494362 7592407 7450407 7301234 7194691 7100584 7222684 6795384
$$ packed form
14187B5700782o19620n55374k14538r20218n26441k08548r54713r1317n14466
14178B1095547q99543m78l35738n98160j33287q35263o67445K16722K1289m98268
14168A7365376q08111R1720m26234P3702o08901k70030j95681l00305m92011k66047
14158A4163478j02591m40128Q3658k79248l35656l9792m68979k67937J43802o4094
14148A2392513l28284k14868l96354n0953L442m06738m44334J35521k05407J60751
14138A0645289o45014o0362O3473q3594l69179J85139n52670J22178J50789o08096
14128H847953j81825L9994J5901m77163J29666J18774m86974n8402L3634J19183
14118H100741J8602n47282p7699R8045j42000j49173j06543r4107J22100m27300
$$ plain form
14108 6795384 6561381 7056794 6916251 6591700 6681936 6521215 6288030 6353895 6275461 5749159
14098 5749159 6056655 6012371 5876138 6009134 6037467 6016231 5772286 5836864 5503996 5375385
14088 5375385 5721632 5535053 5390048 5444661 4798040 5014739 4819406 5163288 5332761 4816912
14078 4816912 5014468 5069926 4742199 4988203 4512459 4484203 4448470 4227072 4482112 4671762
14068 4671762 4349961 4341937 4340709 4242445 4076247 4220562 3888469 4112652 4180667 4075337
14058 4075337 3991787 4174883 4043388 3813676 3888821 3731565 3848499 3814454 3571946 3404749
14048 3404749 3564078 3697504 3360912 3688127 3365080 3769454 3369122 3505974 3247556
14039 3247556 3279086 3109722 3005533 3113194 3123025 3354820 3360593 3073144 3298116 3214766
$$ packed form
14108F795384k34003M95413j40543l24551R0236j60721k33185O5865p8434n26302
14098E749159L07496m4284j36233J32996K8333k1236k43945O4578l32868j28611
14088E375385L46247j86579j45005N4613o46621K16699j95333L43882J69473n15849
14078D816912J97556N5458l27727K46004m75744k8256l5733k21398K55040J89650
14068D671762l21801q024j228r8264j66198J44315l32093K24183O8015j05330
14058D075337q3550J83096j31495k29712P5145j57256J16934l4045k42508j67197
14048C404749J59329J33426l36592L27215l23047M04374m00332J36852k58418
14039C247556L1530j69364j04189J07661R831K31795N773k87449K24972q3350
$$ plain form
14029 3214766 2977324 3414452 3388923 2819792 3052555 2833774 2712567 2726730 2841026 2730019
14019 2730019 2543965 2852968 2696213 2778062 2796512 2447023 2792503 2650285 2436265 2449855
14009 2449855 2263839 2521213 2401102 2352677 2316880 2461031 2430839 2146789 2193107 2374856
13999 2374856 2452564 2451221 1966688 2303151 1946910 2209539 2230196 2391296 2440680 3175025
13989 3175025 4677575 7291910 14980908 30645643 45190233 28306512 13459910 7666758
13981 7666758 5972963 4622324 4266436 3701236 3415931 3386599 3048819 2894681 2735114
13972 2735114 2632587 2652977 2312966 2755269 2672657 2453081 2615919 2284098 1916107 2397032
13962 2397032 2366872 2148261 1970151 2312799 2040943 2088301 2255827 2135840 1984140 1946526
$$ packed form
14029C214766k37442M37128k5529n69131K32763k18781j21207J4163J14296j11007
14019B730019j86054L09003j56755Q1849J8450l49489L45480j42218k14020J3590
14009B449855j86016K57374j20111m8425l5797J44151l0192k84050M6318J81749
13999B374856P7708j343m84533L36463l56241K62629K0657J61100M9384P34345
13989C175025J502550K614335P688998J5664735J4544590j6883721A3459910n793152
13981G666758j693795j350639l55888n65200k85305k9332l37780j54138j59567
13972B735114j02527K0390l40011M42303q2612k19576J62838l31821l67991M80925
13962B397032l0160k18611j78110L42648k71856M7358J67526j19987j51700l7614
$$ plain form
13952 1946526 1867107 1974710 2041204 1994167 2004791 1911403 1776150 1916130 1811302 1882753
13942 1882753 1685333 2118423 1896873 1666749 1656355 1695503 1981398 1815090 1712897 1915818
13932 1915818 1789669 1782760 1901488 1684969 1752703 1386987 1351585 1438023 1443447 1662348 1499522
13921 1499522 1558022 2084293 1556702 1742141 1526048 1416798 1322695 1430949 1683080 1626573
13911 1626573 1498973 1494738 969648 1574358 1303096 1339871 1025777 1207766 1635972 1520728
13901 1520728 1270005 1603613 1334304 1431832 1614623 1391622 1315477 1418946 1364812 1357089
13891 1357089 1491203 1170408 1262497 1303497 1272938 1317459 1286666 1414903 1344828 1449643
13881 1449643 1275122 1051124 1101649 1223845 853976 1210508 1287227 1235239 986972 1294979
$$ packed form
13952A946526p9419J07603O6494m7037J0624r3388j35253J39980j04828P1451
13942A882753j97420M33090k21550k30124j0394L9148K85895j66308j02193K02921
13932A915818j26149o909J18728k16519O7734l65716l5402Q6438N424K18901j62826
13921A499522N8500N26271n27591J85439k16093j09250r4103J08254K52131n6507
13911A626573j27600m235n25090O04710k71262L6775l14094J81989M28206j15244
13901A520728k50723L33608k69309R7528J82791k23001p6145J03469n4134p723
13891A357089J34114l20795R2089M1000l0559M4521l0793J28237p0075J04815
13881A449643j74521k23998N0525J22196l69869L56532P6719n1988k48267L08007
$$ plain form
13871 1294979 1074964 1102690 1208524 1110810 1098881 1433075 1328580 1062014 1113199 1005871
13861 1005871 947979 1133160 1141117 1226176 1150130 982189 1040862 812863 620531 1137964
13851 1137964 1151729 835127 1219076 892867 895509 978857 1122687 1007937 1349607 980234
13841 980234 1268387 1172541 948392 1164553 1184497 1144068 814908 503895 974145 857223
13831 857223 777713 797088 888683 570791 1042767 947870 803826 746664 747248 835742 855366
13820 855366 650153 1165139 713478 959155 684837 550755 919004 1254794 905245 1150180
13810 1150180 688928 899934 914216 864405 893165 1147598 437731 872685 909992 632037
13800 632037 957228 844927 924564 628330 833515 835735 763529 728297 797393 713999 839432
$$ packed form
13871A294979k20015K7726J05834r7714j1929L34194j04495k66566N1185j07328
13861A005871n7892J85181P957Q5059p6046j67941N8673k27999j92332N17433
13851A137964J3765l16602L83949l26209K642Q3348J43830j14750L41670l69373
13841I80234K88153r5846k24149K16161J9944m0429l29160l11013M70250j16922
13831H57223p9510J9375R1595l17892M71976r4897j44044n7162N84Q8494J9624
13820H55366k05213N14986m51661K45677k74318j34082L68249L35790l49549K44935
13810A150180m61252K11006J4282m9811K8760K54433D37731M34954L7307k77955
13800F32037L25191j12301P9637k96234K05185K220p2206l5232O9096q3394J25433
$$ plain form
13789 839432 909327 768359 667507 522344 895715 730189 1010636 587933 812814 722427
13779 722427 853787 930324 646403 1006765 571782 896835 940854 972311 883242 862417
13769 862417 567003 706212 657393 420914 641659 484342 907469 743266 897389 736835
13759 736835 721276 724798 621980 1234620 935211 632840 735153 712064 581093 538504
13749 538504 564251 604867 668793 552111 415247 625726 454605 758656 674533 425885
13739 425885 621145 837053 545445 697830 402784 770430 688593 434589 752712 314560
13728 595879 645204 663093 664806 627719 514806 243269 490606 384707 458911 640980 494193
13717 494193 379538 501669 602750 374407 553426 652790 772216 697531 518806 551790
$$ packed form
13789H39432O9895j40968j00852j45163L73371j65526K80447m22703K24881r0387
13779G22427J31360P6537k83921L60362m34983L25053M4019L1457q9069k0825
13769H62417k95414J39209m8819k36479K20745j57317M23127j64203J54123j60554
13759G36835j5559L522j02818O12640k99409l02371J02313k3089j30971m2589
13749E38504K5747M0616O3926j16682j36864K10479j71121L04051q4123k48648
13739D25885J95260K15908k91608J52385k95046L67646q1837k54004L18123C14560
13728E95879M9325J7889J713l7087j12913B43269K47337j05899P4204J82069j46787
13717D94193j14655J22131J01081k28343J79019R9364J19426p4685j78725L2984
$$ plain form
13707 551790 466524 601825 545974 582064 384928 222954 496740 460029 603169 377666
13697 377666 264609 619873 694398 329793 254307 447585 739360 631772 496729 464159
13687 464159 909200 604194 243567 461979 536939 641568 380410 483709 473980 471389
13677 471389 238656 465885 -2999 487760 173847 559898 801449 466507 303423 443394
13667 443394 887943 297805 439632 480967 478079 284411 310738 523204 396080 729473
13657 729473 265370 660041 330973 151812 248017 193532 839765 243813 622660 399857
13647 399857 582043 382396 343414 348330 633071 582694 589153 446998 458936 476523 591809
13636 591809 415931 169111 268923 582822 314096 447647 561799 364497 -39379 821095
$$ packed form
13707E51790q5266J35301n5851L6090j97136j61974K73786l6711J43140k25503
13697C77666j13057L55264P4525C29793p5486J93278K91775j07588j35043l2570
13687D64159M45041l05006B43567K18412P4960J04629k61158J03299r729k591
13677D71389k32733K27229b999D87760A73847L86051K41551l34942j63084J39971
13667D43394M44549B97805J41827M1335k888j93668K6327K12466j27124L33393
13657G29473B65370L94671l29068A51812R6205n4485O46233B43813L78847k22803
13647C99857J82186j99647l8982M916K84741n0377O459j42155J1938J7587J15286
13636E91809j75878A69111R9812L13899k68726J33551J14152j97302c9379H21095
$$ plain form
13625 415432 107443 525647 344517 825373 524207 573572 307443 291639 312743 445034
13615 445034 227196 399559 248095 282907 427969 268601 500100 259702 320554 169496
13605 169496 552333 426029 237511 395915 518544 268290 585508 536512 332840 345096
13595 345096 350976 542355 765326 19402 500776 311929 342609 332124 166345 381765
13585 381765 274914 -169418 371266 358729 630708 213036 551230 224642 290937 532024
13575 532024 378605 476982 211504 414919 373303 422559 30658 656721 322455 176797
13565 176797 290387 285899 575797 312157 310658 74575 142256 385260 188052 236832 379179
13554 379179 462792 570205 505611 167785 403479 454484 6102 83071 191624 637040 584447
$$ packed form
13625D15432A07443M18204j81130M80856l01166M9365k66129j5804K1104J32291
13615D45034k17838J72363j51464L4812J45062j59368K31499k40398O0852j51058
13605A69496L82837j26304j88518J58404J22629k50254L17218m8996k03672J2256
13595C45096N880J91379K22971A9402M81374j88847L0680j0485j65779K15420
13585C81765j06851a69418C71266j2537K71979B13036L38194B24642O6295K41087
13575E32024j53419R8377B11504K03415m1616M9256C0658O26063C22455j45658
13565A76797J13590m488K89898k63640j499G4575O7681K43004A88052M8780J42347
13554C79179Q3613J07413o4594A67785K35694N1005F102P6969J08553M45416n2593
$$ plain form
13543 584447 137343 409535 540373 144203 78694 260252 87231 427015 261937 321175
13533 321175 49289 140782 199925 300106 286655 311906 87565 318564 139039 265145 711412
13522 711412 270016 375704 394517 -44724 302673 100408 -52296 379606 361651 344376
13512 344376 243263 301188 414758 399164 336562 123603 153216 544145 155019 252870
13502 252870 369402 21784 92234 145633 680979 244959 204602 -231620 298865 101028
13491 463587 24400 672397 254355 198664 264956 333351 408274 -92155 403598 163377 559428
13480 559428 67924 113240 353690 -82416 389565 75186 247174 342688 333593 338294 308576
13469 308576 239721 56246 194093 -34087 133217 148492 190334 238028 209001 7352 358026
$$ packed form
13543E84447A37343K72192J30838A44203o5509J81558H7231L39784j65078N9238
13533C21175D9289R1493N9143J00181j3451K5251H7565K30999A39039J26106M46267
13522G11412B70016J05688J8813d4724C02673A00408e2296C79606j7955j7275
13512C44376j01113N7925J13570j5594o2602A23603K9613L90929A55019R7851
13502B52870J16532B1784P0450N3399N35346B44959m0357b31620B98865A01028
13491D63587B4400O47997B54355n5691O6292O8395P4923i2155D03598A63377L96051
13480E59428F7924M5316K40450h2416C89565G5186J71988R5514r095M701k9718
13469C08576o8855E6246J37847c4087A33217J5275M1842M7694k9027G352L50674
$$ plain form
13458 358026 170405 301164 -9695 239454 396853 526186 272975 242127 340287 451036
13448 451036 444083 17431 232814 -66295 326325 147781 272888 253849 279702 233891 204321
13437 204321 119166 184671 470699 303062 243376 248241 293865 342935 222607 320701 -90547
13425 122681 504282 -207710 127934 185014 258022 149963 257608 155688 83094 191674
13415 191674 -240875 -130922 184377 172894 536220 220781 284192 211393 212717 -79570 112243
13403 159128 144984 610453 -7311 377558 199167 160870 -159490 162069 77475 196909
13393 196909 111128 392203 97477 -64252 217157 77225 75793 344962 236367 321725 305011
13382 305011 213032 -295150 1676 135373 299645 327804 311970 146573 198700 266618 237291
$$ packed form
13458C58026A70405J30759i695B39454J57399J29333k53211l0848R8160J10749
13448D51036o953A7431K15383f6295C26325A47781J25107j9039K5853m5811k9570
13437B04321q5155O5505K86028j67637n9686M865M5624M9070j20328R8094i0547
13425A22681L81601b07710A27934N7080P3008j08059J07645j01920p2594J08580
13415A91674b40875J09953A84377j1483L63326B20781O3411p2799J324g9570A12243
13403A59128j4144M65469g311C77558j78391l8297a59490A62069G7475J19434
13393A96909q5781K81075I7477f4252B17157G7225j432K69169j08595Q5358j6714
13382C05011r1979b95150A676J33697J64272K8159j5834A46573N2127O7918k9327
$$ plain form
13371 237291 272932 79851 288583 235202 246859 351474 495100 358438 231148 195398
13361 195398 158025 130647 241199 246858 281559 187129 252021 271414 246310 133715 -24046
13349 386457 107291 343244 114047 151368 177203 191969 297067 558299 455971 592280
13339 592280 76358 516105 14431 439954 532346 476012 628073 257438 221891 49777 461799
13328 461799 -126550 314571 -137076 377883 10935 473344 95743 165027 296587 157909
13318 157909 231977 10294 282221 264816 211963 246355 266445 197341 658570 322341 425884
13307 425884 2215 82988 208981 233431 295336 229220 -23082 -9666 227162 357558 83654
13295 67565 -78088 180978 182093 434537 -232128 78861 135852 -200600 104747 161909 -299260
$$ packed form
13371B37291L5641G9851K08732n3381J1657J04615J43626j36662j27290l5750
13361A95398l7373k7378J10552N659L4701r4430O4892J9393k5104j12595b4046
13349C86457A07291K35953A14047L7321K5835J4766J05098K61232j02328J36309
13339E92280G6358M39747A4431M25523R2392n6334J52061B57438l5547D9777M12022
13328D61799a26550C14571a37076C77883A0935M62409I5743O9284J31560j38678
13318A57909P4068A0294K71927j7405n2853L4392K0090o9104M61229C22341J03543
13307D25884B215Q0773J25993K4450O1905o6116b3082i666B27162J30396H3654
13295F7565g8088A80978J115K52444b32128G8861N6991b00600A04747N7162b99260
$$ plain form
13283 271226 169750 149508 123209 43677 30027 685865 162032 315548 103319 12406
13272 325827 19068 23502 -67083 369225 243765 141088 141612 -85550 -21791 -240944 153273
13260 131204 34458 244058 -219072 -27131 151826 123549 341569 404333 -132640 -300921
13250 -300921 349187 -229490 184150 -114210 107880 145283 329780 139347 344501 309161
13240 309161 -83817 568883 -101139 239176 11555 266195 149888 -175790 465900 87616
13229 -64272 273044 367683 4483 497125 74128 18019 26414 -195791 35965 49124 213275
13218 213275 160179 274662 14973 91321 -196026 -64672 267903 29163 -155274 343823
13207 -35858 66838 245842 164804 157680 120310 34789 -192426 45217 107535 52807 46780 171962
$$ packed form
13283B71226j01476k0242k6299D3677j3650O55838A62032J53516A03319A2406
13272C25827A9068M434f7083C69225j25460j02677N24h5550b1791k19153A53273
13260A31204C4458K09600b19072b7131A51826k8277K18020O2764a32640j68281
13250c00921C49187b29490A84150a14210A07880L7403J84497A39347K05154l5340
13240C09161h3817E68883a01139B39176A1555K54640j16307a75790D65900H7616
13229f4272B73044R4639D483M92642G4128A8019Q395a95791C5965J3159J64151
13218B13275n3096J14483A4973P6348a96026f4672B67903B9163a55274C43823
13207c5858F6838J79004q1038p124l7370C4789a92426D5217O2318E2807o027J25182
$$ plain form
13195 171962 158158 -32816 343684 -344732 83705 67485 -158209 -97598 184372 -22932 507020
13183 486 -166596 344080 -70690 -31112 113993 298000 -4697 245976 46775 294725 -76189
13171 176126 5510 46577 102891 106516 121244 -193715 -102593 -252603 -85378 84335 22603
13159 114532 187259 126112 206491 -3521 9310 392 65976 -33563 134068 146780 -201741 -293021
13147 -293021 33812 -112141 38164 186298 116617 -195664 352153 93811 -114745 14670
13136 -61290 184542 19850 -16662 67387 -71279 267191 312349 -71706 214679 208963 -187899
13124 21282 -193026 45002 419866 16331 170874 -309938 67633 40266 111292 95651 63237
13113 63237 -153379 355723 26468 83248 251377 263444 244822 -31295 18053 77086 100591
$$ packed form
13195A71962j3804c2816C43684c44732H3705j6220a58209O0611A84372b2932E07020
13183D86a66596C44080g0690c1112A13993J84007d697B45976D6775K47950g6189
13171A76126E510M1067N6314L625J4728a93715R1122j50010h5378H4335B2603
13159A14532P2727o1147Q0379c521I310C92O5584c3563A34068J2712b01741r1280
13147b93021C3812a12141C8164J48134o9681a95664C52153I3811a14745A4670
13136f1290A84542A9850a6662F7387g1279B67191M5158g1706B14679n716a87899
13124B1282a93026D5002L74864A6331J54543c09938F7633k7367P1026j5641l2414
13113F3237a53379C55723B6468N6780J68129J2067j8622c1295A8053N9033K3505
$$ plain form
13102 100591 280941 218396 -98092 253042 -92296 96861 17823 106188 37571 211497 -162870
13090 27207 -102452 178186 -28845 19909 105561 -19990 -78539 -58358 438067 -204410 -387417
13079 -387417 101612 391317 305859 -54384 208368 121131 -88045 336744 107962 -101453
13068 163832 -202572 116662 110458 -41636 59519 -169607 140029 -41843 58274 -48177 26207
13056 173499 95121 -37698 162501 101287 65856 -414345 270118 -199735 243348 -51540
13045 -38742 430605 126445 -27612 34672 325196 40272 -209528 159455 54144 -11577 -41184
13034 -41184 84222 -139872 313243 105286 243554 57881 435678 -2415 -162513 8922 -32107
13022 217544 210094 -56690 97824 -24606 140453 -54839 -164969 95560 -99543 8126 20419
$$ packed form
13102A00591J80350o2545i8092B53042i2296I6861A7823Q8365C7571J73926a62870
13090B7207a02452A78186b8845A9909Q5652a9990n8549K0181D38067b04410j83007
13079c87417A01612K89705q5458e4384B08368q7237h8045C36744A07962a01453
13068A63832b02572A16662o204d1636E9519a69607A40029d1843E8274d8177B6207
13056A73499p8378c7698A62501o1214l5431d14345B70118a99735B43348e1540
13045c8742D30605A26445b7612C4672K90524D0272b09528A59455E4144a1577k9607
13034d1184H4222a39872C13243A05286J38268E7881L77797b415j60098H922c2107
13022B17544p450e6690I7824b4606A40453e4839j10130I5560i9543H126J2293
$$ plain form
13011 20419 175745 179335 53519 75553 275089 82224 251873 156304 105844 32635 153585
13000 153585 57852 55010 -61254 22176 139067 -85037 -153992 20197 150210 79910 335567
12989 335567 157566 185388 -145842 287619 206166 363289 -66669 3776 216417 -6338 223199
12977 200345 -74605 291151 280747 123809 -49105 197805 -56950 223252 68406 122854 82489
12966 82489 5006 165833 174021 78569 195351 188693 -33894 261762 -30107 109668 -221920
12954 -55300 -121024 71085 8693 13935 -5709 -154333 18181 138067 -110385 -40962 8544 -198903
12941 -9221 125671 76849 -279576 337992 58636 -57396 -146654 141269 201185 179932 -150383
12929 -149319 -196184 -32157 101016 56024 -83714 65356 -30670 285785 -497165 59008 135834
$$ packed form
13011B0419J55326L590E3519K2034J99536H2224J69649r5569n0460C2635J20950
13000A53585E7852k842f1254B2176J16891h5037o8955B0197J30013p0300K55657
12989C35567A57566K7822a45842B87619q1453J57123f6669C776K12641f338B23199
12977B00345g4605B91151j0404A23809d9105A97805e6950B23252F8406N4448m0365
12966H2489E006J60827Q188G8569J16782o658c3894B61762c0107A09668b21920
12954e5300o5724G1085H693N242e709j48624A8181J19886a10385d0962H544a98903
12941i221A25671m8822b79576C37992E8636e7396q9258A41269N9916k1253a50383
12929a49319m6865c2157A01016m4992h3714F5356c0670B85785d97165E9008P6826
$$ plain form
12918 135834 -262381 337252 28896 171227 -75658 -3288 -140300 -272403 35748 133461 -217095
12906 -12607 -299362 312899 -7850 -420499 -49418 77394 146187 90268 16276 -88654 -169726
12895 -169726 -52960 79838 -118636 24323 80995 259108 -22937 152322 16868 211849 -238608
12883 259864 63918 81063 205878 220992 -32610 214174 -154602 -193753 -165635 -190608 -265777
12872 -265777 -200982 -161995 126367 333061 -207968 -156635 -89673 -39042 222163 -31655 -185775
12861 -185775 187830 -110617 182835 -18479 -175142 202693 -104564 14529 80442 -171686
12850 144630 -37220 276791 -240481 -337449 -136267 140908 -36755 -355412 -189188 352829
12839 196545 -115551 -44523 97829 53966 86787 34910 -193481 108042 105985 -96108 -33356
$$ packed form
12918A35834b62381C37252B8896J42331g5658c288j37012j32103C5748R7713b17095
12906a2607k86755C12899g850m12649d9418G7394O8793n5919A6276h8654q1072
12895a69726e2960G9838a18636B4323N6672J78113b2937A52322A6868J94981b38608
12883B59864F3918J7145J24815J5114c2610B14174a54602l9151K8118k4973p5169
12872b65777O4795L8987A26367K06694b07968N1333O6962c9042B22163c1655j54120
12861a85775A87830a10617A82835a8479j56663B02693a04564A4529O5913a71686
12850A44630c7220B76791b40481r6968a36267A40908c6755l18657J66224C52829
12839A96545a15551d4523I7829m3863L2821C4910a93481A08042k057i6108c3356
$$ plain form
12827 4379 -174248 -229814 -47064 251451 -43572 -60651 206165 -83579 -19717 -74814 -250002
12816 -250002 -60134 98157 -141382 44686 14805 -230865 -115641 381893 151447 159013 26233
12804 -359335 -237774 -192387 -5464 26371 -237717 28759 24336 227464 209298 -97238 -392317
12793 -392317 -131390 -381119 151210 -8971 -60584 -112520 -83647 -12858 -60811 71848 232352
12782 232352 -50291 -208234 79891 -30217 141240 -55483 -358505 -157832 127467 -268572
12771 201480 198056 -184821 80582 195785 -317342 -121391 365566 40524 -173633 232628
12760 204778 31579 212268 128342 71796 155212 -28846 15554 -174845 207251 -107357 -152885
12749 -152885 124337 -86991 79985 416783 48039 13768 31446 293531 -270594 111848
$$ packed form
12827D379a74248n5566d7064B51451d3572j7079B06165h3579a9717n5097j75188
12816b50002f0134I8157a41382D4686A4805b30865J15224C81893A51447P566B6233
12804c59335J21561M5387e464B6371b37717B8759m423K03128j8166i7238k95079
12793c92317a31390k49729A51210h971n1613n1936K8873a2858m7953G1848J60504
12782B32352e0291j57943G9891c0217A41240e5483l03022a57832A27467b68572
12771B01480l424a84821H0582J15203c17342a21391C65566D0524a73633B32628
12760B04778C1579J80689q3926n6546Q3416b8846A5554a74845B07251a07357m5528
12749a52885A24337h6991G9985L36798D8039A3768J7678K62085b70594A11848
$$ plain form
12738 111090 136131 -47564 85957 111674 -15915 182790 -97468 80781 -220132 -309329 57036
12726 -112925 -95400 105148 -150270 -398093 -324678 -128560 203444 -82195 10437 311083
12716 311083 298023 -8344 13691 228273 117324 -48428 458061 -80692 -307337 -61256 92444
12704 14495 -289386 532012 46179 58809 31154 -218454 123414 149964 334576 -50832 -241252
12693 -241252 104069 18365 31872 -116319 -148694 224933 133653 -112397 36017 134904 -185229
12681 51973 51092 209253 2207 -189404 -274856 17378 177397 -5438 168601 500163 -323326
12669 -146518 219239 -323622 -191606 280536 206435 155769 -82336 274749 379324 -47204
12658 71853 -81165 212657 -73707 83629 101047 248065 172459 47746 100538 -242536 172143
$$ packed form
12738A11090K5041d7564H5957K5717a5915A82790i7468H0781b20132q9197E7036
12726a12925J7525A05148a50270k47823P3415a28560B03444h2195A0437L00646
12716C11083j3060h344A3691K14582j10949d8428D58061h0692k26645f1256I2444
12704A4495b89386E32012D6179J2630k7655b18454A23414K6550J84612e0832j90420
12693b41252A04069A8365J3507a16319l2375B24933r1280a12397C6017R8887a85229
12681E1973q81J58161B207a89404q5452A7378J60019e438A68601L31562c23326
12669a46518B19239c23622J32016B80536p4101n0666h2336B74749J04575d7204
12658G1853h1165B12657g3707H3629J7418J47018p5606D7746N2792b42536A72143
$$ plain form
12646 -143678 -189258 51802 -152940 -81575 -23084 96373 -25723 147901 55635 89945 -83826
12634 -125134 49135 247894 169383 71993 574792 120325 42624 -16657 162300 306710
12624 306710 160915 93271 47563 -319707 174669 23590 136387 7485 55426 127973 223782
12613 223782 164780 -217895 -14444 87412 434728 217651 -473085 -80148 170425 89134
12603 89134 104494 43347 149138 158788 5979 66913 236165 92298 287186 88138 -168694
12591 23228 71767 249645 69255 315561 402511 84856 234819 -70766 19191 4898 100917
12580 100917 95791 -98194 34151 95219 -87921 -68895 41896 -92226 -1682 424136 -187196
12568 114570 4460 -213577 101692 -122448 22595 220498 337201 279113 28519 49625 -104952
$$ packed form
12646a43678m5580E1802a52940P1365b3084I6373b5723A47901E5635L4310h3826
12634a25134D9135J98759p8511G1993N02799A20325D2624a6657A62300J44410
12624C06710j45795o7644m5708c19707A74669B3590J12797G485M7941P2547R5809
12613B23782n9002b17895a4444H7412L47316k17077d73085h0148A70425q1291
12603H9134J5360D3347J05791R650E979O0934J69252I2298J94888H8138a68694
12591B3228M8539J77878F9255K46306Q6950H4856J49963g0766A9191D898R6019
12580A00917n126i8194C4151O1068h7921J9026D1896i2226a682D24136a87196
12568A14570D460b13577A01692a22448B2595J97903J16703n8088B8519K1106a04952
$$ plain form
12556 39852 -122145 183989 -115976 -85739 -20939 243571 -165090 -152447 -86755 262332
12545 67988 106636 -160867 -295127 -168012 -42278 -128692 -507792 -256595 159221 272156
12535 272156 -115168 105666 63358 -50913 -373246 108423 -81547 324526 -35832 -118830
12525 -118830 -35883 183143 -81011 135778 293690 102585 -96583 197699 368547 484873
12515 484873 40991 318692 54226 22990 153981 -47589 257275 3857 -281309 -209466 -284918
12504 -284918 173421 121251 81386 -219926 -248086 38244 357887 -51308 191659 -257264
12493 -233439 -14635 35482 225524 242470 245818 366263 342651 -22325 -44096 -239008 70756
12481 -227270 -90461 61555 64815 38047 33125 -80398 -114108 -2586 -90893 -82750 325418 140969
$$ packed form
12556C9852a22145A83989a15976L0237b0939B43571a65090J2643O5692B62332
12545F7988L8648a60867j34260J27115d2278q6414l79100K51197A59221J12935
12535B72156a15168A05666m2308e0913l22333A08423h1547C24526c5832q2998
12525a18830c5883A83143h1011A35778J57912A02585i6583A97699J70848J16326
12515D84873D0991K77701E4226B2990J30991d7589B57275C857b81309P1843p5452
12504b84918A73421n2170l9865b19926k8160C8244L19643e1308A91659b57264
12493b33439a4635C5482J90042J6946L348J20445k3612b2325k1771j94912G0756
12481b27270i0461F1555L260k6768m922h0398l3710b586q8307Q143C25418A40969
$$ plain form
12468 -221130 243006 147015 61237 14983 111373 37780 31808 -90553 497793 37000 -108554
12456 24663 96441 200616 -201542 26589 92324 -260181 26822 234138 15464 42997 52855
12445 52855 89192 -15757 -183397 81882 -76002 123636 -28636 -97516 -325040 -423713 46681
12433 -128621 -292344 -79281 -122709 -71568 -72001 -235248 21177 -226230 160341 -214661 -125030
12422 -125030 -58354 50134 42748 186118 -137633 64323 308697 -89948 5186 298275 -138350
12410 -219923 117489 110923 -245920 -174886 -334386 -9066 343296 -205688 156133 52014 -541285
12398 48247 49738 181163 81264 22536 132135 281686 249297 52893 214640 145223 -326751
12386 123831 -36172 240288 -49801 270275 401043 -63117 -164238 -472497 145667 194016
$$ packed form
12468b21130B43006r5991F1237A4983R6390C7780n972i0553D97793C7000a08554
12456B4663P1778J04175b01542B6589O5735b60181B6822K07316A5464K7533R858
12445E2855L6337a5757j67640H1882g6002A23636b8636o8880k27524r8673D6681
12433a28621j63723g9281m3428N1141m33j63247B1177b26230A60341b14661Q9631
12422a25030e8354E0134p386J43370a37633F4323K44374h9948E186K93089a38350
12410b19923A17489o566b45920P1034j59500i066C43296b05688A56133E2014e41285
12398D8247J491J31425H1264B2536J09599J49551l2389E2893J61747o9417c26751
12386A23831c6172B40288d9801B70275J30768f3117j01121l08259A45667M8349
$$ plain form
12376 194016 420344 -93048 293781 -21734 -144560 2509 -172506 -314861 26400 -106024
12365 -246812 46076 -160081 -35455 241383 -46354 160848 -96475 -116036 66990 20184 -69334
12353 49243 227524 120940 -19056 -160089 -153197 -8328 21426 144783 -74021 116608 309130
12342 309130 256526 247142 -86696 208843 72669 71425 -158400 -23378 101786 292308 521931
12331 521931 46145 -51822 129416 15297 38660 128895 134880 -90768 267828 -100645 125093
12319 124322 367321 142729 327495 -28581 23172 -100016 3581 -17496 24163 12237 87433
12308 87433 166498 158344 -195616 263934 277349 -139920 -53529 -12955 -230140 143430 -129546
12296 -210560 179725 335710 19073 -295394 88134 -120465 96492 380251 257327 53387
$$ packed form
12376A94016K26328i3048B93781b1734j22826B509a72506j42355B6400a06024
12365b46812D6076a60081c5455B41383d6354A60848i6475j9561F6990B0184f9334
12353D9243J78281j06584a9056j41033O892h328B1426J23357g4021A16608J92522
12342C09130n2604r384h6696B08843G2669j244a58400b3378A01786J90522K29623
12331E21931D6145e1822A29416A5297K3363R0235N985i0768B67828a00645A25093
12319A24322K42999A42729J84766b8581B3172a00016C581a7496B4163j1926P5196
12308H7433P9065q154a95616B63934J3415a39920e3529a2955k17185A43430a29546
12296b10560A79725J55985A9073b95394H8134a20465I6492K83759j22924E3387
$$ plain form
12285 320776 177427 18394 -101633 68719 -146297 170872 2155 238433 160363 68890 247789
12274 247789 28568 155773 198610 404172 168417 197284 -58681 177713 -34385 -190942
12264 -190942 84571 90849 123915 90075 177508 -192065 171485 152488 229156 62065 351198
12253 351198 212358 42207 308637 116315 236377 -154581 3800 387950 133074 343848
12243 343848 -113117 -88952 265578 205243 150854 186540 183631 90292 108487 43443 427916
12232 427916 334982 168922 157907 26468 315165 63162 -34053 52509 442334 397200 452456
12221 452456 262603 351457 426786 375063 518902 524251 284971 199336 64961 94825 66960
12210 66960 228193 399236 254396 -146371 -66481 240600 25164 164495 -294442 103419
$$ packed form
12285C20776j43349A8394a01633F8719a46297A70872B155K36278p8070F8890J78899
12274B47789B8568J27205M2837K05562A68417K8867e8681A77713c4385j56557
12264a90942H4571O278L3066l3840Q7433a92065A71485j8997P6668F2065K89133
12253C51198j38840D2207K66430A16315J20062a54581C800L84150A33074K10774
12243C43848a13117K4165B65578o0335n4389L5686k909I0292J8195D3443L84473
12232D27916r2934j66060j1015B6468K88697F3162c4053E2509L89825m5134N5256
12221D52456j89853Q8854P5329n1723J43839N349k39280q5635F4961K9864k7865
12210F6960J61233J71043j44840a46371f6481B40600B5164J39331b94442A03419
$$ plain form
12199 29173 310009 339483 228238 -31709 316453 653100 665323 320881 189123 167250
12189 167250 160698 218200 458197 314728 487921 328479 89973 232758 153720 198754 246542
12178 246542 -6337 241560 134826 395228 190406 223631 31172 314821 10494 277994
12168 277994 423494 373774 504638 -45239 -96442 -193065 169585 105868 131129 31983 332957
12157 332957 268339 298831 81798 -20675 163489 -97645 5231 88442 237645 -44300 286602
12145 38173 -46196 81040 186251 107957 -10138 255659 -18870 239493 137554 26676 219881
12134 219881 89191 -37733 183647 -21488 -87722 179160 310048 28193 -44650 456519 300161
12123 300161 108375 174516 105057 230649 164170 251166 147132 154954 74204 22958 -86164
$$ packed form
12199B9173K80836K9474j11245c1709C16453L36647J2223C20881j31758k1873
12189A67250o552N7502K39997j43469J73193j59442H9973J42785p9038M5034M7788
12178B46542f337B41560j06734K60402A90406L3225C1172K83649A0494K67500
12168B77994J45500m9720J30864d5239n1203r6623A69585o3717K5261C1983L00974
12157C32957o4618L0492H1798b0675A63489i7645E231Q3211J49203d4300B86602
12145C8173d6196H1040J05211p8294a0138B55659a8870B39493j01939B6676J93205
12134B19881H9191c7733A83647b1488o6234A79160J30888B8193d4650D56519j56358
12123C00161A08375O6141o9459J25592o6479Q6996j04034P822G4204B2958h6164
$$ plain form
12111 43260 -209843 127174 -90221 -56764 232210 -29210 202228 -175690 174661 -96278
12100 -91637 306123 31314 -87992 -132251 -116695 299702 -105152 190919 8831 78887 277708
12089 277708 101175 208426 -57543 -239179 224455 94303 170026 265307 -66136 -92300 399853
12077 38166 -37409 -148155 -203374 163192 268704 188486 183702 233788 246415 -430691 175986
12065 535988 -204317 -35574 113221 99926 246252 165203 283957 -159248 123164 143056
12055 143056 177630 -212585 54040 140648 105273 364928 -52857 168643 382988 -5842 238344
12043 36861 -25483 -333628 86742 13533 -44104 67198 34341 -122808 -142549 -232897 -107186
12031 227519 -53111 -243996 187632 -103371 -130890 -109940 246718 -286788 200943 64296
$$ packed form
12111D3260b09843A27174i0221L3457B32210b9210B02228a75690A74661i6278
12100i1637C06123C1314h7992m4259J5556B99702a05152A90919H831P0056J98821
12089B77708A01175J07251e7543j81636B24455I4303P5723R5281f6136k6164C99853
12077C8166c7409j10746n5219A63192J05512q0218m784N0086J2627d30691A75986
12065E35988b04317c5574A13221j3295J46326q1049J18754a59248A23164J9892
12055A43056L4574b12585E4040Q6608l5375K59655e2857A68643K14345e842B38344
12043C6861b5483l08145H6742A3533d4104F7198l2857a22808j9741r0348a07186
12031B27519e3111j90885A87632a03371k7519K0950B46718b86788B00943F4296
$$ plain form
12020 5221 -31624 112303 -31142 -120069 -92002 -209627 82529 99329 54847 68880 -82539
12008 -193640 307637 -67916 -121907 100667 -98010 109091 -18475 116956 99641 -271275
11997 111448 -89732 27064 -138797 362767 13921 -106240 232742 -52956 -115057 66170 -163249
11985 -154228 174673 145775 -99829 -28094 -224464 -93003 335700 189210 201351 -91289 -392506
11974 -392506 32493 66127 -28865 109923 38905 -289119 -80936 -416262 -51654 -222721 -84395
11962 235121 212068 227157 -169351 16487 202777 -379654 -137717 119241 -90301 61276
11951 -60952 28680 138456 111830 -82063 205572 59618 10197 27321 47631 -136078 -313338
11940 -313338 -43853 -141792 -44317 117178 -171963 -14449 -51826 66258 185626 -345054 32414
$$ packed form
12020E221c1624A12303c1142q8927K8067j17625H2529J6800m4482J4033h2539
12008a93640C07637f7916n3991A00667i8010A09091a8475A16956j7315b71275
11997A11448h9732B7064a38797C62767A3921a06240B32742e2956o2101F6170a63249
11985a54228A74673k8898i9829b8094j96370i3003C35700j46490J2141i1289l01217
11974c92506C2493L3634b8865A09923C8905b89119h0936l35326e1654j71067h4395
11962B35121k3053J5089a69351A6487J86290c79654a37717A19241i0301F1276
11951f0952B8680J09776k6626h2063B05572E9618A0197J7124K0310a36078j77260
11940c13338d3853r7939d4317A17178a71963a4449l7377F6258J19368c45054C2414
$$ plain form
11928 146130 -111539 -179636 -3160 -343886 -345160 64419 -174219 -180258 -417300 -215708 95336
11916 292718 -211969 155452 -311351 -231625 184634 -376659 342143 275364 6491 -239324
11905 -340547 18780 -49590 -201537 159988 78201 -133830 -154290 -78246 -352457 -356752 171868
11893 -415076 34348 5453 -203260 68396 -79007 93053 -262839 -26901 -249878 -142205 -136590
11882 -136590 -125383 112932 16991 -79611 183154 -285611 92459 -391668 151963 27526
11871 -274720 -93884 -250439 148566 192293 -31396 130797 187462 -170371 -242770 -169310 160478
11859 -78306 217884 34545 60736 26421 -58048 -12751 265366 -9303 -109489 -50508 44651
11847 -315416 -18568 -121199 -125476 -38905 164537 85906 114250 -106496 32338 -180553 86852
$$ packed form
11928A46130a11539o8097c160l40726j274F4419a74219o039k37042K01592I5336
11916B92718b11969A55452c11351P9726A84634c76659C42143o6779F491b39324
11905c40547A8780d9590j51947A59988G8201a33830k0460P6044k74211m295A71868
11893d15076C4348E453b03260F8396g9007I3053b62839b6901k22977J07673N615
11882a36590J1207A12932A6991g9611A83154b85611I2459c91668A51963B7526
11871b74720i3884j56555A48566M3727c1396A30797N6665a70371p2399P3460A60478
11859g8306B17884C4545K6191B6421e8048a2751B65366i303j00186e0508D4651
11847c15416a8568j02631m277c8905A64537p8631K8344a06496C2338a80553H6852
$$ plain form
11835 13485 -54281 -47250 -132066 381952 78965 -114147 -208672 -77041 -188567 -16063 128583
11823 42106 71586 -295955 -184932 275708 205457 240946 34116 -45890 160042 169031 104899
11812 104899 -151498 47211 -102767 -181626 -158331 -121376 -36740 17328 -38507 -22510 77014
11800 256313 138125 -3549 2441 -188182 -42191 11835 114535 -317325 138929 -121195 -242156
11789 -242156 -249918 -235340 -218286 70626 -180917 45533 -328906 -88619 19104 199229 -254087
11777 235683 51888 18895 -63036 -140330 -29933 170759 129258 94399 -49242 -51503 -229051
11766 -229051 -79882 -117103 -43364 -118360 -262252 -35472 168377 138465 -99300 -19339 -117697
11755 -117697 -30657 191116 128026 33128 -17482 -228826 -183135 99076 -37456 76813 -114202
$$ packed form
11835A3485e4281P031q4816C81952G8965a14147r4525g7041j11526a6063A28583
11823D2106K9480b95955J11023B75708p0251L5489C4116d5890A60042Q989o4132
11812A04899a51498D7211a02767p8859K3295L6955c6740A7328c8507J5997G7014
11800B56313j18188c549B441a88182d2191A1835J02700c17325A38929a21195j20961
11789b42156p762J4578J7054G0626a80917D5533c28906h8619A9104J80125b54087
11777B35683E1888A8895f3036p7294b9933A70759m1501l4859d9242k261j77548
11766b29051g9882l7221d3364p4996j43892c5472A68377k9912i9300a9339r8358
11755a17697c0657A91116o3090C3128a7482k11344M5691I9076c7456G6813a14202
$$ plain form
11743 -262581 70237 -258417 -104184 83297 -69263 52603 -263329 -86741 -97814 -114639 -133041
11732 -133041 14374 -89332 90305 203802 283754 -216131 -214919 -43811 -22986 343597 -69609
11720 68907 20572 -181744 82800 -110550 381858 220219 177093 345746 -1529 -257958 190971
11708 213998 11061 -197812 -70213 -90838 -196589 1881 -234885 -313449 44702 -165598 144753
11696 -76926 -235104 293409 206184 213387 -113464 69338 40918 -27982 525876 -55316 -117961
11685 -117961 -24226 -112976 198954 -14290 150452 258719 313424 53772 30950 106444 187208
11674 187208 -248966 -218840 96314 50642 35615 213250 13529 148137 17236 145816 -166555
11662 27352 107690 44529 124111 407814 202720 210823 205 57927 -230825 122898 -126624
$$ packed form
11743b62581G0237b58417a04184H3297f9263E2603b63329h6741j1073j6825j8402
11732a33041A4374h9332I0305J13497P9952b16131J212d3811K0825C43597f9609
11720F8907B0572a81744H2800a10550C81858j61639m3126J68653a529k56429A90971
11708B13998A1061a97812g0213k0625j05751A881b34885p8564D4702a65598A44753
11696g6926j58178B93409q7225P203a13464F9338k8420b7982E25876e5316o2645
11685a17961b4226q8750A98954a4290A50452J08267N4705E3772k2822P5494Q0764
11674A87208b48966L0126I6314m5672j5027J77635A3529J34608A7236J28580a66555
11662B7352Q0338D4529P9582K83703B02720Q103B05N7722b30825A22898a26624
$$ plain form
11650 -71673 -212670 1348 137136 170953 -201595 122329 -34650 -265162 -14668 -1204 89521
11638 67205 -73276 -43497 85953 143739 -8332 -62507 -24933 25480 51639 -231801 170522
11626 27163 -68038 -60624 -173965 -19442 239527 -156123 -133034 484715 276362 132875 79530
11615 79530 -155254 60477 -132094 231712 9897 -180955 262496 96303 -291349 -4692 96900
11603 -894 134948 299807 210143 -215789 126672 290502 374380 215348 -22283 74318 -112070
11591 -48098 4729 4507 -188910 178661 -130129 -132832 38697 178459 195946 83768 123229 16716
11578 185153 162750 -356162 19130 1821 193200 15820 -220375 395048 53558 -252577 -267377
11567 -267377 -39269 23397 124828 351772 110847 -81636 79721 179998 143318 -106181
$$ packed form
11650g1673j40997A348J35788L3817b01595A22329c4650k30512a4668a204H9521
11638F7205g3276K9779H5953N7786h332n4175b4933B5480K6159b31801A70522
11626B7163f8038P414j13341a9442B39527a56123K3089D84715k08353A32875n3345
11615G9530a55254F0477a32094B31712I897a80955B62496I6303b91349d692I6900
11603h94A34948J64859q9664b15789A26672J63830Q3878j59032b2283G4318a12070
11591d8098D729k22a88910A78661a30129k703C8697J39762J7487H3768L9461A6716
11578A85153k2403c56162A9130A821J91379A5820b20375C95048E3558b52577j4800
11567b67377c9269B3397J01431K26944A10847h1636G9721J00277l6680a06181
$$ plain form
11556 1541 -1153 -175768 374329 102235 226563 -93629 -203308 207577 -31031 141474 55870
11544 -107540 21985 115777 123936 342323 103726 -73785 -66060 -171458 17659 387106 -49214
11532 25116 10941 98433 44103 -23893 -323174 168219 37143 238823 -101255 250665 329166
11521 329166 22349 -59720 147631 127328 -110799 16725 131191 -301906 51486 352677
11511 352677 92601 91211 -249314 155247 213058 126613 111386 31002 42197 -15077 -34545
11500 -34545 88779 323413 -103866 -43824 305116 323787 -168764 198578 517661 50854
11489 425995 89167 236856 476312 -49661 -229723 88796 -57876 41079 94471 20235 340842
11478 340842 424771 93726 -14897 228903 105465 272213 187653 54357 -96407 120292 -80764
$$ packed form
11556A541a153j74615C74329A02235J24328i3629j09679B07577c1031A41474E5870
11544a07540B1985R3792Q159K18387A03726g3785P725j05398A7659L69447d9214
11532B5116A0941Q7492D4103b3893k99281A68219C7143K01680a01255B50665P8501
11521C29166B2349e9720A47631k0303a10799A6725J14466c01906E1486L01191
11511C52677I2601j390b49314A55247N7811q6445j5227C1002J1195a5077j9468
11500c4545H8779K34634a03866d3824C05116J8671a68764A98578L19083E0854
11489D25995H9167J47689K39456d9661j80062H8796e7876D1079N3392B0235L20607
11478C40842Q3929I3726a4897B28903A05465J66748q4560E4357i6407A20292h0764
$$ plain form
11466 142049 7749 49262 -7254 -44421 364450 260870 141382 -46091 167728 176195 514599
11455 514599 64674 363005 309154 130777 269843 -86764 96252 104408 -98268 -29558 105831
11443 -72531 9170 53493 106429 177894 116215 -61093 -181325 182406 -239853 225505 -113949
11431 -128987 193667 1123 -13566 15879 128622 -44673 209056 -249418 -379118 151044
11420 262064 243822 57623 -238611 164903 125208 198971 114349 75788 183805 252076 -130319
11408 259022 73395 -16073 184043 239666 -752 33050 40078 -64332 -121727 -411582 72694 181535
11396 181535 228928 32630 117864 -61007 -152886 179176 -255068 -312228 -2343 67855 52365
11385 52365 -5398 -15189 -187457 103998 -65255 -73157 281764 343450 38439 313590 232020
$$ packed form
11466A42049G749M1513g254l7167C64450j03580j19488d6091A67728Q467L38404
11455E14599F4674K98331n3851A30777J39066h6764I6252Q156i8268b9558A05831
11443g2531I170M4323N2936P1465o1679f1093j20232A82406b39853B25505a13949
11431a28987A93667A123a3566A5879J12743d4673B09056b49418j29700A51044
11420B62064j8242E7623b38611A64903l9695P3763q4622l8561J08017O8271a30319
11408B59022G3395a6073A84043N5623g52C3050P028f4332n7395k89855G2694J08841
11396A81535M7393C2630Q5234f1007r1879A79176b55068n7160b343F7855j5490
11385E2365e398r791j72268A03998f5255p902B81764O1686C8439K75151q1570
$$ plain form
11374 232020 -338732 -224616 256524 -38981 -114368 -373155 109223 -136397 42035 -157455
11363 87459 200628 559793 -129822 421821 -15825 226290 -159443 -80781 136887 -98789
11352 -64661 -95870 -279486 46313 -212945 -285253 -169979 -40610 -15285 -86688 213327 96196
11340 -20528 -218286 -67018 334790 -162653 -143417 -116576 81485 52235 192186 79636 -137069
11328 -29141 -142871 244722 22573 222410 139910 141253 186209 -2832 -96853 20205 -81421
11316 137280 -223185 254980 26564 -151314 635 -155740 44966 188995 9494 32694 -179183
11304 -225969 28777 -60446 -296436 -23349 -4777 -40327 -64950 -155105 -258662 -143698 177903
11292 -60483 -139359 47802 191555 -85112 -103043 -115187 -241672 -245776 69926 240983 -209143
$$ packed form
11374B32020c38732J14116B56524c8981p5387k58787A09223a36397D2035a57455
11363H7459J13169L59165a29822D21821a5825B26290a59443P8662A36887i8789
11352f4661l1209j83616D6313b12945p2308J15274d0610a5285p1403B13327I6196
11340b0528j97758f7018C34790a62653J9236K6841H1485k9250J39951G9636a37069
11328b9141j13730B44722B2573J99837q2500J343M4956b832r4021B0205h1421
11316A37280b23185B54980B6564a51314F35a55740D4966J44029I494K3200a79183
11304b25969B8777f0446k35990b3349d777l5550k4623r0155j03557J14964A77903
11292f0483p8876D7802J43753h5112j7931j2144j26485m104F9926J71057b09143
$$ plain form
11280 -23430 -141396 -39242 -303119 116766 -157739 30398 93330 -110060 118134 -282296
11269 -116404 -151370 -303129 -19197 -448816 164127 -131624 -200131 -11546 54352 75796 -360758
11257 -89472 256849 -228217 -410966 101657 -393839 -138723 -49022 -99272 34022 -229695
11246 96595 -137037 -314032 -351101 -338285 -248627 -290178 74589 52797 -355369 137182 -34891
11234 -263893 -419295 -270825 24764 -35139 56698 -47762 -94420 -27051 88941 -249789 -121238
11222 -225814 463222 209078 -211152 -102407 259394 -90283 40121 -183779 -207608 -93194
11211 -239866 -293290 59823 20111 -73282 -405829 66066 -249837 65775 -132550 -22028 15660
11199 154636 -134393 201281 -221001 -368587 89323 32717 19931 -319019 -52496 120491
$$ packed form
11280b3430j17966c9242k63877A16766a57739C0398O2932a10060A18134b82296
11269a16404l4966j51759a9197m29619A64127a31624o8507a1546E4352K1444c60758
11257h9472B56849b28217j82749A01657c93839a38723d9022n0250C4022b29695
11246I6595a37037j76995l7069J2816Q9658m1551G4589k1792c55369A37182c4891
11234b63893j55402J48470B4764c5139E6698d7762m6658b7051H8941b49789a21238
11222b25814D63222B09078b11152a02407B59394i0283D0121a83779k3829i3194
11211b39866n3424E9823B0111g3282l32547F6066b49837F5775a32550b2028A5660
11199A54636a34393B01281b21001j47586H9323C2717j2786c19019e2496A20491
$$ plain form
11188 12040 84912 -193561 176343 -333405 -31155 -165293 -322826 -38215 121089 -21353
11177 8024 -310790 -149816 271571 -132527 105554 -337332 -284430 -40240 -198661 -167093
11167 -167093 -400920 -175668 -508524 -125051 66231 53531 -20093 -122887 -86953 137720
11156 -41715 -123253 -188363 -252729 -142404 -327705 -229875 -60990 -58969 -296632 143078 -78676
11144 39144 -94989 -123947 37108 2244 -73259 127437 146016 -65999 -233633 24322 217229
11133 217229 -33943 20395 58895 86273 320851 -100945 63009 6023 130492 275527 307389
11122 307389 121158 83774 -149322 106203 169897 -44327 86911 133273 7703 137102 78679
11111 78679 -294050 -73267 43946 189275 75162 98322 318598 230666 57533 235822 -129239
$$ packed form
11188A2040P2872a93561A76343c33405c1155j34138j57533c8215A21089b1353
11177H024c10790a49816B71571a32527A05554c37332N2902d0240j58421L1568
11167a67093k33827a75668l32856a25051F6231j2700b0093j02794L5934A37720
11156d1715q1538o5110o4366J10325j85301R7830f0990K021k37663A43078g8676
11144C9144i4989k8958C7108B244g3259A27437J8579f5999j67634B4322J92907
11133B17229c3943B0395L8500K7378K34578a00945F3009F023J24469J45035L1862
11122C07389A21158l7384a49322A06203O3694d4327H6911M6362G703J29399n8423
11111G8679b94050g3267D3946J45329G5162K3160K20276q7932E7533J78289a29239
$$ plain form
11099 34673 133692 510104 34316 63530 164829 -51156 306783 114011 391897 305932 160070
11088 160070 -6048 482059 96753 320360 390544 47950 213022 133401 334109 -86669 25859
11076 243018 256118 567737 462423 433271 340870 29844 321666 619688 114037 635413
11066 635413 534559 533586 597201 598883 496883 485106 579130 653803 724284 566837 654980
11055 654980 744963 775178 950939 622643 899731 773426 916658 919530 960295 843851
11045 843851 1220465 1161979 1045989 956748 1273916 1156986 960817 1201071 992865 882027
11035 882027 915088 976876 922377 916214 801957 687474 712134 713041 1002955 1058309 1044987
11024 1044987 1013815 910264 967682 1145327 676888 566385 837423 693638 814781 695557
$$ packed form
11099C4673R9019L76412C4316K9214J01299e1156C06783A14011K77886q5965j45862
11088A60070f048D82059I6753K23607P0184D7950J65072p9621K00708h6669B5859
11076B43018J3100L11619j05314k9152r2401B9844K91822K98022A14037N21376
11066F35413j00854r73O3615J682j02000j1777R4024P4673P0481j57447Q8143
11055F54980Q9983L0215J75761l28296K77088j26305J43232K872M0765j16444
11045H43851L76614n8486j15990q9241L17168j16930j96169K40254k08206j10838
11035H82027L3061O1788n4499o163j14257j14483K4660R07K89914N5354j3322
11024A044987l1172j03551N7418J77645m68439j10503K71038j43785J21143j19224
$$ plain form
11014 695557 788227 748039 875170 583724 989583 900599 741109 1071793 513642 951903
11004 951903 963580 659110 790612 619279 916720 724682 627910 866520 959421 590515
10994 590515 1001487 706520 642666 924824 736282 897508 842071 1141094 1120263 1094128
10984 1094128 1136357 1119645 1035660 1354607 1250160 1516985 1569749 1650277 1431913 1873370
10974 1873370 2367080 2249828 2665171 2817029 3173208 3585385 3616212 3903131 3632628 3725268
10964 3725268 3606505 3327003 2715134 2643037 2158100 2171243 1975848 2101839 2062347 1990997
10954 1990997 2119271 1900795 1674748 1306310 1346696 1129513 1002704 998611 738235 401838
10944 401838 491286 632000 284775 81565 148989 196466 50929 109610 302335 -110125 -22430
$$ packed form
11014F95557R2670m0188J27131k91446M05859q8984j59490L30684E13642M38261
11004I51903J1677l04470J31502j71333K97441j92038r6772K38610R2901l68906
10994E90515M10972k94967o3854K82158j88542J61226n5437K99023k0831k6135
10984A094128M2229j6712q3985L18947j04447K66825N2764Q0528k18364M41457
10974A873370M93710j17252M15343J51858L56179M12177L0827K86919k70503R2640
10964C725268j18763k79502o11869p2097m84937J3143j95395J25991l9492p1350
10954A990997J28274k18476k26047l68438M0386k17183j26809m093k60376l36397
10944D01838Q9448J40714B84775H1565O7424M7477E0929N8681J92725a10125b2430
$$ plain form
10932 172835 218452 -100600 163737 167760 108058 -25071 -79019 41376 279434 77089 87997
10921 87997 -717 24044 48328 95485 196381 196103 -195117 -139068 -2306 -217804 -76215 -199671
10909 -199671 -40558 125407 -12035 109616 100148 37902 -179212 41772 -3226 176779 -221944
10897 -361684 -389687 103124 -189610 3713 142134 -353164 180089 -280392 -345533 296716
10886 152269 -220816 34786 -230633 -229028 -124983 -125414 45321 367807 -251931 -252590 -78905
10874 -59460 -112232 60078 -142588 141316 -215108 51977 284495 53788 177310 72035 -189822
10862 189441 -60533 102475 -170982 -73157 -133814 175908 -270491 -98437 88060 41119 -251490
10850 -91026 56060 114126 -137405 -98186 255216 -2653 82886 -60578 166528 -302472 -58703
$$ packed form
10932A72835M5617a00600A63737M023n9702b5071n3948D1376K38058G7089J0908
10921H7997g17B4044K4284M7157J00896k78a95117N6049b306k15498g6215j23456
10909a99671d0558A25407a2035A09616r468C7902a79212D1772c226A76779b21944
10897c61684k8003A03124a89610C713J38421c53164A80089b80392o5141B96716
10886A52269b20816C4786b30633J605J04045m31D5321L22486b51931o59g8905
10874e9460n2772F0078a42588A41316b15108E1977K32518E3788J23522G2035a89822
10862A89441f0533A02475a70982g3157o0657A75908b70491i8437H8060D1119b51490
10850i1026E6060N8066a37405L9219B55216b653H2886f0578A66528c02472e8703
$$ plain form
10838 96628 184269 -266069 -335275 26961 -182643 158342 -69689 -54642 -212596 30917 76928
10827 76928 30558 22577 58225 -397616 259463 227144 -218274 -146141 -7201 -64932 -53011
10816 -53011 146441 -392649 13428 -96871 -131763 -84684 -35414 -122581 30706 -151832 -141937
10805 -141937 54407 185135 -70416 -331378 308586 45895 192394 -25009 -243569 365339
10794 206698 -332439 -7490 -105881 -130010 -201039 -156600 -305666 -155876 -145406 -58478 267416
10782 -64048 -47949 -53194 -105622 -23812 506782 -244864 161912 481128 -145759 -159132 20564
10770 -220837 204082 -224871 -212924 -122015 -161923 -107522 -40349 -49293 -99710 -114256 -305532
10759 -305532 -37723 15176 29589 -14529 205311 -442554 175980 7347 -162283 -357280 -223502
$$ packed form
10838I6628Q7641b66069o9206B6961a82643A58342f9689J5047j57954C0917M6011
10827G6928C0558p981L5648c97616B59463l2319b18274P2133g201n7731J1921
10816e3011A46441c92649A3428i6871l4892M7079c5414q7167C0706a51832R895
10805a41937E4407J30728g0416k60962C08586D5895J46499b5009k18560C65339
10794B06698c32439g490r8391k4129p1029M4439j49066J49790J0470e8478B67416
10782f4048J6099n245n2428b3812E06782b44864A61912L19216a45759j3373B0564
10770b20837B04082b24871J1947R0909l9908N4401d0349q944n0417j4546j91276
10759c05532c7723A5176J4413a4529B05311d42554A75980G347a62283j94997J33778
$$ plain form
10748 -223502 203584 -11000 -108008 246667 41582 -129427 1599 -217364 33234 -205041 -172882
10737 -172882 -118019 -160970 -119749 278452 -47565 -166246 20410 70522 39099 16913 189282
10726 189282 -45356 -352607 -111010 102515 -99660 -90360 19489 4627 41109 -64479 207905
10714 182307 -343343 -204681 -227727 83887 -334627 -52794 201974 -71519 296685 11119
10703 260043 -27586 -91941 163459 110950 62135 -442822 -97285 -113696 -60103 -145730 93407
10691 -266308 -23282 11958 -19825 188906 -180263 -1674 18298 -247994 63604 101521 9290
10679 -44835 -423910 281795 377246 23134 10032 344051 186187 -156633 189411 -278862
10668 -15078 35794 161010 -186252 221192 -400039 -104811 -102034 -107777 -110744 -314878 5144
$$ packed form
10748b23502B03584a1000r7008B46667D1582a29427A599b17364C3234b05041L2159
10737a72882N4863m2951M1221B78452d7565j18681B0410N0112l1423A6913J72369
10726A89282d5356l07251a11010A02515i9660R300A9489D627L6482f4479B07905
10714A82307c43343J38662k3046H3887c34627e2794B01974g1519B96685A1119
10703B60043b7586o4355A63459n2509m8815d42822i7285j6411N3593q5627I3407
10691b66308b3282A1958a9825A88906a80263a674A8298b47994F3604L7917I290
10679d4835l79075B81795R5451B3134A0032L34019j57864a56633A89411b78862
10668a5078C5794J25216a86252B21192d00039a04811K777n743k967k04134E144
$$ plain form
10656 147076 44440 -165102 -437021 -153148 -107493 -82023 -45818 -301160 89213 -134277
10645 -164383 -117181 -285241 -58090 -63504 -90932 174250 -295062 -193404 189534 -160268
10634 12297 132432 280307 -208096 58656 -61639 56974 -177085 -234414 76219 -73521 -16153
10622 51358 -18417 34901 -97925 -297275 122626 117636 -409094 -40344 120936 -238083 -191416
10611 -191416 25594 -97201 75463 -68959 -175228 -77298 27276 -140884 -244505 122574 -170863
10599 -84257 -111602 -38497 -149685 -188106 -75987 -287204 -64037 -99634 -246147 -83688 107620
10587 -150740 179124 -155656 91327 273154 -145145 -186993 11515 -158924 146169 -372885
10576 -527 101652 -79391 141368 20813 -22460 -71028 22197 -262947 86598 120399 -38931
$$ packed form
10656A47076D4440a65102k71919a53148M5655K5470L6205k55342H9213a34277
10645a64383M7202j68060e8090n414k7428A74250b95062J01658A89534a60268
10634A2297J20135J47875b08096E8656f1639E6974a77085n7329G6219g3521a6153
10622E1358a8417C4901i7925j99350A22626m990d09094d0344A20936b38083M6667
10611a91416B5594i7201G5463f8959j06269g7298B7276a40884j03621A22574a70863
10599h4257k7345c8497j11188l8421g5987k11217f4037l5597j46513h3688A07620
10587a50740A79124a55656I1327J81827a45145m1848A1515a58924A46169c72885
10576e27A01652g9391A41368B0813b2460m8568B2197b62947H6598L3801c8931
$$ plain form
10564 26412 69380 -338742 -265259 22654 -188152 410925 -166830 -92509 -241833 214843
10553 -53966 -105362 50494 -161474 -51772 20942 -159115 -440716 -189233 -304648 -32087 -178214
10542 -178214 -151594 9982 -329667 -60620 -157807 231478 69429 -128227 201006 -169310 -92552
10531 -92552 180653 -390720 -163030 151353 99660 -134376 -184677 82156 -101684 -83765
10521 -83765 -199347 -176779 -29949 240437 -40031 -57107 -55998 -143314 -398640 22042 -15520
10509 1720 151963 -423239 -15645 123242 -359851 -361805 215517 -233631 -249426 -46666 -386747
10498 -386747 355531 -296661 99964 67679 250117 267585 -180464 196964 14079 -70751
10487 -186014 137192 -11106 129822 -218145 47591 -22489 -3860 87192 168847 216606 141440
$$ packed form
10564B6412M2968c38742P3483B2654a88152D10925a66830P4321j49324B14843
10553e3966n1396E0494a61474e1772B0942a59115k81601a89233j15415c2087j46127
10542a78214K6620I982c29667f0620r7187B31478F9429a28227B01006a69310P6758
10531i2552A80653c90720a63030A51353n1693a34376n0301H2156a01684J7919
10521h3765j15582K2568b9949B40437d0031j7076J109q7316k55326B2042a5520
10509A720J50243d23239a5645A23242c59851j954B15517b33631j5795d6666l40081
10498c86747C55531b96661I9964l2285J82438J7468a80464A96964A4079g0751
10487a86014A37192a1106A29822b18145D7591b2489c860H7192Q1655M7759p5166
$$ plain form
10476 141440 386878 191774 351546 324444 -129901 108433 192372 130115 -8744 61896 -282427
10464 112066 -246809 53835 -218393 132295 -198057 157534 -140584 -174402 43995 -111070
10453 97626 -374330 -31298 -21253 -352860 10753 -345393 -102564 252119 -11904 -300042
10443 -300042 -125990 184657 87191 10547 -61675 -272386 294000 -21725 -175370 293679
10432 -310157 -104790 -168199 -94729 290421 161754 103215 -24528 -120453 203454 -93262 5092
10420 33779 -155911 -30304 7150 81489 -3346 80358 -145603 375912 205846 2152 183428
10409 183428 -44359 63832 136096 -22731 153696 -32172 370809 14925 -34734 -71241 319762
10397 -156273 -13579 27898 108652 -241939 52840 29766 13549 356911 59292 -122315 277881
$$ packed form
10476A41440K45438A91774J59772k7102a29901A08433Q3939o2257h744F1896b82427
10464A12066b46809E3835b18393A32295a98057A57534a40584l3818D3995a11070
10453I7626c74330c1298J0045l31607A0753c45393a02564B52119a1904k88138
10443c00042a25990A84657H7191A0547f1675k10711B94000b1725j53645B93679
10432c10157a04790o3409P3470B90421j28667n8539b4528r5925B03454i3262E092
10420C3779a55911c0304G150P4339c346H0358a45603C75912j70066B152J81276
10409A83428d4359F3832P2264b2731A53696c2172C70809A4925c4734l6507C19762
10397a56273a3579B7898Q0754b41939E2840k3074A3549L43362E9292a22315B77881
$$ plain form
10385 26302 60414 171369 343197 112358 -21037 22859 -31712 33539 146144 253812 452495
10374 452495 276928 78462 548080 276847 406058 360052 242168 598315 403213 84081
10363 346104 960729 850774 602108 311465 305571 147901 299348 131284 -31551 202085
10352 247977 173415 288551 247689 527690 384775 765468 439370 439215 324975 438824
10342 438824 241361 408036 103035 1289 387134 283372 95546 -1062 392819 -38941 338054
10330 432149 370026 17910 111653 53214 145690 417979 90818 158720 275890 334263 332013
10319 332013 321451 -15255 61460 53572 -57309 -208856 265895 108612 -153080 158149 -192825
10307 -2317 127430 -186598 -69726 -133771 6741 -16082 -36993 166380 -302293 -321416 121787
$$ packed form
10385B6302L4112J10955J71828A12358b1037B2859c1712C3539J12605J07668J98683
10374D52495j75567G8462M69618k71233J29211m6006j17884L56147j95102H4081
10363C46104O14625j09955k48666k90643n894A47901J51447A31284c1551B02085
10352B47977p4562J15136m0862K80001j42915L80693l26098j55j14240J13849
10342D38824j97463J66675A03035A289L85845j03762I5546a062C92819c8941C38054
10330D32149o2123A7910R3743E3214R2476K72289I0818O7902J17170N8373k250
10319C32013j0562a5255F1460p888e7309j51547B65895A08612a53080A58149a92825
10307b317A27430a86598f9726o4045F741a6082k0911A66380c02293j9123A21787
$$ plain form
10295 -337312 -206879 -268503 -314550 -17351 -285918 -1917 -11720 -11272 -40723 -108724 -35615 -114251
10283 -114251 -172838 -75815 -187070 -142580 -257595 39655 254497 61310 26432 284814 -260656
10271 -143623 -408170 188867 -298061 127852 60916 -84981 -100998 37209 -24564 182817
10260 -278056 -81769 315638 68135 43033 64903 306902 595218 283471 520379 19455
10249 43762 149991 41342 347681 165744 -29585 -141134 -94893 55009 -62451 -141684 219916
10237 171348 -58296 176645 129201 47785 22073 -4051 147862 -280001 -65298 68571 -34310
10225 -64921 259892 207589 17703 -292419 158134 -281801 -162526 -133748 -65978 -102690 -336402
10214 -336402 -356308 -204302 -422722 17487 -129499 -56004 12278 -153807 -50886 -61244 132443
$$ packed form
10295c37312J30433o1624m6047a7351k68567a917r803M48k9451o8001c5615p8636
10283a14251n8587g5815j11255M4490j15015C9655K14842F1310B6432K58382b60656
10271a43623k64547A88867b98061A27852F0916h4981j6017C7209b4564A82817
10260b78056h1769C15638F8135k5102K1870K41999K88316B83471K36908A9455
10249D3762J06229D1342L06339A65744b9585j11549M6241E5009f2451p9233B19916
10237A71348e8296A76645m7444D7785B2073d051A47862b80001f5298F8571c4310
10225f4921B59892n2303A7703b92419A58134b81801J19275K8778f5978l6712k33712
10214c36402j9906J52006k18420A7487a29499e6004A2278a53807e0886j0358A32443
$$ plain form
10202 -298976 175641 -177882 -105710 -608547 175063 -40115 149029 -416926 -130320 18528
10191 -53378 39399 -75438 139887 -128174 131333 -50696 249473 26610 -324346 -304917 10114
10179 45085 -83573 -233924 -130475 -103746 62260 -228312 -173891 143021 -11843 66107 -95187
10167 304623 113468 -95222 -25340 133770 81884 -155562 -227200 -3706 -214897 36826 81690
10156 81690 26206 22780 66937 -144528 44307 74924 -256397 13421 161995 -145280 17414
10144 77595 -102292 -538850 -333362 200529 -102310 -135721 -34363 201110 -264724 -21577
10133 -59763 74937 337366 -142899 195144 -57588 121172 -438106 -306967 -117648 131388
10122 -22497 62993 -35861 106144 -235190 71750 -22145 149804 -116495 26617 -179243 -58596
$$ packed form
10202b98976A75641a77882P2172n02837A75063d0115A49029d16926a30320A8528
10191e3378C9399g5438A39887a28174A31333e0696B49473B6610c24346J9429A0114
10179D5085h3573j50351J03449K6729F2260b28312N4421A43021a1843F6107i5187
10167C04623A13468i5222b5340A33770n1886a55562p1638c706k11191C6826M4864
10156H1690B6206l426M4157a44528D4307L0617b56397A3421J48574a45280A7414
10144G7595a02292m36558K05488B00529a02310l3411c4363B01110b64724b1577
10133e9763G4937K62429a42899A95144e7588A21172d38106J31139a17648A31388
10122b2497F2993c5861A06144b35190G1750b2145A49804a16495B6617a79243e8596
$$ plain form
10110 -101404 -71191 107888 118133 1449 -101953 -80752 61560 6103 -166372 -22469 -37419
10099 -37419 183702 -249063 209214 28818 -320532 5293 -34889 -44801 -53494 -87766 -55687
10088 -55687 -277601 204586 -186406 -112891 232781 -140013 -36629 335001 -285175 -224983
10078 -224983 -127114 -230857 -24459 -334528 -236569 -111504 -43712 -74875 -150565 -264686 -81479
10066 -194151 -419516 -22538 -134677 -269427 -98641 -176557 -154780 28894 -112711 -105842 -54702
10055 -54702 241358 86777 -160287 -192618 -61573 -196546 -314083 -26161 40761 -384431 -24222
10043 -182302 114436 -187948 -185621 7922 -144378 210248 -1846 -30529 -131950 -128205 168901
10031 83579 57655 -264491 -196050 -29097 124052 283024 -352405 -50345 81850 -269163 100185
$$ packed form
10110a01404L0213A07888J0245A449a01953K1201F1560F103a66372b2469j4950
10099c7419A83702b49063B09214B8818c20532E293c4889r912q693l4272L2079
10088e5687k21914B04586a86406P3515B32781a40013c6629C35001b85175O0192
10078b24983R7869j03743b4459l10069R7959a11504d3712l1163p5690j14121h1479
10066a94151k25365b2538j12139j34750i8641p7916K1777B8894a12711O869N1140
10055e4702B41358H6777a60287l2331f1573j34973j17537b6161D0761c84431b4222
10043a82302A14436a87948K327G922a44378B10248a846k8683j01421L745A68901
10031H3579k5924b64491O8441b9097A24052J58972c52405e0345H1850b69163A00185
$$ plain form
10019 -87545 -374870 -91944 -124581 211956 -141468 36224 -76289 -24485 133705 -46573 -28415
10008 -28415 89071 27237 172630 -405122 79720 -575279 -263944 -13595 -69671 -137695 -46163
9996 -88327 146948 103902 165238 67671 -48825 -336771 -107104 -129997 -66013 -22638 -84711
9985 -84711 -105481 181162 -65442 -258028 94849 -46127 -315230 -254558 -54551 -182058 -33583
9973 143982 -429381 -159088 -9651 -157437 129922 -86311 -42891 311145 -101012 115951
9962 -59846 -238446 139483 148364 -281505 59722 -70112 184720 -195668 -72632 -310028 182234
9950 -35566 -227981 -253238 -74986 -157378 -364585 -111582 -125198 -65970 244141 -27170 -128260
9939 -128260 -364459 96771 -115067 -11886 -205990 52215 135030 -133785 -142535 -367843 16573
$$ packed form
10019h7545k87325i1944l2637B11956a41468C6224g6289b4485A33705d6573J8158
10008b8415H9071B7237J45393d05122G9720e75279b63944a3595n6076o8024d6163
9996h8327A46948m3046O1336F7671d8825k87946a07104k2893O3984b2638o2073
9985h4711k0770A81162f5442j92586I4849d6127k69103O0672e4551j27507c3583
9973A43982d29381a59088i651j47786A29922h6311d2891C11145a01012A15951
9962e9846j78600A39483Q881b81505E9722g0112A84720a95668g2632k37396A82234
9950c5566j92415k5257g4986q2392k07207a11582j3616N9228B44141b7170j01090
9939a28260k36199I6771a15067a1886j94104E2215Q2815a33785q750k25308A6573
$$ plain form
9927 8460 -136715 185973 -141187 -121418 -180640 31860 125162 75552 194841 -110511 -216267
9916 -216267 103714 -143994 356429 -94046 -150225 -212628 3838 -167091 2624 -458110 316988
9904 -316214 -116169 -218644 8878 71516 511 -106202 -151949 15030 -263546 -148786 -65671
9892 314747 -102873 124129 -280174 -2693 -26666 -639607 -303887 -153935 317806 91419
9881 -161652 146673 -84016 150307 86173 -153969 -3904 -66947 58294 -91405 -78130 -380359
9870 -380359 202348 77204 -110391 -9410 -251081 -78381 -33834 41231 -64231 28590 -242616
9858 -117935 -320343 -214864 147586 -262382 -116389 -140526 -119113 96765 -206850 -2494 -121269
9847 -121269 229264 -38905 -209255 362575 -32869 136552 82954 128663 -477906 -38687 85894
$$ packed form
9927H460a36715A85973a41187J9769n9222C1860R3302m9610J19289a10511j05756
9916b16267A03714a43994C56429i4046n6179o2403C838a67091B624d58110C16988
9904c16214a16169j02475H878O2638E11a06202m5747A5030b63546J14760f5671
9892C14747a02873A24129b80174b693k3973o12941c03887J49952C17806I1419
9881a61652A46673h4016A50307o4134a53969c904o3043E8294i1405J3275l02229
9870c80359B02348G7204a10391i410k41671g8381c3834D1231f4231B8590b42616
9858a17935k02408J05479A47586b62382a16389k4137K1413I6765b06850b494j18775
9847a21269B29264c8905j70350C62575c2869A36552n3598M5709d77906c8687H5894
$$ plain form
9835 266973 -62687 -120886 -108595 42113 111909 154025 -5766 -149810 17933 -38331 -4866 82940
9822 -344906 279605 -164420 -34832 -58072 31739 -241792 -5695 -134119 -80152 -161654 263989
9810 -175140 -218905 112723 -167139 -307421 139686 34917 -155104 -156368 -170349 -431843 -247034
9799 -247034 60802 -265043 -97029 -414625 -84938 -34756 -196125 17921 -66333 -314439 50940
9787 -212786 -10107 -81662 -432214 -88911 17749 -360229 -128845 -36370 -44523 -5029 -247516
9776 -247516 -83679 -35309 -94770 -323678 -21537 36693 -375704 -215020 84812 -268793 162153
9764 130638 -87028 -99276 171281 148713 -160501 -334673 -68431 246503 -398033 -283751
9754 -283751 -394572 57684 -379035 151678 -338899 -193787 26087 -202280 -158810 124533
$$ packed form
9835B66973f2687n8199J2291D2113O9796M2116e766j44044A7933c8331d866H2940
9822c44906B79605a64420c4832k3240C1739b41792e695j28424N3967q1502B63989
9810a75140m3765A12723a67139j40282A39686C4917a55104j264j3981k61494J84809
9799b47034F0802b65043i7029l17596h4938c4756j61369A7921f6333k48106E0940
9787b12786a0107p1555l50552h8911A7749c60229a28845c6370q153e029k42487
9776b47516h3679c5309n9461k28908b1537C6693c75704J60684H4812b68793A62153
9764A30638h7028j2248A71281k2568a60501j74172f8431B46503c98033J14282
9754b83751j10821E7684c79035A51678c38899J45112B6087b02280M3470A24533
$$ plain form
9743 205551 -271438 161266 -87696 168318 159150 160592 77162 -176221 208087 -16260 116179
9731 -53810 70532 118125 -359931 -286559 -202710 -228460 -114252 159085 -53393 -332583 -313651
9720 -313651 74361 -103778 244472 77406 22717 -25953 -121209 -221510 111449 -179942 -422564
9709 -422564 -55039 301555 39214 139559 -281829 61869 171848 -148457 82731 -112845
9698 80901 -115846 -17012 -44715 -584951 26004 -48648 -183679 -25924 -159198 225112 -255376
9686 -23031 47737 -262641 -123727 -60062 67819 -406286 -176784 -116285 -207499 -203654 -175020
9675 -175020 -124686 31145 -301144 52949 176408 -283989 -157777 19704 -104292 105432
9664 -346551 -112332 -48303 -75583 171575 -39334 -16834 189076 -262122 -252626 -289067 -137018
$$ packed form
9743B05551b71438A61266h7696A68318r168J442G7162a76221B08087a6260A16179
9731e3810G0532M7593c59931P3372Q3849k5750J14208A59085e3393k79190J8932
9720c13651G4361a03778B44472G7406B2717b5953r5256j00301A11449a79942k42622
9709d22564e5039C01555C9214J00345b81829F1869J09979a48457H2731a12845
9698H0901a15846a7012k7703n40236B6004d8648j35031b5924j33274B25112b55376
9686b3031D7737b62641a23727f0062F7819d06286a76784O0499r1214L845K8634
9675a75020N0334C1145c01144E2949J23459b83989J26212A9704a04292A05432
9664c46551a12332d8303k7280A71575c9334a6834A89076b62122R496l6441a37018
$$ plain form
9652 -62339 3366 -77066 252300 -119993 26832 -95897 11018 41030 -179177 12844 150575
9641 150575 -212695 -433300 -251455 -46905 -321977 322693 -91306 -52556 -274072 -251146
9631 -251146 -49910 20756 66101 7309 -57738 -173119 -189646 158949 -137149 -62742 -32518
9620 -32518 65689 -176462 112702 -83179 46138 52744 189582 -24680 -85526 83870 -157259
9608 331118 -254475 -179130 -53554 -51557 -143635 -164120 -221963 -50804 -338872 -2391 138340
9596 -68843 109271 29716 169815 -110213 290078 46317 128224 363705 78942 255417 -160634
9584 -191632 -4963 -116118 72738 -141055 -105067 -21545 -111984 46842 -349445 -67434 -407199
9573 -407199 -78401 2288 -119650 13147 36627 -79310 -134606 -63041 80656 101178 -166452
$$ packed form
9652f2339C366g7066B52300a19993B6832i5897A1018L0012a79177A2844J37731
9641A50575b12695k20605J81845d6905k75072C22693i1306L8750k21516K2926
9631b51146d9910B0756M5345G309e7738j15381j6527A58949a37149f2742L0224
9620c2518F5689a76462A12702h3179D6138O606J36838b4680o0846H3870a57259
9608C31118b54475P5345e3554J997r2078k0485n7843e0804k88068b391A38340
9596f8843A09271B9716J40099a10213B90078D6317Q1907K35481G8942J76475a60634
9584a91632d963j11155G2738a41055L5988b1545r0439D6842c49445f7434l39765
9573d07199g8401B288a19650A3147K3480g9310n5296f3041H0656K0522a66452
$$ plain form
9561 85076 -118877 -147494 -223949 -137284 -173915 -158522 -258874 -33061 63094 -57386 82722
9549 -6350 304254 -132188 189119 -161916 178317 -266200 18687 -288683 -42181 16603 -236109
9537 174970 -263790 -80313 -31631 -219368 1806 193731 -161342 178396 109076 30589 -70258
9525 -193163 167325 28226 226486 -16729 47947 -375729 -276500 -256048 -37912 113802 51658
9513 -94561 164661 -286073 22449 -101126 -6303 -10925 -181626 -96859 -352129 -11542 -265262
9502 -265262 141544 -71789 55206 106549 -185255 -175617 113285 -177224 -464236 -239310 -46795
9490 -252035 -936 -13544 13548 126558 -52957 -101284 -28908 -441234 -12869 -61110 -27397 -107311
9478 -107311 -140734 -201904 -316011 159348 -153486 18258 -9883 1483 -62577 82750 117909
$$ packed form
9561H5076a18877k8617p6455Q6665l6631J5393j00352c3061F3094e7386H2722
9549f350C04254a32188A89119a61916A78317b66200A8687b88683d2181A6603b36109
9537A74970b63790h0313c1631j87737A806J91925a61342A78396o9320C0589g0258
9525a93163A67325B8226J98260a6729D7947c75729R9229K0452c7912A13802E1658
9513i4561A64661b86073B2449a01126f303m622j70701Q4767k55270a1542k53720
9502b65262A41544g1789E5206N1343a85255R638A13285a77224k87012K24926d6795
9490b52035i36j2608A3548J13010e2957m8327b8908m12326a2869m8241b7397p9914
9478a07311l3423o1170j14107A59348a53486A8258i883A483f2577H2750L5159
$$ plain form
9467 117909 -192432 60237 -201485 -304668 10605 -143507 -171846 -264314 -145223 -117607 88738
9455 -135607 -33210 -410612 163486 -27516 276413 397644 193930 52901 -103732 -384981
9445 -384981 46700 -152817 166089 -168358 -50164 -216938 -157035 -108768 -157092 19420 -140792
9433 -111286 -137707 -17686 -30926 110746 120565 -37030 194798 -124994 -35464 -69890 219424
9421 -226820 -36256 -238791 -211600 -176718 13279 52827 -51010 67072 254442 244383 -326542
9409 245958 -76655 -174485 181758 89747 -55567 -165960 54812 -16384 -253003 -298927 -247266
9398 -247266 -57604 328480 -365770 -206109 -385875 -361779 -88427 -10300 -37846 -244814 182691
9386 -51296 -262501 -78650 -18391 -153285 13460 -32652 93992 -229723 -94661 -565167 -65544
$$ packed form
9467A17909a92432F0237b01485j03183A0605a43507k8339r2468J19091K7616H8738
9455a35607c3210l77402A63486b7516B76413J21231A93930E2901a03732k81249
9445c84981D6700a52817A66089a68358e0164j66774N9903M8267m8324A9420a40792
9433a11286k6421a7686j3240A10746R819c7030A94798a24994c5464l4426B19424
9421b26820c6256k02535K7191L4882A3279L9548e1010F7072J87370j0059c26542
9409B45958g6655r7830A81758H9747e5567j10393E4812a6384k36619m5924N1661
9398b47266e7604C28480c65770J59661j79766K4096h8427a0300k7546k06968A82691
9386e1296k11205g8650a8391j34894A3460c2652I3992b29723i4661m70506f5544
$$ plain form
9374 -309255 -197961 -137531 216681 -127311 434223 41087 -242457 -87039 358786 -247617
9363 -5619 -251005 50226 -158314 134409 16817 -233152 -233236 31595 -101166 -102642 19614 11332
9351 11332 -111168 -162578 61440 -152164 -294844 59172 -178971 -96341 -254900 -113957 3820
9339 58926 -138743 -245363 48894 217533 -259021 -341727 -61671 -424223 -55510 -405616 93761
9327 -122710 -410219 58987 -107230 -77190 1394 86930 -3420 -69172 251259 49932 -120562
9315 -195695 90727 -229866 -267323 265141 11538 64034 75868 282940 -281813 152114 -381218
9303 200538 -78897 -78188 -74142 -232140 -331131 69943 -121191 42806 10607 205231 47456 -201238
9290 233937 117093 -83983 -36479 -91558 -145227 -8831 137045 7680 -180252 115087 -178801
$$ packed form
9374c09255J11294O0430B16681a27311D34223D1087b42457h7039C58786b47617
9363e619k45386E0226a58314A34409A6817b33152q4C1595a01166j476A9614q282
9351A1332a11168n1410F1440a52164j42680E9172a78971Q2630j58559a13957C820
9339E8926a38743j06620D8894J68639b59021q2706f1671l62552e5510l50106I3761
9327a22710k87509E8987a07230L0040A394Q5536c420o5752B51259D9932a20562
9315a95695I0727b29866l7457B65141A1538N2496J1834K07072b81813A52114c81218
9303B00538g8897P09M046j57998r8991F9943a21191D2806A0607J94624D7456b01238
9290B33937j16844h3983c6479n5079n3669h831A37045G680a80252A15087a78801
$$ plain form
9278 -203168 -126884 -327776 -74190 -42480 -16592 -101774 -78829 57230 179225 -74069 172413
9266 -7069 -27891 -149426 88088 -85502 -45389 -123585 120264 -23585 280475 43122 -196762
9254 -68416 131115 58641 -83579 76214 -75931 8329 -203635 -85028 6836 -374115 -76558 -113934
9242 -113934 -229618 144685 -194519 203015 -239145 3412 269897 -71592 -34019 -28437 -71661
9231 -71661 172114 -198749 -104430 -276988 -386244 -52598 -162593 -141177 -93643 -233012 346616
9219 -158776 6799 -183047 -195510 -73694 17731 -63162 -270702 101794 -292600 -54960 -280326
9208 -280326 176472 -16413 238155 -157591 -398413 88441 105832 -23446 -99519 -207305 -451697
9197 -451697 -405263 41474 -120164 -215347 310871 147524 -44528 -108994 25920 -101377 -27999
$$ packed form
9278b03168P6284k00892g4190L1710a6592q5182K2945E7230J21995g4069A72413
9266g069k0822j21535H8088h5502M0113p8196A20264b3585B80475D3122a96762
9254f8416A31115E8641h3579G6214g5931H329b03635h5028F836c74115g6558l7376
9242a13934j15684A44685a94519B03015b39145C412K66485g1592c4019N582m3224
9231g1661A72114a98749R4319j72558j09256e2598j09995K1416M7534j39369C46616
9219a58776F799a83047j2463g3694A7731f3162k07540A01794b92600e4960k25366
9208b80326A76472a6413B38155a57591k40822H8441J7391b3446p6073j07786k44392
9197d51697M6434D1474a20164r5183C10871A47524d4528o4466B5920a01377b7999
$$ plain form
9185 -108331 -34204 437260 -315270 -320385 189430 -207135 4066 -258088 20396 -236521 30201
9173 227842 -41798 -145332 -8464 -266380 -15752 -356404 -344575 25201 -197726 17039 -103051
9161 51696 -227186 -77343 -324985 49077 -34574 151335 -61701 -231152 1969 166282 94696
9150 94696 125740 67882 -51472 -45555 -156714 -26933 116071 -167826 -203601 -43296 90627
9138 52603 -22619 211171 23267 141030 -80587 -17273 -66412 -166401 22273 -81376 -163673
9127 -163673 81999 -14686 -219300 307734 85100 -192220 -117459 108188 -388605 -212492
9117 -212492 177007 -152825 -64359 -92309 -66116 -115988 -31430 -235963 -299174 252892 84313
9105 -80072 -429948 56693 125206 -156701 93110 -14227 -50566 -161565 40115 117404 -269234
$$ packed form
9185a08331c4204D37260c15270n115A89430b07135D066b58088B0396b36521C0201
9173B27842d1798j03534h464k57916a5752l40652J1829B5201a97726A7039a03051
9161E1696b27186g7343k47642D9077c4574A51335f1701j69451A969J64313p1586
9150I4696L1044n7858e1472N917j11159b6933A16071a67826l5775d3296I0627
9138E2603b2619B11171B3267J17763h0587a7273m9139r9989B2273h1376q2297
9127a63673H1999a4686k04614C07734H5100a92220P4761A08188c88605J76113
9117b12492A77007a52825f4359k7950K6193m9872c1430k04533o3211B52892H4313
9105h0072l49876E6693O8513a56701I3110a4227l6339j10999D0115P7289b69234
$$ plain form
9093 -58257 68179 -153122 235401 -110182 -49859 -197666 -132805 -118993 -26238 164175 -81556
9081 -130384 112661 -157606 -163729 -227668 204889 -212428 16985 187162 -288713 -293604 -134230
9069 22484 160320 -140292 239036 -22751 94736 4338 -55520 -110465 127987 64558 194933
9058 194933 42823 -147608 -145452 -217113 -90637 64253 82972 -142830 150567 -118435 -16908
9046 -211225 -97377 -560170 -101382 -95947 49668 -294481 -131277 -27713 -9731 -224807 -1637
9034 44588 -84854 -71036 -57982 -189588 -245352 -133228 129356 -102898 202582 -64236 -68587
9023 -68587 -117622 -216948 104749 8681 71334 -42118 -262087 -160860 -22775 -3210 -379847
9012 -379847 56399 39004 246605 106658 -277286 -80670 139623 17033 -95487 -286898 140458
$$ packed form
9093e8257F8179a53122B35401a10182d9859j47807O4861J3812b6238A64175h1556
9081a30384A12661a57606o123o3939B04889b12428A6985J70177b88713m891a34230
9069B2484J37836a40292B39036b2751I4736D338e5520n4945A27987o3429J30375
9058A94933D2823a47608K156p1661i0637F4253J8719a42830A50567a18435a6908
9046b11225i7377m62793a01382N435D9668b94481a31277b7713i731k15076a637
9034D4588h4854J3818J3054j31606n5764J12124A29356a02898B02582f4236m351
9023f8587m9035r9326A04749H681O2653d2118k19969J01227b2775c210l76637
9012c79847E6399j7395K07601A06658b77286h0670A39623A7033i5487j91411A40458
$$ plain form
9000 -19618 163657 -50094 -161888 -113287 -69303 -87734 -210900 -240690 -320508 164123 79454
8988 -42389 -112379 206060 31676 -407415 158523 119722 80361 -17941 -353431 -139060 -142557
8977 -142557 27148 -334472 -202067 91913 -127664 -183443 -22694 118946 103851 215720 74112
8965 -45036 -237886 279585 224952 37452 -28063 -184787 -108066 25407 -243629 139960 -134470
8953 160926 19816 -31267 9854 -41040 -105821 22341 109141 -89727 97431 -178733 -226880 197350
8940 -35887 19102 112820 -37037 167334 -257603 -317 27771 165402 417546 149810 -137387
8928 255216 -103703 -46802 -302767 -61695 269709 831362 1165129 3602846 9990703 15568953
8918 15568953 4261260 1475061 960602 585311 133340 390007 -61439 204887 6102 35143
$$ packed form
9000a9618A63657e0094j11794M8601M3984j8431j23166k9790p9818A64123G9454
8988d2389o9990B06060C1676d07415A58523l8801l9361a7941l35490a39060l497
8977a42557B7148c34472J32405I1913a27664n5779b2694A18946j5095J11869G4112
8965d5036j92850B79585n4633C7452b8063j56724P6721B5407b43629A39960a34470
8953A60926A9816c1267I854d1040o4781B2341Q6800h9727I7431a78733m8147A97350
8940c5887A9102R3718c7037A67334b57603c17B7771J37631K52144A49810a37387
8928B55216a03703d6802k55965f1695B69709N61653L33767K437717O387857N578250
8918A5568953D261260A475061n14459l75291A33340K56667f1439B04887F102K9041
$$ plain form
8908 35143 -137807 213982 552087 -25615 136261 160292 -222726 -63951 -123052 -141776 -108840
8897 -108840 101776 25933 -152698 25786 -25512 -56315 194528 -298351 210070 -110315
8886 -65532 258952 -169788 -83625 -17693 -152559 -55046 -279395 -36105 -76341 -58109 -27773
8874 148265 -30293 203363 -73844 -82867 260487 -276525 -170818 -242314 -55518 -190382 66405
8862 83029 -283938 -46938 58717 -65385 138529 -87718 5833 -320957 -122799 148433 -152411
$$ packed form
8908C5143a37807B13982L38105b5615A36261K4031b22726f3951n9101j8724L2936
8897a08840A01776B5933a52698B5786b5512l0803A94528b98351B10070a10315
8886f5532B58952a69788h3625a7693j34866e5046k24349c6105m0236J8232b7773
8874A48265c0293B03363g3844r023B60487b76525J05707p1496e5518j34864F6405
8862H3029b83938d6938E8717f5385A38529h7718E833c20957a22799A48433a52411
$$ [...]
##END NTUPLES=NMR SPECTRUM
##END=
