
##TITLE=AC1365_HAWAS12179_7155411_SWLinPkv4v
##JCAMPDX= 6.0         $$ Bruker NMR JCAMP-DX V2.0
##DATA TYPE= NMR SPECTRUM
##DATA CLASS= NTUPLES
##ORIGIN= BRUKER
##OWNER= Administrator
$$ 1.72 TOPSPIN		Version 2.1
$$ 2012-11-30 19:55:49.812 -0500  Administrator@X
$$ Compression mode = diff/dup
##.OBSERVE FREQUENCY= 400.02188249412
##.OBSERVE NUCLEUS= ^1H
##.ACQUISITION MODE= SIMULTANEOUS (DQD)
##.ACQUISITION SCHEME= undefined
##.AVERAGES= 8
##.DIGITISER RES= 22
##SPECTROMETER/DATA SYSTEM= spect
##.PULSE SEQUENCE= zg30
##.SOLVENT NAME= COFFEE_meoh
##.SHIFT REFERENCE= INTERNAL, COFFEE_meoh, 1, 14.98509
##AUDIT TRAIL= $$ (NUMBER, WHEN, WHO, WHERE, PROCESS, VERSION, WHAT)
$$ ##TITLE= Audit trail, TOPSPIN		Version 2.1
$$ ##JCAMPDX= 5.01
$$ ##ORIGIN= Bruker BioSpin GmbH
$$ ##OWNER= Administrator
$$ $$ E:\/data/COFFEE/nmr/AC1365_HAWAS12179_7155411_SWLinPkv4v/10/pdata/1/auditp.txt
$$ ##AUDIT TRAIL=  $$ (NUMBER, WHEN, WHO, WHERE, PROCESS, VERSION, WHAT)
(   1,<2012-11-30 19:55:41.437 -0500>,<Administrator>,<X>,<go>,<TOPSPIN 2.1>,
      <created by zg
	started at 2012-11-30 19:54:36.970 -0500,
	POWCHK enabled, PULCHK disabled,
       configuration hash MD5:
       86 BA 57 50 F2 9D 5C 9B 26 00 A9 28 5F 66 2E 89
       data hash MD5: 64K
       64 0A CE A0 00 E5 0A A6 D3 87 D8 94 E3 0A 04 5F>)
(   2,<2012-11-30 19:55:44.624 -0500>,<Administrator>,<X>,<proc1d>,<TOPSPIN 2.1>,
      <Start of raw data processing
       efp LB = 0 FT_mod = 6 PKNL = 1 PHC0 = 0 PHC1 = 0 SI = 32K 
       data hash MD5: 32K
       C1 4A CD 02 74 42 E2 FB E7 F9 48 F4 D9 AE EB 3D>)
(   3,<2012-11-30 19:55:45.093 -0500>,<Administrator>,<X>,<proc1d>,<TOPSPIN 2.1>,
      <pk PHC0 = 96.45447 PHC1 = 0 
       data hash MD5: 32K
       46 8A 29 03 C5 01 98 05 5C D8 07 AE 98 87 FE 7A>)
(   4,<2012-11-30 19:55:45.327 -0500>,<Administrator>,<X>,<proc1d>,<TOPSPIN 2.1>,
      <abs ABSG = 1 
       data hash MD5: 32K
       A4 6A 7E 17 4E 6B A3 A1 9A 1C 5E F9 34 27 E7 19>)
(   5,<2012-11-30 19:55:45.483 -0500>,<Administrator>,<X>,<proc1d>,<TOPSPIN 2.1>,
      <abs ABSG = 2 
       data hash MD5: 32K
       CD 72 7F F8 38 7F 59 25 C7 58 20 D7 AB CF 67 D9>)
(   6,<2012-11-30 19:55:45.640 -0500>,<Administrator>,<X>,<proc1d>,<TOPSPIN 2.1>,
      <abs ABSG = 3 
       data hash MD5: 32K
       D5 EC 8C 7F 21 CE 85 D6 33 94 AB 02 E3 7E 2F 2A>)
(   7,<2012-11-30 19:55:45.796 -0500>,<Administrator>,<X>,<proc1d>,<TOPSPIN 2.1>,
      <abs ABSG = 4 
       data hash MD5: 32K
       8F A1 AD 74 B6 76 09 13 F7 0B C1 1B C4 89 8C E0>)
(   8,<2012-11-30 19:55:45.937 -0500>,<Administrator>,<X>,<proc1d>,<TOPSPIN 2.1>,
      <abs ABSG = 5 
       data hash MD5: 32K
       1C EF F9 F2 01 AD B5 42 42 AE 76 EE 12 32 B6 72>)
$$ ##END=
$$ 
$$ $$ hash MD5
$$ $$ 15 90 22 82 AB FE A5 21 E7 F7 B0 D5 46 A3 5C E1
##$RELAX= 
##$RELAX= 
##$RELAX= 
##$RELAX= 
##$RELAX= 
##$RELAX= 
##$RELAX= 
$$ Bruker specific parameters
$$ --------------------------
##$DU= <E:\>
##$EXPNO= 10
##$NAME= <AC1365_HAWAS12179_7155411_SWLinPkv4v>
$$ [...]
##$TP= (0..7)
150 150 150 150 150 150 150 150
##$TP07= 0
##$TPNAME0= <>
##$TPNAME1= <>
##$TPNAME2= <>
##$TPNAME3= <>
##$TPNAME4= <>
##$TPNAME5= <>
##$TPNAME6= <>
##$TPNAME7= <>
##$TPOAL= (0..7)
0.5 0.5 0.5 0.5 0.5 0.5 0.5 0.5
##$TPOFFS= (0..7)
0 0 0 0 0 0 0 0
##$TUNHIN= 0
##$TUNHOUT= 0
##$TUNXOUT= 0
##$USERA1= <user>
##$USERA2= <user>
##$USERA3= <user>
##$USERA4= <user>
##$USERA5= <user>
##$V9= 5
##$VALIST= <valist>
##$VCLIST= <CCCCCCCCCCCCCCC>
##$VD= 0
##$VDLIST= <DDDDDDDDDDDDDDD>
##$VPLIST= <PPPPPPPPPPPPPPP>
##$VTLIST= <TTTTTTTTTTTTTTT>
##$WBST= 1024
##$WBSW= 4
##$XGAIN= (0..3)
0 0 0 0
##$XL= 0
##$YL= 0
##$YMAX_a= 676745
##$YMIN_a= -575807
##$ZGOPTNS= <>
##$ZL1= 120
##$ZL2= 120
##$ZL3= 120
##$ZL4= 120
##$ABSF1= 14.98509
##$ABSF2= -5.573092
##$ABSG= 5
##$ABSL= 3
##$ALPHA= 0
##$AQORDER= 0
##$ASSFAC= 0
##$ASSFACI= 0
##$ASSFACX= 0
##$ASSWID= 0
##$AUNMP= <proc_prof1d_extract_pilot.lims>
##$AXLEFT= 0
##$AXNAME= <>
##$AXNUC= <1H>
##$AXRIGHT= 0
##$AXTYPE= 0
##$AXUNIT= <>
##$AZFE= 0.1
##$AZFW= 0.1
##$BCFW= 0
##$BC_mod= 0
##$BYTORDP= 0
##$COROFFS= 0
##$CY= 15
##$DATMOD= 1
##$DC= 0
##$DFILT= <>
##$DTYPP= 0
##$F1P= 0
##$F2P= 0
##$FCOR= 0.5
##$FTSIZE= 32768
##$FT_mod= 6
##$GAMMA= 0
##$GB= 0
##$INTBC= 1
##$INTSCL= 1
##$ISEN= 128
##$LB= 0
##$LEV0= 0
##$LPBIN= 0
##$MAXI= 10000
##$MC2= 0
##$MEAN= 0
##$ME_mod= 0
##$MI= 0
##$NCOEF= 0
##$NC_proc= -8
##$NLEV= 6
##$NOISF1= 0
##$NOISF2= 0
##$NSP= 0
##$NTH_PI= 0
##$NZP= 0
##$OFFSET= 14.98509
##$PC= 1
##$PHC0= 96.45447
##$PHC1= 0
##$PH_mod= 1
##$PKNL= yes
##$PPARMOD= 0
##$PPDIAG= 0
##$PPIPTYP= 0
##$PPMPNUM= 2147483647
##$PPRESOL= 1
##$PSCAL= 4
##$PSIGN= 0
##$PYNMP= <proc.py>
##$REVERSE= no
##$SF= 400.02
##$SI= 32768
##$SIGF1= 0
##$SIGF2= 0
##$SINO= 400
##$SIOLD= 32768
##$SPECTYP= <>
##$SREGLST= <1H.CDCl3>
##$SSB= 0
##$STSI= 32768
##$STSR= 0
##$SW_p= 8223.68421052631
##$SYMM= 0
##$S_DEV= 0
##$TDeff= 65536
##$TDoff= 0
##$TI= <>
##$TILT= no
##$TM1= 0
##$TM2= 0
##$TOPLEV= 0
##$USERP1= <user>
##$USERP2= <user>
##$USERP3= <user>
##$USERP4= <user>
##$USERP5= <user>
##$WDW= 1
##$XDIM= 32768
##$YMAX_p= 475854827
##$YMIN_p= -736085
##$CURPLOT= <Network HP LaserJet P1505>
##$CURPRIN= <$Network HP LaserJet P1505>
##$DFORMAT= <normdp>
##$LAYOUT= <+/1D_H.xwp>
##$LFORMAT= <normlp>
##$PFORMAT= <normpl>
##$SURQMSG= 1
$$ End of Bruker specific parameters
$$ ---------------------------------
##NTUPLES= NMR SPECTRUM
##VAR_NAME=  FREQUENCY,     SPECTRUM/REAL,   SPECTRUM/IMAG
##SYMBOL=    X,             R,               I
##VAR_TYPE=  INDEPENDENT,   DEPENDENT,       DEPENDENT
##VAR_FORM=  AFFN,          ASDF,            ASDF
##VAR_DIM=   32768,         32768,           32768
##UNITS=     HZ,            ARBITRARY UNITS, ARBITRARY UNITS
##FACTOR=    0.250966925370066, 1,           1
##FIRST=     8223.43324360094, -33303,       -77075
##LAST=      0,             -31233,          -59752
##MIN=       0,             -736085,         0
##MAX=       8223.43324360094, 475854827,    0
$$ Real data points
##PAGE= N=1
##DATA TABLE= (X++(R..R)), XYDATA
$$ [...]
19552c8299A15211f6667k41252b2402D3273d6425j79148c7508D2563b2826k14299
19541b37125C07737j42807b03042j47958h759B2222b29315L3398l9875k2315f7408
19529a41014r935A82925b70223n1118b2796G4842a47252K8147A12184b08907C1525
19517A18814a94771C1931a2326I186a50752f9166L625k00240a3157A72617l7499
19506A35118J71905h5572B7554L49381a64475A0569b7149j76900l4824F8397a74767
19494I3490e36643g453B49590a16118c4034B56902G1230C4646J74305d14735G2416
19482a19901j20163j44118b7596C4098b64176N0124e3154m02268a09472L3799
19472g5673c2615j45683d0685E8136a23185E4189B5402f5631o762j04297N4348
$$ y = [-38299, 115211, -66667, -307919, -22402, 43273, -46425, -225573, -37508, 42563, -22826, -237125, 307737, 164930, -203042, -351000, -8759, 22222, -229315, -195917, -235792, -258107, -67408, -141014, -150949, 182925, -270223, -321341, -22796, 74842, -147252, -119105, 112184, -208907, 31525, 118814, -194771, 31931, -12326, 9186, -150752, -69166, -65541, -265781, -13157, 172617, 135118, 307023, -85572, 27554, 376935, -164475, 10569, -27149, -204049, -238873, 68397, -174767, 93490, -536643, -7453, 249590, -116118, -34034, 256902, 71230, 34646, 208951, -414735, 72416, -119901, -240064, -384182, -27596, 34098, -264176, -214052, -53154, -455422, -109472, -75673, -32615, -178298, -40685, 58136, -123185, 54189, 25402, -65631, -72393, -176690, -122342]
19461a22342q5417H0652a1115A0936a12210B79604b2256k88506h0795j25850m0189
19450b46834j4155A4678b1338B45404j16040A0838a67616F0465g152I7601b04008
19438B24553b0962L831p2613k06021J31931C7776G586b59012j43999A61707a38724
19426a31217N8385p604b1964B72890b89408b4287o4827A61094P1351b70996f4123
19414B77547l5065a39716C6304K77736b37225B141b10441d447n1442G4835f3722
19402b48354K6911M978B31522A6210e1208l0797A26671a75138A06820A0990L1843
19391D2833a92243b7438A78755E2767a1484E5302a31534B62693I3486m3382A2085
19379a05363A10802b9575l95681f4343k23052a37482O2530M519I7166b28937p9920
$$ y = [-122342, -207759, 80652, -11115, 10936, -112210, 279604, -22256, -310762, -80795, -206645, -246834, -260989, 14678, -21338, 245404, 129364, 10838, -167616, 60465, -7152, 97601, -204008, 224553, -20962, -17131, -89744, -295765, -163834, 37776, 7586, -259012, -403011, 161707, -138724, -131217, -72832, -80436, -21964, 272890, -289408, -24287, -89114, 161094, 232445, -270996, -64123, 277547, 242482, -139716, 36304, 314040, -237225, 2141, -210441, -4447, -55889, 74835, -63722, -248354, -221443, -216465, 231522, 16210, -51208, -82005, 126671, -175138, 106820, 10990, 42833, -192243, -27438, 178755, 52767, -11484, 55302, -131534, 262693, 93486, 50104, 12085, -105363, 110802, -29575, -425256, -64343, -287395, -137482, -74952, -70433, 97166, -228937, -308857]
19368c08857a41776A4940K9810Q1647b4193k07609A06870D9024a28630M3375n8593
19357a43848O5938k11801C6454J4918a12604B70965K8671e1181j00033o0489A728
19345a08140K3604p7095B12833b26739G6698j5713a85800G9584l0365d12232J71322
19334b40910A15207c9690k83574J8368f9704L0780A66867a8529D570J6371g8964
19322A25343E3571a41377c2979j71101D5991d32909b08435l11198B06560b36175
19311d20687K04211j36117B51930a40715M634B5914J03718b00556I3686a85694
19300B35742n5841a01673A80925b27948f1366k81272a42149j74948J09652K3661
19290a83784E530b41639g9603j65151l83955I5053b650A71110a04279l3270a4723
$$ y = [-308857, -141776, 14940, 44750, 126397, -24193, -231802, 106870, 49024, -128630, -85255, -143848, -77910, -289711, 36454, 51372, -112604, 270965, 299636, -51181, -151214, -211703, 1728, -108140, -84536, -161631, 212833, -226739, 76698, 60985, -185800, 79584, 49219, -412232, -240910, 115207, -39690, -323264, -304896, -69704, -38924, 166867, -18529, 4570, 20941, -78964, 125343, 53571, -141377, -32979, -204080, 45991, -432909, -208435, -519633, 206560, -236175, -420687, -216476, -352593, 251930, -140715, -136081, 25914, 129632, -200556, 93686, -185694, 235742, 179901, -101673, 180925, -227948, -61366, -342638, -142149, -317097, -207445, -183784, 5530, -241639, -79603, -244754, -628709, 95053, -2650, 171110, -104279, -137549, -14723]
19278C9412K10432d28179O8858k28110J44551H170c69747c9945k14754A84782
19267a5855k38651E626h7892B79216a84468Q5597k29946M9801B39353E5614b64352
19255A30269c91047q1966h2552D6461j7157a88989k6770h3743l10427a34061j03750
19244b37811C7720A4965J05286O4712a74087B35495C2618a19981E7553e0076B27153
19232A40028l0203g5892l73484A12623b83281a15765n078A616K2664a2091C10712
19220B3557J68459h3563k94557e3252b267E1614a25429j29440Q1444A32088b37237
19208c8371q2177n6696l11552a06187p8410d5447j17716k08151J57403B04003
19197E4821a60069d0345j41431M5709L3195k7177N1512E0736a30040M0814E2528
$$ y = [39412, 249844, -428179, -359321, -587431, -442880, 8170, -369747, -39945, -254699, 184782, -15855, -254506, 5626, -87892, 279216, -184468, -98871, -328817, -279016, 239353, 55614, -264352, 130269, -391047, -473013, -82552, 46461, 29304, -188989, -215759, -83743, -394170, -134061, -237811, 37720, 14965, 120251, 184963, -174087, 235495, 32618, -119981, 57553, -50076, 227153, 140028, 109825, -75892, -449376, 112623, -283281, -115765, -120843, 1616, 24280, -12091, 310712, 23557, 192016, -83563, -378120, -53252, -2267, 51614, -125429, -254869, -173425, 132088, -237237, -38371, -120548, -177244, -488796, -106187, -184597, -45447, -163163, -371314, -213911, 204003, 54821, -160069, -40345, -181776, -136067, -102872, -130049, -78537, 50736, -130040, -89226, 52528]
19185E10401c2758F8866O1956a15624k80151a88461h3881A360L15933G9191a64165
19173a33936l912J946C52559a86891A9054g2199q8240k41913A93359a4334l78135
19162c92469J73618c9151j94873e7852A30457g964j53194L108d4445k02739E7978
19150A15361c90328g0566j4044A13676g411B00994a00318A93464l8628j9611K99900
19139D35125b45901g0537l29260J84400A5499O3185o029e6015K7070B16056j7969
19128A98087E6307J43837r8606b27546J0061R6760m82359a74973r9807q2508h1160
19116a94635f0505A28708a70213E7720a17948j7945J0977B99234h5923A99112
19105A30749J65723C4483a6175j58768j65974G9156g6377F8713K10086D2581a65087
$$ y = [510401, -32758, 68866, 130822, -115624, -395775, -188461, -83881, 1360, 317293, 79191, -164165, -133936, -137848, -135902, 352559, -186891, 19054, -72199, -160439, -402352, 193359, -14334, -392469, -218851, -39151, -234024, -57852, 130457, -7964, -161158, -158050, -44445, -247184, 57978, 115361, -390328, -70566, -84610, 113676, -7411, 200994, -100318, 193464, 154836, 135225, 435125, -245901, -70537, -399797, -215397, 15499, 78684, 72655, -56015, -28945, 216056, 198087, 56307, 200144, 101538, -227546, -217485, -120725, -603084, -174973, -274780, -357288, -81160, -194635, -60505, 128708, -170213, 57720, -117948, -135893, -124916, 299234, -85923, 199112, 130749, 296472, 34483, -16175, -174943, -340917, 79156, -76377, 68713, 278799, 42581, -165087]
19093B19080h0175j13888B72127b55966H8135a92696b6715C7747a64429P2989
19083i1440n2274B3354N2117l3233a61040r2355d4758r7318f6559j65738l7287
19072b69584a28000e9019C7023L2640d00683g8159j43244a3567j08787M7188F7135
19060A6231b17446i9809A24727n6595j3792a05361D0692a99420A20108i2285o6785
19049a59070k46996a79620D1710J42495D7898c90124B97415m9588d4719A75684
19038a87056e767G3681J90313A18510i3462k5137E4130f1501p6934C5843f4115
19026a12028j40492G9609g0323j12845n2414G1692d156A31998a73049e339C47035
19014d0889H966a57393k79262A72707q3787a78546A04441L8544E4078A3149h1172
$$ y = [219080, -80175, -194063, 272127, -255966, 88135, -192696, -26715, 37747, -164429, -91440, -143714, 23354, 75471, 42238, -161040, -253395, -44758, -142076, -66559, -232297, -269584, -128000, -59019, 37023, 69663, -400683, -78159, -221403, -13567, -122354, -75166, 67135, 16231, -217446, -99809, 124727, 68132, 54340, -105361, 40692, -199420, 120108, -92285, -159070, -406066, -179620, 41710, 184205, 47898, -390124, 297415, 247827, -44719, 175684, -187056, -5767, 73681, 263994, 118510, -93462, -118599, 54130, -61501, -138435, 35843, -64115, -112028, -252520, 79609, -70323, -183168, -235582, 71692, -4156, 131998, -173049, -5339, 347035, -40889, 8966, -157393, -436655, 172707, 88920, -178546, 104441, 142985, 54078, 13149, -81172]
19002B30348b00117j49337C1898c4840q2748F3497N3691A5277J1510a31849j43386
18991b75235G1010O9640I145b40032A9434h8830k03050A91990D2037O172b34716
18979a98927A27693J69627c09639h1549B0328I346e8862j1379B6489b46809N6569
18968a90240h9014M1302B74951A6071b44658e1620l18503A26005h5154j21469
18958b06623A29557c42227J66829A18324m631b03323A00758J14525a35255F1651
18947c67696A44483E1675a38165A2355d0318A61339c5987k52731A26635h1491
18936D2870h2231C0015K1553J2580C2018b2866E7941a00077A19789a32719I0006
18924c37948H0195c24045e6247C25452e6418k80399J05262B34958R1588a4055
$$ y = [230348, -200117, -349454, 31898, -34840, -117588, 63497, 117188, 15277, 26787, -131849, -275235, 71010, 140650, 9145, -240032, 19434, -88830, -291880, 191990, 42037, 48209, -234716, -198927, 127693, 297320, -309639, -81549, 20328, 9346, -58862, -70241, 26489, -246809, -190240, -89014, -47712, 274951, 16071, -244658, -51620, -370123, 126005, -85154, -206623, 129557, -342227, -175398, 118324, 113693, -203323, 100758, 215283, -135255, 61651, -367696, 144483, 51675, -138165, 12355, -40318, 161339, -35987, -288718, 126635, -81491, 42870, -82231, 30015, 51568, 64148, 32018, -22866, 57941, -100077, 119789, -132719, 90006, -337948, 80195, -324045, -56247, 325452, -56418, -336817, -231555, 234958, 326546, -14055]
18913e3730a1964j8415F6689J478a16618k28618C07856b00125e8994m34556a389
18901i7779E2062b36022L0334Q2358F4321J57756a59142B77125b27763B54417
18890a80487H486K40489D6305O4358c8426B12926p5142a15676B01633b65035j7483
18879b82518H0348c05503i036k38999K8193e1689F6651a16317M5015q3416J3783
18868a40935N8436F6211A1150J39424b31894K1640P2754k9845P2778a8356C87987
18856H2351c6539A04955d93991A49642b28509g154A9955b47825A04304P9211a86761
18844A84586a83112A41200L51980d0337a2831p5427A23750n9538e6332n6286d8724
18832b13593A03733Q7472A9300r71L7087a50603a0980m7115A09346L2067b05003
$$ y = [-53730, -11964, -30379, 66689, 68167, -116618, -345236, 307856, -200125, -58994, -493550, -1389, -97779, 52062, -236022, -205688, -123330, 64321, 222077, -159142, 277125, -227763, 254417, -180487, 8486, 248975, 46305, 110663, -38426, 212926, 137784, -115676, 201633, -265035, -282518, 80348, -305503, -9036, -248035, -219842, -51689, 66651, -116317, -71302, -154718, -140935, -82499, 66211, 11150, 150574, -231894, -210254, -137500, -167345, -94567, -18356, 387987, 82351, -36539, 104955, -493991, 149642, -228509, -7154, 19955, -247825, 104304, 183515, -186761, 184586, -183112, 141200, 493180, -40337, -12831, -88258, 123750, 64212, -56332, -112618, -48724, -213593, 103733, 191205, 19300, 18329, 55416, -150603, -10980, -58095, 109346, 141413, -205003]
18820I3595K28840q9749B4167a05441A18420h2235r4760N1546A41726b2615B18316
18808B87509N184a59839D38479k15383h9364A63853m6653N3723f4923E70b77271
18796i9990a7895k57220b3160o2840k11055A2N3244b09019A28987i0059K3153
18785f6906b4741j09427F520a69799A07479a80017c9521j74917a05590a2425B39733
18773e5996k97770H628J39235J24398b23126H4857h0764j75693a8667E0361a81333
18761A93582a19857B30350i7251J1930B0458f3813r6485p5931b1620m67626D71582
18749A34497g215p2246R765B00918G1021d4975k15246k616b5724r211A39071a51072
18736b5920l16982B56428H7570c57765J27255N5243b3465B98945c859A13923b61996
$$ y = [93595, 322435, 232686, 24167, -105441, 118420, -82235, -176995, -125449, 141726, -22615, 218316, 287509, 292693, -159839, 438479, 223096, -89364, 163853, 117200, 170923, -64923, 570, -277271, -99990, -17895, -275115, -23160, -86000, -297055, 12, 53256, -209019, 128987, -90059, -66906, -24741, -134168, 6520, -169799, 107479, -180017, -39521, -214438, -105590, -12425, 239733, -55996, -353766, 8628, 147863, 272261, -223126, 84857, -80764, -256457, -18667, 50361, -181333, 193582, -119857, 230350, -97251, -85321, 20458, -63813, -160298, -236229, -21620, -489246, 471582, 134497, -7215, -79461, -69696, 200918, 71021, -44975, -260221, -262837, -25724, -34935, 139071, -151072, -25920, -342902, 256428, 87570, -357765, -230510, -175267, -23465, 298945, -3859, 113923, -261996]
18724A98768d0222E8319b56403I5783j2434f1316j70194d3880j7344b2188k66351
18713b88539B20810D9083e595H6194b57928e4656H1451g3571b6120j17779e9622
18701A3031d3896B62880m856h2710B01558a08951A1684J19122a03602a6721j1054
18690b7775k24027d8786k38783a07196j41378G2853J26758a1940G8072l6708M0689
18679H2053a8189q767f407j2983n7340B79059c14767e7653G2697k2456K6531a15880
18666A95038a33100A76990r210C0024b54915M6284c3798k63922c1934A18768f020
18654d9299k63483B64121f247k57504J7097R3983J8020c680A1896e312l6425k07064
18642b48801a2844l8816j23914Q5015r8789b2966k82014a20625A61788a42664
$$ y = [198768, -40222, 58319, -256403, 95783, 83349, -61316, -231510, -43880, -61224, -22188, -288539, 220810, 49083, -5595, 86194, -257928, -54656, 81451, -73571, -26120, -143899, -59622, 13031, -43896, 262880, 258024, -82710, 201558, -108951, 11684, 130806, -103602, -16721, -27775, -251802, -48786, -287569, -107196, -248574, 72853, 199611, -11940, 78072, 41364, 82053, -18189, -26956, -6407, -19390, -76730, 279059, -314767, -57653, 72697, 50241, 76772, -115880, 195038, -133100, 176990, 167780, 30024, -254915, -208631, -33798, -297720, -31934, 118768, -6020, -49299, -312782, 264121, -6247, -263751, -246654, -152671, -134651, -3680, 11896, -5312, -41737, -248801, -12844, -51660, -175574, -90559, -189348, -22966, -304980, -120625, 161788, -142664]
18631d6133D899a25047B71375c4336j88177N0768B47030I2232d16826h17j41315
18620a42132j06372H3732f2034k21873B4065b4654A90572b39171H372K78533A27670
18608I5360b10978A87479o9663l5794M8792l1485g2960j35706j76951a76581J6819
18597a59762c1172A85119b17728r4662c8450J0069j16365A7724K6331j5713J6299
18586D4641b19121c9253o0185B30595A0057e25681f5353E405a90268c6715B16525
18574D4368i1941F4390B227J54321b6237j70496J0046P7909c9462k9623M833j06070
18562a70322e4489j19661f23A28826C0237P0828a25758C38178F5237M531a34713
18550F908i3274k53880A45769a69907d9121G3916l1755N5794l702c70519A1899
$$ y = [-46133, 4899, -125047, 271375, -34336, -222513, -171745, 247030, 92232, -416826, -817, -142132, -248504, 83732, -62034, -283907, 24065, -24654, 190572, -239171, 8372, 286905, 127670, 95360, -210978, 187479, 117816, 82022, 130814, 99329, -72960, -208666, -385617, -176581, -159762, -31172, 185119, -217728, -312390, -38450, -28381, -144746, 17724, 44055, 28342, 44641, -219121, -39253, -99438, 230595, 10057, -525681, -65353, 5405, -190268, -36715, 216525, 44368, -91941, 64390, 2227, 156548, -26237, -196733, -186687, -108778, -39462, -69085, -64252, -170322, -54489, -174150, -623, 128826, 30237, 101065, -125758, 338178, 65237, 69768, -134713, 6908, -93274, -347154, 145769, -169907, -49121, 73916, 42161, 97955, 94253, -370519, 11899]
18538f273m3368r1543A36891a82852N2941j30598m1011B0190J43514i2279D1213
18526a35029C11765C4377i9199a5193C5300a2255B91380b38402E5897k6635a97759
18514b98043H4392L4994b99091g3593L0728k4285B5822c8858A04237b30865A48333
18502A20923b64080j67736a3329A56552b28484Q1819d480j79302n9709A46289
18491a07537k7328A5795a26505k0486A80850f414c057B0674b2836A94150d4745
18479A70360c7510k7615j13766b7352j27275r560B91165i3284L3987B0039c00501
18467b32223B43947i6364p9834G5520J8004J74235j09916n9311d75398A27132
18456D2002a39492L2389j22664k37434H1504K09814I4288c58879f8964D4891A2952
$$ y = [-6273, -49641, -141184, 136891, -182852, -129911, -260509, -301520, 20190, 163704, -92279, 41213, -135029, 311765, 34377, -99199, -15193, 35300, -12255, 291380, -238402, 55897, 29262, -197759, -298043, 84392, 119386, -299091, -73593, -42865, -67150, 25822, -38858, 104237, -230865, 148333, 120923, -264080, -431816, -13329, 156552, -228484, -146665, -4480, -183782, -243491, 146289, -107537, -134865, 15795, -126505, -146991, 180850, -6414, -3057, 20674, -22836, 194150, -44745, 170360, -37510, -65125, -178891, -27352, -154627, -164187, 291165, -93284, -59297, 20039, -300501, -232223, 243947, -96364, -176198, 75520, 93524, 267759, 157843, 98532, -475398, 127132, 42002, -139492, -107103, -229767, -467201, 81504, 291318, 94288, -358879, -68964, 44891, 12952]
18444b8648k55727A77839n6037e8379o6498a0206E2622J10044M1623n0410a23278
18432h1582L1728m7341A04209A8191d41679a4601k82854a47900k61684e3359k25065
18421b78424i821B99363j19126b30001k38840J12705a07295F7159c95937Q2658
18411c13279a23881A53539o1848K63534d9840A84001k3313E3577J07008b2428
18400C35878A32649h4146n6151j14429n7263B70829b18092j37832p106G623d15491
18388A13503a43083j6323P4954G9794i182k2748G6852i2832L2428j20303o782
18377a87489A1628c1792p8473j23472D4171b29700N0023A50764i3165E3014i0586
18365a76487B2601c6921r4510j01526I9864l8339O3772R4067a80460r3360G0337
$$ y = [-28648, -284375, 177839, 121802, -58379, -124877, -10206, 52622, 162666, 204289, 153879, -123278, -81582, -49854, -97195, 104209, 18191, -441679, -14601, -297455, -147900, -409584, -53359, -278424, -9821, 299363, 180237, -230001, -468841, -356136, -107295, 67159, -395937, -313279, -123881, 153539, 91691, 355225, -49840, 184001, 160688, 53577, 160585, -22428, 335878, 132649, -84146, -140297, -254726, -311989, 270829, -218092, -355924, -363030, 7623, -415491, 113503, -143083, -159406, -84452, 79794, -9182, -31930, 76852, -92832, -60404, -180707, -187489, 11628, -31792, -110265, -233737, 44171, -229700, -179677, 150764, -93165, 53014, -90586, -176487, 22601, -36921, -131431, -232957, 99864, 61525, 125297, 219364, -180460, -273820, 70337]
18353b52922E0979P196N8837j1889L3403d336o2594l759l2747k5177M1503B10721
18340G999P4194K38418a09423j44245J08593M7857r3814C2278J14964n26e6080
18328A65922c40729I1589M2746e7635j34087L2296B30067a44487L9261d7991J2128
18317c5863j44330G1143j2797L6700a48613L7106H9653B333J85013o0951c02887
18305B12388D5324m823P1007Q7094D9580a6172k17363d3492k17593a1010j72563
18294a83573N8935j6654O3934F5074b37599f3845n4055A40736l5441b58728A1829
18282H8773O5893l9151b20638K6179G2662c6229o2477n2387J2777F2660b8440
18270a69640K8631j2882C05384O3324j79476A6407a63890C9851A1368N5716f6627
$$ y = [-252922, 50979, 58175, 117012, 105123, 138526, -4336, -66930, -70689, -103436, -128613, -87110, 210721, 7999, 82193, 320611, -109423, -253668, -145075, -97218, -191032, 32278, 147242, 146716, -56080, 165922, -340729, 91589, 134335, -57635, -191722, -159426, 230067, -144487, -105226, -47991, -35863, -180193, 71143, 58346, 95046, -148613, -111507, 89653, 2333, 187346, 126395, -302887, 212388, 45324, 40501, 111508, 198602, 49580, -16172, -233535, -43492, -261085, -11010, -183573, -124638, -141292, -77358, 65074, -237599, -63845, -117900, 140736, 105295, -258728, 11829, 88773, 154666, 115515, -220638, -194459, 72662, -36229, -98706, -151093, -138316, 62660, -28440, -169640, -141009, -153891, 305384, 368708, 189232, 16407, -163890, 39851, 11368, 67084, -66627]
18258B7288f5513B94482j41753R0995h9486D15116a85768A11663P5454A2001N2885
18247F4886f4482C8802a1991C28335R1256B8237K0176i929F5150b8902F0236k876
18235E7360J62050f6370A5772a02793C11356a50411P5094B02632D5616N2359Q4841
18224A82816a85353B07196b09367c7306j4793E7450a02148b261j31966j32353
18214b66580I359a78879b2554C1901c5030m9265A59159h5703l4801m4605G474
18202A68266a42261p403A19276c74648a57150e166A19561J5358c6089A97462a40417
18190a81290c9262l1191o9839G1963A5618e2577p4331M5906F1780e3594p4475
18179a28069A23434a01360m8645q8987A2828a06213A08486L9303b75130A41152
$$ y = [27288, -65513, 294482, 152729, 243724, -89486, 415116, -185768, 111663, 187117, 12001, 64886, -64482, 38802, -11991, 328335, 419591, 28237, 48413, -9929, 65150, -28902, 60236, 57360, 219410, -66370, 15772, -102793, 311356, -150411, -75317, 202632, 45616, 97975, 182816, -185353, 207196, -209367, -37306, -52099, 57450, -102148, -2261, -134227, -266580, 9359, -178879, -22554, 31901, -35030, -84295, 159159, -85703, -120504, -165109, 7474, 168266, -142261, -149664, 119276, -374648, -157150, -5166, 119561, 134919, -36089, 197462, -140417, -181290, -39262, -70453, -140292, 71963, 15618, -52577, -126908, -81002, 61780, -53594, -128069, 123434, -101360, -150005, -238992, 12828, -106213, 108486, 147789, -275130, 141152]
18168B75990j06871A5981a08504k11057R4821H8954i9564D2532a75780j0023l03959
18157d89762E0562a52201B69665d443m773B5518a6109j01433O558c9615m6561
18146h6176J1800M997j10265B13949b62279A96875L10752d2410j44629g5978j90421
18135b66399G4876J54042a08739j7159M525H6372c1631B1298d4302j78438G9480
18123F5298b79826b6876j58009o1367H658a80981j02820f1373j20408C20713A42382
18111b59138K2091f3070A51951I708g6859A51467a37333j90264R3393d7920F1002
18099A1715K8151A628J97161b18134j04394B41878I6588a08030L5274E6592k8060
18088B8532c94211A44679N668a67348O6015A31773M2890e3109N554j65725A19937
$$ y = [275990, 169119, 15981, -108504, -319561, -224740, 88954, -99564, 42532, -175780, -185803, -489762, 50562, -152201, 269665, -4443, -9216, 25518, -16109, -117542, -110984, -39615, -86176, -74376, -69379, -179644, 213949, -262279, 196875, 507627, -42410, -187039, -75978, -266399, 74876, 228918, -108739, -125898, -121373, 86372, -31631, 21298, -44302, -222740, 79480, 65298, -279826, -26876, -184885, -246252, 8658, -180981, -283801, -61373, -181781, 320713, 142382, -259138, -237047, -63070, 151951, 9708, -76859, 151467, -137333, -327597, -234204, -47920, 61002, 11715, 39866, 1628, 198789, -218134, -322528, 241878, 96588, -108030, -72756, 56592, 28532, -394211, 144679, 150347, -167348, -101333, 131773, 174663, -53109, -47555, -213280, 119937]
18076a54992B0257d7638I7233b73332N5028q1987d1200D63164A11469a40410L6398
18065a04012B50941b50062J24251l01736A55570a34041A77465J1887n2884i8316
18054e7024f493A89335G5428K64922j56499a08707J3875l6091A68305G3711b15442
18042i6259a3368P94p0550C15891a17263j49174E7853k2070Q4542c1256k0257
18031e1513E020a7826n2431r9540A8473c9235l9029B26359I5356a16881A44096
18019E0555E686a54711n5267h3970E7776g1057o4151K5680A31971a31632B05827
18007a8150A22759J67243c99697B16673o6607e5524A87923a81318A68037n3380
17997A14657C3494e01813C15463a05765q7484I3983a37756A24072E0287J40007
$$ y = [-154992, 20257, -47638, 97233, -273332, -218304, -300291, -41200, 463164, 111469, -140410, -104012, 250941, -250062, -125811, -427547, 155570, -134041, 177465, 189352, 136468, -98316, -57024, -6493, 189335, 75428, 340350, 183851, -108707, -94832, -130923, 168305, 73711, -215442, -96259, -13368, -12574, -83124, 315891, -117263, -266437, 57853, 35783, 120325, -31256, -51513, 5020, -17826, -70257, -169797, 18473, -39235, -78264, 226359, 95356, -116881, 144096, 50555, 5686, -154711, -209978, -83970, 57776, -71057, -135208, -109528, 131971, -131632, 205827, -18150, 122759, 290002, -399697, 216673, 150066, -55524, 187923, -181318, 168037, 114657, 33494, -501813, 315463, -105765, -193249, 93983, -137756, 124072, 50287, 190294]
17987A90294C1677L7802J28687d6903A92924a90269A0162b47908A13269i2212
17976A0029e8266b3626A83178o3947b71321e5378k9059j35495J09609o9053O1432
17965a17944a1419q117k47100h7818C1420J26447g1603q0967E6475j5105K28864
17954B70234E9110N2101n5058c18073H6137b72143H9395b5631n2644j4925A97132
17942b40929n7886a19082G1913a30082c2901C2221M4764L9708g4125B22037K27012
17931D49049a5876A6029M861M559J22371p1568g0454A03432J24629b95101M3598
17920b51503m0479c8451j78665O1563k0829j71528J60268m5466h2978j24102E3898
17908a83726C12678A45146k2589a17740B84900b2577B2559f9942A71024a40397
$$ y = [190294, 31677, 69479, 198166, -46903, 192924, -190269, 10162, -247908, 113269, -92212, 10029, -58266, -23626, 183178, 119231, -271321, -55378, -84437, -219932, -110323, -179376, -117944, -11419, -19536, -266636, -87818, 31420, 157867, -71603, -152570, 56475, 41370, 270234, 59110, 111211, 56153, -318073, 86137, -272143, 89395, -25631, -78275, -93200, 197132, -240929, -298815, -119082, 71913, -130082, -32901, 32221, 76985, 116693, -74125, 222037, 449049, -15876, 16029, 20890, 25449, 147820, 76252, -70454, 103432, 228061, -295101, -251503, -291982, -38451, -217116, -155553, -176382, -347910, -187642, -233108, -82978, -207080, 53898, -183726, 312678, 145146, 122557, -117740, 284900, -22577, 22559, -69942, 171024, -140397]
17897c69456a69281c4810k11464c6290j17673j6923A47600G2171a23813j60850
17887b84663e0159J5366n8138K0722k10940K1842f7991m6730j80176i8363L0442
17876f7921C5205b92285a2383D67516a82842j48349H8199O3460L37760d33915
17865a78677F7735a20074B43243E7214b26206g6542D0881a05399B72029m8410
17855B23619a23954B8810d37902K06544Q0816G6671O6622a20234a3169k42731
17845b55900C76818j46876b22445C36597c20993A42162N9747g6880B53713b2741
17834a38074B85205b68545j56699h1856j71700K3281G3506J8310K9919h3242A5005
17822A00917J5300i7480A49350K70410f2523p9827D63084k10996H9215b28903
$$ y = [-369456, -169281, -34810, -246274, -36290, -153963, -170886, 147600, 72171, -123813, -284663, -50159, -34793, -92931, -72209, -283149, -261307, -67991, -114721, -294897, -98363, -67921, 35205, -292285, -12383, 467516, -182842, -331191, 88199, 151659, 489419, -433915, -178677, 67735, -120074, 243243, 57214, -226206, -76542, 40881, -105399, 272029, 223619, -123954, 28810, -437902, -231358, -150542, 76671, 143293, -120234, -13169, -255900, 376818, 229942, -222445, 336597, -320993, 142162, 201909, -76880, 253713, -22741, -138074, 285205, -268545, -425244, -81856, -253556, -230275, 73506, 91816, 121735, -83242, 15005, 100917, 116217, -97480, 149350, 419760, -62523, -142350, 463084, 252088, 89215, -228903]
17811D1690L6927b08472F3843b2634B69161a99726D2329c1088C1937b35533N9504
17800a76029A2280a78702h0312a1997p8746m6504G9797J4568a6575A09418j1752
17789I7666a12627a6855H6444p286J30265H2501b4313A92378b11160g0127K6851
17778d3276j04446G0280h819C8815e6674A08460f7861E5891c06301A46789a46020
17766g8151A52776l5238K58220A06252D040J92105b19612C53165G4744g3455H2422
17754A96129a93665F5540h9638B42119a56648A82347p0633a04595b982j15850
17744a18832l2263I4666a4675I79Q1245c50239C9089c10928M5043A1472b78192
17732C48081b91748D2133a57469I5259d04042A40282a4476A00397a17876m28881
$$ y = [41690, 78617, -208472, 63843, -22634, 269161, -199726, 42329, -31088, 31937, -235533, -176029, 12280, -178702, -80312, -11997, -90743, -137247, 79797, 94365, -16575, 109418, 97666, -112627, -16855, 86444, 79158, 209423, 82501, -24313, 192378, -211160, -70127, -43276, -147722, 70280, -8819, 38815, -56674, 108460, -67861, 55891, -306301, 146789, -146020, -78151, 152776, 117538, 375758, 106252, 4040, 196145, -219612, 353165, 74744, -73455, 82422, 196129, -193665, 65540, -89638, 242119, -156648, 182347, 111714, -104595, -2982, -118832, -151095, 94666, -14675, 979, 82224, -350239, 39089, -310928, -265885, 11472, -278192, 348081, -291748, 42133, -157469, 95259, -404042, 140282, -14476, 100397, -117876, -546757]
17722e46757a11186e0299k66366D0472M4364B637a70836M4344E4413a03084A36432
17710h4989B01942e5877l16867b0970E3952J6734K12706C4151f4974E0918M1886
17699I2804A4761e0355n8713a2099k6224n3107A26499B164a7332A98128a90051
17687g0194p4437B91364l2256a68461F6741f5946A14124J37614p7469n1525c6191
17675G9941P2385A1215b93395A16189d4852B0811b08534e4959r6658B03725a93893
17663b25354a00273I7343h4699j10440A57853b83619B66752D5297O987c02323
17652B05031A6332f1946A49434n8307a91085N3125D71278c8690B96716c9773l4317
17641g4090o5875A43057c60603J66813c7536j03507k0358c4592B06914c262j1362
$$ y = [-546757, -111186, -50299, -316665, 40472, 84836, 2637, -170836, -126492, 54413, -103084, 136432, -84989, 201942, -55877, -372744, -20970, 53952, 70686, 283392, 34151, -64974, 50918, 92804, 14761, -50355, -109068, -12099, -38323, -91430, 126499, 2164, -17332, 198128, -190051, -70194, -144631, 291364, 259108, -168461, 66741, -65946, 114124, 251738, 174269, 122744, -36191, 79941, 152326, 11215, -293395, 116189, -44852, 20811, -208534, -54959, -151617, 203725, -193893, -225354, -100273, 97343, -84699, -195139, 157853, -283619, 266752, 45297, 52284, -302323, 205031, 16332, -61946, 149434, 91127, -191085, -137960, 471278, -38690, 296716, -39773, -74090, -139965, 143057, -360603, -193790, -37536, -141043, -161401, -34592, 206914, -3262, -14624]
17630a4624j74034k05801A89363m9124e1880A50630J76574c4994k24343F7b57000
17618A35263A4314d3676j4150A18711b09806A02793C7348K46133d9105G2921K58550
17607C31471a0381n1246n2732B5075L0014a11430j31004a3742N354E1505a9780
17595A29373i0109C15238j48455j6338b6711B10328a05604B69146a18021j42978
17585b60999P7099q2340E22155A94602B7697c2417B19875q1643k8136d0202F8938
17573c59695B0695K87632b13921O8646A96627c43341H0873c65018F1618b02800
17562d7404C68921A30540b72137i5479m8262A62831C002g5194B37842p8291m3900
17551A15651c0282E2223J94283o7687a89875D5630d72D02141i8091A87523D5889
$$ y = [-14624, -188658, -394459, 189363, 140239, -51880, 150630, 327204, -34994, -259337, 67, -257000, 135263, 14314, -43676, -57826, 118711, -209806, 102793, 37348, 283481, -49105, 72921, 331471, -10381, -61627, -114359, 25075, 55089, -111430, -242434, -13742, -8388, 51505, -19780, 129373, -90109, 315238, 166783, 150445, -26711, 210328, -105604, 269146, -118021, -260999, -183900, -266240, 522155, 194602, 27697, -32417, 219875, 138232, 110096, -40202, 68938, -359695, 20695, 308327, -213921, -145275, 196627, -343341, 80873, -365018, 61618, -202800, -47404, 368921, 130540, -272137, -95479, -143741, 162831, 3002, -75194, 237842, 159551, 115651, -30282, 52223, 246506, 178819, -189875, 45630, -472, 402141, -98091, 187523, 45889]
17539a05101C26590a55002K3248C8788K72913n4707A12131O1089k1896a55550
17528c2187B346J41032b70564b3585k0651C25658H6404a06084a4949C5310d7041
17516F9074b97344B0273O1938K17498I5141J14377D8382a37278B13134K54730
17506D67864h269A98473H6128K146J25160l0006J09506k8550a24950B42032C9300
17494A86327b3647l14917A29563j9434D0036i7475C1052J33635K6351F6298L5384
17483A01682L4365k9183j1336J23266C6380R2815C0965I642J20003b66648E0743
17471D66229j87700m0095Q9455A4950J10344r005r921J26495i3209E7368a01066
17459B69362J03916A85634J11265I4959B5127J029i3423F4601J89301J60205l8483
$$ y = [-105101, 326590, -155002, -131754, 38788, 311701, 256994, 112131, 173220, 151324, -155550, -32187, 2346, 143378, -270564, -23585, -44236, 325658, 86404, -106084, -14949, 35310, -47041, 69074, -297344, 20273, 82211, 299709, 95141, 209518, 48382, -137278, 213134, 467864, -8269, 198473, 86128, 88274, 213434, 183428, 292934, 264384, -124950, 242032, 39300, 186327, -23647, -338564, 129563, 110129, 40036, -97475, 31052, 164687, 191038, 66298, 101682, 136047, 106864, 95528, 218794, 36380, 129195, 30965, 9642, 129645, -266648, 50743, 466229, 278529, 238434, 327889, 14950, 125294, 116289, 106368, 232863, -93209, 57368, -101066, 269362, 373278, 185634, 296899, 94959, 25127, 26156, -93423, 64601, 253902, 414107, 375624]
17448C75624k2923O9441j84734K51019B6050M27190J25654A10096Q8346J64107
17438C62549I0548J56419L51211A10519E0149K05781Q1385r4906n4918l2206N5507
17427B10792J98851J43323B30067k2004L43843d0536m159D11833m2052A2026J62597
17416A74623L02188k3881A98086E0285M98921A624K07249J62450a84952B15259
17405g0185B47142d4963A56894K61892A1665K95012F2767L97437k29717F8942
17394A98498c3734C10006a66599E58446A6138h0598D42652r3741A41902J93931
17384C35833a20545b911C44050C2174a54827j62704D9893K49460C992a2825D740
17372f3932A72535J54632m5710K02397F644e1432G5834P4262K6310O0322k6967
$$ y = [375624, 352701, 422142, 237408, 488427, 26050, 453240, 578894, 110096, 198442, 362549, 90548, 246967, 598178, 110519, 50149, 255930, 337315, 242409, 187491, 155285, 210792, 409643, 552966, 230067, 208063, 551906, -40536, -44695, 411833, 369781, 12026, 174623, 476811, 452930, 198086, 50285, 549206, 1624, 208873, 371323, -184952, 215259, -70185, 247142, -44963, 156894, 418786, 11665, 306677, 62767, 460204, 230487, 68942, 198498, -33734, 310006, -166599, 558446, 16138, -80598, 442652, 348911, 141902, 335833, -120545, -2911, 344050, 32174, -154827, -317531, 49893, 299353, 3992, -12825, 4740, -63932, 172535, 327167, 281457, 483854, 6644, -51432, 75834, 150096, 176406, 236728, 209761]
17361B09761a7852q5088C1994K47992a35131I7521O5381k8464J29474f8714j03558
17350a72272A49091L1521a59095B4386M71778k32076b60604C14464a210C86859
17339D47026B04620Q6809j39005N9944a723F7761k0835K5268L43175A66184b5811
17327A70724j4298e2900C99063O6917A77882k6286h8249b7647D8709K73965j13490
17316B09184k6518A8118a30202C46661j52370f4508p8165C77159A50334D5131
17305D68477A92234J04918a15428A86124h5327D24338j72792J07392A07844J4602
17295A22446b5807A42071a47414L3234A22777n1700B5559P6704a21986B51857
17284C2950J12308C0378J63892a9270o0105A34148D0268b4456B28267P5005A25980
$$ y = [209761, -17852, -102940, 31994, 279986, -135131, 97521, 162902, 134438, 263912, -68714, -172272, 149091, 180612, -159095, 24386, 496164, 264088, -260604, 314464, -1210, 386859, 447026, 204620, 291429, 152424, 212368, -1723, 67761, 46926, 72194, 415369, 166184, -25811, 170724, 156426, -52900, 399063, 465980, 177882, 151596, -88249, -27647, 48709, 322674, 209184, 182666, 18118, -130202, 346661, 194291, -64508, -142673, 377159, 150334, 45131, 468477, 192234, 297152, -115428, 186124, -85327, 424338, 251546, 358938, 107844, 122446, -25807, 142071, -147414, -114180, 122777, 71077, 25559, 102263, -121986, 251857, 32950, 145258, 30378, 194270, -19270, -79375, 134148, 40268, -24456, 228267, 303272, 125980]
17272B26546d8906k6658E3012J51882i9464B52415f0964B40790A12043a4797j30734
17261a45531A18257K18192a0389A70935k4916A927a9949C4760d4025B57801a68539
17249C17872p944q4380n6154C9221L55553A69509m5523L5835R9277N1667o0425
17238B50340i2559q4355A84442E7821L53342J8789J9629j78122L9378J8077r7590
17227B31324n3245K90417j87741R9770A47511K94090o3243c4707e813F3952J33676
17216A97628J14711J74018f5262F2257b14066C71267j00429N3857J85079j84630
17206C25144K7081P6961n0083c5829q3345B69238I6892l8277J49168M6178j24115
17195A29846K08834M8007F255K5764j4478K13728k5621k623O9838I916M57199
$$ y = [226546, -48906, -75564, 53012, 204894, -99464, 252415, -60964, 240790, 112043, -14797, -145531, 118257, 336449, -10389, 170935, 146019, 1927, -19949, 34760, -44025, 257801, -168539, 317872, 309928, 225548, 169394, 39221, 394774, 169509, 123986, 159821, 259098, 310765, 250340, -92559, -176914, 184442, 57821, 411163, 429952, 449581, 271459, 310837, 328914, 231324, 178079, 468496, 280755, 380525, 147511, 441601, 378358, -34707, -5813, 63952, 197628, 312339, 486357, -65262, 62257, -214066, 371267, 270838, 324695, 509774, 325144, 352225, 429186, 379103, -35829, -119174, 269238, 96892, 58615, 207783, 253961, 129846, 338680, 386687, 6255, 32019, 17541, 231269, 205648, 203025, 272863, 9916, 467115]
17184D67115j08801j35846J64835b1186C20002J52641j70609p2910L6943J44994
17174D11061A67519e0919C22158K19012A43282J26316c7520C96335R7982A86170
17163A48625J71185J22684A51861J12959r272r4174L67759k54573R3674E4175
17152D14407A97076J73547j74807f6444C07043j41680q2166L41405j07824K0123
17142C36901A18304J77105k8950j1920A00785K99222n6326K03425A0385K97559
17132C07944m8799O0461J41140J4041A43886M45695j43182R0715o7117B20222
17121D32442l1742P3410A46997J71974k7759p9452O6707K27391I3472K67668K14649
17110E75789j07434R0666A46287K76932O5572j78825J42776j94164K06029D3694
$$ y = [467115, 358314, 222468, 387303, -21186, 320002, 472643, 302034, 229124, 266067, 411061, 167519, -50919, 322158, 541170, 143282, 269598, -37520, 396335, 494317, 186170, 148625, 319810, 442494, 151861, 264820, 255548, 161374, 529133, 274560, 368234, 54175, 414407, 197076, 370623, 195816, -66444, 307043, 165363, 83197, 424602, 316778, 336901, 118304, 295409, 266459, 254539, 100785, 400007, 343681, 547106, 10385, 307944, 259145, 319606, 460746, 474787, 143886, 589581, 446399, 537114, 469997, 220222, 432442, 400700, 474110, 146997, 318971, 291212, 211760, 278467, 505858, 93472, 361140, 575789, 468355, 559021, 146287, 423219, 488791, 309966, 452742, 258578, 464607, 43694]
17099E46922A70812J70866P2515j88491J77239L71558B65441o0410K3778J93504
17089D22313H7040L93895Q5498J59278B50132L523M95560l09533J011N13132C54153
17077B52949R6203L78456k19969j31846L47530B35899m473K87195B53678R6280
17067C49958J16423n0991M9902J35892j87313J22569o4935j00204M58171B47237
17056E03034m7558A23246O39787l14825j48796P14814m74511q4170k4190L1808
17046D63163J24418k48347K57278o5339J32588K3959l31731L15852l02254K01583
17036E71170j25419K163K97832B9197O81588J82653C52240J37721N3811R589J10861
17025F64222q6322k02406K15756J02948l11715J09286J159N65019D56001K23710
$$ y = [546922, 170812, 341678, 414193, 225702, 402941, 774499, 265441, 205031, 228809, 422313, 87040, 480935, 566433, 725711, 250132, 253655, 749215, 439682, 440693, 953825, 354153, 252949, 349152, 727608, 507639, 375793, 723323, 235899, 231426, 518621, 253678, 349958, 466381, 415390, 465292, 601184, 413871, 536440, 471505, 371301, 829472, 247237, 503034, 455476, 123246, 763033, 448208, 299412, 1014226, 539715, 455545, 431355, 463163, 587581, 339234, 596512, 531173, 663761, 687720, 355989, 671841, 369587, 571170, 445751, 447914, 745746, 29197, 710785, 893438, 352240, 489961, 543772, 553361, 664222, 577900, 375494, 591250, 694198, 382483, 491769, 492928, 1057947, 456001, 679711]
17015F79711Q509J6948j37577m4475P7133m477j45572P18987E43397J77274j29976
17004E90695j10213O6432J73849j47012J09655j65446K01760k64392K5752J26523
16994F07603R4598K10261k93388L43008j65295K00025j77562J12737k38217j31243
16984E62527L42903l70948L53480n086j22405K52137j79912J78138n7524N2982
16974A006292o959k72883L00088R546m15182J61869Q7281j72310K50376r5514
16964H52604K13787J69679k44162K26475l40122K63108j52641N7292k88766R6805
16954H54059N9550J28459Q6009j4352k69072K71501m29092L5668L09134m8241
16944I83623J00124k14236N75745k92295M18119m35804p1331J86459J23139m3154
$$ y = [679711, 688220, 705168, 567591, 523116, 600249, 595772, 450200, 1169187, 543397, 720671, 590695, 480482, 546914, 720763, 573751, 683406, 517960, 719720, 455328, 481080, 607603, 702201, 912462, 619074, 962082, 796787, 996812, 819250, 931987, 693770, 562527, 905430, 534482, 887962, 882876, 760471, 1012608, 832696, 1010834, 953310, 1006292, 999333, 726450, 1026538, 1036084, 620902, 782771, 870052, 697742, 948118, 852604, 1066391, 1236070, 991908, 1218383, 878261, 1141369, 988728, 1046020, 757254, 854059, 913609, 1042068, 1128077, 1113725, 844653, 1116154, 687062, 722730, 1031864, 983623, 1083747, 869511, 1445256, 1152961, 1571080, 1135276, 1063945, 1250404, 1373543, 1330389]
16934A330389n9371j67342l9806q4875K95225k06063J93323J44512j93224k8665
16924A184103q7672K3611J33809n0478N36892n50754N1718M19645l21450J28736
16914A468160J7448K04805k66395N8341m3755j97970M32098k97343p5478J31993
16904A431904K75351k76557J41049Q1634j13892m1539N57839k73248k57731L02360
16894A827170k32995J59357J44293R0341K45252k48714j26203j3087L6203O15928
16884B497545p58468J17802O6452M762J06041l31438K81663J42775J26444L6096
16874B289674J64246j27773P3571K56417l15250o3898M95868k51977p134J70123
16864B683867n0917J19056N9237k12127L40740m13837M52162j72762o7025J17329
$$ y = [1330389, 1271018, 1103676, 1063870, 978995, 1274220, 1068157, 1261480, 1405992, 1212768, 1184103, 1096431, 1120042, 1253851, 1203373, 1740265, 1189511, 1241229, 1660874, 1339424, 1468160, 1485608, 1690413, 1424018, 1482359, 1438604, 1240634, 1672732, 1375389, 1299911, 1431904, 1707255, 1430698, 1571747, 1653381, 1539489, 1497950, 2055789, 1782541, 1524810, 1827170, 1594175, 1753532, 1897825, 1988166, 2233418, 1984704, 1858501, 1845414, 1881617, 2497545, 1739077, 1856879, 1923331, 1928093, 2034134, 1702696, 1984359, 2127134, 2253578, 2289674, 2453920, 2326147, 2399718, 2656135, 2340885, 2276987, 2772855, 2520878, 2513744, 2683867, 2632950, 2752006, 2811243, 2599116, 2939856, 2526019, 2978181, 2805419, 2738394, 2855723]
16854B855723J10067J08091N0432o5892L14686n231j9205J39715p9112K81354
16844C690628l39870J84127J66151p3202Q3546j76689N66219k17905O6483L34834
16834D284322n4025j42024K66530O0513J78784n5615Q058r3843L75835K2699L23739
16823E174973k59513K18831O982K73914K27787j82622L30000n1919L51032Q3879
16813F173344K65975j92924J62553K51807J9494j88098M21282L24322k70716N16512
16803G483551k15784Q44745j74183L94878K2004P5880J62635N18677q1925M91607
16793I522085J132J95523M92651K82408J72162M41830L76311o9591N25824N2522
16783A1992857P87221K52344K24065Q46633L87459L37355N01361L10654Q17102
$$ y = [2855723, 2965790, 3073881, 3124313, 3058421, 3373107, 3367876, 3348671, 3488386, 3409274, 3690628, 3350758, 3534885, 3701036, 3627834, 3711380, 3534691, 4100910, 3883005, 3949488, 4284322, 4230297, 4088273, 4354803, 4415316, 4594100, 4538485, 4546543, 4452700, 4828535, 4851234, 5174973, 4915460, 5134291, 5141273, 5415187, 5642974, 5460352, 5790352, 5738433, 6089465, 6173344, 6439319, 6246395, 6408948, 6660755, 6680249, 6492151, 6913433, 7237755, 6967039, 7483551, 7267767, 8112512, 7938329, 8333207, 8355211, 8431091, 8593726, 9112403, 9030478, 9522085, 9523217, 9718740, 10211391, 10493799, 10665961, 11107791, 11484102, 11414511, 11940335, 11992857, 12780078, 13032422, 13256487, 14103120, 14490579, 14827934, 15329295, 15639949, 16457051]
16774A6457051N39839M29694Q29194J29749O81952R83109O03334Q05788O20030
16765B2079740Q33267R24203Q27146J216559Q74121J071993J088856J634733J146314
16756C1696932J160504J726954J781375J470223J907148K049444J893133K148950
16748D5834663K365836K415387K613136K985646L351690L267074L393254L769960
16740F9996646M069584M297196N115190M854066N168253N761654N757506O890396
16732A11910491O183755P640736P506808P929420Q030708P908401Q332354P611678
16724A73054351Q056726O990277O441782N293578M610654L237422J447011K25168
16716B09356969j645808l062781m151181n427005o290355p612146p859961p988494
$$ y = [16457051, 16996890, 17426584, 18255778, 18385527, 19067479, 20050588, 20653922, 21459710, 22079740, 22913007, 23837210, 24664356, 25880915, 26755036, 27827029, 28915885, 30550618, 31696932, 32857436, 34584390, 36365765, 37835988, 39743136, 41792580, 43685713, 45834663, 48200499, 50615886, 53229022, 56214668, 59566358, 62833432, 66226686, 69996646, 74066230, 78363426, 83478616, 88332682, 93500935, 99262589, 105020095, 111910491, 118094246, 125734982, 133241790, 141171210, 149201918, 157110319, 165442673, 173054351, 181111077, 188101354, 194543136, 199836714, 204447368, 207684790, 209131801, 209356969, 207711161, 204648380, 200497199, 195070194, 188779839, 181167693, 173307732, 165319238]
16708A65319238q893382q401055q163608q044987q176335o834244p617139o853473
16700A02335015o072759n906724n797817m635745m739888m515669m300286l380281
16692F2985846l603093l418972l046269k951174k283387k802622j722535k448771
16684D0709023k128987j397781k269069j438917j588452j236107j388516j155000
16676B8106194j573674j078894p66780r72112j163137q79842n97553j374164k64252
16667A9435786m75767n36151j019779n23331o67034o00432k80871o63360k12179
16658A4456882p06223k83666k40234j67257n00798j133482k59294k19632j45943
16649A0800353k77086j65105p37124K38176q39288q8704k141m39495P0689o60746
$$ y = [165319238, 156425856, 148024801, 139861193, 131816206, 123639871, 116805627, 109188488, 102335015, 96262256, 90355532, 84557715, 79921970, 75182082, 70666413, 66366127, 62985846, 59382753, 55963781, 52917512, 49966338, 47682951, 44880329, 43157794, 40709023, 38580036, 37182255, 34913186, 33474269, 31885817, 30649710, 29261194, 28106194, 26532520, 25453626, 24686846, 23714734, 22551597, 21671755, 21074202, 19700038, 19435786, 18960019, 18423868, 17404089, 16880758, 16213724, 15613292, 15332421, 14669061, 14456882, 13750659, 13466993, 13226759, 13059502, 12558704, 11425222, 11165928, 10946296, 10800353, 10523267, 10358162, 9621038, 9859214, 9019926, 8931222, 8929081, 8489586, 8560275, 7899529]
16639G899529M19637n35469J7916n49532J19909l74341l63423N597L2752l56458
16629F316117o5692n54569L40990m11915R7561j83734J06687k68862m48850O6533
16619D994266P5558j71236J44889l88655J66692l69057m22230L72258J54924k69317
16609D288092k02693j89372K16307k00667k77582J70780j19683j08619k40202
16600C336361j81461L43060k59877M6150n7343j99880J04438j36804j72765J21249
16590B943128k54420Q3939J23267M5117m70352L74436k79029K1676j06155L45265
16580B826872m38441L857K61763k22505L0127j05045p0652k97743J35252j92602
16570A930883J36585L18249l38088k54114J46912J2662K11892J38617k00425l48366
$$ y = [7899529, 8319166, 7783697, 7801613, 7252081, 7371990, 6997649, 6634226, 6639823, 6672575, 6316117, 6250425, 5695856, 6036846, 5624931, 5722492, 5538758, 5645445, 5376583, 4927733, 4994266, 5069824, 4898588, 5043477, 4654822, 4821514, 4452457, 4030227, 4402485, 4557409, 4288092, 4085399, 3896027, 4112334, 3911667, 3634085, 3804865, 3685182, 3576563, 3336361, 3154900, 3497960, 3238083, 3284233, 3226890, 3027010, 3131448, 2994644, 2821879, 2943128, 2688708, 2772647, 2895914, 2941031, 2470679, 2845115, 2566086, 2587762, 2481607, 2826872, 2388431, 2392288, 2654051, 2431546, 2461673, 2356628, 2285976, 1988233, 2123485, 1930883, 2067468, 2385717, 2047629, 1793515, 1940427, 1953089, 2164981, 2303598, 2103173, 1754807]
16560A754807P7103J53408j14788L18626l21834j68471K14308j89965j0007Q9920
16550A803107J17792r7855m6103k15793j09851K04226j15088P1281r1334m40537
16540A079845K21887Q6137j40995K379K37980J17998o4596k01022p5600r5003
16530A169010J56255j32323K25018m8534j42969n8431P3731p4675K00802j80073
16520A187811k23777K29301j35294q818O20639k64711L6131l31515m03141L84960
16510A091586m62858N11118J19571l22982j60212J27136J19425r7889K26343j15820
16500A035418m53754J13005J98647k22395r3874N47952E54828N28443k85319M220
16490H02172M2696J00050k69252M45759m93219L01895j46075L5519k24891N5680
$$ y = [1754807, 1831910, 1985318, 1870530, 2189156, 1867322, 1698851, 1913159, 1723194, 1713187, 1803107, 1920899, 1823044, 1776941, 1561148, 1451297, 1655523, 1540435, 1611716, 1520382, 1079845, 1301732, 1387869, 1246874, 1249253, 1487233, 1605231, 1540635, 1339613, 1264013, 1169010, 1325265, 1192942, 1417960, 1369426, 1226457, 1168026, 1241757, 1167082, 1367884, 1187811, 964034, 1193335, 1058041, 1049223, 1669862, 1405151, 1441282, 1109767, 706626, 1091586, 628728, 1139846, 1259417, 936435, 776223, 903359, 1022784, 924895, 1151238, 1035418, 581664, 694669, 893316, 670921, 577047, 1124999, 554828, 1083271, 797952, 802172, 844868, 944918, 675666, 1121425, 628206, 930101, 784026, 819545, 594654, 650334]
16480F50334J06436k24086k8331M44331j39868J01799l6263l1028J45720m50360
16470E38684J17967I5155M54910J4277J09872L3065k88263L10896j2901R3352
16460H10363k46257J99705j47343M07075m05653n8946K56254k54641K70550C75183
16449F36457K37041r6811l27244J90845J41118A95625K65044K23222j28369j48476
16439D07046N933R7707q0802m737J88151j76379j66923p9281K79471Q4310K06104
16428G60600k92353D6865M39106J68504B90787O8317J30775j59950L37169I9698
16417A16334L11271J22432F2020N38779A92860K92107A50663J48414N8165j49753
16407B07489L7423K02127d5174D69389j59262K93267R2889l37449j13101Q2867
$$ y = [650334, 756770, 532684, 504353, 948684, 808816, 910615, 874352, 843324, 989044, 538684, 656651, 95155, 550065, 564342, 674214, 707279, 419016, 729912, 717011, 810363, 564106, 763811, 616468, 1023543, 617890, 558944, 815198, 560557, 831107, 375183, 636457, 873498, 776687, 449443, 640288, 781406, 195625, 460669, 683891, 555522, 407046, 412979, 510686, 429884, 425147, 613298, 436919, 269996, 190715, 470186, 554496, 760600, 468247, 46865, 485971, 654475, 290787, 359104, 489879, 329929, 667098, 99698, 116334, 427605, 550037, 62020, 600799, 192860, 484967, 150663, 299077, 357242, 207489, 244912, 447039, -45174, 469389, 310127, 603394, 696283, 358834, 245733, 328600]
16397C28600J96420r419o2552A19602L08038r0295K641A37417N89510C33420K35121
16386E68541J66435j37284j93565A63978l068m9655M88334a18584G1536Q9196
16376A60732m6488K35268J29594q3977K70735A42478L49863k2405j03553R5750
16366D62133K1843A95528J501K39413K23084I1399J69562K40660A77836R0396
16356B68232R9446N8154j52139j17948K54225j56503E4500R3365J71317J0378
16346C29560j42854k7618O64908A42853K06739o8078J160J1851J85226j56320
16336C23431J12261r9737p0871o2858d1897C69627k724N5184p0735j13368j9871
16325B18113K0799j18773K30446a12319B62204F4274L72569j90661K63702R0806
$$ y = [328600, 525020, 515601, 453049, 119602, 427640, 337345, 339986, 137417, 726927, 333420, 568541, 734976, 597692, 404127, 163978, 160910, 111255, 599589, -118584, 71536, 160732, 114244, 349512, 479106, 395129, 665864, 142478, 492341, 469936, 366383, 462133, 483976, 195528, 197029, 436442, 659526, 91399, 260961, 501621, 177836, 268232, 367678, 425832, 273693, 155745, 409970, 253467, 54500, 147865, 319182, 329560, 186706, 159088, 823996, 142853, 349592, 281514, 282674, 294525, 479751, 323431, 435692, 335955, 265084, 202226, -41897, 369627, 366903, 422087, 351352, 237984, 218113, 238912, 120139, 350585, -112319, 262204, 64274, 436843, 246182, 509884, 600690]
16315F00690A81293R7361O3507E9229P0010M8813j4872D6187M22678j91778j24848
16304A52239E1814M4902R87K07156A26188O85668C09266B3692J46447o1512k7367
16293H1260L47491B09481G2171J26328f005I2569L70963C2644P3433K86757A07510
16281A47200K90379C6919P63750d7333A47675G3484P1656P6248J80180A52231
16270A95942k0990E3803N1448P0192J95582j5498A03987P8486M9555g676j0415
16259a8091D2131b06423g869B07115m9831R191R9915R6055g8340A9892a09885
16247B45482N7040I1615h7761I4040K31823k4753J43186l9535o9605j11101d7731
16235A33193P7730H3001m050P5552b7290n7233A76916J87671H6191A2992d8752
$$ y = [600690, 181293, 278654, 342161, 59229, 129239, 178052, 163180, 46187, 468865, 277087, 152239, 51814, 96716, 97703, 304859, 126188, 811856, 309266, 23692, 170139, 108627, 81260, 428751, 209481, 72171, 198499, -6005, 92569, 463532, 32644, 106077, 392834, 107510, 147200, 437579, 36919, 800669, -47333, 147675, 73484, 145140, 221388, 401568, 152231, 195942, 174952, 53803, 105251, 175443, 371025, 355527, 103987, 182473, 232028, -7676, -18091, 42131, -206423, -7869, 207115, 157284, 166475, 266390, 362445, -78340, 19892, -109885, 245482, 302522, 91615, -87761, 94040, 325863, 301110, 444296, 404761, 335156, 224055, -47731, 133193, 210923, 83001, 78951, 154503, -27290, -84523, 176916, 364587, 86191, 12992, -48752]
16223C74918j72700F0197J23166n8832J26898N4591B2815b26375F146d1608C06938
16211A35387j5251P6978J3009K05510A13852D5022M51101d7832k1534B46106a06290
16199B27222g59l4987q5752A14326l2577l9686R6298M2321b49875C12581j23089
16188A89492m3394C7951i9564D75357a28626A56836B2027a60520O8595j01391
16178a93316D73761d6619A16834P1955l1384a25643r2810i0735A70696b0584j70990
16167a91574A4243O7595h8762L9022A7861d3282n8746C06434i8610I5463D3058
16155C51610A34416b4187D52349I2313a20866C21121a13248A75623b64047C46888
16144B03047a55904a469E1436J09452f24565g4457E1554R3609D0960d5719B2099
$$ y = [374918, 202218, 60197, 183363, 124531, 251429, 306020, 22815, -226375, 6146, -41608, 306938, 135387, 120136, 197114, 210123, 415633, 113852, 45022, 496123, -47832, -69366, 246106, -106290, 227222, -759, -35746, -121498, 114326, 81749, 42063, 138361, 180682, -249875, 312581, 189492, 146098, 37951, -99564, 475357, -128626, 156836, 22027, -160520, -91925, -193316, 473761, -46619, 116834, 188789, 157405, -125643, -218453, -90735, 170696, -20584, -191574, 14243, 81838, -88762, -49740, 17861, -43282, -102028, 306434, -98610, 95463, 43058, 351610, 134416, -24187, 452349, 92313, -120866, 321121, -113248, 175623, -264047, 346888, 203047, -155904, -1469, 51436, 160888, -624565, -74457, 51554, 145163, 40960, -45719, 22099]
16132D47084a86355A49796a00785B37487e5424A0069K69828c8537m94k17732N9091
16121a97672C5691J13177g129l0988l37541a50661A02021k2926J11853F9453d2309
16109g2581H6509R2228B7651c7542C16860I1498l1745K56493j12475m9096K60822
16098D15497b081j3698B83067a12678o7685B4541J21822K9783f8744B8112L58666
16087C86778b59379J1682J20617G3101K6922C7944J07610e6901k42537E3097b304
16075f1834B44788F2823D636a01944L5491j75773a06142d4753A25380C0828A3961
16063B1690K93122A37586L3026d04398D1768P4822b47869A5587c60390a24160
16052b15321C8315i1389c0026A45432a45607O5764n8345K4475A14513N8449c7584
$$ y = [447084, -186355, 149796, -100785, 237487, -55424, 10069, 279897, -38537, -39031, -256763, -197672, 35691, 148868, -7129, -38117, -375658, -150661, 102021, 79095, 190948, 69453, -42309, -72581, 86509, 178737, 27651, -37542, 316860, 91498, 59753, 316246, 203771, 154675, 415497, -2081, -15779, 283067, -112678, -180363, 24541, 146363, 176146, -68744, 28112, 386778, -259379, -247697, -127080, 73101, 100023, 37944, 145554, -56901, -299438, 53097, -2304, -61834, 244788, 62823, 4636, -101944, -66453, -242226, -106142, -44753, 125380, 30828, 13961, 21690, 314812, 137586, 170612, -404398, 41768, 116590, -247869, 15587, -360390, -124160, -215321, 38315, -91389, -30026, 145432, -145607, -79843, -138188, -113713, 114513, 172962, -37584]
16040b26039c2464o4650B79367j31874F2253i7294k8209N5744j71795f8429A34207
16028i914o7684j12058K2500H6990C5814g2681j43626j49291H815c35819F0410
16016B77253q4152j6609a27630D63462h7480j05378A2322b39094L6307j03287
16006c06074d3619A73641B2302R5225b67706i1241a3843l69277Q1255n4006A71329
15994a54924A64250b27463d9951j43229N8949a6286B92338G1106g655j03938D4009
15982a58368H6509J92506C1809J49269P5481k1848H8180b16410N0119B7591i9731
15970b05198d3045m4629A78028b43730i1133k78421A86029F7153H776J78664Q0548
15959B67988c60680h953m0562c149m25190H2787P6268a60335P8932C4627a39135
$$ y = [-226039, -32464, -97114, 279367, 147493, 62253, -97294, -125503, -69759, -241554, -68429, 134207, -9914, -77598, -189656, -167156, 86990, 35814, -72681, -216307, -365598, 8815, -335819, 60410, 277253, 193101, 176492, -127630, 463462, -87480, -192858, 12322, -239094, -202787, -306074, -43619, 173641, 22302, 117527, -267706, -91241, -13843, -383120, -301865, -355871, 171329, -154924, 164250, -227463, -49951, -193180, -134231, -16286, 292338, 71106, -7655, -111593, 44009, -158368, 86509, 279015, 31809, 181078, 256559, 234711, 88180, -216410, -166291, 27591, -99731, -205198, -43045, -87674, 178028, -243730, -91133, -369554, 186029, 67153, 8776, 187440, 267988, -360680, -8953, -49515, -3149, -428339, 82787, 159055, -160335, -81403, 34627, -139135]
15947C05589d1915D9322h915A04875d6052l28198C24694a51326B30128E5305g0318
15935b22604o807C16891j22081b98327E7003a83994I0158K23865D4222q853N2468
15924H7837b18373C8225J66312c73701B6486K61884d1822r126F7151P3929a95956
15912I9956c38558h2300A1959a94000C0523c56197A71446B4038J08873F208K5081
15901C1289d3942C5997c4906f982B60e1728A67576d0681D5169a54780j21489B99511
15888A33281d2242k93719c5524l7396G1375B7750a73249b1325G9173b01872E0157
15876F8441d7863B81754A05676j5001c88373I9807J09184B924b03579p847B75815
15864b02540A86368K6882a53619l76256B26809b98219a18697D2046d4809A79269
$$ y = [305589, -41915, 49322, -8915, 104875, -46052, -374250, 324694, -151326, 230128, 55305, -70318, -222604, -229411, 316891, 194810, -298327, 57003, -183994, 90158, 314023, 44222, 35369, 87837, -218373, 38225, 204537, -373701, 26486, 288370, -41822, -50948, 67151, 141080, -195956, 99956, -338558, -82300, 11959, -194000, 30523, -356197, 171446, 24038, 132911, 6208, 31289, -43942, 35997, -34906, -6982, 260, -51728, 167576, -40681, 45169, -154780, -276269, 299511, 133281, -42242, -335961, -35524, -72920, 71375, 27750, -173249, -21325, 79173, -201872, 50157, 68441, -47863, 281754, 105676, 90675, -388373, 99807, 208991, 2924, -203579, -211426, 275815, -202540, 186368, 213250, -153619, -529875, 226809, -298219, -118697, 42046, -44809, 179269]
15853H5446O545a05086q941F6775a83498B41717J84508h417k09800A95280a24762
15841d39942D9996d1100J6944k4036F9468R1440b99937O5009K7962L2266j87644
15830c62344j28029K29072A16387d99985F2634k7247b58334R8486j2232A84029
15819a57269J9248b1694l1174J7309j77621m4326n6791Q513A88e19691B462K66406
15807B68868M9685d2673j44426e1523k56831e6050B30643D0769J03573b82969
15796c3528l7052j0606b7968l57084O3891J17874k4449e5028m60683d8579B00341
15784A2171M0584h6012i144r1325B58564b24781j2207B36558a13336j89511a14225
15772d47286N5582i999q0636A37607a22115A54397a58827r4653E3349b55655C47774
$$ y = [85446, 91991, -105086, -114027, 66775, -183498, 241717, 426225, -8417, -218217, 195280, -124762, -439942, 49996, -41100, -24156, -48192, 69468, 160908, -299937, -234928, -206966, -174700, -362344, -490373, -261301, 116387, -499985, 62634, 35387, -258334, -159848, -172080, 184029, -157269, -138021, -21694, -52868, -35559, -213180, -257506, -314297, -305784, 188, -519691, 2462, 268868, 318553, -42673, -187099, -51523, -308354, -56050, 230643, 40769, 144342, -282969, -33528, -70580, -81186, -27968, -385052, -321161, -203287, -227736, -55028, -515711, -48579, 200341, 12171, 52755, -86012, -9144, -100469, 258564, -224781, -236988, 236558, -113336, -302847, -114225, -447286, -391704, -9999, -90635, 137607, -122115, 154397, -158827, -253480, 53349, -255655, 347774]
15760c9862C39449a08008C4326R5143C0156L3234J59782G5106J33428d0502B21783
15748G3456i1475c9448C10386b94933i0150B3876i6052A49850e928D2650a46991
15736A87208B2247a44009A91348f2439b3918k02936P9280B43704a48430C4484
15725e5341j50768G378b86420c0573j70659e0910A51992c837o0259j25458e9995
15713b08870j28021G3460J3065e1490j24965H5205C1659N6959b73089f3124l5737
15702i8861E1171g2620J0772m05128a57505C9150a35571G5626c9482j16818A84295
15690A60489o4678k5084B3260d3986H3975g0957A66787a12586m4499K0695n5963
15679a92353h736k13692j6718J13331F5690J54145c6273j58082A58240F7113L34795
$$ y = [-39862, 339449, -108008, 34326, 129469, 30156, 63390, 223172, 75106, 208534, -40502, 221783, 73456, -91475, -39448, 310386, -294933, -90150, 23876, -96052, 149850, -5928, 42650, -146991, 187208, 22247, -144009, 191348, -62439, -23918, -226854, -147574, 243704, -148430, 34484, -55341, -206109, 7378, -286420, -30573, -201232, -50910, 151992, -3837, -64096, -189554, -59995, -208870, -336891, 73460, 86525, -51490, -176455, 85205, 31659, 88618, -273089, -63124, -98861, 51171, -72620, -61848, -466976, -157505, 39150, -135571, 75626, -39482, -156300, 184295, 160489, 95811, 70727, 23260, -43986, 83975, -70957, 166787, -112586, -157085, -136390, -192353, -8736, -222428, -239146, -125815, 65690, 219835, -36273, -194355, 158240, 67113, 401908]
15668D01908g3699B35108n9775d48982a48774B17001g9111a7130k47006A26494
15657B7762K10905e5048j54657Q8575b8658k21889c1028B5424G173J16336k4792
15646I8717a37033B80694c9249m0311o6275A50936P9650q6634c535k73899A01114
15634b22259k4639B13880B806a81427M9859B06114b11697M7753f7084j11094a6671
15622A43985R6192o2920i2933C2888R9761a559A17039f5569j13577j0086K5781
15611a63451B9781K28825c2118A60161b50609A72741a04247E99474G4897g8546
15600b26654a02755j29183q5890D3094A3686K32432D0053p605b58467A82016a82962
15588a71285K5135A45479a95349h2669a2775j83794M6393K081j83839a54993C37357
$$ y = [401908, -73699, 235108, 175333, -448982, -148774, 217001, -79111, -17130, -264136, 126494, 27762, 238667, -55048, -209705, -121130, -28658, -250547, -31028, 25424, 7173, 123509, 98717, -137033, 280694, -39249, -79560, -145835, 150936, 230586, 143952, -3535, -277434, 101114, -222259, -246898, 213880, 2806, -181427, -131568, 206114, -211697, -163944, -67084, -178178, -16671, 143985, 240177, 177257, -92933, 32888, 132649, -1559, 117039, -65569, -179146, -189232, -163451, 29781, 258606, -32118, 160161, -250609, 172741, -104247, 599474, 74897, -78546, -226654, -102755, -231938, -317828, 43094, 13686, 246118, 40053, 32448, -258467, 182016, -182962, -171285, -146150, 145479, -195349, -82669, -12775, -196569, -150176, -148095, -331934, -154993, 337357]
15576A57378a58840r6574R5412a6985E50011A58125a88808P2086j02958e4323
15565a44257b147j02869r0346D6494L23568A0489J70889b17524j1500I6551A7956
15553C43401b15535C24903k8054H2686b38883F1772a0556j1608A09472b0839a468
15541a64926G838c07075b8783B06690P5045D7870a15404k9650B10949C2734a77288
15529I9898b41884C47718a33200l7665b3427k39166G8872P7417d0646p3551A60580
15517B70613M569F5940M8932h8394c2545m8731H9511N2266L4606P9710p4243a00518
15504a03110A28585b64876g0745C1983a08723d8491B451e8812j23981g2242k70500
15493c42742e4305J5565p6592p8144f0774B3958C23J46989a16031F9452K4581
$$ y = [157378, -158840, -255414, -160002, -16985, 550011, 158125, -188808, -116722, -219680, -54323, -144257, -2147, -105016, -195362, 46494, 370062, 10489, 181378, -217524, -229024, 96551, 17956, 343401, -215535, 324903, 296849, 82686, -238883, 61772, -10556, -22164, 109472, -20839, -1468, -164926, 7838, -307075, -28783, 206690, 281735, 47870, -115404, -145054, 210949, 32734, -177288, 99898, -241884, 347718, -133200, -170865, -23427, -262593, 78872, 156289, -40646, -114197, 160580, 270613, 275182, 65940, 114872, -88394, -32545, -81276, 89511, 141777, 176383, 256093, 181850, -100518, -103110, 128585, -264876, -70745, 31983, -108723, -48491, 2451, -58812, -182793, -72242, -342742, -54305, -38740, -115332, -193476, -60774, 23958, 323, 147312, -116031, 69452, 94033]
15482I4033h3956q9835G2049c4627F0948f9338A17445n4492K9380L5668E2454
15470b07956d0034B05147D915a3309k87317I4911k4471J23233G6834J4134b53725
15458b06405C1339N6870J03413A7999b2090C3988e43108a90714a4184F598P866
15447A4464K34250b67482A49151n7519b73274I7219C1034J75314q1291C8444c41983
15435B00462h933k57412a0501r2604Q789N700A46359a3102H3888c9493D1216c87658
15422b93291a37015e7745l0934J1578H6491d8969j38794a4591k5663J1242n29093
15411e58105a48485E7705L1518a23535C0741b06316q9769a45150M4285o8340j3699
15400a82904H8984M7307b9995j9043k8905D8340J42848F3541b17855J06138C29158
$$ y = [94033, -83956, -173791, 72049, -34627, 60948, -69338, 117445, 62953, 92333, 128001, 52454, -207956, -40034, 205147, 4915, -13309, -300626, 94911, 70440, 193673, 76834, 90968, -253725, -206405, 31339, 88209, 191622, 17999, -22090, 33988, -543108, -190714, -14184, 6598, 14464, 248714, -267482, 149151, 91632, -273274, 97219, 31034, 206348, 125057, 38444, -341983, 200462, -8933, -266345, -10501, -103105, -94316, -88616, 146359, -13102, 83888, -39493, 41216, -387658, -293291, -137015, -57745, -88679, -77101, 86491, -48969, -187763, -14591, -40254, -29012, -558105, -148485, 57705, 89223, -123535, 30741, -206316, -296085, -145150, -100865, -169205, -182904, 88984, 136291, -29995, -49038, -77943, 48340, 191188, 63541, -217855, -111717, 329158]
15388A14375B599M55815D1650K674a0476j00650D5808e8677A749a92934A58160
15376b07755k879H0791r152a82839p8840A49859a80059l5603A53380D1877c23892
15364B25437b41535I469K67577b13592B6248a46777a9844C18913g936j05392D030
15352g5980n9513n8924k77164b7865j26868B47370B3143e4032j60406A19514b57111
15340a16067c2085p1194A5193K33341a14359A39215E6316H52b6521B79394f7516
15328D4276a49289p2135k2199A70151K9200B7024J47035i9153B53790l1452G4469
15316A18455a1023k2018A33643L8057b05464J508a00567r0123B25715F4501k8458
15305C6043K15431f7946R204A19112a85498n3676C54239a72564N0462C04436g3938
$$ y = [114375, 2599, 458414, 41650, 44324, -10476, -111126, 45808, -58677, 1749, -192934, 158160, -207755, -210634, 80791, 71639, -182839, -261679, 149859, -180059, -215662, 153380, 41877, -323892, 225437, -241535, 9469, 277046, -213592, 26248, -146777, -19844, 318913, -7936, -113328, 4030, -75980, -135493, -194417, -471581, -27865, -154733, 247370, 23143, -54032, -214438, 119514, -257111, -116067, -32085, -103279, 15193, 248534, -114359, 139215, 56316, 852, -26521, 279394, -67516, 44276, -149289, -221424, -243623, 170151, 199351, 27024, 174059, -99153, 253790, 222338, 74469, 118455, -11023, -33041, 133643, 171700, -205464, -203956, -100567, -190690, 225715, 64501, 36043, 251474, -67946, -58742, 119112, -185498, -239174, 354239, -172564, -122102, 304436, -73938]
15293H4247b15481b5710A29088D7399a55651m6645j09020a15435D8115Q3071K02235
15282C33421D4196p486a60502i783k79612h9200c8137m0820A99579a27404B45246
15270A72522N11107a93811f8465C28386j5628B4960g5196r3674C06497H0930C8763
15258C56453a24254A98112n8566e645B33345G6942k8161J28698J58014P69782
15248A105275M79406p50968N47958k6857A90357L69671A79419q5597J69257r9193
15238A63886a08598j37468B13439a89389I1315b45207B7856h5175A3635c0875
15227B41006l3899f1590I5394J15463C1291a86229K3627b1271e531C55918e7547
15215B60152A9585J90698j04236h37o0863B24940j11235A5407L66887a1951C41813
$$ y = [84247, -215481, -25710, 129088, 47399, -155651, -202296, -311316, -115435, 48115, 131186, 333421, 44196, 36710, -160502, -9783, -289395, -89200, -38137, -78957, 199579, -127404, 245246, 172522, 683629, -193811, -68465, 328386, 312758, 24960, -75196, -168870, 306497, 80930, 38763, 356453, -124254, 198112, 139546, -5645, 233345, 76942, 48781, 177479, 335493, 1105275, 1584681, 833713, 1381671, 1354814, 190357, 560028, 179419, 93822, 263079, 163886, -108598, -246066, 213439, -189389, 91315, -245207, 27856, -85175, 13635, -30875, 241006, 207107, -61590, 95394, 210857, 31291, -186229, -162602, -21271, -5531, 355918, -57547, 260152, 19585, 210283, 106047, -837, -61700, 224940, 113705, 15407, 382294, -11951, 341813]
15203B09295r1833n312J3850J54803h2315A73646a4394A82188K6297k8029b08290
15191B36812J07989A53534J61038G734e9644J6882A5082d5224C81670B2468R7813
15180A20281D5914J48726p8978A8194J32786b62020a6611A37954j2246K6834a21915
15168a0013D7372M9607J3950J78037A16521K08172q2460a18500C9063K95464f9661
15156I7674b26675d3001B13328I5676J10269J70792b09374A63377e9236D17286
15145D0027Q6577R0558D8222Q0272L28936C6493A1232J07128O4581M89512A20300
15133a17993A55130a53090q4913A98057C0523J39819c8497B05985k0032E3693
15122D0940N9375L23148j24937b03668H9530J56214C3531a45459B49731N9262
$$ y = [209295, 117462, 112150, 126000, 280803, -82315, 173646, -14394, 182188, 208485, 180456, -208290, 236812, 344801, 153534, 314572, 7734, -59644, -42762, 15082, -45224, 381670, 22468, 120281, 45914, 194640, 115662, 18194, 150980, -262020, -16611, 137954, 125708, 152542, -121915, -10013, 47372, 96979, 110929, 288966, 116521, 324693, 242233, -118500, 39063, 334527, -69661, 97674, -226675, -43001, 213328, 95676, 205945, 376737, -209374, 163377, -59236, 417286, 40027, 126604, 217162, 48222, 128494, 457430, 36493, 11232, 118360, 182941, 672453, 120300, -117993, 155130, -153090, -238003, 198057, 30523, 170342, -38497, 205985, 185953, 53693, 40940, 100315, 423463, 298526, -203668, 89530, 245744, 33531, -145459, 249731, 308993]
15112C08993q1319n887P7431A31611L09345a40687e839B03209q7786J39013b87754
15100A59178k5662n53J69950e5493B88465A20509K051K22189O4244I0193O7302
15089A57495N5002d9577a5719j63927A26603k5604L2182J85715E4839c7153D09343
15077B22181f935k72416A8803M82101B25432p9224M3181K65994j90535C4655J59531
15066A94186p1435i0170J3378A75825M006i7080B09902a65741A95238J18590o6328
15055B47500J18177j45086a25312C22618j35689n7790J85514A30310M53210f9316
15044I3068O6033A9736P5106M34994A68026k3840J96719j52333J2983o7476J41698
15033B75777l4486h510A51612J66499d8833B86632A36806L4991K91186N7257A04656
$$ y = [308993, 227674, 221787, 299218, 131611, 440956, -140687, -5839, 203209, 115423, 254436, -287754, 159178, 133516, 132963, 302913, -55493, 288465, 120509, 122560, 344749, 408993, 90193, 157495, 212497, -49577, -15719, -179646, 126603, 100999, 133181, 318896, 54839, -37153, 409343, 222181, -6935, -279351, 18803, 500904, 225432, 146208, 189389, 455383, 264848, 34655, 194186, 122751, -90170, -76792, 175825, 179831, -97080, 209902, -165741, 195238, 313828, 247500, 365677, 220591, -125312, 322618, 186929, 129139, 314653, 130310, 583520, -69316, 93068, 159101, 19736, 94842, 529836, 168026, 144186, 340905, 188572, 201555, 134079, 275777, 241291, -8510, 151612, 318111, -48833, 286632, 136806, 171797, 462983, 520240, 104656]
15021A37275a81204I4572l7247K47055Q0168r9492J6454J600p4404J33303a24302
15009H7705K0760C1015K56786k6811E5066K29928q4192K1920J8180l8775q7595
14998A14532E2251N5375J91065q1167n4342g6312C53791B4392e0961e993G5706
14986C47015J16621k19867p2556E1093L74466j10680j2439L1754G2643j4262J40815
14975A99196J9047K34409A76296a7453B22071L8790Q6855J66797e2704C96128
14964B78456L2762q4992K13754A65252J90433A9153K08995E0282M6284J92304
14954B88870j322K76817G2649K72185j44326J20769j08870K92925D2416o922P9396
14943A14890J85614o5597R2481A08065J867J81621R1857j61478j6947J50274M3701
$$ y = [137275, -181204, 94572, 57325, 304380, 384548, 285056, 301510, 303110, 228706, 362009, -124302, 87705, 108465, 31015, 287801, 260990, 55066, 284994, 200802, 222722, 240902, 202127, 114532, 52251, 107626, 298691, 217524, 163182, -76312, 353791, 24392, -50961, -5993, 75706, 347015, 463636, 243769, 171213, 51093, 425559, 314879, 302440, 334194, 72643, 58381, 199196, 218243, 452652, 176296, -17453, 222071, 260861, 347716, 514513, -52704, 396128, 278456, 311218, 226226, 439980, 165252, 355685, 19153, 228148, 50282, 96566, 288870, 287548, 564365, 72649, 344834, 200508, 321277, 212407, 505332, 42416, 35494, 114890, 300504, 234907, 327388, 108065, 109932, 291553, 383410, 221932, 204985, 355259, 398960]
14932C98960q4713J71357O2510B33513r2350R2881I2995K06405r1945J85871L0895
14921D24221c6046B87670O3790H4022J92819E8792K00141j18310J91411J58111
14911D90145A8430K39885R2867r4429K08937q2913j52029M19019B69991m1822
14901B28169e5978B92944J2612p3996M2731J15332J48708j50476j65155j03751
14891A18949J35512L34156N3731k46936j33549K13941j64899r0013K30124J1077
14881D62093d9664C66214j71732K06689P5243B12551J85642l6779K56956p8742
14871E39628j39878j69618K34765j97231O9167j29351J64196j15451J95485J48507
14861F00219A30528N13128j01821J16478A23568K62154j45930R1965Q0117K53995
$$ y = [398960, 314247, 485604, 548114, 233513, 141163, 234044, 92995, 299400, 207455, 393326, 424221, -36046, 287670, 351460, 84022, 276841, 58792, 258933, 140623, 332034, 490145, 18430, 258315, 351182, 256753, 465690, 382777, 230748, 649767, 269991, 228169, -55978, 292944, 305556, 231560, 274291, 389623, 538331, 387855, 222700, 118949, 254461, 588617, 642348, 395412, 261863, 475804, 310905, 220892, 451016, 462093, -49664, 366214, 194482, 401171, 476414, 212551, 398193, 361414, 618370, 539628, 399750, 230132, 464897, 267666, 336833, 207482, 371678, 256227, 451712, 600219, 130528, 643656, 541835, 658313, 123568, 385722, 239792, 331757, 411874, 665869]
14851F65869k95892N06125D02690E0125K41579K95506H0836K87405q746J46885
14841E06380J50585B60366J75938K826o8842M44498k28698k21126J40611J13735
14831F19308k68117N225L33528j75130B49598K18916O833K59243o5261j64753
14821E04576J70445k37239J22512l4857j9710J80869k22802B29309L81480L6779
14811F47568p1220j99283K76045j25486o9793l1901m8167L15717k6822j06098
14801E60560j72952o1835N9635J22668J3868O062j49557J30660B46543K02127
14791D48670J96132j68518k7540L42800C71676p1437n1586K29840K79835k97192
14781D61136K14962L145n0830O0297P5596o632l7909L60771m93299J39419k43578
$$ y = [665869, 369977, 876102, 402690, 50125, 291704, 587210, 80836, 368241, 359495, 506380, 656965, 260366, 436304, 439130, 370288, 814786, 586088, 364962, 505573, 619308, 351191, 356416, 689944, 514814, 249598, 468514, 475347, 734590, 669329, 504576, 675021, 437782, 560294, 525437, 505727, 686596, 463794, 229309, 610789, 647568, 576348, 377065, 653110, 527624, 457831, 425930, 377763, 693480, 666658, 560560, 387608, 325773, 385408, 508076, 521944, 528006, 378449, 509109, 246543, 448670, 644802, 476284, 448744, 791544, 371676, 300239, 248653, 478493, 758328, 461136, 676098, 679243, 628413, 688710, 764306, 757674, 719765, 1080536, 587237, 726656, 483078]
14770D83078k39293L38249K23800m0095B35568K26989K05469J19691k23831N1784
14760F15670j16412K81757J47570C15265L61651J54222J8656o0991M6850C52719
14749F84789J05988p1708l45694M12600p3035K173L07255j93032k07825R9720
14739G21231K15721l90046M06135j26646k90693L23225p3534J38063N2034j88730
14729G86760J05297J11063k90444J60090K20237l80100j21384K80371j53958j2557
14719G05375J17440k67064M44874j21089O0172p3298j32409K2643p3468K4404
14709G07580N4399q0029K97536j25045K31617m0478j84849M2782j54772L21063
14699A069804k19328m4458L34604l41292j201N73062m00509j18630J49724K93178
$$ y = [483078, 243785, 582034, 805834, 765739, 235568, 462557, 668026, 787717, 563886, 615670, 499258, 781015, 928585, 315265, 676916, 831138, 849794, 788803, 835653, 352719, 684789, 790777, 719069, 373375, 785975, 712940, 715113, 1022368, 829336, 621511, 721231, 936952, 546906, 953041, 826395, 535702, 858927, 785393, 923456, 975490, 786760, 892057, 1003120, 712676, 872766, 1093003, 712903, 591519, 871890, 717932, 705375, 822815, 555751, 1000625, 879536, 939708, 866410, 734001, 756644, 683176, 707580, 761979, 681950, 979486, 854441, 1086058, 1045580, 860731, 903513, 748741, 1069804, 850476, 806018, 1140622, 799330, 798129, 1371191, 970682, 852052, 1001776, 1294954]
14689A294954j13643l08707q1653J16451O2697J03125k37982J11494L48918l85932
14679I09722J42518j8295K20088l2677k35459k40607K27114P1362L90500k37207
14669A197059k39253L15297l96409K64928J81078j00760n83827K12332K83818
14660A134263j19304M05567P4148n34937K78365j25696j14248M10275k46801J45480
14650A307112J47399l16445J50458j96662R7045j6955P8867J08538O6316M5476
14640A471149j39339K79861j79731p6235j05894K14338j01794m9402O5963P6109
14630A455025j78740p1788L72074o949M0015l72362M55464k50193L17771r9927
14620A660390l26767K41540j10251j30984J2241L368o2702J87535j8848j27234
$$ y = [1294954, 1181311, 872604, 790951, 907402, 970099, 1073224, 835242, 946736, 1295654, 909722, 1052240, 1033945, 1254033, 1221356, 985897, 745290, 972404, 1043766, 1434266, 1197059, 957806, 1273103, 876694, 1141622, 1322700, 1221940, 638113, 850445, 1134263, 1014959, 1420526, 1494674, 959737, 1238102, 1112406, 998158, 1408433, 1161632, 1307112, 1454511, 1138066, 1288524, 1091862, 1188907, 1171952, 1250819, 1359357, 1425673, 1471149, 1331810, 1611671, 1431940, 1355705, 1249811, 1464149, 1362355, 1312953, 1378916, 1455025, 1276285, 1204497, 1576571, 1569622, 1609637, 1237275, 1692739, 1442546, 1760317, 1660390, 1333623, 1575163, 1464912, 1333928, 1346169, 1349537, 1286835, 1474370, 1455522, 1328288]
14610A328288M06366k16320J32090O7312k08396L32109k3845l9053j11531M64267
14600B131287n01606J639K43545J7415q5949j7931J45452j68513L09662Q7882
14590B162883j45062P7010q1275j66323L33659k40593M251L23906J29101k27907
14580B169650K49778j69285l57814M93443k10147L18225j66895l21918O36000
14571B641037k98625J6138L20683j90556J78814L2554j0879K02516K9904L603
14561B925189O5390R7777J27929K62495k51860j61765P33566O714P3238P39711
14551D618384R74756R92683J568687L063526P325262J6637102J3115566k1855598
14543B6440368A1427930n613891j893417j015848l22468K02873m85211K14348
$$ y = [1328288, 1734654, 1518334, 1650424, 1717736, 1509340, 1841449, 1817604, 1778551, 1667020, 2131287, 1629681, 1631320, 1874865, 1892280, 1806331, 1788400, 1933852, 1765339, 2075001, 2162883, 2017821, 2094831, 2013556, 1847233, 2180892, 1940299, 1944550, 2268456, 2397557, 2169650, 2419428, 2250143, 1892329, 2385772, 2175625, 2493850, 2326955, 2005037, 2641037, 2342412, 2358550, 2679233, 2488677, 2667491, 2700045, 2689166, 2891682, 2921586, 2925189, 2990579, 3088356, 3216285, 3478780, 3226920, 3065155, 3798721, 3805435, 3878673, 4618384, 5593140, 6585823, 8154510, 11218036, 18543298, 35180400, 48295966, 26440368, 11427930, 5814039, 3920622, 2904774, 2582306, 2785179, 2299968, 2514316]
14535B514316J17795k57622k26386N8887K77386j27120O9136j94672L70253r6080
14525B505893J08335k43116K44697O4031k87950L69474m5231L7455K0879R7954
14515B872421L846J00732j16704K12625k47368K77575K58427J29657m76853M23368
14505C437726j07905o8636J33342j63183J30662j94593K25859j0218j50715L87175
14495C619514O2918l49525K97829L1650Q0466K19924J00082l8177l89679L23643
14485C958645k01394N62031l38380R6262l5754K29986q3521R8726k24601J92162
14475D254162J56311K73671n43771M82865n2883K46980n6870k3630O37327l28660
14465E045502J99598k65669o2094L39525k23110M27006q09704P68809L2943j72749
$$ y = [2514316, 2632111, 2374489, 2148103, 2206990, 2484376, 2357256, 2426392, 2231720, 2601973, 2505893, 2614228, 2371112, 2615809, 2679840, 2391890, 2761364, 2716133, 2753588, 2774467, 2872421, 2876267, 2976999, 2860295, 3072920, 2825552, 3103127, 3361554, 3491211, 3014358, 3437726, 3329821, 3261185, 3394527, 3231344, 3362006, 3167413, 3393272, 3383054, 3232339, 3619514, 3682432, 3332907, 3630736, 3662386, 3742852, 3962776, 4062858, 4024681, 3635002, 3958645, 3757251, 4319282, 3980902, 4077164, 4041410, 4271396, 4187875, 4286601, 4062000, 4254162, 4410473, 4684144, 4140373, 4623238, 4570355, 4817335, 4760465, 4736835, 5374162, 5045502, 5245100, 4979431, 4917337, 5256862, 5033752, 5460758, 4651054, 5419863, 5452806, 5280057]
14455E280057Q0654J87744L6801K34768o7594j26502M13536J73779m1332n10O2800
14444F234201J30792O9584J29068k42303L19732M30863k69813O1005k04361J87921
14434F846689L39378J74014K080K04002k32815L61405j29134K75388J31022K8639
14424H000668K95467q6687J36110L01690m20579Q47488P2354J30963l9659K59430
14414I497245m16163N03776L08557k29407m5231L56563L42816Q0151j20692L44007
14404A0621622L36505N7689R1730J27468L92597k07055N82021k1707K85119J22145
14394A2388134O63181l58031N40478L21327k83980M53638O6337N73184J52907
14385A4517175K94694L54585j07995M30624M22944K65204L05492L64721L36337
$$ y = [5280057, 5360711, 5548455, 5585256, 5820024, 5752430, 5625928, 6039464, 6213243, 6171911, 6171401, 6234201, 6364993, 6434577, 6563645, 6321342, 6641074, 7071937, 6802124, 6863129, 6658768, 6846689, 7186067, 7360081, 7362161, 7566163, 7333348, 7694753, 7565619, 7841007, 7972029, 8000668, 8296135, 8209448, 8345558, 8647248, 8226669, 9074157, 9146511, 9277474, 9237815, 9497245, 9081082, 9584858, 9893415, 9664008, 9618777, 9975340, 10318156, 10398307, 10277615, 10621622, 10958127, 11015816, 11107546, 11235014, 11627611, 11420556, 12002577, 11980870, 12265989, 12388134, 13051315, 12693284, 13233762, 13555089, 13271109, 13724747, 13791084, 14364268, 14517175, 14811869, 15166454, 15058459, 15489083, 15912027, 16177231, 16482723, 16847444, 17183781]
14376A7183781K82266J66109N17108J04238P87001n3148O12566L98766L03129
14367B0301816K15424O56129M94137O07121M73590O81962n1419Q15812L69598
14358B4564170O99456O28596O64528K72352O71735N87499P57566M86823J219286
14349C0552011N02529P82479J021464P07641J022044O52429J019010P91767Q65605
14340C7916979J417520Q95426R98333J465209J020448J201839J599664J209303
14332D7724721J528677J296825J929735J438923J800579J519099K158678J852890
14324F1250127K065925J875549K237636K381398K990045K504792K693949K631960
14316H0631381L147714L116406L358299L158936M264073L702861L814505M612583
$$ y = [17183781, 17466047, 17632156, 18149264, 18253502, 19040503, 18987355, 19599921, 19998687, 20301816, 20517240, 21173369, 21667506, 22274627, 22748217, 23430179, 23378760, 24194572, 24564170, 25263626, 25892222, 26556750, 26829102, 27500837, 28088336, 28845902, 29332725, 30552011, 31054540, 31837019, 32858483, 33566124, 34588168, 35240597, 36259607, 37051374, 37916979, 39334499, 40229925, 41228258, 42693467, 43713915, 44915754, 46515418, 47724721, 49253398, 50550223, 52479958, 53918881, 55719460, 57238559, 59397237, 61250127, 63316052, 65191601, 67429237, 69810635, 72800680, 75305472, 77999421, 80631381, 83779095, 86895501, 90253800, 93412736, 97676809, 101379670, 105194175, 109806758]
14308A09806758N028323M142595N457539N216394N768147N840857O689784O773310
14300A54723707O921359P535691P791801Q665436Q414465R626060R393788J0937196
14292B24009503J0283419J1592483J1329770J2362661J3058194J3142495J3575636
14285C09354161J4220564J4241960J4473867J4745996J4540771J4443353J3736923
14278D09757595J3502673J2501812J1435719J0011326Q249283O404391L861949
14271D75724748J30079k283982j606419l541850n279131p031885r252857j1102690
14263D35756013j2905249j4011343j4935715j5519156j5931413j5478785j5860673
14256C31113679j5201025j4120917j4356596j4305605j3006360j2753791j2117185
$$ y = [109806758, 114835081, 118977676, 124435215, 129651609, 135419756, 141260613, 147950397, 154723707, 161645066, 169180757, 176972558, 185637994, 194052459, 203678519, 213072307, 224009503, 234292922, 245885405, 257215175, 269577836, 282636030, 295778525, 309354161, 323574725, 337816685, 352290552, 367036548, 381577319, 396020672, 409757595, 423260268, 435762080, 447197799, 457209125, 465458408, 471862799, 475724748, 475854827, 473570845, 471964426, 468422576, 463143445, 456111560, 446858703, 435756013, 422850764, 408839421, 393903706, 378384550, 362453137, 346974352, 331113679, 315912654, 301791737, 287435141, 273129536, 260123176, 247369385, 235252200]
14249B35252200j1386661j0986459r925931r959290r098489q665382p618054q194190
14241A59417744p141517p005561o472614n935831n027566n927606n582126m703267
14233A11621656m480230m473613l196980m114263l640768l371675l551897l137192
14225H1655038k898107k888849k652641k577509k497641k122549k413257k144764
14217F1459721k020002j956898j831719j701635j051475j997729j430248j898038
14209D7571977j173188r35108q47996r66413j633536j260263j178576j324420
14201C8252477n34713o91835j464489p21214j221587q31530n90526p10338r90824
14192C0495421o45437q73664r66584l52226n30699p70751n16091n23701m64432
$$ y = [235252200, 223865539, 212879080, 202953149, 192993859, 183895370, 175229988, 167611934, 159417744, 152276227, 145270666, 138798052, 132862221, 127834655, 121907049, 116324923, 111621656, 107141426, 102667813, 99470833, 95356570, 91715802, 88344127, 84792230, 81655038, 78756931, 75868082, 73215441, 70637932, 68140291, 66017742, 63604485, 61459721, 59439719, 57482821, 55651102, 53949467, 52897992, 50900263, 49470015, 47571977, 46398789, 45463681, 44615685, 43649272, 42015736, 40755473, 39576897, 38252477, 37717764, 37025929, 35561440, 34840226, 33618639, 32787109, 32196583, 31486245, 30495421, 29849984, 28976320, 28009736, 27657510, 27126811, 26356060, 25839969, 25316268, 24851836]
14183B4851836o43273q53694k34120p98907m09327m3011o70868k33832o08458
14174B0356346n77671J27390n12739o88539l9115o91343j2724n95444l44716j26608
14164A6894837j46523o33650j44740k93964j20186p70424O332n89087L9236l48364
14154A3893467j58710J40827l40313P2972o37357K5504m08487m87302q5392L6464
14144A2051673k72919j95525j93197k35036M3819k16383k71384J67808j61454
14135A0717402p72084j12101K85654k49115p1303p08951P455M50248n37479J5286
14125I025012j4034l0180k35877R5412o67773J52821o9833l23660k15796J94989
14115G911081N712l95122J05456j1173k60626m64719K79079l23536P6178R1918
$$ y = [24851836, 24208563, 23354869, 23120749, 22321842, 21912515, 21869504, 21198636, 20964804, 20356346, 19778675, 19906065, 19393326, 18704787, 18665672, 17974329, 17961605, 17366161, 17021445, 16894837, 16748314, 16114664, 15969924, 15675960, 15555774, 14785350, 14791682, 14202595, 14241831, 13893467, 13734757, 13875584, 13535271, 13608243, 12970886, 12996390, 12587903, 12100601, 12015209, 12051673, 11778754, 11583229, 11390032, 11154996, 11198815, 10982432, 10711048, 10878856, 10717402, 9945318, 9833217, 10118871, 9869756, 9798453, 9089502, 9096957, 9547205, 9009726, 9025012, 9010978, 8980798, 8744921, 8840333, 8172560, 8325381, 8255548, 7931888, 7716092, 7911081, 7916793, 7521671, 7627127, 7615954, 7355328, 6890609, 7169688, 6846152, 6922330, 7014248]
14105G014248n4100l1497l04394L69396o99468L73838j77148l88792P3199K10310
14095F385592r8843k00389j4704j33306j08381j8405r8132j19335P2684J5391
14085E682172n6505l36097j39232J96223m3448n29128R7486K68871k43726J14397
14075E011013j98406j77408K02709l217k04974J43466j58918j32336L3311O0552
14065D575792k1273m25515L43058j06230m18709K66903J91003l77310K34504m7578
14055D214645J3636l29999J10781k3k80732p068P5309Q4642j76651j88651J66529
14044C682418L10622l87471k36334L5746j29380J13007j10376K55492l78860J93026
14034C347890j48900o4973J06736k14741L11286k7872o4404l43029K54285j01694
$$ y = [7014248, 6960148, 6928651, 6624257, 6993653, 6294185, 6668023, 6490875, 6102083, 6175282, 6385592, 6286749, 6086360, 6071656, 5938350, 5829969, 5811564, 5713432, 5594097, 5666781, 5682172, 5625667, 5289570, 5150338, 5346561, 5303113, 4773985, 4871471, 5140342, 4896616, 5011013, 4812607, 4635199, 4837908, 4834691, 4629717, 4773183, 4614265, 4481929, 4515240, 4575792, 4554519, 4129004, 4472062, 4365832, 3947123, 4214026, 4405029, 4027719, 4262223, 4214645, 4228281, 3898282, 4009063, 4009040, 3728308, 3721240, 3796549, 3881191, 3704540, 3515889, 3682418, 3993040, 3605569, 3369235, 3404981, 3275601, 3388608, 3278232, 3533724, 3154864, 3347890, 3198990, 3134017, 3240753, 3026012, 3337298, 3309426, 3245022, 2901993, 3156278, 3054584]
14024C054584j96958J55731k06410m3844l9632L8629k91167K48207K59253o8090
14014B910303l17312M10039o94121K47474K32287q0194J39700o30017M20690j97825
14004B441024N0486j08017K29209m49777L38815k36882j33283j87450N10675j42523
13994B312277K34764k77257M23643J63897R1617J045625K062037O154476J5060356
13985B7271435J8299196j5220326j4207212o316843k576321k015474j190516j33628
13977C910311M4860p62127Q0423K36655p73852P4188P9225n2393R3649l34385
13967B596554n2330J46059m77350L68288n24813k81351O67970k24793j92145j09476
13957A916613M07876j64933k56995K76823J58850n38142J94569J47496l18834
$$ y = [3054584, 2857626, 3013357, 2806947, 2763103, 2723471, 2762100, 2470933, 2719140, 2978393, 2910303, 2592991, 3003030, 2308909, 2556383, 2788670, 2708476, 2848176, 2218159, 2638849, 2441024, 2491510, 2383493, 2612702, 2162925, 2501740, 2264858, 2131575, 1944125, 2454800, 2312277, 2547041, 2269784, 2693427, 2857324, 2948941, 3994566, 6056603, 12211079, 27271435, 45570631, 30350305, 16143093, 9826250, 7249929, 5234455, 4043939, 3910311, 3955171, 3193044, 3273467, 3510122, 2736270, 2810458, 2889683, 2837290, 2930939, 2596554, 2544224, 2690283, 2212933, 2581221, 2056408, 1775057, 2443027, 2218234, 2026089, 1916613, 2324489, 2159556, 1902561, 2179384, 2338234, 1800092, 1994661, 2142157, 1823323]
13948A823323N8849j54156K48651L1040q1493k9424K56855j52785k01223J23141
13938A922778j43943m1631J82143r4480N9640j72008M4365j2163L34900m90662
13928A588939L56101q1514l5527l77433J90193J63665R8657j87930R6758q8069
13918A723840K08808m60210K47110k30325M04870n39502r2607N33959p2759j39825
13908A583359j4104k69493K6911j7054K47900k79445M61623l47656n8730m2933
13898A290378O0920J96036j19094J28156j58225K73921l61632Q1556j72721M39316
13888A658611n17615K3736J28277J8914k60224K78210r4885n8054L84382m12522
13878A148830K55593K26632l14160j89205J6857M23829m61864M81973l79058K85338
$$ y = [1823323, 1882172, 1728016, 1976667, 2007707, 1926214, 1896790, 2153645, 2000860, 1799637, 1922778, 1778835, 1737204, 1919347, 1824867, 1884507, 1712499, 1756864, 1744701, 2079601, 1588939, 1945040, 1863526, 1827999, 1450566, 1640759, 1804424, 1903081, 1715151, 1811909, 1723840, 1932648, 1472438, 1719548, 1489223, 1894093, 1354591, 1261984, 1795943, 1723184, 1583359, 1569255, 1299762, 1326673, 1309619, 1557519, 1278074, 1739697, 1392041, 1333311, 1290378, 1351298, 1547334, 1428240, 1556396, 1398171, 1672092, 1310460, 1392016, 1219295, 1658611, 1140996, 1164732, 1293009, 1311923, 1051699, 1329909, 1235024, 1176970, 1561352, 1148830, 1404423, 1631055, 1316895, 1127690, 1144547, 1568376, 1106512, 1588485, 1209427, 1494765]
13868A494765k05599K7066l78476J36472J14314j2649k36405k03245K00375O3976
13858A000594K0582l13345N23342j05877j01859J20759L58743n18393J7098L89012
13848A390656j50904l32410L76619l14123L301j74331J14897K4361J38077m73667
13838F02476L52674L9312j74702K17669m2351k3556K65468m19856K15014J87346
13828A219494j50083j37203n8936J31799m1915Q7592p7955J76546j35612m21693
13818E92034L21164D52614O60889j84770j11975K53362j20581k39984R3496M6501
13808H49552K74070l22385J06559o9836K15218o8898j56510j27876Q0040J91425
13798I71359m6054K6175P9598r7370k46699k13317K55602J20802p1602j4809K8497
$$ y = [1494765, 1289166, 1316232, 937756, 1074228, 1188542, 1175893, 939488, 736243, 936618, 1000594, 1021176, 707831, 1231173, 1125296, 1023437, 1144196, 1502939, 984546, 1001644, 1390656, 1239752, 907342, 1283961, 969838, 973139, 798808, 913705, 938066, 1076143, 602476, 955150, 994462, 819760, 1037429, 995078, 971522, 1236990, 817134, 1032148, 1219494, 1069411, 932208, 873272, 1005071, 963156, 1050748, 972793, 1149339, 1013727, 592034, 913198, 452614, 1113503, 928733, 816758, 1070120, 949539, 709555, 803051, 849552, 1123622, 801237, 907796, 837960, 1053178, 984280, 827770, 699894, 779934, 971359, 925305, 951480, 1031078, 933708, 687009, 473692, 729294, 850096, 778494, 763685, 792182]
13787G92182k35611J27598J48999j85936J01434K42423j97505m0184o0493J33704
13777H26611k23487J48226j83678L39748l27528L36177p4708p6927j07427J26952
13767G83959M6004R0682D00183K44656p4395L60774M230m63014L26745j69662
13757F29517J90688j26608L53307j01370l44365J66322C46717L11657K01204k25912
13747F33666K38520C44752J58887p0889j00398L61289R4571K57623m97164P0059
13737F18730p7927j37392l8452K67387j5438L2438K17513k94162J40980N926N9577
13726G79180j84240j28966j00794K66119B65580N42454J39811J21421l73870r1278
13716F04118N2357k69804M24332C26761K42060J18688K6051Q5934j51120J48494
$$ y = [792182, 556571, 684169, 833168, 647232, 748666, 991089, 793584, 753400, 692907, 826611, 603124, 751350, 567672, 907420, 579892, 916069, 841361, 764434, 657007, 783959, 829963, 920645, 400183, 644839, 570444, 931218, 935448, 472434, 799179, 629517, 820205, 693597, 1046904, 945534, 601169, 767491, 346717, 658374, 859578, 633666, 872186, 344752, 503639, 432750, 332352, 693641, 788212, 1045835, 548671, 618730, 540803, 403411, 364959, 632346, 616908, 649346, 866859, 572697, 713677, 719603, 779180, 594940, 465974, 365180, 631299, 265580, 808034, 947845, 1069266, 695396, 604118, 656475, 386671, 811003, 326761, 568821, 687509, 713560, 799494, 648374, 796868]
13706G96868O6417B59346N14006q4228O432j41382k68449K04411K29498j87049
13696E32585O6376j16690M6051r0823j84751L83581p2410J2780J78897l9494j87930
13685E28172K33457l61475L50164j61223j872N0636p5078M5863l2491k07807K5640
13674C93986L1335q271J2764j16880K47130k10718K61142k47228K467J54630j50119
13663C70238n2314L99056l17559L01422j82819j16782j20055M63677B66907L35866
13653F02773j67330J5271B04278J08434Q575I7989L04837J18280K18266j89876
13643E49496k33873J9827L49802A33181J81727J9822J39935K74040B24442L70744
13633E95186A52057D8207L76739K62114k72396l4080N3245M3789I8149L12812
$$ y = [796868, 863285, 259346, 773352, 689124, 695556, 554174, 285725, 490136, 719634, 532585, 598961, 482271, 528322, 437499, 252748, 636329, 563919, 576699, 755596, 716102, 528172, 761629, 400154, 750318, 589095, 587223, 637859, 562781, 608644, 576153, 368346, 393986, 425321, 417050, 429814, 312934, 560064, 349346, 610488, 363260, 365727, 520357, 370238, 317924, 716980, 399421, 700843, 518024, 401242, 281187, 744864, 266907, 602773, 435443, 450714, 204278, 312712, 321287, 97989, 402826, 521106, 739372, 549496, 315623, 335450, 685252, 133181, 314908, 334730, 474665, 748705, 224442, 595186, 152057, 48207, 424946, 687060, 414664, 380584, 433829, 477618, 98149, 410961]
13623D10961L56497j54785k92820B9736L72292Q5486m9240L27959C37636M74432
13613H12068C42875A33745M79508m5300r2983j84659j10719R4459K55322J2600
13603E41973k46192J06458j58690M5014A6961M24310n4481J10290A05394J15710
13593B21104J20734A42653Q3660K60462B29835q5583E5131L67833j43839Q8035
13583C67160Q2124A00822J83779J93738A67953L1485j8456K93370j12131J52161
13573E14382I0580L02280m6794K05437N3174k97006D5148J44991K41090A75472
13562C49034N239A45445N5885G0823J18954P9725K89562K31554C93599K7298j37724
13551B83173J48995A37288K74251J41259a8406E38878B15994M4782K8802p0865
$$ y = [410961, 767458, 612673, 319853, 29736, 402028, 487514, 438274, 766233, 337636, 812068, 342875, 133745, 613253, 567953, 474970, 290311, 179592, 274051, 529373, 541973, 295781, 402239, 243549, 288563, 16961, 441271, 386790, 497080, 105394, 221104, 341838, 142653, 226313, 486775, 229835, 144252, 55131, 422964, 279125, 367160, 449284, 100822, 284601, 478339, 167953, 199438, 180982, 474352, 362221, 514382, 90580, 392860, 346066, 551503, 604677, 307671, 45148, 190139, 431229, 175472, 349034, 354273, 145445, 201330, 70823, 189777, 269502, 559064, 790618, 393599, 420897, 283173, 432168, 137288, 411539, 552798, -18406, 538878, 215994, 260776, 289578, 218713]
13541B18713a31650D75543j69014C7788J09947L04779H3036K78585j30274M3169
13531B74516J66772j77168D0964q807J99259K54963B19347N6323o6296n8188J30348
13520B81534j25917K75143N8080A85702n8014K7390p6699L86832j32299A2164
13509C66657j4101J28157J49992B45167j05368J08859m5582p2059K24957j24939
13499B31035C4176J97276q687O9959e358C45480L0191l7905K75423k92510C8995
13487F25270j85732J26584B11636K9360F8754L39595c6269D97682r4167A34833
13476A33052K3562g7784B83675J22835J48068j55753j65730J51641J14758j91971
13466C07523A43310J46032m6720J57320A17696B1838K36137F6283K6055K40781
$$ y = [218713, -131650, 475543, 306529, 37788, 147735, 452514, 83036, 361621, 231347, 274516, 441288, 264120, 40964, 32157, 231416, 486379, 219347, 275670, 209374, 151186, 281534, 155617, 430760, 488840, 185702, 127688, 155078, 78379, 465211, 332912, 12164, 366657, 352556, 480713, 630705, 245167, 139799, 248658, 203076, 131017, 355974, 231035, 34176, 231452, 222765, 292724, -5358, 345480, 375671, 337766, 613189, 320679, 38995, 625270, 439538, 566122, 211636, 240996, 68754, 408349, -36269, 497682, 403515, 134833, 133052, 156614, -77784, 283675, 406510, 554578, 398825, 233095, 384736, 499494, 307523, 143310, 289342, 242622, 399942, 117696, 21838, 257975, 66283, 92338, 333119]
13456C33119J0611j05998l2939C1410I390L90596J26497B21434j349R3572M7346
13445C61003m8238A27436K16422A44158L1896b22144B42535f5954B75035E6623
13434D52262q8880o1069G1099K77566A25722l1401d1433A37560Q8788K2125P3783
13423C22256m6513p8062J36164J62909k31782B3468M07607D9273P23838f0145
13412C55617r6689l7531e7410C44865h382B33283I5092R1372k6158G9379J52032
13401B31411p4272J2162E891J25875J25672p5989J510h624B5187A1881K17134
13390B29015J69230j83904J85038A10991P635J26723d798H984J26741N5744l9432
13379A52037J86002D2906J60571F9888L52K72296G9587L50462J29162k16280A57642
$$ y = [333119, 343730, 237732, 204793, 31410, 9390, 399986, 526483, 221434, 220085, 313657, 361003, 312765, 127436, 343858, 144158, 176054, -222144, 242535, -65954, 275035, 56623, 452262, 363382, 302313, 71099, 348665, 125722, 94321, -41433, 137560, 226348, 248473, 322256, 275743, 197681, 333845, 496754, 264972, 23468, 431075, 49273, 773111, -60145, 355617, 258928, 221397, -57410, 344865, -8382, 233283, 95092, 186464, 160306, 79379, 231411, 157139, 169301, 5891, 131766, 257438, 181449, 182959, -8624, 25187, 11881, 229015, 398245, 214341, 399379, 110991, 118626, 245349, -4798, 8984, 135725, 191469, 152037, 338039, 42906, 203477, 69888, 70240, 342536, 79587, 430049, 559211, 342931, 157642]
13367B78550N2117N712j15119F3177J01058K44425A96708J17432J02044J71199
13357E87383j09529B7478M10740G4542M6038L8740M81370C2969K21120J79380
13347D33469A10411K71131A70837a13158D33394g7265C71843A79622N649K9470
13337B14741J75855j95229K06810j46621p6088l6362J669d89768b03190A1707
13326a58233H360L18813H6343K07372A42670J89406j29776J06010a47121B80122
13315D2640K8924b0522G9128L23024A69240n4452L05280g3443A39958Q8473K00684
13304D29115A44709N2846q9053B5744a10822A21155P7772E2027L08503j13858
13294B46672c7173A25676J35355n7382g743D54631b9736A25627k5672a5101m2244
$$ y = [278550, 330667, 336379, 221260, 63177, 164235, 408660, 196708, 314140, 416184, 587383, 477854, 27478, 438218, 74542, 120580, 159320, 640690, 32969, 254089, 433469, 110411, 381542, 170837, -113158, 433394, -77265, 371843, 179622, 185271, 214741, 390596, 195367, 402177, 255556, 179468, 143106, 144775, -489768, -203190, 11707, -158233, 8360, 327173, 86343, 293715, 142670, 332076, 202300, 308310, -147121, 280122, 42640, 71564, -20522, 79128, 402152, 169240, 114788, 420068, -73443, 139958, 228431, 429115, 144709, 197555, 108502, 25744, -110822, 121155, 198927, 52027, 360530, 246672, -37173, 125676, 261031, 203649, -7743, 454631, -29736, 125627, 99955, -15101, -57345]
13283e7345C04197j6281c24204a11615M5722B69339J00199A27714k5220J90488
13273B92982l7187A10785a82417A93716b56576I7729Q2123p1484l4319M0119k7970
13262H6198L07893k7079e1886D45105a76192A33742J08949J14745a54462r2188
13252b46650G6298J06892J73142I5447K15623J2653h7243J8586C00807n4437r891
13241B36479A16622M13658A97852a0757k784C32625g8504A16862P7109j4306F4235
13229a97605f2063J7016B42181q4047h7705C77093B5136J36507k5926j2287r945
13218A13485e4808A21174c65517I9212i1297A67489J23815k8321l0342j00872
13208A31769i1418C24727b53620A67552m8454a06269C293R1917Q3964J2427n3510
$$ y = [-57345, 304197, 287916, -324204, -111615, -65893, 269339, 369538, 127714, 102494, 292982, 255795, 110785, -182417, 193716, -256576, 97729, 179852, 108368, 74049, 114168, 86198, 394091, 367012, -51886, 445105, -176192, 133742, 242691, 357436, -154462, -246650, 76298, 183190, 356332, 95447, 311070, 323723, -87243, -68657, 300807, 246370, 236479, 116622, 530280, 197852, -10757, -13541, 332625, -78504, 116862, 193971, 179665, 64235, -197605, -62063, -45047, 242181, 158134, -87705, 377093, 25136, 161643, 135717, 123430, 113485, -54808, 121174, -365517, 99212, -91297, 167489, 291304, 262983, 232641, 131769, -91418, 324727, -253620, 167552, 119098, -106269, 3293, 95210, 179174, 191601, 138091]
13197A38091M5155o6152J1154K5294K90624b05673h4820o2354e126D16072j32754
13186B83318H0105c8324j23506G3603i6805A92591M5276h8427A38671k2277b9669
13174A22599a02588C83257j89499k7261O9661r7958a4905C72257R4023A42918
13163G8019J33210r3145J8315o1433a2706A02706b16315D1257A9981e7911C7538
13151B44579k9925b0852A35550K16025r0804a72705A0510a23566A56171Q4922
13141B41093a54928C24694j58498J9862m0448G205a11131I9718m5849d333A32329
13129b61167L9618A88859e2726A17766h7044B50728A4968a00186A90880m298a46625
13117C0049a15115B67287n1590F3997K19915F3122J28668p2781e5210D9956J34475
$$ y = [138091, 183246, 117094, 128248, 153542, 444166, -205673, -84820, -147174, -5126, 416072, 283318, 80105, -38324, -161830, 73603, -96805, 192591, 237867, -88427, 138671, 116394, -29669, 122599, -102588, 383257, 193758, 166497, 236158, 138200, -14905, 372257, 466280, 142918, 78019, 211229, 118084, 136399, 74966, -12706, 102706, -216315, 41257, 19981, -57911, 37538, 244579, 214654, -20852, 135550, 351575, 260771, -172705, 10510, -123566, 156171, 241093, -154928, 324694, 166196, 186058, 145610, 7205, -111131, 99718, 53869, -4333, 132329, -261167, -221549, 188859, -52726, 117766, -87044, 250728, 14968, -100186, 190880, 186582, -146625, 30049, -115115, 267287, 215697, 63997, 283912, 63122, 191790, 119009, -55210, 49956, 184431]
13106A84431M0359a30741O4594O863A86618l9230b4793B91519b19436K896M1002
13095a75538A78601D134b17141B08081i0393c3917G6993a29403A7289b84523E4517
13083F4514R8765i5108K9988A6926J46335h2909B33130a5445n5944j00580B62717
13071B66711c9131E9306J80931D965b18094B41903c9336A0974R0282i137l6011
13060d5148D6240J48050d2364b46C33399B7853J86210b7882A35756B4230M53171
13049D77401J97865B63948m3694N4402n4757K26022k12058m6199b7004G2129J53708
13038B25837r7484A1943M9118R8351K09080a897C9955b50289f3645E5239O1055
13027A16294m9020a56495F06711I7570l6248K17945b17342A17255J14436p2448
$$ y = [184431, 224790, -130741, -66147, -59284, 186618, 147388, -24793, 291519, -219436, -216540, -175538, 178601, 4134, -217141, 208081, -90393, -33917, 76993, -129403, 17289, -284523, 54517, 64514, 163279, -95108, -65120, 16926, 163261, -82909, 233130, -15445, -71389, -171969, 262717, 266711, -39131, 59306, 240237, 4965, -218094, 241903, -39336, 10974, 101256, -9137, -45148, 46240, 194290, -42364, -246, 333399, 27853, 214063, -27882, 135756, 24230, 477401, 675266, 263948, 220254, 274656, 219899, 445921, 233863, 187664, -27004, 72129, 225837, 128353, 11943, 61061, 159412, 368492, -1897, 39955, -250289, -63645, 55239, 116294, 67274, -156495, 606711, 97570, 61322, 279267, -217342, 117255, 231691, 159243]
13017A59243M7356I0587L71993G8407J29543J81230A10796J01536P1205i1467
13006H2363i3241A02142A2885a5780B60517g9518L5907A6772J88227C4780i9822
12994B26910d2670Q108A07713f4768A32922c35556C27875f8830j65532E1110b97513
12982D095O2917a8636F7748b1753r6832M7051A2055b55270n4499A63901K3346
12971A87247J62346Q3915A28465a5070k05235C37492a1769A68793C4481d9681
12960A63784p6681a22196e4497A54396a30452j7499A74057h2570b6854i783n2075
12949f1858E2555J21633P0113b6053B31143h6168q8745j0215B16421a45473f4971
12937C6756a4043B58941a25586A38025P912O6368N113c5149k2843i469B9893M353
$$ y = [159243, 206599, 90587, 462580, 78407, 207950, 389180, 110796, 212332, 283537, -91467, 82363, -93241, 102142, 12885, -15780, 260517, -79518, -43611, 16772, 204999, 34780, -99822, 226910, -42670, -34562, 107713, -64768, 132922, -335556, 327875, -68830, -234362, 51110, -297513, 4095, 67012, -18636, 67748, -21753, -118585, -71534, 12055, -255270, -309769, 163901, 187247, 349593, 433508, 128465, -15070, -220305, 337492, -11769, 168793, 34481, -49681, 163784, 87103, -122196, -54497, 154396, -130452, -147951, 174057, -82570, -26854, -9783, -61858, 52555, 174188, 244301, -26053, 231143, -86168, -174913, -185128, 216421, -145473, -64971, 36756, -14043, 258941, -125586, 138025, 145937, 212305, 217418, -35149, -57992, -9469, 29893, 34246]
12925C4246N7271i306A85768N022J11448h1381l0884C12829A2641d9015n3567
12914a02582K2965G595Q7621J68165A31626n187J15164a06260n1376r1841a09718
12902A45833J04028b67633J16196I8724f9044A69031a28361j21317a1413B31371
12891D5764O6573c4821B69796h7969a4514G0905L928K74165b10512A31161N7218
12880A88379a295F6123b56383M9261A41487l9894g9606q8232N1881l2917F8201
12868E5242a55834A54554p4064k1642a96786A92610R8207j08758A1117P31K93306
12857C05154D5156g3681B48707d28611B24155E8338N9800C3939h8948a9386E5487
12845I9310l7575e1363l2503D34575C6185a52618A13640c3370j11783B3744K43770
$$ y = [34246, 91517, -9306, 185768, 190790, 302238, -81381, -112265, 312829, 12641, -49015, -102582, -79617, 7595, 95216, 263381, 131626, 126439, 241603, -106260, -157636, -249477, -109718, 145833, 249861, -267633, -151437, 98724, -69044, 169031, -128361, -249678, -11413, 231371, 45764, 112337, -34821, 269796, -87969, -14514, 70905, 74833, 348998, -210512, 131161, 188379, -1295, 66123, -256383, -207122, 141487, 101593, -79606, -167838, -115957, -148874, 68201, 55242, -155834, 154554, 80490, 58848, -196786, 192610, 290817, 182059, 11117, 11848, 305154, 45156, -73681, 248707, -428611, 224155, 58338, 118138, 33939, -88948, -19386, 55487, 99310, 61735, -51363, -83866, 434575, 36185, -152618, 113640, -33370, -145153, 23744, 267514]
12834B67514a85603q2859C96211b77098E5042i0189q249d4746j3993H1595N6927
12823A38522Q8598M5965A26364b01319H1367P9140O966R504K31233b84626B07046
12811a18779C85047d852J986A2588b1008C80965F5106f1906E954K66701A24159
12799a13837A3917O0922a41563C38310j61523b5978A106J19541d30939C2316d1517
12787b49165e8631C14369D3493J11856g3100n8386B20172G5559b63145B47831
12776A56718a08452c6993A53289b64282E8080j4039c70636a24292k7447G3148
12765G3548e7121m06360h8183A03030b8534A61274o179f4692F3133j3234a45165
12753e4685A22553j3521K26562b84242c6490A42017F8702c62147B64450M3352
$$ y = [267514, -185603, -268462, 396211, -277098, 55042, -90189, -98438, -44746, -58739, 81595, 138522, 227120, 273085, 126364, -201319, 81367, 160507, 167473, 176977, 408210, -284626, 207046, -118779, 385047, -4852, -2866, 12588, -21008, 380965, 65106, -61906, 5954, 272655, 124159, -113837, 13917, 74839, -141563, 338310, 176787, -25978, 1106, 120647, -430939, 32316, -41517, -249165, -58631, 314369, 43493, 155349, -73100, -131486, 220172, 75559, -263145, 247831, 156718, -108452, -36993, 153289, -264282, 58080, 44041, -370636, -124292, -151739, 73148, 73548, -57121, -463481, -88183, 103030, -28534, 161274, 155095, -64692, 63133, 49899, -145165, -54685, 122553, 109032, 335594, -284242, -36490, 142017, 68702, -362147, 264450, 307802]
12743C07802e1826m4538j06637H0212K06692A41436K03081K01313A91444a02799
12732A49158n5626c7984A45572c04147B02653g9185H9942A1139M8610J0707O1130
12721A31586O9435e263A36361m1487f6973C00994k033o9224a63467A44692a11774
12709a12048C18945i3636A70154C8949K342L42298g201C34239k4072l5938H9589
12697A32144e1854A98571E2168N0610Q4323O290c55845A18964P8973H6009O3634
12686A49643k2270b2461q2201o2492a3442B16821H2448K95452H1904i4258j17516
12675b11774A92465p1142B7061C604J56999e5648A61282A7985J13097j4703h8876
12663C31622C9435O3710J08912n6847l7683D0531b1133B65661h7809D14762i40
$$ y = [307802, -51826, -96364, -203001, 80212, 286904, 141436, 344517, 545830, 191444, -102799, 149158, 93532, -37984, 145572, -304147, 202653, -79185, 89942, 11139, 59749, 70456, 131586, 201021, -5263, 136361, 94874, -66973, 300994, 298961, 229737, -163467, 144692, -111774, -112048, 318945, -93636, 170154, 38949, 41291, 383589, -7201, 334239, 310167, 274229, 89589, 132144, -51854, 198571, 52168, 102778, 187101, 193391, -355845, 118964, 197937, 86009, 149643, 127373, -22461, -104662, -167154, -13442, 216821, 82448, 377900, 81904, -94258, -211774, 192465, 121323, 27061, 3604, 160603, -55648, 161282, 17985, 131082, 116379, -88876, 331622, 39435, 103145, 212057, 155210, 117527, 40531, -21133, 265661, -87809, 414762, -940]
12651F1053a07302p8642A90594N1942j06592a72826a7566k45902A73474a28409
12640a09197A72953A8270a21704q7368A68242B7025Q4311M3125F088a88691A66725
12628C16488A17064J76766F8741B8560g7451A44365l4790f9691A88252N4847i328
12616b6207j0231j36494B02328b34025i194F1815L00747A24219a24604A29412
12605a07928k93480d2842l4752D515J98523J01794j7029A36895n0767b4681A89338
12593C79999j74020A00005C7662c4347A57127J69027C691b01731H7149h7291G12
12581A1206b6861m6082P906A60046J19370a83597g3896Q235B5014J0746L39917
12570C75677I6151P3499n9626K38883a53701k482A66885O6145b89389J21193B82914
$$ y = [61053, -107302, -185944, 190594, 242536, 135944, -172826, -17566, -263468, 173474, -128409, -109197, 172953, 18270, -121704, -209072, 168242, 27025, 111336, 154461, 6088, -188691, 166725, 316488, 117064, 293830, 68741, 28560, -77451, 144365, 109575, -69691, 188252, 243099, -9328, -26207, -36438, -172932, 202328, -234025, -9194, 61815, 362562, 124219, -124604, 129412, -107928, -401408, -42842, -77594, 4515, 203038, 304832, 287803, 136895, 86128, -24681, 189338, 379999, 205979, 100005, 37662, -34347, 157127, 326154, 3691, -201731, 87149, -87291, 712, 11206, -26861, -72943, -65037, 160046, 279416, -183597, -73896, -65661, 25014, 35760, 375677, 96151, 169650, 110024, 348907, -153701, -156183, 166885, 233030, -289389, -168196, 282914]
12558e3626A40770Q4367h6218F4764j0060J5383a75625B51849G1510J44399I396
12546a27313j9657A13249J3430J98274b2311E8889b4425B42380A15754A8337P694
12535B6031D474L4216j0910b00477h7592D5618L02164d0016j29879d7899j14101
12524a62000A5154a833G8495k8907J04363a00865D72675f3117m1421K8171K9473
12513d6894A98643P816E5442a93701h9790b002k14429L5212L8390g0454C17138
12501C50736D9883R9956c75361i0550A25968a76787B2258R1803J96552c91656
12490B1792a20747j3646m1873k17206a0644q8177C2946i6421K7216G7375Q4987
12479A62362p4152A1640P9722a72481k18596a13481m4361A01517J26128D8928
$$ y = [-53626, 140770, 225137, -86218, 64764, 54704, 70087, -175625, 251849, 71510, 215909, 9396, -127313, -146970, 113249, 126679, 324953, -22311, 58889, -24425, 242380, 115754, 18337, 26031, 4474, 38690, 27780, -200477, -87592, 45618, 347782, -40016, -169895, -47899, -162000, 15154, -1833, 78495, 49588, 153951, -100865, 472675, -63117, -104538, -76367, -46894, 198643, 206459, 55442, -193701, -89790, -2002, -216431, -181219, -142829, -70454, 317138, 350736, 49883, 149839, -375361, -90550, 125968, -176787, 22258, 114061, 310613, -391656, 21792, -120747, -134393, -176266, -393472, -10644, -98821, 32946, -96421, -69205, 77375, 162362, 88210, 11640, 91362, -172481, -391077, -113481, -157842, 101517, 227645, 48928]
12468B84795e4051F7366h02j29501g157m7386H170a12465p9367D5600P0902a03848
12455A3376a25253F9323e9728m46548I516a35963f0504D2496K75911e247n0992
12444e6239k5275j24981J9253c0873k39574C79307a36037b5313B03362d27986
12433b39829A14093J68700b06917C9699J35547A8759b27710n7136e9473j06427
12423a65900d5179I5855b9961j75369F1421J5048a02832B1823b0401o129A83692
12411a80601G4998a5942j93199B88844b59195L3991d630r7335D569a34626k21837
12400c56463c6680C54406b1799B94259h1661I8584b76330J23784j10235a26741
12389b89578I5226Q7494J33887H5947k1594a46691O5101D7921a04276A82805d2069
$$ y = [284795, -54051, 67366, -802, -130303, -7157, -54543, 8170, -112465, -191832, 45600, 116502, -103848, 13376, -125253, 69323, -59728, -506276, 9516, -135963, -60504, 42496, 318407, -5247, -56239, -81514, -206495, -187242, -30873, -270447, 379307, -136037, -25313, 203362, -427986, -239829, 114093, 282793, -206917, 39699, 175246, 18759, -227710, -284846, -59473, -165900, -45179, 95855, -29961, -205330, 61421, 76469, -102832, 21823, -20401, -26530, 183692, -180601, 74998, -15942, -209141, 288844, -259195, -225204, -4630, -101965, 4569, -134626, -356463, -36680, 354406, -21799, 294259, -81661, 98584, -276330, -152546, -262781, -126741, -289578, 95226, 182720, 316607, 85947, 64353, -146691, -81590, 47921, -104276, 182805, -42069]
12377a96189e9901C6356i3677A45089g5157a0070p701k89713F2956J9847a45715
12365a4185j48181A87976F3932J26940B7787b19686C36825j59241P2474E7930
12354a20580L1092D9565g1451A77741h4567K8068D0245a42083A17881c88124B63989
12342A14419k4446k7221k524K24050E7646a40642b6930m0660B9612J82275A3070
12330I5371b45322B08361f6905j4025m0921E6051c4026r0240M581r6369e032j62432
12318a67464A0627f4634K3203p9828J6596A2755J50415J38072A41457a90569b5037
12306F568a72706e3833H0080J09078Q4297c40469h7220E7970J31797a60753j07360
12295b68113B05627i045p7958j06257E0122a10166A93336m0958c4984m3911A91013
$$ y = [-196189, -59901, 36356, -93677, 145089, -75157, -10070, -17771, -307484, 62956, 82803, -145715, -14185, -162366, 187976, 63932, 190872, 27787, -219686, 336825, 177584, 250058, 57930, -120580, -89488, 49565, -71451, 177741, -84567, -56499, 40245, -142083, 117881, -388124, 263989, 114419, 89973, 62752, 60228, 284278, 57646, -140642, -26930, -67590, 29612, 211887, 13070, 95371, -245322, 208361, -66905, -80930, -121851, 56051, -34026, -124266, -119685, -216054, -5032, -167464, 10627, -64634, -41431, -121259, -104663, 12755, 163170, 301242, 141457, -190569, -25037, 6568, -172706, -53833, 80080, 189158, 273455, -340469, -87220, 57970, 189767, -160753, -268113, 205627, -9045, -87003, -193260, 50122, -110166, 193336, 152378, -34984, -78895, 191013]
12283a75513F525N05157j98600A11022C9169e5469A67418F1459B5896K92398A05306
12271A18646j516P6376a70810B64930g3040J3910r4727A1246O0051K0826B5706
12259b5859I0413O6660A761e7528a0954E7633c3497j7658B81078b47846C03201
12247C84719H5612k151a186B12136A0140h5005A49926J19919p4065R4960n2582
12236B38158j9347c178k37172R4652C7798p286M00229H8156m3775L41162A36153
12224D31095j73177J96274D905O8527P6430a2624A51594c2140E01849B16843M0263
12213B57106H6320a68475i591A38938f8879A31868k0284J87261J15966F7633a19060
12201A64097N7825K060q6506l0929J06473j5466m5084R9170G0321M57659B09353
$$ y = [-175513, 6525, 511682, 313082, 111022, 39169, -55469, 167418, 61459, 25896, 318294, 105306, 118646, 117130, 193506, -170810, 264930, -73040, -59130, -153857, 11246, 71297, 92123, 25706, -25859, 90413, 157073, 1761, -57528, -10954, 57633, -33497, -51155, 281078, -247846, 303201, 384719, 85612, 83461, -1186, 212136, 10140, -85005, 149926, 269845, 195780, 290740, 238158, 218811, -3178, -240350, -145698, 37798, 30512, 430741, 88156, 44381, 385543, 136153, 431095, 257918, 454192, 4905, 73432, 149862, -12624, 151594, -32140, 501849, 216843, 257106, 86320, -168475, -9591, 138938, -68879, 131868, 111584, 298845, 414811, 67633, -119060, 164097, 221922, 223982, 137476, 106547, 213020, 197554, 152470, 251640, 70321, 527980, 209353]
12189A05636D3633M4954D1316a16105B64955q0207K54347r1901a20082D31747
12178A51835J09430r0495h3437B73717a28507m6705H2659j31K2497m7755a54521
12166F0273b91361H7775K40605A2972e2298A37483i8433A36562b72716h5466k3161
12155a08627k5139C08043Q977C3486J5516G701K89074f1433j06555I4453L862
12144I8315h4557B90687J5136b52745b6461F9539n905d4586B12210f9115o7550
12133a36665k0095C28223f3233B27449K36809b110I4904Q5118b12188C22792e988
12121a63942F4689a61607a7594j74947C15354a48185B42068L9497q7903n2770
12111A40892n3263e0349l9664o9890I3071b42384d8876F7820c7236m4005b8973
$$ y = [105636, 43633, 88587, 41316, -116105, 264955, 184748, 439095, 347194, -120082, 431747, 151835, 261265, 170770, -83437, 273717, -128507, -175212, 82659, 82528, 105025, 57270, -154521, 60273, -291361, 87775, 328380, 12972, -52298, 137483, -98433, 136562, -272716, -85466, -108627, -133766, 308043, 317020, 33486, 49002, 7701, 296775, -61433, -167988, 94453, 98315, -84557, 290687, 305823, -252745, -26461, 69539, 63634, -44586, 212210, -69115, -136665, -156760, 328223, -63233, 227449, 464258, -2110, 94904, 180022, -212188, 322792, -5988, -163942, 64689, -161607, -17594, -192541, 315354, -148185, 242068, 281565, 193662, 140892, 87629, -50349, -90013, -159903, 93071, -242384, -48876, 67820, -37236, -81241, -28973]
12099C9856J03336c21673a4293k60666A23962a23120L1014H6364C4561e7861p3709
12088a31570B06870G232c45710a1101m42786a30640A52632d6301J23j68503j06441
12077c21122D84730a78211P7390j65814R3631M5426k01307i9927j49922K979A19448
12065b50409j60623C66455r0523M01242Q66835F18531C1716J64702J65097a1187
12054A50691F1200J13950E9447a49904B47323a38982p117f0580F1686a40697M6194
12043i4503L6150A27240a49327B56028b5692l1655l05123a27232A1495b94026
12032B0785l249K11581D8139a03854H4489a1019E3473J09683b46056j42243h7958
12020I9514O493a05340A97471a0147k682k40449B634L20345e9266j5267E9109
$$ y = [39856, 143192, -321673, -14293, -274959, 123962, -123120, -92106, 86364, 34561, -57861, -131570, 206870, 7232, -345710, -11101, -453887, -130640, 152632, -46301, -46178, -214681, -321122, 484730, -178211, -100821, -266635, -173004, -127578, -328885, -99927, -249849, -246870, 119448, -250409, -411032, 366455, 275932, 677174, 1544009, 618531, 31716, 196418, 361515, -11187, 150691, 61200, 175150, 59447, -149904, 247323, -138982, -146099, -60580, 61686, -140697, -94503, -58353, 127240, -149327, 256028, -25692, -57347, -362470, -127232, 11495, -294026, 20785, 17536, 229117, 48139, -103854, 84489, -11019, 53473, 163156, -246056, -388299, -87958, 99514, 106007, -105340, 197471, -10147, -12829, -253278, 2634, 322979, -59266, -74533, 59109]
12008B9384N7177g1562B23184b71302D7095J788J05667D3235b24588F7517J48387
11997B15904I6527m5019c9018G7290k000j3516K98171b10698A30760a08693b4799
11985B2128a75215j22265a45014A5298f4424j75928G3493J13465G1763B2674J34813
11974A57487G8403B2154J1345b45499L5703A34937J35207a55829j72136i6867
11963b19000M0129a3330G2745b91972A53216k2289f5520q8533A12533f8467n1667
11952a20134A46186c46528H9712a91297E0473g8446d130m5623A22738f1702i801
11940E6839b98941d3053r9410d7714K0144B95755l301L8023H5726d9349A46643
11928a40155A53790e7981G6446a274r9062J13F0882f1930k31165h5193l19605
$$ y = [29384, 86561, -71562, 223184, -271302, 47095, 48883, 154550, 43235, -224588, 67517, 215904, 96527, 51508, -39018, 77290, 75290, 61774, 359945, -210698, 130760, -108693, -24799, 22128, -175215, -297480, -145014, 15298, -64424, -240352, 73493, 186958, 71763, 22674, 157487, 78403, 22154, 33499, -245499, -209796, 134937, 270144, -155829, -327965, -96867, -219000, -178871, -13330, 72745, -291972, 153216, 130927, -65520, -154053, 112533, -68467, -120134, 146186, -346528, 89712, -191297, 50473, -78446, -4130, -49753, 122738, -61702, -9801, 56839, -298941, -43053, -142463, -47714, -27570, 295755, 292454, 330477, 85726, -49349, 146643, -140155, 153790, -57981, 76446, -1274, -100336, -100223, 60882, -61930, -293095, -85193, -404798]
11917d04798J51589B13904q5150G037J73642d5435j60319F8048L5609j6495i2870
11905A4531a44296D0397i8776A64382c9950B45846g2751j6617j53467e6119j23979
11894a80098h8185n7335N3576A27829a69260O6293k66651G2919R9545H5920e136
11882g9392A36000i5352k83485B33544a30453J1250A28213i7507A71855b38278
11871A54513J7250e4122B40819L9040c24844I1435J01779b37828A05804a63658
11860a20228c1552j5318I962d7549B56132R9280A09164J31673c13738Q7389B5818
11848D8138c4112j45334A35256K17609c49422A70546k6178g8762l3739r6630R7214
11837a11917A95092n8051J45512b02128j458p2567A25660a9295k08091i7716j21543
$$ y = [-404798, -253209, 213904, 128754, 7037, 180679, -45435, -205754, 68048, 103657, 87162, -92870, 14531, -144296, 40397, -98776, 164382, -39950, 245846, -72751, -89368, -242835, -56119, -180098, -88185, -145520, -91944, 127829, -169260, -102967, -369618, 72919, 172464, 85920, -5136, -79392, 136000, -95352, -378837, 233544, -130453, -119203, 128213, -97507, 171855, -238278, 154513, 171763, -54122, 240819, 279859, -324844, 91435, 193214, -237828, 105804, -163658, -120228, -31552, -46870, 9962, -47549, 256132, 355412, 109164, 240837, -313738, -226349, 25818, 48138, -34112, -179446, 135256, 352865, -349422, 170546, 144368, -78762, -112501, -209131, -111917, 195092, 137041, 282553, -202128, -203586, -276153, 125660, -19295, -227386, -97716, -219259]
11826b19259A84942b3776k5585k1471A14842d05121I6417a61688A55364C5888
11815c46586G5610d9861B4456b16048k16294a5347D9825d8982A49109h9250l45491
11804d34741c0724B4854a68003B6607a60333F468a1544j36947J5407o4333F6204
11792A72658b4098j32830r8093h5872A13559R0813h9103C99103a28853A21199
11781E5056A9429J16759e5313j75426I5946c09951b4930I3363h5742j54703c8519
11769a40871A10210Q3773a55123C6967j7452a74601C41967c10716A6990P9131
11759I6121b63507O9698o4465A68704E2099h0476B15557n3940j9160b24579A02463
11747b3521B04069L2869i3213J418m7610C19917j54788o3574L8119g7460j66384
$$ y = [-219259, 184942, -23776, -49361, -70832, 114842, -405121, 96417, -161688, 155364, 35888, -346586, 75610, -49861, 24456, -216048, -432342, -15347, 49825, -48982, 149109, -89250, -434741, -30724, 24854, -168003, 26607, -160333, 6468, -11544, -148491, -133084, -197417, 66204, 172658, -24098, -156928, -255021, -85872, 113559, 204372, -89103, 399103, -128853, 121199, 55056, 19429, 136188, -55313, -230739, 95946, -309951, -24930, 93363, -85742, -240445, -38519, -140871, 110210, 193983, -155123, 36967, 19515, -174601, 341967, -310716, 16990, 96121, -263507, -193809, -258274, 168704, 52099, -80476, 215557, 161617, 142457, -224579, 102463, -23521, 204069, 236938, -93213, -91795, -139405, 319917, 165129, 101555, 139674, -77460, -243844]
11736b43844j54368A2833a22233j99826e5223j15353K6386f8754A64647a77888
11725a34311j50426G5773O1247k4162B8046A2888h8426B48571A18869n2309b53027
11713i1177B17560a95608I7761m2808R2911c18145C266N23833e564A61558b62866
11701B62232p1211C8859J3973O9703a96087O5540f2013F7484a49567m6430O4967
11690a31030M8908G5916d6047I5481J10211m7568J58177r4434r4728b25860C43866
11678C2328J84989q0470a29602A37142K5229b8619j48845C0190J09238J43018
11668B82446K3403b72010B66598I1877J61072g8145I9535d2418A88223p2747J82495
11657B97971a73656k78678a44221B26268i9642L4771D2575a48065B87103B9195
$$ y = [-243844, -398212, 12833, -122233, -322059, -55223, -170576, -144190, -68754, 164647, -177888, -134311, -284737, 75773, 137020, 112858, 28046, 12888, -88426, 248571, 118869, 66560, -253027, -91177, 217560, -195608, 97761, 54953, 147864, -318145, 3266, 527099, -5564, 161558, -262866, 262232, 191021, 38859, 52832, 122535, -196087, -130547, -62013, 67484, -149567, -195997, -131030, -82122, 75916, -46047, 95481, 205692, 158124, 316301, 221867, 127139, -225860, 343866, 32328, 217317, 136847, -129602, 137142, 162371, -28619, -177464, 30190, 139428, 282446, 305849, -272010, 266598, 91877, 252949, -78145, 99535, -42418, 188223, 115476, 297971, -173656, -452334, -144221, 226268, -99642, -64871, 42575, -148065, 287103, 29195]
11646a89580B83439i0200B55832D5624A717c47043A15139i8153A53864J12616
11636B66480B5818R8126f673A90705O5922G2385b00072A99726q3987a57335A69896
11624C08252j3955A29496C8472j0762P6841B4741O4841d5705F5642K28019A45584
11612b06478C9606J1757K16446I3916j9061A7876J34210b17630F6442b03332L3230
11601a70102B4307J61317a73980A43669g0680A8657a4012j77259k2090A7084N743
11590B2827h1035B74568c8232n3224G6633J82391M3681d7858n1671A06099a50563
11578A13303f4386A81913a1045A32592a64914B15927J4579a73117C63090a43112
11567G5846K67228n6703j12867G9376J86893j17559B3640J34956f5644A67860
$$ y = [-189580, 283439, -90200, 255832, 45624, 1717, -347043, 115139, -98153, 153864, 266480, 25818, 123944, -6673, 190705, 256627, 72385, -200072, 199726, 115739, -157335, 169896, 308252, 294297, 129496, 38472, 27710, 104551, 24741, 89582, -45705, 65642, 293661, 145584, -206478, 39606, 51363, 267809, 93916, 74855, 17876, 152086, -217630, 66442, -203332, -170102, 24307, 185624, -173980, 143669, -70680, 18657, -14012, -191271, -213361, 17084, 22827, -81035, 274568, -38232, -91456, 76633, 259024, 302705, -47858, -99529, 106099, -150563, 113303, -64386, 181913, -11045, 132592, -164914, 215927, 230506, -173117, 363090, -143112, 75846, 343074, 286371, 173504, 79376, 266269, 148710, 23640, 158596, -65644, 167860]
11556a3659B13171m3012a67690e6679E6791L86449a63765B92513a70392A05144
11545D9164J04870L698a5366A12751C0658R0032N224J00059p5067e086q4178j94785
11533b84049D29633a92031B56407A17246K13852i3104B25011J33694j46929p088
11523B04688a26535I6711b73894A61501j4005o9500f785J226E5459O6895b756
11511A10724K339n2784R347L59848a15010j54551A14103J36506o6148J15127J29696
11500D29284A22680J39618h1053B3500O3981i9187B51444b42638a01266B23441
11489D19128a44441A63792m1453j4563J54835N5359g9870D97123k13538I5447
11478b1481H8219E223K50499o9750N5277M4020j02030A5104Q7762c8777H6430
$$ y = [-13659, 213171, 170159, -167690, -56679, 56791, 443240, -163765, 292513, -170392, 105144, 49164, 154034, 157732, -15366, 112751, 30658, 120690, 125914, 225973, 150906, -5086, -89264, -284049, 429633, -192031, 256407, 117246, 331098, -93104, 225011, 358705, 211776, 204688, -126535, 96711, -273894, 161501, 147496, 77996, -6785, -5559, 55459, 122354, -2756, 110724, 113063, 60279, 69626, 429474, -115010, -269561, 114103, 250609, 184461, 299588, 429284, 122680, 262298, -81053, 23500, 87481, -99187, 251444, -242638, -101266, 223441, 419128, -144441, 163792, 122339, 107776, 262611, 317970, -79870, 497123, 283585, 95447, -21481, 88219, 5223, 255722, 185972, 241249, 285269, 183239, 15104, 102866, -38777, 86430]
11466E5051K0948J46745i4302L5068B48929b1075p6293k585A05915K91730e3129
11454b37504H243M5038L27014A59338g304B0621M1301J08673a11332l5580A65479
11442b3207B26837d7405C8222K47888a21375j93290E46385h5068A70671q3593
11432H7078L942L1021B6473b12742A56998b84230A98662P6759a65928j9432A96030
11420a23650A27553C0137L8099A097J68347g7262R382H9490g9261a8451A49076
11408D5749c17439g7825k56806N6742a19251B2690J3029b89972h4296l0194A90933
11396C4408j910Q4518L153A0457L6130P3178h8624E6554A1090c3981G2875b42853
11383E8378J6129a05297j4529E9988a22138b2503A23259J55516D7659j8887K72941
$$ y = [55051, 75999, 222744, -94302, -59234, 248929, -21075, -97368, -99953, 105915, 397645, -53129, -237504, 8243, 53281, 380295, 159338, -7304, 20621, 61922, 170595, -111332, -146912, 165479, -23207, 226837, -47405, 38222, 286110, -121375, -314665, 546385, -85068, 170671, 87078, 91020, 122041, 26473, -212742, 156998, -284230, 198662, 275421, -165928, -185360, 196030, -123650, 127553, 30137, 68236, 1097, 169444, -77262, -67880, 89490, -79261, -18451, 149076, 45749, -317439, -77825, -334631, -277889, -119251, 22690, 35719, -289972, -84296, -114490, 190933, 34408, 32498, 117016, 120169, 10457, 46587, 119765, -88624, 56554, 11090, -33981, 72875, -242853, 58378, 74507, -105297, -119826, 59988, -122138, -22503, 123259, 278775, 47659, 28772, 301713]
11372C01713j32068a255B11181F0554a3857k68037g6292n1196A36835C726L0002
11361C3728a4652j29544E1993f001j87866A55553b1619A17011K11223j50836a20837
11349B8197h7864A09606b26731J00844O2174C6370K12326i3280D201J86941H9921
11337D55408C546J20153a39475N9318k67342A04057d8051j03880C65897d11540
11326A33068b23871C84430H5497c23508D4596J47555F5870i3143C44739c93898
11315g731k81465h5635j7988j2502E5256i4956A40565h5966j59607L0521B39338
11303c114j97282e7187b7686A90336a21079I9295c2635A335a92729B30939a30216
11291c03036R5435j35994J71146l2458B13434C9785j7253b0710A12540A0470J4579
$$ y = [301713, 169645, -1255, 211181, 60554, -13857, -281894, -76292, -127488, 136835, 3726, 33728, -14652, -144196, 51993, -6001, -193867, 155553, -21619, 117011, 328234, 177398, -120837, 28197, -87864, 109606, -226731, -125887, -63713, 36370, 248696, -93280, 4201, 191142, 89921, 455408, 3546, 123699, -139475, -80157, -347499, 104057, -48051, -151931, 365897, -411540, 133068, -223871, 384430, 85497, -323508, 44596, 192151, 65870, -93143, 344739, -393898, -7731, -289196, -85635, -103623, -116125, 55256, -94956, 140565, -85966, -245573, -215052, 239338, -3114, -200396, -57187, -27686, 190336, -121079, 99295, -32635, 1335, -192729, 230939, -130216, -303036, -207601, -343595, -172449, -204907, 213434, 39785, 22532, -20710, 112540, 10470, 25049]
11280B5049a54211g1950E9874j6342R9489g9600c9115j39804h9107k01237L5733
11269b54611A4075a36938j44785I3201J1690M01480a84506A08976l2272L5613
11259A12317d62991J44720G482b00104E8398a37123b3047B23205b9116A76841
11248a817k43568b6203B8538L06254c5149n8816A79391a11050L4997a5651I0139
11236a83819h6992E6700b04954c4257q6638k92457b4876B65367F173K88804i0544
11224a77361B57642f5286j55014q3062B26082B5112a16836c0408o2893j62133
11214b55434a25678k9030j59766c7177q2747M0299B15646a60168B31788n6127
11204A75661b50073N1998j15164l1129g0589j08651k16449J56609P0216m2354
$$ y = [25049, -154211, -71950, 59874, 43532, 143021, -79600, -39115, -178919, -89107, -290344, -254611, 14075, -136938, -281723, 93201, 104891, 506371, -184506, 108976, 76704, 112317, -462991, -318271, 7482, -200104, 58398, -137123, -23047, 223205, -29116, 176841, -1817, -245385, -26203, 28538, 334792, -35149, -93965, 179391, -111050, -76053, -15651, 90139, -183819, -86992, 56700, -204954, -34257, -120895, -413352, -24876, 265367, 6173, 294977, -90544, -177361, 257642, -65286, -220300, -303362, 226082, 25112, -116836, -30408, -93301, -255434, -125678, -154708, -314474, -37177, -119924, -79625, 215646, -160168, 231788, 175661, -250073, -198075, -313239, -344368, -70589, -179240, -395689, -239080, -168864, -211218]
11194b11218A13137b90341J18191d6179A49077B9605J2480J48128j2750m2237
11184A35226m49i0283k8815j02056A46102a71529A53654K01000b01829F0762J90647
11173B51409e3125r272j2696B4289J2046m224e6321e329k55766C01342c55204
11161b26747i1993c0841F0974b17359e8319G5346h422B96704b19511A42223a640
11149B55299l0004c59924A05907N505A3532L4049b36091B94453H8418O8603E1280
11137a17195k68255B32835C4773m874a64720B7721a30915B7032h4645a3729l6399
11126e0128A41046c9226H8021a26949j60750J21217O236C09907K6832b21330n38
11115b21868C13265a21436H76M92181A17771J54665H8079j2566J49037N6716j26770
$$ y = [-211218, 113137, -290341, -172150, -46179, 149077, 29605, 42085, 190213, 177463, 135226, 134777, -90283, -119098, -221154, 146102, -171529, 153654, 354654, -201829, 60762, 251409, -53125, -62397, -75093, 24289, 36335, 32111, -56321, -5329, -261095, 301342, -355204, -226747, -91993, -30841, 60974, -217359, -58319, 75346, -8422, 296704, -219511, 142223, -1640, 255299, 225295, -359924, 105907, 111412, 13532, 47581, -236091, 294453, 88418, 157021, 51280, -117195, -385450, 232835, 34773, 29899, -164720, 27721, -130915, 27032, -84645, -13729, -50128, 141046, -39226, 88021, -126949, -287699, -166482, -160246, 309907, 336739, -221330, -221868, 313265, -121436, 876, 493057, 117771, 272436, 88079, 75513, 224550, 281266, 154496]
11104A54496P5407J43286j60209o0524Q242K06986j79285L13075a59471B27200
11093g316D55649q1548A67873C9858A0234K39636a10211j64369A65083J9453K61730
11082D46266j37886M6330a28744f1592F12602G7259b6630C87931c5653B77150
11071E28753k50295j2518m8233J2337L35812n8029n5982B01466n3459O42960B86195
11059D54521L39304k97456r091J16626J8961J81494k32307K41459l70259J51246
11049E94498P5594N53561E24096K19109L957P8497j20317O89J21126j76901q8450
11038E61806K26830K69877n07862O5109k8875K40293J6355k18004R1932n8566
11028F58895M43359B65457M61446K00509j31431k95232K07947Q7573j97800p069
$$ y = [154496, 229903, 373189, 212980, 152456, 160698, 367684, 188399, 501474, -159471, 227200, -7316, 455649, 374101, 167873, 39858, 10234, 249870, -110211, -274580, 165083, 184536, 446266, 308380, 354710, -128744, -61592, 612602, 77259, -26630, 387931, -35653, 277150, 528753, 278458, 265940, 217707, 230044, 565856, 507827, 451845, 201466, 148007, 790967, 286195, 454521, 793825, 496369, 487278, 603904, 622865, 804359, 572052, 813511, 443252, 594498, 670092, 1223653, 524096, 743205, 747162, 825659, 705342, 706031, 827157, 650256, 561806, 788636, 1058513, 550651, 615760, 586885, 827178, 843533, 625529, 717461, 658895, 1102254, 265457, 726903, 927412, 795981, 500749, 708696, 796269, 598469, 591400]
11018E91400k70758K90335K39852l20531J56584j33637K33109j04871j34418J62760
11008G09825k50518L23493k11602R5193L9606J2378L1169N1185j53782k11070
10998D35877N45096n969k82067k68072J97190j38641K79624J80312l10938K3663
10988F56075K82815O7418p7072J37883K07007Q7542k85543J72301L38531J07387
10978A694344q4526M17910k06141K14382M42593M79800j2094J64661r8463l7730
10968B974736M2553r120n73703l83731o22101N90822J48733K03029m30285L06055
10958B246988P7006j06115j77698p8188l08562k3297m50407J98242m59931l49581
10948E68457J08905k63134K7434Q8005G4244R1297M60069A90116Q0233M510n904
$$ y = [591400, 320642, 610977, 850829, 530298, 686882, 553245, 786354, 681483, 547065, 709825, 459307, 782800, 571198, 666391, 705997, 718375, 749544, 800729, 646947, 435877, 980973, 975004, 692937, 424865, 622055, 483414, 763038, 943350, 632412, 656075, 938890, 1006308, 929236, 1067119, 1274126, 1361668, 1076125, 1248426, 1586957, 1694344, 1609818, 2027728, 1821587, 2035969, 2478562, 2958362, 2946268, 3110929, 3012466, 2974736, 3017289, 3008169, 2434466, 2050735, 1428634, 2019456, 2168189, 2371218, 1940933, 2246988, 2323994, 2217879, 2040181, 1961993, 1653431, 1630134, 1179727, 1377969, 918038, 568457, 677362, 414228, 441662, 529667, 74244, 165541, 625610, 190116, 270349, 274859, 268955]
10937B68955O1463A11906k4932k4974h1217A61796a1377n7187F5514J31160c26004
10925A03608J5947a97248A57123a06726G8852b2937C87527E7994d8291C2458N9528
10914I1986i1832p4914A42814J29811f1674j9788A4844R1383j3470b10478a5671
10902f1943j22560N0556D9597a76938k16481F3580c12669b3078C6885M14646j75886
10891B75645a14430C7725a36196B28450a20769B5509J19982M5423p2042a96874
10880b1042B76397A36990h966A35705a83908H6485e1257A06285e3097A01740b89718
10868F8350j2099L1069C1322f1085A71149a78103a5089A39741R7383L11137B35081
10856c81659a72879B29889p3555g631k21723A63735i7189r0791p3679J21613F2087
$$ y = [268955, 330418, 111906, 86974, 62000, -81217, 161796, -11377, -68564, 65514, 196674, -326004, 103608, 119555, -197248, 157123, -106726, 78852, -22937, 387527, 57994, -48291, 32458, 91986, -91832, -166746, 142814, 272625, -61674, -81462, 14844, 106227, 92757, -210478, -15671, -61943, -184503, -133947, 49597, -176938, -393419, 63580, -312669, -23078, 36885, 451531, 275645, -114430, 37725, -136196, 228450, -120769, 25509, 145491, 190914, 118872, -196874, -21042, 276397, 136990, -8966, 135705, -183908, 86485, -51257, 106285, -53097, 101740, -289718, 68350, 56251, 87320, 31322, -61085, 171149, -178103, -15089, 139741, 237124, 548261, 235081, -381659, -172879, 229889, 156334, -7631, -229354, 163735, -97189, -187980, -261659, -140046, 62087]
10844a07760j85500E6526d0955q7051A15277d1243A04265d8131c100q2830l3790
10833a19720j42631C14006h386j42305E1503c48579P1337c9874k2227A5555c167
10821A16036j6213a6882L389B44190p7836c12740C27050b695l8338F3057f0971
10809G1505a66464A46919F3833J6659a80565N0195a3377n29153a64815j06137
10799b70952A85059a69124B9055c8171l32598J28835C53326A54127B8054b98252
10788C26794a31515l7455b5357I4477b96025A56436p7734J5290Q6592a07570k26959
10777c34529a56613A04431a02455B2055c29811A07949d08968B5733L36290b94435
10766C5755K45087g7632I2221N1369i9560D8162c81891J10479h6055A89313E0886
$$ y = [-107760, -293260, 56526, -40955, -128006, 115277, -41243, 104265, -48131, -3100, -85930, -119720, -262351, 314006, -8386, -150691, 51503, -348579, -277242, -39874, -62101, 15555, -3167, 116036, 99823, -16882, -13493, 244190, 166354, -312740, 327050, -2695, -41033, 63057, -60971, 71505, -166464, 146919, 63833, 80492, -180565, -130370, -13377, -542530, -164815, -270952, 185059, -169124, 29055, -38171, -370769, -241934, 353326, 154127, 28054, -298252, 326794, -131515, -168970, -25357, 94477, -296025, 156436, 78702, 93992, 180584, -107570, -334529, -156613, 104431, -102455, 22055, -329811, 107949, -408968, 25733, 362023, -294435, 35755, 280842, -77632, 92221, 143590, -99560, 48162, -381891, -271412, -86055, 189313, 50886]
10754A28292a02108B68325b28104h6147G1178a05959c7047E281J07252K791a03051
10742A1213J61644C0102J97300f5252r3412g4445h319k32072P8311g8805p143
10731h5948A46361p2285J17654d5898B95104n0364O6618a90221o3731g0767F0009
10719a38765G7576a79032A46884d87794c9022n0839e071G9084i6119B2212J47222
10708A69434a67634j41500e5989l52274c86j82297I657a38726A85253m7355c17674
10696E4115J24664a83155B4128a40574l5192l0696N9575J5469L4741C0803p098
10685B3705P7992d15710a3546A4503Q8762J6462a11963B02252a58447n76b6927
10673f0920p8367D6479a42963H970J84224a82033B92771a88434G2636a58904j3928
$$ y = [128292, -102108, 268325, -228104, -86147, 71178, -105959, -37047, 5281, 112533, 115324, -103051, 11213, 172857, 30102, 227402, -65252, -158664, -74445, -8319, -240391, -162080, -78805, -85948, 146361, 74076, 191730, -45898, 295104, 244740, 311358, -190221, -253952, -70767, 60009, -138765, 77576, -179032, 146884, -487794, -39022, -89861, -5071, 79084, -96119, 22212, 169434, -167634, -309134, -55989, -408263, -386, -182683, 9657, -138726, 185253, 137898, -317674, 54115, 178779, -183155, 24128, -140574, -175766, -206462, -146887, -131418, -96677, 30803, 23705, 101697, -415710, -13546, 14503, 103265, 119727, -111963, 202252, -158447, -159023, -26927, -60920, -139287, 46479, -142963, 8970, 193194, -182033, 292771, -188434, 72636, -158904, -172832]
10662a72832G1792b04761A58882J6520b20664D1686K8856a70241j67960b6241
10651a61599k54599A58677e6878E4085J47296B9323h6041j49163j32106B79305
10640a50691B0852c6956o3382k3495A44260a86864G4026h9081A50056g1300k70598
10629c41898A16565d4364l1878F1144i8179c9346E9705h1353r2984A7005J70615
10618A87620i2075l09972b6883j42876b442B56021b83475G3615i1001B22756a84386
10606c57326a01865D5711b12595g3431A5502J57753K2855b26847A30870a13587
10595f364j02964E8577J58827b11235C3340b85677B76283a42459m3783M4626J9008
10584a22608k22708b774B5715h403p7915k16702E6948g3030b3998m36661H6525
$$ y = [-172832, 71792, -204761, 158882, 175402, -220664, 41686, 70542, -170241, -338201, -26241, -161599, -416198, 158677, -56878, 54085, 201381, 29323, -86041, -235204, -367310, 279305, -150691, 20852, -36956, -100338, -123833, 144260, -186864, 74026, -89081, 150056, -71300, -341898, 116565, -44364, -76242, 61144, -98179, -39346, 59705, -81353, -174337, 17005, 187620, -92075, -402047, -26883, -169759, -2442, 256021, -283475, 73615, -91001, 222756, -184386, -357326, -101865, 45711, -212595, -73431, 15502, 173255, 196110, -226847, 130870, -113587, -6364, -109328, 58577, 217404, -211235, 33340, -285677, 276283, -142459, -186242, -141616, -122608, -345316, -2774, 25715, -8403, -86318, -303020, 56948, -73030, -23998, -460659, 86525]
10572b45079B04907j3362B9081J54068L5454a90912H8117C9436a5121k15673R5446
10561a35348c4154A87962m4837f496B31332o5774d68984b8111k40716J29922G3198
10549a67446q415e2095p5611L5072E8474a72495A96934c5580r8441B03947K23131
10538D27078b51320J19453F8370h3912L5794A89512a1640m68840a13352A7614
10527c33990c0503q4999C01083b9290k54443C2136j3562O4645a16472k36621F1705
10515a19970d160r2788R932j07789A32050o667b95933a4629C17260a23447j46496
10504b69943B41605a12881A78524a52808A64064c23974R4222F2886c285B47303
10493G1621J30941L0075h6136b1471k12690A86974C9733J7726a63115C904J89594
$$ y = [-245079, 204907, 191545, 29081, 183149, 218603, -190912, 88117, 39436, -15121, -230794, -135348, -34154, 187962, 143125, -6496, 231332, 165558, -468984, -28111, -268827, -138905, 73198, -167446, -175861, -52095, -127706, -92634, 58474, -172495, 196934, -35580, -134021, 203947, 427078, -251320, -131867, 68370, -83912, -48118, 189512, -11640, -480480, -113352, 17614, -333990, -30503, -115502, 301083, -29290, -283733, 32136, 18574, 83219, -116472, -353093, 61705, -119970, -4160, -96948, -87016, -194805, 132050, 125383, -295933, -14629, 317260, -123447, -269943, 241605, -112881, 178524, -152808, 164064, -323974, -229752, 62886, -3285, 247303, 71621, 202562, 232637, -86136, -21471, -234161, 186974, 39733, 57459, -163115, 3904, 193498]
10482A93498L13665k43163k4228M2731j28380g1272a4243C02801c3900j34790
10472a68690c9370n19547A2492K12488D8612a54455M2288a0392p8678A2212h1793
10460B01976K882e3310m5307G5134K2362l9876K18147j04330b01632k6710L6621
10449a91721g5828p1169k2736A25318c42712J54797A104d8575B26936F9713K17578
10438B87291a2366j51013B4012a77450L8841I6903J52238a05846j14986R9196
10428a21636l71762B15184J95032G9295a07210C9300a66764j22773G2197c25511
10417b27739j01853i620G2703a98091o8842f0496C6263g3953K6005j71490Q7423
10406a32015B01556a28767b2413j07034k22738a10351a8956k72312A1942J06156
$$ y = [193498, 507163, 264000, 239772, 282503, 154123, -71272, -14243, 302801, -33900, -168690, -39370, -558917, 12492, 224980, 48612, -154455, -112167, -10392, -89070, 12212, -81793, 201976, 204858, -53310, -98617, 75134, 97496, 57620, 275767, 171437, -201632, -228342, -191721, -75828, -146997, -169733, 125318, -342712, -187915, 1104, -48575, 226936, 69713, 287291, -12366, -163379, 24012, -177450, -138609, 96903, 249141, -105846, -220832, -121636, -493398, 215184, 410216, 79295, -107210, 39300, -166764, -289537, 72197, -325511, -227739, -329592, -9620, 72703, -198091, -266933, -60496, 36263, -73953, -47948, -219438, -132015, 201556, -128767, -22413, -129447, -352185, -110351, -18956, -291268, 11942, 118098]
10396A18098c6201A31789b07422C67300j47837C5494a15113j85219O7021C0062
10385f6262E45938F5471i7745B30065M4017B3950Q3970a68823f7797D04382G2690
10373I9515J53140M33045j9752k36224L92417B92169K9898J65393N9986A03180
10362C66955r0718A17513m5367J41441B1835J928K58370n4227l3144K45045m2693
10351C97114J63874J05631r9371J60732j10857A96904P1583J90584n6556E48M87697
10340D88245j65046h0988A22742N4239J49992d3955A46532P1671a05770C56723
10329C23049a47159A2722K5778A6262J67080c7173D0822J12512L76358B03372
10318a69723A27193l5429P9821a99982C1720J51301F0924a46406N8293A60492
$$ y = [118098, -36201, 131789, -207422, 367300, 219463, 35494, -115113, -300332, -233311, 30062, -66262, 545938, 65471, -97745, 230065, 274082, 23950, 107920, -168823, -67797, 404382, 72690, 99515, 252655, 685700, 665948, 429724, 822141, 292169, 322067, 487460, 547446, 103180, 366955, 276237, 117513, 72146, 213587, 21835, 23763, 282133, 227906, 194762, 439807, 397114, 560988, 666619, 567248, 727980, 617123, 196904, 268487, 459071, 402515, 548, 488245, 323199, -80988, 122742, 176981, 326973, -43955, 146532, 218203, -105770, 356723, 323049, -147159, 12722, 38500, 16262, 183342, -37173, 40822, 153334, 529692, 203372, -169723, 127193, 91764, 171585, -199982, 31720, 183021, 60924, -146406, -88113, 160492]
10307a97238A14363b3402j4419A89255L3397b15521A57289J50451A16607J0867
10297A27474m8231L49636D6946j7670k131K8811K4438l3124c32998d6932l0551
10286g7483l16574c4234C10349O689b16880h6304o8970O9674K1547B62431a01709
10274a83643a2709B07264B8171L01443a10800j64509F4702a36503A94032c05466
10263F3860L58181k03301l3225L42455n4788A63258M11895A17644N2722b35998
10252B50745d28186B90777j31781L02403a02742k12446i1043A9142d76624A36901
10241c7443j49945j16615E4357b6268f980A51049a81009P7838o9537n3069d2389
10229a34870q2963H8164b59133f9267j00877A34696a36049B15134C4301K2887
$$ y = [-197238, 114363, -23402, -37821, 189255, 222652, -215521, 157289, 307740, 116607, 127474, 79243, 428879, 46946, 29276, 27145, 55956, 80394, 47270, -332998, -46932, -77483, -394057, -34234, 310349, 317038, -216880, -86304, -155274, -85600, -64053, 262431, -101709, -183643, -12709, 207264, 28171, 329614, -110800, -275309, 64702, -136503, 194032, -305466, 63860, 422041, 218740, 185515, 527970, 473182, 163258, 575153, 117644, 170366, -235998, 250745, -428186, 290777, 158996, 461399, -102742, -315188, -91043, 19142, -476624, 136901, -37443, -187388, -304003, 54357, -26268, -6980, 151049, -181009, -103171, -172708, -225777, -42389, -134870, -217833, 88164, -259133, -69267, -170144, 134696, -136049, 215134, 34301, 57188]
10219E7188d1560l23842a81135B0066L4553b01880q2159A25522K35667c95435
10208H132K15362i1012A6142P8297e28390a4310m0750J6542d82m152C13171E5426
10195A8209a5827q4338A13599i2155k84636A69027a83670A61824m4222B4258J24152
10184A48410E2966J18701a09641j6782N2472k62392B32995a23243A34626l8447
10174I6179b8632k17999A95244b49418J19802I013b04819k7560F766K10538b06342
10162C10099b058k95126E8198N3194B1150a23794N4516j95548e4563E506c62123
10150e0792m3954d6874k43489M1346I1563a93608B68273b98193h8946k69289A40197
10138a43896j14467E531b96476d01j56011j6690H7628b52942l5075J38903D0384
$$ y = [57188, -41560, -365402, -181135, 20066, 54619, -201880, -284039, 125522, 361189, -395435, 8132, 223494, -91012, 16142, 94439, -528390, -14310, -55060, -38518, -482, -4634, 313171, 55426, 18209, -15827, -100165, 113599, -92155, -376791, 169027, -183670, 161824, 117602, 24258, 148410, 52966, 171667, -109641, -126423, -73951, -336343, 232995, -123243, 134626, 96179, -28632, -246631, 195244, -249418, -129616, 9013, -204819, -232379, 6766, 217304, -206342, 310099, -2058, -297184, 58198, 111392, 21150, -123794, -69278, -264826, -54563, 5506, -362123, -50792, -94746, -46874, -290363, -249017, 91563, -193608, 268273, -298193, -88946, -358235, 140197, -143896, -258363, 5531, -296476, -401, -156412, -173102, 87628, -252942, -288017, -149114, 40384]
10126c38264J18582i8881A09197d3346A06884A8569a59519A88820a83965r5492
10116b79457L9257k8088A15614b92969D6178a28548j11945k49481B9321b1683
10105g6562c17k51618H2764K5620a32934j79662F9649j8209e45724a56178A9392
10093E702K81358a05038j26068B42994a46044D6409e7295D4356J1803a15179H3286
10081a96967N0643j29994a10104j01636p9149B68805A6300b27787a7536K432q1671
10070i6775j54831k33089c8660E5139a36989A62928D884i7791a4446j07476J9894
10059a02028A31280g7930F3355a1175l78453b3664B06403p2182a65198C36905
10048a14539l36333a04244k32049B0800J3798J45404A4328h0789j29939j23993
$$ y = [-338264, -219682, -98881, 109197, -43346, 106884, 18569, -159519, 188820, -183965, -279457, -240200, -268288, 115614, -292969, 46178, -128548, -240493, -489974, 29321, -21683, -76562, -317, -251935, 82764, 108384, -132934, -312596, 69649, 51440, -545724, -156178, 19392, 5702, 287060, -105038, -231106, 242994, -146044, 46409, -57295, 44356, 56159, -115179, 83286, -196967, -146324, -276318, -110104, -211740, -290889, 268805, 16300, -227787, -17536, -15104, -96775, -251606, -484695, -38660, 55139, -136989, 162928, 4884, -97791, -14446, -121922, -102028, 131280, -77930, 63355, -11175, -389628, -23664, 206403, 134221, -165198, 336905, -114539, -450872, -104244, -336293, 20800, 34598, 180002, 14328, -80789, -210728, -334721]
10038c34721H2602k818b6903r8621A63389B9062J09300b61477N4628l8069c3902
10026c70422f8117o7048I7424h2537A3056c87175a48892G3471e1397l2955B18767
10014C6020J9974a8592F0899K5660b9874h333m6841j16507g5018k20594B89739
10002b11992B32016B2212a01394j67557I1692K14702f2825P171A3799b53374n3608
9991c06982A17383g9746p874j36196l0817c7662J2706A37633B3907a72797j2086
9980a84883A68200a2580n9539K6564a0473C1097a99716j28280J21380E26435i3156
9968E2854R0158D8994J15804k233B9024a44282E6664d5384D1246L15638c7749
9956b44614i8132j61062B0449a8703A40273a04059B86179G2103C0498a72356K7047
$$ y = [-334721, 82602, 79784, -26903, -125524, 163389, 29062, 138362, -261477, -206849, -244918, -33902, -370422, -68117, -135165, 97424, -82537, 13056, -387175, -148892, 73471, -51397, -84352, 218767, 36020, 55994, -18592, 60899, 86559, -29874, -8333, -55174, -171681, -75018, -295612, 289739, -211992, 232016, 22212, -101394, -268951, 91692, 306394, -62825, -55654, 13799, -253374, -306982, 117383, -79746, -87620, -223816, -254633, -37662, -24956, 137633, 23907, -172797, -184883, 168200, -12580, -72119, -45555, -10473, 31097, -199716, -327996, -206616, 526435, -93156, 52854, 143012, 48994, 164798, 162565, 29024, -144282, 56664, -45384, 41246, 356884, -37749, -244614, -98132, -259194, 20449, -18703, 140273, -104059, 286179, 72103, 30498, -172356, -145309]
9945a45309A17849c37984a34508j4321o550k00050f9446A31394E9628a43553L8187
9934a05366Q505j05964i9353n4784B09667e0175I373L0980a1113l5385r8401l72431
9922e17330e3879p7659d7187a2669D12561A26158b61390a5550N062C9249c9785
9910i245C8914K1363g0911l9367l42151a46062D53331A05362b842B577a75101
9898f4978C02669c70509h5341b3412j50623b808F2571b73047J10135L7580k8003
9887a53335b2840k34058A75181b9226p5105l26622a38405A03809b83623a25271
9876h3964A50646a66512B59450C5391k978d46190a73877E3163b3344j3542A23790
9864b92148A75467K2040d23523d4231B0595a12785l5392A00781b7851k0926j54996
$$ y = [-145309, 117849, -337984, -134508, -148829, -155379, -355429, -69446, 131394, 59628, -143553, -105366, -96861, -202825, -99353, -154137, 209667, -50175, 9373, 40353, -11113, -46498, -144899, -517330, -53879, -131538, -47187, -12669, 412561, 126158, -261390, -15550, -10488, 39249, -39785, -9245, 38914, 60277, -70911, -110278, -452429, -146062, 453331, 105362, -2842, 2577, -175101, -64978, 302669, -370509, -85341, -23412, -174035, -2808, 62571, -273047, -162912, -125332, -153335, -22840, -256898, 175181, -29226, -104331, -430953, -138405, 103809, -283623, -125271, -83964, 150646, -166512, 259450, 35391, 32413, -446190, -173877, 53163, -23344, -36886, 123790, -292148, 175467, 197507, -423523, -44231, 20595, -112785, -148177, 100781, -27851, -48777, -203773]
9853b03773l3607d5371G6901c14176A05621c43461D8227b12047G1034a94569j8107
9842b12676c8735D25921d0956j88277A77891a54165F321i4037q5097A51626E3919
9830e7193p9388C37240a01760J1208j71716J3698B7053d4380A72751a99145j38660
9819c37805A5674i2194n7929c2331D9494M9176A8381J08504c87913a43385A51276
9807A25181k5957g113j03488n2646I5396C1410K91695a50237H8677Q6003e7150
9795b7345l36828A44977a91412j08345n187R1777F2005A2894e28198h8110D4867
9783B8190b01052I2075E346J65860B3146B046N958K9655a85603c8397j15883I8779
9770a87461k36485a84018C6834h9028j20640C80149a0290j60362G1527l473a47882
$$ y = [-203773, -237380, -45371, 76901, -314176, 105621, -343461, 48227, -212047, 71034, -194569, -212676, -38735, 425921, -40956, -229233, 177891, -154165, 6321, -94037, -179134, 151626, 53919, -57193, -136581, 337240, -101760, -90552, -262268, -248570, 27053, -44380, 172751, -199145, -337805, 15674, -92194, -150123, -32331, 49494, 98670, 18381, 126885, -387913, -143385, 151276, 125181, 99224, -7113, -110601, -163247, 95396, 31410, 323105, -150237, 88677, 174680, -57150, -27345, -364173, 144977, -191412, -299757, -304944, -213167, 62005, 12894, -528198, -88110, 44867, 28190, -201052, 92075, 5346, 171206, 23146, 2046, 8004, 37659, -185603, -38397, -154280, 98779, -187461, -423946, -184018, 36834, -89028, -209668, 380149, -10290, -170652, 71527, 68054, -147882]
9758c87403a17403j42906k28237A20520a00642K7049C39Q8388a49721G9000b09249
9746D05i5885k09060D4167b44780L6400L5263P9142A34683l0115d94480A75726
9734f9715n029L2869I5599a13824A205c1779j33696A02512b77808H0924c98297
9722h0853J632j9787q6601L922C21154a10611A17492a60204k73917a00228A47691
9710b57783a16686j27905A07840J01956e43891A30504b56143I678b96620A69486
9699A00660a60797o9289N1609B44948q2258a52431B2253i5027r7359f4975k04644
9688b69619P1805O2256d6931G2625J9261a00393A77092a59045c9782A21047r286
9677A11761J08120b89822H3199f5364J3041l02311L8977C453b21674C21965a58272
$$ y = [-387403, -117403, -260309, -488546, 120520, -100642, -73593, 339, 88727, -149721, 79000, -209249, 405, -95885, -304945, 44167, -244780, -208380, -173117, -93975, 134683, 104568, -494480, 175726, -69715, -74744, -41875, 95599, -113824, 1205, -31779, -165475, 102512, -277808, 80924, -398297, -80853, -79221, -99008, -185609, -181687, 321154, -110611, 117492, -160204, -434121, -100228, 147691, -257783, -116686, -244591, 107840, 209796, -543891, 130504, -256143, 9678, -296620, 169486, 100660, -160797, -230086, -178477, 244948, 162690, -152431, 22253, -95027, -192386, -64975, -269619, -197814, -135558, -46931, 72625, 91886, -100393, 177092, -159045, -39782, 121047, 111761, 219881, -289822, 83199, -65364, -52323, -354634, -315657, 3453, -221674, 321965, -158272]
9665g3945H4564J11877c3716q6037D9655L284a07643C9887a45207j67623I376
9653a76002F6332a73715P1703C2205R5413c0850B0690L0477K38216a58639F841
9641E3016i7478C667a78459B08068a10312k7402n5347B73096c67384h0883A15122
9629D9164K64663F3520L84J569a97621K7994H401c15975j0751c8864H6565A9487
9616c4110q4111n1043r8246a1711p227A31849b74467A41563b51464a01779m902
9605a06681E4226a30011M0133m5378j15506I5187a98941p8062e769A17165b56637
9593B31372A6588J27521E9099i6157j4032j62847L0764M9107j5771n6029a11857
9581A84312f5004A22334d85148C035e4348F7280J68599j15893n6297M9130b72970
$$ y = [-73945, 84564, 196441, -33716, -119753, 49655, 52939, -107643, 39887, -145207, -312830, 9376, -176002, 66332, -173715, -102012, 32205, 127618, -30850, 20690, 51167, 289383, -158639, 6841, 53016, -97478, 3667, -178459, 208068, -110312, -137714, -193061, 273096, -367384, -80883, 115122, 49164, 313827, 63520, 63904, 65473, -197621, -169627, 8401, -315975, -326726, -38864, 86565, 19487, -34110, -118221, -169264, -267510, -11711, -18938, 131849, -274467, 141563, -251464, -101779, -106681, 54226, -130011, -89878, -135256, -250762, 95187, -198941, -277003, -5769, 117165, -256637, 231372, 16588, 144109, 59099, -96157, -110189, -273036, -242272, -193165, -208936, -264965, -111857, 184312, -65004, 122334, -485148, 3035, -54348, 67280, 235879, 119986, 63689, 112819, -272970]
9569b16935g5838A3823L2821b37171e4334l0250m1949j22868C7585a36697j32788
9558b69485g6647B7771a73171b8826k16456B43017j5884J49643b0373j61110k18569
9547d00052a67365j25326A08979J02197a16879E525e3501b3804j87871A8497O222
9536B4719K85873a52219I0730R2111b05768R8511A50897a39014A78791b10329
9525A42289a96401G8040h3158c6316k26972E3214K30309H7900d0908l11610C1178
9513a55377A48231E2944Q8346b74663P5924A76692b9695j49982B57060H8360a27342
9501a05090A57407c94187Q7650a11137k4023l97458a98173B4048b3237B89108
9490b0749A14452k0965J8164a02571A80511c2258A15406a21763R066B12727a45149
$$ y = [-216935, -75838, 13823, 46644, -237171, -54334, -84584, -126533, -249401, 37585, -136697, -269485, -76647, 27771, -173171, -28826, -245282, 243017, 227133, 376776, -20373, -181483, -400052, -167365, -292691, 108979, 211176, -116879, 5525, -53501, -23804, -211675, 18497, 24719, 310592, -152219, 90730, 182841, -205768, -107257, 150897, -139014, 178791, -210329, 142289, -196401, 78040, -83158, -36316, -263288, 53214, 283523, 87900, -40908, -352518, 31178, -155377, 148231, 52944, 141290, -274663, -198739, 176692, -29695, -179677, 257060, 88360, -127342, -105090, 157407, -394187, -306537, -111137, -135160, -532618, -198173, 24048, -23237, 289108, -20749, 114452, 93487, 111651, -102571, 180511, -32258, 115406, -121763, -112697, 212727, -145149]
9478b81420K9579A86743a73422l5571M5658L7374A26506J20229D6702a95846D2547
9466a99951L8349j72248g596j02073c977C4164i1594b0281j92044g288B62222
9454B9536J22407a40822k62003Q4543A20791b25503c2028F4013J58086e75046
9443A08939d73652n7318a10660B941R8382i285m15762K09983A39689b50224J18417
9432a31807m5418m5707k20524a97253K7159O0181F2173J47353a86777D5148g2282
9420H4567g0194E5499e259l12128l7705a3027l68046B71640o5571C3199P6633
9409A09832a68525C7686a89504m9735H3145b10287A25923a97064b4229p7159K2428
9398g8960k8436l18840h8798I6414a6570k08767P3929D6810h7165q5837B0666
$$ y = [-281420, -251841, 186743, -173422, -208993, -163335, -125961, 126506, 246735, 46702, -195846, 42547, -199951, -161602, -333850, -7596, -109669, -3977, 34164, -91594, -20281, -212325, -7288, 262222, 29536, 151943, -140822, -402825, -318282, 120791, -225503, -32028, 64013, 222099, -575046, 108939, -473652, -530970, -110660, 2941, 101323, -9285, -425047, -215064, 139689, -250224, -131807, -177225, -222932, -443456, -197253, -170094, -109913, 62173, 209526, -186777, 45148, -72282, 84567, -70194, 55499, -5259, -317387, -355092, -13027, -381073, 271640, 206069, 33199, 109832, -168525, 37686, -189504, -239239, 83145, -210287, 125923, -197064, -24229, -101388, -78960, -107396, -426236, -88798, 96414, -16570, -225337, -151408, 46810, -87165, -173002, 20666]
9386f7213b5355I3247M142f5353b0737o4680H8099B6325f85902a15227A48207
9374i1306d5467k66553B74973d8111j39539A5040b90925L932B01624D117a56932
9362c27370a42631A06329a57072A53126e7553l5875j58080a330D8961P7345a27339
9350E5855J3252a22576k92633g2927l69046a64472f4969j01276A2855L38742g7568
9338a2610D2149d5168k0343B35457b36976A81881N62b39010i3477p9859a0536
9326A84737c71407F5579c36225d5536l7950o651c4239j01604O2187r7040J2179
9315a58517B18551d0073l9261c6842C00970a03834A22193k0144B3532K9566K13147
9304B66245j3660R8935B3373a19664C40642a28854H20a14797b5955k2499B6338
$$ y = [-67213, -25355, 93247, 97389, -65353, -20737, -85417, 88099, 26325, -685902, -115227, 148207, -91306, -45467, -312020, 274973, -48111, -187650, 15040, -290925, -286993, 201624, 4117, -156932, -327370, -142631, 106329, -157072, 153126, -57553, -93428, -251508, -1330, 48961, 126306, -127339, 55855, 69107, -122576, -415209, -72927, -441973, -164472, -64969, -166245, 12855, 351597, -77568, -12610, 42149, -45168, -65511, 235457, -236976, 181881, 182443, -239010, -93477, -173336, -10536, 184737, -371407, 65579, -336225, -45536, -83486, -90137, -34239, -135843, -73656, -170696, -158517, 218551, -40073, -79334, -36842, 300970, -103834, 122193, 102049, 23532, 53098, 266245, 252585, 351520, 23373, -119664, 340642, -128854, 820, -114797, -25955, -48454, 26338]
9292h1841K2712A05489C8524d3778k93480j1473d8468k24816a15856e4149F4165
9280a20911e8545l7600d4931j15941c6947A3893b14410P2583C5551Q0728A3394
9268D1335a31350D1917e4827j24327D0868b54721j02282G1632j3234a23044q6733
9257b09777g9549j45755O8249O6772k03004r7884a89321b2390D2191d6841A4854
9245a09874p9631P0306B28979d2432n6139l03338A80952a25398D9826K49259a27653
9233a89436k80435A47013a25727E1505P7337k9786B1556e3516j15693A5734K34956
9222B50690b41885a01032d759A06303a83127A97672B7614l187f4294I8934d8783
9210d0017q2243j15044A87150c41218A19154f9568R425k83244B3224b75205D3312
$$ y = [-81841, -59129, 105489, 38524, -43778, -337258, -348731, -48468, -273284, -115856, -54149, 64165, -120911, -58545, -96145, -44931, -160872, -36947, 13893, -214410, -141827, 35551, 116279, 13394, 41335, -131350, 41917, -54827, -179154, 40868, -254721, -357003, 71632, 58398, -123044, -209777, -79549, -225304, -157055, -90283, -293287, -391171, -189321, -22390, 42191, -46841, 14854, -109874, -189505, -119199, 228979, -42432, -98571, -401909, 180952, -125398, 49826, 299085, -127653, -189436, -469871, 147013, -125727, 51505, 128842, 99056, 21556, -53516, -169209, 15734, 250690, -241885, -101032, -4759, 106303, -183127, 197672, 27614, 24427, -64294, 98934, -48783, -40017, -122260, -237304, 187150, -341218, 119154, -69568, -60143, -343387, 23224, -275205, 43312]
9198c38714c5357a3495l16536J44698A69025b58153B46840b61450f4685j24812
9188a89497n6995e5725N415j64390J8487A09741A2617J67130J04865A4992J08
9177A5100a85369d8787J0641B24280b50818M3145F3575c28031f5511M17C61688
9165A14868C0499b33659a1103o7425j26961I7753p96D2454d3669l36239J10007
9154b69901F6281b62640A17442e6957o1896D8944J75623I3945J6480A5044d9175
9142f3408b2584H3874a7998A02664b68751A739h6521I0162b00051f3774r3453
9131a57227O1482j58839A97310O4209C3459b8196J1257j83017j91328E3407K3996
9120G7403J4852c19253j72202e960j49084p2788d554B12328a74843a4473k60330
$$ y = [-338714, -35357, -13495, -330031, -185333, 169025, -258153, 246840, -261450, -64685, -189497, -246492, -55725, -50310, -214700, -196213, 109741, 12617, 179747, 284612, 14992, 15100, -185369, -48787, -38146, 224280, -250818, -207673, 63575, -328031, -65511, -65094, 361688, 114868, 30499, -233659, -11103, -78528, -205489, 97753, 96957, 42454, -43669, -379908, -269901, 66281, -262640, 117442, -56957, -118853, 48944, 224567, 93945, 110425, 15044, -49175, -63408, -22584, 83874, -17998, 102664, -268751, 1739, -86521, 90162, -200051, -63774, -157227, -95745, -254584, 197310, 261519, 33459, -28196, -16939, -199956, -391284, 53407, 77403, 92255, -319253, -491455, -5960, -155044, -227832, -4554, 212328, -174843, -14473, -274803]
9109b74803P6166N6124k31454B5144b66386D2583b77594A24323C3951d00731d3425
9097f1189j03724d2213m26017J46044a21230P325c9624B59557b17272C11878f168
9085a93991a1323A20516j8183a92455a7469m6593k14237a02750j25679Q0657k36230
9074c84002A29466d7042I239J2799J29811G0765e7459A06462J46944b56342B09808
9062B43886A14765c7591k44965q9727I841g1478J2560G1753J31850N5398m9980
9051B09021g8694P45H416d1527m8711J2616j7308c1136j81255a04164p1380I969
9038a9594j00199G2305a29270B21390k4258a99258A21118f2694K2419j99121M5140
9027a94256e3530B552b43040E2275a69380H729J201L476K5578c29024H2694b46953
$$ y = [-274803, -198637, -142513, -373967, 25144, -266386, 42583, -277594, 124323, 33951, -400731, -43425, -61189, -164913, -42213, -468230, -322186, -121230, -113905, -39624, 259557, -217272, 311878, -6168, -193991, -11323, 120516, 102333, -192455, -17469, -64062, -278299, -102750, -228429, -147772, -384002, 129466, -47042, 9239, 22038, 151849, 70765, -57459, 106462, 253406, -256342, 209808, 243886, 114765, -37591, -282556, -372283, 9841, -71478, -58918, 71753, 203603, 259001, 209021, -78694, -77949, 8416, -41527, -90238, -77622, -94930, -31136, -212391, -104164, -175544, 9969, -19594, -119793, 72305, -129270, 221390, 197132, -199258, 121118, -62694, -40275, -239396, -194256, -53530, 2552, -243040, 52275, -169380, 8729, 9930, 13406, 38984, -329024, 82694, -246953]
9014c85189A55696C0221e7456E1513e1267K3236k480F5541b6002A06509f1254
9002h4884B2188b60555J25310A19065a93941B3464I610b13144e8262B40509d2218
8990F1314c40110A31192a80285d6499B42379e9737l76942B41737n0463A238a39240
8978d4064m0720k15926J46391k1661M1380E2734a26080j10583f3009m1512k31383
8967c35904F5505l1276a67874c0079k07857A02888a75627L2207l30358B32038
8956B42827g9075K190D9279K24885M1320i6525F7832b22042f6993B4725A1356
8944A59123b5791B62848c4421D17107j23319I8775e8607A04512b04708B58900
8933c5305C8455b9018A44388J2869B8584L22189G5199Q8034K50017O93524K396276
$$ y = [-385189, 155696, 30221, -57456, 51513, -51267, -28031, -30511, 65541, -26002, 106509, -61254, -84884, 22188, -260555, -135245, 119065, -193941, 23464, 9610, -213144, -58262, 240509, -42218, 61314, -340110, 131192, -180285, -46499, 242379, -59737, -436679, 241737, 191274, 1238, -139240, -44064, -84784, -300710, -154319, -175980, -134600, 52734, -126080, -236663, -63009, -104521, -335904, 65505, 34229, -167874, -30079, -237936, 102888, -175627, -143420, -473778, 232038, 242827, -79075, -76885, 49279, 274164, 315484, -96525, 67832, -222042, -66993, 24725, 11356, 159123, -25791, 262848, -34421, 417107, 293788, 98775, -58607, 104512, -204708, 258900, -35305, 38455, -29018, 144388, 157257, 28584, 350773, 75199, 163233, 413250, 1106774, 3503050]
8922C503050Q773066l415904B132216H43400C90914j04169K57059A890i8002A84621
8911i9187A10434J76900a0724C74607D952b02376c5292a664k45939A09009h0130
8899d16450B0459P5676L1447L59529a77575L0540I3429R1966o6929j6844C1219
8887A9049c29054B6941J7466k1280Q3875b87360b5014O710A7048f1296C65861
$$ y = [3503050, 12276116, 8860212, 2132216, 843400, 390914, 286745, 543804, 1890, -98002, 184621, -99187, 110434, 287334, -10724, 374607, 4952, -202376, -35292, -1664, -247603, 109009, -80130, -416450, 20459, 96135, 127582, 487111, -177575, -147035, 93429, 185395, 118466, 101622, 31219, 19049, -329054, 26941, 44407, 23127, 107002, -287360, -25014, -18304, 17048, -61296, 365861]
$$ [...]
##END NTUPLES=NMR SPECTRUM
##END=
