
##TITLE=AC1365_HAWAS12179_7155411_SWLinPkv4v
##JCAMPDX= 6.0         $$ Bruker NMR JCAMP-DX V2.0
##DATA TYPE= NMR SPECTRUM
##DATA CLASS= NTUPLES
##ORIGIN= BRUKER
##OWNER= Administrator
$$ 1.72 TOPSPIN		Version 2.1
$$ 2012-11-30 20:08:56.234 -0500  Administrator@X
$$ Compression mode = diff/dup
##.OBSERVE FREQUENCY= 400.02188249412
##.OBSERVE NUCLEUS= ^1H
##.ACQUISITION MODE= SIMULTANEOUS (DQD)
##.ACQUISITION SCHEME= undefined
##.AVERAGES= 64
##.DIGITISER RES= 22
##SPECTROMETER/DATA SYSTEM= spect
##.PULSE SEQUENCE= noesygpps1d.comp
##.SOLVENT NAME= COFFEE_meoh
##.SHIFT REFERENCE= INTERNAL, COFFEE_meoh, 1, 14.9608
##AUDIT TRAIL= $$ (NUMBER, WHEN, WHO, WHERE, PROCESS, VERSION, WHAT)
$$ ##TITLE= Audit trail, TOPSPIN		Version 2.1
$$ ##JCAMPDX= 5.01
$$ ##ORIGIN= Bruker BioSpin GmbH
$$ ##OWNER= Administrator
$$ $$ E:\/data/COFFEE/nmr/AC1365_HAWAS12179_7155411_SWLinPkv4v/12/pdata/1/auditp.txt
$$ ##AUDIT TRAIL=  $$ (NUMBER, WHEN, WHO, WHERE, PROCESS, VERSION, WHAT)
(   1,<2012-11-30 20:08:48.342 -0500>,<Administrator>,<X>,<go>,<TOPSPIN 2.1>,
      <created by zg
	started at 2012-11-30 19:57:17.249 -0500,
	POWCHK enabled, PULCHK disabled,
       configuration hash MD5:
       86 BA 57 50 F2 9D 5C 9B 26 00 A9 28 5F 66 2E 89
       data hash MD5: 64K
       43 8B B6 AB 15 A0 56 7C 9D 32 D7 7C D2 7E 1E 10>)
(   2,<2012-11-30 20:08:52.427 -0500>,<Administrator>,<X>,<proc1d>,<TOPSPIN 2.1>,
      <Start of raw data processing
       efp LB = 0.3 FT_mod = 6 PKNL = 1 PHC0 = 0 PHC1 = 0 SI = 128K 
       data hash MD5: 128K
       4D 8D 84 BC 50 44 01 F2 F0 4A 80 28 05 03 54 31>)
(   3,<2012-11-30 20:08:53.894 -0500>,<Administrator>,<X>,<proc1d>,<TOPSPIN 2.1>,
      <pk PHC0 = -81.16699 PHC1 = 0 
       data hash MD5: 128K
       5C B8 65 7E B7 34 92 39 D1 D1 D9 B6 C9 0D 10 B2>)
(   4,<2012-11-30 20:08:54.899 -0500>,<Administrator>,<X>,<proc1d>,<TOPSPIN 2.1>,
      <abs ABSG = 1 
       data hash MD5: 128K
       FC 4C 40 F5 07 09 15 61 FB 5E AC BC 00 8C 3D F7>)
(   5,<2012-11-30 20:08:55.184 -0500>,<Administrator>,<X>,<proc1d>,<TOPSPIN 2.1>,
      <abs ABSG = 2 
       data hash MD5: 128K
       84 DB BD 1F 4D E4 9D 7A 43 FB 2F 98 EE 38 66 38>)
(   6,<2012-11-30 20:08:55.379 -0500>,<Administrator>,<X>,<proc1d>,<TOPSPIN 2.1>,
      <abs ABSG = 3 
       data hash MD5: 128K
       1C 64 44 C7 F2 F2 A2 0B 3F 69 05 2E 2C A7 DC D5>)
(   7,<2012-11-30 20:08:55.604 -0500>,<Administrator>,<X>,<proc1d>,<TOPSPIN 2.1>,
      <abs ABSG = 4 
       data hash MD5: 128K
       03 49 76 4E CB C2 37 25 C3 C2 E7 E3 44 88 86 5A>)
(   8,<2012-11-30 20:08:55.814 -0500>,<Administrator>,<X>,<proc1d>,<TOPSPIN 2.1>,
      <abs ABSG = 5 
       data hash MD5: 128K
       7A D8 24 AE 09 DC B4 A3 63 79 4E 17 C5 FC 22 46>)
$$ ##END=
$$ 
$$ $$ hash MD5
$$ $$ FF CA C7 3A 59 67 8C 29 C6 7C 5C 68 3C 89 7C 98
##$RELAX= 
##$RELAX= 
##$RELAX= 
##$RELAX= 
##$RELAX= 
##$RELAX= 
##$RELAX= 
##$RELAX= 
$$ Bruker specific parameters
$$ --------------------------
##$DU= <E:\>
##$EXPNO= 12
$$ [...]
150 150 150 150 150 150 150 150
##$TP07= 0
##$TPNAME0= <>
##$TPNAME1= <>
##$TPNAME2= <>
##$TPNAME3= <>
##$TPNAME4= <>
##$TPNAME5= <>
##$TPNAME6= <>
##$TPNAME7= <>
##$TPOAL= (0..7)
0.5 0.5 0.5 0.5 0.5 0.5 0.5 0.5
##$TPOFFS= (0..7)
0 0 0 0 0 0 0 0
##$TUNHIN= 0
##$TUNHOUT= 0
##$TUNXOUT= 0
##$USERA1= <user>
##$USERA2= <user>
##$USERA3= <user>
##$USERA4= <user>
##$USERA5= <user>
##$V9= 5
##$VALIST= <valist>
##$VCLIST= <CCCCCCCCCCCCCCC>
##$VD= 0
##$VDLIST= <DDDDDDDDDDDDDDD>
##$VPLIST= <PPPPPPPPPPPPPPP>
##$VTLIST= <TTTTTTTTTTTTTTT>
##$WBST= 1024
##$WBSW= 4
##$XGAIN= (0..3)
0 0 0 0
##$XL= 0
##$YL= 0
##$YMAX_a= 6772451
##$YMIN_a= -13138312
##$ZGOPTNS= <>
##$ZL1= 120
##$ZL2= 120
##$ZL3= 120
##$ZL4= 120
##$ABSF1= 14.9608
##$ABSF2= -5.597382
##$ABSG= 5
##$ABSL= 3
##$ALPHA= 0
##$AQORDER= 0
##$ASSFAC= 0
##$ASSFACI= 0
##$ASSFACX= 0
##$ASSWID= 0
##$AUNMP= <proc_prof1d_extract.lims>
##$AXLEFT= 0
##$AXNAME= <>
##$AXNUC= <1H>
##$AXRIGHT= 0
##$AXTYPE= 0
##$AXUNIT= <>
##$AZFE= 0.1
##$AZFW= 0.1
##$BCFW= 0
##$BC_mod= 0
##$BYTORDP= 0
##$COROFFS= 0
##$CY= 15
##$DATMOD= 1
##$DC= 0
##$DFILT= <>
##$DTYPP= 0
##$F1P= 0
##$F2P= 0
##$FCOR= 0.5
##$FTSIZE= 131072
##$FT_mod= 6
##$GAMMA= 0
##$GB= 0
##$INTBC= 1
##$INTSCL= 1
##$ISEN= 128
##$LB= 0.3
##$LEV0= 0
##$LPBIN= 0
##$MAXI= 10000
##$MC2= 0
##$MEAN= 0
##$ME_mod= 0
##$MI= 0
##$NCOEF= 0
##$NC_proc= -2
##$NLEV= 6
##$NOISF1= 0
##$NOISF2= 0
##$NSP= 0
##$NTH_PI= 0
##$NZP= 0
##$OFFSET= 14.9608
##$PC= 1
##$PHC0= -81.16699
##$PHC1= 0
##$PH_mod= 1
##$PKNL= yes
##$PPARMOD= 0
##$PPDIAG= 0
##$PPIPTYP= 0
##$PPMPNUM= 2147483647
##$PPRESOL= 1
##$PSCAL= 4
##$PSIGN= 0
##$PYNMP= <proc.py>
##$REVERSE= no
##$SF= 400.020009714671
##$SI= 131072
##$SIGF1= 0
##$SIGF2= 0
##$SINO= 400
##$SIOLD= 131072
##$SPECTYP= <>
##$SREGLST= <1H.CDCl3>
##$SSB= 0
##$STSI= 131072
##$STSR= 0
##$SW_p= 8223.68421052631
##$SYMM= 0
##$S_DEV= 0
##$TDeff= 65536
##$TDoff= 0
##$TI= <>
##$TILT= no
##$TM1= 0
##$TM2= 0
##$TOPLEV= 0
##$USERP1= <user>
##$USERP2= <user>
##$USERP3= <user>
##$USERP4= <user>
##$USERP5= <user>
##$WDW= 1
##$XDIM= 131072
##$YMAX_p= 444567748
##$YMIN_p= -18052
##$CURPLOT= <Network HP LaserJet P1505>
##$CURPRIN= <$Network HP LaserJet P1505>
##$DFORMAT= <normdp>
##$LAYOUT= <+/1D_H.xwp>
##$LFORMAT= <normlp>
##$PFORMAT= <normpl>
##$SURQMSG= 1
$$ End of Bruker specific parameters
$$ ---------------------------------
##NTUPLES= NMR SPECTRUM
##VAR_NAME=  FREQUENCY,     SPECTRUM/REAL,   SPECTRUM/IMAG
##SYMBOL=    X,             R,               I
##VAR_TYPE=  INDEPENDENT,   DEPENDENT,       DEPENDENT
##VAR_FORM=  AFFN,          ASDF,            ASDF
##VAR_DIM=   131072,        131072,          131072
##UNITS=     HZ,            ARBITRARY UNITS, ARBITRARY UNITS
##FACTOR=    0.0627417313425164, 1,          1
##FIRST=     8223.62146879497, -3634,        -60754
##LAST=      0,             -2538,           -61880
##MIN=       0,             -18052,          0
##MAX=       8223.62146879497, 444567748,    0
$$ Real data points
##PAGE= N=1
##DATA TABLE= (X++(R..R)), XYDATA
$$ [...]
63932C323596K34717K27378K13762J93949J68996J40094J08266P4605M0185N517
63922D731065k9379o4297r8487j30932j60415j85282k03829k15413k21054k22595
63912C199382k21408k17879k11796k02917j91399j77969j63616j49016j34394
63903A528988j20001j06359r3789q2040p0825o0529n1869m4943l9070l3594k8414
63892G97555k3687j9511j6116j3871j2719j1880j0542q632o606m681k723p03J228
63879F67112L084N061P115R026J0936J3439J6821K0608K4154K7404L0666L3816
63867H69242L6206L7384L7637L7678L7935L8194L7864L6516L4159L1035K7281
63856A261131K2988J8435J3925R363M430q06n832j0491j5229k0209k4672k7860
$$ plain form
63932 3323596 3558313 3785691 3999453 4193402 4362398 4502492 4610758 4685363 4725548 4731065
63922 4731065 4701686 4637389 4538902 4407970 4247555 4062273 3858444 3643031 3421977 3199382
63912 3199382 2977974 2760095 2548299 2345382 2153983 1976014 1812398 1663382 1528988
63903 1528988 1408987 1302628 1208839 1126799 1055974 995445 943576 898633 859563 825969 797555
63892 797555 773868 754357 738241 724370 711651 699771 689229 680597 673991 669310 666587 665884 667112
63879 667112 670196 675257 682372 691398 702334 715773 732594 753202 777356 804760 835426 869242
63867 869242 905448 942832 980469 1018147 1056082 1094276 1132140 1168656 1202815 1233850 1261131
63856 1261131 1284119 1302554 1316479 1325842 1330272 1329466 1323634 1313143 1297914 1277705 1253033 1225173
63844A225173l0206l2738l5537l7640l8638l9415m0900m2755m3915m3888m3007
63833G96534m1654l9957l8022l5957l3604l0737k7637k5001k3197k1866k0438
63822D58464j8756j7026j5356j3710j2247j1363j1169j1126j0511r298q283q105
63810C11514q386q169p068n643m585l988l537l111k842k783k763k575k143j564
63796B52357j031p55q68j441k390l244l265k227j015q63j933l088l259k527j567
63781B22884o90O5L98P6m76o12m08m60q38r40n23r7q7k27j74j29l65n99m39j37
63761B16222k86q83j283j122p16m25j31L74P65M24p88k220k948k539j307N9J035
63744B04231J520J633J463J081P43P71J147J422J285J072J411K298K983K899K403
$$ plain form
63844 1225173 1194967 1162229 1126692 1089052 1050414 1010999 970099 927344 883429 839541 796534
63833 796534 754880 714923 676901 640944 607340 576603 548966 523965 500768 478902 458464
63822 458464 439708 422682 407326 393616 381369 370006 358837 347711 337200 327902 319619 311514
63810 311514 303128 294959 287891 282248 277663 273675 270138 267027 264185 261402 258639 256064 253921 252357
63796 252357 251326 250571 249703 248262 245872 242628 239363 237136 236121 235258 233325 230237 226978 224451 222884
63781 222884 222194 222259 222657 222733 222257 221645 221237 220777 219939 218999 218476 218379 218292 218065 217891 217762 217397 216798 216359 216222
63761 216222 215936 215053 213770 212648 211932 211507 211376 211750 212515 212939 212151 209931 206983 204444 203137 203196 204231
63744 204231 205751 207384 208847 209928 210671 211442 212589 214011 215296 216368 217779 220077 223060 225959 228362
63729B28362K171K197J929J391J369K285L443L987M079M475N229N584N209M717
63715B76427M743N065N091M621L766K509R22n43j474k092k840l595l858l624l415
63700B81703l360k919j826o35j1R4Q1qk71l42L23J581K652L082L117L080K951
63683B89292K824L142M006M630M151K795J681J383J333P65k09q66q63m69J1O03
63667C14209J390K217K801K949K623K023J538J378J171L27j094k259k593k519
63653C24161k813l541m203m619n058n505n541n049m400l769k869j664p03k86M4
63638B74185O65J069O15k33l14P63K204L114L280K961K544K523L227M366N322
63623C06291N931O482P005P217P202P477Q192Q973R756J1002J2718J4146J4871
$$ plain form
63729 228362 230533 232730 234659 236050 237419 239704 243147 247134 251213 255688 260917 266501 271710 276427
63715 276427 281170 286235 291326 295947 299713 302222 303144 302601 301127 299035 296195 292600 288742 285118 281703
63700 281703 278343 275424 273598 272963 272952 273046 273127 273119 272848 272506 272829 274410 277062 280144 283261 286341 289292
63683 289292 292116 295258 299264 303894 308045 310840 312521 313904 315237 316002 315793 314927 314064 313595 313606 314209
63667 314209 315599 317816 320617 323566 326189 328212 329750 331128 332299 332626 331532 329273 326680 324161
63653 324161 321348 317807 313604 308985 303927 298422 292881 287832 283432 279663 276794 275130 274427 274141 274185
63638 274185 274850 275919 276534 276301 275987 276750 278954 282068 285348 288309 290853 293376 296603 300969 306291
63623 306291 312222 318704 325709 332926 340128 347605 355797 364770 374526 385528 398246 412392 427263
63610D27263J5546J6799J8183J9036J9857K1755K4726K7405K8621K8442K7587
63599F75220K6365K4438K1226J6492J0786N272Q51k442m899o373o583n934n386
63586G49033n588o685q806j1998j5633j8648k0609k1941k2991k3416k2803k1391
63574E48524j9718j7936j5780j3091j0153p589n925n000l958k128J50J927K807
63561D52130L237L792M736O253Q378J0475J1541J1356J0852J1009J1852J2862
63549E58473J3875J5189J7142J9897K3334K6961L0405L4093L8617M3005M4375
63538H65366M0281L1137J9786R031J79o480j0893j3159j3489j2022r072n619l116
63525H91930k550l944o708j0263j4318j8916k4167k9637l4102l6373l6349l4937
$$ plain form
63610 427263 442809 459608 477791 496827 516684 538439 563165 590570 619191 647633 675220
63599 675220 701585 726023 747249 763741 774527 779799 780650 778208 773309 766936 760353 754419 749033
63586 749033 743445 736760 727954 715956 700323 681675 661066 639125 616134 592718 569915 548524
63574 548524 528806 510870 495090 481999 471846 464257 458332 453332 449374 447246 447396 449323 452130
63561 452130 455367 459159 463895 470148 478526 489001 500542 511898 522750 533759 545611 558473
63549 558473 572348 587537 604679 624576 647910 674871 705276 739369 777986 820991 865366
63538 865366 905647 936784 956570 965601 965780 959300 948407 935248 921759 909737 900665 895046 891930
63525 891930 889380 885436 878728 868465 854147 835231 811064 781427 747325 710952 674603 639666
63513F39666l3019l0959k9006k7447k6014k3837k0499j6868j4301j3104j2297
63502C92315j0863q812o895n688n233n280n459n285m442l168k111j656j541j318
63488C24564r48o54m08R6R49J808K225K028J413Q76R64J876L239M483N331N798
63472C53640N876N509M839M081L216K112Q05o74k502m637o363o933o590o233o114
63457C40032n629m501l283k414j705j067r10j247j242l79P42J438K111L429M999
63442C30374N966O509P586R348J0939J1956J3076J4975J7509K0291K3432K7211
63430D99172L1390L5087L7009L5824L0889K2932J3811N452q68m500n376m116j649
63417F95057J551N600J0548J5928K1059K5511K9104L1701L3082L2886L0723K6488
$$ plain form
63513 639666 606647 575688 546682 519235 493221 469384 448885 432017 417716 404612 392315
63502 392315 381452 372640 365745 360057 354824 349544 344085 338800 334358 331190 329079 327423 325882 324564
63488 324564 323616 322962 322554 322650 323599 325407 327632 329660 331073 331949 332913 334789 338028 342511 347842 353640
63472 353640 359516 365025 369864 373945 377161 379273 380078 379404 376902 372265 365902 358969 352379 346146 340032
63457 340032 334403 329902 326619 324205 322500 321433 320523 319276 318034 317655 318397 319835 321946 325375 330374
63442 330374 336340 342849 350435 359783 370722 382678 395754 410729 428238 448529 471961 499172
63430 499172 530562 565649 602658 638482 669371 692303 706114 711566 710698 706198 700822 696706 695057
63417 695057 696608 702208 712756 728684 749743 775254 804358 836059 869141 902027 932750 959238
63405I59238K0538J3496O162l17m745o846p584q050q403q399q503r654j2213j5859
63391I08861k0307k5219k9659l2631l4127l4752l4410l2495k9423k6682k5024
63380E84132k3693k1863j9702j7451j4672j1235q061n912m212k073K57K007L335
63367D60857M926O604P656Q383R926J2433J4577J5360J5522J6621J9300K2837
63355F15002K6015K8092K9298L0543L2400L4255L4871L3775L1495K8451K4323
63344I48520J8867J2649O425M13n195r395j1011j0203q610p779q010r030j1103
63331I06538j4776j9694k4499k8077l0381l1773l2061l0764k8056k4805k1601
63320F20051j8303j4657j0715o427j493L605O749N396j002j0066j8205k3066k4430
$$ plain form
63405 959238 979776 993272 999434 999117 994372 987526 979942 971892 963489 955090 946587 936933 924720 908861
63391 908861 888554 863335 833676 801045 766918 732166 697756 665261 635838 609156 584132
63380 584132 560439 538576 518874 501423 486751 475516 467455 461543 457331 455258 455515 457522 460857
63367 460857 465783 472387 480043 488426 498352 510785 525362 540722 556244 572865 592165 615002
63355 615002 641017 669109 698407 728950 761350 795605 830476 864251 895746 924197 948520
63344 948520 967387 980036 986461 986874 981679 972284 961273 951070 942460 934681 926671 917641 906538
63331 906538 891762 872068 847569 819492 789111 757338 725277 694513 666457 641652 620051
63320 620051 601748 587091 576376 569949 568456 572061 578810 584206 583204 573138 554933 531867 507437
63307E07437k3386k1256j8988j6986j5142j3208j1250r650q611p893p125o237
63295C47705n433m840m388l964l528l076k664k391k163j687r92p81j689l185l876
63280C03048l215k191j914k132j878j050m01k14M1O35J152J282J256J212R50O67
63264B97248J066K183K859K165Q23L12R21J638J805J911K547L408L860L897M032
63249C30675M439M766M768M759N249O327P555Q448Q872R049R338J0070J1336J2818
63235D38469J4037J4986J6214J7977J9595K0265K0301K0820K2104K3060K2644
63224F50472K1192J9945J9702K0388K1451K2221K2291K2040K2427K3771K5039
63213H90939K4895K3134K0521J7563J4098R974N341K71n246j0942j6393k1481
$$ plain form
63307 507437 484051 462795 443807 426821 411679 398471 387221 377571 368960 361067 353942 347705
63295 347705 342272 337432 333044 329080 325552 322476 319812 317421 315258 313571 312579 311798 310109 306924 303048
63280 303048 299833 297642 295728 293596 291718 290668 290267 290053 290094 290729 291881 293163 294419 295631 296581 297248
63264 297248 298314 300497 303356 305521 306344 306656 307577 309215 311020 312931 315478 318886 322746 326643 330675
63249 330675 335114 339880 344648 349407 354656 360983 368538 376986 385858 394907 404245 414315 425651 438469
63235 438469 452506 467492 483706 501683 521278 541543 561844 582664 604768 627828 650472
63224 650472 671664 691609 711311 731699 753150 775371 797662 819702 842129 865900 890939
63213 890939 915834 938968 959489 977052 991150 1001124 1006465 1006736 1001490 990548 974155 952674
63201I52674k6131k9624l0994l0242k8525k6821k4996k2414j8895j4713j0189
63190F89130n746j854J494M940Q895J2881J6203J8887K1430K3926K6100K8022
63178H44308L0005L1778L2535L2068L1228L0969L1369L1947L2404L2628L2304
63167A193543L1109K9042K6111K1858J5802Q315M08p373j5262k3334l0974l7676
63155A211569m3661m9096n3151n4732n3957n2137n0175m7736m4235l9935l5634
63144F87120l1729k8106k4738k1870j9636j7848j6162j4312j2222j0108q367p195
63132D74827o315n332m212l288k771k528k351k253k309k328j899q37N02J517J942
63117D42365J996J994K061K256K622K950K852K353K145K764L774M239L870L158
$$ plain form
63201 952674 926543 896919 865925 835683 807158 780337 755341 732927 714032 699319 689130
63190 689130 683384 681530 683024 687964 696859 709740 725943 744830 766260 790186 816286 844308
63178 844308 874313 906091 938626 970694 1001922 1032891 1064260 1096207 1128611 1161239 1193543
63167 1193543 1224652 1253694 1279805 1301663 1317465 1325780 1326188 1318815 1303553 1280219 1249245 1211569
63155 1211569 1167908 1118812 1065661 1010929 956972 904835 854660 806924 762689 722754 687120
63144 687120 655391 627285 602547 580677 561041 543193 527031 512719 500497 490389 482022 474827
63132 474827 468512 463180 458968 455680 452909 450381 448030 445777 443468 441140 439241 438404 438906 440423 442365
63117 442365 444361 446355 448416 450672 453294 456244 459096 461449 463594 466358 470132 474371 478241 481399
63103D81399K542K074J874K078K303J848P12k67n33l86j83K43Q78J023K60o79
63087D95186p86n6P95J472K079K330J803Q73N17J083J969K625L085L570M166N078
63071E25789O417P665Q068P792P923R064J0596J1743J2590J3598J4741J5811J7071
63058F68868J8894K1025K2968K4905K7435L0475L3173L5148L7087L9714M2728
63047A002420M5256M7049M8592N0142N1313N1781N1876N2098N2451N2631N2662
63036A558271N2856N3269N3733N4395N5612N7075N7572N5939N1872M5513L6836
63025B132943K5971J3797J498j0413k2113l3634m4396n3591o0589o5012o6858
63014A817603o6529o4406o0514n4908m8220m1218l3887k5664j6611p717K36P492
$$ plain form
63103 481399 483941 486015 487889 489967 492270 494118 494830 494563 494030 493644 493461 493704 494582 495605 495865 495186
63087 495186 494400 494344 495139 496611 498690 501020 502823 503696 504213 505296 507265 509890 512975 516545 520711 525789
63071 525789 532206 539871 547939 555731 563654 572718 583314 595057 607647 621245 635986 651797 668868
63058 668868 687762 708787 731755 756660 784095 814570 847743 882891 919978 959692 1002420
63047 1002420 1047676 1094725 1143317 1193459 1244772 1296553 1348429 1400527 1452978 1505609 1558271
63036 1558271 1611127 1664396 1718129 1772524 1828136 1885211 1942783 1998722 2050594 2096107 2132943
63025 2132943 2158914 2172711 2174209 2163796 2141683 2108049 2063653 2010062 1949473 1884461 1817603
63014 1817603 1751074 1686668 1626154 1571246 1523026 1481808 1447921 1422257 1405646 1397929 1398165 1405657
63002A405657J4749K2253K9802L7038M3397M8168N1237N3443N5663N7787N9099
62991A878293N9526N9792O0365O0897O0928O0525N9728N7742N3333M6073L6698
62980B493900K6083J4255P48j4399l0399m6299o1285p4510q5254r3484r9692j03836
62968A925828j05044j02915r8603r3839q9043q3343p6396o9236o2951n7318n1447
62957A035693m5350m0093l6498l4183l2044k9357k6307k3644k1914k1005k0369
62946G04929j9635j8873j8300j7880j7303j6246j4628j2796j1426j1041j1411
62935E35390j1642j1020r668q345p616p379p117o544n906n630n679n468m574l286
62921D35516k270j787j598j461j334j132p74n47r22j873k687k800k405k028j819
$$ plain form
63002 1405657 1420406 1442659 1472461 1509499 1552896 1601064 1652301 1705744 1761407 1819194 1878293
62991 1878293 1937819 1997611 2057976 2118873 2179801 2240326 2300054 2357796 2411129 2457202 2493900
62980 2493900 2519983 2534238 2534986 2520587 2490188 2443889 2382604 2308094 2222840 2129356 2029664 1925828
62968 1925828 1820784 1717869 1619266 1525427 1436384 1353041 1276645 1207409 1144458 1087140 1035693
62957 1035693 990343 950250 913752 879569 847525 818168 791861 768217 746303 725298 704929
62946 704929 685294 666421 648121 630241 612938 596692 582064 569268 557842 546801 535390
62935 535390 523748 512728 503060 494715 487099 479720 472603 466059 460153 454523 448844 443376 438802 435516
62921 435516 433246 431459 429861 428400 427066 425934 425160 424613 423691 421818 419131 416331 413926 411898 410079
62906D10079j643j603j921k447k704k515k213k057j863j362o94k45r1J4J73K16
62890C89124J19J94N52P33L27k58k32M54J035J120J238J755K025J260j48r70o74
62873C97654J65R07J564K283K760K516J534K57p79j299j452j615j904j920j302
62858C99369k88N52J030J304J332R03J83l13k84K05J049J977K292J567N50N37
62842D11965J637K542K332J572J226J303J304J224J291J248P41J11nL77P18Q51
62826D30437J083J514J920K237K605K905K846K489K195K010J626J057Q10J247
62812D56981K063K683K893K984L341L984M515M546M209M070M409M947N434O081
62798E13140P112Q223R028R778J1004J2592J3841J4443J4850J5587J6787J8463
$$ plain form
62906 410079 408436 406833 404912 402465 399761 397246 395033 392976 391113 389751 389057 388812 388721 388735 388908 389124
62890 389124 389243 389437 389989 390722 391049 390791 390559 391013 392048 393168 394406 396161 398186 399446 399298 398328 397654
62873 397654 397819 398726 400290 402573 405333 407849 409383 409640 408861 407562 406110 404495 402591 400671 399369
62858 399369 399081 399633 400663 401967 403299 404202 404385 404072 403788 403993 405042 407019 409311 410878 411428 411965
62842 411965 413602 416144 418476 420048 421274 422577 423881 425105 426396 427644 428385 428496 428491 428868 429586 430437
62826 430437 431520 433034 434954 437191 439796 442701 445547 448036 450231 452241 453867 454924 455734 456981
62812 456981 459044 461727 464620 467604 470945 474929 479444 483990 488199 492269 496678 501625 507059 513140
62798 513140 520252 528475 537503 547281 558285 570877 584718 599161 614011 629598 646385 664848
62786F64848K0775K3720K7013L0571L4653L9325M4168M8877N3836N9610O6016
62775A113412P2226P7670Q2442Q6614Q9650R0735Q9509Q6018Q0053P0972N8545
62764A997846M3659K7848J2095l579j9251l4281m7625n8790o8056p5685q1273
62753A692908q4123q4207q2421p9833p6828p3212o8949o4385n9769n4994n0120
62742I14067m5630m1797l8134l4035k9705k5907k2940k0524j8508j6890j5184
62731F04813j2680r599p138n904n115l823k143o59O77K181L500M056M159M802
62717E77127O376Q327J0064J1485J2653J3672J4961J7022J9738K2472K4997K7796
62705G66690L1269L5210L9291M3651M8666N4434O0803O7699P5145Q2987R0755
$$ plain form
62786 664848 685623 709343 736356 766927 801580 840905 885073 933950 987786 1047396 1113412
62775 1113412 1185638 1263308 1345750 1432364 1522014 1612749 1702258 1788276 1868329 1939301 1997846
62764 1997846 2041505 2069353 2081448 2077869 2058618 2024337 1976712 1917922 1849866 1774181 1692908
62753 1692908 1608785 1524578 1442157 1362324 1285496 1212284 1143335 1078950 1019181 964187 914067
62742 914067 868437 826640 788506 754471 724766 698859 675919 655395 636887 619997 604813
62731 604813 592133 582534 575396 569492 564377 560554 558411 557752 558429 560610 564110 568166 572325 577127
62717 577127 583503 591830 601894 613379 626032 639704 654665 671687 691425 713897 738894 766690
62705 766690 797959 833169 872460 916111 964777 1019211 1080014 1147713 1222858 1305845 1396600
62694A396600R7874J04052J09429J14185J17796J18981J16592J10372J00648Q7654
62684B474183P1596N3021L2563J0553j2517l5257n5917p3724q8978j01719j11065
62673B162739j16273j17872j17144j14884j11101j05699r8979r1474q3707p6096
62663A129510o8953o2495n6796n1709m6881m2036l7284l2954k9261k6262k3963
62652F50916k2116k0071j7429j4790j3255j3056j3180j2626j1475j0435r758r105
62640D83620q112o736n148l752l061l210l579l292k056l74R54J380Q23l26j372
62625D45759j780j541j056p07o06o39n51j35N61J213J580J727J857K097K525L242
62609D53546M159M930N352N671O282P210Q232R342J0740J2349J3813J5061J6498
$$ plain form
62694 1396600 1494474 1598526 1707955 1822140 1939936 2058917 2175509 2285881 2386529 2474183
62684 2474183 2545779 2598800 2631363 2641916 2629399 2594142 2538225 2464501 2375523 2273804 2162739
62673 2162739 2046466 1928594 1811450 1696566 1585465 1479766 1380787 1289313 1205606 1129510
62663 1129510 1060557 998062 941266 889557 842676 800640 763356 730402 701141 674879 650916
62652 650916 628800 608729 591300 576510 563255 550199 537019 524393 512918 502483 492725 483620
62640 483620 475508 468772 463624 459872 456811 453601 450022 446730 444674 444300 445254 446634 447457 447131 445759
62625 445759 443979 442438 441382 440675 440069 439430 438879 438744 439305 440518 442098 443825 445682 447779 450304 453546
62609 453546 457705 462635 467987 473658 479940 487150 495382 504724 515464 527813 541626 556687 573185
62596E73185J8399K0541K2737K5379K8946L3149L7145M0513M3373M5445M5779
62585I34591M3885M0471L6447L1543K4811J6340P519n18p911j5242k2390k8765
62573A060781l4056l8178m0874m1988m1921m1225l9927l7727l4772l1685k8890
62562F49538k6325k3812k1354j9017j6839j4847j3029j1381j0128r550r351q667
62550D65238p128n483m585m177l448k432j823j650j193l27K13K28O31K005L533
62535D39602M117L916L833M041L908L274K845L257M326N488O551P782R477J1582
62521E13999J3795J5987J8451K1476K4779K7832L0809L4592L9506M4608M8852
62510H34686N2480N6506O1033O4859O6816O6729O4793O0670N3851M4640L4201
$$ plain form
62596 573185 591584 612125 634862 660241 689187 722336 759481 799994 843367 888812 934591
62585 934591 978476 1018947 1055394 1086937 1111748 1128088 1135607 1135089 1127178 1111936 1089546 1060781
62573 1060781 1026725 988547 947673 905685 863764 822539 782612 744885 710113 678428 649538
62562 649538 623213 599401 578047 559030 542191 527344 514315 502934 492806 483256 473905 465238
62550 465238 458110 452627 448042 443865 440417 437985 436162 434512 433319 432992 433205 433433 434064 436069 439602
62535 439602 443719 447635 451468 455509 459417 462691 465536 468793 473119 478607 485158 492940 502417 513999
62521 513999 527794 543781 562232 583708 608487 636319 667128 701720 741226 785834 834686
62510 834686 887166 943672 1004705 1069564 1136380 1203109 1267902 1328572 1382423 1427063 1461264
62499A461264K3479J2391L39j2582k5059l5388m2696m7292n0029n1561n2124n1542
62487A129200m9351m5270l9796l4056k8814k3888j8806j3669q958m746o90L235
62475H64391O583R168J1389J3530J5082J5126J3277R858N388L24m654q762j1929
62462I38771j5200j9622k4780k8999l1205l2039l2782l3641l3802l2769l0905
62451F23027k8609k5828k2672j9790j7621j5740j3483j0944q843p495o466n191
62439D40345l604k101j132q15p91m65M10J427K004K030J830J559R52k64j931l487
62423D35967m385m485m179m072m425m917n050m671m036l485l202l228l433l518
62409C78881l281k851k516k302j945j322o89l48k42r1J65K97J85J48O27J622K542
$$ plain form
62499 1461264 1484743 1497134 1497473 1484891 1459832 1424444 1381748 1334456 1284427 1232866 1180742 1129200
62487 1129200 1079849 1034579 994783 960727 931913 908025 889219 875550 866592 861846 861156 864391
62475 864391 870974 880142 891531 905061 920143 935269 948546 958404 963792 964116 959462 950700 938771
62462 938771 923571 903949 879169 850170 818965 786926 754144 720503 686701 653932 623027
62451 623027 594418 568590 545918 526128 508507 492767 479284 468340 459497 452002 445536 440345
62439 440345 436741 434640 433508 432693 431902 431437 431847 433274 435278 437308 439138 440697 441649 441385 439454 435967
62423 435967 431582 427097 422918 418846 414421 409504 404454 399783 395747 392262 389060 385832 382399 378881
62409 378881 375600 372749 370233 367931 365986 364664 363975 363627 363385 363294 363459 363756 363941 364089 364716 366338 368880
62392C68880K795K430K094K332L016L469L160K262J501J395J724J881J712J735
62378D00386K436L657M927O084P144P779P554O732O352P076Q352R059Q916Q830
62364D95284R866J2058J4398J5945J6759J7694J9365K1655K4282K7450L1557L6426
62352G42739M1248M5350M8672N1436N3581N4571N3572M9885M3530L5398K6654
62341A246636J8050R996K936k934q200j3795j9931k5992l1547l6675m1070m3628
62329A053846m3564m1507l8858l6377l3940l1388k8895k6512k3953k1083j8322
62318G09447j6368j5576j5698j6094j6318j6467j6874j7450j7564j6792j5510
62307E28736j4498j4035j3560j2271r977p466n907n742o186o075n134m021l241
$$ plain form
62392 368880 371675 374105 376199 378531 381547 385016 388176 390438 391939 393334 395058 396939 398651 400386
62378 400386 402822 406479 411406 417490 424634 432413 439967 446699 453051 460127 468479 477538 486454 495284
62364 495284 505150 517208 531606 547551 564310 582004 601369 623024 647306 674756 706313 742739
62352 742739 783987 829337 878009 929445 983026 1037597 1091169 1141054 1184584 1219982 1246636
62341 1246636 1264686 1274682 1277618 1274684 1266484 1252689 1232758 1206766 1175219 1138544 1097474 1053846
62329 1053846 1010282 968775 929917 893540 859600 828212 799317 772805 748852 727769 709447
62318 709447 693079 677503 661805 645711 629393 612926 596052 578602 561038 544246 528736
62307 528736 514238 500203 486643 474372 464395 456929 451022 445280 439094 433019 427885 423864 420623
62294D20623k556j653p68k87r2K62R29J646K086K131J939J877K162K578K779K919
62278D36575L441M220M551M204L809L865M024L810L396L143K933K722L151M783
62264D88627P050Q836R901J0961J2542J4590J7097K0242K3880K7681L1782L6576
62252G09765M1740M6278M9746N2691N5491N7439N7323N4523M9139M1573L2439
62241A248147K2606J2950M120l406r512j4933k1009k8426l6293m2990m7776n1124
62229A032354n3564n4715n3864n1075m7245m3073l8521l3542k8833k5303k2928
62218E79691k0793j8341j5979j4251j3051j1974j0902r784q355o638n304m839
62206D39480m743m213l373k992l163l103k389j535j117r77o83k04K40O78J373
$$ plain form
62294 420623 418067 416414 415646 415359 415267 415529 416458 418104 420190 422321 424260 426137 428299 430877 433656 436575
62278 436575 440016 444236 448787 452991 456800 460665 464689 468499 471895 475038 477971 480693 483844 488627
62264 488627 495677 504513 514414 525375 537917 552507 569604 589846 613726 641407 673189 709765
62252 709765 751505 797783 847529 900220 955711 1013150 1070473 1124996 1174135 1215708 1248147
62241 1248147 1270753 1283703 1287823 1284417 1274905 1259972 1238963 1210537 1174244 1131254 1083478 1032354
62229 1032354 978790 924075 870211 819136 771891 728818 690297 656755 627922 602619 579691
62218 579691 558898 540557 524578 510327 497276 485302 474400 464616 456261 449623 444319 439480
62206 439480 434737 430524 427151 424159 420996 417893 415504 413969 412852 411875 411192 410988 411228 411906 413279
62191D13279K457L779N005N874O471P221Q331R402R890R809R675R848J0357J1130
62177E22528J1913J2053J0973Q873O530M469K812J856K065L454N579Q234J1529
62164F12868J5246J8868K2354K6229L0636L4979L8779M2080M4625M5296M3074
62153I75034L8154L1682K4737J8050J2180P318L056j240n867j0772j5749k0365
62141A056218k4057k6573k8160k9029k9015k7980k6148k3745k0735j7324j4272
62130G89180j2207j0867r527p891o215m754l529k408j065Q83L352N678P362Q513
62116G56505R168Q703O653L753J370P5m97n56L8Q22N54j515m790q151j1040j3277
62100G47815j4360j3678j1340q215n183k573l22J722L738N824P788R195R788R821
$$ plain form
62191 413279 415736 419515 424520 430394 436865 444086 452417 461819 471709 481518 491193 501041 511398 522528
62177 522528 534441 546494 557467 566340 572870 577339 580151 582007 584072 587526 593105 601339 612868
62164 612868 628114 646982 669336 695565 726201 761180 799959 842039 886664 931960 975034
62153 975034 1013188 1044870 1069607 1087657 1099837 1107155 1110211 1108971 1103104 1092332 1076583 1056218
62141 1056218 1032161 1005588 977428 948399 919384 891404 865256 841511 820776 803452 789180
62130 789180 776973 766106 756579 748688 742473 737719 734190 731782 730717 731600 734952 740630 747992 756505
62116 756505 765673 774376 781029 784782 786152 786227 785730 785174 785212 786034 786588 785073 780283 772132 761092 747815
62100 747815 733455 719777 708437 700222 695039 692466 692144 693866 697604 703428 711216 720411 730199 740020
62086G40020R818J0048J0346J0530J0806J1573J2925J4503J5921J7097J8225J9552
62074I01364K1274K3347K5223K6095K5619K4269K2766K1359J9909J8409J7052
62063A146686J5897J4942J4500J5066J6668J8704K0607K2307K3787K4537K3840
62052A357541K1547J8125J4015R350M403j08l636o618j0317j5678k2427k9358
62040A336839l5361m0109m3913m7086m9426n0325m9461m7328m4914m2740m0426
62029H45750l7376l3636k9821k6353k3178k0190j7568j5550j4110j3037j2143
62018F02788j1294j0368r394q646q476q920r492r438q411o885n742n354n313n105
62004D89950m656l994k783p27J780L963N485O545P275P614P675P625P201N941
$$ plain form
62086 740020 749838 759886 770232 780762 791568 803141 816066 830569 846490 863587 881812 901364
62074 901364 922638 945985 971208 997303 1022922 1047191 1069957 1091316 1111225 1129634 1146686
62063 1146686 1162583 1177525 1192025 1207091 1223759 1242463 1263070 1285377 1309164 1333701 1357541
62052 1357541 1379088 1397213 1411228 1420578 1424981 1424873 1421237 1414619 1404302 1388624 1366197 1336839
62040 1336839 1301478 1261369 1217456 1170370 1120944 1070619 1021158 973830 928916 886176 845750
62029 845750 808374 774738 744917 718564 695386 675196 657628 642078 627968 614931 602788
62018 602788 591494 581126 571732 563086 554610 545690 536198 526760 518349 511464 505722 500368 495055 489950
62004 489950 485294 481300 478517 477790 479570 483533 489018 495563 502838 510452 518127 525752 532953 538894
61990E38894L960J884m8k107m181n561n994o141o545o828o633o647p723r373j0083
61975D66874r099p148n338m132l455l185l180l219l128k816k166j236n14n48j242
61960D16468j934k224k281k249j870r61J04Q36J222J551J843J892J802K049K892
61945D19140M022M953N613O336P445Q982J0887J3148J5627J7894J9456K0304K1002
61932E74809K2053K3233K3747K3155K1909K0761J9773J8276J5918J3272J1025
61921G87931Q879N892J932j909m628o495q397j0423j1736j1714j0525q582o061
61908G24164l087R8L421P084J1093J4996J8216K0437K1483K1138J9334J6358J2631
61895H87366Q367L584j601o726j1016j3862j5457j6755j8404j9937k0413j9720
$$ plain form
61990 538894 542854 544738 544690 542583 538402 532841 526847 520706 514161 507333 500700 494053 486330 476957 466874
61975 466874 457775 450627 445289 441157 437702 434517 431337 428118 424990 422174 420008 418772 418258 417710 416468
61960 416468 414534 412310 410029 407780 405910 404949 405053 405889 407111 408662 410505 412397 414199 416248 419140
61945 419140 423162 428115 433728 440064 447509 456491 467378 480526 496153 514047 533503 553807 574809
61932 574809 596862 620095 643842 666997 688906 709667 729440 747716 763634 776906 787931
61921 787931 796810 802702 804634 802725 798097 791602 783205 772782 761046 749332 738807 730225 724164
61908 724164 721077 721175 724596 731680 742773 757769 775985 796422 817905 839043 858377 874735 887366
61895 887366 895733 899317 897716 890990 879974 866112 850655 833900 815496 795559 775146 755426
61883G55426j8640j7625j6303j4450j2762j2122j2491j3020j3059j2655j2235
61872F00064j2131j2344j2496j2085j0947r350p677o197n046m053k690o01J769
61859E06216L670N139O907R110J0966J2110J3358J5543J8321K0994K3742K7151
61847F73227L0872L3849L5745L7133L8258L8550L7631L5988L4183L1857K8017
61836A055310K2162J4845P288M86n366j0628j5384j9014k0709k0211j7839j4034
61824I76906r152l533K467Q391J3490J6958J8647J9120J8624J6391J1546M409
61812A094264l654j1516j8814k5424l1097l5668l9039m0968m1301m0441l9027
61801G67315l7130l4361l0827k7435k4939k3142k1241j8762j5982j3594j2032
$$ plain form
61883 755426 736786 719161 702858 688408 675646 663524 651033 638013 624954 612299 600064
61872 600064 587933 575589 563093 551008 540061 530711 523034 516837 511791 507738 505048 504447 506216
61859 506216 509886 515025 521932 531042 542008 554118 567476 583019 601340 622334 646076 673227
61847 673227 704099 737948 773693 810826 849084 887634 925265 961253 995436 1027293 1055310
61836 1055310 1077472 1092317 1099605 1100091 1094725 1084097 1068713 1049699 1028990 1008779 990940 976906
61824 976906 967754 964221 966688 975079 988569 1005527 1024174 1043294 1061918 1078309 1089855 1094264
61812 1094264 1090610 1079094 1060280 1034856 1003759 968091 929052 888084 846783 806342 767315
61801 767315 730185 695824 664997 637562 612623 589481 568240 549478 533496 519902 507870
61790E07870j1031r932q489p186o459o013n354m653m465m717m698m079l269k686
61776D24839k249j793j421j212j055r46j102j504j812j799j537j021p2J171K134
61761D10621K514K682L075L522L570L266L174L694M588N245N219M591L862L516
61747D63139L579L618L118J876J99j255j966k079k222k659k952k694k195j977
61733D55530j915j467o30k2m2m51q11q48l96N11J495K232K935L834M389L811K421
61716D70576J544J825K461K562K396K626K975K552J160m53j609k287k687k843
61702D80798k810k866l276l973m594m808m609m256l898l417k727k151k119k577
61688D32717l009l117l113l253l403l179k385j167j7M84K21k22j85K34M33K37
$$ plain form
61790 507870 496839 486907 478418 471232 464773 458760 453406 448753 444288 439571 434873 430794 427525 424839
61776 424839 422590 420797 419376 418164 417109 416163 415061 413557 411745 409946 408409 407388 407316 408487 410621
61761 410621 413135 415817 418892 422414 425984 429250 432424 436118 440706 445951 451170 455761 459623 463139
61747 463139 466718 470336 473454 475330 475529 474274 472308 470229 468007 465348 462396 459702 457507 455530
61733 455530 453615 452148 451518 451496 451454 451003 450192 449344 448948 449459 450954 453186 456121 459955 464344 468155 470576
61716 470576 472120 473945 476406 478968 481364 483990 486965 489517 490677 490224 488615 486328 483641 480798
61702 480798 477988 475122 471846 467873 463279 458471 453862 449606 445708 442291 439564 437413 435294 432717
61688 432717 429708 426591 423478 420225 416822 413643 411258 410091 410074 410558 410779 410557 410372 410606 411039 411276
61672D11276l3l34j017j972k490k265j905j908j865j268m86k51n04n30pO95J156
61655C96292J210Q01J01l06Q0R78J667J941K188K513K449J732Q90P06J406K600
61639D17248L715M325M291L892L623L597L326K302P28o66j468j995k778l820m621
61624D31699m765m395m035m051m254l984k719p30R61J520J150P39P66Q71N66j40
61608D09199j033k066l109l755l884m075m860n880o322o025n492m931m125l243
61594C50399k942l388l841l682l276l333l832m094l707k945k320k021j844j535
61580C07639j179j211j889k810l268k951k094j028k4M66K3j135k144k358j910
61565B84127j377j182j337j429r12K28J113Q86p4n60j49L12R3m31n67l47j84j13
$$ plain form
61672 411276 411243 410909 409892 407920 405430 403165 401260 399352 397487 396219 395733 395482 394978 394448 394441 395136 396292
61655 396292 397502 398303 398404 398098 398178 399156 400823 402764 404952 407465 409914 411646 412536 413242 414648 417248
61639 417248 420963 425288 429579 433471 437094 440691 444017 446319 447047 446381 444913 442918 440140 436320 431699
61624 431699 426934 422539 418504 414453 410199 406215 403496 402766 403727 405247 406397 407136 407902 408773 409339 409199
61608 409199 408166 406100 402991 399236 395352 391277 386417 380537 374215 368190 362698 357767 353642 350399
61594 350399 347457 344069 340228 336546 333270 329937 326105 322011 318304 315359 313039 311018 309174 307639
61580 307639 306460 305249 303360 300550 297282 294331 292237 291209 291185 291651 291674 290539 288395 286037 284127
61565 284127 282750 281568 280231 278802 277890 278118 279231 280117 280043 279483 279334 279646 279739 279308 278741 278394 278210 278097
61547B78097L5J86K80N86J180J544J273Q37J013J759K234J827O65o75j486j178
61531B88177K30J894K825K814K343J776J080K47m60p84p42n94o86j262k172k928
61515B91758l143k844k235j442o61l08o12j202j336n99O95J583J140n82k294k589
61499B75329j444j17M61M91L87n7j028j946k099j630j198r71o14n5L81M64K06
61482B66560k87p33o99j60K72J20j82J16R98J764K018J975J876J662J263P70L00
61465B77633o1j98p2K61Q34J675K348K115Q60n72j341j452j308j036p66q56j177
61448B76887q22O11J973J860N67l06J6Q14J277J421J524J568J591J803K157K343
61432B95284K381K582K925L064L016L142L380L225K555J793J162N18jR0P69J320
$$ plain form
61547 278097 278132 278318 278598 279184 280364 281908 283181 284018 285031 286790 289024 290851 291516 290841 289355 288177
61531 288177 288407 290301 293126 295940 298283 300059 301139 301386 300926 300142 299400 298806 298120 296858 294686 291758
61515 291758 288615 285771 283536 282094 281433 281125 280513 279311 277975 277376 278071 279654 280794 280212 277918 275329
61499 275329 273885 273768 274229 274720 275107 275050 274022 272076 269977 268347 267149 266178 265564 265509 265890 266354 266560
61482 266560 266273 265540 264841 264681 264953 265073 264891 265007 266005 267769 269787 271762 273638 275300 276563 277333 277633
61465 277633 277572 277374 277302 277563 278397 280072 282420 284535 285395 284823 283482 282030 280722 279686 278920 278064 276887
61448 276887 276065 276676 278649 280509 281076 280770 280786 281600 282877 284298 285822 287390 288981 290784 292941 295284
61432 295284 297665 300247 303172 306236 309252 312394 315774 318999 321554 323347 324509 325027 325026 325116 325885 327205
61416C27205J337J214J402J758J983K107K206K082J630J073N69l4p71j312j445
61401C41004j431j603j901k106k220k389k637k795k661k186j647j440j509j287
61387C13192o09k05n91r41j10J378J679K22j220p99J091K547K586J812J138P93
61371C21963O86Q93J475K135K394K026J242M66n2k94k10L91J481K611L334L647
61355C44188L719L496L067L094M203O030P512Q149Q354Q588Q734Q452P633O406
61341D31625N150M427M396M443L983L434L585M245M519M322M428M888M606K990
61327D91041Q92o41j554k149k291k031k082k873l758m039m016m191m093l019j405
61312D53791l95k77l03J17R80K331M258O229P252P079O639O986Q166R325R574
$$ plain form
61416 327205 328542 329756 331158 332916 334899 337006 339212 341294 342924 343997 344566 344532 343761 342449 341004
61401 341004 339573 337970 336069 333963 331743 329354 326717 323922 321261 319075 317428 315988 314479 313192
61387 313192 312583 312378 311787 310846 310736 312114 313793 314015 312795 311996 313087 315634 318220 320032 321170 321963
61371 321963 322649 323542 325017 327152 329546 331572 332814 333280 333228 332934 332724 333115 334596 337207 340541 344188
61355 344188 347907 351403 354470 357564 361767 367797 375309 383458 391812 400400 409134 417586 425219 431625
61341 431625 436775 441202 445598 450041 454024 457458 461043 465288 469807 474129 478557 483445 488051 491041
61327 491041 491933 491292 489738 487589 485298 483267 481185 478312 474554 470515 466499 462308 458215 455196 453791
61312 453791 453396 453119 452816 452933 453913 456244 460502 466731 473983 481062 487701 494687 502853 512178 521752
61297E21752Q622O674L996O70l004o074p514p304o453n726n026m230l843m134
61283D88406m397l908l074k661k394j464j40L74j91n83K66J930L344M161M647
61268D84316M903M894M938N419O112O356N924N326N196N690O574P648Q823R891
61254E72010J0520J0547J0113R432Q490P167N575M103L103K612K367K006J303
61241F49348L70n00j283k360l911n438o235o218n866n490n072m759m899n462n968
61226E86257o111n907n220l766j839l71J02M2J54M83O40M58J33K1N18J696K884
61209E70174L174K554J957J884J767J038J46j87J5L08O80J338K089K703L539N115
61193E98294P300R587J1795J3924J5633J6566J6848J6630J5494J3047R885P175
$$ plain form
61297 521752 530374 537048 541044 541714 538710 532636 525122 517818 511365 505639 500613 496383 492540 488406
61283 488406 484009 480101 477027 474366 471972 470508 470368 470742 470551 469968 470234 472164 475508 479669 484316
61268 484316 489219 494113 499051 504470 510582 516938 522862 528188 533384 539074 545648 553296 562119 572010
61254 572010 582530 593077 603190 612622 621112 628279 633854 637957 641060 643672 646039 648045 649348
61241 649348 649718 649218 647935 645575 641664 636226 629991 623773 617907 612417 607345 602586 597687 592225 586257
61226 586257 580146 574239 569019 565253 563414 563043 563145 563187 563341 563824 564464 564922 565055 565076 565594 567290 570174
61209 570174 573348 575902 577859 579743 581510 582548 582694 582507 582522 582830 583510 584848 586937 589640 593179 598294
61193 598294 605594 615181 626976 640900 656533 673099 689947 706577 722071 735118 745003 752178
61181G52178N478M644M507M839M887L998K718K309K985L519K849J295j47j101
61167G94958j882k836l969n077n931o470o859p289p764q264q964r899j0643j0727
61153F98384j0271r770r351q717p781o781n701m143j991J19J232Q13r83l591o442
61138F25026r150j1324j2391j1944j0331q463o896n559m495m134m400m281l003
61125E28655j151K40J209K610M600O402P536Q369R331J0400J1573J3148J5265
61112F18187J7610J9742K1371K2272K2452K2373K2553K2857K2744K2160K1715
61101H56036K1783K1902K1217J9245J6108J2335Q446M603P42k883n684p517r060
61088I57273j0901j2733j3949j4688j5591j6823j8011j8895j9341j9031j7878
$$ plain form
61181 752178 757656 762300 766807 771646 776533 780531 783249 785558 788543 792062 794911 796206 796059 794958
61167 794958 793076 790240 786271 781194 775263 768793 761934 754645 746881 738617 729653 719754 709111 698384
61153 698384 688113 678343 668992 660275 652494 645713 640012 635869 633878 633997 635229 636042 635059 631468 625026
61138 625026 615876 604552 592161 580217 569886 561423 554527 548968 544473 540339 535939 531658 528655
61125 528655 527504 527744 528953 531563 536163 542565 550101 558470 567801 578201 589774 602922 618187
61112 618187 635797 655539 676910 699182 721634 744007 766560 789417 812161 834321 856036
61101 856036 877819 899721 920938 940183 956291 968626 977072 981675 982417 979534 973850 966333 957273
61088 957273 946372 933639 919690 905002 889411 872588 854577 835682 816341 797310 779432
61077G79432j6581j5956j5828j5335j4185j2836j1563j0235q968q159p767p276
61065F34743o424n360m105k589j181l97l2P03K079L529M495N012N396N903O726
61050F48498P880R139J0358J1634J2859J3730J4550J6207J8706K0719K1555K2505
61038H28340K4974K8243L0657L2171L3976L6339L8777M1734M5871N0062N2414
61027A243558N3039N3599N4338N4215N3912N5851O0743O6902P3459Q1330R0337
61016A941283R8570J05701J13895J24394J36725J52645J76955K12336K57395L12303
61006C632202L81907M70275N77712P07848Q71399J075390J313985J577442J856718
60997A2464878K112013K234343K078130J579383Q52444J45981l17995m66861l58072
$$ plain form
61077 779432 762851 746895 731067 715732 701547 688711 677148 666913 657945 649786 642019 634743
61065 634743 628319 622959 618854 616265 615084 614687 614655 615358 617437 620966 625461 630473 635869 641772 648498
61050 648498 656378 665517 675875 687509 700368 714098 728648 744855 763561 784280 805835 828340
61038 828340 853314 881557 912214 944385 978361 1014700 1053477 1095211 1141082 1191144 1243558
61027 1243558 1296597 1350196 1404534 1458749 1512661 1568512 1629255 1696157 1769616 1850946 1941283
61016 1941283 2039853 2145554 2259449 2383843 2520568 2673213 2850168 3062504 3319899 3632202
61006 3632202 4014109 4484384 5062096 5769944 6641343 7716733 9030718 10608160 12464878
60997 12464878 14576891 16811234 18889364 20468747 21321191 21467172 21149177 20682316 20324244
60988B0324244q4087K64052N55405O11348L03230l28392j073342j687131k033668
60979A6851659k117126k015946j812258j567877j326073j110749r26634p69819
60971E205177o38217n30723m42575l67853l04811k54656k16515j86937j63206
60962B099684j44170j28596j15221j03845r4455q5861p6853o7784n9434n1449
60952A172016m3584l7359l4372l3811l3615l3373l3887l4466l3060k9217k4852
60941H00420k1705j9643j7787j5841j3894j2125j1068j1208j2111j2864j3317
60930F38857j3922j4390j3797j2221j0960j0795j1044j0721r786q763p947p348
60918E07163o804n969m794m048m497n510n488l948k177j431j452j329r52p94r24
$$ plain form
60988 20324244 20240157 20504209 21059614 21670962 21974192 21645800 20572458 18885327 16851659
60979 16851659 14734533 12718587 10906329 9338452 8012379 6901630 5974996 5205177
60971 5205177 4566960 4036237 3593662 3225809 2920998 2666342 2449827 2262890 2099684
60962 2099684 1955514 1826918 1711697 1607852 1513397 1427536 1350683 1282899 1223465 1172016
60952 1172016 1128432 1091073 1056701 1022890 989275 955902 922015 887549 854489 825272 800420
60941 800420 778715 759072 741285 725444 711550 699425 688357 677149 665038 652174 638857
60930 638857 624935 610545 596748 584527 573567 562772 551728 541007 531221 522458 514511 507163
60918 507163 500359 494390 489596 485548 481051 475541 470053 466105 463928 462497 461045 459716 458764 457970 457046
60903D57046r67p58l50K73R85J283Q47J06k27K7M78P58P67N16J57l6j6j59q18
60884D59912j887k993l920m533m639m289l961m004m112l847l426l367l536l202
60870D08196k161j127p17o51l21K69P00R34J422K417L643M696N421N776N631M931
60854D39059L910L012K581K652K974L274L538L966M511M659L988K805J909J615
60840D84453J513J233R71R20O94j99j500k447k702k618k554k467k221j907j664
60825D69505j540j595j816j933j628j024n91n07m98l66k45j69J05N95Q59O26K84
60808D60062L43P48J144J549K219L063L734M220M790N390N563N170M717M726N117
60793E12555N493N840O561P779Q934R263Q632P705P233P373P775Q131Q333Q238
$$ plain form
60903 457046 456079 455321 454971 455244 456229 457512 458359 458465 458238 458265 458743 459501 460268 460784 460941 460905 460889 460730 459912
60884 459912 458025 455032 451112 446579 441940 437651 433690 429686 425574 421727 418301 414934 411398 408196
60870 408196 406035 404908 404191 403540 403219 403488 404188 405122 406544 408961 412604 417300 422721 428497 434128 439059
60854 439059 442969 445981 448562 451214 454188 457462 461000 464966 469477 474136 478124 480929 482838 484453
60840 484453 485966 487199 488170 489090 489784 489585 488085 485638 482936 480318 477764 475297 473076 471169 469505
60825 469505 467965 466370 464554 462621 460993 459969 459378 458871 458373 458007 457762 457593 457698 458293 459152 459778 460062
60808 460062 460405 461153 462297 463846 466065 469128 472862 477082 481872 487262 492825 497995 502712 507438 512555
60793 512555 518048 523888 530449 538228 547162 556425 565057 572762 579995 587368 595143 603274 611607 619845
60779F19845P733P072O781O988P219P042O641O425O312N745M406K659J304R43
60765F97115J438J911J557M82n53j331k499m381o117o662o273o169o890p860q545
60750F45223r130r747r936r391q615q214p923p042n628m585m522n106n686o172
60736E43526o932q112r322j0041j0085r675r100q498p937p580p498p402o744n315
60722D29285l580k245j605j470j593j845j999j715j007m11l93p67r77q85r02j300
60706D06591j837k190k395k580k653k573k650l085l487l310k697k321k408k523
60692C69882k423k421k693k806k405j832j591j571j363j079j209j785k215k044
60678C42445j422p60l18j45j54j55%K42M79Q74J622K515L003K783K052J134J21
$$ plain form
60779 619845 627578 634650 641431 648419 655638 662680 669321 675746 682058 687803 692209 694868 696172 697115
60765 697115 698553 700464 702021 702503 701950 700619 698120 693739 687622 680960 674687 668518 661628 653768 645223
60750 645223 636093 626346 616410 607019 598404 590190 582267 575225 569597 565012 560490 555384 549698 543526
60736 543526 536594 528482 519160 509119 499034 489359 480259 471761 463824 456244 448746 441344 434600 429285
60722 429285 425705 423460 421855 420385 418792 416947 414948 413233 412226 411815 411422 410655 409678 408793 407891 406591
60706 406591 404754 402564 400169 397589 394936 392363 389713 386628 383141 379831 377134 374813 372405 369882
60692 369882 367459 365038 362345 359539 357134 355302 353711 352140 350777 349698 348489 346704 344489 342445
60678 342445 341023 340263 339945 339800 339646 339491 339491 339733 340212 341086 342708 345223 348226 351009 353061 354195 354316
60661C54316r68j893k259j826p94K67Q63J010J126J444J802K093K574L441M330
60646C65526M640M255L585L106L080L437L607K810J027n95j016o69q33j771k491
60631C87698k342j816j438r79l58l98j686l323l834l132k471k575k780k321j535
60616C56710j223j357j182m21K83K95j61m37m21n61r88j199q19k07J36K90N17
60599C49255N10j69j048j072j39N82K62m61m92K26R20J170J102P39J4o86o86O7
60581C50094Q60J075Q38P00J027J743K459K796K785K930L601M581N472O374P711
60566C95046R451J1010J1952J2372J2443J2024J0924R290P497N657L457N14k993
60553D98644o111p803p960p414o787n768l892j545M81K143M061O382Q532J0172
$$ plain form
60661 354316 353348 351455 349196 347370 346576 346843 347706 348716 349842 351286 353088 355181 357755 361196 365526
60646 365526 370166 374421 378006 381112 384192 387629 391236 394046 395073 394478 393462 392793 391960 390189 387698
60631 387698 385356 383540 382102 381123 380765 380367 378681 375358 371524 368392 365921 363346 360566 358245 356710
60616 356710 355487 354130 352948 352527 352810 353105 352944 352507 352086 351525 350537 349338 348519 348312 348448 348738 349255
60599 349255 349765 349596 348548 347476 347337 347919 348181 347720 347228 347454 348374 349544 350646 351385 351399 350713 350027 350094
60581 350094 350954 352029 352867 353567 354594 356337 358796 361592 364377 367307 370908 375489 380961 387335 395046
60566 395046 404497 415507 427459 439831 452274 464298 475222 484512 492009 497666 501123 501637 498644
60553 498644 492533 484730 476770 469356 462569 456801 452909 451364 451845 453988 458049 464431 472963 483135
60539D83135J1724J3599J5504J6736J6741J5216J2196Q347M637J374j946n464
60527E91799q230r204q599p520o547n367l862k715k590l119l237k442j307o66
60513E26394n68l82J95P46R54J336K609M568O210P041P660Q919J1050J3871J7276
60498F07879K1179K5356K9686L4299L9124M3635M7331N0042N1471N0808M7262
60487A048072M0681L1214J8840L880j2231k7334l9750m8756n4243n6584n6610
60476H47179n4963n1481m5951l9357l3543k9355k6052k2796j9834j7716j6126
60465D90005j4380j2497j0918r496p782o132n543o128o690o166m825l596k773
60452C93079k023j270q72r69j242j368j376j470j798k372k963l064k365j263n28
$$ plain form
60539 483135 494859 508458 523962 540698 557439 572655 584851 593198 597835 599209 597263 591799
60527 591799 583569 574365 565766 558246 551699 546332 542470 539755 537165 534046 530809 528367 527060 526394
60513 526394 525826 525444 525639 526385 527339 528675 531284 535852 542062 549103 556763 565682 576732 590603 607879
60498 607879 629058 654414 684100 718399 757523 801158 848489 898531 950002 1000810 1048072
60487 1048072 1088753 1119967 1138807 1142687 1130456 1103122 1063372 1014616 960373 903789 847179
60476 847179 792216 740735 694784 655427 621884 592529 566477 543681 523847 506131 490005
60465 490005 475625 463128 452210 442714 434932 428800 423257 417129 410439 404273 399448 395852 393079
60452 393079 391056 389786 388914 387945 386703 385335 383959 382489 380691 378319 375356 372292 369927 368664 368136
60437C68136l96l73q1J99Q0l01n98q28j156j367j094m77m6j0q3l0O2J10K07L90
60417C62344N75P30Q53P47K57l11m42j11K81O11J153J818K009J480P24K06j72
60400C72752m06L4J288K350K129R93M10J161K595L628L771L142K208J702K226
60385C99983L539M596M528L403J950R24P25J287K071K436K244J934J953K298K646
60370D36517K740K543K208J934J733J414Q67L11kj95n46r58r97n21J1M6m66j034
60352D45605j079m15O09J446J919K309K874L511M036M511M992N290N248M973M386
60337D90215K991P11j451k351k160k087k703l396l589l556l704l819l516k938
60323D58647k485k341k540l077l615l493k503j232l25L08J041J758K033J936K142
$$ plain form
60437 368136 367740 367367 367286 367485 367565 367264 366666 365838 364682 363315 362221 361744 361698 361688 361605 361575 361637 361747 361954 362344
60417 362344 362919 363649 364502 365249 365506 365195 364753 364642 364923 365534 366687 368505 370514 371994 372718 372924 372752
60400 372752 372346 372380 373668 376018 378147 379140 379550 380711 383306 386934 390705 393847 396055 397757 399983
60385 399983 403522 408118 412646 416049 417999 418923 419648 420935 423006 425442 427686 429620 431573 433871 436517
60370 436517 439257 441800 444008 445942 447675 449089 449956 450267 450265 450070 449524 448566 447569 447048 447059 447105 446639 445605
60352 445605 444526 444111 444720 446166 448085 450394 453268 456779 460815 465326 470318 475608 480856 485829 490215
60337 490215 493206 493917 492466 490115 487955 485868 483165 479769 476180 472624 468920 465101 461585 458647
60323 458647 456162 453821 451281 448204 444589 441096 438593 437361 437036 437344 438385 440143 442176 444112 446254
60308D46254L166M852O623Q138R715J2150J5950K0605K4682K6685K5856K2393
60296F27069J7337J2036P076J750m828j2045j7916k1091k1877k1074j8827j5408
60284E32202j2217j0811j1073j1306j0161p818n332l490k465k017j797j666j791
60271D50258k262k743k776k327j720j258j106j365j848k044j730j406j670k262
60257D23741k324j568o58l34o55j220j753k270k804l197l049k043m46Q77J255
60242D03552R73Q91J333J766J600R69M59L34L15J51J04O67J782K705K902K833
60226D23336L336M377M996M582L541K535J715J086Q94J146J346J250J384K164
60212D57688L041L312L248L555M091M233M169M672N604N870N121M351M351M554
$$ plain form
60308 446254 449420 454272 460895 469033 478748 490898 506848 527453 552135 578820 604676 627069
60296 627069 644406 656442 663518 665268 660440 648395 630479 609388 587511 566437 547610 532202
60284 532202 519985 509174 498101 486795 476634 468816 463484 459994 457529 455512 453715 452049 450258
60271 450258 447996 445253 442477 440150 438430 437172 436066 434701 432853 430809 429079 427673 426003 423741
60257 423741 421417 419849 419191 418857 418202 416982 415229 412959 410155 406958 403909 401866 401420 402297 403552
60242 403552 404525 405416 406749 408515 410115 411084 411543 411877 412192 412343 412447 413114 414896 417601 420503 423336
60226 423336 426672 431049 436045 440627 444168 446703 448418 449504 450398 451544 452890 454140 455524 457688
60212 457688 460729 464041 467289 470844 474935 479168 483337 488009 493613 499483 504604 508955 513306 517860
60198E17860M086L180K803L336M296N036N160M488L171J728O50Q0kM09J013J148
60182E58442M81m50q77q12r32j509k035k105k159k853l963m445l755k619k148
60167E28261k489k877k807k536k307j864j106n88q34j498j827j575r89k39N62
60152E05287J023Q96O04P31J154J312J131R79R26P89P67J177J697J816J908K862
60136E25059M544N805O174O410P036P537P514P520P866P726O378M508L225K436
60122F09738J339Pp73j002j555k699l574l421k538j716j289j032o07P0O95P78
60106E92421K10m78p92r47j381j839j656r08n82j376k875m133m607m308l425k207
60090E61117r97l4O71J193J590J978K477K920K905K372J949K436L844N226N553
$$ plain form
60198 517860 521946 525126 527929 531265 535561 540597 545757 550245 553416 555144 555794 555874 555872 556281 557294 558442
60182 558442 558923 558473 557596 556784 555852 554343 552308 550203 548044 545191 541228 536783 533028 530409 528261
60167 528261 525772 522895 520088 517552 515245 513381 512275 511687 510853 509355 507528 505953 504964 504725 505287
60152 505287 506310 507206 507810 508541 509695 511007 512138 513117 514043 514832 515599 516776 518473 520289 522197 525059
60136 525059 529603 535408 541582 547992 555028 562565 570079 577599 585465 593191 599569 604077 607302 609738
60122 609738 611077 611084 610311 609309 607754 605055 601481 598060 595522 593806 592517 591485 590878 590948 591643 592421
60106 592421 592631 592153 591361 590414 589033 587194 585538 584630 584048 582672 579797 575664 571057 566749 563324 561117
60090 561117 560120 560086 560757 561950 563540 565518 567995 570915 573820 576192 578141 580577 584421 589647 595200
60075E95200M695L468K749K701K863K715J941L52k050m852p371r162j0196j0551
60061E72502j0264r579q965q664q493q272q132q119p857p032n956n156m590l758
60047D67665k536j420q21n55k78L7L21Q90K179L961N237N243M362L753M014M605
60031D96657M716M253L690L144K235P94p91k067k973l670m288m963n761o436o574
60016D77966o220n966o178o438o098n117m047l363l101l030k904k563j988j296
60002D19657o50j91rj5O0L29N49N53O84J323K140K458K301K378K934L407L445
59985D41353L371L370L131K803L311M906O243O028M925M586N129M924K963K76
59971D97319j392j431m90N11J005Q82M60J76J49K36M94J229K494L892M953N420
$$ plain form
60075 595200 599895 603363 606112 608813 611676 614391 616332 616684 614634 609782 602411 593249 583053 572502
60061 572502 562238 552659 543694 535030 526537 518265 510133 502014 494157 487125 481169 476013 471423 467665
60047 467665 465129 463709 462888 462333 462055 462092 462413 463303 465482 469443 474680 479923 484285 488038 492052 496657
60031 496657 501373 505626 509316 512460 514695 515489 514698 512631 509658 505988 501700 496737 490976 484540 477966
60016 477966 471746 465780 459602 453164 447066 441949 437902 434539 431438 428408 425504 422941 420953 419657
60002 419657 419007 418816 418807 418792 418852 419181 419730 420283 420967 422290 424430 426888 429189 431567 434501 437908 441353
59985 441353 444724 448094 451225 454028 457339 462245 468488 474516 479441 484027 489156 494080 497043 497319
59971 497319 495927 494496 494006 494517 495522 496404 496864 497040 497189 497425 497919 499148 501642 505534 510487 515907
59955E15907N167M286L263K693K593K277J119p55k568l574l709l638m115n092
59941E13854n694n284m246l362k776k115j380j068j363j857k150k197k008j523
59927D76831r50o97q12q88o26j16N28J314K004K119J565Q85O36Q71J392K115K923
59910D89094L570M038M691N773O955P719P877P584P024O425O066N966N736N063
59896E73581M146L318K409R81r31k734m015m920n555n478m175j948J11J132J157
59881E57079Q33P12J063K064L724N622O991P236O340M865L634L230L466L430K412
59866F12701O93q23j665k056k239k152j813j494j325j252j357j704j779r10O32
59851E93457J789K291L064M507N405M506K307K17j404l111m701n089l868j929
$$ plain form
59955 515907 521074 525360 528623 531316 533909 536186 537305 536550 533982 530408 526699 523061 518946 513854
59941 513854 508160 502876 498630 495268 492492 490377 488997 487929 486566 484709 482559 480362 478354 476831
59927 476831 475881 475184 474372 473484 472858 472742 473270 474584 476588 478707 480272 481157 481793 482664 484056 486171 489094
59910 489094 492664 496702 501393 507166 514121 521840 529717 537301 544325 550750 556816 562782 568518 573581
59896 573581 577727 581045 583454 584435 583504 580770 576755 571835 566280 560802 556627 554679 554790 555922 557079
59881 557079 557912 558624 559687 561751 565475 571097 578088 585324 591664 596529 600163 603393 606859 610289 612701
59866 612701 613394 612571 610906 608850 606611 604459 602646 601152 599827 598575 597218 595514 593735 592825 593457
59851 593457 595246 597537 600601 605108 610513 615019 617326 617543 616139 613028 608327 603238 599370 597441
59837E97441m24Q3n69k285m474o433p988r148r380q153o081m493l822l305k449
59822E28520j731j619j901k269k747l197l286l222l681m652n221m895m231l761
59808D82107l273k628k350k650k762k070j157q93j126j149r39r56j151j069p51
59793D57183p15j112j630j990k046j599p98m08j000k024k412j955j366j119r70
59778D36039p04n31m97j99N64J287J361R29P91J474K636L460L566L332L291L440
59762D60239L407L118K866K742K597K594L168M226N000N071M969N299N867O193
59748E17356O393O895P668Q423R171R943J0289R809R022Q774Q994Q772P671O160
59734F35340M681L196J804J008R12P77j28j620k936l629l741l435k881k438k504
$$ plain form
59837 597441 597017 597100 596531 594246 589772 583339 575351 566203 556823 548670 542589 538096 534274 530969 528520
59822 528520 526789 525170 523269 521000 518253 515056 511770 508548 504867 500215 494994 490099 485868 482107
59808 482107 478834 476206 473856 471206 468444 466374 465217 464324 463198 462049 461110 460154 459003 457934 457183
59793 457183 456468 455356 453726 451736 449690 448091 447293 446885 445885 443861 441449 439494 438128 437009 436039
59778 436039 435335 434804 434307 434108 434672 435959 437320 438249 439040 440514 443150 446610 450176 453508 456799 460239
59762 460239 463646 466764 469630 472372 474969 477563 480731 484957 489957 495028 499997 505296 511163 517356
59748 517356 523749 530644 538312 546735 555906 565849 576138 585947 594969 603743 612737 621509 629180 635340
59734 635340 640021 643217 645021 646029 646941 647718 647590 645970 643034 639405 635664 632229 629348 626910 624406
59719F24406l091l767m021l701l111k667k496k362k088j870j966k198k091j462
59705E87515n75K87J034J508J396O78q8k53K44Q68J108R24O45O28J021J631J985
59688F00556J653P10k71q43j206j818k619l036k841k513k445k349j937j744k508
59673E76789l902m707m381l734l774m565n496o060n963n019l492k178j739k085
59659E19694k728l305l514l041j992j016m68J63J380K706L238K959K690K808K808
59644E22382K203J169R6r31j885k468k434k042j909k429l407m205m282l677k953
59629D93228k576k498k413k202j869j312n05K26M73K49j01m15q62j573k440l278
59613D72132l946m285m152l578k791k027j425j002o44k75m2j17k74J0Q52J674
$$ plain form
59719 624406 621315 617548 613527 609826 606715 604048 601552 599190 597102 595232 593266 591068 588977 587515
59705 587515 586940 587227 588261 589769 591165 591843 591755 591502 591746 592614 593722 594646 595291 595919 596940 598571 600556
59688 600556 602209 602919 602648 601805 600599 598781 596162 593126 590285 587772 585327 582978 581041 579297 576789
59673 576789 572887 568180 563799 560065 556291 551726 546230 540170 534207 529188 525696 523518 521779 519694
59659 519694 516966 513661 510147 507106 505114 504098 503630 503793 505173 507879 511117 514076 516766 519574 522382
59644 522382 524585 525754 525850 524919 523034 520566 518132 516090 514181 511752 508345 504140 499858 496181 493228
59629 493228 490652 488154 485741 483539 481670 480358 479853 480079 480552 480801 480700 480285 479423 477850 475410 472132
59613 472132 468186 463901 459749 456171 453380 451353 449928 448926 448282 448007 447965 447848 447574 447584 448436 450110
59597D50110J878J444O99j76r92j364j107n85k37OM34R13J081R40P70O01K62j70
59579D54507n01q85j578k329k553k193j844j959k373k718k895l015l180l414l541
59564D19529l212k347j436j005r26p09k77P6M36J211K219K604J998J174J093J709
59548D22137K246K332K345K712L345L882M182M430M909N832P348R438J1791J4059
59534E00988J6446J9557K2932K3972J9608R713j809j0163j3499j3186j1078p884
59522E55597m017m48K000L448M426N046N122M730M080L088J487o55k811m374n191
59507E71528n740o721q231r551r950r571r111q834q401p612o699n808m789l718
59493D66792l044k981l106k843k116j278p36p69j348j958j833o59J132K768L658
$$ plain form
59597 450110 451988 453432 454131 453955 452963 451599 450492 449907 449670 449676 450110 451023 452104 453044 453814 454415 454677 454507
59579 454507 454006 453121 451543 449214 446661 444468 442624 440665 438292 435574 432679 429664 426484 423070 419529
59564 419529 416317 413970 412534 411529 410603 409894 409617 409693 410129 411340 413559 416163 418161 419335 420428 422137
59548 422137 424383 426715 429060 431772 435117 438999 443181 447611 452520 458352 465700 475138 486929 500988
59534 500988 517434 536991 559923 583895 603503 613216 611407 601244 587745 574559 563481 555597
59522 555597 551580 551132 553132 556580 561006 566052 571174 575904 579984 583072 584559 583904 581093 576719 571528
59507 571528 565788 559067 550836 541285 531335 521764 512653 503819 495418 487806 481107 475299 470510 466792
59493 466792 463748 460767 457661 454818 452702 451424 450688 449919 448571 446613 444780 444121 445253 448021 451679
59478D51679L646L055K590K770L458M147M665N127N269M570L135J864J359J227
59464D98561P78ko43q84p16j7J226K461K941K629K402L114M736O528P847Q632
59448E39593R095R362R462R491R486R177Q237O717M928K814l3l466o418p878p864
59433E92703p121o223n449n108n259n444n204m754m471m103l152j792o06L85J723
59418E36125L614N775Q054J0459J2755J4795J7021J9889K3154K6542L0338L3727
59406G42248L3224K5152J0357n480j6908k2516k3391k0304j4047o495Q99Q388
59394G11127J5434J8132J2094j833j7071k7155l0642k9974k7622k4539k0984j7205
59382E59762j3472j0208p925o612n600m372l145k395k179k258k453k543k165j192
$$ plain form
59478 451679 455325 458380 460970 463740 467198 471345 476010 481137 486406 490976 494111 495975 497334 498561
59464 498561 499339 499337 498694 497810 497094 497077 498303 500764 503705 506334 508736 511850 516586 523114 530961 539593
59448 539593 548688 558050 567512 577003 586489 595666 603903 610620 615548 618362 618329 614863 608445 600567 592703
59433 592703 585582 579359 573910 568802 563543 558099 552895 548141 543670 539567 536415 534623 534017 534402 536125
59418 536125 539739 545514 553568 564027 576782 591577 608598 628487 651641 678183 708521 742248
59406 742248 775472 800624 810981 805501 788593 766077 742686 722382 708335 701840 702739 711127
59394 711127 726561 744693 756787 754954 737883 710728 680086 650112 622490 597951 576967 559762
59382 559762 546290 536082 528157 521545 515945 511573 508428 506033 503854 501596 499143 496600 494435 493243
59368D93243lR18J415J593J538J324J130J091J249J678K445L317L800L699L510
59353E21947L943N115O380P126P617Q777J0953J3185J4154J3861J3725J4735J6205
59340F57723J6893J6780J6859J7428J7587J6593J4742J2651J0364P671M743J883
59328H11917r71l908o523q312r433j0463j1494j2014j1833j1466j1330j1105j0335
59315F92730r248q368p536o145m299k965k628k480j484L32K291M318O908J0053
59301F71479J3083J5484J7007J6840J3678P264p67q085j3374j6546j7917j7746
59289F80400j6345j4160j1702r497p717n896l519j155r2n56j110m84Q24J691K322
59274F13004L773N944P478P812P973R008J0634J2037J3073J3990J4532J4180J2958
$$ plain form
59368 493243 493240 494158 495573 497166 498704 500028 501158 502249 503498 505176 507621 510938 514738 518437 521947
59353 521947 525890 531005 537385 544511 552128 560905 571858 585043 599197 613058 626783 641518 657723
59340 657723 674616 691396 708255 725683 743270 759863 774605 787256 797620 805291 810034 811917
59328 811917 810946 807038 800515 792203 782770 772307 760813 748799 736966 725500 714170 703065 692730
59315 692730 683482 675114 667578 661433 657134 654169 651541 649061 647577 647909 650200 654518 661426 671479
59301 671479 684562 700046 717053 733893 747571 754835 754068 745983 732609 716063 698146 680400
59289 680400 664055 649895 638193 628696 620979 615083 611564 610409 610317 609761 608651 608167 608991 610682 613004
59274 613004 616777 622721 630199 638011 645984 654992 665626 677663 690736 704726 719258 733438 746396
59261G46396J1432R995Q598O975M779J711k035n556p937r162j0012j0992j1746
59248G32446j1727j1075j0441j0045r388q077o480n215m241l073j796j240j819
59235F47829k796l086k455j472n50L84J378K132K250J531N9j746l221l992m365
59220F31880m885n641o311o831p490q299q773q522p771p072o688o472o142n599
59206E35384m939m307l675k880j904r98m00k8L57Q35J369J964K572K992L077K932
59190E32351K686K358K191K771M313O031O810O445N655M986M350L687L332L451
59176E91417L744M020M514N255N670N354M788M703N027N111M895N048N858O614
59162F62018O498N728N358N984P049P495O886N704M615L636K287M09j465k746
$$ plain form
59261 746396 757828 767823 776421 783396 788175 789886 787851 782295 774358 765196 755184 744192 732446
59248 732446 720719 709644 699203 689158 679770 671693 665213 659998 655757 652684 650888 649648 647829
59235 647829 645033 641947 639492 638020 637470 637854 639232 641364 643614 645145 645204 643458 640237 636245 631880
59220 631880 626995 621354 615043 608212 600722 592423 583650 575128 567357 560285 553597 547125 540983 535384
59206 535384 530445 526138 522463 519583 517679 516681 516281 516253 516610 517445 518814 520778 523350 526342 529419 532351
59190 532351 535037 537395 539586 542357 546670 552701 559511 565956 571611 576597 580947 584634 587966 591417
59176 591417 595161 599181 603695 608950 614620 619974 624762 629465 634492 639603 644498 649546 655404 662018
59162 662018 668516 674244 679602 685586 692635 700130 707016 712720 717335 720971 723258 723667 722202 719456
59148G19456l566m574o049p573q651r296r777j0019r654q594p197n824m569l546
59134F20567l069l271l651l460k527j456q42m83L85K091L957M949M876M738N618
59119F28422P381Q859R312R235R504J0152J0503J0172R526R145R180R264Q846
59106G49501P725O435N810N929N895N014L718K758J961O91p86j489j276j131j659
59091G89096k297k449k447k765l105k882k223j773j921k677l896n194o039o410
59077G43018o960q086r294r932j0087j0157r989r191q045p357p424p674p402o529
59063F24891n580n164n338n465m953m116l833m250m490l964l218l028l339l629
59049E64524l718l610l110k335j958k199k197j246j07Mo87q27P9J174J750K100
$$ plain form
59148 719456 715890 711316 705267 697694 689043 679747 669970 659951 650297 641703 634506 628682 624113 620567
59134 620567 617498 614227 610576 607116 604589 603133 602291 601808 602193 604284 608241 613190 618066 622804 628422
59119 628422 635803 644662 653974 663209 672713 682865 693368 703540 713066 722211 731391 740655 749501
59106 749501 757226 763661 769471 775400 781295 786309 790027 792785 794746 795437 794651 793162 791886 790755 789096
59091 789096 786799 784350 781903 779138 776033 773151 770928 769155 767234 764557 760661 755467 749428 743018
59077 743018 736058 727972 718678 708746 698659 688502 678513 669322 661277 653920 646496 638822 631420 624891
59063 624891 619311 614147 608809 603344 598391 594275 590442 586192 581702 577738 574520 571492 568153 564524
59049 564524 560806 557196 554086 551751 549793 547594 545397 544151 544044 544048 543361 542534 542613 543787 545537 547637
59033E47637K658L262L664L999M405M774N151N811O756P553P932Q220R006J0688
59019F31516J3239J6078J8292J9419J9921K0441K0749J9960J7621J4096R964N618
59007H26914J399k409n639q033r195r157q599p956o809m847k842j723j163k29
58993G59712Q71J041J56o50p22o51j041j714k507l673m995n599n338n344o486
58978G23060q014q519p565n777l894k374j411o66N99K581M521N623N970O103O260
58963G16497O484P056Q115R190R620R332Q701P967P066N846M122J723j187m065
58949G96467o454q319r786j0850j1462j1661j1434j0822j0142r744r456q657p063
58936F70617n011l046j602j017j278j722j684j420j705k520k955k583j915j291
$$ plain form
59033 547637 550295 553557 557221 561220 565625 570399 575550 581361 588117 595670 603602 611822 620828 631516
59019 631516 644755 660833 679125 698544 718465 738906 759655 779615 797236 811332 821296 826914
59007 826914 828313 825904 820265 812232 803037 793880 785281 777325 770516 765669 762827 761104 759941 759712
58993 759712 760583 761624 761780 761130 760408 759757 758716 757002 754495 750822 745827 740228 734890 729546 723060
58978 723060 715046 706527 698962 693185 689291 686917 685506 684840 685439 688020 692541 698164 704134 710237 716497
58963 716497 722981 730037 738152 747342 756962 766294 774995 782962 790028 795874 799996 801719 800532 796467
58949 796467 790013 781694 771908 761058 749596 737935 726501 715679 705537 695793 686337 677680 670617
58936 670617 665606 662560 660958 659941 658663 656941 655257 653837 652132 649612 646657 644074 642159 640868
58922F40868l50R02J489O81r20k204k889l347l686l768l705l685l533l008k251
58907F10594j520p91K3Q59J830L209M804N943O466P091Q217R195R413R369R803
58892F84505J0290R848Q551P610P861R113J0838J2753J4599J6134J7422J8608
58880H28132J9353J9020J7430J4984J2071Q861N621K710Q6k729o059r702j3130
58867H96648j5822j7417j7774j6969j5256j3075j1076r764r024q372p763p598
58855G46738p808p669o956o563p195q064p764o162m434l343k449j181J92J037
58841F78379J211R91M52o26k324m252n789o604o940p265p673p795p410o762o278
58826F11315o134o284o505o271n046l056j363p74r10q23j96M86P73O65L63N8N5
$$ plain form
58922 640868 640518 641420 642909 643590 642670 640466 637577 634230 630544 626776 623071 619386 615853 612845 610594
58907 610594 609074 608283 608306 609165 610995 614204 619008 624951 631417 638508 646725 655920 665333 674702 684505
58892 684505 694795 704643 713194 720804 728665 737778 748616 761369 775968 792102 809524 828132
58880 828132 847485 866505 883935 898919 910990 919851 925472 928182 928268 925539 919480 909778 896648
58867 896648 880826 863409 845635 828666 813410 800335 789259 779495 770471 762099 754336 746738
58855 746738 738930 731261 724305 717742 710547 702483 694719 688557 684123 680780 678331 677150 677342 678379
58841 678379 679590 680581 681033 680407 678083 673831 668042 661438 654498 647233 639560 631765 624355 617593 611315
58826 611315 605181 598897 592392 586121 581075 578019 576656 575882 574972 574149 573953 574439 575212 575877 576240 576298 576353
58809E76353O53J744K700K858K086R53K37J85K82k6n25n66o7L71L16j06p95j822
58791E84831k791k865j970j204j483k297k496j758n86O56J888K814L130L083L179
58776E82131L482L784M262N151N939N632M035K070O22m11j712l473n033n503m693
58761E96283l440k808k970l127k641j725p94K33J464K416K659K740L603N136O177
58746F03206O039N352M987M773L797J805j30n90P17K646L900M360M824N662O348
58731F57696O487O467O769P177P252P152P322P598P228N726L314N91j802l412
58717G25565m220m674n086n172m433k919j278j13N64J189K119L126L533L003J997
58702G13201J071n5k058m783p171q545r167r410r391r605j0905j3185j4974j5053
$$ plain form
58809 576353 577006 578750 581450 584308 586394 587347 587584 587769 588051 588025 587500 586934 586867 587238 587554 587448 586653 584831
58791 584831 582040 579175 577205 576001 574518 572221 569725 567967 567381 568037 569925 572739 575869 578952 582131
58776 582131 585613 589397 593659 598810 604749 610381 614416 616486 617108 616697 614985 611512 606479 600976 596283
58761 596283 592843 590035 587065 583938 581297 579572 578778 579011 580475 582891 585550 588290 591893 597029 603206
58746 603206 609245 614597 619584 624357 628154 629959 629829 629239 629956 632602 636502 640862 645686 651348 657696
58731 657696 664183 670650 677419 684596 691848 699000 706322 713920 721148 726874 730188 730779 728977 725565
58717 725565 721345 716671 711585 706413 701980 699061 697783 697670 698234 699423 701542 704668 708201 711204 713201
58702 713201 714272 714217 712159 707376 700205 691660 682493 673083 663692 654087 643182 629997 615023 599970
58688E99970j3729j1963j0047p933n992m578l468k624k748m079n336n026l442
58675E19005k168j943k124k049j712j101P6J728L296M416N167N662O038O707P909
58660E48907R135R615R231Q333O858M463J376j581l726m747m466l166j917j719
58646E76596k313k631k270j754j468j273j221j709k688l438l443k938k357j781
58632E45312j139n52k16k04m63q21j053j097j084j032q28o44r18j646k185k047
58616E29383j323j01J814M142N976O990P920R107R570Q540O928O007N419L971
58602F04343J813L00q7j38m21p32j043j608k106j920j324j135j236p23L54Q71
58586E95208N49O80K374N141P718R425J0238J0438J0643J1521J2944J3932J3705
$$ plain form
58688 599970 586241 574278 564231 556298 550306 545728 542260 539636 536888 532809 527473 522447 519005
58675 519005 516837 514894 512770 510721 509009 507908 507984 509712 513008 517424 522591 528253 534291 540998 548907
58660 548907 558042 567657 576888 585221 592079 596542 597918 596337 592611 587864 583398 580232 578315 576596
58646 576596 574283 571652 569382 567628 566160 564887 563666 561957 559269 555831 552388 549450 547093 545312
58632 545312 544173 543621 543405 543201 542738 541917 540864 539767 538683 537651 536823 536179 535261 533615 531430 529383
58616 529383 528060 527959 529773 533915 539891 546881 554801 563908 573478 582018 588946 594953 600372 604343
58602 604343 606156 606456 606369 606231 605810 605078 604035 602427 600321 598401 597077 595942 594706 593983 594337 595208
58586 595208 595757 596437 598811 603952 611670 621095 631333 641771 652414 663935 676879 690811 704516
58573G04516J2299J0141P719N704M655M379M241M196M852O436Q393J0143J1634
58560G99308J3098J4828J7150K0025K2702K4345K4848K4606K3726K2086J9706
58549A026428J6496J2109O868K226p28k612m617o632p797q304r115j0320j1328
58536A002674j2404j4343j6802j8570j9423k0143k0672k0132j8693j7585j6912
58525H06995j5331j2371r378p492o284n011l749k584j151L73J113J031J162J813
58511G49136J953J196P46J445K277J936O69m80j210j674j720j435j556k365l018
58496G45900k877k583k911l365k962j757n71K26Q28J356J832K396L060L660M345
58481G46577N436O667P406P943R399J1937J4196J5215J5718J6624J7319J6551
$$ plain form
58573 704516 716815 726956 734675 740379 745034 749413 753654 757850 762702 769138 777531 787674 799308
58560 799308 812406 827234 844384 864409 887111 911456 936304 960910 984636 1006722 1026428
58549 1026428 1042924 1055033 1061901 1064127 1063399 1060787 1056170 1049538 1041741 1033437 1024322 1014002 1002674
58536 1002674 990270 975927 959125 940555 921132 900989 880317 860185 841492 823907 806995
58525 806995 791664 779293 769915 762423 756139 751128 747379 744795 743644 744017 745130 746161 747323 749136
58511 749136 751089 752285 753031 754476 756753 758689 759358 758878 757668 755994 754274 752839 751283 748918 745900
58496 745900 743023 740440 737529 734164 731202 729445 728874 729100 729928 731284 733116 735512 738572 742232 746577
58481 746577 752013 758680 766086 774029 783428 795365 809561 824776 840494 857118 874437 890988
58469H90988J4278J1524Q802N661J656k867o920r489j0325j0188r930r422q010
58456H65758n884l973k478o35J899M494O615Q303R337R093P677O056M631K787
58442I13680K10k483m785o778q171q172o771n041l692k456j244m90O7J404L503
58427H68781N015N339N567O625P961Q842R564J0430J0970J0981J1086J1309J0504
58414I82974Q082N051K397j64k858m762n213n112n610o502o971o880o414n452
58400I42566m205l391k991k080n13O07R30J705L679N720O748P367Q258Q499P080
58385I79979M857L481L325L753M346M672M000K471J453J583J734R82K21M99J253
58370A018609J636K124L330M497M904N484P336R713J1202J1919J2872J4084J4914
$$ plain form
58469 890988 905266 916790 925592 931253 932909 930042 923122 913633 903308 893120 883190 873768 865758
58456 865758 859874 855901 853423 852788 854687 859181 865796 874099 883436 892529 900206 906262 910893 913680
58442 913680 913890 911407 906622 899844 891673 883501 876730 871689 867997 865541 864297 863807 863874 865278 868781
58427 868781 873796 879135 884702 891327 899288 908130 917694 928124 939094 950075 961161 972470 982974
58414 982974 991056 996107 998504 998340 995482 990720 985507 980395 974785 968283 961312 954432 948018 942566
58400 942566 938361 934970 931979 929899 929386 929993 930923 932628 936307 942027 948775 956142 964400 972899 979979
58385 979979 984836 988317 991642 995395 999741 1004413 1008413 1010884 1012337 1013920 1015654 1016636 1016857 1017356 1018609
58370 1018609 1020245 1022369 1025699 1030196 1035100 1040584 1047920 1057633 1068835 1080754 1093626 1107710 1122624
58357A122624J5510J6365J7192J7518J7558J7384J6259J3982J1774J0567R590
58346A286323P895O086N137M790M571N071O753Q652R769J0553J1658J2597J3021
58333A392876J3864J5592J6888J6753J6412J7339J8786J9267J8979J8805J8197
58322A583758J6268J3935J2805J2791J2730J2463J2517J2599J2170J1652J1585
58311A725273J1554J1360J1920J3609J5143J5612J6124J7809J9859K1283K2816
58300A902362K5176K7134K7442K7099K7697K8980K9949L0729L1516L1466L0491
58289B220041L0288L1613L2680L2287L2171L4021L6539L8023L9391M1884M4221
58278B613159M5005M5666M7890N0369N1272N1731N3641N6157N7792N9712O3486
$$ plain form
58357 1122624 1138134 1154499 1171691 1189209 1206767 1224151 1240410 1254392 1266166 1276733 1286323
58346 1286323 1294218 1300304 1305441 1310231 1314802 1319873 1326626 1335278 1345047 1355600 1367258 1379855 1392876
58333 1392876 1406740 1422332 1439220 1455973 1472385 1489724 1508510 1527777 1546756 1565561 1583758
58322 1583758 1600026 1613961 1626766 1639557 1652287 1664750 1677267 1689866 1702036 1713688 1725273
58311 1725273 1736827 1748187 1760107 1773716 1788859 1804471 1820595 1838404 1858263 1879546 1902362
58300 1902362 1927538 1954672 1982114 2009213 2036910 2065890 2095839 2126568 2158084 2189550 2220041
58289 2220041 2250329 2281942 2314622 2346909 2379080 2413101 2449640 2487663 2527054 2568938 2613159
58278 2613159 2658164 2703830 2751720 2802089 2853361 2905092 2958733 3014890 3072682 3132394 3195880
58267C195880O7697P0365P2637P6458Q0678Q3277Q5350Q9088R3801R7614J01059
58256D113904J05215J08571J09640J10248J12321J13970J12990J11492J12561
58247E110912J15177J17229J20592J27917J37102J44539J51285J60459J71088
58238F356300J80485J90233K03609K19171K33109K45830K60244K75821K90596
58229H455398L06579L26734L49079L70356L92787M20308M51155M81493N13334
58220A2067223N51156N93807O37904O85943P42690Q06977Q75984R53820J046347
58211A8961851J151519J264915J390688J536516J702438J886191K094488K336934
58203C2325540K615180K932561L308882L771242M337597N026259N874145O927771
$$ plain form
58267 3195880 3263577 3333942 3406579 3483037 3563715 3646992 3732342 3821430 3915231 4012845 4113904
58256 4113904 4219119 4327690 4437330 4547578 4659899 4773869 4886859 4998351 5110912
58247 5110912 5226089 5343318 5463910 5591827 5728929 5873468 6024753 6185212 6356300
58238 6356300 6536785 6727018 6930627 7149798 7382907 7628737 7888981 8164802 8455398
58229 8455398 8761977 9088711 9437790 9808146 10200933 10621241 11072396 11553889 12067223
58220 12067223 12618379 13212186 13850090 14536033 15278723 16085700 16961684 17915504 18961851
58211 18961851 20113370 21378285 22768973 24305489 26007927 27894118 29988606 32325540
58203 32325540 34940720 37873281 41182163 44953405 49291002 54317261 60191406 67119177
58195F7119177Q226190R814235J1761531J4142766J7008244K0392406K4316114
58188A72780663K8718354L3366731L7807769M1264018M2435412L9553333L1147620
58181D27073900J7286360K07488j6487768k9587731l7583796m0721536m0195572
58174B79991345l7366773l3388258k9092664k4972477k1247595j7990800j5211074
58167A00721704j2870797j0902741r247158p863347o710014n740686m922110m237340
58159C8227511l667925l189278k783952k443712k157614j911641j699656j521501
58151A8852232j370588j235463j112686j006075r14006q29100p49889o81299o23341
58142A0329785n70022n19905m77875m45568m18810l94967l74578l55455l33371
$$ plain form
58195 67119177 75345367 85159602 96921133 111063899 128072143 148464549 172780663
58188 172780663 201499017 234865748 272673517 313937535 356372947 395926280 427073900
58181 427073900 444360260 444567748 428079980 398492249 360908453 320186917 279991345
58174 279991345 242624572 209236314 180143650 155171173 133923578 115932778 100721704
58167 100721704 87850907 76948166 67701008 59837661 53127647 47386961 42464851 38227511
58159 38227511 34559586 31370308 28586356 26142644 23985030 22073389 20373733 18852232
58151 18852232 17481644 16246181 15133495 14127420 13213414 12384314 11634425 10953126 10329785
58142 10329785 9759763 9239858 8761983 8316415 7897605 7502638 7128060 6772605 6439234
58133F439234l09159k87692k69686k51474k32736k17104k05060j93233j81090
58124D292000j71613j64972j57928j49837j43160j37745j30619j21811j14535
58115B999780j09096j02267r3238q4812p8143p1382o4189n8715n5475n2658m9950
58104B179855m8816m8825m7897m6181m5574m5632m4327m2400m2488m4137m4275
58093A679303m2602m1781m2240m1418l8518l5479l2843k8991k4098k0598j9145
58082A311590j8032j7020j7654j9421j9735j8389j7941j9019j9330j8156j7770
58071A109123j9252k0675k0702k0447k0551j9802j7980j6860j7129j7199j6232
58060I02294j5421j5227j4254j2092j0507j0597j1289j1714j2552j3884j4166
$$ plain form
58133 6439234 6130075 5842383 5572697 5321223 5088487 4871383 4666323 4473090 4292000
58124 4292000 4120387 3955415 3797487 3647650 3504490 3366745 3236126 3114315 2999780
58115 2999780 2890684 2788417 2695179 2610367 2532224 2460842 2396653 2337938 2282463 2229805 2179855
58104 2179855 2131039 2082214 2034317 1988136 1942562 1896930 1852603 1810203 1767715 1723578 1679303
58093 1679303 1636701 1594920 1552680 1511262 1472744 1437265 1404422 1375431 1351333 1330735 1311590
58082 1311590 1293558 1276538 1258884 1239463 1219728 1201339 1183398 1164379 1145049 1126893 1109123
58071 1109123 1089871 1069196 1048494 1028047 1007496 987694 969714 952854 935725 918526 902294
58060 902294 886873 871646 857392 845300 834793 824196 812907 801193 788641 774757 760591
58049G60591j2538j0137q166o615n558n556o163o103n450n591o605o989o341n990
58035F62789o448o596o037n930o738p382p363p651q727r684r958j0054j0107r618
58021E50496q983r258j0070r752p982o202n098l870k427j961k711l229k721k050
58007D74182j815j376m84k3l92q12r00j272k110k695k758k738k534j680q52j378
57991D50363l059m314m532m492m457l941l322l457l584k054O42K018J177k09r21
57976D15858j660k811l289k636k008k072j925j061l99n06o00k17J0p4L69J386
57960C98365J935J934K600M023M475L091J168l9q35j546j575r47q51j586j907
57945D08305j293r11j355j460n76J61J3J25J475L246M616O300Q737J0513J0291
$$ plain form
58049 760591 748053 737916 729750 723135 717577 712021 705858 699755 694305 688714 682109 675120 668779 662789
58035 662789 656341 649745 643708 637778 631040 623658 616295 608644 599917 590233 580275 570221 560114 550496
58021 550496 541513 532255 522185 512433 504451 498249 493151 489281 486854 484893 482182 478953 476232 474182
58007 474182 472367 470991 470507 470484 470092 469280 468380 467108 464998 462303 459545 456807 454273 452593 451741 450363
57991 450363 447304 442990 438458 433966 429509 425568 422246 418789 415205 413151 413793 415811 416988 416779 415858
57976 415858 414198 411387 408098 405462 403454 401382 399457 398396 397997 397491 396891 396674 396684 396610 396979 398365
57960 398365 400300 402234 404834 408857 413332 416423 417591 417552 416717 415171 413596 412649 411798 410212 408305
57945 408305 407012 406101 404746 403286 402710 402871 402884 403009 404484 407730 412346 418646 427383 437896 448187
57930D48187Q898P952P629P183O409N229L049j16k940m405n128o069p122p905
57916D60851q680r520r727r066q366q010p165n407l720k932k512j905j617j983
57902C80241k259j988j905k502l064l124l337l935l869k691j682j848k330k037
57888C43670j400j123p07L95J416J570J413J551J297O6j193j420j126j247j539
57873C41623j573k048l521m962n119m344l621k923k006j569k015k193j108J82
57859C04803K09l76J25J704K944L529M393N754O751P012P015O976O666O159N671
57844C69335M933L771K839K715K807K192R68k39j411k641l273k777j824j277q30
57829C75288Q5Q29M27o57j121p15k03R6M94R57J203J388J654J535P24j06l96p70
$$ plain form
57930 448187 457085 465037 472666 479849 486258 491487 494536 494420 491480 487075 481947 475878 468756 460851
57916 460851 452171 442651 432924 423858 415492 407482 400317 394910 391190 388258 385746 383841 382224 380241
57902 380241 377982 375994 374089 371587 368523 365399 362062 358127 354258 351567 349885 348037 345707 343670
57888 343670 342270 341147 340440 340835 342251 343821 345234 346785 348082 348148 346955 345535 344409 343162 341623
57873 341623 340050 338002 334481 329519 324400 320056 316435 313512 311506 309937 307922 305729 304621 304803
57859 304803 305012 304636 304761 306465 309409 312938 317331 323085 329836 336848 343863 350839 357505 363664 369335
57844 369335 374268 378039 380878 383593 386400 388592 389560 389321 387910 385269 381996 379219 377395 376118 375288
57829 375288 375373 376202 376629 375972 374851 374136 373933 374029 374523 375480 376683 378071 379725 381260 381984 381878 381482 380712
57811C80712j969l532m795o207q184r585r104p502o659o877o834n935m944m417
57797B94168m126l975m049l816k640r74K23J000K061L222L666L453L374L500L332
57782B98419L187L842M914N177M570M411N393O773P684Q005P721O674N250M203
57768C76223L547K580J061n44k025l582n035n882o181o379o446o056n519n394
57754C30368n382m769l790l318l299k842j837j098q49l20Q03J814K193K267K324
57739C12265K097J515J038R03Q16N78L05n4o07q81j84J307K545K846K402J696
57723C28587J192J387K355L287L361K836K441K072J203K41M6L27n1j145j737j285
57707C45117p07q47j437j904k074j722n18J167K344K632K524K389K217K369L330
$$ plain form
57811 380712 378743 375211 370416 364209 356025 346440 337336 329834 323175 316298 309464 303529 298585 294168
57797 294168 290042 286067 282018 278202 275562 274588 274811 275811 277872 281094 284760 288213 291587 295087 298419
57782 298419 301606 305448 310362 315539 320109 324520 329913 336686 344370 352375 360096 366770 372020 376223
57768 376223 379770 382350 383411 382867 380842 377260 372225 366343 360162 353783 347337 341281 335762 330368
57754 330368 324986 320217 316427 313109 309810 306968 305131 304033 303184 302864 303667 305481 307674 309941 312265
57739 312265 314362 315877 316915 317818 318634 319212 319517 319463 318856 317975 317791 319098 321643 324489 326891 328587
57723 328587 329779 331166 333521 336808 340169 343005 345446 347518 348721 348962 349008 349335 349284 348139 346402 345117
57707 345117 344410 343563 342126 340222 338148 336426 335908 337075 339419 342051 344575 346964 349181 351550 354880
57692C54880M460M292K445J08j651k869l686l741l182k922l189k925j473K94J393
57677C42234K247L880O344R037J1921J5568K0350K6394L3880M2710N2266O2077
57665F28908P2112Q1414Q6444Q1774O3348L1945n872m0449o4062p4633p5164p0022
57653G15743o2209n3393m4793l7161l0637k5238k1092j7875j4811j1696r217p777
57641C79844o656n044l166j704n46R58K707L692L263K037J246J444K063K166J495
57626C83799O18J04q9k43l51l84p06j581k543k829k407j876j553j328j276j624
57610C65731k061j913j155n04l97o29j061j858k726k794j748m37J59O4J6M05R44
57593C50036J103O09l22j140j574j991k798l629l672k774j650r08m55L2N27P45
$$ plain form
57692 354880 359340 363632 366077 366185 364534 361665 357979 354238 351056 348134 344945 342020 340547 340841 342234
57677 342234 344481 348361 354705 363742 375663 391231 411581 437975 471855 514565 566831 628908
57665 628908 701020 782434 868878 950652 1014000 1045945 1040073 999624 935562 860929 785765 715743
57653 715743 653534 600141 555348 518187 487550 462312 441220 423345 408534 396838 387621 379844
57641 379844 373188 368144 364978 363274 362728 363686 366393 370085 373348 375385 376631 378075 380138 382304 383799
57626 383799 384417 384521 384432 384189 383838 383454 382748 381167 378624 375795 373388 371512 369959 368631 367355 365731
57610 365731 363670 361757 360602 360098 359701 359072 358011 356153 353427 350633 348885 348448 348607 348671 348687 349092 350036
57593 350036 351139 351748 351426 350286 348712 346721 343923 340294 336622 333848 332198 331290 330835 330867 331394 332139
57577C32139M69k62j036j253p87j77J75O32J504K130J672N35m8K25M39Nn16m46
57559C35400O8M64M75J83j17RP22J510J834J978K631L722M439M333L626K576J375
57542C65228N63O46J307J786J908K008K085K039K363L367M060L138J003o87j335
57527C89479j686j892j224J0K38r15j708q15Q00J595J627J884K549L150L631M146
57511D00869M518M618M634M386L379K068J834K998M065L909L392L689M285M026
57497D52670L131K628K522K061J314J012J225J415J536J844J992J510R39J252
57483D77051K304L009K976K867L147L548L863M332M977N314N018M316L594L003
57469E29319K488J949J359J008J261J867K013J458J118J871L252M033L833L413
$$ plain form
57577 332139 332608 332346 331310 330057 329270 329093 329268 329900 331404 333534 335206 335741 335693 335918 336357 336362 335846 335400
57559 335400 335468 335932 336407 336590 336473 336482 337204 338714 340548 342526 345157 348879 353318 357651 361277 363853 365228
57542 365228 365791 366437 367744 369530 371438 373446 375531 377570 379933 383300 387360 390498 391501 390814 389479
57527 389479 387793 385901 384677 384687 384925 384010 382302 381487 382287 383882 385509 387393 389942 393092 396723 400869
57511 400869 405387 410005 414639 419025 422404 424472 426306 429304 433369 437278 440670 444359 448644 452670
57497 452670 455801 458429 460951 463012 464326 465338 466563 467978 469514 471358 473350 474860 475799 477051
57483 477051 479355 482364 485340 488207 491354 494902 498765 503097 508074 513388 518406 522722 526316 529319
57469 529319 531807 533756 535115 536123 537384 539251 541264 542722 543840 545711 548963 552996 556829 560242
57455E60242L554M215M763M638L861L098K965L225L169K862L193M333N192N023
57441F14333M628N036N840N951N380N077N365N722N893O123O345O197N872O030
57427F93792O732P297P325P174P251P497P743Q030Q381Q625Q625Q418Q109P814
57413H02813P605P339O768O024N741O311P314Q001Q110P885P614P505P677P982
57399I04689Q086Q008Q208Q885R639J0089J0330J0473J0270R665R171R241R730
57386A026484J0334J1037J1709J1888J1511J1299J1870J2897J3639J3789J3420
57375A159877J2669J1904J1588J1572J1235J0707J1001J2339J3397J3023J1840
57364A291152J1190J1349J1765J2230J2777J3019J2781J2830J3889J5405J6291
$$ plain form
57455 560242 563796 568011 572774 577412 581273 584371 587336 590561 593730 596592 599785 604118 609310 614333
57441 614333 618961 623997 629837 635788 641168 646245 651610 657332 663225 669348 675693 681890 687762 693792
57427 693792 700524 707821 715146 722320 729571 737068 744811 752841 761222 769847 778472 786890 794999 802813
57413 802813 810418 817757 824525 830549 836290 842601 849915 857916 866026 873911 881525 889030 896707 904689
57399 904689 912775 920783 928991 937876 947515 957604 967934 978407 988677 998342 1007513 1016754 1026484
57386 1026484 1036818 1047855 1059564 1071452 1082963 1094262 1106132 1119029 1132668 1146457 1159877
57375 1159877 1172546 1184450 1196038 1207610 1218845 1229552 1240553 1252892 1266289 1279312 1291152
57364 1291152 1302342 1313691 1325456 1337686 1350463 1363482 1376263 1389093 1402982 1418387 1434678
57353A434678J6373J6150J5707J4994J4598J5018J5647J5676J5556J6264J7514
57342A608175J8059J7608J7116J7196J7439J7333J6911J6452J6364J7127J8568
57331A798348J9570J9420J8948J9290K0106K0319K0007K0105K0546K0335J9397
57320B016391J8764J8909J9310J9766K0637K1650K1899K1420K1377K2339K3519
57309B245981K4099K4136K3926K3568K3469K4171K5415K6365K6973K7857K8806
57298B524766K8732K7504K6457K6563K7270K7703K7832K7887K7752K7563K7961
57287B827990K9050L0028L0352L0388L0485L0355K9930K9803L0242L0665L0636
57276C159924L0526L0651L0683L0537L0905L2144L3428L3763L3243L2712L2782
$$ plain form
57353 1434678 1451051 1467201 1482908 1497902 1512500 1527518 1543165 1558841 1574397 1590661 1608175
57342 1608175 1626234 1643842 1660958 1678154 1695593 1712926 1729837 1746289 1762653 1779780 1798348
57331 1798348 1817918 1837338 1856286 1875576 1895682 1916001 1936008 1956113 1976659 1996994 2016391
57320 2016391 2035155 2054064 2073374 2093140 2113777 2135427 2157326 2178746 2200123 2222462 2245981
57309 2245981 2270080 2294216 2318142 2341710 2365179 2389350 2414765 2441130 2468103 2495960 2524766
57298 2524766 2553498 2581002 2607459 2634022 2661292 2688995 2716827 2744714 2772466 2800029 2827990
57287 2827990 2857040 2887068 2917420 2947808 2978293 3008648 3038578 3068381 3098623 3129288 3159924
57276 3159924 3190450 3221101 3251784 3282321 3313226 3345370 3378798 3412561 3445804 3478516 3511298
57265C511298L3619L5123L6718L7618L7657L7350L6936L6180L5301L5040L5361
57254C908201L5159L3874L2342L1441L0874L0094K9428K9302K9281K8886K8739
57243D247621K9728L1526L2930L3339L3181L3082L3428L4334L5435L5947L5506
57232D616057L4630L3853L2997L1793L0636L0005K9618K8889K7822K6736K5542
57221D948578K4065K2701K1944K1603K1171K0731K0726K1082K1329K1486K2043
57210E187459K3092K4156K4853K5229K5387K5319K5162K5219K5672K6434K7257
57199E465239K7733K7511K6778K6297K6552K7144K7349K7082K6691K6078K4610
57188E759064K2155J9594J7929J7042J5799J3458J0617Q353O680M601J750q64
$$ plain form
57265 3511298 3544917 3580040 3616758 3654376 3692033 3729383 3766319 3802499 3837800 3872840 3908201
57254 3908201 3943360 3977234 4009576 4041017 4071891 4101985 4131413 4160715 4189996 4218882 4247621
57243 4247621 4277349 4308875 4341805 4375144 4408325 4441407 4474835 4509169 4544604 4580551 4616057
57232 4616057 4650687 4684540 4717537 4749330 4779966 4809971 4839589 4868478 4896300 4923036 4948578
57221 4948578 4972643 4995344 5017288 5038891 5060062 5080793 5101519 5122601 5143930 5165416 5187459
57210 5187459 5210551 5234707 5259560 5284789 5310176 5335495 5360657 5385876 5411548 5437982 5465239
57199 5465239 5492972 5520483 5547261 5573558 5600110 5627254 5654603 5681685 5708376 5734454 5759064
57188 5759064 5781219 5800813 5818742 5835784 5851583 5865041 5875658 5884011 5890691 5895292 5897042 5896178
57176E896178k334l276m800o684p799q143r097j1481j4513j7011j8629j9547j9924
57163E752940k0099k0463k0687j9938j8218j6668j6023j5624j4477j2508j0259
57152E567976q141o501n646n229m431l261k856l929n884q063j0828j4473j8062
57139E470672k0491k2108k4092k6651k8878l0062l0324l0110k9882l0017l0358
57128E167699l0195k9262k8312k8134k8480k8582k8210k7451k6055k3820k1239
57117D867959j8963j7025j5263j3983j3410j2868j1339q425m064K245J1084K2409
57105D788357L5949N1948P0717R1922J15175J41057J70952K06376K49004L00592
57095F222049L61877M32061N10103N95666O87758P83081Q76691R63213J036372
$$ plain form
57176 5896178 5893844 5890568 5885768 5879084 5871285 5863142 5854045 5842564 5828051 5811040 5792411 5772864 5752940
57163 5752940 5732841 5712378 5691691 5671753 5653535 5636867 5620844 5605220 5590743 5578235 5567976
57152 5567976 5559835 5553334 5547688 5542459 5538028 5534767 5531911 5527982 5522098 5514035 5503207 5488734 5470672
57139 5470672 5450181 5428073 5403981 5377330 5348452 5318390 5288066 5257956 5228074 5198057 5167699
57128 5167699 5137504 5108242 5079930 5051796 5023316 4994734 4966524 4939073 4913018 4889198 4867959
57117 4867959 4848996 4831971 4816708 4802725 4789315 4776447 4765108 4756683 4752619 4754864 4765948 4788357
57105 4788357 4824306 4876254 4946971 5038893 5154068 5295125 5466077 5672453 5921457 6222049
57095 6222049 6583926 7015987 7526090 8121756 8809514 9592595 10469286 11432499 12468871
57086A2468871J088632J113211J105551J061401R75907Q49227O93578N30195L75936
57077B0262509K33346R4444m8256j96087l46462m95993o40485p74341q91870r88906
57067A6207899j062775j111462j133603j129386j101211j053333r90761r18300
57059G707068q40180p60046o80771o04355n32354m66313m07452l56073l11613
57050B747911k73246k40146k11423j86423j64941j46635j30506j15572j01857
57041A177162r0027q0160p1649o4100n7321n0534m2728l3993k5408j7251q399
57030F35592K048J3611K5266L5905M2707M0514K5438k92k8376n0189o2192o5925
57018F14107o4246n8910n1205m2967l5844l0032k4704j9605j5430j2560j0285
$$ plain form
57086 12468871 13557503 14670714 15776265 16837666 17813573 18662800 19356378 19886573 20262509
57077 20262509 20495855 20590299 20542043 20345956 19999494 19503501 18863016 18088675 17196805 16207899
57067 16207899 15145124 14033662 12900059 11770673 10669462 9616129 8625368 7707068
57059 7707068 6866888 6106842 5426071 4821716 4289362 3823049 3415597 3059524 2747911
57050 2747911 2474665 2234519 2023096 1836673 1671732 1525097 1394591 1279019 1177162
57041 1177162 1087135 1006975 935326 871226 813905 763371 720643 686650 661242 643991 635592
57030 635592 637640 651251 676517 712422 755129 795643 821081 820789 792413 742224 680032 614107
57018 614107 549861 490951 439746 396779 360935 330903 306199 286594 271164 258604 248319
57007B48319p819n433l976l606l688l712l674l676l736l936m329m692m793m772
56993A86477m864m911m607l968l103j761J95K175L390M008M967O580P968Q021
56979B00567O337L220n97m202o932q773r957j0372r891r003q273p392n591l017
56965A26124o78R96K554M330N958P447R586J2661J5661J7529J8292J8183J6344
56952B54987J1638M464l103r014j2554j4165j4641j4519j3773j2035r355o592
56940A61338m696l735k928j506P41L651O950J0369J3733J6982J9980K2330K3342
56927B66551K2106J7660R735l72j0071j7161k1243k3192k3643k2499j9898j6799
56915A61174j4174j2039r803p456n743n029m616l685k449j694j392o78P22J930
$$ plain form
57007 248319 240500 235067 231091 227485 223797 220085 216411 212735 208999 205063 200734 196042 191249 186477
56993 186477 181613 176702 172095 168127 165024 163263 163458 165633 169023 173031 177998 184578 192546 200567
56979 200567 206904 210124 209527 205325 198393 189620 179663 169291 159400 150397 142124 134732 129141 126124
56965 126124 125446 126442 128996 133326 139284 146731 156317 168978 184639 202168 220460 238643 254987
56952 254987 266625 271089 267986 258972 246418 232253 217612 203093 189320 177285 167930 161338
56940 161338 156642 152907 149979 148473 149214 152865 159815 170184 183917 200899 220879 243209 266551
56927 266551 288657 306317 316052 315680 305609 288448 267205 244013 220370 197871 177973 161174
56915 161174 147000 134961 125158 117702 111959 106930 102314 98629 96180 94486 93094 92416 93138 95068
56901I5068K187J884J760J809J747J911K775L930M584M858N637P181Q878J0426
56887A54635J2251J4455J6261J6889J6274J4536J1414O785J313l910q070j0753
56875B42080j1823j1500j0351q840p018m768k088R73M340P822J1312J5118J9712
56862B44969K5085L0672L6014M1059M5534M8252M7145M0231K7042R658p878k1821
56850E65962l0589l4484l4325l1108k6354k1507j6797j1503n356J163P883J5214
56838C78199K3105L0786L7994M5545N4189O3456P1892P7430P7150O7778M7896
56827I75420J9789j1172l8906n8815o9086p0998o7675o1756n4199m5263l5784
56816D81555k6852j8767j1105l595L707J0899J8333K6139L4038M1559M8181N3031
$$ plain form
56901 95068 97255 99139 100899 102708 104455 106366 109141 113071 117655 122513 128150 135331 144209 154635
56887 154635 166886 181341 197602 214491 230765 245301 256715 263500 264813 260903 252833 242080
56875 242080 230257 218757 208406 199566 192548 187780 185692 186665 191005 198827 210139 225257 244969
56862 244969 270054 300726 336740 377799 423333 471585 518730 558961 586003 595661 587783 565962
56850 565962 535373 500889 466564 435456 409102 387595 370798 359295 353939 355102 362985 378199
56838 378199 401304 432090 470084 515629 569818 633274 705166 782596 859746 927524 975420
56827 975420 995209 984037 945131 886316 817230 746232 678557 616801 562602 517339 481555
56816 481555 454703 435936 424831 421236 424943 435842 454175 480314 514352 555911 604092 657123
56804F57123N4387M9753L7142J7119o505k8663m5747n6303o0055n7774n1945m5693
56792D62839m0248l4515k7632k0674j5034j0444n824j153K894O569J0935J6300
56780C44013K1817K6362K8751K7352K0830R712l532j6141k6321l3111l6081l5683
56768C27968l3276l0218k7106k3975k0914j8207j6007j4073j1978r610p359n651
56756A09594m393l263k443k476l284l962l835l232k831k790k837k753k363j527
56742F7605n82k46o52j044q72n87o99p45l6J030J400R21M40M34M19r8q32j156
56724F4700q82l33N3P9n6M0M52Q11Q26O95P31Q92J039J304J715J805J164K16j22
56705G5129M56J321J602R16m55j753k255j949j533j574j873k065k305k790k995
$$ plain form
56804 657123 711510 761263 798405 815524 809019 780356 734609 678306 618251 560477 508532 462839
56792 462839 422591 388076 360444 339770 324736 314292 308468 307315 310209 316778 327713 344013
56780 344013 365830 392192 420943 448295 469125 478837 475305 459164 432843 399732 363651 327968
56768 327968 294692 264474 237368 213393 192479 174272 158265 144192 132214 122604 115245 109594
56756 109594 105201 101938 99495 97019 93735 89773 85938 82706 79875 77085 74248 71495 69132 67605
56742 67605 67023 66777 66125 65081 64209 63622 62923 62178 62142 63172 64572 65493 65933 66367 66786 66688 65856 64700
56724 64700 63818 63485 63538 63617 63561 63601 64053 64864 65690 66385 67116 68008 69047 70351 72066 73871 75035 75251 75129
56705 75129 75585 76906 78508 79424 78969 77216 74961 73012 71479 69905 68032 65967 63662 60872 57877
56690E7877k171n48P19R12M89K22J85q0o82j114q86j12O26R52R88Q79M37m32j173
56671E7088j145o46n85j057j064nJ283J602R09J61O7N66J280J874K152K216K396
56654F7092K796L215L633M273N010N328N146N024N138M814L684K588K565L463
56640A23769M346M732M719M270L298K117J128K84m84p46k30L97K69m67r68r10
56624A45524n69j2Q18J373Q60o19k091k921l257l331l110k698k407k195j697r14
56608A22754l94o09j479k485k924k314j023k37p16j805k272j840j200p56k09O24
56592A03115J430J935K190K173J654O77k42n41q4P25J186R02K96J67N43O32J73
56575A16931J8P40J507J299N66N20J272J836J790J721K064K532K807K933L003
$$ plain form
56690 57877 55706 55158 55877 56789 57278 57500 57685 57605 56923 55809 54923 54811 55437 56389 57377 58256 58693 58261 57088
56671 57088 55943 55297 54712 53655 52591 52586 53869 55471 56380 56541 56608 57174 58454 60328 62480 64696 67092
56654 67092 69888 73103 76736 81009 86019 91347 96493 101517 106655 111469 115153 117741 120306 123769
56640 123769 128115 132847 137566 141836 145134 147251 148379 148663 148179 147433 147203 147600 147869 147402 146434 145524
56624 145524 144955 144943 145761 147134 147994 147375 145284 142363 139106 135775 132665 129967 127560 125365 123668 122754
56608 122754 122360 121751 120272 117787 114863 112549 111526 111289 110573 108768 106496 104656 103456 102700 102491 103115
56592 103115 104545 106480 108670 110843 112497 113174 112932 112391 112307 113032 114218 115120 115416 115583 116126 116758 116931
56575 116931 116949 117689 119196 120495 121061 121581 122853 124689 126479 128200 130264 132796 135603 138536 141539
56560A41539L185L943N534P351Q530Q916Q758P856N996L851K318J220j70j514
56546B07313j736q92l18o36r96o60j42k15q00j410j861k069j881j526j563k032
56530A88576k257j829j116o26m87p08j288j874j992j792j858k265k551k654k938
56515A62341l277k971j898q11k91j44m8mQ7M17O96L93l11o31m23l34o45r17r97
56496A50232j251j507r43M62J511J390O95K47j01p06j146r27n48q58j811k526
56480A42213k384j542n71n6j87n01k72O40J666K247K231J613N56l21l99J03M62
56463A45498N82R52J543J717J354R77O44r9r69r08K52J355J656J692J877J625
56447A59748O72KL36Q14L12q37j581j754j773j416k59J139J748J489J120Q87L85
$$ plain form
56560 141539 144724 148667 154201 161552 170082 178998 187756 195612 201608 205459 207777 208997 208827 207313
56546 207313 205577 204685 204367 203731 202735 202075 201933 201718 200918 199508 197647 195578 193697 192171 190608 188576
56530 188576 186319 184490 183374 182748 182261 181553 180265 178391 176399 174607 172749 170484 167933 165279 162341
56515 162341 159064 156093 154195 153384 153093 152949 152901 152897 152984 153401 154097 154490 154179 153548 153125 152791 152146 151229 150232
56496 150232 148981 147474 146531 146993 148504 149894 150589 150836 150735 150029 148883 147956 147408 146550 144739 142213
56480 142213 139829 138287 137716 137660 137473 136972 136700 137340 139006 141253 143484 145097 145653 145332 144933 145036 145498
56463 145498 146080 147032 148575 150292 151646 152623 153267 153168 152199 151291 151543 152898 154554 156246 158123 159748
56447 159748 160420 160422 160758 161572 161884 161047 159466 157712 155939 154523 154264 155403 157151 158640 159760 160647 161032
56430A61032l86p53l29M89J076J099O03k5k44J45P94J348J817K165K022J214K09
56413A72276m26o29n77k59K39N16M11M03Q94J430J237L27m43l86K93P75N17j60
56395A76438m39o4L39K93L14R97J729J430L59m8P18J519J299M05k49l47rO24J165
56376A86473J240J211J832K822K925J765N04J70M15N14M17J97l90j059q53L03
56360A98486J079O25q7J78J142J853K253K673K675J800P38M76P98Q67Q18J437
56344B17811K604L275L012K465K320K548K731K554K028J633J968K981L842L901
56330B55673L255K179P76m86p23K88J658K510K834K865K491J800J283R74K80q07
56314B76850j375j046o40p49p97k87K24L11O23J647K612K691K248J936J597J132
$$ plain form
56430 161032 160646 159893 159564 160053 161129 162228 162831 162806 162562 162707 163501 164849 166666 168831 170853 172067 172276
56413 172276 171850 171221 170644 170385 170624 171140 171551 171954 172848 174278 175515 175842 175399 175013 175306 176081 176598 176438
56395 176438 175999 175935 176274 176567 176881 177878 179607 181037 181396 181348 182066 183585 184884 185289 185040 184693 184684 185308 186473
56376 186473 187713 188924 190756 193578 196503 198268 198772 198942 199357 199871 200288 200485 200095 199036 198183 198486
56360 198486 199565 200190 200103 200281 201423 203276 205529 208202 210877 212677 213415 213891 214689 215556 216374 217811
56344 217811 220415 223690 226702 229167 231487 234035 236766 239320 241348 242981 244949 247930 251772 255673
56330 255673 258928 261107 261883 261397 260674 260962 262620 265130 267964 270829 273320 275120 276403 277377 277657 276850
56314 276850 275475 274429 273789 273040 272243 271956 272180 272491 273114 274761 277373 280064 282312 284248 285845 286977
56298B86977J268K302L196L128K789K918K764J550L03N36J855K634K426K100K175
56283C18921K418K758L247L564L634M058M913N101M161L605M885O991P853P313
56269C83422O887P196P503P421P326P344P429Q115R744J1350J1814J1725J2597
56256D99873J4637J6783J8543K0371K2617K5503K9561L4673L9378M2684M5793
56245H10416N0348N5727O0014O2999O6057O9444P1920P2886P2842P1634O8221
56234A532508O2294N4510M5108L3931K1684R500k537j4790k6268l5323m2063m8055
56222A590499n3720n7836n9844o0638o0862o0129n8264n5765n2826m9340m5904
56211I75371m3292m1016l7960l4327l1279k8839k5996k2855k0705j9770j8765
$$ plain form
56298 286977 288245 290547 293743 296871 299660 302578 305342 306892 307195 307731 309586 312220 314646 316746 318921
56283 318921 321339 324097 327344 330908 334542 338600 343513 348614 352775 356380 361265 368256 376109 383422
56269 383422 390309 397505 405008 412429 419755 427099 434528 442643 452387 463737 475551 487276 499873
56256 499873 514510 531293 549836 570207 592824 618327 647888 682561 721939 764623 810416
56245 810416 860764 916491 976505 1039504 1105561 1175005 1246925 1319811 1392653 1464287 1532508
56234 1532508 1594802 1649312 1694420 1728351 1750035 1759535 1756998 1742208 1715940 1680617 1638554 1590499
56222 1590499 1536779 1478943 1419099 1358461 1297599 1237470 1179206 1123441 1070615 1021275 975371
56211 975371 932079 891063 853103 818776 787497 758658 732662 709807 689102 669332 650567
56200F50567j6967j5001j3339j1665r967q626p359n563l780l111l193k606j268
56187E48122n43p84p85N3Q17P88L66K6j54K59J646L038K978J724R60J332K030
56170E61873K742L953N271N551M999N089O116O805O690O826P779Q834R596J0516
56156F52640J1458J1677J1510J2183J3688J4813J5478J7000J9749K2664K5428
56145H28288K9042L3876L9244M5241N2810O1700P0642P9756R0276J01449J10191
56134A542515J14385J14024J08726R7297Q1014O4649N2566M5700M3167M4101M6359
56123B354503M5872L9613K8182J4433R37j0353j8041k2524k6338l2304m2038n6064
56111B275878p3483r1088j04720j12251j14025j10599j02192r0381p7910o6171
$$ plain form
56200 650567 633600 618599 605260 593595 583628 575002 567643 562080 558300 555189 551996 549390 548122
56187 548122 547579 546795 546010 546063 546880 547668 548034 548060 547906 548165 549811 552849 555827 557551 558511 559843 561873
56170 561873 564615 568568 573839 579390 584389 589478 595594 602399 609089 615915 623694 632528 642124 652640
56156 652640 664098 675775 687285 699468 713156 727969 743447 760447 780196 802860 828288
56145 828288 857330 891206 930450 975691 1028501 1090201 1160843 1240599 1330875 1432324 1542515
56134 1542515 1656900 1770924 1879650 1976947 2057961 2122610 2175176 2220876 2264043 2308144 2354503
56123 2354503 2400375 2439988 2468170 2482603 2483540 2473187 2455146 2432622 2406284 2373980 2331942 2275878
56111 2275878 2202395 2111307 2006587 1894336 1780311 1669712 1567520 1477139 1399229 1333058
56101A333058n4837m4123l5159k7959k1429j5683j1840r424o590l233j031r8J372
56088A103024L727N201N282N647P011Q068Q360R090J0346J0678J0218J0962J3085
56075A210699J4308J3825J3422J3842J3568J2336J2194J3751J5023J5257J6227
56064A364452J8418J9744J9583K0200K2513K4318K4467K4908K6751K8219K8476
56053A622049K9451L1795L3047L2050L1188L2000L2473L1077K9537K9265K9023
56042A962955K8435K9611L2790L4685L3867L3494L5884L8722L9618M0112M1971
56031B352144M3788M4507M6149M9818N3167N4923N7583O2466O6658O8239O9879
56020B969321P3694P7311P8744Q0386Q4195Q7681Q8665Q9434R2184R5020R6424
$$ plain form
56101 1333058 1278221 1234098 1198939 1170980 1149551 1133868 1122028 1112604 1106014 1102781 1101750 1101652 1103024
56088 1103024 1106751 1111952 1117234 1122881 1129892 1137960 1146320 1155410 1165756 1176434 1186652 1197614 1210699
56075 1210699 1225007 1238832 1252254 1266096 1279664 1292000 1304194 1317945 1332968 1348225 1364452
56064 1364452 1382870 1402614 1422197 1442397 1464910 1489228 1513695 1538603 1565354 1593573 1622049
56053 1622049 1651500 1683295 1716342 1748392 1779580 1811580 1844053 1875130 1904667 1933932 1962955
56042 1962955 1991390 2021001 2053791 2088476 2122343 2155837 2191721 2230443 2270061 2310173 2352144
56031 2352144 2395932 2440439 2486588 2536406 2589573 2644496 2702079 2764545 2831203 2899442 2969321
56020 2969321 3043015 3120326 3199070 3279456 3363651 3451332 3539997 3629431 3721615 3816635 3913059
56009C913059R8775J03495J07819J10273J14077J21033J27898J32896J39625J49995
55999E118945J59859J66605J74327J86083J98063K07204K17459K32102K47051
55990F907698K58567K70550K87207L05624L22747L42315L67497L94240M19500
55981I875945M48041M83352N20567N56583N97956O49856P07098P65612Q32205
55972A5437215R12562J000787J092436J196220J320509J460846J614366J793389
55964B5828330K010087K262143K550063K893738L314686L819417M420901N158646
55956E2258011O076178P200188Q567178J0245901J2303063J4772629J7686298
55949A29109446K1084022K4927456K9012203L2960197L6138041L7411115L5134857
$$ plain form
56009 3913059 4011834 4115329 4223148 4333421 4447498 4568531 4696429 4829325 4968950 5118945
55999 5118945 5278804 5445409 5619736 5805819 6003882 6211086 6428545 6660647 6907698
55990 6907698 7166265 7436815 7724022 8029646 8352393 8694708 9062205 9456445 9875945
55981 9875945 10323986 10807338 11327905 11884488 12482444 13132300 13839398 14605010 15437215
55972 15437215 16349777 17350564 18443000 19639220 20959729 22420575 24034941 25828330
55964 25828330 27838417 30100560 32650623 35544361 38859047 42678464 47099365 52258011
55956 52258011 58334189 65534377 74101555 84347456 96650519 111423148 129109446
55949 129109446 150193468 175120924 204133127 237093324 273231365 310642480 345777337
55942C45777337K7904412J5777048Q27013j3712895k5088233l2093106l4977616
55935B84413960l4727714l2467994k9183102k5591468k2106459j8915343j6098813
55928A05323067j3680180j1626577r880295q401596p164180o128655n251439m509581
55920C8680564l892133l376695k936213k559399k243986j977803j744735j541535
55912A8408065j371389j227559j099015r85475q91668q12578p38569o69700o11713
55903A0000399n62647n16096m73008m38279m09575l80774l52765l30297l11687
55894F225271k91568k70543k52692k36836k19152k01338j87577j76422j63765
55885D225378j50824j41537j35224j29317j25959j28091j32096j31858j27460
$$ plain form
55942 345777337 373681749 389458797 390285810 376572915 351484682 319391576 284413960
55935 284413960 249686246 217218252 188035150 162443682 140337223 121421880 105323067
55928 105323067 91642887 80016310 70136015 61734419 54570239 48441584 43190145 38680564
55920 38680564 34788431 31411736 28475523 25916124 23672138 21694335 19949600 18408065
55912 18408065 17036676 15809117 14710102 13724627 12832959 12020381 11281812 10612112 10000399
55903 10000399 9437752 8921656 8448648 8010369 7600794 7220020 6867255 6536958 6225271
55894 6225271 5933703 5663160 5410468 5173632 4954480 4753142 4565565 4389143 4225378
55885 4225378 4074554 3933017 3797793 3668476 3542517 3414426 3282330 3150472 3023012
55876C023012j22775j17509j08891r8513r0181q3272p5070o7333o3771o3129o1348
55865B071220n8449n6986n5962n2660m8422m6295m4921m1066l6167l4105l4278
55854A561909l3204l1258l1463l2982l2257k9664k8846l0154l0599k9668k9584
55843A222230l0203k9157k6756k5649k5834k4886k2789k1786k1781k0522j8071
55832I54796j6659j6414j5466j3889j3365j3398j2027r843r218j0074j0357j0161
55820H03925j1269j3221j3922j3671j4514j6018j5773j3779j2389j2111j1307
55809F55951r815r093q969p872o100n262m912l282r25k7m49j47R06R05p1k44K61
55792F00855l16j740k161j806k500l802l489j751r43j120m7K044J847k096p515
$$ plain form
55876 3023012 2900237 2782728 2673837 2575324 2485143 2401871 2326801 2259468 2195697 2132568 2071220
55865 2071220 2012771 1955785 1899823 1847163 1798741 1752446 1707525 1666459 1630292 1596187 1561909
55854 1561909 1528705 1497447 1465984 1433002 1400745 1371081 1342235 1312081 1281482 1251814 1222230
55843 1222230 1192027 1162870 1136114 1110465 1084631 1059745 1036956 1015170 993389 972867 954796
55832 954796 938137 921723 906257 892368 879003 865605 853578 843735 834517 824443 814086 803925
55820 803925 792656 779435 765513 751842 737328 721310 705537 691758 679369 667258 655951
55809 655951 646136 637043 628074 620202 614102 608840 603928 600646 599721 599694 599245 599098 600004 600909 600838 600594 600855
55792 600855 600539 598799 596638 594832 592332 588530 585041 583290 582347 581227 581180 583224 585071 582975 575460
55777E75460j2153j5861j8240j7947j5375j2866j1198q813n273k390j074j42P95
55764D54923K12k390n034o012n834n558n238m787m443l912k841k242l355n342
55750C98147o354o665p978r970j0500r349q592q868q496o795n285m776m182l036
55736B97301k396k413j733k32L92l80q97l89l52j726l174l456l341l850m586m939
55720B63829n102m981l918k362j877k763l474l083k409k006j201J97J269J851
55706B33970K977M723N585M824L422K086L64j572k526k548l347n397o801o199
55692B29561m754m009l717l126k586k473k043p22P65J573J859J835J239M60P19
55677B14581K200L435L375K624J959J145M8o37n94m61n22k99K1n89k041k746j936
$$ plain form
55777 575460 563307 547446 529206 511259 495884 483018 471820 463007 457734 455344 454270 454128 454923
55764 454923 455135 452745 447711 441699 435865 430307 425069 420282 415839 411927 409086 406844 403489 398147
55750 398147 391793 385128 377150 367180 356680 347331 338739 329871 321375 314580 309295 304519 300337 297301
55736 297301 294905 292492 290759 290527 290919 290539 289642 289253 288901 287175 284001 280545 277204 273354 268768 263829
55720 263829 258727 253746 249828 247466 245589 242826 239352 236269 233860 231854 230653 230850 232119 233970
55706 233970 236947 241670 247255 252079 255501 257587 257951 256379 253853 251305 247958 242561 235760 229561
55692 229561 224807 220798 217081 213955 211369 208896 206853 206131 206896 208469 210328 212163 213402 213862 214581
55677 214581 216781 220216 223591 226215 228174 229319 229367 228730 228136 227675 227153 226854 226875 226286 224245 221499 219563
55660B19563p12o9L99R89R61J77j11P51J578J270N01K88K86l26j318j963k089
55643B20175j817j188p10j144k275l025l094l175l274k655j718j979l498m380
55629A86243l750l190m047n249n191m072k981k056j030l32k82k41L34R75J176
55614A56307J162R33j02j767k788k687k577l218l803l549k965k609k104j346j045
55599A27842j184o10P85J343L22o86m19j29j264k758k647j105J63N90Q99J323
55583A22465J461J315J158R07P16J350K948M352M681M564M793N125N459O765R401
55568A77460J1880J2782J2627J2236J0740P024K107j922m499o441q007q911r568
55555B07508j0514j1163j0643r365q278p312n962m712m291m162l337k088j327
$$ plain form
55660 219563 218851 218782 219181 220170 221131 221308 221197 221948 223526 224796 225297 225585 225871 225545 224227 222264 220175
55643 220175 218358 217170 216460 215316 213041 210016 206922 203747 200473 197818 196100 194121 190623 186243
55629 186243 182493 179303 175256 170007 164816 160744 157763 155707 154677 154345 154063 153822 154156 155131 156307
55614 156307 157469 158402 158300 156533 153745 151058 148481 145263 141460 137911 134946 132337 130233 128887 127842
55599 127842 126658 126048 126833 128176 128498 127812 127393 127264 126000 123242 120595 119490 119653 120243 121142 122465
55583 122465 123926 125241 126399 127306 128022 129372 132320 136672 141353 145917 150710 155835 161294 168059 177460
55568 177460 189340 202122 214749 226985 237725 244749 246856 244934 240435 233994 225987 217076 207508
55555 207508 196994 185831 175188 165823 157545 150233 144271 139559 135268 131106 127769 125681 124354
55542A24354r19j66O25O85L64N65J121J223J065J427K076K125J674J576J838J694
55526A41327R92J83o69j561j758p57L98L49o04j197j388k029k792k402r69k26
55510A26897j105k682l835m526n068n332n145m489l258j630n64q56j805j981j162
55495H3459l71j61j43j50m63q24n64J22K54k88n21ON13L76P8K64P29R74R95J028
55475H5313J020Q53O42M65J67l87j057j543j588j160n86l66o09r76j299j663j810
55458G5416j219j70K64j87l98L37J017N38m33n57O2L30J40L26R54J187P61K25
55440G8593j94o47p71k6J048J247M40l36n51p29j143j218n71L78J122J588J650
55423G9880J068J36l17L9O28P95N19K39L08O79Q59M28j77k0Q40J037j82j640j824
$$ plain form
55542 124354 123435 123269 123894 124579 124943 125508 126629 127852 128917 130344 132420 134545 136219 137795 139633 141327
55526 141327 142319 142502 141833 140272 138514 137757 138155 138504 137900 136703 135315 133286 130494 128092 127123 126897
55510 126897 125792 123110 119275 114749 109681 104349 99204 94715 91457 89827 89263 88407 86602 84621 83459
55495 83459 83088 82927 82784 82634 82171 81347 80783 80905 81159 80871 80350 80356 80869 81245 81323 81587 82316 83290 84285 85313
55475 85313 86333 87186 87828 88293 88460 88073 87016 85473 83885 82725 82139 81773 81164 80188 78889 77226 75416
55458 75416 74197 74027 74291 74104 73706 74043 75060 75598 75165 74608 74670 75000 75140 75466 76420 77607 78368 78593
55440 78593 78399 77752 76981 76955 78003 79250 79690 79354 78803 78074 76931 75713 75142 75520 76642 78230 79880
55423 79880 80948 81084 80767 80806 81434 82229 82748 82987 83295 83974 84833 85261 85084 85064 85904 86941 86759 85119 83295
55404H3295j021o00q65j044r72j230j837k114j837j314n64M93J235J029M31M06
55388G3491O60K43n05l08P75J284P11J98M64O99K01m32n43m94p47q76m05K86N48
55369G5250L10k30j028j881k366k474k533k402j562k76L99J34j04M16J073R69
55353F3695K89j81k86m15o35n92j78K97N38O25Q28J159J148L81p19j111l90O98
55335F5151J367J691J858J417J88q83r27n30o90j059o38K84N44J20L1L93K75m53
55317F8139q36n20j21K26R66J619J008o01j385n59O30J056J071R95J85j357k195
55300F8321j512n02m54q82q34o80j084j392p11L53O09K56L81J034J327J123J154
55283F6507J613J856J514Q94L51QJ2K94L78L2k13J13N26K83m21q36q36q76j051
$$ plain form
55404 83295 82274 81674 80809 79765 78793 77563 75726 73612 71775 70461 69897 70390 71625 72654 73085 73491
55388 73491 74151 74394 73889 73581 74356 75640 76351 76549 77013 77712 77913 77481 76938 76444 75697 74821 74416 74702 75250
55369 75250 75560 75330 74302 72421 70055 67581 65048 62646 61084 60808 61207 61341 61237 61653 62726 63695
55353 63695 63984 63803 63517 63102 62467 61875 61697 61994 62532 63157 63985 65144 66292 66673 65954 64843 64453 65151
55335 65151 66518 68209 70067 71484 71672 70789 69862 69332 68642 67583 66945 67229 67773 67893 67924 68317 68592 68139
55317 68139 67303 66783 66662 66888 67854 69473 70481 69880 68495 67936 68566 69622 70693 71688 71873 70516 68321
55300 68321 66809 66307 65853 64971 64137 63457 62373 60981 60270 60623 61232 61488 61869 62903 64230 65353 66507
55283 66507 68120 69976 71490 72384 72735 72743 72755 73049 73427 73459 73246 73359 73885 74168 73747 72911 72075 71199 70148
55264G0148j075r72r48p30O1J053J422J093Q17J059J481J658J633J520J095J20
55248G9435j149k041k011j103O6Q39J036Q56M27k16p81r09o78m76l26O3M77K65
55230G3774n57j050o15J51L92J41n9j09k51m02k61J87P22J240J586J399N71l89
55212G6470p99m73K70R48J155P67J64k22n20j090j534j005K63P78k26j514j420
55195G2012j2J218J327P15K51M29J202J948J796N54q49j389j148r34j038j076
55179G5006q33n29l13j21l5j81k79J82J164J910J750Q22j29n03l10K1J88K57L41
55160G8408K64j53o30p22m62k21J5O57J665K336K160J366M59l20q15q92p62q77
55142H1476j234j287p78j31J81J09k81r01j226n64Q58J839J649Q61L30M3m39j091
$$ plain form
55264 70148 69073 68101 67153 66423 66484 67537 68959 70052 70869 71928 73409 75067 76700 78220 79315 79435
55248 79435 78286 76245 74234 73131 73197 74036 75072 75928 76355 76139 75358 74449 73771 73295 72969 73032 73509 73774
55230 73774 73217 72167 71552 71703 72095 72236 72177 72068 71817 71415 71154 71341 72063 73303 74889 76288 76859 76470
55212 76470 75671 75198 75468 76416 77571 78338 78502 78280 77760 76670 75136 74131 74394 75172 74946 73432 72012
55195 72012 72000 73218 74545 75260 75511 75940 77142 79090 80886 81440 80591 79202 78054 77120 76082 75006
55179 75006 74173 73644 73331 73210 73175 72994 72715 72897 74061 75971 77721 78543 78414 77911 77601 77622 77810 78067 78408
55160 78408 78672 78519 77889 77167 76705 76484 76499 77156 78821 81157 83317 84683 85142 84822 84007 83115 82353 81476
55142 81476 80242 78955 78177 78046 78227 78336 78055 77154 75928 75364 76222 78061 79710 80571 80901 80944 80505 79414
55124G9414j574j762j555o82P34J887K104J570Q82K96j48l65m36o10p49m22K12
55107G8796L55j56m88j55K49K63M65J248J700R11m08q33k42K55J16j60j47K0J75
55088H1964L05K32q5j76L30R34R13M38K28L41K06k88o74p49p38o40k48K31L24
55069H2848P2j4K34N04O11O18M18j54q47j192j105p74k11N48J058R55N90M98M99
55050H5156J36l39k84J83L08p0l89l88l90m37j60L31L67j58m36N2P54Q98N69L83
55030H6086N10N59K18l73q15q21n40m41p87j294j476j202o22K06J181J833J706
55013H3928R75L14O3K4j5nJ18K63L29K58Ll18l90j14J30K5j56O7O37J057J095
54992H8288R46Q03O90N73L50j33p21r53o95l83k39J76J098J809J560P90M63N68
$$ plain form
55124 79414 77840 76078 74523 73841 74575 76462 78566 80136 81018 81314 81166 80801 80365 79755 79006 78584 78796
55107 78796 79151 78995 78507 78352 78601 78864 79329 80577 82277 83188 82780 81947 81705 81960 82076 81916 81769 81789 81964
55088 81964 82269 82501 82416 82240 82570 83504 84417 84855 85083 85424 85630 85342 84668 83919 83181 82541 82293 82524 82848
55069 82848 82920 82906 83140 83644 84255 84873 85291 85137 84290 83098 81993 81219 81008 81556 82614 83569 84159 84657 85156
55050 85156 85292 84953 84669 84852 85160 85090 84701 84313 83923 83486 83326 83657 84024 83866 83430 83482 84236 85134 85703 86086
55030 86086 86596 87155 87373 87000 86185 85364 84824 84383 83596 82302 80826 79624 79002 79208 80389 82222 83928
55013 83928 84903 85217 85280 85304 85289 85284 85402 85665 85994 86252 86255 85937 85547 85433 85563 85588 85432 85499 86136 87193 88288
54992 88288 89234 90037 90727 91300 91650 91517 90796 89843 89148 88765 88526 88702 89800 91609 93169 93959 94422 94990
54974I4990K88m51p34j28O17O72J75j92n4N72J483K242K315J614O78J39J36L31
54956A04693L16j8l74l40P6M40M72L48K04j61q37j431j553j227n32N62J596J613
54938A03847M47p03q02l96n79j133r60M2Q54R68Q85R41Q21M36K69N91J160J835
54920A08523K643L241L230L066L640M860N667N693N828O724P729P862P028N678
54906A81412L936J688r44l618n980p570p994p430o548n812n162m473l727k791
54892A24987j586n71m62j294k276k608k019p27N85R55J39p72n36O05J427J602
54876A17449J862K407K585K432L038M807O625P480P760Q136Q195P175N296L340
54862A88587J495n55k769m730o128o784o613n996n645n677n400m450l425k925
$$ plain form
54974 94990 95278 94827 94093 93965 94582 95254 95429 95237 95183 95755 97238 99480 101795 103409 104087 104226 104362 104693
54956 104693 105009 104991 104617 104277 104353 104793 105265 105613 105817 105656 104819 103388 101835 100608 100076 100638 102234 103847
54938 103847 104294 103591 102789 102393 101814 100681 99721 99763 100617 101585 102470 103411 104232 104668 104937 105528 106688 108523
54920 108523 111166 114407 117637 120703 124343 129203 134870 140563 146391 153115 160844 168706 175734 181412
54906 181412 185348 187036 186092 182474 176494 168924 160930 153500 146952 141140 135978 131505 127778 124987
54892 124987 123401 122830 122368 121074 118798 116190 114171 113444 114029 114984 115123 114351 113815 114420 115847 117449
54876 117449 119311 121718 124303 126735 129773 134580 141205 148685 156445 164581 172776 179951 185247 188587
54862 188587 190082 189527 186758 182028 175900 169116 162503 156507 150862 145185 139785 135335 131910 128985
54848A28985k694k361k215k514k758k481k175k458k901k679j943j441j125k63
54834I8977J078J804J273J57m97m33j34q1l62p18p84m79j80k80o66q66o89m35
54816I6685m54p20q83n85J18P32Q01N05M96J034J647J785J499J192J012P45J83
54799A05792n94j141q51L32J483J482M20m34l31Q0m9m12k00M46O30J12m06m33
54781A05926k87l65m80l04J6J11m6q1L04J030J730K094K177K358K890L504L708
54764A24285L506L556M359N453N864N419N150O057P701Q611P960O268M360K340
54750B00889m6k653n020o856p986q205p678p043o588n816m409l054k517k386j804
54735A28828j006r68j666j970j312l73J41K92K50j12n72n24N6N05O37J075K066
$$ plain form
54848 128985 126291 123930 121715 119201 116443 113962 111787 109329 106428 103749 101806 100365 99240 98977
54834 98977 100055 101859 103132 103289 102792 102359 102225 102144 101782 101064 100280 99801 99621 99341 98675 97809 97120 96685
54816 96685 96231 95511 94628 94043 94161 94893 95694 96199 96695 97729 99376 101161 102660 103852 104864 105609 105792
54799 105792 105198 104057 103206 103538 105021 106503 106923 106489 106158 106238 106189 105777 105577 106023 106653 106765 106359 105926
54781 105926 105639 105274 104794 104490 104506 104617 104571 104490 104794 105824 107554 109648 111825 114183 117073 120577 124285
54764 124285 127791 131347 135706 141159 147023 152442 157592 163649 171350 179961 187921 194189 198549 200889
54750 200889 200843 198190 193170 186314 178328 170123 162445 155402 148814 142998 138589 135535 133018 130632 128828
54735 128828 127822 126854 125188 123218 121906 121533 121674 121966 122216 122104 121532 121008 121064 121569 122206 123281 125347
54718A25347L025L718M768O357P514P455O739O257N895N066L749K139qk686m934
54703A80401n939o259o939p786p745o644n410m588l820k901k265k109j851r90
54689A15155lQ5j127k863l740k898p86J210K011J612O63k63q49r04n51k50k98
54672A06204n06n83n35m37k20Jj17n81q61o75m49n40n30J33J125J611J273M56
54654A04769m76j291j629j260n03J00M15O00N98L19R9M17J081J321Q18J72J32
54637A05682N93O48l61j880k506j515J51R20M59n2L89J376J817J301K96n26q40
54620A05952p78p86j054j099m42M36N58n8l77J6L70K27J68N12N48l6k12P36J646
54601A06327J081l37p40K71J269J157K80o17j195j176l65P14J128O79K2l45m46
$$ plain form
54718 125347 128372 132090 136858 143215 150729 158184 164923 171180 177075 182141 185890 188029 188021 185335 180401
54703 180401 174462 168203 161264 153478 145733 139089 133679 129091 125271 122370 120105 117996 116145 115155
54689 115155 115152 115237 114110 111247 107507 104609 103823 105033 107044 108656 109319 109056 108207 107303 106752 106502 106204
54672 106204 105698 105115 104580 104143 103923 103924 103807 103226 102365 101690 101241 100701 100171 100304 101429 103040 104313 104769
54654 104769 104293 103002 101373 100113 99610 99710 100125 100725 101323 101642 101741 102158 103239 104560 105378 105550 105682
54637 105682 106275 106923 106562 104682 102176 100661 100812 101732 102191 102139 102528 103904 105721 107022 107318 106792 105952
54620 105952 105174 104388 103334 102235 101793 102229 102787 102729 102352 102368 102738 102965 103133 103645 104193 104157 103945 104681 106327
54601 106327 107408 107071 106331 106602 107871 109028 109308 108691 107496 106320 105955 106669 107797 108476 108498 108153 107707
54584A07707k63K72P62O90K79K48O70R55Q91Q27Q00L96l61q81q68o01k52K20N30
54565A12021K76j93p3N79Q23L37l7K69N64Qj071j682j468q75l51K6L34O47J033
54546A11167J442J684J669J458J122P97Q03J292J814J755J153O42N82P63R75J216
54530A30334J301Q79Q2m87o41q65j413j713j206k92J01l29r82j194r53p68r62
54513A20892j279j262r15p23q60p90jJ142J779J604J005L19m39j095j236q08l18
54496A17015j97l27l15K7N82J071J196Q69L20j48m69p00p96p12n76n17n04m96
54478A15323n39n02j06N45Q93O72L16K88N20R23J661K494K609J881J420J866K048
54461A32312O76j311j711j45J519J773J017K36l29o87o37l77n19r78q17K64J271
$$ plain form
54584 107707 107444 107716 108478 109168 109447 109695 110365 111320 112211 113038 113838 114234 113873 112992 112124 111523 111271 111491 112021
54565 112021 112297 112104 112031 112610 113433 113770 113733 114002 114566 114574 113503 111821 110353 109478 109127 109153 109487 110134 111167
54546 111167 112609 114293 115962 117420 118542 119339 120142 121434 123248 125003 126156 126798 127380 128143 129118 130334
54530 130334 131635 132514 132596 132109 131468 130603 129190 127477 126271 125979 126080 125751 124769 123575 122622 121854 120892
54513 120892 119613 118351 117436 116713 115853 115063 115062 116204 117983 119587 120592 120911 120472 119377 118141 117333 117015
54496 117015 116818 116491 116176 116203 116785 117856 119052 119921 120241 120093 119624 118924 118128 117416 116840 116323 115819 115323
54478 115323 114784 114282 114176 114721 115614 116286 116602 116890 117410 118333 119994 122488 125097 126978 128398 130264 132312
54461 132312 132988 131677 129966 129821 131340 133113 134130 134366 134037 133350 132713 132336 131817 130839 130022 130286 131557
54444A31557J305O81J03l92r75j333j184r06r33j057q75m49k7M07Q53J060R67
54427A28802Q90Q70M85l63j050j087p51m26Q2R18J549J383O94K73M56R63J363
54410A35051J274N02o08j248j021l97lJ46L52O29P93Q21P23M32Q8N9L51N01K89
54391A38734O6P0L9j20J2N07N82k74j323j516r44m78k91J67Q88J061L57m47n80
54372A36510l03l12n34k02Q77J800J581M58l54j69L76L63j15k31K88Q58R87Q28
54354A42706O27K97k57q52j294j525j381p14J01L37j76q11r91p22k05M75J017
54337A36632R25K24m05n39m97o37p61o37m87m51j05Q43J936K485K408K072J695
54320A44701J366J315J561J641J134K96k80m36n17q46j440k017k198j816j215
$$ plain form
54444 131557 132862 133543 133646 133254 132279 130946 129762 128856 127923 126866 125991 125542 125515 125922 126775 127835 128802
54427 128802 129692 130562 131047 130684 129634 128547 127796 127370 127452 128370 129919 131302 131996 132269 132725 133688 135051
54410 135051 136325 136827 136219 134971 133950 133553 133550 133696 134048 134677 135470 136291 137014 137446 137534 137593 137944 138445 138734
54391 138734 138800 138870 138909 138789 138801 139308 139890 139616 138293 136777 135833 135355 135064 135231 136119 137180 137537 137090 136510
54372 136510 136207 135895 135361 135159 136036 137836 139417 139875 139521 139352 139728 140091 139976 139745 140033 140891 141878 142706
54354 142706 143333 143630 143373 142521 141227 139702 138321 137607 137708 138045 137869 137058 136067 135345 135140 135615 136632
54337 136632 137557 137781 137376 136837 136340 135703 134942 134305 133818 133367 133262 134105 136041 138526 140934 143006 144701
54320 144701 146067 147382 148943 150584 151718 152014 151734 151298 150781 149935 148495 146478 144280 142464 141249
54305A41249q53p00m32j75l32p36p55m25m73r47q95L9P72L31o28q24j66M70O43
54286A35163M99j0r65j732j466l38N67N92N9m33o19m81j39J44K55L81N63M47p4
54267A32413m31j13N39R11J104J569K127K136J483O50l3n04n43JO68Q23N32L48
54249A43680L75L02K25N32R82P99j58j065j226p58j24M40P05L45n31j254j321
54232A41948r46o37n53n26m38l37l24m14m85l76j99l26q73j355j221n25K35P55
54214A33403J010R11M43n9k25j91l07m69k93R3M7o80j549j877j446m33Q07J701
54196A30886J716R12J1l21j09J09m9m02m37J05Q56J196R90O66M44O3n78r60o98
54177A34400k47k67n70m68P0L59J40m9J98N31L94k26r32j388j427r61j03P13R71
$$ plain form
54305 141249 140396 139696 139264 139089 138757 138021 137266 136841 136368 135421 134526 134565 135337 135668 135040 134216 134050 134520 135163
54286 135163 135662 135652 134687 132955 131489 131151 131718 132310 132369 131936 131317 130836 130697 130841 131096 131477 132040 132487 132413
54267 132413 131982 131869 132408 133319 134423 135992 138119 140255 141738 142388 142355 141851 141308 141309 141977 142800 143332 143680
54249 143680 144055 144357 144582 145114 146096 146895 146737 145672 144446 143688 143564 144004 144709 145054 144523 143269 141948
54232 141948 141002 140365 139812 139286 138848 138511 138187 137773 137288 136912 136713 136387 135514 134159 132938 132413 132648 133403
54214 133403 134413 135324 135767 135708 135483 135292 134985 134516 134223 134316 134363 133683 132134 130257 128811 128378 129185 130886
54196 130886 132602 133514 133525 133204 133095 133204 133155 132753 132316 132421 133277 134473 135463 136129 136573 136636 136058 135098 134400
54177 134400 134153 133886 133316 132848 132918 133277 133417 133368 133566 134097 134491 134265 133333 131945 130518 129557 129454 130167 131138
54158A31138N19k38o00k71K85L80O6R7P15J083M41o35q67N7J138J388Q93M25M48
54139A36462P17O42ro82n49L83J085Q04J35K04J053J674J421P23J90j85o87j264
54121A42117j574j440r14j90M58P77P48O16O48R51J382J632J478J051O47L08j68
54104A48527p32j049j046j010r63n07L67R29O61M2j65K5R5q9k44k77k67j39J08
54085A44266J25l05p86p75j83Q51K222L366L266J765K64J76J135J692J325O91
54069A59095K76K4O6O21J213J077L51j51j81j00J74J025J984J985R52Jj42J85
54051A68455O34J440K606L584M089M282M020L067K158K508L930M785M406M072
54037B14036M897O140O675O882P733Q924R313Q673P828P357P179P113O959O302
$$ plain form
54158 131138 131657 131419 130819 130548 130833 131213 131279 131376 132091 133174 133615 132980 132113 132170 133308 134696 135589 136014 136462
54139 136462 137179 137821 137812 137130 136581 136964 138049 138853 138988 139192 140245 141919 143340 144063 144253 144068 143381 142117
54121 142117 140543 139103 138189 137999 138457 139234 139982 140598 141246 142197 143579 145211 146689 147740 148387 148695 148527
54104 148527 147795 146746 145700 144690 143727 143220 143587 144516 145177 145219 145054 145079 145174 145085 144841 144564 144297 144158 144266
54085 144266 144391 144086 143300 142525 142342 143193 145415 148781 152047 153812 154076 154252 155387 157079 158404 159095
54069 159095 159371 159395 159461 160082 161295 162372 162723 162572 162391 162291 162465 163490 165474 167459 168411 168412 168270 168455
54051 168455 169089 170529 173135 176719 180808 185090 189110 192177 194335 196843 200773 205558 209964 214036
54037 214036 218933 225073 231748 238630 246363 255287 264600 273273 281101 288458 295637 302750 309709 316011
54023C16011N043L885L534L642L277K186R25l3o89j173j662k430l447m184m278
54008C20607m153m335m528m035k821j479l10Q50K007K918L526L855L384J278k490
53993C14274o732r982j1580j1766j1123j0101q899p575o263n207m483l864l160
53980B13539k571k361k347k055j404r00j022j635k137k100j617j067o41k48J65
53965A91599M57N61P35J220J783J881J319N12R4M01J228J852J577N85M8Q76K541
53948B09269L640L576L016K790L032L550M240M884N094M889M786N074N490N880
53934B69210O538P572Q428Q550Q102P592P171O746O410O266O061N509M799M407
53920C63361M434M525M394M212M454N450P012Q478R255R381R355R493R611R232
$$ plain form
54023 316011 321054 324939 328473 332115 335392 337578 338503 338470 337781 336608 334946 332516 329069 324885 320607
54008 320607 316454 312119 307591 303556 300735 299256 298946 299796 301803 304721 308247 312102 315486 316764 314274
53993 314274 307542 297560 285980 274214 263091 252990 244091 236516 230253 225046 220563 216699 213539
53980 213539 210968 208607 206260 204205 202801 201901 200879 199244 197107 195007 193390 192323 191682 191434 191599
53965 191599 192056 192617 193352 194572 196355 198236 199555 200067 200161 200562 201790 203642 205219 205804 205852 206728 209269
53948 209269 212909 216485 219501 222291 225323 228873 233113 237997 243091 247980 252766 257840 263330 269210
53934 269210 275748 283320 291748 300298 308400 315992 323163 329909 336319 342585 348646 354155 358954 363361
53920 363361 367795 372320 376714 380926 385380 390830 397842 406320 415575 424956 434311 443804 453415 462647
53906D62647P946N676K996Q91k83j305k944m579m935m064l537m408o003p142p604
53891D33352p867q191q648r429j0452j1134j1101j0724j0468j0209r609q729p769
53878C09022o675n528m731m371l931l143k633k991l790m231m283m449m699m483
53864B49084l693k852k472k650l241l870l993l349k305j375o82j29K70N65R20
53849B20228J137O88k02k53J375L791N474O197O962Q375J0120J1786J2996J2767
53835C01441R924M606j453o456r736j1361j1525j0739r760q749p041m313j507
53822B33331P3K79J36M85J219J815K105K314K683L325M314N606O850P425O903
53807B78863N516M062L235L011K793K112J180O15P96J524K423L406M455N102M694
$$ plain form
53906 462647 470593 476269 479265 480156 479873 478568 475624 471045 466110 462046 458509 454101 448098 440956 433352
53891 433352 425485 417294 408646 399217 388765 377631 366530 355806 345338 335129 325520 316791 309022
53878 309022 302347 296819 292088 287717 283786 280643 278010 275019 271229 266998 262715 258266 253567 249084
53864 249084 245391 242539 240067 237417 234176 230306 226313 222964 220659 219284 218602 218473 218743 219308 220228
53849 220228 221365 222053 221851 221598 222973 226764 232238 238435 245397 253772 263892 275678 288674 301441
53835 301441 311365 315971 314518 308062 298326 286965 275440 264701 254941 246192 239151 234838 233331
53822 233331 233404 233683 233819 234304 235523 237338 239443 241757 244440 247765 252079 257685 264535 271960 278863
53807 278863 284379 288441 291676 294687 297480 299592 300772 301387 302183 303707 306130 309536 313991 319093 323787
53792C23787L309J866J101Q28O06N80J047J652J739J269O15k88j719l264m106
53777C29022m271m601n404o068o207o168o175n946n547n566n976n811m676l597
53763B53009l603m264m461l968l400l169l250l546l744l328k342j610j576j599
53749B09149j095o41j017j797j996j607j337j156l18J198K335K241J163j1n11
53734B04600p6Q20J236P43p1n19p50j117j178l32Q77J292Q68P52J479K235K245
53717B13104J913K046K567K701K145J425J176J365J471J279J211J703K504L001
53703B39611L116L206L223K766K044J816K115K105J614J629K526L130K481J451
53689B72833J270J540J181N02O04J231J045o7p67m87k68r71j976k214j546o01
$$ plain form
53792 323787 327096 328962 330063 330891 331497 332077 333124 334776 336515 337784 338399 338111 336392 333128 329022
53777 329022 324751 320150 314746 308678 302471 296303 290128 284182 278635 273069 267093 261282 256606 253009
53763 253009 249406 245142 240681 236713 233313 230144 226894 223348 219604 216276 213934 212324 210748 209149
53749 209149 208054 207413 206396 204599 202603 200996 199659 198503 198185 199383 201718 203959 205122 205111 204600
53734 204600 204524 205344 206580 207323 207252 206733 205983 204866 203688 203356 204233 205525 206393 207145 208624 210859 213104
53717 213104 215017 217063 219630 222331 224476 225901 227077 228442 229913 231192 232403 234106 236610 239611
53703 239611 242727 245933 249156 251922 253966 255782 257897 260002 261616 263245 265771 268901 271382 272833
53689 272833 274103 275643 276824 277326 277930 279161 280206 280139 279372 278885 278617 277646 275670 273456 271910 271309
53673B71309n1k65j099j850j955j614j185m27P79J568J110J11j13K85O2q40j122
53656B64703l63L23K57J36M28M09l40r09m74L60N76J52l68p93r65m07Q90J993
53638B65608K136J659J284J167J269J806K635K926K181R72J03k83k16O16K089
53623B85952L186L218K830K972L496L714L673L855M076L772L131K929L284L570
53609C33658L455L297L405L615L663L507L198K844K645K661K672K528K394K280
53595C75822J770O30o30j346j560j724j756j200j88M19P2q54j613j876j722j283
53579C62961p35m47p56j482j921j577p77l27n08q42r54j143j673k004j434j87
53563C46194Q55J420J960K585K821K626K768L722M864N261M777L999L425L082
$$ plain form
53673 271309 271258 270993 269894 268044 266089 264475 263290 262863 263642 265210 266320 266431 266318 266603 266665 265825 264703
53656 264703 264340 264663 264920 265056 265484 265893 265553 264644 264170 264530 265106 265258 264890 264097 263132 262725 263615 265608
53638 265608 267744 269403 270687 271854 273123 274929 277564 280490 282671 283643 283746 283463 283247 283863 285952
53623 285952 289138 292356 295186 298158 301654 305368 309041 312896 316972 320744 323875 326804 330088 333658
53609 333658 337113 340410 343815 347430 351093 354600 357798 360642 363287 365948 368620 371148 373542 375822
53595 375822 377592 378222 377592 376246 374686 372962 371206 370006 369818 370237 370309 369455 367842 365966 364244 362961
53579 362961 362226 361779 361023 359541 357620 356043 355266 354939 354431 353589 352635 351492 349819 347815 346381 346194
53563 346194 347049 348469 350429 353014 355835 358461 361229 364951 369815 375076 379853 383852 387277 390359
53549C90359K602J512k58k024k912k815k315j694p09N99J642K130K469L082L958
53534C95626N072O507P843Q251P634P049P470Q747J0185J1449J2456J3013J3130
53521E14432J3222J3505J3755J3996J4784J6236J7541J8053J8286J9087K0374
53510F93271K1450K2135K2797K3503K3895K3726K3074K2123K1211K0846K1227
53499I39258K1943K2413K2452K2165K1709K1351K1322K1332K0729J9405J8073
53488A172152J7360J7202J7339J7706J8007J7718J7018J6903J7839J8932J9119
53477A367295J8391J7248J5660J3352J0558P695M861K281N63l28j666m557q440
53464A442913j1813j3954j4999j4934j3713j2107j1387j2101j3861j6055j8100
$$ plain form
53549 390359 392961 394473 394215 392191 389279 386464 384149 382455 381746 382345 383987 386117 388586 391668 395626
53534 395626 400698 407205 415048 423299 430933 437982 445452 454199 464384 475833 488289 501302 514432
53521 514432 527654 541159 554914 568910 583694 599930 617471 635524 653810 672897 693271
53510 693271 714721 736856 759653 783156 807051 830777 853851 875974 897185 918031 939258
53499 939258 961201 983614 1006066 1028231 1049940 1071291 1092613 1113945 1134674 1154079 1172152
53488 1172152 1189512 1206714 1224053 1241759 1259766 1277484 1294502 1311405 1329244 1348176 1367295
53477 1367295 1385686 1402934 1418594 1431946 1442504 1450199 1455060 1457341 1457904 1457576 1455910 1451353 1442913
53464 1442913 1431100 1417146 1402147 1387213 1373500 1361393 1350006 1337905 1324044 1307989 1289889
53453A289889j9439k0094k0809k1891k2485k1862k0802k0466k0552j9855j8261
53442A063373j6641j5088j2954j0606r407r500r241p522n267l873l257k458j249
53429I56310j60O19J407K429L679N167O804Q294R561J1044J3069J5165J6431J6601
53415A066420J6476J7236J9401K2348K4965K6749K8140K9597L0907L1776L2671
53404A346686L4337L6693L8978M0959M3114M5547M7637M9002N0129N1546N3022
53393A837650N4016N4479N4713N4769N4496N3902N3147N2237N1057M9587M7869
53382B417922M5931M3848M1746L9529L6803L3270K9168K5163K1724J8694J5467
53371B769265J1605P207K481k892r610j7749k6271l3792l9654m4000m7172m9458
$$ plain form
53453 1289889 1270450 1250356 1229547 1207656 1185171 1163309 1142507 1122041 1101489 1081634 1063373
53442 1063373 1046732 1031644 1018690 1008084 998677 989177 979936 972414 967147 963274 960017 957559 956310
53429 956310 956150 956769 958176 960605 964284 969451 976255 984549 994110 1005154 1018223 1033388 1049819 1066420
53415 1066420 1082896 1100132 1119533 1141881 1166846 1193595 1221735 1251332 1282239 1314015 1346686
53404 1346686 1381023 1417716 1456694 1497653 1540767 1586314 1633951 1682953 1733082 1784628 1837650
53393 1837650 1891666 1946145 2000858 2055627 2110123 2164025 2217172 2269409 2320466 2370053 2417922
53382 2417922 2463853 2507701 2549447 2588976 2625779 2659049 2688217 2713380 2735104 2753798 2769265
53371 2769265 2780870 2788077 2790558 2787666 2778056 2760307 2734036 2700244 2660590 2616590 2569418 2519960
53359B519960n1148n2342n2810n2404n1514n0679m9862m8551m6514m4122m1904
53348A978110m0235l9397l9583m0685m2274m3767m4556m4169m2591m0311l7882
53337A522660l5516l3265l1275k9566k7804k5594k2913k0063j7498j5757j5225
53326A248184j5618j6141j6360j6520j6798j6806j6216j5292j4329j3138j1597
53315A079369j0170r202q265o843n105l335j271J147L037L641L703M571O330P992
53301A065599R342J1241J4010J6719J8456J9332K0017K0961K2336K3983K5360
53290A267356K6087K6486K6970K7132K6275K4685K3325K2328K0905J8739J6378
53279A526666J4107J1615Q985O820M924K172j684n156o851p427q743j1573j4996
$$ plain form
53359 2519960 2468812 2416470 2363660 2311256 2259742 2209063 2159201 2110650 2064136 2020014 1978110
53348 1978110 1937875 1898478 1858895 1818210 1775936 1732169 1687613 1643444 1600853 1560542 1522660
53337 1522660 1487144 1453879 1422604 1393038 1365234 1339640 1316727 1296664 1279166 1263409 1248184
53326 1248184 1232566 1216425 1200065 1183545 1166747 1149941 1133725 1118433 1104104 1090966 1079369
53315 1079369 1069199 1059997 1051732 1044889 1039784 1036449 1035178 1036325 1039362 1043003 1046706 1051277 1057607 1065599
53301 1065599 1074941 1086182 1100192 1116911 1135367 1154699 1174716 1195677 1218013 1241996 1267356
53290 1267356 1293443 1319929 1346899 1374031 1400306 1424991 1448316 1470644 1491549 1510288 1526666
53279 1526666 1540773 1552388 1561373 1568193 1573117 1575289 1573605 1568449 1561598 1554171 1545428 1533855 1518859
53266A518859j7772j9571k0867k2086k3100k3525k3518k3927k5274k6958k7989
53255A264272k8255k8281k8053k7121k5767k4931k4792k4522k3740k3139k3273
53244I82398k3768k4140k4556k5161k5533k5325k4809k4246k3436k2289k1035
53233G18100j9542j7249j4325j1953j0803j0106q940p667p250p784q619r465j0537
53220E73860j1873j3166j4096j4424j4121j3697j3805j4205j3810j2232j0413
53209D28018r218q286p093o195o331o944o866o057n511n668n978n999n926n947
53195C35999n933n836n758n572n055m406m029l901l641l181k784k558k446k538
53181B78361k844k916k377j635j419j673j644j050m77m63q92j391j766j853j501
$$ plain form
53266 1518859 1501087 1481516 1460649 1438563 1415463 1391938 1368420 1344493 1319219 1292261 1264272
53255 1264272 1236017 1207736 1179683 1152562 1126795 1101864 1077072 1052550 1028810 1005671 982398
53244 982398 958630 934490 909934 884773 859240 833915 809106 784860 761424 739135 718100
53233 718100 698558 681309 666984 655031 644228 634122 625182 617515 610265 602481 593862 584397 573860
53220 573860 561987 548821 534725 520301 506180 492483 478678 464473 450663 438431 428018
53209 428018 418800 410514 403421 397226 390895 383951 377085 371028 365517 359849 353871 347872 341946 335999
53195 335999 330066 324230 318472 312900 307845 303439 299410 295509 291868 288687 285903 283345 280899 278361
53181 278361 275517 272601 270224 268589 267170 265497 263853 262803 262326 261863 260971 259580 257814 255961 254460
53166B54460r27o28o94n65K31J357J949J503L55o47r02n22q1O8N8N6r6o02j301
53147B53072j825j985j801j388j056j170j646j869j482r08o68n49lQ48J314J124
53131B40008P31N32L75p4q06j492j721j240k46N90P28L84K60N93R68R98Q43P89
53113B42220P48M32j16n09m56r1J75K7n15j139j498j495j349j410j799k202k150
53096B28873j569r32o90p63p86o46n01m25m17n97r50j057n72J56N19O08J000J589
53078B22840J543O43k23k62K77Q00J183J339P86n27j550j295k67J23n72j409j410
53061B22019o10K89P34N94J18k43j83K44Q54J541K085K081J468Q36Q53J465J996
53044B36141J830Q22o48j812k043j603j411j796k040j505o31j96j63k8J99J66
$$ plain form
53166 254460 253533 252905 252211 251646 251877 253234 255183 256686 257041 256394 255492 254970 254889 254957 255015 255071 254975 254373 253072
53147 253072 251247 249262 247461 246073 245017 243847 242201 240332 238850 237942 237274 236725 236722 237570 238884 240008
53131 240008 240739 241271 241646 241572 240766 239274 237553 236313 236067 236657 237385 237769 238029 238622 239590 240588 241431 242220
53113 242220 242968 243400 243284 242775 242319 242228 242403 242430 241915 240776 239278 237783 236434 235024 233225 231023 228873
53096 228873 227304 226372 225682 224919 224133 223487 222986 222561 222144 221547 220597 219540 218968 219124 219643 220251 221251 222840
53078 222840 224383 225026 224803 224541 224818 225618 226801 228140 228926 228399 226849 225554 225287 225410 224838 223429 222019
53061 222019 221409 221698 222432 223026 223144 222901 222718 222962 223816 225357 227442 229523 230991 231827 232680 234145 236141
53044 236141 237971 238793 238145 236333 234290 232687 231276 229480 227440 225935 225304 225108 224945 224917 225116 225282
53028B25282k7n9j15n13q33m03N71J193J186J049R64O02Q2R2O72R10L34k71o6
53009B30650N54O17K5m80m96m08o05r28r99p94n63m09j18M97J211J484J073L47
52991B30658j38k46k46l16l34j27L38R35J389J368Q99N34Q05J486J751J128N8
52974B39942n84l68L21P30N91M70J051K071K486J852J042J137K068K879K992K562
52958B61242J811Q12j16n12m35m56q45j203j114p20n07p46j319j841j877j322
52942B50852n91k34l47o13q37j110j480j762j748j372p34j08J71N6j33j54j06
52925B39750r4qM3l81j314j953j643q74n13m77q1N66O44O8k63P9M30K72K8J09
52905B34388M8o31j393j372o65j37j97m91o78p50o85l49J49M50M31L29L07J98
$$ plain form
53028 225282 225255 225196 225081 224568 223735 223332 223903 225096 226282 227331 228295 228897 228979 229071 229743 230653 230987 230716 230650
53009 230650 231204 231821 231846 231366 230870 230462 229857 228929 227930 227136 226573 226164 226046 226543 227754 229238 230311 230658
52991 230658 230520 230274 230028 229712 229378 229251 229589 230524 231913 233281 234180 234714 235519 237005 238756 239884 239942
52974 239942 239358 238990 239311 240041 240632 241102 242153 244224 246710 248562 249604 250741 252809 255688 258680 261242
52958 261242 263053 263865 263749 263237 262802 262346 261501 260298 259184 258464 257957 257211 255892 254051 252174 250852
52942 250852 250261 250027 249680 249067 248230 247120 245640 243878 242130 240758 240024 239916 240087 240143 240010 239856 239750
52925 239750 239656 239648 239691 239310 237996 236043 234400 233526 233013 232536 232455 233021 233665 233733 233470 233549 233979 234251 234279 234388
52905 234388 234436 233805 232412 231040 230375 230238 230041 229550 228872 228122 227437 227088 227237 227687 228118 228447 228754 228952
52887B28952j47m94m01L02J226J663J196J55n94n00Q5K74l85j351j619p63N62
52870B28161J304J114O41O97J360K037K271K164K040J948J587P26m26j330j682
52855B42612j793k129k542k379j441m19n2k52m28l93m34o89r50j136j445j998
52839B24132k594k976l042k831k479k176j986j737j237n66M2M48O77Q52J148J523
52823B07198J517O74o31j329r29j92j31p90j491j783j577q36J90P48M60P1O11
52806B01780J941L010L292L102K619J628L36n04o34o43j037j621k036k230k124
52791B06879j507o50k93o73j106r76n32k96k02N1K96K27J37O28J561K000J453
52774B06997O68P81J804K448J636j50j437j510j019p64o14m5Q25J367J304Q82
$$ plain form
52887 228952 228805 228311 227910 228212 229438 231101 232297 232452 231858 231358 231443 231717 231332 229981 228362 227599 228161
52870 228161 229465 230579 231220 231917 233277 235314 237585 239749 241789 243737 245324 246050 245624 244294 242612
52855 242612 240819 238690 236148 233769 232328 231909 231857 231605 231177 230784 230350 229661 228711 227575 226130 224132
52839 224132 221538 218562 215520 212689 210210 208034 206048 204311 203074 202508 202550 202998 203675 204527 205675 207198
52823 207198 208715 209389 208758 207429 206500 206308 206177 205387 203896 202113 200536 199700 199890 200638 201098 201169 201780
52806 201780 203721 206731 210023 213125 215744 217372 217708 217204 216570 215927 214890 213269 211233 209003 206879
52791 206879 205372 204722 204429 203756 202650 201674 201142 200846 200644 200695 200991 201218 201355 201983 203544 205544 206997
52774 206997 207665 208446 210250 212698 214334 214184 212747 211237 210218 209454 208840 208795 209620 210987 212291 213173
52758B13173M03O4j6l0m07j045j098k08O16K33r75j660j421j001p48j85P63J408
52740B07866J422J340J572J848J972K162K321J933J105O88R15R53M06J67R75K027
52724B29672K056J107K52p4l35q22j250j406j457j519j458j176o92lQ17J423J454
52707B26589R71M34K55M69P24N69q6p83r98o80j31M80J004J051M41j66Q6J033
52689B31262J672J602J397J430J331Q84M94L22q7q34j171o48Q9K70Q9J10K37O3
52671B38512k93m59m73n56o33o70r73j552j683q67K63O98L82J25M40J090J554
52654B34905J429O76n3J96J518K783K901K038J066L97o6l70o32j262k325l118
52638B40083l033k374j677q27L17J065O80l55q51m58K41Q83J477J665R85q0l52
$$ plain form
52758 213173 213576 213640 213624 213594 213187 212142 211044 210836 211452 211685 210710 209050 207629 206628 205880 205695 206458 207866
52740 207866 209288 210628 212200 214048 216020 218182 220503 222436 223541 224229 225144 226097 226503 226670 227645 229672
52724 229672 231728 232835 233087 233013 232678 231856 230606 229200 227743 226224 224766 223590 222898 222895 223712 225135 226589
52707 226589 227560 227994 228249 228718 229442 230011 229925 229142 228144 227464 227333 227813 228817 229868 230309 230143 230229 231262
52689 231262 232934 234536 235933 237363 238694 239578 240072 240394 240307 239473 238302 237654 237743 238013 238102 238212 238449 238512
52671 238512 238219 237760 237287 236731 236098 235428 234455 232903 231220 230353 230616 231314 231696 231821 232261 233351 234905
52654 234905 236334 237010 236957 237153 238671 241454 244355 246393 247459 247856 247790 247420 246788 245526 243201 240083
52638 240083 237050 234676 232999 232172 232489 233554 234234 233879 233028 232570 232811 233694 235171 236836 237821 237741 237389
52621B37389M95J454J459M49r55k011k076r50P02J829K042J755J344P70J13k65
52605B43544k55j41q0J05M52O92P43Q70J234J574J563J168O15K35K89P08J062
52588B54378J063R70J199J700K044J969J530R45N05M22M53O6p38j244j041o18
52572B63603m74k69L73Q80M61o09j454j899k323k544k037j104o53q06q29m75k64
52555B49577l58l34k55p80j771k058j132o1P5k35J77J341K105J663M13o38q11
52538B46918k23L99M43J4l29l23j38J50N63P90L95m06q40o14k19oK19M69K32o34
52518B46860j349j187m28J88M24M70L87K36L90J070J835K117K073K321K979L488
52502B61874L344K603J591N57l81j205j957k632l064l092k703j994j125m14k19
$$ plain form
52621 237389 237884 239338 240797 241246 240291 238280 236204 235254 235956 237785 239827 241582 242926 243696 243809 243544
52605 243544 243289 243148 243068 243173 243625 244317 245060 245930 247164 248738 250301 251469 252084 252319 252608 253316 254378
52588 254378 255441 256411 257610 259310 261354 263323 264853 265798 266303 266725 267178 267244 266506 265262 264221 263603
52572 263603 263129 262860 263233 264113 264574 263965 262511 260612 258289 255745 253708 252604 251951 251145 250316 249841 249577
52555 249577 249219 248885 248630 247850 246079 244021 242889 242828 242903 242668 242845 244186 246291 247954 248367 247729 246918
52538 246918 246695 247094 247537 247551 247222 246899 246761 246911 247474 248264 248659 248253 247413 246799 246580 246574 246793 247262 247494 246860
52518 246860 245511 244324 243896 244084 244508 244978 245365 245601 245991 247061 248896 251013 253086 255407 258386 261874
52502 261874 265218 267821 269412 269969 269588 268383 266426 263794 260730 257638 254935 252941 251816 251402 251183
52487B51183n34q56p28k97r7k78l76M3O75P25kn83j3J398K194J595M23j10J01
52468B54463L75N24Q75J355J490J321J392J773J962J870K042K602K842K266J311
52453B78463N47j70j174k173k592k420k145k052j985j747j315q52o24p69j052
52438B57940j056p33m07k07Q7N41Q65R06Q40O81J33p98j515j540j113p77p65j016
52420B52066j386j478p43P72K164K584K173J714J714K166K851L473L770L973M819
52405B80632O711R008J0675J1341J1279J0500Q521N027M71m111p547r039q597
52392C24871p047n388m092l161k584k386k341k057j513j133j219j489j362o43
52378B88456K59Q17J009J266J857K568L071L366L621L842M029M440N232N943N882
$$ plain form
52487 251183 250649 249793 249065 248768 248671 248393 248017 248060 248735 249460 249458 248875 248862 250260 252454 254049 254472 254362 254463
52468 254463 254838 255362 256237 257592 259082 260403 261795 263568 265530 267400 269442 272044 274886 277152 278463
52453 278463 279010 278840 277666 275493 272901 270481 268336 266284 264299 262552 261237 260385 259761 258992 257940
52438 257940 256884 256151 255744 255537 255624 256165 257030 257936 258776 259457 259590 258792 257277 255737 254624 253847 253082 252066
52420 252066 250680 249202 248459 249231 251395 253979 256152 257866 259580 261746 264597 268070 271840 275813 280632
52405 280632 287343 296351 307026 318367 329646 340146 348667 353694 354165 350054 342507 333468 324871
52392 324871 317824 312436 308344 305183 302599 300213 297872 295815 294302 293169 291950 290461 289099 288456
52378 288456 288715 289532 290541 291807 293664 296232 299303 302669 306290 310132 314161 318601 323833 329776 335658
52363C35658N013M014L362K835J976O65q25j939k034r26O71J784K228K530K921
52348C57933L089K951K881K944K751K300K246K939L960M962O146P515Q521R063
52334D20201R927J1492J2825J3026J2720J3189J4539J5860J6843J8030J9631K1145
52322E99428K2282K3222K3965K4265K4288K4497K4748K4379K3302K2166K1212
52311H57754J9871J7816J5685J4241J3491J3096J2958J2872J2140J0291P890N979
52299A014084M854L923K686J316J84o70j457k312l285m510o089p764q923r088
52285I82949q434p603o943o079m444k097K51K008L282M625O477Q812J1153J2825
52271I96782J3482J3495J3695J4606J6029J7438J8517J9158J9132J8130J6185
$$ plain form
52363 335658 340671 344685 348047 350882 352858 353523 352698 350759 348725 347799 348470 350254 352482 355012 357933
52348 357933 361022 363973 366854 369798 372549 374849 377095 380034 383994 388956 395102 402617 411138 420201
52334 420201 430128 441620 454445 467471 480191 493380 507919 523779 540622 558652 578283 599428
52322 599428 621710 644932 668897 693162 717450 741947 766695 791074 814376 836542 857754
52311 857754 877625 895441 911126 925367 938858 951954 964912 977784 989924 1000215 1008105 1014084
52299 1014084 1018938 1022861 1025547 1026863 1027047 1026377 1024920 1022608 1019323 1014813 1008724 1000960 992037 982949
52285 982949 974515 966912 959969 953890 949446 947349 947600 949608 952890 957515 963992 972804 983957 996782
52271 996782 1010264 1023759 1037454 1052060 1068089 1085527 1104044 1123202 1142334 1160464 1176649
52260A176649J3825J1667R998Q762P882P351P062O714O052N093M047L083K250
52247A270435J554R08M8j362l424n834p965r179r231q545p940p837p824p189n800
52232A190815m242l154k626k249j496k06J104J558R27J61M55J842L255L918M087
52217A194149M310M692N199O022P157Q104Q534Q833R474J0169J0277R870R676
52204A296466J0021J0352J0001Q927P548O249N250M718M664M841M949M890M710
52191A383586M341L611K554J537Q89N28J92n2O8L10j15j547l286m519n461o878
52175A375758q661r799r872r711j0184j0883j0609q813o196l996k967k825k627
52162A278615j776o98j75j78R2J014K020K498K567K668K911L148L169K507P56
$$ plain form
52260 1176649 1190474 1202141 1212139 1220901 1228783 1236134 1243196 1249910 1255962 1261055 1265102 1268185 1270435
52247 1270435 1271989 1272897 1272945 1271583 1268159 1262325 1254360 1245181 1235950 1227405 1219465 1211628 1203804 1196615 1190815
52232 1190815 1186573 1183419 1180793 1178544 1177048 1176842 1177946 1179504 1180431 1180592 1181047 1182889 1186144 1190062 1194149
52217 1194149 1198459 1203151 1208350 1214372 1221529 1229633 1238167 1247000 1256474 1266643 1276920 1286790 1296466
52204 1296466 1306487 1316839 1326840 1335767 1343315 1349564 1354814 1359532 1364196 1369037 1373986 1378876 1383586
52191 1383586 1387927 1391538 1394092 1395629 1396518 1397046 1397238 1397186 1397254 1397564 1397449 1395902 1392616 1388097 1382636 1375758
52175 1375758 1367097 1357298 1347426 1337715 1327531 1316648 1306039 1297226 1291030 1287034 1284067 1281242 1278615
52162 1278615 1276839 1276141 1275966 1275788 1275880 1276894 1278914 1281412 1283979 1286647 1289558 1292706 1295875 1298382 1299138
52147A299138j594l152l092k121j445j215p52R0O10L26l45o52l58K00O47J107
52131A287392K149M099O514Q636J0345J2209J4518J6866J8908K0998K3604K6568
52119A452806K9357L1642L3272L4020L3791L2774L1097K8674K5735K2984K0832
52108A776984J8845J6371J3349J0113O882L801J059j434m067o744q698r459r512
52095A807490r500r357q794q051p531p168o860o923p501q057q209q385q875q881
$$ plain form
52147 1299138 1297544 1294392 1291300 1289179 1287734 1286519 1285767 1285857 1286467 1286793 1286448 1285796 1285438 1285638 1286285 1287392
52131 1287392 1289541 1293640 1300154 1308790 1319135 1331344 1345862 1362728 1381636 1402634 1426238 1452806
52119 1452806 1482163 1513805 1547077 1581097 1614888 1647662 1678759 1707433 1733168 1756152 1776984
52108 1776984 1795829 1812200 1825549 1835662 1842544 1846345 1847404 1845970 1841903 1835159 1826461 1817002 1807490
52095 1807490 1797990 1788633 1779839 1771788 1764257 1757089 1750229 1743306 1735805 1727748 1719539 1711154 1702279 1693398
$$ [...]